<?xml version="1.0" encoding="UTF-8" standalone="no"?>
<svg
   xmlns:dc="http://purl.org/dc/elements/1.1/"
   xmlns:cc="http://creativecommons.org/ns#"
   xmlns:rdf="http://www.w3.org/1999/02/22-rdf-syntax-ns#"
   xmlns:svg="http://www.w3.org/2000/svg"
   xmlns="http://www.w3.org/2000/svg"
   xmlns:xlink="http://www.w3.org/1999/xlink"
   xmlns:sodipodi="http://sodipodi.sourceforge.net/DTD/sodipodi-0.dtd"
   xmlns:inkscape="http://www.inkscape.org/namespaces/inkscape"
   width="100px"
   height="100px"
   viewBox="0 0 100 100"
   version="1.1"
   id="svg18"
   sodipodi:docname="query.svg"
   inkscape:version="0.92.4 (f8dce91, 2019-08-02)">
  <metadata
     id="metadata22">
    <rdf:RDF>
      <cc:Work
         rdf:about="">
        <dc:format>image/svg+xml</dc:format>
        <dc:type
           rdf:resource="http://purl.org/dc/dcmitype/StillImage" />
        <dc:title>eclispe-che</dc:title>
      </cc:Work>
    </rdf:RDF>
  </metadata>
  <sodipodi:namedview
     pagecolor="#ffffff"
     bordercolor="#666666"
     borderopacity="1"
     objecttolerance="10"
     gridtolerance="10"
     guidetolerance="10"
     inkscape:pageopacity="0"
     inkscape:pageshadow="2"
     inkscape:window-width="1920"
     inkscape:window-height="1052"
     id="namedview20"
     showgrid="false"
     inkscape:pagecheckerboard="true"
     inkscape:zoom="11.700384"
     inkscape:cx="52.126071"
     inkscape:cy="36.667202"
     inkscape:window-x="0"
     inkscape:window-y="0"
     inkscape:window-maximized="1"
     inkscape:current-layer="layer1-2" />
  <!-- Generator: Sketch 45.2 (43514) - http://www.bohemiancoding.com/sketch -->
  <title
     id="title2">eclispe-che</title>
  <desc
     id="desc4">Created with Sketch.</desc>
  <defs
     id="defs7">
    <path
       d="M50.0004412,4.04252804e-14 C22.3871247,4.04252804e-14 0,22.3848726 0,49.9995588 C0,77.6133626 22.3871247,100 50.0004412,100 C77.6137577,100 100,77.6133626 100,49.9995588 C100,22.3848726 77.6128753,3.55271368e-14 50.0004412,4.04252804e-14 Z"
       id="path-1" />
    <path
       inkscape:connector-curvature="0"
       id="path-1-6"
       d="M 50.000441,0 C 22.387125,0 0,22.384873 0,49.999559 0,77.613363 22.387125,100 50.000441,100 77.613758,100 100,77.613363 100,49.999559 100,22.384873 77.612875,0 50.000441,0 Z" />
  </defs>
  <g
     inkscape:groupmode="layer"
     id="layer1"
     inkscape:label="BACKGROUND">
    <g
       style="fill:#ffffff;fill-opacity:1;fill-rule:evenodd;stroke:none;stroke-width:1;stroke-opacity:1"
       id="Page-1">
      <g
         id="eclispe-che"
         style="fill:#ffffff;fill-opacity:1;stroke:none;stroke-opacity:1">
        <g
           id="path3023-path"
           style="fill:#ffffff;fill-opacity:1;stroke:none;stroke-opacity:1">
          <use
             xlink:href="#path-1"
             id="use9"
             style="fill:#ffffff;fill-opacity:1;fill-rule:evenodd;stroke:none;stroke-opacity:1"
             x="0"
             y="0"
             width="100%"
             height="100%" />
          <path
             d="M 50.000441,0.5 C 22.662621,0.5 0.5,22.661661 0.5,49.999559 0.5,77.337051 22.663098,99.5 50.000441,99.5 77.337613,99.5 99.5,77.337222 99.5,49.999559 99.5,22.661796 77.337514,0.5 50.000441,0.5 Z"
             id="path11"
             style="fill:#ffffff;fill-opacity:1;stroke:none;stroke-width:1;stroke-opacity:1"
             inkscape:connector-curvature="0" />
        </g>
      </g>
      <g
         id="g12351"
         transform="translate(-14.272546,-12.289495)">
        <g
           transform="translate(14.272546,12.789495)"
           inkscape:label="BACKGROUND"
           id="layer1-2">
          <g
             id="Page-1-9"
             style="fill:#ffffff;fill-opacity:1;fill-rule:evenodd;stroke:none;stroke-width:1;stroke-opacity:1">
            <g
               style="fill:#ffffff;fill-opacity:1;stroke:none;stroke-opacity:1"
               id="eclispe-che-1">
              <g
                 style="fill:#ffffff;fill-opacity:1;stroke:none;stroke-opacity:1"
                 id="path3023-path-2">
                <use
                   height="100%"
                   width="100%"
                   y="0"
                   x="0"
                   style="fill:#ffffff;fill-opacity:1;fill-rule:evenodd;stroke:none;stroke-opacity:1"
                   id="use9-7"
                   xlink:href="#path-1-6" />
                <path
                   inkscape:connector-curvature="0"
                   style="fill:#ffffff;fill-opacity:1;stroke:none;stroke-width:1;stroke-opacity:1"
                   id="path11-0"
                   d="M 50.000441,0.5 C 22.662621,0.5 0.5,22.661661 0.5,49.999559 0.5,77.337051 22.663098,99.5 50.000441,99.5 77.337613,99.5 99.5,77.337222 99.5,49.999559 99.5,22.661796 77.337514,0.5 50.000441,0.5 Z" />
              </g>
            </g>
          </g>
          <image
             y="-0.50744522"
             x="0.048775136"
             id="image12482"
             xlink:href="data:image/png;base64,iVBORw0KGgoAAAANSUhEUgAAAfkAAAH7CAYAAADPfubvAAAABHNCSVQICAgIfAhkiAAAIABJREFU eJzs3XmYHWWB/v1vnb3P6b3TSXfSIensIYEQkrAJSQybigqIIIgyjCuK4zjo+PNVucZ3dJwZFf35 ujCAjqKoCKKCqKxhlwTIQgghG1lJpztb76f7bFXvH9XBJGTprlPn1Fnuz3XVJULqqdsI3F1VTz2P MX7cNESkoFQCjUNHw9BRD9QOHdVDR+XQEQMqho7w0BEcOvxDhzF0WENHZuhIDR2JoWNg6OgH+oaO nqGja+g4AOwfOvYOHX05+Z0QkawEvA4gUmbGAhOA8UPHuKGjeegYA1Tl8PoHy96H/UNAxKVxe4EO YPfQsWvo2Dl0bAfaXLqWiAyTSl7EfVOHjilDxySgdeio8DBXLlUNHVOO82sGgK1DxxZg89CxaegQ EZep5EWcmwnMBk4e+uMZwHTcuzsuNRXYv1cnH+WvDQIbgPXAa8A6YO3QH4uIQ4beyYucUBSYC8wZ Ok4FTsF+Fy651Q+8AqwBXh46VgFxL0OJFAuVvMhbnQ4sAOYNHad7G0eOYiWwYuh4cei/i8gRVPJS 7mqBs4eOM4eOGk8TiRPdwPKh4/mho8vTRCIFQCUv5aYBOA84F3gbcJa3cSSHlgHPAc8Cz2B/8idS VlTyUuqCwNuBRUPH27yNIx56Dnhq6HgCe30AkZKmkpdSNBs4H1gydFR6G0cKUB+wdOh4HHsmv0jJ UclLKTCAi4GLgAuxS15kJNYCjwKPAA9jrwooUvRU8lKs6oB3Dh0XYy8BK+KGvdhF/9eho9PbOCLO qeSlmIwB3g1cArwLe412kVxKAH8B/gw8iL10r0jRUMlLoRsFvHfoeA/2musiXjCBPwEPDB37vI0j cmIqeSlEYeBy4DLgUrRMrBSeQeB+4I/AH7Dv+EUKjkpeCskFwBXA+4DRHmcRGa49wO+B+4DHPM4i chiVvHhtOnDl0HGqx1lEsrUGuHfo2OBxFhGVvHjCAK4GrsJ+JC9Siv4I3APcjT7JE4+o5CWfZgPX YBf8JI+ziOTLFuyi/w1adEfyTCUv+fA+4Nqh/xQpZ78HfjX0nyI5p5KXXBkNfBj4EHCax1lECs1q 4C7gl9gT90RyQiUvbpsLXDd01HucRaTQHQB+MXSs8jiLlCCVvLjlYuB67PftIjJydwM/x15SV8QV KnnJ1tXAP2JvDiMi2XsE+Bl26YtkRSUvThjAR4eOszzOIlKqlgE/HTr0CZ44opKXkYgAHxs65nic RaRcvAz8ZOgY9DiLFBmVvAxHBfCJoeNkj7OIlKt1wO1Dx4DHWaRIqOTleMLAJ4cOlbtIYVgH3DZ0 aGMcOS5/TXWD1xmkMN2AfcdwPdDobRQROUQj8E7s7ZcBXvIwixQ4lbwc6TrsO4RPAmM8ziIixzYG eDd24Sex392LHMbndQApGJcBjwJ3Amd6nEVEhu9M7H9uH0UbPskRVPJyHvBb4A/Y+7mLSHG6APuf 499i/3Mtosf1ZWwa8DXgVmCWt1FExEWzsBeoGgW8Duz3No54SSVffmLAF4D/AZZ4nEVEcucM4Eog hL0ufsrbOOIFlXx5+RD2nft1QKXHWUQk9yqB84ELsb+tX+NtHMk3vZMvD+cA92Bva7nA4ywikn8L sP/5vwf73wdSJnQnX9pGAV8Bfoz2dBcR+339Ndiv7dYAcW/jSK6p5EvXh7DL/Sog6HEWESkcQezZ 9xcC/egRfklTyZee04BvYc+cb/Y2iogUsGbgfcBkYCvQ7m0cyQWVfGn5PPAj4G1eBxGRojEHuHTo j5/3Moi4TyVfGhYDPwQ+A1R5G0VEilAVcBH2BL02YJunacQ1KvniVgF8GbvgZ3ucRUSK3zTg/djv 7V8A0t7GkWyp5IvXhdjl/lHsxS5ERNwQAt6OvSZ+O7DF2ziSDZV88Ylgfxb3A2C6x1lEpHRNAq7A vqtfju7qi5JKvrgswi73j6PP4kQk94LYc37mAW8A2z1NIyOmki8eX8Au+FO9DiIiZWcq8B7ABP7m cRYZAZV84ZsD/F/gJiDqcRYRKV9R7Bn4M4DNQIe3cWQ4VPKF7Xrg+9iPy0RECsFs7Il5fcBqj7PI CajkC1Mj8A3gv7DXnxcRKSSjgMuAGmAlWgO/YKnkC8/bsR/PX+t1EBGREzgbmIs9KW+bt1HkaFTy heVG4HvY7+FFRIrBJOx1OxLAix5nkSOo5AtDE/Cf2JvKaFlaESk2VcC7sB/jr8J+Xy8FQCXvvYXY d+/XeB1ERCRLZ2A/idyOvqkvCCp5b30E+C72QhMiIqVgMvYXQb3Yd/XiIZW8NyLYj+a/A9R5G0VE xHV12NvXBrEXz9GSuB5RyeffDOAW7El2IiKlbCH2xLx1wD6Ps5QllXx+XYR9936J10FERPLkFOA0 YBfwusdZyo5KPn8+gl3wWnteRMrNSdh39T3oPX1eqeTz42bg20C910FERDxSi/2ZHcDTXgYpJyr5 3GoCvgV8EfB7nEVExGt+7FU9xwAr0Pf0OaeSz505wH8D13kdRESkwCwAWoENaDe7nFLJ58YF2AX/ Dq+DiIgUqJOBWcBOYIvHWUqWSt59H8DePW6+10FERArcBOx/V+4HXvU4S0lSybvrBuyCb/U6iIhI kWgEzgX6gZc8zlJyVPLu+RL2JjO1XgcRESkyldivOTPAsx5nKSkq+exFgH/HXqY24G0UEZGiFcAu +jDwHFoK1xUq+eyMAv4D+LzXQURESsR52E9EXwTiHmcpeip55yZgF/wnvQ4iIlJizsB+V78a6PY4 S1FTyTszA/gG8GGvg4iIlKi52AuKvYo2t3FMJT9ypwFfB97vdRARkRI3G2jBXjSn3eMsRUklPzJn YE+ye4/XQUREysQM7A1uNmPvZCcjoJIfvrdhF7xWsRMRya+pwETslfF2ehuluKjkh2ch8P9if94h IiL5Nxm76LcB2z1NUkRU8ie2GPsb+Ld7G0NEpOy1Dh3bscteTkAlf3yLsQt+sacpRETkoInYRb8N Ff0JqeSPbSEqeBGRQjRx6NiKHt0fl0r+6N6G/Q5ej+hFRArTROxFyV5Hk/GOSSX/Vgc/k9MkOxGR wtYKjMf+jl6f1x2FSv5wp6HP5EREislkYBywDi2Y8xYq+b+bgb2SnRa6EREpLlOxl8B9GS2BexiV vG0C9lr0WqpWRKQ4zcDeGfQltKnNm1Tyf98uVpvNiIgUt9lADfZ+9NqmFpV8BG0XKyJSSuYCUeAJ IO1xFs+Ve8n/O/B5r0OIiIirzgD8wONeB/FaOZf8l7AXuxERkdJzHpAAnvU6iJfKteRvAP4TCHgd REREcuZcYD/2ZLyyVI4l/wHgv4Bar4OIiEhOBYD5wBvAqx5n8US5lfwF2AXf6nUQERHJi0rgZGAj 9n70ZaWcSn4O8N/YP9WJiEj5aMS+uVsJdHicJa/KpeSbsAtey9WKiJSnCdhl/zTQ53GWvCmXkv8W cJ3XIURExFMnAzHgz14HyZdyKPmbgS96HUJERArCAsDEvqMveaVe8h8Bvo29KIKIiAjYn9btAlZ5 HSTXSrnkLwK+A9R7HURERAqKH3tr8XXA6x5nyalSLfkZ2AV/qtdBRESkINViz7h/nhLenrYUSz4C 3AJc4nUQEREpaCdhP+39CyW6mU0plvzXgBu9DiEiIkXhFMAAlnodJBdKreQ/gv2YXkREZLgWAjsp wYl4pVTyC4HvAnVeBxERkaJzKnbJb/c6iJt8XgdwSRPwVbQmvYiIONOK3SNNXgdxU6ncyf8ncI3X IUREpKhNxp68/Vevg7ilFEr+RuzJdiIiItk6A/uTuhe9DuKGYi/5twPfA6q8DiIiIiXjNOz389s8 zpG1Yn4n3wh8GRjrdRARESkpY7H7pdHrINkq5jv5bwDXeh1CRERK0iQgADzsdZBsFGvJXw/8l9ch RESkpJ2N/Undaq+DOFWMj+vnAF/yOoSIiJSFL2H3TlEqxpL/EjDd6xAiIlIWplPEN5bF9rj+C8BN XocQEZGyMhvoB/7mdZCRKqY7+UUU8U9TIiJS1L6E3UNFpVhKPgL8H6CoHjuIiEjJaMDuoYjXQUai WB7XfwX4uNchRESkrE3F3nf+Ka+DDFcxlPyFwA+AoNdBRESk7J2BveTtFq+DDEehP66vAL4IRL0O IiIigt1HX8Tup4JX6CX/r8AFXocQERE5xAXY/VTwCrnkF1Mkv4kiIlJ2/hW7pwpaIZf8F4BKr0OI iIgcRSV2TxW0Qp1493ngM16HEBEROY5pQB/wvNdBjqUQ7+RPwy55ERGRQvd57N4qSIVY8jcBzV6H EBERGYZmCni59UIr+Q8BH/Y6hIiIyAh8GLu/Ck4hlfwoCvinIRERkeO4CbvHCkohlfy/AHO9DiEi IuLAXOweKyiFUvLnAJ/zOoSIiEgWPofdZwWjUEr+c2jpWhERKW5RCuyGtRBK/kPAlV6HEBERccGV FNAkvIDH148Bn/U4g5Q4y++na9pUmDQZqmsg4PXf9lIwLBPSachkIJ2BTNr+7wMDEI9Dfz/E40Ti ccLd3fgGBrxOLMXhs8AfgH6vg3j9b7vPAgs8ziAlrGvOHBL/cD3JmTOgqgqCIfAZXseSQmFZhx+m af9nOv33I5NhIJ3Gn0xi9PTC3j2wZ+ho201w5w6qd+7EPzjo9f8aKRwLsPvtP70OYowfN82ra08D ngKavAogJcww6H7nO+i56SYY1wK+QngzJUXvyB8GTBNMEyOZxHjjDdiwEda/RsXLL1O3di1GOu11 YvFOO7AI2OhlCC9L/gdofXrJAcvno++ss+i6+WaYNMnrOFKuEkl47TV4+WUiL79Mzatr8Xd3QyKB L5HAyGS8Tii590Pgn7wM4FXJnwc87cWFpfQlR42i46tfhXe+0+soIn8Xj8OGDRhr1lDzylqCb+yE vXsJ7d2LL5HwOp3kzkLgGa8u7tU7ed3BS86kWifCeed5HUPkcNEozJ2LNXcuXZkMdHTA+vXE1r1G cNNGjNdfJ7pjhwq/9HyGMiv5y4CrPLiulAHL56PnlFOhstLrKCLH5vfD2LEwdiz9ixfDvn0YO3cy uHUrvhUrqFi+nMju3Rim6XVSyd5VwG+AP3pxcS9K/kYPrillJD1+vNcRRIbP54PRo7FGj2bgtNPg /PMZ3LcP38pVGA8/xOhlyzEymsBX5G7Eo5L311Q35PN616G94iWXDIOe886DU0/1OonIyPl8UFGB 1dCAOetkMu95D72XXcqAZRHWZ3rFbBKwFXg53xfOd8nfBrTk84JSZgyD/kmTsM491+skItkxDLv0 a2rILFxI37vfTc/o0YQOHMBIpfGlkvZnfFIsxgI/yfdF81nyNwCfzNfFpDwZlkUQiF98MYTDXscR cU9lJZx+OvF3XULfSRPwmyZWIoE/HsdQ2ReDFqADeCmfF81XyYeB24Ex+biYlLlkkuS4FjLTptl3 QyKlJByG6dMYPO9cEq2tZCqrMHp68Pf1quwL30nAz4C8LZKQr5K/Ebg+HxcSMRIJrM4DDM6YAaNH ex1HJDfCYcxJk0jOnUvytNNIVFUR3rpVn+AVtjHAXmB5vi6Yj5KvwL6Lb8z1hURg6JH93r2Y27eT mj4DRjXojl5Kk2FARQRz3DjSc+cysGQJicFBItu2aUW9wjUB+24+L59M5KPkbwQ+nOuLiBzKME0q du4k9sgjDPh8WFOmQSjodSwpJsX0g6EBhEOYjY2klyyh94wzMbZuI7SnQ4/wC08jebybz/WythFg BXByLi8iciJmKMzeGdOxGhogFPI6jhQKn8/eejgYhEAQggF7ZbrqavuoqoaaGqivw4pESAeD9q8N hex34+Fw4W5d3NMD9/2OxnvuJbxjhzbLKSzrgHlAzr+JzHXJfwZ7IxoRkaJl+Xyka2rpa6jHbGiA UaOgqRnGjsVqHMVgTQ1WbS3U10NtXWE9NdqwgZpf/YrQc38jsusNfXZXOP4JewObnMplyRvAKmBO ri4gIuI1MxIh3tCAOXo0NDVjNTczMG4sqZYWaG21l68Nelz6iQT+p56m6g9/oGLZ8wTicW/zCNgL 48wFcvpTVy5L/mPAHbkaXESkIBkGycpKMrW10NBAZuxY+mbOJHXKKXDKHKiMepMrk8FoayP4579Q d9cvCe3d600OOdTHyfECObks+eeBs3I1uIhIMbB8PsxwGKuiAquqmvazz4QlF8C8eVAZy3+gwUH8 69ZR/c1vUvnKK/m/vhxqGXB2Li+Qq5K/GnvXHREROYpEfT1d559P6v1XYs2Ybj/S9/vzFyCVxved bzH2V7/GSKXyd1050jXA3bkaPFef0N0CTM7FwCIipSAwMEDlunVU3/c7kk89ha+7CyMYxgz4IRS2 Z/7nkt+HdfbZDLS0ENy6FV9vr7a29UY1cFeuBs9FyV8M/Jvbg4qIlKrY3r1ULltG+LHHYPt2fPE4 pt8PtTW5LXufD3PKFAamT8fs7iK0ux2fPrXLt8nYj+1fz8XguSj5bwCz3R5URKTU+QcHqdi4kdAL LxB8dS2h7dtJhEL2J3u5epTv82GNHUty1mwyhkFk3Tqtlpd/AeC+XAzsdsnPRd/Fi4hkxZ9MEmpr I7xmDeFVqwhs3ECiugZGNeam7A0DamtJzZ5NsnkskRUv4Usm3b+OHMts4AGg3e2B3S75/4Nm1IuI uMIwTQKdnYQ3bqTy8cdJb9xEesoUqK/LzQUjETLTZzAw51QCL71EsLc3N9eRoxkAHnZ7UDdLfjT2 d/EVbg0oIiJ22fsGB4lu3EjVfffR39sHU6bZy+r6XX5n7/dhtrQQn3s65vr1RPbt0/r3+TEN+DnQ 7+agbpb8DcClbg0mIiJvZaTTVK9aSeThh0hZYI0ahRWLuTtBzzBgzGiS06fDrl2E29s18z73KoAO 7DVmXONmyf8YaHJrMBEROTZ/by8VL72Ef+NG0j4fZlMTRCLuXcAwoKmJxNQpsGcvkW1b3RtbjmU0 cJubA7pV8u8D/tmNgUREZHh8mQyhnTsJvvwyoW3bGKyrt9fKd9Po0SRmzsTs6aViwwZ3x5YjNQGv AK+5NaBbJf8NYKYbA4mIyMgE+vsJb9pEeMUK4gNxmDYdwi5uqVxXR3LuXNLdPURfW+feuHI0QeAe twZzo+Rno8/mRES8ZVkEurqoWrUK/2uvMThtOjS4+PVULEpqzhwy+/frjj63ZmJ/M7/HjcHcKPl/ Bs5zIYuIiGTJSKcJb9uG8fxzpMc0YY0dB8GAO4NHo6RmzsTq2EN4+zZNxsudLmCpGwNlW/IGcDuQ o482RUTEiXBXN9FnnyFjWfbe9lVV7gxcXU1yyhR71v0bb6joc2McLj0hz7bkr8HeN15ERAqML5kk +uILmLvaSDaOhqYm8BnZD9zQQOKkk7A2byaye3f248mR6oANwNpsB8q25L8OzMg2hIiI5E5k6xZ8 GzdgVlWTmXASBFx4fD96NMnWSRgvvUi4uzv78eRIfuC3WQ+SRclPB36YbQAREcktAwjt20f4lVdI h8L20rihYJaDGtDcRHL2KUSefgp/PO5KVnnTDOx95vdnM0g2Jf8pYEk2FxcRkfwwLAt/by/RZctI hEJk5szJfrOboQVzkq2tRJcuxdA2tW7rAJ7OZoBsSv4HwJhsLi4iIvllZDLEli9nMJUmc8op9vr3 WQ1oYI4ZQ9rvJ7J6tbapddco4H+yGcBpyV8A/Gs2FxYREe9UrlxBsrOT9LRpUF2d3WDBIOlx4zD3 7SO0dSs+Fb1bxgDPAVucDuC05P8VmO/0oiIi4r3oxo2k9+8nNXUq1GX5JXRVFammJgIbNxLs6NDO de6JA392erKTkg9jfxsfc3pRERHxnmGahHfuxOzsJDVtGtTWZjfgqEYyDQ1UPP83fAMD7oSUk7Bf jzt6POKk5K8E/sHJxUREpLD40mnC27aT7uokPWcOxLK4f/MZmC0tDGYyVC1b5lrGMhcDXsXhN/NO Sv6r2OvVi4hICTAyaaLr15MYHCRzzjnZzbr3+zHnzaP3hReobmtzL2R5ywC/c3LiSEt+FPZety4t hCwiIoUitnYtg8GgPes+mMV39IaBcdZZRJYuxd/T417A8jUFu3tHvBjBSEv+auCKkV5ERESKQ+zF F0nW1JCePj27oo/FSNTWEl6+HH8i4V7A8hTAXuZ21UhPHGnJ/xtaxlZEpGQZlkXk1bWkGkbZn9c5 fXRvGJijR8OePUQ2bNBse3fcPdITRlLyY7Bn1buwu4GIiBQqXyKBsX07AydNgAkT7JXtnAhHMGuq Cb76KsF9+9wNWX6mYT+y7x/JSSMp+auBS0cYSkREilCguxtr7x6Ss2ZBg8OVUQ0Da/RoUn19hF55 BX8y6W7I8mIA6xnhI/uRlPzNwMwRhhIRkSJkWBaRN94gY5qk5s6FSMTZQH4/5sSJVKxYQXC3Zttn KcMId6YbbsnXoVn1IiJlJ7JpE4mWFjIzZzp/bB+NEg+HiT3/PD5NwsvGJOBHwOBwT/AN89e9E3ul OxERKSNGMknsRz+CNa9kN9AFF9B/5pnuhCpfYew+HraRlLyIiJShWHs7td/8D2hvdz5IOEzPp24k le3SuTKiPh7O43oDe6s7rVUvIlKmwh0dmMkkyXPPBd9w7w+PMGoUqcQgsRdecDdceWkGvjPcXzyc /6cuBhodxxERkZJQ+cgjsPRx5wP4DJLXXEPv+PHuhSo/jdi9PCzDuZP/NHB2NolERKT4+eNxgvsP MHDWmVBV5WyQUAjLNIn+7W9adMW5vcDDw/mFw7mTvzC7LCIiUirCa1+h4o/3w+CwJ3gfLhAgtXAh /TO0eGoWht3LJ/okbjbacc41gzU1ZBpHY8Wizt9puc2yIB4nuHcv4e4uML1ZejJdVcVgNAr+Avl9 keJkAaaJYZoE0mn8yST+ZAIjlfY6Wcnwx+PEHnmY5NlnkTntNEef1ZnjxjF48cVUbNmide2dOdjN J9x+9kQlf74rccpcYtQo4osXMzh/AelxY6GysnBK3jShv59gRwfhFSupfOxRgnv25OXSVjBIfNYs kmeeRXpSK4OxGASy2OJSxAIyJoaZwZ9OE0wm8SUGMeKD0NUJnV1wYD/s2UNFezvhffswTNPr1EUn snEjoYceYmDKVKiqHPkAFRUkzj6bxCOPEF23zv2A5eF8XCj5Je5kKV+JiRM58NnPkj77bKitLZxy P0LKskidey6JJW+n+r/+i+jmzbm9XnU1nR/4AKlLL8VsaYGKipxeT8qLBaSHDsD+YTaRsB8xDw5C PM5gfz/+zi7YtBHWryf66qvEduzASOuu/0SMTIaaB+4necGFZBbMdzSGOX06qdPnYW3ahJFKuZyw LCwBvn+iX2SMHzftWH8tCBwAHPyYJgCZigra77gD8/TTne/klG+mibGrjcZrP0i4oyM3lwiF2P2Z z2Befz2EtcaSeMiyIJ2GVAojlcLY1QbLluFf+hhjVq7GyKjwj6f9/PNJ/fjHjs83nn6axq99jfCu XS6mKht9QD1w3J+Qjje7/gLgoy6HKh+Gwa4vfhHrXe8q2Lv3ozIMqKlmcNJkYn/9a04eZe6+8CLM /+fL2e1VLeIGw7B/AA8GIRLBamzEmjsX8/L30XP55fSMbcbX3UNgYADMjB7tH6Fy61Z6zjkHxo51 NkBTE5Hlywnu2OFusPIQAp4FXj/eLzpeyX8EOM/lUGVjYOJE4v/xzaJ9x2zV1ZLauJHYtm2ujpuO xej5/vehTqteSQEzDKiugtPmMnjppfTOn0+iIkIwlcJKpbSb2iESW7eQede7nP3QHggwgEHV00/p NYkzO4Glx/sFxyv5fwdOcjtRudh32eWYixd5HcM5v59AdzexZ55xddj9551H+tprXR1TJKcCARg3 jsyiRfSfeSaJpiYsvx9fd7dmhgOx9g56pk2Dacd89Xt8zU34H36YcGenu8HKgw/43xP9gqNpAN7m epxyMmO61wmyEwjA+PFYLj+JSM2Z4+p4InnV2krq2mvp+upX6fzKVzhw0UVYgTLfnNOyqL7nHujp cXZ+dTXdl1zibqby8Tbsvj6mY5W8HtNnq9gnlBmG/fjN7fkEdXXujieSb34/tLSQeNcl9H/lK+z5 /v/HgQULnG/DWgKimzbB8887Pt963xWY4ZCLicrKcfv6WP8GPzcHQcrLvn1eJ8iOaUJvL0bS5U9b urvdHU/EK34fjBlD8vwl9P/wh7R/8f8wMGqU16k8EejspO7RR52vgtfcRMfCxa5mKiPH7etjlbwe 1WfJt2yZ/XlOsUok4OWXXR/Wv2p1cf++iBzJMKC2ltQ/Xs++O+6gb/Ei0tGo16nyyjBN/OvWYaxe 7XAAA+v9V2AV05dIheO4fX2039Fa4KzcZCkfjc8/Dxs3eR3DMaO9ndBTT7k+7qjly2C7PpeREmQY cPLJdH77O7TfcAODra1l9Qg/vGMHsRUrIOHsywPr1FMZbGlxOVVZOAu7t4/qaLPr3w5o+nOWjFQK s62N5FlnQSzmdZyRGRik6kc/pvaZp10f2pdKYfZ0kTz77OKftyByNOEwzJ/PwJQp+Lq6COzejZHJ eJ0q5wzTJBkIkJh3ur265whZFpg7dxJb+0oO0pW8p4GjLlN6tJK/Dijib78KR+SNN7D6+0lOn+58 W8Z86+4mduut1Nzz25x9txreuRPT5yc1c6aKXkrXuHEkTz2VlM+Hb+tWAk7fVxcRX3c3yXnzMSdO GPlTDL8f/2CC6NKlZfFDkcu2AE8c7S8creS/BEzOdaJyYFgWoc2bMdavJ1FfD83Nhbu8bSoNL71E 7Xe+Q/Vf/oIvh/9CMlJpQhs2YO3ZQ7J1EtTUlNVjTSkThoFVU0N69ikkqioJr1+PPx73OlVO+RMJ BuvrSc+fD6ERzpY3DMxMGt+KFYSLfeJy/iWAu472F462dn0XUJPrRGXFMLB8PnpaW+mdPx9r7NjC WdI1k4G2NipXr6J20+sY6VT+JsYZBqn6BvYvXkxq0UJoHgsR3dlLFgweCmHbAAAgAElEQVQDAkEI hyBWae/4WAjbF5smPPQQY2++GX9fn9dpcqp3wgS6f/lLrDFjRn7ygQNU3fJdan93r/vBSls3x3gv f2TJnw6syEciEZFcs/wBUnV1dDY3YY4bB62tMGUqTJ1CuroaolF7B8RgCPLxMOnpZ2j66pcJduRn O2ev7L7jDtILF478RNMk9otfUPvtb+PTMrcjNQ9YeeSfPPJx/XuBd+crkYhILhmWiT8ep3LPHqo2 b6bqpZeoeuRhKu+7j8yTTxJ47TWCHR0Y8X7MTMYu/FyuYDdhAv0nzyK0di2BzgO5u47HBoJBMhdc MPITDYNUVxfBlSsJOV1Br3yt4ig36UeW/CexfxoQESlZRiZDRWcn0Y0bqfjb3wg9+yz+tWsJb99O sr8famrtu/xcaG4mcdJJBDa/TnDv3txcw2P+vXuJf+ADI38vD2BZVKxYQUjbz47UbuBPR/7JI0v+ a0BzngKJiHjOsCwC8TiRnTsJr15NaNUqwi+vJtndhdUwyv4yxs2JoT4fVnMzycZGghs3EijBjVkC 8Tg98+bDxIkjPzkaJbJqNaEN67Vw1sgYwO1H/slDSz4K/DCfiUREColhWQR7ewlt30505SqiTz9N uqeXzNSpEIm4dyG/H3P8eBKxKOE1a0py1n1PrALevmTkJwYCpHbsILJ6tbb0HZlm4NvAYWuRHzrt dG5e44iIFCrLItDbS3jDBkZ/77vUX3klxlNPuXtnGQqRed8VdLzvCsxC+drGRU1Ln7S/3nEgM3kK VmWlu4HKw1t6/NCS1x6gIiJHEdu+nZZPfILgpz+Ff/Vq5xuxHMkw4FM30nv++eArrbUiAt1dsPZV ZydParU/f5SRekuPH/q4/mNo0p2IyDFVbttO6IUXSPr9mE1N9pLV2b6vDwZIzF9AYMUKQu3t7gQt BIZBz8SJMNfBQ+JolPDjjxF6Q5PvRmgX8OChf+LQkv8KoN0BRESOI9DdTXDNGvy7d5MaPx6rsTH7 QWNRBidMwP/ii6Xz6Zhlka6uJvWOd4z8XJ+P9IYNxNaswdDku5FIAT899E8cWvLfBxx87yAiUl4C iQTh118ntHYt8daJMG5c9oM2NmL6/FS8+EJJrN1uAP5wmP6LL3Y0adHcf4DqJ5ZimKb74UpXHfDN Q//EwXfyM4Ei2ypNRMQ7RjpN5JVXaP7nz8Gf3vJ58siFQiQvupC+xYuzH6tAGN09sG27s5OnTNae FiMXw+7zNx0s+dn5zyIiUuQsi8D+/TR9/esYd99tr1GfzXBjx9J9+WX0u/FkoBD098GW152d29pa uBt6FbbD+vxgyZ/sQRARkZIQ7O5m1G234X/gAUgkshvsjDNJL1qEFSz+t6f+eJyKnTudnRyN0n/S Se4GKg+H9fmhj+tFRMShSFsbdbfdhv+JJyCVOvEJxxKL0XPZ5SRPGu9eOI/4EwkiHe2Ofz86Z6ia HDjq4/oZHgQRESkpFVu2UPejH+F7ZW12A82aRe/552MV++Nqy8LY3wmdXc7On/aWrdDlxA7r84Ml P92DICIiJadi40bqv/XfzosNIOBn4OprSDc0nPjXFrquTti/z9m5Eye4m6U8HNbnPmAq4OKizCIi 5a3i5ZcJ3PxVSGfxKdzYZvZcc417obzS3Q1ON+EZr3fyDkSwex34e8mLiIhbTJOmJ57AuOsu5zPu DQPzuuvI1Na4my3f+voxnC7wM3acPqNz5rCSn+JhEBGRkmSk0zTefTes3+B8kMpK9lz1AfdCeSDS 30ekt9fZyVUxkrW17gYqD2/2ukpeRCRHArt2Ebnnt/Yja4fMd7yTwZriLTr/wAD+7m7HTzT6mppc TlQWDiv5SR4GEREpWf5kgtqnniK8bDmYztZgN1vG0Xf2WS4nyyPLwujqdrx+QKK+BCYf5t+bve4D Wj0MIiJS0oLt7QQfexT27XU2QCyGdd7C4v6crr8Pkkln59YU+ZwEb7zZ6yp5EZFcMk2qly4lvGET ONlRLRAgMW0qvRMnuh4tb/rjzhcIKvaJh944rOQrPAwiIlLy/H19+B76CwwMODrfam7GmjXL5VR5 NJBFyRfxfAQPVQBj4e+L4YiISA7VPvYYvvZ2ZyfX15OeNo1MKOhuqHyJZ1PyupN3aAKo5EVE8iLQ 1YXx0MPOTvb7GZg8mUTjaHdD5cvgIKTTzs6t0FptDo0HlbyISN7UPHA/pJyVnTVxIhTr52TptPNF gYJF+vTCeyp5EZF8im3fDmtednby2LFYjaOLcwW4dNrZpEOAUPFvueuRcaCSFxHJH9OERx91dm4k Qt+kVtLhsLuZ8iGTcX4nH9CdvEMqeRGRfBv99NN26TmQnNiKVVGEH0RlU/J6XO9UM6jkRUTyKtjR Adu3Ozt5/HiIFOFENKeP6iUbKnkRkbxLp+HVV52d29JSnCXv8zmfS+B0Vr6MAZW8iEh+ZTIYGzc5 O7ehHjMWczdPPhgGOJ0vmHb4fb1UAZUqeRGRPDIyGWq2bnF2st/P4Jgx7gbKB58Pxy3vdBEdAWhU yYuI5JFhmoT27bMXiHGgp6kZ57fFHvH7h4reAZV8NlTyIiJ5l0jAgQPOzq2rK7qOJxh0XvJ6J5+N BpW8iEi+JZLQ3e3s3Noi3LAlEASfw61ynW5RK6CSFxHxQDoFff3Ozq2qdDdLPgSD4HdYN/0Of58E oF4lLyKSb5kMJJy9ky/KZV7DIfu9vBM9ve5mKS+1KnkRkXwzTefvmsNFWPKRCAQCzs7t6XE3S3lR yYuI5J1lQcbhMq9O3217qaLCecl3d7mbpbxUq+RFRPLN54OAw7J2uFWtpyIRxxvNGHpcnw2VvIhI 3hmG83fUxfjdeEUUgs7u5MO9Dr9CENCKdyIiHvD5nO+uVozLvMZijicMVnSp5LOgkhcRyTt/wH5P 7cRgwt0sOWb5/ViVMWdPLtIZQvv3ux+qfMRU8iIi+RbwOy/53uJ6R22GI5gVUWe70O3bh68YX08U jgqVvIhIvgWDEKtydm5vcX1SloxGSMSizk7e1eZumPKjkhcRybtwGGqrHZ1q9HTbn+AVCTMaI+N0 lb7dKvkshVXyIiL5ZBiYlZWOH9dXON3YxivRmPOnFrt2uZul/KjkRUTyyfL56G1qcvaO2rKIdexx P1QuxWLO19vXnXy2gip5EZE8svx+Ei0tzk6Ox/EX2cQ7KmNQ5ezVRGjnTpfDlB2VvIhIXvl80DLe 2bn7DxTfYjhVVVBb4+jUus2vuxym7Djd+09ERBzx+2HiRGfn7umAZPF8J2/5/WTq6uxlbUeqs4tg V6f7ocqLSl5EJJ+sigponejs5La2oloMJx2JEB/d6OzkHdvt3fokG4ZKXkQkj3omTbInozkQaGvD SBRPyVuRCKkxTc5O3r6jqD4VLFAqeRGRfOqbN8/ZiaZFbFcb/iIqeSIRaG52dq7u5N1gqeRFRPLp zLOcndfdTWDPHoxMxt08uVRRAWPHOjo1tkN38i5QyYuI5IsZCsHc052d3N4ORbYQjhWNgpPH9ek0 0e3bMXQnn62MSl5EJE/azzgTIs62XDXad8OB4tmRzfL5GJgwwdk+8rva8BXbegCFSSUvIpI3S5Y4 O8+yiOzaRbiY7uQNg97p052du2M7xOPu5ilPKZW8iEgeZKJROOMMZyf39xPcvh1/MRWfzwdTpzk6 1b9jO0a83+VAZUklLyKSD32nnIo5ZrSzk/fvh61b3Q2Uaz4fOLmTtyyi23fg7y+iH2gKV0IlLyKS B8lFC7GcrPwG+PfvJ1RkJZ9obgYnP9T09hLs6MCXTrsfqvyo5EVEci1VV4c5Zw6EHEy6y2QIbd9B RZFtu7p33jz7bn6k9uyFfcUzwbDADajkRURyrH/+fJLjxjk7OR6Hl14qvm/GFyxwdJrR3oaxt8i2 0y1cKnkRkVxKRyKk5s+HRmdruBt9/YRWrHA5VW5Zfj/Mm+/gRIvIG7sI793rfqjy1K+SFxHJoURr K4Nz5kDAwffigH/zJqp2bHc5VW71jh8PLS0jPzEeJ7CtyL4iKGx9KnkRkRyxAgEyp5zqbJb5QQ8/ XFxL2QL9CxaAzxj5iZ1dxfcVQWFTyYuI5Eq6oYHexYshGnU2QHyAhkcecTVTXixwth6Ar6uTwNYt Locpaz0qeRGRXDAM0pMmYZ57rvMxHn+MUHe3e5nyIBONYs2dO/ITLYvgnr3Edu50P1T5UsmLiOSC GQ6z79prIexsrXpSKYJ33+1uqDzoPP10MlWVIz8xmcRYu1ab0rirSyUvIpID/aedBgsXOR9g7VrG rFnjXqB8mTfP3mJ2hIxEgsCKl3IQqKyp5EVE3JaJxej6p39yfhdvmkTvvx+KbNW3VFUVmZkzIRwe 8bnGgQNUvvpqDlKVtQMqeRERl3W95z3O940HeH0LlS+tKLpH1wOTJpEaOxaMkc+sN1asJKjtZd22 XyUvIuKiweaxDF53Hfid/+s1svRxAm3FtYwtgDVtOtboMc5OfvIJd8MIqORFRNxj+Xz0Xn895vjx zgfZsYPo88/j7y+urVbNSITMtKlQVzvyk5Mpxjz7rPuhZK9KXkTEDT4f3eeey+Dixc42ogHIZPC/ 8CL+19a7Gi0fBsePp3/GDGcnL3teq9zlhkpeRMQNqaYmkldcASdlcRff0UH0iSeIdHW6FywffD7M SZNg2jRHp4f/8leXAwnQi1a8ExHJXqaigq53vpPE297mbHtVgEyGwIqVVCxf7m64PMhEo/TPOQ1q HTyq33+Auuefdz+UdACo5EVEsjQwaxaDH7wWqqocj2H09xP53b2Ee3tcTJYfZk0tybPPdnbyC8vx dxfZk4visBtU8iIiWTEjFXR9+cswbmxW4/gee5yaF190KVV+DU6ZDNOdPaqvfvIpjGTK5UTCUMk7 2/tQREQwg0F2ffObMGtWdgN199D4ve/iK7Ld5gAwDLouugj8/pGf+8YbRDasL7pd9orELlDJi4g4 kopG2ffh6+CSd2U5UIrQD35AcM8ed4LlWaKqGhYvdnSuf9UqjH373A0kB+0CPa4XERmxTCRC17su IX399dkPtnw5o+6/P/txPLL3ve+FUaNGfuLAILHVqwl26n18juwElbyIyIhYwSDxRYtIfvSjzhZ+ OVTbLqp+/nN8fcW5nKsZjWJ96EPOTt62Df+r6zCKbH3+IqKSFxEZCcvnIz5/Pr033og5cYKjNdrf lEwRu/8BqleuLLo16g/qXLgIJk4Y+YmmRWT9a0Q2bXQ/lBy0Hex38gPAyPcFFBEpM8kpU+i8+Was SZOyK3iAlS8ReuABfEW2fO1BlmGQuvL9zn4fujoJrFhBoK/P/WACdq+3gX0nv9XbLCIihc3y+UhM mcKeW2/Fmjw564I32tqo/vVvqNyyxaWE+Xdg3jxSU6c6Otdob8dXhIv+FJE3e10lLyJyHGY4TPys s9hz+x3Q0pL9gMkk4QceoPrxx7MfyyNmMIh5/vnOVrjLZAitfpmaHTvcDyYHvdnrAaB4f5QUEcmh ZGUlfRdcyMCnbsh6sZuDjCefpOrOO4t6wtnglCmkFiyAcHjE5xoDg0Qe0lr1OfZmrweAzR4GEREp SKnaWjrffxXJD14DY5vdGXTNGupv+Q6RAwfcGc8DZihE4txzyUya5Oh8Y80aKlevdjmVHOHNXlfJ i4gcIV3fwL7P30T6wguhpsadQdt20/Af/0F023Z3xvNIcvx44ucthFjM0fm+X/4SXyLhcio5wmEl v8nDICIiBSU+cSIHvv99rGnTnO8od6TeXmq//S0qXnnFnfE8YgUCpE47DfP0050N8PrrND35hLuh 5Gje7PWDJT8IRDyLIyLiJcMgU1XFvksuIfn5L0BVpXtj9/ZRcdttRJ94oujXaE/X19P13vdC0MGK 6KaJ/847i3ZNgCIyyBElD7ABmONJHBERD2UqIgzOmk3fVVeRvOgiqHBx2ZB4HP999xG77z78AwPu jeuRgXnzYf58Zyfv3MnopUvdDSRHs+HQ/3Kw5NejkheRMtM7YQKpd72T/kveDZMnu/d4HiCTwf/A A9T9/GdUFPFEu4MylZV0/+M/QsDJXbxF5MEH8fX0uB9MjrT+0P9y8P+t1zwIIiLiiUR9Pf2XXEL/ RRfD7FkQjbp+DeO++6i/9VYi7e2uj+2FzquuglNmOzt5+zYqn3kGXzLpbig5msP6/GDJr/MgiIhI XmViMXoWL2bggx8kM306VFXl5kL33MuYW24h2NWVm/HzrHf8eAY+/jFnTzpMi+iTTxHatBksy/1w cqTD+vxgya/1IIiISF5YPh9dixbTd+OnYdYsdx/LH3YhC37zG5pvuaWk1mWPf/zjUFfv7OQ3dhL6 23P4i3SnvSJ0WJ8f+ri+H3D24aOISAGxfD4ysRhWfT17zzuPzPvfDzNn5vaiff34fncvo26/raQK /sAZC0ied56z9fozGSIrV1KxapX7weRo+jnG43qAV4Cz8hpHRMRF6aoqki0tZCZNon/+fFLnLYRx 48CX5Y5xJ2Ds30/ot/dQddcvCe8v/kl2B6Vqakhf9j5obHR0vrF/P6HHHiPQq7v4PHnLQgyHlvwa VPIiUkx8Pgbr60hMmgLTppKcOpXBmTNhyhTHK7KNWFsbVbffTuzBB0uqzKxAgPi555E45xwIBh0M YBFYs4bYsmXuh5NjWXPknzi05F/OYxAREUfSdXV0tbbaj9+nTSN10kmkx4yBMU1Qmec3jmteoeGW W4iseAlfKpXfa+dYatw44u+7HMaMcTZAIkH0rrtK6gefIvCWHlfJi0hBylRW0tfcTLxlHLSMh8lT YOpUrNGNZCoq7EVrIhFn321nK52Bv/6Fxh//mMjWrSU3azwTDrPvwgvJnHmm41cdxiOPUvXiiy4n kxM4bslrZoQcm2Fg+f3EW1s5cNbZ9k/3oZDXqaSY+QwIBCESsv9eqohCfb09i7u+3r4rdzLZK9d6 eojceSe1P/85wRKaYHeoTEsLmY99zNljeoCBQRq/8+2i3k63SL2lxw8t+TiwEnC484CUqnQsRv+C BfR88pPgdGMKkWKXSmFs3EjlHT+h5pFHMDKlWWCZSISOz38e6uqcDWCaBH7+M8IdHe4GkxNZid3j hznyOdcKVPJyiFRNDZ1XXEHi45+Aeof/0IsUu7Y2ok8+gf/OX1C7bZvXaXLG8vk5cMUVsGSJ80G2 bKHh9793L5QM14qj/cmjlfzHc59FioEZDNK3ZAmJ669XwUt5iscxli+n8o/3U/PE4xiJ0l6Wte+M M0h88gbnr0kGB4neey8B3cV7YVglr1kS8qZUSwsDl10Gox3OrhUpVpYFW7YQ/dWviD31FKHdu4t+ m9gT6WtpoeeTn8Aa7eybeABefJHok0/iSyTcCybDddT+PrLkVwLdQE3O40hhMwwyrZPIzD0dCnDu k0jODCbw//pXjPrVrwns6SiLTVXMSITENddgnn6687v4ffuoevBBIjt2uBtOhqMbu7/f4mjfniwH LsppHCl4mXCY/bNmQlgz6KUMmCZGfADj8ccZ9X+/R7itzetE+WMY9C9aRPw977E/SXTCNAkvW07l 449jmKa7+WQ4lh/rL6jk5eh8PqjVe3gpcckkRlsbwVWrid17L7E1L2OU2KI2x2UY9E+bRte11zpf 9AYw2toI/+5eLXzjnRGV/PM5DCLFwrJA79WkVHX3wObNxFauJLB0KVVrX8Eog8fyR0rX1ND9D/8A CxY4H8SyCPz1IapfeMG9YDJSx+xtlbwclZFKEd2+nbhp5XxzD5G8yJjQtovQCy9Q8dIKfGvXUrl5 E5Tp42XL56Pr+uvJvPvd2W29++qrVP/yFyU/MbHAjajku4BlaLOasuZLp4lu3ER81xswfrzXcUSc 6+uDZcsJPvssta+swd/WRqCrq+zfHe9///sZ+PCHIRx2PkhfHw1f/zpRfTLnpWXYvX1Ux1r0+TlU 8mUvuHkTFUuXMvDh63Q3L8Wlrw9WroLHHmXM008T6OmBRAKfllkFYN+ZZzLwuc9BZWV2A/3kDqIv a9sTjz13vL94rJJ/Fvi8+1mkmAR6e4nccw+DU6dinXkW+LN4pCfiNtOEdNpebjaVwujYAytXEHjq KRpWrLCLXQ5nGPS1tpL4/Bfs/QGcsiyM5ctpuu/3Jbc5TxF69nh/8Vgl/0wOgkgRqty8GfPb36b/ 058hvWAe1NZ6HUnKTTJpTwIdHISBAejvJxSPY7R3wJYtsP41ql57jcju3WX/CP64DINky3jin/1n zFknZ7f5T3sHtT+/k8C+fe7lE6eO29fHKvn92I8A3uZ6HCk61evWEf63mxm46CJSc+cy2NQM0Sj4 /V5Hk6Jm2XfjGRPMDGQybxZ6YHCQwGCCwEAcOrugqxM6O2HfPoz2Dqo72vHF37IXhxxHetQoej76 ERJvX5zd9rz9/YQeuJ/QipfKdtJiAXkOu6+P6Xj/Tz+FSl6GhPfvJ/yb35B+8EEGx4yxtwXV43vJ hoVd7qb597JPDZX80OEfGNCsbRdYoRCd11/PYDYL3gBkMgRXvETdffcR0uuQQvDUiX7BiUr+y+5l kVIQ6O2lUgteiBSVPR/5KMmrr856op2xZy8Vt91OSEvXFoqsSv4JoA/IcvqliIh4pf1DHyL1mRsh GMx6LP+tt1K9cqUm2xWGPuyePq7jPW9NAUtdiyMiInljhsLsufpqUjfdlH3Bmyb+Pz1I82/v1uTG wrEUu6eP60QvVVXyIiJFJhOL0Xn5ZSQ+9WmIxbIbzLIwVq5izDe+7k44ccuw+vlEJf+4C0FERCRP MhUVdF1yCfFPfByanG8686YNG6n83nfxd3dnP5a4aVj9fKKSXzt0iIhIoTMMOt/9buI33AAtLixH 3dZG5f/+L9Vr1ug9fGEZdjcP52PJR4HZWcUREZGc67j+epKf+ER2q9kd1NdH9Hf3Uf3oI/jKcIe+ AvfocH/hcD50fiSLICIikmOWz6D9pptIfvGL7hR8JkPo6WeoufNO/Fp0qBANu5eHcyf/MLAXaHQc R0RE3GcYZGrr2H/DDaSu/kB2W8YewvfqOiq/820CfVoTowDtxe7lYRnO3xHWSAYUEZE8MHwkW1ro /Ow/kbjyyuxWsjvUpk1Ev/ZvxHbtcmc8cdvD2L08LMP9se+vzrKIiEgudM+cQde/3MTA5ZdDLOrO oK+/TtXXv0Hdq6+6M57kwoj6eLi7FPwVSADhEccRERFX7T/3POKf+QyccgoEXNooaudOar7/fape fMGd8SQXEuSo5DuBvwCXjzSRiIi4w/L52H/1NQx8+lMwqhGy2C32MHv3Un3rrVQ98YRWtCtsf8Hu 42EbyX6Df0YlLyLiCTMa5cCnPsXAhz8MFRXuDdzbR+Wdd1J9//0Y6bR740ou/HmkJ4yk5B8ETIb/ Hl9ERLJk+f30T5lC50c+Bu98B4RD7g3e10/0N7+m9he/UMEXPhO7h0dkJCXfAfwJuHSkFxERkZEz IxH6Fy6k6yMfgdNOA8Ot5/NAf5zor39F3Y9/jJFIuDeu5MqfsHt4REZS8gAPoJIXEcm5vnFjSV55 Ff1XXAGjR7s8eB+xn/2M2p/+FN/AgLtjS6484OQkJyU/CLj0QaaIiBzK8vvpW7CAnuuvxzznHAi7 /FFTTw+Vd9xB9a9/rYIvHoPkqeT3AfcDH3ByMRERObZEVRUHrvoAmQ9eg9XcDH6XPo87qKeHyttv p+Y3v8HX1+fu2JJL92P374iNtOQB/ohKXkTENZbPR2rcOPbcfDMsXOjuu/eDenqI/fSn1Nx5pzac KT5/dHqiMX7ctJGeEwZ2AC6/JBIRKTM+H6lRo9izaBHm5/4FRjXk5jr79hH9yU+ov+uXGCnNoi8y e4CTsBfCGTEnd/IJ4PfADU4uKCIikKqpYXDePPouuwzz/PMh4ORfx8OwdRuVt99G7R/+gKE94YvR 73FY8OCs5AHuQyUvIjJils9H76xZDF56KYklS6C52bXd4w6/kAWrVlF92+3UPPmE++NLvtyXzclO S/4xYA1wajYXFxEpJ5mqKvZ/6EMkL7kE66ST3J85/+aFMvDMM9TceitVr7ySm2tIPqzB7lvHsnk+ dC8qeRGRE7JCIfZfeCGJT9yA2Tohd+UOkEoTfPRRar/3XcJvvKG16IvbvdkO4GTi3UHTgfXZBhAR KVVmpIL+WbPouvHTcMaZEMzRe/eDBgcJ3Xcfjbfcgq+/P7fXknyYAWzIZoBs/o7bgD2t/7JsAoiI lJpkbS2ZiRPZ9/4r7fXmKytze0HLgl27iNx5J6Puukt376Xhj2RZ8JBdyQPcg0peRAQMg2RDA8lT T6V74ULMCy+EUaNyf91EgsCKFYR/9jPqn34699eTfLnHjUGyeVwP9m7Gm4FJboQRESlG6dpaehct IrloEcnTT4cxY3IzY/5IPT1E/vxnqn79a8KbN+sOvnRsAaYAWX/zmO2dvAXcDXw52yAiIsUmXVvL gYsvxrzkElKTJ0N9fX7KHWDPHsL/8z/UPfQQgQMH7Ef2UiruxoWCh+zv5AFmA/pGQ0TKRu/YsfRc cQVcfjnmqFEQCuVmKdpj2bCB+i9+kejmzdoHvjSdAqx1YyA3pnquxV6R530ujCUiUnDMQACrooLU +PHsvfoauPgiqK3NcwgT+vvx//73NH/rWyr30vV7XCp4cKfkAX6FSl5ESojl85GurSMztpmu2aeQ On8JnHkWhEP5DzM4SGDtWkK//AW1Tzypgi9tv3JzMDce1x+0CjjNrcFERLxgRiL0T5mMNXMWA3NP Izl/PrS0uL/t63C1txP861+pue/3VGzepHfvpW01MNfNAd1cmeEuVPIiUoTMcJj45MkkTz8d69RT ibe2wsRWqK7yLlQ6A08+Sd299xBauYJQT693WSRf7nJ7QDfv5EcDrwH1bg0oIpJL/ZMm0bdwEZxz NukJEzDr66GqKr+T6I5m504q//d/iS1dSqijQ3fv5eEAMBN7a81LAMQAABQRSURBVFnXuHknvwf4 BfA5F8cUEXGNGQ7TNXMm8SVLYMn5cNJ4LL/ffhTvdbEDJBLw0EPU/fjHxHbs0Hfv5eUXuFzw4O6d PNjvEla6OaCIyIgYBmYwiBmJQDiMVVNN+ymnwjnn2OvHN43xOuFb9cfxb91K+H9upX7pUoxMxutE kn+nY89tc5XbuyWswv6I/2qXxxUROSorECBZWYlZXQ01NVgNDQy0thKfMQNmzoTWSRAKeh3z6Pr7 8W/aROihh6j73e/w9+q9e5m6mxwUPLhf8gA/RyUvIjlghsMM1NSSqa+DxtEwZjTWmDHEm5pINzVB czOMGwfRqNdRjy+ZhHXriDzxJJWPPkxky1YMvXcvZz/P1cC5KPmHgUeAi3IwtoiUODMUIlVbS7yu FrOu3i7zpjEwpgmroYFEdRVmVZW9GE1trb3Dm1eftzmxaTPBP/6B6ueeI7RlC4FEwutE4q1HsHsz J3K1ufHPUMlLMTEMMlVVpCMVnk7A8qVTBHp6MFIpzzIA9u9HZSXpaBR7H6qRng9WwE86EMAMBEkH Am/+MZVRiFXZs9ir/v/27j24yvrO4/g7yckFCQJyEWpVUGwtIOCFKrNoW6t1trtr7TqLu7MXcei2 293V3te2s1vrTG291HopU1uXrbq2ympVugiuBVFuIhOQSxGNSEgEcjGAQEJySE7O2T++D4qCkoTz nO/zPOfzmvkNccY5zydn5uRznsvv96uG6kE2Ve2kYTBiBAweTLaygmx5OblUCioqbQGaikpIReQB uf7Ytg0eeZRRzy+hpLWVVDrtnUii4YEwXzzfD94dbhVwUVgvLpIPXaNH0/KVr8Cll1rBeBdILgfp NKx9mYEPPcjQlSsL+oT1vrFjabtuJrnLr4Ahgwv7fni/92FpaqLswQcZ9tSTVO5v03Q4OdxLwLQw DxBmyX8J+M+wXlzkeGQGDaLl6qvJ3vB1GDjAO87R5XLwh0WMuu02yht3hloOPYMH8/aMa+icNQuG FnhN9qTpyULbflKNTaSeeILBCxdQsWePdyqJpn8E5oR5gDBLvgR7WnByWAcQ6Y+uQYPYM2sW3bNm 2e5hEVdaU8Owm35A1da6UF6/Z9Ag9l47k46Z19oldOmfgwdhxw4qX3uNsqXLGLJ4EWUHDninkuja gE07D/XSTlj35MGCzwF+HuIxRPqmpIQDn/o03VdfHYuCB8hOmcLemTM56fY7qMjzFKtcaSn7pk6l 45oZKvj+6uigdP16BqxdS2rNGgZs+iPl7Sp3OaY5hFzwEG7Jg/0SXwXGh3wckV5JjxhB+rOXwvDh 3lF6r7yc7gsvIj15MhUrVuT1pXNVVRy48koYOTKvr5t42Ry8+SYsX8awlSspra+norGRUj0pL72z mZAv0x8SdsmngfuBu0M+jkivZMaMIfOxj0NpqXeUvhk9muzEc8itXJnX+dS5gdUw/eK8vV7iHTwI K1dywsKFnLhhAyV79pBqb/dOJfFzP9aPoQu75MF+mS+js3mJgqFDYVgM91CqqCA7cgS5qipKOjvz 9rLpj4y2aWxypByQy0JPDyW1tTD/aUY+PZ+KXbu8k0m8bcZ6sSAKUfKdwK+AewpwLJEPl0pBKqJL nB5DT3k52VSKfF6DOBj1leEKracH2too2bef1M5GSlatpPr55zmhrk7ryUu+/ArrxYIoRMmD/VKz gEkFOp7I0bUfgPb2+J29ZrOk9u+nLM8LqAxsaeFAJmNffopVZye0tJBqaqKi4U1KXtlE6caNDN66 1X9RIkmajVgfFkyhPtkHgfuCIeKnuQkad8LoUd5J+mb/fkobGvJeOqk9u6G+HsaNy+vrRlomA80t UF9Pqr6OgVvrKGl4k9SbDVQ1NVGSyXgnlOS6D+vDgink1/dfAjOBCwt4TJH3GNDQQHrdOjonToTK Su84vZaq20ZlTU3eX7eko5Oqp58m/bWvJXfFuZ6sfbF7fQup2teorq2lvLkZ3n6b0rf32LRELUIn 4VuN9WBBFfoa3S9QyYujsnSainnzSE+bRm7CBO84vdPWRuqpJ6lsaMj7S5d2dVG9aBHp6dPhggvy /vou9u2H2lp47VXKNm9m2KZNpPbutSfju7oo7eoq6FLBIoFfeBw0zBXvPsgi4LJCH1TkcLumTqXz 9p/CqJHRnU6Xy0F3N+Vz5jDqnnCfW22fNo293/8+uXHjovd+ZLP2XuRy9nM2ayWdyVDS1AJvvA5b tsCWLQyrraVqxw6tDy9Rsxi43OPAHiV/FfBUoQ8q8n57xp1F9w3X0zVhgm1ZWlUFpWX92nQtb7I5 6O6ys/ftOyh75LeMnD+/IIdumzSJjutm0TVpok01rKw8vi1cc7ngMnjuiJJ+Z/T02Mj0QE/G7pd3 d1PanaEs001pZxp274ZdrdDaCm+9BY2NVDc1UdXSQql2cpN4+CIwz+PAHiUP8D/ADI8DixwuW1HO vvPOh/Hjbd/yykrfe9M9Gdi7F+rqGFhTQ0Vra0EPnx0wgH3nToEJE23r16pK+v2tJ5e1Ly3ZrP2c 6YFMN3R12xeZrm5Id9rT7Z1p+7ejHdraqWhvp6qtjbI8L+Mr4uAx4Bqvg3uV/MXAMo8Di4iIFNAl wHKvg3vdfFsOzHY6toiISCHMxrHgwa/kwXana3Y8voiISFiaicAurJ4l/zpwr+PxRUREwnIv1nOu vOfK3Avkf4UPERERPzVE5CTWu+QPEJE3QkREJE/uxfrNnXfJA/wGeNw7hIiISB48jvVaJESh5AHu Bjq8Q4iIiByHDqzPIiMqJf8iEXtjRERE+uhurM8iIyolD3AXsM47hIiISD+sw3osUqJU8ruAn3mH EBER6YefYT0WKVEqebCHFR72DiEiItIHDxOhh+0OF7WSB/s21OQdQkREpBeaiPBV6CiW/HrgTu8Q IiIivXAn1luRFMWSB3vTFniHEBER+RALiPhJaVRLHuCnQLt3CBERkaNox3oq0qJc8i8Ad3iHEBER OYo7sJ6KtCiXPNibuNg7hIiIyGEWE5OT0KiXfCdwO1ryVkREoqED66VO7yC9UTb4xGHeGY6lDigH Pu2cQ0RE5Bbg194heisOJQ+wGjgfOMs7iIiIFK1ngBuAjHeQ3or65fpD0sBtwG7vICIiUpR2Yz2U 9g7SF3EpeYClwK3eIUREpCjdivVQrMTlcv0hLwJnAxO9g4iISNGYC3zLO0R/xOlM/pBbgVrvECIi UhRqifFV5DiW/AZi/IaLiEis3Ir1TizF7XL9IeuBwcA07yAiIpJYd2EP28VWXEse4GXgXOAM7yAi IpI4i4FvEPPF2OJ4uf6QVuDHQKN3EBERSZRGrF9avYMcrzifyQPUAweBzzvnEBGR5Pge8Jh3iHyI e8kD1ADDgU96BxERkdibDdzsHSJfklDyAOuAycCZ3kFERCS2FgHfxPaKT4Q435M/XDPwI2CbdxAR EYmlbViPNHsHyaeknMkDNABtwBe8g4iISOx8G5jnHSLfklTyYJfty4FLvIOIiEhs3ALc6R0iDEkr ebD17c8AzvEOIiIikfcIdhYfm+1j+yKJJZ8BNgNTgNOcs4iISHStwAo+UffhD5fEkgfYBezELtsP cc4iIiLR0wB8B1jtHSRMSS15gK3AfmyhnDLnLCIiEh3dWMH/zjtI2JJc8mAP4gF8xjWFiIhEyc3A Pd4hCiHpJQ+wDDgZmOodRERE3N0H3OgdolCKoeQB1gJjgfHeQURExM0TWMEnZkW7YymWkm8HaoEJ wOnOWUREpPCWA9/FntcqGsVS8gAtwHbgAmCEcxYRESmczdjOcqu8gxRaMZU8QB2wG5gOVDtnERGR 8DVjBT/fO4iHYit5gFeAA8BlQMo5i4iIhCeNFfxD3kG8FGPJA6wBerCiFxGRZPoP4G7vEJ6KteTB ljOsBC72DiIiInn3E2w+fFEr5pIHWIkte/tJ7yAiIpI3s4F/J6GbzvRFsZd8BqjBnrY/1zmLiIgc vwewgt/vHSQKir3kATqA9cAoYKJzFhER6b+52H34Ju8gUaGSN/uwp+4/CpztnEVERPpuHlbwRbXY zbGo5N+1C1sV7zTgLOcsIiLSewuBHwCbvINEjUr+vZqBN4AxwJm+UUREpBcWATdhe5TI+6jkj7QT WxlvDLapjYiIRNMS4IfAS845Ikslf3TbgXqs5Me4JhERkaN5ASv4Fb4xok0l/8EagqGiFxGJlqXY QjdLvYNEnUr+w9UHYwwqehGRKHgBK/gXfGPEg0r+2OqBbdg+9LpHLyLi59A9eJ3B95JKvncasLmX p6Kn7kVEPCxC9+D7TCXfe9uxefSnoHn0IiKFtBCbJqen6PtIJd83O4HN2BK4WhlPRCR887CFbjQP vh9U8n3XDGwAhqO17kVEwnRoLXqtZNdPKvn+2QWsAQaj3etERMLwAFqL/rip5PtvH7Yf/QloP3oR kXw6tB+8dpM7Tir549MBPA+UARc7ZxERSYKfoP3g80Ylf/wywHPAQWA6kPKNIyISS2ns8vzN2N9V yQOVfP6sAHYDFwDVzllEROKkGfgecLd3kKRRyefXGmAHMB4Y4ZxFRCQONmMF/5B3kCRSyeffK8Dr 2BK4pztnERGJsuVYwc/3DpJUKvlw1AEvY2fz452ziIhE0RPAd4FV3kGSTCUfnhZgGTAQmOqcRUQk Su4DbkRz4EOnkg9XO7AAyGJP3pf5xhERcdWNPT1/I/b3UUKmki+MZdi691OAIc5ZREQ8NADfAe7x DlJMVPKFsw57inQscJpzFhGRQlqBFfzvvIMUG5V8YW3FHjI5CTjHOYuISCE8AnwbWO0dpBip5Atv F7Y3cglwiXMWEZEw3YIVfLN3kGKlkveRAZYA24FJwFDfOCIiebUNK/c70RK1rlTyvtYF46PAmc5Z RETyYRHwTWCedxBRyUdBA/ahqEJb1opIvM3GCv4V7yBiVPLR0A48g92vnwIM8o0jItInjdjytDej +e+RopKPlhrs8v0pwBnOWUREemMx8A3gMe8gciSVfPTUA/+H7Us/zTeKiMiHugsreF2ejyiVfDR1 AM9i9+s/AQz3jSMi8h612OI2t2F/rySiVPLRth7binEIMNE5i4gIwFzg69iJiEScSj76WrAtGQ8A 5wMn+MYRkSK1G7gJ+Bb2d0liQCUfHy9iy0KeDJzlnEVEisszwA3Ao95BpG9U8vHSgJ3VZ7A59eW+ cUQk4TqwpWlvQHu/x5JKPn4ywFJsut1oNNVORMKxGLge+DVamja2VPLxVYdt29gFTAUqfOOISEK0 Y2fv12NP0UuMqeTj7dBZ/SpgBPAx3zgiEnMLsHJ/CJ29J4JKPhnqsT2b27F96rUsroj0RRO2JO31 2N8TSQiVfLKsAp4DBgKTnbOISDw8DPwr8JR3EMk/lXzyNGMf1q3AWOzhPBGR91sH/Bt2Bt/snEVC opJPro28O93ufDTdTkRMB3AH8C/AS85ZJGQq+WTrAJYALwAnAhNc04iIt8excn8IrTlfFEq9A0hB vAjMAP4em18vIsWlBvv8z8D+HkiR0Jl8cdnIu0/hTwCqfeOISMiagR8D/wysdc4iDlTyxacbWAHM B0qw5XFFJHlmA18Ffo997qUIqeSL125s04kl2JQ73a8XSYbHsHL/JfY5lyKme/KyHLgG+CK2VrWI xNNi7HN8Dfa5FlHJyzvmAZcD12Jb2opIPKzGPreXY59jkXfocr283wZgDtACnIbtXy8i0bMR+CHw T9jnVuQIKnn5IGuAB4BW4HRsAxwR8bcZ+BFW7rrqJh+q5NRTtHGZHNMA4MvBGO+cRaRYbQbuD0an cxaJCZW89EUV8KVgaAMckcI4dAttDpB2ziIxo5KX/igBZgXjIucsIkn1EvBfwcg5Z5GYUsnL8fpr 4Drgc95BRBLiD9jzMHO9g0j8qeQlX64AZmKlLyJ9Nxd4EHjWOYckiEpe8u1c4B+CcZJzFpGo2wP8 dzDWOWeRBFLJS1hGYrte/R0wxTmLSNSsB34DPAy85ZxFEkwlL4Xwl8DfBv+KFLMngd8G/4qETiUv hTQR+Bvsvv0ZzllECqUOu9/+KLDJOYsUGZW8eCjBin4GcJVzFpGwzMN2hJuLpsCJE5W8ePs48FfB mOScReR4bQQeD0atcxYRlbxEymXA1di9+5HOWUR66y3sHvsTaLtmiRiVvERRJbYv9lXAF7DldEWi JA38Hrsk/xRw0DeOyNGp5CXqhgNXBuMvgFLfOFLEssB84H+Dscs3jsixqeQlTk4G/hz4M+Dz2Bm/ SJgOAguBBcDTQItvHJG+UclLXA0F/jQYV6D97iV/WrGlZZ8Jxtu+cUT6TyUvSVCCFf3ngMux+fgi fbEJWIRtDvMsmvImCaGSlySaCHwWuDQY1b5xJILagSXBeA4tUiMJpZKXpCsHPgN8Khh/4htHHK0E lgbjeaDbN45I+FTyUmyGARcD07HCv8g3joToJazYVwDLgd2+cUQKTyUvxW4IMC0YFwZjsGsi6Y99 wOpgrArGXtdEIhGgkhc50nnAVOD8YJznG0eO4mVgbTBqgv8WkfdRyYsc2wnAucDkYEwCzgEGeoYq EgeAP2Jrwm8IxjqgwzOUSFyo5EX67xPYk/zjg5/Pxjbc0TK8fZfGNnR5DXgV2Iw98f6qZyiRuEt5 BxCJsVc5egmdFYxxwTgDGBuMAQVLFz2dwLZg1AFvBGNLMEQkz1TyIvn3YaX1EeB04NRgnBKM0cE4 GRhUgIz51oYt+doUjJ3B2B6MBqDRLZ1IkdLlepHoqcaW6R2BTfkbBpyEzQQYApwYjOpgDMSuEAzA 1vOvxNYHKAfKglESjFwweoLRHYyDwegMxgFswZh2YH8w9gZjDzYdbTe2BGxr8P+JSMT8P87mFGrL tt1vAAAAAElFTkSuQmCC "
             preserveAspectRatio="none"
             height="100.1517"
             width="100.2784" />
          <text
             xml:space="preserve"
             style="font-style:normal;font-weight:normal;font-size:40px;line-height:1.25;font-family:sans-serif;letter-spacing:0px;word-spacing:0px;fill:#ffffff;fill-opacity:1;stroke:none"
             x="33.613678"
             y="81.949493"
             id="text12487"><tspan
               sodipodi:role="line"
               id="tspan12485"
               x="33.613678"
               y="117.34012" /></text>
          <text
             xml:space="preserve"
             style="font-style:normal;font-weight:normal;font-size:40px;line-height:1.25;font-family:sans-serif;letter-spacing:0px;word-spacing:0px;fill:#000000;fill-opacity:1;stroke:none"
             x="22.227837"
             y="87.601349"
             id="text12491"><tspan
               sodipodi:role="line"
               x="22.227837"
               y="87.601349"
               style="font-size:9.33333302px;line-height:0;fill:#ffffff"
               id="tspan12501">Druid Query</tspan></text>
        </g>
        <g
           transform="translate(14.272546,12.789495)"
           inkscape:label="PLACE LOGO HERE"
           id="layer2-9" />
      </g>
    </g>
  </g>
  <g
     inkscape:groupmode="layer"
     id="layer2"
     inkscape:label="PLACE LOGO HERE" />
</svg>
