(footprint "SOD-523F_0P9X1P3_ONS" (version 20211014) (generator pcbnew)
  (layer "F.Cu")
  (tags "MM5Z2V4 ")
  (attr smd)
  (fp_text reference "REF**" (at 0 0 unlocked) (layer F.SilkS)
    (effects (font (size 1 1) (thickness 0.15)))
  )
  (fp_text value SOD-523F_0P9X1P3_ONS (at 0 0 unlocked) (layer F.Fab)
    (effects (font (size 1 1) (thickness 0.15)))
  )
  (fp_text user "${REFERENCE}" (at 0 0 unlocked) (layer F.Fab)
    (effects (font (size 1 1) (thickness 0.15)))
  )
  (fp_text user "*" (at -1.3319 0) (layer F.SilkS)
    (effects (font (size 1 1) (thickness 0.15)))
  )
  (fp_text user "*" (at -0.3937 0) (layer F.Fab)
    (effects (font (size 1 1) (thickness 0.15)))
  )
  (fp_line (start -0.6477 0.1778) (end -0.6477 -0.1778) (layer "F.Fab") (width 0.0254))
  (fp_line (start -0.6477 -0.1778) (end -0.8509 -0.1778) (layer "F.Fab") (width 0.0254))
  (fp_line (start -0.8509 -0.1778) (end -0.8509 0.1778) (layer "F.Fab") (width 0.0254))
  (fp_line (start -0.8509 0.1778) (end -0.6477 0.1778) (layer "F.Fab") (width 0.0254))
  (fp_line (start 0.6477 -0.1778) (end 0.6477 0.1778) (layer "F.Fab") (width 0.0254))
  (fp_line (start 0.6477 0.1778) (end 0.8509 0.1778) (layer "F.Fab") (width 0.0254))
  (fp_line (start 0.8509 0.1778) (end 0.8509 -0.1778) (layer "F.Fab") (width 0.0254))
  (fp_line (start 0.8509 -0.1778) (end 0.6477 -0.1778) (layer "F.Fab") (width 0.0254))
  (zone (net 0) (net_name "") (layer "F.Cu") (hatch full 0.508)
    (connect_pads (clearance 0))
    (min_thickness 0.254)
    (keepout (tracks not_allowed) (vias not_allowed) (pads allowed ) (copperpour not_allowed) (footprints allowed))
    (fill (thermal_gap 0.508) (thermal_bridge_width 0.508))
    (polygon
      (pts
        (xy -0.5969 -0.3937)
        (xy 0.5969 -0.3937)
        (xy 0.5969 0.3937)
        (xy -0.5969 0.3937)
      )
    )
  )
  (fp_line (start -1.0525 0.2544) (end -1.0525 -0.2544) (layer "F.CrtYd") (width 0.1524))
  (fp_line (start -1.0525 -0.2544) (end -0.7493 -0.2544) (layer "F.CrtYd") (width 0.1524))
  (fp_line (start 0.7493 -0.2544) (end 1.0525 -0.2544) (layer "F.CrtYd") (width 0.1524))
  (fp_line (start 1.0525 -0.2544) (end 1.0525 0.2544) (layer "F.CrtYd") (width 0.1524))
  (fp_line (start 1.0525 0.2544) (end 0.7493 0.2544) (layer "F.CrtYd") (width 0.1524))
  (fp_line (start -0.7493 0.2544) (end -1.0525 0.2544) (layer "F.CrtYd") (width 0.1524))
  (fp_line (start -0.7493 0.5461) (end -0.7493 0.2544) (layer "F.CrtYd") (width 0.1524))
  (fp_line (start -0.7493 -0.2544) (end -0.7493 -0.5461) (layer "F.CrtYd") (width 0.1524))
  (fp_line (start -0.7493 -0.5461) (end 0.7493 -0.5461) (layer "F.CrtYd") (width 0.1524))
  (fp_line (start 0.7493 -0.5461) (end 0.7493 -0.2544) (layer "F.CrtYd") (width 0.1524))
  (fp_line (start 0.7493 0.2544) (end 0.7493 0.5461) (layer "F.CrtYd") (width 0.1524))
  (fp_line (start 0.7493 0.5461) (end -0.7493 0.5461) (layer "F.CrtYd") (width 0.1524))
  (fp_text user "*" (at -0.3937 0 unlocked) (layer "F.Fab")
    (effects (font (size 1 1) (thickness 0.15)))
  )
  (fp_text user "*" (at -1.3319 0 unlocked) (layer "F.SilkS")
    (effects (font (size 1 1) (thickness 0.15)))
  )
  (fp_line (start -0.6477 -0.22225) (end -0.42545 -0.4445) (layer "F.Fab") (width 0.0254))
  (fp_line (start -0.6477 0.22225) (end -0.42545 0.4445) (layer "F.Fab") (width 0.0254))
  (fp_line (start -0.7747 0.5715) (end 0.7747 0.5715) (layer "F.SilkS") (width 0.1524))
  (fp_line (start 0.7747 -0.5715) (end -0.7747 -0.5715) (layer "F.SilkS") (width 0.1524))
  (fp_line (start -0.6477 0.4445) (end 0.6477 0.4445) (layer "F.Fab") (width 0.0254))
  (fp_line (start 0.6477 0.4445) (end 0.6477 -0.4445) (layer "F.Fab") (width 0.0254))
  (fp_line (start 0.6477 -0.4445) (end -0.6477 -0.4445) (layer "F.Fab") (width 0.0254))
  (fp_line (start -0.6477 -0.4445) (end -0.6477 0.4445) (layer "F.Fab") (width 0.0254))
  (pad "1" smd rect (at -0.7993 0) (size 0.3032 0.3056) (layers "F.Cu" "F.Paste" "F.Mask"))
  (pad "2" smd rect (at 0.7993 0) (size 0.3032 0.3056) (layers "F.Cu" "F.Paste" "F.Mask"))
)
