%YAML 1.1
%TAG !u! tag:unity3d.com,2011:
--- !u!181963792 &2655988077585873504
Preset:
  m_ObjectHideFlags: 0
  m_CorrespondingSourceObject: {fileID: 0}
  m_PrefabInstance: {fileID: 0}
  m_PrefabAsset: {fileID: 0}
  m_Name: MushroomBoxCollider
  m_TargetType:
    m_NativeTypeID: 65
    m_ManagedTypePPtr: {fileID: 0}
    m_ManagedTypeFallback: 
  m_Properties:
  - target: {fileID: 0}
    propertyPath: m_Material
    value: 
    objectReference: {fileID: 0}
  - target: {fileID: 0}
    propertyPath: m_IsTrigger
    value: 1
    objectReference: {fileID: 0}
  - target: {fileID: 0}
    propertyPath: m_Enabled
    value: 1
    objectReference: {fileID: 0}
  - target: {fileID: 0}
    propertyPath: m_Size.x
    value: 0.9903259
    objectReference: {fileID: 0}
  - target: {fileID: 0}
    propertyPath: m_Size.y
    value: 0.314926
    objectReference: {fileID: 0}
  - target: {fileID: 0}
    propertyPath: m_Size.z
    value: 0.8725891
    objectReference: {fileID: 0}
  - target: {fileID: 0}
    propertyPath: m_Center.x
    value: -0.07796097
    objectReference: {fileID: 0}
  - target: {fileID: 0}
    propertyPath: m_Center.y
    value: 0.13511874
    objectReference: {fileID: 0}
  - target: {fileID: 0}
    propertyPath: m_Center.z
    value: 0.07183838
    objectReference: {fileID: 0}
  m_ExcludedProperties: []
