{{About||the islands of the sovereign state|Saint Vincent (Antilles)|and|Grenadines}}
{{Other uses|Saint Vincent (disambiguation)|Grenadine (disambiguation)}}
{{pp-move-indef}}
{{short description|Island state in the Windward Islands in the Caribbean}}
{{EngvarB|date=October 2015}}
{{Use dmy dates|date=April 2013}}
{{Coord|13|15|N|61|12|W|display=title}}
{{Infobox country
| religion                = {{ublist |item_style=white-space:nowrap;
  |82.1% [[Christianity]]
  |7.5% [[Irreligion|No religion]]
  |1.1% [[Rastafarianism]]
  |4.6% Others
  |4.7% Unspecified
  }}
| religion_year                = 2012
| religion_ref                =  <ref>{{cite web | url=https://www.indexmundi.com/saint_vincent_and_the_grenadines/demographics_profile.html | title=Saint Vincent and the Grenadines Demographics Profile | publisher=Index Mundi | access-date=12 December 2020 }}</ref>
| languages_type                = [[Vernacular language]]
| languages                = [[Vincentian Creole]]
| conventional_long_name                = Saint Vincent and the Grenadines
| common_name                = Saint Vincent and the Grenadines
| image_flag                = Flag of Saint Vincent and the Grenadines.svg
| image_coat                = Coat of arms of Saint Vincent and the Grenadines.svg
| symbol                = Coat of arms of Saint Vincent and the Grenadines
| symbol_type                = Seal
| image_map                = Saint Vincent and the Grenadines on the globe (Americas centered).svg
| image_map2                = 
| national_motto                = {{native phrase|la|"Pax et Justitia"|italics=off}}<br/>{{small|"Peace and Justice"}}
| national_anthem                = "[[Saint Vincent, Land so Beautiful]]"<br /><div style="display:inline-block;margin-top:0.4em;">{{center|[[File:National anthem of Saint Vincent and the Grenadines, performed by the United States Navy Band.oga]]}}</div>
| royal_anthem                   = "[[God Save the Queen]]"<br /><div style="display:inline-block;margin-top:0.4em;">{{center|[[File:United States Navy Band - God Save the Queen.ogg]]}}</div>
| official_languages                = [[English language|English]]
| ethnic_groups                = {{unbulleted list
  | 66% [[Afro-Vincentian|Black (African)]]
  | 19% [[Multiracial|Mixed]]
  | 6.0% [[Indo-Vincentian|Indian]]
  | 4% [[White Caribbeans|European]]
  | {{nowrap|2% [[Island Caribs|Island]] and [[Black Carib]]s}}
  | 3% Others
 }}
| demonym                = [[Demographics of Saint Vincent and the Grenadines|Saint Vincentian or Vincentian]]<br>Vincy {{small|(colloquial)}}
| capital                = [[Kingstown]]
| coordinates                = {{Coord|13|10|N|61|14|W|type:city}}
| largest_city                = capital
| government_type                = [[Unitary state|Unitary]] [[Parliamentary system|parliamentary]] [[constitutional monarchy]]
| leader_title1                = [[Monarchy of Saint Vincent and the Grenadines|Monarch]]
| leader_name1                = [[Elizabeth II]]
| leader_title2                = {{nowrap|[[Governor-General of Saint Vincent and the Grenadines|Governor-General]]}}
| leader_name2                = [[Susan Dougan]]
| leader_title3                = [[List of Prime Ministers of Saint Vincent and the Grenadines|Prime Minister]]
| leader_name3                = [[Ralph Gonsalves]]
| legislature                = [[House of Assembly of Saint Vincent and the Grenadines|House of Assembly]]
| sovereignty_type                = [[Independence]]
| established_event1                = [[Associated Statehood Act 1967|Associated State]]
| established_date1                = 27 October 1969
| established_event2                = from the [[United Kingdom]]
| established_date2                = 27 October 1979
| area_rank                = 184th
| area_magnitude                = 
| area_km2                = 389
| area_sq_mi                = 
| percent_water                = negligible
| population_estimate                = {{UN_Population|Saint Vincent and the Grenadines}}{{UN_Population|ref}}
| population_estimate_rank                = 179th
| population_estimate_year                = {{UN_Population|Year}}
| population_census                = 109,991
| population_census_year                = 2011
| population_density_km2                = 307
| population_density_sq_mi                = 792
| population_density_rank                = 39th
| GDP_PPP                = $1.373 billion
| GDP_PPP_year                = 2019
| GDP_PPP_per_capita                = $12,431<ref name="IMF">[https://www.imf.org/external/pubs/ft/weo/2019/01/weodata/weorept.aspx?pr.x=71&pr.y=15&sy=2017&ey=2024&scsm=1&ssd=1&sort=country&ds=.&br=1&c=364&s=NGDPD%2CPPPGDP%2CNGDPDPC%2CPPPPC&grp=0&a= Report on St. Vincent and the Grenadines], International Monetary Fund.</ref>
| GDP_nominal                = $864 million
| GDP_nominal_year                = 2019
| GDP_nominal_per_capita                = $7,827<ref name="IMF" />
| Gini_year                = 
| Gini_change                = <!--increase/decrease/steady-->
| Gini                = <!--number only-->
| Gini_ref                = 
| Gini_rank                = 
| HDI_year                = 2019<!-- Please use the year to which the data refers, not the publication year-->
| HDI_change                = increase <!--increase/decrease/steady-->
| HDI                = 0.738<!--number only-->
| HDI_ref                = <ref name="UNHDR">{{cite book|title=Human Development Report 2020 The Next Frontier: Human Development and the Anthropocene|date=15 December 2020|publisher=United Nations Development Programme|isbn=978-92-1-126442-5|pages=343-346|url=http://hdr.undp.org/sites/default/files/hdr2020.pdf|access-date=16 December 2020}}</ref>
| HDI_rank                = 97th
| currency                = [[East Caribbean dollar]]
| currency_code                = XCD
| time_zone                = [[Atlantic Standard Time|AST]]
| utc_offset                = -4
| time_zone_DST                = 
| utc_offset_DST                = 
| drives_on                = [[Right- and left-hand traffic|left]]
| calling_code                = [[Area code 784|+1 784]]
| cctld                = [[.vc]]
| today                = 
}}

'''Saint Vincent and the Grenadines''' ({{IPAc-en|audio=En-us-Saint Vincent and the Grenadines.ogg|ˌ|ɡ|r|ɛ|n|ə|ˈ|d|iː|n|z}}), also frequently [[Pars pro toto#Geography|known simply as]] '''Saint Vincent''', is an island country in the Caribbean. It's located in the southeast [[Windward Islands]] of the  [[Lesser Antilles]], which lies in the [[West Indies]] at the southern end of the eastern border of the [[Caribbean Sea]] where the latter meets the Atlantic Ocean.

Its {{convert|369|km2|abbr=on}} territory consists of the main island of [[Saint Vincent (Antilles)|Saint Vincent]] and the northern two-thirds of the [[Grenadines]], a chain of 32 smaller islands. Some of the Grenadines are inhabited&nbsp;— [[Bequia]], [[Mustique]], [[Union Island]], [[Canouan]], [[Petit Saint Vincent]], [[Palm Island, Grenadines|Palm Island]], [[Mayreau]], [[Young Island (Grenadines)|Young Island]]&nbsp;— while others are not: [[Tobago Cays]], [[Baliceaux]], [[Battowia]], [[Quatre]], [[Petite Mustique]], [[Savan (island)|Savan]] and [[Petit Nevis]]. Most of Saint Vincent and the Grenadines lies within the [[Hurricane Alley]].

To the north of Saint Vincent lies [[Saint Lucia]], to the east is [[Barbados]], and [[Grenada]] lies to the south. Saint Vincent and the Grenadines is a densely populated country for its size (over 300 inhabitants/km<sup>2</sup>) with approximately {{UN_Population|Saint Vincent and the Grenadines}} inhabitants.{{UN_Population|ref}}

[[Kingstown]] is the capital and main port. Saint Vincent has a [[British Empire|British colonial]] history, and is now part of the [[Organisation of Eastern Caribbean States]], [[Caribbean Community|CARICOM]], the [[Commonwealth of Nations]], the [[Bolivarian Alliance for the Americas]] and the [[Community of Latin American and Caribbean States]] (CELAC).

==Etymology==
[[Christopher Columbus]], the first European to reach the island, named it after [[St. Vincent of Saragossa]], whose feast day it was on the day Columbus first saw it (22 January 1498). The name of the Grenadines refers to the Spanish city of [[Granada]], but to differentiate it from the island of the same name, the diminutive was used. Before the arrival of the Spaniards, the Carib natives who inhabited the island of St. Vincent called it Youloumain, in honour of Youlouca, the spirit of the rainbows, who they believed inhabited the island.<ref name="CIA World Factbook – St Vincent">{{cite web |url=https://www.cia.gov/the-world-factbook/countries/saint-vincent-and-the-grenadines/ |title=CIA World Factbook – St Vincent |access-date= 7 July 2019}}</ref><ref name="thecommonwealth.org">{{cite web |url=http://thecommonwealth.org/our-member-countries/st-vincent-and-grenadines/history |title=The Commonwealth – St Vincent and the Grenadines |access-date= 7 July 2019}}</ref>

==History==
{{Main|History of Saint Vincent and the Grenadines|French West Indies|British West Indies}}

===Pre-colonial period===
Before the arrival of Europeans and Africans in the 16th century, various [[Amerindian]] groups passed through or settled on [[St. Vincent and the Grenadines]], including the [[Ciboney]], [[Arawaks|Arawak]], and [[Island Caribs|Carib]] people.<ref>{{cite web |url=http://thecommonwealth.org/our-member-countries/st-vincent-and-grenadines/history |title=The Commonwealth – St Vincent and the Grenadines |access-date= 7 July 2019}}</ref><ref>[http://indigenousreview.blogspot.com.au/#stash.9WFLBXgH.dpuf Yurumein (Homeland): A Documentary on Caribs in St. Vincent]</ref> The island now known as Saint Vincent was originally named [[Youloumain]]<ref>{{Cite book |title=Historic Account of Saint Vincent, the Carib Youroumayn, the island of the Karaÿbes |author=Frere. Adrien Le Breton SJ. (1662–1736) |publisher=Museum of Natural History, Fonds Jussieu |location=Paris}}</ref> by the native [[Island Caribs]] who called themselves Kalina/Carina ("l" and "r" being pronounced the same in their language).{{Citation needed|date=July 2019}}

=== European arrival and early colonial period ===
It is thought that [[Christopher Columbus]] sighted the island in 1498, giving it the name St Vincent.<ref name="CIA World Factbook – St Vincent"/> The indigenous [[Garifuna]] people, who became known as the "Black Caribs", aggressively prevented European settlement on Saint Vincent.<ref name="britannica.com">{{cite web |url=https://www.britannica.com/place/Saint-Vincent-and-the-Grenadines |author=David Lawrence Niddrie, Richard Tolson, Adrian Fraser| work=Encyclopædia Britannica |title= Saint Vincent and the Grenadines |date= 21 October 2019|access-date= 7 July 2019}}</ref><ref name="thecommonwealth.org"/>

=== French and British colonisation and the First Carib War ===
Various attempts by the English and Dutch to claim the island proved unsuccessful, and it was the French who were first able to colonise the island, settling in the town of [[Barrouallie]] on the leeward side of St Vincent in 1719.<ref name="britannica.com"/> The French brought with them enslaved African prisoners of war to work the plantations of sugar, coffee, indigo, tobacco, cotton and cocoa.<ref>{{cite web |url=http://svgancestry.com/index.php/st-vincent-timeline/ |title=St Vincent Genealogy Resources |website=svgancestry.com |archive-url=https://web.archive.org/web/20120321165131/http://svgancestry.com/index.php/st-vincent-timeline |archive-date=21 March 2012}}</ref>

[[File:SaintVincent Carib Treaty Negotiation 1773.jpg|thumb|upright|Depiction of the 1773 treaty negotiations between the British and the [[Black Carib]]s]]
The British captured the island and drove out the French from Barrouallie during the [[Seven Years' War]], a claim confirmed with the [[Treaty of Paris (1763)]].<ref name="britannica.com"/> On taking control of the island in 1763, the British laid the foundations of [[Fort Charlotte, Saint Vincent|Fort Charlotte]] and also brought with them enslaved African prisoners of war to work on the island plantations. The Black Caribs however, opposed to the British presence, went into open conflict against the British, starting the [[First Carib War]] which lasted from 1772 to 1773.<ref name="britannica.com"/>

During the [[Anglo-French War (1778–1783)]] the French [[French capture of Saint Vincent|recaptured St Vincent]] in 1779.  However, the British regained control under the [[Treaty of Versailles (1783)]].<ref name="britannica.com"/><ref name="thecommonwealth.org"/>

=== British colonial period and the Second Carib War ===
{{Main|British Windward Islands}}
The uneasy peace between the British and the Black Caribs led to the [[Second Carib War]], which lasted from 1795 to 1796.<ref name="britannica.com"/> The Black Caribs were led by [[Garifuna]] Paramount Chief [[Joseph Chatoyer]] and they were supported by the French, notably the radical [[Victor Hugues]] from the island of [[Martinique]]. Their revolt and uprising was eventually put to an end in 1797 by British General Sir [[Ralph Abercromby]]; a peace treaty agreement was made which resulted in almost 5,000 Black Caribs being exiled to [[Roatán]], an island off the coast of [[Honduras]], and to [[Belize]] and [[Baliceaux]] in the Grenadines.<ref name="thecommonwealth.org"/>
 
In 1806 the building of Fort Charlotte was completed.{{citation needed|date=July 2019}}

The volcano [[La Soufrière (volcano)|La Soufrière]] erupted in 1812, resulting in considerable destruction<ref name="Pyle, David">{{cite web |url=https://blogs.egu.eu/network/volcanicdegassing/2014/01/20/a-volcanic-retrospective-eruptions-of-the-soufriere-st-vincent/ |title=A volcanic retrospective: eruptions of the Soufrière, St Vincent|author=Pyle, David |access-date= 7 July 2019}}</ref><ref name="thecommonwealth.org"/>

[[File:Flag of Saint Vincent and the Grenadines (1907-1979).svg|thumb|Colonial flag (to 1979)]]

The British [[abolitionism in the United Kingdom|abolished]] slavery in Saint Vincent (as well as in the other [[British West Indies]] colonies) in 1834, and an apprenticeship period followed which ended in 1838.<ref name="thecommonwealth.org"/><ref name="britannica.com"/> After its end, labour shortages on the plantations resulted, and this was initially addressed by the immigration of indentured servants; in the late 1840s many Portuguese immigrants arrived from [[Madeira]] and between 1861 and 1888 shiploads of Indian labourers arrived.<ref name="britannica.com"/> Conditions remained harsh for both former slaves and immigrant agricultural workers, as depressed world sugar prices kept the economy stagnant until the turn of the century. The economy then went into a period of decline with many landowners abandoning their estates and leaving the land to be cultivated by liberated slaves.{{citation needed|date=October 2019}}

The [[Opobo]] king [[Jaja of Opobo|Jaja]] of [[Nigeria]] was exiled to {{nowrap|St. Vincent}} after his 1887 arrest by the British for shipping cargoes of [[palm oil]] directly to [[Liverpool]] without the intermediation of the [[National African Company]].{{citation needed|date=October 2019}}

===20th century===
{{Main|West Indies Federation}}
[[File:Baking bread in the West Indies.png|thumb|Residents of Saint Vincent making [[Tapioca#Flatbreads|''casabe'']] (casava bread) in the 1910s]]
In 1902, the volcano [[Soufrière (volcano)|La Soufrière]] erupted, killing 1,500–2,000 people; much farmland was damaged, and the economy deteriorated.<ref name="thecommonwealth.org"/><ref name="britannica.com"/><ref name="Pyle, David"/>

Saint Vincent and the Grenadines passed through various stages of colonial status under the British. A representative assembly was authorised in 1776, Crown Colony government was installed in 1877, a [[legislative council]] was created in 1925 with a limited franchise,<ref name="britannica.com"/> and [[Universal suffrage|universal adult suffrage]] was granted in 1951.<ref name="britannica.com"/> During the period of its control of Saint Vincent and the Grenadines, Britain made several attempts to unify the island with other Windward Islands as a single entity, with the aim of simplifying British control in that sub-region through a single unified administration.<ref name="britannica.com"/> In the 1960s, the British again tried to unify all of its regional islands including Saint Vincent into one united single entity under British control, unified politically. The unification was to be called the [[West Indies Federation]] and was driven by a desire to gain independence from British government.  However, the attempt collapsed in 1962.<ref name="britannica.com"/>

Saint Vincent was granted "associate statehood" status by Britain on 27 October 1969.<ref name="britannica.com"/>  This gave Saint Vincent complete control over its own internal affairs but was short of full independence in law.{{citation needed|date=October 2019}}

In April 1979 La Soufrière erupted again. Although no one was killed, thousands were evacuated and again there was extensive agricultural damage.<ref name="Pyle, David"/>

On 27 October 1979 Saint Vincent and the Grenadines became the last of the Windward Islands to gain full independence,<ref name="britannica.com"/><ref name="thecommonwealth.org"/> and this date is now the country's [[List of national independence days|Independence Day]], a [[Public holidays in Saint Vincent and the Grenadines|public holiday]].<ref name="CIA World Factbook – St Vincent"/> The country opted to remain within the [[British Commonwealth]], retaining Queen Elizabeth as [[Monarchy of Saint Vincent and the Grenadines|Monarch]], represented locally by a [[Governor-General of Saint Vincent and the Grenadines|Governor-General]].<ref>{{Cite web|last=corporateName=Commonwealth Parliament; address=Parliament House|first=Canberra|title=Sir David Smith &quot;An Australian Head of State: An Historical and Contemporary Perspective [1]&quot;|url=https://www.aph.gov.au/About_Parliament/Senate/Powers_practice_n_procedures/~/~/link.aspx?_id=D704CA6CD1B549AF8654FDCFBA383150&_z=z|access-date=2020-08-12|website=www.aph.gov.au|language=en-AU}}</ref>

===Post-independence era===
[[File:Sir James Mitchell SVG.png|thumb|right|James Fitz-Allen Mitchell, the Vincentian prime minister from 1984 to 2000]]
[[Milton Cato]] of the centre-left [[Saint Vincent Labour Party]] (SVLP) was the country's first Prime Minister (he had been Premier since 1974), ruling until he was defeated in the [[1984 Vincentian general election]] by [[James Fitz-Allen Mitchell]] of the centre-right [[New Democratic Party (Saint Vincent and the Grenadines)|New Democratic Party]] (NDP).<ref name="britannica.com"/> During Cato's time in office there was a brief rebellion on [[Union Island]] in December 1979 led by [[Lennox 'Bumba' Charles]]; apparently inspired by the recent revolution on Grenada, Charles alleged neglect of Union by the central government.  However, the revolt was swiftly put down and Charles arrested.<ref>{{cite web |url=https://www.nytimes.com/1979/12/09/archives/st-vincent-surppresses-shortlived-rebellion-on-isle-in-grenadines.html |title=St. Vincent Suppresses Short‐Lived Rebellion On Isle in Grenadines |access-date= 7 July 2019}}</ref><ref>{{cite web |url=https://searchlight.vc/searchlight/our-readers-opinions/2005/12/09/union-remembers-december-7-uprising/ |title=Union remembers December 7 uprising |access-date= 7 July 2019}}</ref> There were also a series of strikes in the early 1980s.<ref name="thecommonwealth.org"/> James Mitchell remained Prime Minister for 16 years until 2000, winning three consecutive [[Elections in Saint Vincent and the Grenadines|elections]].<ref name="britannica.com"/> Mitchell was at the forefront of attempts to improve regional integration.<ref name="thecommonwealth.org"/> In [[Hurricane Allen|1980]] and 1987 hurricanes damaged many banana and coconut plantations. Hurricane seasons were also very active in 1998 and 1999, with [[Hurricane Lenny]] in 1999 causing extensive damage to the west coast of the island.

In 2000 [[Arnhim Eustace]] became Prime Minister after taking over the leadership of the NDP following Mitchell's retirement; he was [[2001 Vincentian general election|defeated]] a year later by [[Ralph Gonsalves]] of the [[Unity Labour Party]] (the successor party to the SVLP).<ref name="caribbeanelections2001">{{cite web|url=http://www.caribbeanelections.com/svg/past/results_2001.asp |title=Archived copy |access-date=2011-09-12 |url-status=dead |archive-url=https://web.archive.org/web/20111006195247/http://www.caribbeanelections.com/svg/past/results_2001.asp |archive-date=2011-10-06 }}</ref><ref name="britannica.com"/> Gonsalves—a left-winger known in the country as "Comrade Ralph"<ref name=BBCLeaders>[https://www.bbc.com/news/world-latin-america-20006737 St Vincent and the Grenadines profile – Leaders], BBC News (27 November 2014).</ref><ref>Ralph E. Gonsalves, ''The Making of "The Comrade": The Political Journey of Ralph Gonsalves: an Autobiographical Sketch of a Caribbean Prime Minister'' (SFI Books, 2010).</ref>—has argued that European nations owe Caribbean nations [[Reparations for slavery|reparations]] for their role in the Atlantic slave trade.<ref>{{cite web |url=https://www.reuters.com/article/us-caribbean-slavery/caribbean-nations-consider-push-for-slavery-reparations-idUSBREA2525520140306 |title=Caribbean nations consider push for slavery reparations |access-date= 7 July 2019}}</ref> Gonsalves won a second term in 2005,<ref name=BBCLeaders/> a third term in 2010,<ref name=BBCLeaders/> and a fourth term in 2015.<ref>[https://www.bbc.com/news/world-latin-america-20006734 St Vincent and the Grenadines country profile], BBC News (31 May 2018).</ref>

In 2009, [[Vincentian constitutional referendum, 2009|a referendum was held on a proposal to adopt a new constitution]] that would make the country a [[republic]], replacing Queen [[Elizabeth II]] as head of state with a non-executive President, a proposal supported by Prime Minister Gonsalves. A two-thirds majority was required, and it was defeated by 29,019 votes (55.64 per cent) to 22,493 (43.13 per cent).<ref name="antillean">{{cite web |url=http://www.antillean.org/2009/11/26/constitutional-reform-referendum-defeated-in-st-vincent-the-grenadines/ |title=Constitutional reform referendum defeated in St Vincent & the Grenadines |website=Antillean |date=26 November 2009 |access-date=16 December 2011 |archive-url=https://web.archive.org/web/20100218004358/http://www.antillean.org/2009/11/26/constitutional-reform-referendum-defeated-in-st-vincent-the-grenadines/ |archive-date=18 February 2010}}</ref><ref name="britannica.com"/>

==Geography==
{{Main|Geography of Saint Vincent and the Grenadines}}
[[File:Saint Vincent and the Grenadines.svg|thumb|A map of [[Saint Vincent Island|Saint Vincent]] and the [[Grenadines]]]]

Saint Vincent and the Grenadines lies to the west of [[Barbados]], south of [[Saint Lucia]] and north of [[Grenada]] in the [[Windward Islands]] of the [[Lesser Antilles]], an [[island arc]] of the [[Caribbean Sea]]. The islands of Saint Vincent and the Grenadines include the main island of [[Saint Vincent (island)|Saint Vincent]] {{convert|344|km2|sqmi|abbr=on}} and the northern two-thirds of the [[Grenadines]] {{convert|45|km2|sqmi|abbr=on}}, which are a chain of smaller islands stretching south from Saint Vincent to Grenada. There are 32 islands and cays that make up St Vincent and the Grenadines (SVG). Nine are inhabited, including the mainland St Vincent and the Grenadines islands: Young Island, [[Bequia]], [[Mustique]], [[Canouan]], [[Union Island]], [[Mayreau]], Petit St Vincent and Palm Island. Prominent uninhabited islands of the Grenadines include [[Petit Nevis]], used by [[Whaling|whalers]], and [[Petite Mustique|Petit Mustique]], which was the centre of a prominent real-estate scam in the early 2000s.<ref>{{Cite web|url=https://www.lecho.be/economie-politique/belgique/economie/l-enfer-d-une-societe-belge-au-paradis-terrestre/10057158.html|title=L'enfer d'une société belge au paradis terrestre|last=Balboni|first=Julien|date=2018-10-10|website=L'Echo|language=fr|url-status=live|archive-url=https://web.archive.org/web/20190108145529/https://www.lecho.be/economie-politique/belgique/economie/l-enfer-d-une-societe-belge-au-paradis-terrestre/10057158.html|archive-date=2019-01-08|access-date=2019-12-11}}</ref>

The capital of Saint Vincent and the Grenadines is [[Kingstown]], Saint Vincent.<ref name="CIA World Factbook – St Vincent"/> The main island of Saint Vincent measures {{convert|26|km|abbr=on}} long, {{convert|15|km|abbr=on}} in width and {{convert|344|km2|abbr=on}} in area. From the most northern to the most southern points, the Grenadine islands belonging to Saint Vincent span {{convert|60.4|km|abbr=on}}, with a combined area of {{convert|45|km2|abbr=on}}.{{citation needed|date=October 2019}}

The island of Saint Vincent is volcanic and heavily forested, and includes little level ground.<ref name="CIA World Factbook – St Vincent"/> The windward side of the island is very rocky and steep, while the leeward side has more sandy beaches and bays.{{Citation needed|date=June 2011}} Saint Vincent's highest peak is [[Soufrière (volcano)|La Soufrière]] volcano at {{convert|1234|m|ft|abbr=on}}.<ref name="CIA World Factbook – St Vincent"/> Other major mountains on St Vincent are (from north to south) [[Richmond Peak, St Vincent|Richmond Peak]], [[Mount Brisbane]], [[Colonarie Mountain]], [[Grand Bonhomme]], [[Petit Bonhomme, St Vincent|Petit Bonhomme]] and [[Mount St Andrew]].{{citation needed|date=October 2019}}

The country is home to three terrestrial ecoregions: Windward Islands moist forests, Leeward Islands dry forests, and Windward Islands dry forests.<ref name="DinersteinOlson2017">{{cite journal|last1=Dinerstein|first1=Eric|last2=Olson|first2=David|last3=Joshi|first3=Anup|last4=Vynne|first4=Carly|last5=Burgess|first5=Neil D.|last6=Wikramanayake|first6=Eric|last7=Hahn|first7=Nathan|last8=Palminteri|first8=Suzanne|last9=Hedao|first9=Prashant|last10=Noss|first10=Reed|last11=Hansen|first11=Matt|last12=Locke|first12=Harvey|last13=Ellis|first13=Erle C|last14=Jones|first14=Benjamin|last15=Barber|first15=Charles Victor|last16=Hayes|first16=Randy|last17=Kormos|first17=Cyril|last18=Martin|first18=Vance|last19=Crist|first19=Eileen|last20=Sechrest|first20=Wes|last21=Price|first21=Lori|last22=Baillie|first22=Jonathan E. M.|last23=Weeden|first23=Don|last24=Suckling|first24=Kierán|last25=Davis|first25=Crystal|last26=Sizer|first26=Nigel|last27=Moore|first27=Rebecca|last28=Thau|first28=David|last29=Birch|first29=Tanya|last30=Potapov|first30=Peter|last31=Turubanova|first31=Svetlana|last32=Tyukavina|first32=Alexandra|last33=de Souza|first33=Nadia|last34=Pintea|first34=Lilian|last35=Brito|first35=José C.|last36=Llewellyn|first36=Othman A.|last37=Miller|first37=Anthony G.|last38=Patzelt|first38=Annette|last39=Ghazanfar|first39=Shahina A.|last40=Timberlake|first40=Jonathan|last41=Klöser|first41=Heinz|last42=Shennan-Farpón|first42=Yara|last43=Kindt|first43=Roeland|last44=Lillesø|first44=Jens-Peter Barnekow|last45=van Breugel|first45=Paulo|last46=Graudal|first46=Lars|last47=Voge|first47=Maianna|last48=Al-Shammari|first48=Khalaf F.|last49=Saleem|first49=Muhammad|display-authors=1|title=An Ecoregion-Based Approach to Protecting Half the Terrestrial Realm|journal=BioScience|volume=67|issue=6|year=2017|pages=534–545|issn=0006-3568|doi=10.1093/biosci/bix014|doi-access=free}}</ref> It had a 2019 [[Forest Landscape Integrity Index]] mean score of 6.95/10, ranking it 61<sup>st</sup> globally out of 172 countries.<ref name="FLII-Supplementary">{{cite journal|last1=Grantham|first1=H. S.|last2=Duncan|first2=A.|last3=Evans|first3=T. D.|last4=Jones|first4=K. R.|last5=Beyer|first5=H. L.|last6=Schuster|first6=R.|last7=Walston|first7=J.|last8=Ray|first8=J. C.|last9=Robinson|first9=J. G.|last10=Callow|first10=M.|last11=Clements|first11=T.|last12=Costa|first12=H. M.|last13=DeGemmis|first13=A.|last14=Elsen|first14=P. R.|last15=Ervin|first15=J.|last16=Franco|first16=P.|last17=Goldman|first17=E.|last18=Goetz|first18=S.|last19=Hansen|first19=A.|last20=Hofsvang|first20=E.|last21=Jantz|first21=P.|last22=Jupiter|first22=S.|last23=Kang|first23=A.|last24=Langhammer|first24=P.|last25=Laurance|first25=W. F.|last26=Lieberman|first26=S.|last27=Linkie|first27=M.|last28=Malhi|first28=Y.|last29=Maxwell|first29=S.|last30=Mendez|first30=M.|last31=Mittermeier|first31=R.|last32=Murray|first32=N. J.|last33=Possingham|first33=H.|last34=Radachowsky|first34=J.|last35=Saatchi|first35=S.|last36=Samper|first36=C.|last37=Silverman|first37=J.|last38=Shapiro|first38=A.|last39=Strassburg|first39=B.|last40=Stevens|first40=T.|last41=Stokes|first41=E.|last42=Taylor|first42=R.|last43=Tear|first43=T.|last44=Tizard|first44=R.|last45=Venter|first45=O.|last46=Visconti|first46=P.|last47=Wang|first47=S.|last48=Watson|first48=J. E. M.|display-authors=1|title=Anthropogenic modification of forests means only 40% of remaining forests have high ecosystem integrity - Supplementary Material|journal=Nature Communications|volume=11|issue=1|year=2020|issn=2041-1723|doi=10.1038/s41467-020-19493-3|doi-access=free}}</ref>

==Government and politics==
{{Main|Politics of Saint Vincent and the Grenadines}}
[[File:Ralph Gonsalves (cropped).jpg|thumb|190px|[[Ralph Gonsalves]], Prime Minister of St Vincent and the Grenadines since 2001]]
Saint Vincent and the Grenadines is a [[parliamentary democracy]] and [[Commonwealth realm|constitutional monarchy]], with [[Elizabeth II]] as [[Queen of Saint Vincent and the Grenadines]].<ref name="CIA World Factbook – St Vincent"/> She does not reside in the islands and is represented as [[head of state]] in the country by the [[Governor-General of Saint Vincent and the Grenadines]], currently [[Susan Dougan]] (since 1 August 2019).<ref>{{Cite web|url=https://searchlight.vc/searchlight/breaking-news/2019/08/01/svgs-first-female-head-of-state-sworn-in/|title=SVG's First Female Head of State Sworn In|website=Searchlight.vc|date=1 August 2019|access-date=23 August 2019}}</ref>

The office of Governor-General has mostly ceremonial functions including the opening of the islands' [[House of Assembly of Saint Vincent and the Grenadines|House of Assembly]] and the appointment of various government officials. Control of the government rests with the elected [[List of prime ministers of Saint Vincent and the Grenadines|Prime Minister]] and his or her cabinet. The current Prime Minister is [[Ralph Gonsalves]], elected in 2001 as head of the [[Unity Labour Party]].<ref>[http://www.caribbeanelections.com/svg/candidates/ulp/ralph_gonsalves.asp Profile] {{webarchive|url=https://web.archive.org/web/20111006195237/http://www.caribbeanelections.com/svg/candidates/ulp/ralph_gonsalves.asp |date=6 October 2011 }}, caribbeanelections.com; accessed 1 September 2014.</ref>

The legislative branch of government is the unicameral [[House of Assembly of Saint Vincent and the Grenadines]], seating 15 elected members representing single-member [[electoral district|constituencies]] and six appointed members known as Senators. The parliamentary term of office is five years, although the Prime Minister may call elections at any time.<ref name="CIA World Factbook – St Vincent"/>

The judicial branch of government is divided into district courts, the [[Eastern Caribbean Supreme Court]] and the [[Privy Council]] in [[London]] being the court of last resort.<ref name="CIA World Factbook – St Vincent"/>

=== Political culture ===
The two political parties with parliamentary representation are the [[New Democratic Party (Saint Vincent and the Grenadines)|New Democratic Party]] (NDP) and the [[Unity Labour Party]] (ULP). The parliamentary opposition is made up of the largest minority stakeholder in the general elections, headed by the [[Opposition (parliamentary)|leader of the opposition]]. The current opposition leader is [[Godwin Friday]].<ref name="CIA World Factbook – St Vincent"/>

=== Military ===
{{Further|Military of Saint Vincent and the Grenadines}}

Saint Vincent has no formal armed forces, although the [[Royal Saint Vincent and the Grenadines Police Force]] includes a Special Service Unit as well as a militia that has a supporting role on the island.{{cn|date=October 2020}}

In 2017, Saint Vincent signed the UN [[treaty on the Prohibition of Nuclear Weapons]].<ref>{{Cite web |url=https://treaties.un.org/Pages/ViewDetails.aspx?src=TREATY&mtdsg_no=XXVI-9&chapter=26&clang=_en |title=Chapter XXVI: Disarmament&nbsp;– No. 9 Treaty on the Prohibition of Nuclear Weapons |publisher=United Nations Treaty Collection |date=7 July 2017}}</ref>

===Administrative divisions===
{{Main|Parishes of Saint Vincent and the Grenadines}}

Administratively, Saint Vincent and the Grenadines is divided into six [[parish (country subdivision)|parishes]]. Five parishes are on Saint Vincent, while the sixth is made up of the Grenadine islands. [[Kingstown]] is located in the Parish of Saint George and is the capital city and central administrative centre of the country.<ref name="CIA World Factbook – St Vincent"/>

===LGBT rights===
{{main|LGBT rights in Saint Vincent and the Grenadines}}
Acts of gross indecency, which may be defined to include [[homosexual activity]], are illegal in Saint Vincent and the Grenadines.<ref>{{cite news |first=Daniel |last=Avery |title=71 Countries Where Homosexuality is Illegal |url=https://www.newsweek.com/73-countries-where-its-illegal-be-gay-1385974 |work=Newsweek |date=4 April 2019}}</ref> Section 148 of the Criminal Code states:
<blockquote>
Any person, who in public or private, commits an act of gross indecency with another person of the same sex, or procures or attempts to procure another person of the same sex to commit an act of gross indecency with him or her, is guilty of an offence and liable to imprisonment for five years.<ref>{{cite web |url=http://www.unhcr.org/refworld/country%2C%2C%2C%2CVCT%2C4562d94e2%2C4b20f0422%2C0.html |title=Saint Vincent and the Grenadines: Situation and treatment of homosexuals; legislation; availability of state protection and support services (2007 – September 2009) |author=United Nations High Commissioner for Refugees |work=Refworld |url-status=dead |archive-url=https://web.archive.org/web/20110728143803/http://www.unhcr.org/refworld/country,,,,VCT,4562d94e2,4b20f0422,0.html |archive-date=28 July 2011 |df=dmy-all }}</ref></blockquote>

== Foreign relations ==
{{Further|Foreign relations of Saint Vincent and the Grenadines}}

===International and regional relationships===
Saint Vincent and the Grenadines maintains close ties to [[Canada]], the [[United Kingdom]] and the [[United States|US]], and cooperates with regional political and economic organisations such as the [[Organisation of Eastern Caribbean States]] (OECS) and [[CARICOM]].<ref name="ird.gov.tt">{{Cite journal |url=http://www.ird.gov.tt/Media/Default/IRDTreaties/DTT-Caricom--1994.pdf |title=The Double Taxation Relief (Caricom) Order |journal=Legal Supplement |volume=33 |number=273 |date=28 December 1994}}</ref> The island nation's sixth embassy overseas was opened on 8 August 2019 in Taipei, after Prime Minister Ralph Gonsalves' official visit to the Republic of China; the other five are located in London, Washington D.C., Havana, Caracas and Brussels.{{cn|date=October 2020}}

====The Double Taxation Relief (CARICOM) Treaty====
On 6 July 1994 at Sherbourne Conference Centre, St Michael, Barbados, as a representative of the Government of St. Vincent and the Grenadines, then (James Mitchell, who was subsequently knighted) signed the Double Taxation Relief (CARICOM) Treaties.<ref name="ird.gov.tt"/> There were seven other signatories to the agreement on that day. The countries which were represented were Antigua and Barbuda, Belize, Grenada, Jamaica, St Kitts and Nevis, St Lucia, and Trinidad and Tobago.{{cn|date=October 2020}}

An eighth country signed the agreement on 19 August 2016, Guyana.{{cn|date=October 2020}}

This treaty covered taxes, residence, tax jurisdictions, capital gains, business profits, interest, dividends, royalties and other areas.<ref name="ird.gov.tt"/>

====FATCA====
On 30 June 2014, St. Vincent and the Grenadines signed a Model 1 agreement with the United States of America with respect to Foreign Account Tax Compliance (Act) or FATCA.<ref>{{cite web |url=https://www.treasury.gov/resource-center/tax-policy/treaties/Pages/FATCA.aspx |title=Foreign Account Tax Compliance Act (FATCA) |website=Treasury.gov |access-date=8 July 2017}}</ref>

According to the updated site as of 16 January 2017, on 13 May 2016 the agreement went to "In Force" status.{{cn|date=October 2020}}

====International and regional bodies to which St. Vincent and the Grenadines belong====
St Vincent and the Grenadines is a member of the [[United Nations]], the [[Commonwealth of Nations]], the [[Organization of American States]], and the [[Association of Caribbean States]] (ACS).

In September 2017, at the [[Seventy-second session of the United Nations General Assembly|72nd Session of the UN General Assembly]], the Prime Ministers of the Solomon Islands, Tuvalu, Vanuatu and Saint Vincent and the Grenadines called for UN action on alleged human rights abuses committed on [[Western New Guinea]]'s indigenous Papuans.<ref>{{cite news|title=Fiery debate over West Papua at UN General Assembly|url=http://www.radionz.co.nz/international/programmes/datelinepacific/audio/201860156/fiery-debate-over-west-papua-at-un-general-assembly|work=Radio New Zealand 2017|date=27 September 2017}}</ref> Western New Guinea has been occupied by [[Indonesia]] since 1963.<ref>{{cite news |title=Freedom of the press in Indonesian-occupied West Papua |url=https://www.theguardian.com/media/2019/jul/22/freedom-of-the-press-in-indonesian-occupied-west-papua |work=The Guardian |date=22 July 2019}}</ref> More than 100,000 Papuans have died during a 50-year [[Papua conflict]].<ref>{{cite news |title=Goodbye Indonesia |url=https://www.aljazeera.com/programmes/peopleandpower/2013/01/201313018313632585.html |work=Al-Jazeera |date=31 January 2013}}</ref>

====Organisation of American States====
The Charter of the OAS was signed in Bogotá in 1948 and was amended by several Protocols which were named after the city and the year in which the Protocol was signed, such as "Managua" in "1993" forming part of the name of the Protocol.<ref>{{cite web |url=http://www.oas.org/en/sla/dil/inter_american_treaties_A-41_charter_OAS.asp |title=Charter of the Organization of American States |date=1 August 2009 |website=[[Organization of American States]] |access-date=8 July 2017}}</ref>

St Vincent and the Grenadines entered the OAS system on 27 October 1981 according to the OAS website.<ref>{{cite web |url=http://www.oas.org/en/member_states/member_state.asp?sCode=STV |title=Member State: Saint Vincent and the Grenadines |date=1 August 2009 |website=Organization of American States |access-date=8 July 2017}}</ref>

=====Summits of the Americas=====
The last Summits of the Americas, the seventh, was held in Panama City, Panama in 2015 with the eighth summit being held in Lima, Peru in 2018 according to the website of the Summits of Americas.<ref>{{cite web |url=http://www.summit-americas.org/default_en.htm |title=Home |website=Summits of the Americas |access-date=8 July 2017}}</ref>

=====Indigenous Leaders Summits of Americas (ILSA)=====
With St Vincent and the Grenadines having at least two groups of indigenous persons<ref>{{cite web |url=http://www.refworld.org/docid/4954ce54c.html |title=World Directory of Minorities and Indigenous Peoples – St Vincent and the Grenadines |website=United Nations High Commissioner for Refugees |access-date=8 July 2017}}</ref> it is expected that there will be contributions from the SVG's on this topic at the next ILSAs.<ref>{{cite web |url=http://www.oas.org/en/topics/indigenous_peoples.asp |title=Indigenous Peoples |date=1 August 2009 |website=Organization of American States |access-date=8 July 2017}}</ref>

The position of the OAS with respect to indigenous persons appears to be developing over the years. The following statements appear to capture the position of the OAS with respect to the ILSA: "The OAS has supported and participated in the organisation of Indigenous Leaders Summits of Americas (ILSA)" according to the OAS's website. The most recent "statement made by the Heads of State of the hemisphere was in the Declaration of Commitments of Port of Spain in 2009 – Paragraph 86 according to the OAS's website."<ref>{{cite web |url=http://www.summit-americas.org/cs_ind.html |title=Indigenous Peoples |website=Summits of The Americas |access-date=8 July 2017}}</ref>

The Draft American Declaration of the Rights of the Indigenous Persons appear to be a working document. The last "Meeting for Negotiations in the Quest for Consensus on this area appeared to be Meeting Number (18) eighteen and is listed as being held in May 2015 according to the website."<ref>{{cite web |url=http://www.oas.org/consejo/CAJP/Indigenous%20special%20session.asp#Special |title=Events OAS Indigenous Special Events |website=Organization of American States |access-date=8 July 2017}}</ref>

===European nations===
In 2013, Saint Vincent called for European nations to pay reparations for the [[Slavery|slave trade]].<ref>{{cite news |url=http://www.miamiherald.com/2013/09/29/3659868/caribbean-leaders-make-case-for.html |title=Caribbean leaders make case for reparations at U.N. |newspaper=[[The Miami Herald]] |date=29 September 2013}}</ref>

===Venezuela===
Saint Vincent protests against [[Venezuela]]'s claim to give full effect to [[Aves (Bird) Island]], which creates a Venezuelan [[EEZ]]/[[continental shelf]] extending over a large portion of the [[Caribbean Sea]].<ref name="CIA World Factbook – St Vincent"/>

==Economy==
{{Main|Economy of Saint Vincent and the Grenadines}}
[[File:St. Vincent and the Grenadines Export Treemap.png|thumb|A proportional representation of St Vincent and the Grenadines' exports]]
[[File:St. Vincent, Karibik - Kingstown - Looking north from Fort Charlotte - panoramio.jpg|thumb|Camden Park, St. Vincent]]
Agriculture, dominated by [[banana]] production, is the most important sector of this lower-middle-income economy. The services sector, based mostly on a growing tourist industry, is also important. The government has been relatively unsuccessful at introducing new industries, and the [[unemployment rate]] remains high at 19.8% in the 1991 census<ref name="popin">{{cite web |title=Statement of St Vincent & the Grenadines |url=https://www.un.org/popin/icpd/conference/gov/940912160112.html |website=United Nations Population Information Network |date=9 September 1994 |access-date=16 December 2011}}</ref> to 15% in 2001.<ref name="cia"/> The continuing dependence on a single crop represents the biggest obstacle to the islands' development as tropical storms wiped out substantial portions of bananas in many years.{{cn|date=October 2020}}

There is a small manufacturing sector and a small offshore financial sector serving international businesses, and its secrecy laws have caused some international concern.  There are increasing demands for international financial services like stock exchange and financial intermediaries financial activities in the country.  In addition, the natives of [[Bequia]] are permitted to hunt up to four [[humpback whale]]s per year under [[International Whaling Commission|IWC]] subsistence quotas.{{cn|date=October 2020}}

=== Tourism ===
The tourism sector has considerable potential for development. The recent filming of the ''[[Pirates of the Caribbean films|Pirates of the Caribbean]]'' movies on the island has helped to expose the country to more potential visitors and investors. Recent growth has been stimulated by strong activity in the construction sector and an improvement in tourism.<ref name="sids">{{cite web |title=Report to the Regional Consultation on SIDS Specific Issues |url=http://www.pnuma.org/sids_ing/documents/National%20Reports/St.%20Vincent%20National%20Report.pdf |date=October 2003 |website=United Nations Environment Program |first=Lystra |last=Culzac-Wilson |access-date=16 December 2011 |url-status=dead |archive-url=https://web.archive.org/web/20120111085338/http://www.pnuma.org/sids_ing/documents/National%20Reports/St.%20Vincent%20National%20Report.pdf |archive-date=11 January 2012 |df=dmy-all }}</ref>

=== Transportation ===
[[Argyle International Airport]] is the country's new international airport.<ref>{{cite web |title=Argyle International Airport, St Vincent & the Grenadines |url=http://www.caribbeanconstruction.com/index.php?option=com_content&view=article&id=373&Itemid=2 |work=caribbeanconstruction.com |access-date=3 May 2012 |archive-url=https://web.archive.org/web/20160303235235/http://www.caribbeanconstruction.com/index.php?option=com_content&view=article&id=373&Itemid=2 |archive-date=3 March 2016 |url-status=dead |df=dmy-all }}</ref> The new facility opened on 14 February 2017,<ref>{{Cite news |url=http://antiguaobserver.com/argyle-international-airport-to-open-february-14/ |title=Argyle International Airport to open February 14 |date=29 December 2016 |newspaper=Antigua Observer Newspaper |access-date=20 January 2017}}</ref> replacing the existing [[E.T. Joshua Airport]]. The airport is on the island's east coast about 8.3&nbsp;km (5.17 miles) from Kingstown.{{cn|date=October 2020}}

===Communications===
{{main|Telecommunications in Saint Vincent and the Grenadines}}
In 2010, Saint Vincent and the Grenadines had 21,700 telephone land lines. Its land telephone system is fully automatic and covers the entire island and all of the inhabited Grenadine islands.<ref name="cia">{{cite web |title=The World Fact Book |url=https://www.cia.gov/the-world-factbook/countries/saint-vincent-and-the-grenadines/ |date=10 November 2011 |publisher=[[Central Intelligence Agency]] |access-date=16 December 2011}}</ref> In 2002, there were 10,000 mobile phones.<ref name="about">{{cite web |title=Saint Vincent and the Grenadines |url=http://geography.about.com/library/cia/blcstvincent.htm |date=1 November 2005 |publisher=About.com |access-date=16 December 2011}}</ref> By 2010, this number had increased to 131,800.<ref name="cia"/> Mobile phone service is available in most areas of Saint Vincent as well as the Grenadines.{{cn|date=October 2020}}

Saint Vincent has two ISPs ([[Digicel]], [[Flow (brand)|Flow]]) that provide cellular telephone and internet service.<ref name="tourism">{{cite web |title=About SVG: Essentials| url=http://www.discoversvg.com/index.php/en/about-svg/essentials?start=5 |website=SVG Tourism Authority |access-date=16 December 2011}}</ref>

==Demographics==
{{Main|Demographics of Saint Vincent and the Grenadines}}
The population as estimated in {{UN_Population|Year}} was {{UN_Population|Saint Vincent and the Grenadines}}.{{UN_Population|ref}} The ethnic composition was 66% [[African descent]], 19% of mixed descent, 6% East Indian, 4% [[Europeans]] (mainly Portuguese), 2% [[Island Carib]] and 3% others.<ref name="CIA World Factbook – St Vincent"/> Most Vincentians are the descendants of [[sub-Saharan Africa|African]] people brought to the island to work on [[plantation]]s. There are other ethnic groups such as [[Portuguese people|Portuguese]] (from [[Madeira]]) and [[East India]]ns, both brought in to work on the plantations after the abolishing of slavery by the British living on the island. There is also a growing Chinese population.{{Citation needed|date=June 2011}}

===Languages===
{{Main|Vincentian Creole}}

English is the official language. Most Vincentians speak Vincentian Creole.<ref>{{cite web |url=http://www.ethnologue.com/language/svc |title=Vincentian Creole English |website=Ethnologue |date=19 February 1999 |access-date=29 April 2014}}</ref> English is used in education, government, religion, and other formal domains, while Creole (or 'dialect' as it is referred to locally) is used in informal situations such as in the home and among friends.<ref>{{cite web |url=http://www.sil.org/resources/publications/entry/43481 |title=The Classification of the English-Lexifier Creole Languages Spoken in Grenada, Guyana, St Vincent, and Tobago Using a Comparison of the Markers of Some Key Grammatical Features |website=SIL International |access-date=29 April 2014}}</ref>

===Religion===
[[File:St. Vincent, Karibik - St. Mary's R.C. School ^ St. Mary's R.C. Cathedral - panoramio.jpg|thumb|[[Assumption Cathedral, Kingstown|Assumption Cathedral]], Kingstown]] 
According to the 2001 census, 81.5% of the population of Saint Vincent and the Grenadines identified themselves as [[Christianity|Christian]], 6.7% has another religion and 8.8% has no religion or did not state a religion (1.5%).<ref name="2001 census">{{cite web |url=http://www.stats.gov.vc/LinkClick.aspx?fileticket=jSipdTnsXwM%3d&tabid=60 |title=Population and housing census report 2001 |website=stats.gov.vc |access-date=8 July 2017 |archive-url=https://web.archive.org/web/20180911195540/http://www.stats.gov.vc/LinkClick.aspx?fileticket=jSipdTnsXwM%3D&tabid=60 |archive-date=11 September 2018 |url-status=dead }}</ref>

[[Anglicanism]] constitutes the largest religious category, with 17.8% of the population. [[Pentecostals]] are the second largest group (17.6%). The next largest group are [[Methodists#Caribbean|Methodists]] (10.9% of the population), followed by [[Seventh-day Adventists]] (10.2%) and [[Baptists]] (10.0%). Other Christians include [[Jehovah's Witnesses]] (0.6%), [[Roman Catholics]] (7.5%), [[Evangelicalism|Evangelicals]] (2.8%), Church of God (2.5%), [[Brethren Christian]] (1.3%), and the [[Salvation Army]] (0.3%).<ref>{{Cite web|last=Sen Nag|first=Oishimaya|date=13 November 2018|title=Religious Beliefs In Saint Vincent and the Grenadines|url=https://www.worldatlas.com/articles/religious-beliefs-in-saint-vincent-and-the-grenadines.html|website=World Atlas}}</ref>

Between 1991 and 2001 the number of Anglicans, Brethren, Methodists and Roman Catholics decreased, while the number of Pentecostals, Evangelicals and Seventh-day Adventists increased.{{citation needed|date=October 2019}}

The number of non-Christians is small. These religious groups include the [[Rastafari movement|Rastafarians]] (1.5% of the population), [[Hinduism in the West Indies|Hindus]] and [[Muslims]] (1.5%).<ref>{{Cite web |url=http://pewforum.org/uploadedfiles/Topics/Demographics/Muslimpopulation.pdf |title=Archived copy |access-date=2010-11-27 |archive-url=https://web.archive.org/web/20110810075151/http://pewforum.org/uploadedfiles/Topics/Demographics/Muslimpopulation.pdf |archive-date=2011-08-10 |url-status=dead }}</ref>

== Culture ==
[[File:Mustiquebeaches.jpg|thumb|The island of [[Mustique]] in the [[Grenadines]]]]

===Sport===
{{See also|Cricket in the West Indies}}
<!-- mention something abt cricket here? -->
Cricket, [[Rugby football|rugby]] and association football are most popular among men whereas [[netball]] is most popular among women. Basketball, volleyball and tennis are also very popular.<ref>{{Cite web |url=http://www.visitsvg.com/discover/sports.html |title=Visit St Vincent & the Grenadines – Sport |website=visitsvg.com |access-date=28 October 2015 |url-status=dead |archive-url=https://web.archive.org/web/20150919002957/http://www.visitsvg.com/discover/sports.html |archive-date=19 September 2015 |df=dmy-all }}</ref>

The country's prime [[association football|football]] league is the [[NLA Premier League]], which provides its [[Saint Vincent and the Grenadines national football team|national (association) football team]] with most players. A notable Vincentian footballer is [[Ezra Hendrickson]], former national team captain who played at several Major League Soccer clubs in the United States and is now an assistant coach with the [[Seattle Sounders FC]].<ref name="sounders">{{cite web |title=Ezra Hendrickson, Assistant Coach |url=http://www.soundersfc.com/Team/Coaches/Ezra-Hendrickson.aspx |website=Seattle Sounders FC |access-date=16 December 2011}}</ref>

The country regularly participates at the [[Caribbean Basketball Championship]] where a [[Saint Vincent and the Grenadines national basketball team|men's team]] and a [[Saint Vincent and the Grenadines women's national basketball team|women's team]] compete. Saint Vincent and the Grenadines also has its own [[Saint Vincent and the Grenadines national rugby union team|national rugby union team]] which is ranked 84th in the world. Other notable sports played at the regional level include track and field.{{citation needed|date=October 2019}}

===Music===
{{Main|Music of Saint Vincent and the Grenadines}}
Music popular in Saint Vincent and the Grenadines includes big drum, [[Calypso music|calypso]], [[Soca music|soca]], [[steelpan]] and [[reggae]]. String band music, quadrille and traditional storytelling are also popular.  One of the most successful St Vincent natives is [[Kevin Lyttle]].  He was named Cultural Ambassador for the Island 19 September 2013.<ref>{{cite web |url=http://www.islandmix.com/backchat/showthread.php?p=4469536 |title=Kevin Lyttle, "Skinny Fabulous," n "Fireman Hooper" Are Named Cultural Ambassadors |website=Islandmix.com |date=19 September 2013 |access-date=29 April 2014}}</ref>

The national anthem of Saint Vincent and the Grenadines is "[[Saint Vincent, Land so beautiful]]", adopted upon independence in 1979.{{citation needed|date=October 2019}}

=== Media ===
Saint Vincent has twelve FM radio stations: 88.9 Adoration Fm,<ref>{{cite web |url=http://www.adoration88.com |title=Contemporary Christian Radio Station |website=Adoration FM SVG |access-date=8 July 2017}}</ref> 89.1 Jem Radio, 89.7 NBC Radio, 95.7 and 105.7 [[Praise FM (Saint Vincent and the Grenadines)|Praise FM]], 96.7 Nice Radio, 97.1 Hot 97, 98.3 Star FM, 99.9 We FM, 103.7 Hitz, 102.7 EZee radio, 104.3 Xtreme FM and 106.9 Boom FM. There are several Internet radio stations including Chronicles Christian Radio.<ref>{{cite web |url=http://www.ccradio.co/about.html |title=About Caribbean Christian Radio Online |website=Chronicles Christian Radio |access-date=8 July 2017}}</ref> It has one television broadcast station ZBG-TV (SVGTV)<ref name="svgtv">{{cite web |title=SVGTV |url=http://www.svgbc.com/svgtv.htm |website=St Vincent and the Grenadines Broadcasting Corporation Ltd. |access-date=16 December 2011 |url-status=dead |archive-url=https://web.archive.org/web/20120108101920/http://www.svgbc.com/svgtv.htm |archive-date=8 January 2012 |df=dmy-all }}</ref> and one cable television provider.

St Vincent and the Grenadines Broadcasting Co-operation is the parent company for SVGTV, Magic 103.7.<ref>{{cite web |title=Welcome to the Saint Vincent & The Grenadines Broadcasting Corporation Website |url=https://www.svgbc.com/ |website=SVGBC |access-date=18 March 2020}}</ref>

==See also==
{{Portal|Caribbean|Caricom}}
{{Wikipedia books|Saint Vincent and the Grenadines}}
*[[Outline of Saint Vincent and the Grenadines]]
*[[Index of Saint Vincent and the Grenadines-related articles]]

==References==
{{Reflist}}

==Further reading==
{{Refbegin}}
* Bobrow, Jill & Jinkins, Dana. 1985. ''St. Vincent and the Grenadines''. 4th Edition Revised and Updated, Concepts Publishing Co., Waitsfield, Vermont, 1993.
* Cosover, Mary Jo. 1989. "St. Vincent and the Grenadines." In ''Islands of the Commonwealth Caribbean: A Regional Study'', edited by Sandra W. Meditz and Dennis M. Hanratty. US Government Printing Office, Washington, D.C.
* [https://www.cia.gov/the-world-factbook/countries/saint-vincent-and-the-grenadines/ CIA Factbook entry]
* Gonsalves, Ralph E. 1994. ''History and the Future: A Caribbean Perspective''. Quik-Print, Kingstown, St Vincent.
* [https://2009-2017.state.gov/r/pa/ei/bgn/2345.htm US Dept of State Profile]
* Williams, Eric. 1964. ''British Historians and the West Indies'', Port-of-Spain.
{{Refend}}

==External links==
{{Sister project links|voy=Saint Vincent and the Grenadines}}
; Government
* {{Official website|http://www.gov.vc }}
* [http://www.pmoffice.gov.vc/ Website of the Prime Minister of St Vincent and the Grenadines]
* [https://web.archive.org/web/20091026201651/https://www.cia.gov/library/publications/world-leaders-1/world-leaders-a/afghanistan.html Chief of State and Cabinet Members]
; General information
* [https://www.cia.gov/the-world-factbook/countries/saint-vincent-and-the-grenadines/ Saint Vincent and the Grenadines]. ''[[The World Factbook]]''. [[Central Intelligence Agency]].
* [https://web.archive.org/web/20090423081159/http://ucblibraries.colorado.edu/govpubs/for/saintvincent.htm Saint Vincent and the Grenadines] from ''UCB Libraries GovPubs''
* {{Curlie|Regional/Caribbean/Saint_Vincent_and_the_Grenadines}}
* [http://news.bbc.co.uk/2/hi/americas/country_profiles/1210689.stm St Vincent and the Grenadines] from the [[BBC News]]
* {{Wikiatlas|Saint Vincent and the Grenadines}}
* [http://www.ifs.du.edu/ifs/frm_CountryProfile.aspx?Country=VC Key Development Forecasts for St Vincent and the Grenadines] from [[International Futures]]
* [https://www.ceintelligence.com/files/documents/2014-St.-Vincent-and-the-Grenadines-Private-Sector-Assessment-Report.pdf Saint Vincent and the Grenadines Private Sector Assessment Report]
{{Saint Vincent and the Grenadines topics}}
{{Navboxes
|list =Related articles 
{{Countries of North America}}
{{Bolivarian Alliance for the Americas (ALBA)}}
{{Organization of Eastern Caribbean States (OECS)|state=collapsed}}
{{Caribbean Community (CARICOM)|state=collapsed}}
{{Commonwealth realms}}
{{The Commonwealth}}
}}

{{Authority control}}

{{DEFAULTSORT:Saint Vincent And The Grenadines}}
[[Category:Saint Vincent and the Grenadines| ]]<!--Keep at start of list (eponymous category)-->
[[Category:Countries in the Caribbean]]
[[Category:Island countries]]
[[Category:Windward Islands]]
[[Category:English-speaking countries and territories]]
[[Category:Member states of the Caribbean Community]]
[[Category:Member states of the Commonwealth of Nations]]
[[Category:Member states of the Organisation of Eastern Caribbean States]]
[[Category:Member states of the United Nations]]
[[Category:States and territories established in 1979]]
[[Category:Small Island Developing States]]
[[Category:1979 establishments in North America]]
[[Category:Countries in North America]]