question,answer,probability,context,doc_name
"
","
"
Wie alt wurde Max Beckmann?,32 Jahren,0.7310785941845872,"l ihm nur eine kurze Schaffensphase vergönnt war. Er starb bereits mit 32 Jahren in seiner Wahlheimat Rom, nachdem er Frankfurt mit 20 verlassen hatte",kreuzaltar.txt
Wie alt wurde Max Beckmann?,etwa 350 Jahre,0.6430413752667451,"raph. Jemand, der Landkarten von der Erde zeichnet.
Das Gemälde ist etwa 350 Jahre alt. Damals erforschte man gerade die Welt bis in den letzten Winke",der_geograf.txt
Wie alt wurde Max Beckmann?,groß,0.609022764545813,"ie Madonna sehr groß oder das Zimmer sehr klein? Beides richtig, Madonna groß weil ihre Bedeutung hervorgehoben werden soll.
Das kleine Bild Jan van E",lucca_madonna.txt
Wie alt wurde Max Beckmann?,Gut 100 Jahre,0.6062435474255966,"keit gemalt, die van Eyck schon zu Lebzeiten weithin berühmt machte. Gut 100 Jahre nach seinem Tod verbreitete der italienische Kunstschriftsteller Gi",lucca_madonna.txt
Wie alt wurde Max Beckmann?,30 Jahre,0.6001135815364544,"hrecken und Neugierde. 
Als Rembrandt dieses Bild malte, war er gerade 30 Jahre alt. Er lebte in Amsterdam und hatte sich bereits einen Namen als Port",die_blendung_simsons.txt
Wie alt wurde Max Beckmann?,1578–1610,0.5513452615462892,"ch der gebürtige Frankfurter Feinmaler und Miniaturist Adam Elsheimer
(1578–1610) verließ die Heimat gen Rom. Hier fertigte er in seinem kurzen Leben ",kreuzaltar.txt
Wie alt wurde Max Beckmann?,30 Jahre alt,0.5456417447996083,"natürlichen Kraft beraubt.
Als Rembrandt das Bild 1636 malte, war er 30 Jahre alt und hatte bereits seit 2 Jahren eine eigene Werkstatt in Amsterdam. ",die_blendung_simsons.txt
Wie alt wurde Max Beckmann?,etwa 350 Jahre alt,0.5456317407558042,"ph. Jemand, der Landkarten von der Erde zeichnet.
Das Gemälde ist etwa 350 Jahre alt. Damals erforschte man gerade die Welt bis in den letzten Winkel.",der_geograf.txt
Wie alt wurde Max Beckmann?,Ende Juni 1441,0.5455399811208698,"ichtlich nach 1430 zog Jan nach Brügge um, wo er bis zu seinem Tode Ende Juni 1441 mit nur kurzen Unterbrechungen durch Reisen blieb. Wenngleich Jan a",lucca_madonna.txt
Wie alt wurde Max Beckmann?,1962,0.5152889365866541,"ng mit seinen persönlichen Erfahrungen in den 1980er Jahren gesehen. Der 1962 geborene Künstler gehörte zur autonomen Szene der Hamburger Hafenstraße,",horde.txt
"
","
"
Was möchte der Maler mit dem Blick des Geografen ausdrücken?,"Ein solches wissenschaftliches, objektives Abbild der Wirklichkeit",0.7564862278694408,"us, die beinahe etwas Fotografisches hat. Ein solches wissenschaftliches, objektives Abbild der Wirklichkeit zählte sicherlich zu Vermeers künstlerisc",der_geograf.txt
Was möchte der Maler mit dem Blick des Geografen ausdrücken?,dem vertieften Studium der Welt und ihrer Handelswege,0.7055125477184986,chtum Hollands von herausragender Bedeutung war: dem vertieften Studium der Welt und ihrer Handelswege. Lange Zeit war Vermeer aus dem Blickfeld der S,der_geograf.txt
Was möchte der Maler mit dem Blick des Geografen ausdrücken?,"Jemand, der Landkarten von der Erde zeichnet",0.675529820286984,"inge braucht, na??? – ein Geograph. Oder Kartograph. Jemand, der Landkarten von der Erde zeichnet.
Das Gemälde ist etwa 350 Jahre alt. Damals erforsch",der_geograf.txt
Was möchte der Maler mit dem Blick des Geografen ausdrücken?,"die Natur so wiederzugeben, wie sie sich dem Auge darbietet",0.5864391101497721,"ucca-Madonna. An ihr ist van Eycks Bestreben, die Natur so wiederzugeben, wie sie sich dem Auge darbietet, mustergültig nachvollziehbar. Damit wird de",lucca_madonna.txt
Was möchte der Maler mit dem Blick des Geografen ausdrücken?,Er wollte die Welt mit den Augen der Tiere sehen,0.5845125877760571,"ubilden, sondern sich in die Tiere hineinzufühlen. Er wollte die Welt mit den Augen der Tiere sehen:
„Wie armselig seelenlos ist unsere Konvention, Ti",liegender_hund_im_schnee.txt
Was möchte der Maler mit dem Blick des Geografen ausdrücken?,Simonetta Vespucci,0.5558825613894788," hier dargestellt hat, aber vieles spricht dafür, dass es sich um Simonetta Vespucci handelt. Gelebt hat Simonetta vor gut 500 Jahren in Florenz. Dort",weibliches_idealbildnis.txt
Was möchte der Maler mit dem Blick des Geografen ausdrücken?,groß,0.551229407599126,"ie Madonna sehr groß oder das Zimmer sehr klein? Beides richtig, Madonna groß weil ihre Bedeutung hervorgehoben werden soll.
Das kleine Bild Jan van E",lucca_madonna.txt
Was möchte der Maler mit dem Blick des Geografen ausdrücken?,den Blick für mikroskopisch kleine Miniaturdarstellungen ebenso wie für die Komplexität des Gesamtbildes,0.5457094595330204,"elang es dem Künstler, den Blick für mikroskopisch kleine Miniaturdarstellungen ebenso wie für die Komplexität des Gesamtbildes zu schärfen. Seltenhei",kreuzaltar.txt
Was möchte der Maler mit dem Blick des Geografen ausdrücken?,"Er wollte vielmehr mit Hilfe der Fotos ausloten, was Malerei sein kann, wenn man auf all das verzichtet, was normalerweise die Originalität eines Gemälde kennzeichnet: Gegenstand, Form, Komposition, Stil, Intention",0.5283814973123228,"Er wollte vielmehr mit Hilfe der Fotos ausloten, was Malerei sein kann, wenn man auf all das verzichtet, was normalerweise die Originalität eines Gemälde kennzeichnet: Gegenstand, Form, Komposition, Stil, Intention",kahnfahrt.txt
Was möchte der Maler mit dem Blick des Geografen ausdrücken?,die Perspektive des Tieres,0.49987147003695354,"ch schlummert. Aber Franz Marc geht noch weiter: Er versucht, die Perspektive des Tieres einzunehmen, will die Szene sozusagen mit den Augen eines Hun",liegender_hund_im_schnee.txt
"
","
"
Was sind weitere große Werke von Johann Heinrich Wilhelm Tischbein?,"""Goethe in der römischen Campagna""",0.6811169456747301,"ng von Goethes, aber diese hier ist wohl die bekannteste: ""Goethe in der römischen Campagna"" von Johann Heinrich Wilhelm Tischbein.
Goethe hatte auf s",goethe_in_der_roemishen_campagna.txt
Was sind weitere große Werke von Johann Heinrich Wilhelm Tischbein?,Madonna groß,0.527115864594855,"st die Madonna sehr groß oder das Zimmer sehr klein? Beides richtig, Madonna groß weil ihre Bedeutung hervorgehoben werden soll.
Das kleine Bild Jan v",lucca_madonna.txt
Was sind weitere große Werke von Johann Heinrich Wilhelm Tischbein?,Simonetta Vespucci,0.5155986613248593," hier dargestellt hat, aber vieles spricht dafür, dass es sich um Simonetta Vespucci handelt. Gelebt hat Simonetta vor gut 500 Jahren in Florenz. Dort",weibliches_idealbildnis.txt
Was sind weitere große Werke von Johann Heinrich Wilhelm Tischbein?,Weil sie deiner überdrüssig wurde,0.45005432321287925,"hast du mir das angetan? Sagst du nichts mehr?
Sprecher B: Weil sie deiner überdrüssig wurde, du Tor! Deiner Wutausbrüche, Simson. Deiner Gewalttaten!",die_blendung_simsons.txt
Was sind weitere große Werke von Johann Heinrich Wilhelm Tischbein?,Der Frankfurter Kreuzaltar,0.4341996633922606,"Kupfertafeln -  verlieh seinen Farben einen besonderen Glanz. Der Frankfurter Kreuzaltar, eines seiner Hauptwerke, galt über dreihundert Jahre als ver",kreuzaltar.txt
Was sind weitere große Werke von Johann Heinrich Wilhelm Tischbein?,Frankfurter Kreuzaltar,0.3835423507292039," ausgeführt sind. Hier sehen Sie eines seiner Meisterwerke, den Frankfurter Kreuzaltar. Für diese ungeheuer feine Malerei erschien vor allem Leinwand ",kreuzaltar.txt
Was sind weitere große Werke von Johann Heinrich Wilhelm Tischbein?,Lucca-Madonna,0.37728795415455957,"ahrungsort im frühen 19. Jahrhundert benannten, um 1437 entstandenen Lucca-Madonna (Abb.S. 85) ein herausragendes Werk, dessen Bestimmungsort indes ni",lucca_madonna.txt
Was sind weitere große Werke von Johann Heinrich Wilhelm Tischbein?,"Jan van Eyck besitzt das Städel Museum mit der nach ihrem Aufbewahrungsort im frühen 19. Jahrhundert benannten, um 1437 entstandenen Lucca-Madonna",0.37289611463085787,"n Jan van Eyck besitzt das Städel Museum mit der nach ihrem Aufbewahrungsort im frühen 19. Jahrhundert benannten, um 1437 entstandenen Lucca-Madonna (",lucca_madonna.txt
Was sind weitere große Werke von Johann Heinrich Wilhelm Tischbein?,der Frankfurter Kreuzaltar,0.36737804840314364,"furter Malers. Dazu gehört an zentraler Stelle das Hauptwerk: der Frankfurter Kreuzaltar, bestehend aus sieben Kupfertafeln, deren Ankauf nach dem Zwe",kreuzaltar.txt
Was sind weitere große Werke von Johann Heinrich Wilhelm Tischbein?,"Ich bemerkte wohl, dass Tischbein mich öfters aufmerksam betrachtete, und nun zeigte sich’s, dass er mein Porträt zu malen gedenkt. Sein Entwurf ist fertig, er hat die Leinwand schon aufgespannt. Ich soll in Lebensgröße als Reisender, in einen weißen Mantel gehüllt, in freier Luft auf einem umgestürzten Obelisken sitzend, vorgestellt werden, die tief im Hintergrunde liegenden Ruinen der Campagna die Roma überschauend",0.35702372442833097,"Ich bemerkte wohl, dass Tischbein mich öfters aufmerksam betrachtete, und nun zeigte sich’s, dass er mein Porträt zu malen gedenkt. Sein Entwurf ist fertig, er hat die Leinwand schon aufgespannt. Ich soll in Lebensgröße als Reisender, in einen weißen Mantel gehüllt, in freier Luft auf einem umgestürzten Obelisken sitzend, vorgestellt werden, die tief im Hintergrunde liegenden Ruinen der Campagna die Roma überschauend",goethe_in_der_roemishen_campagna.txt
"
","
"
Gibt es noch andere Bilder von Francesca Salviati?,groß,0.5348260697794884,"ie Madonna sehr groß oder das Zimmer sehr klein? Beides richtig, Madonna groß weil ihre Bedeutung hervorgehoben werden soll.
Das kleine Bild Jan van E",lucca_madonna.txt
Gibt es noch andere Bilder von Francesca Salviati?,"Leider wissen wir nicht, WEN er dargestellt hat, aber man vermutet, dass die junge Frau aus Florenz stammte, aus einer begüterten Familie.",0.44997000319978425,"ormo. Leider wissen wir nicht, WEN er dargestellt hat, aber man vermutet, dass die junge Frau aus Florenz stammte, aus einer begüterten Familie. Dass ",bildnis_einer_dame_in_rot.txt
Gibt es noch andere Bilder von Francesca Salviati?,"Sei es der vollkommen fassungslos starrende Philister oben rechts, oder die  rätselhaft blickende Dalilah",0.4422701490800527,"n überragendes Können. Sei es der vollkommen fassungslos starrende Philister oben rechts, oder die  rätselhaft blickende Dalilah: Rembrandt spielt mei",die_blendung_simsons.txt
Gibt es noch andere Bilder von Francesca Salviati?,"Ganz sicher ist es nicht, wen der Maler Sandro Botticelli hier dargestellt hat, aber vieles spricht dafür, dass es sich um Simonetta Vespucci",0.43452435089082164,"hen. Ganz sicher ist es nicht, wen der Maler Sandro Botticelli hier dargestellt hat, aber vieles spricht dafür, dass es sich um Simonetta Vespucci han",weibliches_idealbildnis.txt
Gibt es noch andere Bilder von Francesca Salviati?,weniger als 40 Vermeers erhalten,0.3772502291463091," sehr geringe Anzahl an Bildern geschaffen, und heute sind weniger als 40 Vermeers erhalten – Diese sind natürlich Gemälde von unschätzbarem Wert.
Uns",der_geograf.txt
Gibt es noch andere Bilder von Francesca Salviati?,Es gibt viele Abbildungen Johann Wolfgang von Goethes,0.3650783381569544,"de_ges_728_bas_int // Basistext
Es gibt viele Abbildungen Johann Wolfgang von Goethes, aber diese hier ist wohl die bekannteste: ""Goethe in der römisc",goethe_in_der_roemishen_campagna.txt
Gibt es noch andere Bilder von Francesca Salviati?,"Auch bei einem anderen Idealbildnis rätselte man lange, ob der Maler Bartolomeo Veneto (tätig zwischen 1502 und 1530) mit der als Flora gegebenen Frau nicht doch die skandalumwitterte uneheliche Papsttochter Lucrezia Borgia gemeint habe",0.3592438371060892,"Auch bei einem anderen Idealbildnis rätselte man lange, ob der Maler Bartolomeo Veneto (tätig zwischen 1502 und 1530) mit der als Flora gegebenen Frau nicht doch die skandalumwitterte uneheliche Papsttochter Lucrezia Borgia gemeint habe",weibliches_idealbildnis.txt
Gibt es noch andere Bilder von Francesca Salviati?,"Hier sehen Sie eines seiner Meisterwerke, den Frankfurter Kreuzaltar",0.35405576335811145,"st fein und detailreich ausgeführt sind. Hier sehen Sie eines seiner Meisterwerke, den Frankfurter Kreuzaltar. Für diese ungeheuer feine Malerei ersch",kreuzaltar.txt
Gibt es noch andere Bilder von Francesca Salviati?,Lucca-Madonna,0.3441529215240569,"glänzende Oberflächenwirkungen.
Dies zeigt sich deutlich im Bild der Lucca-Madonna in der Unterscheidung verschiedener Materialien. So kommt die Metal",lucca_madonna.txt
Gibt es noch andere Bilder von Francesca Salviati?,"Leider wissen wir nicht, WEN er dargestellt hat, aber man vermutet, dass die junge Frau",0.34381381224772023,"heißt kurz und knapp: Pontormo. Leider wissen wir nicht, WEN er dargestellt hat, aber man vermutet, dass die junge Frau aus Florenz stammte, aus einer",bildnis_einer_dame_in_rot.txt
"
","
"
Was ist Bar African?,"Barriere, aber auch Schranke, Hindernis oder Absperrung",0.6828368446477354,"emälde den Titel „Barrier“ gegeben, was man mit Barriere, aber auch Schranke, Hindernis oder Absperrung übersetzen kann. 
Corinne Wasmuth zeigt uns Di",barrier.txt
Was ist Bar African?,groß,0.5697952391963012,"ie Madonna sehr groß oder das Zimmer sehr klein? Beides richtig, Madonna groß weil ihre Bedeutung hervorgehoben werden soll.
Das kleine Bild Jan van E",lucca_madonna.txt
Was ist Bar African?,eine großformatige Leinwand,0.4584475730570295,"it Schwingungen bei einem Transport. In Fall Tischbein ist es eine großformatige Leinwand. Da muss man aufpassen, dass sie nicht, wenn sie im LKW oder",goethe_in_der_roemishen_campagna.txt
Was ist Bar African?,Simonetta Vespucci,0.45267680567748014," hier dargestellt hat, aber vieles spricht dafür, dass es sich um Simonetta Vespucci handelt. Gelebt hat Simonetta vor gut 500 Jahren in Florenz. Dort",weibliches_idealbildnis.txt
Was ist Bar African?,"„Barrier“ sieht aus, als ob Corinne Wasmuht die Welt in einzelne Bestandteile aufgelöst und zu einer neuen zusammengefügt hätte",0.4356343035442081,"und Technik
„Barrier“ sieht aus, als ob Corinne Wasmuht die Welt in einzelne Bestandteile aufgelöst und zu einer neuen zusammengefügt hätte.
Genauso a",barrier.txt
Was ist Bar African?,Geograph,0.4230368021837271,"kannst du ein Winkelmaß erkennen. All diese Dinge braucht, na??? – ein Geograph. Oder Kartograph. Jemand, der Landkarten von der Erde zeichnet.
Das Ge",der_geograf.txt
Was ist Bar African?,"Großflächige, quer verlaufende Strukturen wirken wie Barrieren, die das Bild vorne abschließen",0.41944473668739507," Blick nicht gesehen haben. Großflächige, quer verlaufende Strukturen wirken wie Barrieren, die das Bild vorne abschließen.
Der Wechsel zwischen Tiefe",barrier.txt
Was ist Bar African?,Weil sie deiner überdrüssig wurde,0.4146907028854556,"hast du mir das angetan? Sagst du nichts mehr?
Sprecher B: Weil sie deiner überdrüssig wurde, du Tor! Deiner Wutausbrüche, Simson. Deiner Gewalttaten!",die_blendung_simsons.txt
Was ist Bar African?,"So wisse, auch die sind schuldig, die nicht eingreifen bei einer Ungerechtigkeit, die nur zusehen und sich gar noch daran laben",0.34930060411618086," Ist es so? So wisse, auch die sind schuldig, die nicht eingreifen bei einer Ungerechtigkeit, die nur zusehen und sich gar noch daran laben.
Sprecher ",die_blendung_simsons.txt
Was ist Bar African?,Schau dir mal Goethes Füße an! Siehst du’s? Goethe hat zwei linke Füße! Außerdem ist der hintere Oberschenkel viel länger als der vordere!,0.33613819156971814,Bild. Schau dir mal Goethes Füße an! Siehst du’s? Goethe hat zwei linke Füße! Außerdem ist der hintere Oberschenkel viel länger als der vordere! Denno,goethe_in_der_roemishen_campagna.txt
"
","
"
Wer ist Simonetta Vespucci?,die Geliebte Giuliano de’Medicis,0.8653226947260998,"Marsyas. Auch deswegen geht man heute davon aus, dass hier die Geliebte Giuliano de’Medicis, Simonetta Vespucci, abgebildet sein könnte. Ihre – auch f",weibliches_idealbildnis.txt
Wer ist Simonetta Vespucci?,"eine in ganz Florenz gepriesene Schönheit – allerdings nicht im Sinne eines Porträts, sondern als idealisierte Kunstfigur einer antiken Nymphe",0.8452856845082994,"ar, eine in ganz Florenz gepriesene Schönheit – allerdings nicht im Sinne eines Porträts, sondern als idealisierte Kunstfigur einer antiken Nymphe. 
d",weibliches_idealbildnis.txt
Wer ist Simonetta Vespucci?,Giuliano de' Medicis Geliebte,0.8169479055484643,"hwelt die Vermutung, bei der Dargestellten könnte es sich um Giuliano de' Medicis Geliebte Simonetta Vespucci handeln. Auch bei einem anderen Idealbil",weibliches_idealbildnis.txt
Wer ist Simonetta Vespucci?,eine wohlhabende Florentinerin – vielleicht eine Medici,0.6459962803578978,te noch nicht geklärt werden. Es dürfte sich um eine wohlhabende Florentinerin – vielleicht eine Medici – gehandelt hat. Ihr Porträt entstand um 1530-,bildnis_einer_dame_in_rot.txt
Wer ist Simonetta Vespucci?,Weil sie deiner überdrüssig wurde,0.45766098024481316,"hast du mir das angetan? Sagst du nichts mehr?
Sprecher B: Weil sie deiner überdrüssig wurde, du Tor! Deiner Wutausbrüche, Simson. Deiner Gewalttaten!",die_blendung_simsons.txt
Wer ist Simonetta Vespucci?,groß,0.4077282814405918,"ie Madonna sehr groß oder das Zimmer sehr klein? Beides richtig, Madonna groß weil ihre Bedeutung hervorgehoben werden soll.
Das kleine Bild Jan van E",lucca_madonna.txt
Wer ist Simonetta Vespucci?,"Ich kenne dich nicht. Weidest du dich genüsslich an meinem Leid? Ist es so? So wisse, auch die sind schuldig, die nicht eingreifen bei einer Ungerechtigkeit, die nur zusehen und sich gar noch daran laben",0.3753426564711406," Ich kenne dich nicht. Weidest du dich genüsslich an meinem Leid? Ist es so? So wisse, auch die sind schuldig, die nicht eingreifen bei einer Ungerechtigkeit, die nur zusehen und sich gar noch daran laben",die_blendung_simsons.txt
Wer ist Simonetta Vespucci?,"Leider wissen wir nicht, WEN er dargestellt hat, aber man vermutet, dass die junge Frau aus Florenz stammte",0.33577624186282856," und knapp: Pontormo. Leider wissen wir nicht, WEN er dargestellt hat, aber man vermutet, dass die junge Frau aus Florenz stammte, aus einer begüterte",bildnis_einer_dame_in_rot.txt
Wer ist Simonetta Vespucci?,"Diese Dame zieht wahrlich die Blicke auf sich. Der zinnoberrote Stoff ihres Kleides, der im satten Kontrast zum Dunkelgrün des Ärmels steht, strahlt den Betrachter förmlich an.",0.3088516649973968,"Diese Dame zieht wahrlich die Blicke auf sich. Der zinnoberrote Stoff ihres Kleides, der im satten Kontrast zum Dunkelgrün des Ärmels steht, strahlt den Betrachter förmlich an.",bildnis_einer_dame_in_rot.txt
Wer ist Simonetta Vespucci?,Schau dir mal Goethes Füße an! Siehst du’s? Goethe hat zwei linke Füße! Außerdem ist der hintere Oberschenkel viel länger als der vordere!,0.3024416814131929,Bild. Schau dir mal Goethes Füße an! Siehst du’s? Goethe hat zwei linke Füße! Außerdem ist der hintere Oberschenkel viel länger als der vordere! Denno,goethe_in_der_roemishen_campagna.txt
"
","
"
Wer sind Simson und Delila?,"Auch Delilah, die den Simson besiegt, ist eine Philisterin",0.6440962286937478,"seiner Kunst gerne als Philister bezeichnete. Auch Delilah, die den Simson besiegt, ist eine Philisterin. Es mag sein, dass hier ein Schlüssel liegt, ",simson_delila.txt
Wer sind Simson und Delila?,Anführer der feindlichen Israeliten,0.6362000799287503,"n der schönen Philisterin Delilah gemalt, die Simson, dem Anführer der feindlichen Israeliten, das Geheimnis seiner Stärke entlockt hat: die niemals g",simson_delila.txt
Wer sind Simson und Delila?,"Simson, der starke Mann, der seine übermenschliche Kraft verlor, nachdem er sich in Delila verliebt hatte und ihr sein Geheimnis verriet: dass man ihn seiner Kraft berauben könne, wenn man ihm die Haare abschnitt",0.5809500607885856,"Simson, der starke Mann, der seine übermenschliche Kraft verlor, nachdem er sich in Delila verliebt hatte und ihr sein Geheimnis verriet: dass man ihn seiner Kraft berauben könne, wenn man ihm die Haare abschnitt",die_blendung_simsons.txt
Wer sind Simson und Delila?,"Simson, der ewig Starke und ewig Leuchtende",0.5517091496631302,"d. Ich will, dass niemand davonkommt. Schon gar nicht Simson, der ewig Starke und ewig Leuchtende. Seine Stärke blendet jeden, und das widert mich an.",simson_delila.txt
Wer sind Simson und Delila?,groß,0.5461947394562563,"ie Madonna sehr groß oder das Zimmer sehr klein? Beides richtig, Madonna groß weil ihre Bedeutung hervorgehoben werden soll.
Das kleine Bild Jan van E",lucca_madonna.txt
Wer sind Simson und Delila?,Weil sie deiner überdrüssig wurde,0.48882041219274225,"hast du mir das angetan? Sagst du nichts mehr?
Sprecher B: Weil sie deiner überdrüssig wurde, du Tor! Deiner Wutausbrüche, Simson. Deiner Gewalttaten!",die_blendung_simsons.txt
Wer sind Simson und Delila?,"Dalilah, die Verbündete von Simsons Feinden, den Philistern",0.4761997418952347,"on und Dalilah gewählt: die Blendung Simsons. Dalilah, die Verbündete von Simsons Feinden, den Philistern, hat den als unbesiegbar geltenden Helden ve",die_blendung_simsons.txt
Wer sind Simson und Delila?,Simonetta Vespucci,0.43683315826494046," hier dargestellt hat, aber vieles spricht dafür, dass es sich um Simonetta Vespucci handelt. Gelebt hat Simonetta vor gut 500 Jahren in Florenz. Dort",weibliches_idealbildnis.txt
Wer sind Simson und Delila?,Geograph,0.41465599606932635,"kannst du ein Winkelmaß erkennen. All diese Dinge braucht, na??? – ein Geograph. Oder Kartograph. Jemand, der Landkarten von der Erde zeichnet.
Das Ge",der_geograf.txt
Wer sind Simson und Delila?,Botticelli,0.3284717264012703, ganz bisschen buckelig – und ernster Blick. Das war damals angesagt. Botticelli hat Simonetta sogar noch blasser gemacht als in Wirklichkeit. Wir hab,weibliches_idealbildnis.txt
"
","
"
War Tischbein selbst in der römischen Campagna?,Simonetta Vespucci,0.4739248093408855," hier dargestellt hat, aber vieles spricht dafür, dass es sich um Simonetta Vespucci handelt. Gelebt hat Simonetta vor gut 500 Jahren in Florenz. Dort",weibliches_idealbildnis.txt
War Tischbein selbst in der römischen Campagna?,"Goethe hatte auf seiner Italienischen Reise 1786 in Rom Station gemacht. Er wohnte bei Tischbein, der sich dank eines Stipendiums dort aufhielt.",0.4511631698359911,"n.
Goethe hatte auf seiner Italienischen Reise 1786 in Rom Station gemacht. Er wohnte bei Tischbein, der sich dank eines Stipendiums dort aufhielt. Ti",goethe_in_der_roemishen_campagna.txt
War Tischbein selbst in der römischen Campagna?,Weil sie deiner überdrüssig wurde,0.44570483106483116,"hast du mir das angetan? Sagst du nichts mehr?
Sprecher B: Weil sie deiner überdrüssig wurde, du Tor! Deiner Wutausbrüche, Simson. Deiner Gewalttaten!",die_blendung_simsons.txt
War Tischbein selbst in der römischen Campagna?,Goethe selbst hat sein Abbild nie im fertigen Zustand gesehen. Tischbein ließ das Werk vermutlich sogar unvollendet.,0.4129829935334877,"nie auf Tauris“.
Goethe selbst hat sein Abbild nie im fertigen Zustand gesehen. Tischbein ließ das Werk vermutlich sogar unvollendet. Wohl nach 1820 g",goethe_in_der_roemishen_campagna.txt
War Tischbein selbst in der römischen Campagna?,"Für Goethe war diese Reise sehr wichtig, denn er war sehr an der alten römischen Geschichte interessiert und sah sich deshalb lauter alte römische Bauwerke an. So bekam er Anregungen für seine Gedichte und Erzählungen.",0.3819144113607787,"Für Goethe war diese Reise sehr wichtig, denn er war sehr an der alten römischen Geschichte interessiert und sah sich deshalb lauter alte römische Bauwerke an. So bekam er Anregungen für seine Gedichte und Erzählungen.",goethe_in_der_roemishen_campagna.txt
War Tischbein selbst in der römischen Campagna?,Geograph,0.35046354979315003,"kannst du ein Winkelmaß erkennen. All diese Dinge braucht, na??? – ein Geograph. Oder Kartograph. Jemand, der Landkarten von der Erde zeichnet.
Das Ge",der_geograf.txt
War Tischbein selbst in der römischen Campagna?,"Leider wissen wir nicht, WEN er dargestellt hat, aber man vermutet, dass die junge Frau aus Florenz",0.31949013680832905,"kurz und knapp: Pontormo. Leider wissen wir nicht, WEN er dargestellt hat, aber man vermutet, dass die junge Frau aus Florenz stammte, aus einer begüt",bildnis_einer_dame_in_rot.txt
War Tischbein selbst in der römischen Campagna?,"Du fragst dich vielleicht, warum Botticelli sie nicht einfach fröhlicher gemalt hat. Die Nase hätte er etwas kaschieren können! Und hätte er den Hintergrund heller gemalt, dann sähe Simonetta nicht so bleich aus.",0.2869431315898311,"Du fragst dich vielleicht, warum Botticelli sie nicht einfach fröhlicher gemalt hat. Die Nase hätte er etwas kaschieren können! Und hätte er den Hintergrund heller gemalt, dann sähe Simonetta nicht so bleich aus.",weibliches_idealbildnis.txt
War Tischbein selbst in der römischen Campagna?,"So wisse, auch die sind schuldig, die nicht eingreifen bei einer Ungerechtigkeit, die nur zusehen und sich gar noch daran laben",0.27907207548945484," Ist es so? So wisse, auch die sind schuldig, die nicht eingreifen bei einer Ungerechtigkeit, die nur zusehen und sich gar noch daran laben.
Sprecher ",die_blendung_simsons.txt
War Tischbein selbst in der römischen Campagna?,"Leider wissen wir nicht, WEN er dargestellt hat, aber man vermutet, dass die junge Frau aus Florenz stammte, aus einer begüterten Familie. Dass sie reich war, siehst Du nicht nur an dem Kleid mit den Ärmeln aus teurem Samt und an ihrem Schmuck; auch der Stuhl ist mit Samt bezogen und hat eine goldene Verzierung an der Armlehne. Wie viele andere vornehme Damen besitzt auch diese hier ein kleines Schoßhündchen, das uns wachsam ins Auge blickt.",0.278342725369343," Leider wissen wir nicht, WEN er dargestellt hat, aber man vermutet, dass die junge Frau aus Florenz stammte, aus einer begüterten Familie. Dass sie reich war, siehst Du nicht nur an dem Kleid mit den Ärmeln aus teurem Samt und an ihrem Schmuck; auch der Stuhl ist mit Samt bezogen und hat eine goldene Verzierung an der Armlehne. Wie viele andere vornehme Damen besitzt auch diese hier ein kleines Schoßhündchen, das uns wachsam ins Auge blickt.",bildnis_einer_dame_in_rot.txt
"
","
"
Ist das weibliche Idealbildnis auch auf heutige Schönheitsideale anwendbar?,"Heute geht man – nach einer langen Kontroverse zwischen den Kunsthistorikern –davon aus, dass das Porträt die Züge der Simonetta Vespucci trägt. Allerdings ist sie idealisiert dargestellt.",0.6992076644885709,"Heute geht man – nach einer langen Kontroverse zwischen den Kunsthistorikern –davon aus, dass das Porträt die Züge der Simonetta Vespucci trägt. Allerdings ist sie idealisiert dargestellt.",weibliches_idealbildnis.txt
Ist das weibliche Idealbildnis auch auf heutige Schönheitsideale anwendbar?,"Wir haben heute ganz andere Vorstellungen davon, was schön ist.",0.6825049227688866,"r noch blasser gemacht als in Wirklichkeit. Wir haben heute ganz andere Vorstellungen davon, was schön ist. Überleg mal, wie du dich malen lassen würd",weibliches_idealbildnis.txt
Ist das weibliche Idealbildnis auch auf heutige Schönheitsideale anwendbar?,"Ihre – auch für damalige Verhältnisse – eher phantastische Ausstaffierung spricht keineswegs gegen diese Identifikation, solche idealisierten Darstellungen waren zu dieser Zeit durchaus üblich.",0.6267887021138742," Ihre – auch für damalige Verhältnisse – eher phantastische Ausstaffierung spricht keineswegs gegen diese Identifikation, solche idealisierten Darstellungen waren zu dieser Zeit durchaus üblich.",weibliches_idealbildnis.txt
Ist das weibliche Idealbildnis auch auf heutige Schönheitsideale anwendbar?,"eher ein bürgerliches Schönheitsideal verkörpert, als das einer hoheitsvollen Gottesmutter",0.5582434764689921,"te mit einer Marienfigur, die eher ein bürgerliches Schönheitsideal verkörpert, als das einer hoheitsvollen Gottesmutter. Für den im mystischen Denken",lucca_madonna.txt
Ist das weibliche Idealbildnis auch auf heutige Schönheitsideale anwendbar?,groß,0.5483412594746625,"ie Madonna sehr groß oder das Zimmer sehr klein? Beides richtig, Madonna groß weil ihre Bedeutung hervorgehoben werden soll.
Das kleine Bild Jan van E",lucca_madonna.txt
Ist das weibliche Idealbildnis auch auf heutige Schönheitsideale anwendbar?,Weil sie deiner überdrüssig wurde,0.45250892472564164,"hast du mir das angetan? Sagst du nichts mehr?
Sprecher B: Weil sie deiner überdrüssig wurde, du Tor! Deiner Wutausbrüche, Simson. Deiner Gewalttaten!",die_blendung_simsons.txt
Ist das weibliche Idealbildnis auch auf heutige Schönheitsideale anwendbar?,"Also, ICH finde ja, diese Dame in Rot schaut uns ziemlich kühl an - als ob sie gleich fragen würde: Hausaufgaben gemacht? Zimmer aufgeräumt? Bei IHR ist natürlich alles perfekt: Kleid, Schmuck, Frisur, alles tadellos.",0.3412209965755127,"
Also, ICH finde ja, diese Dame in Rot schaut uns ziemlich kühl an - als ob sie gleich fragen würde: Hausaufgaben gemacht? Zimmer aufgeräumt? Bei IHR ist natürlich alles perfekt: Kleid, Schmuck, Frisur, alles tadellos.",bildnis_einer_dame_in_rot.txt
Ist das weibliche Idealbildnis auch auf heutige Schönheitsideale anwendbar?,"Weitgehend einig ist sich die Forschung über Jans nach 1432 entstandenes Euvre, das sich um insgesamt neun signierte und datierte Bilder gruppiert. Umstritten ist demgegenüber die Frage nach Jans früherer Tätigkeit, die vor allem mit den Miniaturen des sogenannten Turin-Mailänder Stundenbuches und einer Reihe erzählender Tafelbilder wie dem New nicht zuletzt im Yorker Diptychon in Verbindung gebracht wird.",0.3355215566030077," Weitgehend einig ist sich die Forschung über Jans nach 1432 entstandenes Euvre, das sich um insgesamt neun signierte und datierte Bilder gruppiert. Umstritten ist demgegenüber die Frage nach Jans früherer Tätigkeit, die vor allem mit den Miniaturen des sogenannten Turin-Mailänder Stundenbuches und einer Reihe erzählender Tafelbilder wie dem New nicht zuletzt im Yorker Diptychon in Verbindung gebracht wird.",lucca_madonna.txt
Ist das weibliche Idealbildnis auch auf heutige Schönheitsideale anwendbar?,"Er beherrscht jedoch meisterhaft die künstlerischen Techniken seiner Zeit und wendet sie auf kluge Weise an. Hier gelingt es ihm, den vornehmen, stolz in sich ruhenden Charakter der Dame herauszuarbeiten",0.3346877285603573," Er beherrscht jedoch meisterhaft die künstlerischen Techniken seiner Zeit und wendet sie auf kluge Weise an. Hier gelingt es ihm, den vornehmen, stolz in sich ruhenden Charakter der Dame herauszuarbeiten",bildnis_einer_dame_in_rot.txt
Ist das weibliche Idealbildnis auch auf heutige Schönheitsideale anwendbar?,"Diese Dame zieht wahrlich die Blicke auf sich. Der zinnoberrote Stoff ihres Kleides, der im satten Kontrast zum Dunkelgrün des Ärmels steht, strahlt den Betrachter förmlich an.",0.31397368865760217,"Diese Dame zieht wahrlich die Blicke auf sich. Der zinnoberrote Stoff ihres Kleides, der im satten Kontrast zum Dunkelgrün des Ärmels steht, strahlt den Betrachter förmlich an.",bildnis_einer_dame_in_rot.txt
"
","
"
"Was hat Monet dazu bewogen, eine Szene aus dem Alltag zu malen?",groß,0.547503309480429,"ie Madonna sehr groß oder das Zimmer sehr klein? Beides richtig, Madonna groß weil ihre Bedeutung hervorgehoben werden soll.
Das kleine Bild Jan van E",lucca_madonna.txt
"Was hat Monet dazu bewogen, eine Szene aus dem Alltag zu malen?",Um die Blendung Simsons darzustellen,0.5387623872959509,"d tötete, als die er zu seinen Lebzeiten getötet hatte. 
Um die Blendung Simsons darzustellen, griff der Maler 1636 zu einem Format von über 2,50 Mete",die_blendung_simsons.txt
"Was hat Monet dazu bewogen, eine Szene aus dem Alltag zu malen?",Weil sie deiner überdrüssig wurde,0.46230308681268867,"hast du mir das angetan? Sagst du nichts mehr?
Sprecher B: Weil sie deiner überdrüssig wurde, du Tor! Deiner Wutausbrüche, Simson. Deiner Gewalttaten!",die_blendung_simsons.txt
"Was hat Monet dazu bewogen, eine Szene aus dem Alltag zu malen?",Simonetta Vespucci,0.46035051764123514," hier dargestellt hat, aber vieles spricht dafür, dass es sich um Simonetta Vespucci handelt. Gelebt hat Simonetta vor gut 500 Jahren in Florenz. Dort",weibliches_idealbildnis.txt
"Was hat Monet dazu bewogen, eine Szene aus dem Alltag zu malen?",Er wollte die Welt mit den Augen der Tiere sehen,0.3785837560170128,"ubilden, sondern sich in die Tiere hineinzufühlen. Er wollte die Welt mit den Augen der Tiere sehen:
„Wie armselig seelenlos ist unsere Konvention, Ti",liegender_hund_im_schnee.txt
"Was hat Monet dazu bewogen, eine Szene aus dem Alltag zu malen?",griechischen Mythologie,0.3590935317997349,wie das Schmuckstück um ihren Hals: Es zeigt eine Szene aus der griechischen Mythologie. In allen Lebensbereichen nahmen sich die wohlhabenden Florent,weibliches_idealbildnis.txt
"Was hat Monet dazu bewogen, eine Szene aus dem Alltag zu malen?","Und als Vermeer dies Bild malte, erfuhren die Menschen immer mehr über die weite Welt, einmal, weil es schon einen gut organisierten Handel mit Länder wie Indien und Indonesien oder Amerika und Afrika gab, und zum anderen unternahmen die Europäer Expeditionen in die entferntesten Winkel der Erde, um endlich den ganzen Globus kennenzulernen.",0.33504968106833316,"Und als Vermeer dies Bild malte, erfuhren die Menschen immer mehr über die weite Welt, einmal, weil es schon einen gut organisierten Handel mit Länder wie Indien und Indonesien oder Amerika und Afrika gab, und zum anderen unternahmen die Europäer Expeditionen in die entferntesten Winkel der Erde, um endlich den ganzen Globus kennenzulernen.",der_geograf.txt
"Was hat Monet dazu bewogen, eine Szene aus dem Alltag zu malen?","Leider wissen wir nicht, WEN er dargestellt hat, aber man vermutet, dass die junge Frau aus Florenz stammte, aus einer begüterten Familie.",0.317064477183502,"ormo. Leider wissen wir nicht, WEN er dargestellt hat, aber man vermutet, dass die junge Frau aus Florenz stammte, aus einer begüterten Familie. Dass ",bildnis_einer_dame_in_rot.txt
"Was hat Monet dazu bewogen, eine Szene aus dem Alltag zu malen?","Leider wissen wir nicht, WEN er dargestellt hat, aber man vermutet",0.3062195025962279,"der Maler heißt kurz und knapp: Pontormo. Leider wissen wir nicht, WEN er dargestellt hat, aber man vermutet, dass die junge Frau aus Florenz stammte,",bildnis_einer_dame_in_rot.txt
"Was hat Monet dazu bewogen, eine Szene aus dem Alltag zu malen?","Man möchte die weißen Flecken vom Globus tilgen, man möchte den Dingen auf den Grund gehen mit den rationalen Mitteln moderner Wissenschaft.",0.30609747063114173,"ist. Man möchte die weißen Flecken vom Globus tilgen, man möchte den Dingen auf den Grund gehen mit den rationalen Mitteln moderner Wissenschaft. Verm",der_geograf.txt
"
","
"
Wieso trägt der Geograf ein solches Gewand?,"Obwohl der Geograph ihn ohne besondere Absicht dort hingestellt hat, wirkt er zugleich, wie auch der Stechzirkel, als Attribut, welches den Wissenschaftler identifiziert",0.6008132311357759," Obwohl der Geograph ihn ohne besondere Absicht dort hingestellt hat, wirkt er zugleich, wie auch der Stechzirkel, als Attribut, welches den Wissenschaftler identifiziert",der_geograf.txt
Wieso trägt der Geograf ein solches Gewand?,Es zeigt eine Szene aus der griechischen Mythologie,0.5915667929238405,tike. Genauso wie das Schmuckstück um ihren Hals: Es zeigt eine Szene aus der griechischen Mythologie. In allen Lebensbereichen nahmen sich die wohlha,weibliches_idealbildnis.txt
Wieso trägt der Geograf ein solches Gewand?,"Unser „Geograph“ zeichnet sich, wie alle Vermeers, durch eine erstaunliche Genauigkeit der Wiedergabe aus, die beinahe etwas Fotografisches hat. Ein solches wissenschaftliches, objektives Abbild der Wirklichkeit zählte sicherlich zu Vermeers künstlerischen Zielsetzungen",0.5608670416633016,"Unser „Geograph“ zeichnet sich, wie alle Vermeers, durch eine erstaunliche Genauigkeit der Wiedergabe aus, die beinahe etwas Fotografisches hat. Ein solches wissenschaftliches, objektives Abbild der Wirklichkeit zählte sicherlich zu Vermeers künstlerischen Zielsetzungen",der_geograf.txt
Wieso trägt der Geograf ein solches Gewand?,"Obwohl der Geograph ihn ohne besondere Absicht dort hingestellt hat, wirkt er zugleich, wie auch der Stechzirkel, als Attribut, welches den Wissenschaftler identifiziert.",0.5587247906252758,"Obwohl der Geograph ihn ohne besondere Absicht dort hingestellt hat, wirkt er zugleich, wie auch der Stechzirkel, als Attribut, welches den Wissenschaftler identifiziert.",der_geograf.txt
Wieso trägt der Geograf ein solches Gewand?,"Die Figuren auf der linken Seite und im Vordergrund tragen Brustpanzer und Beinschienen wie Polizisten, die sich für eine Konfrontation mit Demonstranten schützen",0.49417745566569216,"Die Figuren auf der linken Seite und im Vordergrund tragen Brustpanzer und Beinschienen wie Polizisten, die sich für eine Konfrontation mit Demonstranten schützen",horde.txt
Wieso trägt der Geograf ein solches Gewand?,Weil sie deiner überdrüssig wurde,0.4736041406380757,"hast du mir das angetan? Sagst du nichts mehr?
Sprecher B: Weil sie deiner überdrüssig wurde, du Tor! Deiner Wutausbrüche, Simson. Deiner Gewalttaten!",die_blendung_simsons.txt
Wieso trägt der Geograf ein solches Gewand?,"Die Figuren auf der linken Seite und im Vordergrund tragen Brustpanzer und Beinschienen wie Polizisten, die sich für eine Konfrontation mit Demonstranten schützen",0.46148535744057545,"Die Figuren auf der linken Seite und im Vordergrund tragen Brustpanzer und Beinschienen wie Polizisten, die sich für eine Konfrontation mit Demonstranten schützen",horde.txt
Wieso trägt der Geograf ein solches Gewand?,Simonetta Vespucci,0.4350508837824754," hier dargestellt hat, aber vieles spricht dafür, dass es sich um Simonetta Vespucci handelt. Gelebt hat Simonetta vor gut 500 Jahren in Florenz. Dort",weibliches_idealbildnis.txt
Wieso trägt der Geograf ein solches Gewand?,Man will künstlich- kunstvoll gestalten und nicht einfach nur Natur nachahmen,0.387513739504217,"e Art und Weise, ein gewisses Etwas. Man will künstlich- kunstvoll gestalten und nicht einfach nur Natur nachahmen. 
Gerade die FLORENTINISCHEN Maler ",bildnis_einer_dame_in_rot.txt
Wieso trägt der Geograf ein solches Gewand?,"Er demonstriert seine Vertrautheit mit der Bildtradition, hier Leonardos, und zeigt gleichzeitig kunstfertig seine eigene, ganz persönliche Handschrift",0.3715824034945426," Er demonstriert seine Vertrautheit mit der Bildtradition, hier Leonardos, und zeigt gleichzeitig kunstfertig seine eigene, ganz persönliche Handschrift",bildnis_einer_dame_in_rot.txt
"
","
"
Wieso hat Marc einen Hund als Motiv gewählt?,"als wollte er uns warnen, nicht zu nahe zu kommen",0.7209710573649931,"einer Schoßhund beobachtet uns und hebt die Pfote, als wollte er uns warnen, nicht zu nahe zu kommen.
Also, ICH finde ja, diese Dame in Rot schaut uns",bildnis_einer_dame_in_rot.txt
Wieso hat Marc einen Hund als Motiv gewählt?,"Für Franz Marc verkörperten Tiere das Dasein im Einklang mit der Natur. Sie entsprachen seiner Idealvorstellung eines reinen und ursprünglichen Lebens. Ohne zivilisatorischen Zwängen unterworfen zu sein, ohne Bewusstsein von Vergangenheit und Zukunft,  ist das Tier hier und jetzt sich selbst genug.",0.6909515210761492,"
Für Franz Marc verkörperten Tiere das Dasein im Einklang mit der Natur. Sie entsprachen seiner Idealvorstellung eines reinen und ursprünglichen Lebens. Ohne zivilisatorischen Zwängen unterworfen zu sein, ohne Bewusstsein von Vergangenheit und Zukunft,  ist das Tier hier und jetzt sich selbst genug.",liegender_hund_im_schnee.txt
Wieso hat Marc einen Hund als Motiv gewählt?,"Seine Absicht war nicht, Tiere einfach abzubilden, sondern sich in die Tiere hineinzufühlen. Er wollte die Welt mit den Augen der Tiere sehen:
„Wie armselig seelenlos ist unsere Konvention, Tiere in eine Landschaft zu setzen, die unseren Augen zugehört, statt uns in die Seele des Tieres zu versenken, um dessen Bildkreis zu erraten.“
Für den ‚Liegenden Hund im Schnee‘ hat Marc seinen sibirischen Schäferhund Russi",0.6179116117583182," Seine Absicht war nicht, Tiere einfach abzubilden, sondern sich in die Tiere hineinzufühlen. Er wollte die Welt mit den Augen der Tiere sehen:
„Wie armselig seelenlos ist unsere Konvention, Tiere in eine Landschaft zu setzen, die unseren Augen zugehört, statt uns in die Seele des Tieres zu versenken, um dessen Bildkreis zu erraten.“
Für den ‚Liegenden Hund im Schnee‘ hat Marc seinen sibirischen Schäferhund Russi",liegender_hund_im_schnee.txt
Wieso hat Marc einen Hund als Motiv gewählt?,"Er versucht, die Perspektive des Tieres einzunehmen, will die Szene sozusagen mit den Augen eines Hundes malen.",0.593117871760342,"c geht noch weiter: Er versucht, die Perspektive des Tieres einzunehmen, will die Szene sozusagen mit den Augen eines Hundes malen. Dazu sagt er selbs",liegender_hund_im_schnee.txt
Wieso hat Marc einen Hund als Motiv gewählt?,"Der größte links außen, der mit etwas Abstand zur dicht gedrängten Gruppe steht, hält einen Hund an der Leine",0.5269260117906296,"ner, überlebensgroß. Der größte links außen, der mit etwas Abstand zur dicht gedrängten Gruppe steht, hält einen Hund an der Leine. Die Horde ist mit ",horde.txt
Wieso hat Marc einen Hund als Motiv gewählt?,Weil sie deiner überdrüssig wurde,0.49742427325340094,"hast du mir das angetan? Sagst du nichts mehr?
Sprecher B: Weil sie deiner überdrüssig wurde, du Tor! Deiner Wutausbrüche, Simson. Deiner Gewalttaten!",die_blendung_simsons.txt
Wieso hat Marc einen Hund als Motiv gewählt?,"Ganz sicher hat Pontormo von der Dame genaue Anweisungen erhalten, wie er sie malen sollte.",0.48677480690430325," uns wachsam ins Auge blickt.
Ganz sicher hat Pontormo von der Dame genaue Anweisungen erhalten, wie er sie malen sollte. Zunächst sollte man erkennen",bildnis_einer_dame_in_rot.txt
Wieso hat Marc einen Hund als Motiv gewählt?,"Der größte links außen, der mit etwas Abstand zur dicht gedrängten Gruppe steht, hält einen Schäferhund an der Leine",0.4160649823594103,"chön bedrohlich. Der größte links außen, der mit etwas Abstand zur dicht gedrängten Gruppe steht, hält einen Schäferhund an der Leine. Ist er der Anfü",horde.txt
Wieso hat Marc einen Hund als Motiv gewählt?,Simonetta Vespucci,0.3949409522731107," hier dargestellt hat, aber vieles spricht dafür, dass es sich um Simonetta Vespucci handelt. Gelebt hat Simonetta vor gut 500 Jahren in Florenz. Dort",weibliches_idealbildnis.txt
Wieso hat Marc einen Hund als Motiv gewählt?,"Der größte links außen, der mit etwas Abstand zur dicht gedrängten Gruppe steht, hält einen Hund an der Leine",0.3887698439477848,"ner, überlebensgroß. Der größte links außen, der mit etwas Abstand zur dicht gedrängten Gruppe steht, hält einen Hund an der Leine. Ist er der Anführe",horde.txt
"
","
"
Spielte Beckmann selbst auch Saxofon?,"Ob man dem linken Saxophon solche Töne entlocken könnte, ist fraglich: Es scheint doch zu sehr verbogen.",0.498462670670504," zurückgekauft werden.
Ob man dem linken Saxophon solche Töne entlocken könnte, ist fraglich: Es scheint doch zu sehr verbogen. Aber es bringt Bewegun",stilleben_mit_saxophon.txt
Spielte Beckmann selbst auch Saxofon?,Simonetta Vespucci,0.4670391572379521," hier dargestellt hat, aber vieles spricht dafür, dass es sich um Simonetta Vespucci handelt. Gelebt hat Simonetta vor gut 500 Jahren in Florenz. Dort",weibliches_idealbildnis.txt
Spielte Beckmann selbst auch Saxofon?,Weil sie deiner überdrüssig wurde,0.43802979505101564,"hast du mir das angetan? Sagst du nichts mehr?
Sprecher B: Weil sie deiner überdrüssig wurde, du Tor! Deiner Wutausbrüche, Simson. Deiner Gewalttaten!",die_blendung_simsons.txt
Spielte Beckmann selbst auch Saxofon?,"Der hochmusikalische Beckmann widmete das Bild dem Jazz der 20er Jahre, in dem das Saxofon zu den Hauptinstrumenten zählt",0.3942393031454609,"d Formen dazu. Der hochmusikalische Beckmann widmete das Bild dem Jazz der 20er Jahre, in dem das Saxofon zu den Hauptinstrumenten zählt.
Er malte die",stilleben_mit_saxophon.txt
Spielte Beckmann selbst auch Saxofon?,"So wisse, auch die sind schuldig, die nicht eingreifen bei einer Ungerechtigkeit, die nur zusehen und sich gar noch daran laben",0.2929109094016778," Ist es so? So wisse, auch die sind schuldig, die nicht eingreifen bei einer Ungerechtigkeit, die nur zusehen und sich gar noch daran laben.
Sprecher ",die_blendung_simsons.txt
Spielte Beckmann selbst auch Saxofon?,"Du fragst dich vielleicht, warum Botticelli sie nicht einfach fröhlicher gemalt hat. Die Nase hätte er etwas kaschieren können! Und hätte er den Hintergrund heller gemalt, dann sähe Simonetta nicht so bleich aus.",0.2925437323249935,"Du fragst dich vielleicht, warum Botticelli sie nicht einfach fröhlicher gemalt hat. Die Nase hätte er etwas kaschieren können! Und hätte er den Hintergrund heller gemalt, dann sähe Simonetta nicht so bleich aus.",weibliches_idealbildnis.txt
Spielte Beckmann selbst auch Saxofon?,Schau dir mal Goethes Füße an! Siehst du’s? Goethe hat zwei linke Füße! Außerdem ist der hintere Oberschenkel viel länger als der vordere!,0.2909421072968592,Bild. Schau dir mal Goethes Füße an! Siehst du’s? Goethe hat zwei linke Füße! Außerdem ist der hintere Oberschenkel viel länger als der vordere! Denno,goethe_in_der_roemishen_campagna.txt
Spielte Beckmann selbst auch Saxofon?,"Goethe selbst war mit dem Gemälde ganz  zufrieden, er fand es nur zu groß.",0.2840735041748956,"mmt alles noch von den alten Römern. 
Goethe selbst war mit dem Gemälde ganz  zufrieden, er fand es nur zu groß. So schrieb er in einem Brief nach Hau",goethe_in_der_roemishen_campagna.txt
Spielte Beckmann selbst auch Saxofon?,"Wie aber kann man mit Sicherheit feststellen, ob ein Vermeer echt ist – oder vielleicht",0.2768275309357487,"en, damit man ihm auch glaubte.
Wie aber kann man mit Sicherheit feststellen, ob ein Vermeer echt ist – oder vielleicht ein weiterer van Meegeren?
Nac",der_geograf.txt
Spielte Beckmann selbst auch Saxofon?,"Wer hält das auseinander, wer sichert das ab, wenn der Tag vorbei ist? Wer versichert mir, dass ich auf der richtigen Seite stehe.",0.27050116928862367,"ie Opfer. Wer hält das auseinander, wer sichert das ab, wenn der Tag vorbei ist? Wer versichert mir, dass ich auf der richtigen Seite stehe.
Gitarrenm",horde.txt
"
","
"
Hat Beckmann selbst auch Saxophon gespielt?,"Ob man dem linken Saxophon solche Töne entlocken könnte, ist fraglich: Es scheint doch zu sehr verbogen.",0.6706243425462574," zurückgekauft werden.
Ob man dem linken Saxophon solche Töne entlocken könnte, ist fraglich: Es scheint doch zu sehr verbogen. Aber es bringt Bewegun",stilleben_mit_saxophon.txt
Hat Beckmann selbst auch Saxophon gespielt?,Weil sie deiner überdrüssig wurde,0.4290983209976077,"hast du mir das angetan? Sagst du nichts mehr?
Sprecher B: Weil sie deiner überdrüssig wurde, du Tor! Deiner Wutausbrüche, Simson. Deiner Gewalttaten!",die_blendung_simsons.txt
Hat Beckmann selbst auch Saxophon gespielt?,"Der hochmusikalische Beckmann widmete das Bild dem Jazz der 20er Jahre, in dem das Saxofon zu den Hauptinstrumenten zählt",0.3968294661054683,"d Formen dazu. Der hochmusikalische Beckmann widmete das Bild dem Jazz der 20er Jahre, in dem das Saxofon zu den Hauptinstrumenten zählt.
Er malte die",stilleben_mit_saxophon.txt
Hat Beckmann selbst auch Saxophon gespielt?,"Wie aber kann man mit Sicherheit feststellen, ob ein Vermeer echt ist – oder vielleicht ein",0.3147325548352648,", damit man ihm auch glaubte.
Wie aber kann man mit Sicherheit feststellen, ob ein Vermeer echt ist – oder vielleicht ein weiterer van Meegeren?
Nach ",der_geograf.txt
Hat Beckmann selbst auch Saxophon gespielt?,Schau dir mal Goethes Füße an! Siehst du’s? Goethe hat zwei linke Füße! Außerdem ist der hintere Oberschenkel viel länger als der vordere!,0.2983402346912836,Bild. Schau dir mal Goethes Füße an! Siehst du’s? Goethe hat zwei linke Füße! Außerdem ist der hintere Oberschenkel viel länger als der vordere! Denno,goethe_in_der_roemishen_campagna.txt
Hat Beckmann selbst auch Saxophon gespielt?,"Wer hält das auseinander, wer sichert das ab, wenn der Tag vorbei ist? Wer versichert mir, dass ich auf der richtigen Seite stehe.",0.2832018220090792,"ie Opfer. Wer hält das auseinander, wer sichert das ab, wenn der Tag vorbei ist? Wer versichert mir, dass ich auf der richtigen Seite stehe.
Gitarrenm",horde.txt
Hat Beckmann selbst auch Saxophon gespielt?,"Goethe selbst war mit dem Gemälde ganz  zufrieden, er fand es nur zu groß.",0.28282193819462864,"mmt alles noch von den alten Römern. 
Goethe selbst war mit dem Gemälde ganz  zufrieden, er fand es nur zu groß. So schrieb er in einem Brief nach Hau",goethe_in_der_roemishen_campagna.txt
Hat Beckmann selbst auch Saxophon gespielt?,"Beckmann malt hier aber nicht nur eine Hommage an ein Instrument, sondern vielmehr an einen Lebensstil. Die Worte „Bar African“, der Kopf eines Farbigen auf der Zeitung, die Instrumente, der ganze schwingende Bildeindruck: Das alles rühmt die wilde und experimentierfreudige Lebenslust, die in den europäischen Metropolen in den 20ern Einzug hielt.
Auf den Bildern Max Beckmanns finden sich immer wieder Musikinstrumente. Das """,0.278321246910399,"
Beckmann malt hier aber nicht nur eine Hommage an ein Instrument, sondern vielmehr an einen Lebensstil. Die Worte „Bar African“, der Kopf eines Farbigen auf der Zeitung, die Instrumente, der ganze schwingende Bildeindruck: Das alles rühmt die wilde und experimentierfreudige Lebenslust, die in den europäischen Metropolen in den 20ern Einzug hielt.
Auf den Bildern Max Beckmanns finden sich immer wieder Musikinstrumente. Das """,stilleben_mit_saxophon.txt
Hat Beckmann selbst auch Saxophon gespielt?,"Ich kenne dich nicht. Weidest du dich genüsslich an meinem Leid? Ist es so? So wisse, auch die sind schuldig, die nicht eingreifen bei einer Ungerechtigkeit, die nur zusehen und sich gar noch daran laben",0.2772816846037784," Ich kenne dich nicht. Weidest du dich genüsslich an meinem Leid? Ist es so? So wisse, auch die sind schuldig, die nicht eingreifen bei einer Ungerechtigkeit, die nur zusehen und sich gar noch daran laben",die_blendung_simsons.txt
Hat Beckmann selbst auch Saxophon gespielt?,"Wir wissen nicht genau, mit wem wir es hier zu tun haben.
Die Gestalten von Daniel Richters „Horde“ haben etwas Unmenschliches. Sie könnten fast aus einem Horrorfilm entsprungen sein. Es sind Wesen mit maskenhaften Gesichtern und Augen, die im Dunkeln wie kalte Scheinwerfer leuchten.  
Und wir stehen auf der anderen Seite. Aber sind wir die Gegner? – Oder die Opfer?",0.26867501513747016,"Wir wissen nicht genau, mit wem wir es hier zu tun haben.
Die Gestalten von Daniel Richters „Horde“ haben etwas Unmenschliches. Sie könnten fast aus einem Horrorfilm entsprungen sein. Es sind Wesen mit maskenhaften Gesichtern und Augen, die im Dunkeln wie kalte Scheinwerfer leuchten.  
Und wir stehen auf der anderen Seite. Aber sind wir die Gegner? – Oder die Opfer?",horde.txt
"
","
"
Womit hat Delila Simson die Haare abgeschnitten?,einem perlengeschmückten Brautdiadem,0.6736681362407978,it über die Schultern fallenden blonden Haare werden von einem perlengeschmückten Brautdiadem zusammengehalten. Das Kind hält einen Apfel in seiner li,lucca_madonna.txt
Womit hat Delila Simson die Haare abgeschnitten?,die Schere,0.6176959561068238,"lenarmband geschmückt, hell erleuchtet das eigentliche Tatinstrument: die Schere.
Übrigens hat sich Simson später gerächt. Die Philister warfen ihn da",die_blendung_simsons.txt
Womit hat Delila Simson die Haare abgeschnitten?,Weil sie deiner überdrüssig wurde,0.6079561040197818,"hast du mir das angetan? Sagst du nichts mehr?
Sprecher B: Weil sie deiner überdrüssig wurde, du Tor! Deiner Wutausbrüche, Simson. Deiner Gewalttaten!",die_blendung_simsons.txt
Womit hat Delila Simson die Haare abgeschnitten?,im Schlaf,0.6073422059050457,"ehen Sie Delila, in den Händen die Schere und das Haar. Sie hat es ihm im Schlaf abgeschnitten und den von Gott Geweihten so seiner übernatürlichen Kr",die_blendung_simsons.txt
Womit hat Delila Simson die Haare abgeschnitten?,Als Samson nach dem Liebesakt eingeschlafen ist,0.6019319381989069,"tlockt hat: die niemals geschnittenen langen Haare. Als Samson nach dem Liebesakt eingeschlafen ist, schneidet sie ihm die Locken ab. Der Maler stellt",simson_delila.txt
Womit hat Delila Simson die Haare abgeschnitten?,groß,0.5492959520747941,"ie Madonna sehr groß oder das Zimmer sehr klein? Beides richtig, Madonna groß weil ihre Bedeutung hervorgehoben werden soll.
Das kleine Bild Jan van E",lucca_madonna.txt
Womit hat Delila Simson die Haare abgeschnitten?,"rief einen, der ihm die sieben Locken seines Hauptes abschnitt",0.4971363727188821,"sie ließ ihn einschlafen in ihrem Schoß und rief einen, der ihm die sieben Locken seines Hauptes abschnitt. Und sie fing an, ihn zu bezwingen – da war",simson_delila.txt
Womit hat Delila Simson die Haare abgeschnitten?,vom Rahmen,0.4824688393014878,"eppich, der die Stufen ihres Thrones bedeckt. Teppich und Raum werden vom Rahmen abgeschnitten. Dies bewirkt, dass der Betrachter förmlich in das Bild",lucca_madonna.txt
Womit hat Delila Simson die Haare abgeschnitten?,eine Knarre,0.48202681225827304," die Musik, die dann leiser gefadet wird
Sprecher A: Die Wahrheit ist eine Knarre. Blau schwillt euch der Kamm. Ihr bringt selbst Lichtbögen zum Schme",horde.txt
Womit hat Delila Simson die Haare abgeschnitten?,Simonetta Vespucci,0.38514399029537577," hier dargestellt hat, aber vieles spricht dafür, dass es sich um Simonetta Vespucci handelt. Gelebt hat Simonetta vor gut 500 Jahren in Florenz. Dort",weibliches_idealbildnis.txt
"
","
"
Wieso malt Franz Marc immer Tiere?,"Für Franz Marc verkörperten Tiere das Dasein im Einklang mit der Natur. Sie entsprachen seiner Idealvorstellung eines reinen und ursprünglichen Lebens. Ohne zivilisatorischen Zwängen unterworfen zu sein, ohne Bewusstsein von Vergangenheit und Zukunft,  ist das Tier hier und jetzt sich selbst genug.",0.7168448440398212,"
Für Franz Marc verkörperten Tiere das Dasein im Einklang mit der Natur. Sie entsprachen seiner Idealvorstellung eines reinen und ursprünglichen Lebens. Ohne zivilisatorischen Zwängen unterworfen zu sein, ohne Bewusstsein von Vergangenheit und Zukunft,  ist das Tier hier und jetzt sich selbst genug.",liegender_hund_im_schnee.txt
Wieso malt Franz Marc immer Tiere?,"Seine Absicht war nicht, Tiere einfach abzubilden, sondern sich in die Tiere hineinzufühlen.",0.6543358821512685,"n ganz besonderer Tiermaler. Seine Absicht war nicht, Tiere einfach abzubilden, sondern sich in die Tiere hineinzufühlen. Er wollte die Welt mit den A",liegender_hund_im_schnee.txt
Wieso malt Franz Marc immer Tiere?,groß weil ihre Bedeutung hervorgehoben werden soll,0.6292416397446625,"er das Zimmer sehr klein? Beides richtig, Madonna groß weil ihre Bedeutung hervorgehoben werden soll.
Das kleine Bild Jan van Eycks ist eines der groß",lucca_madonna.txt
Wieso malt Franz Marc immer Tiere?,Das Beeindruckende an den Tierbildern von Marc ist ihre Harmonie.,0.5750037437183054,"chen Museumsverein zurück erworben werden.
Das Beeindruckende an den Tierbildern von Marc ist ihre Harmonie. Diesen Hund mag man sofort, wie er so uns",liegender_hund_im_schnee.txt
Wieso malt Franz Marc immer Tiere?,Simonetta Vespucci,0.4588209191043047," hier dargestellt hat, aber vieles spricht dafür, dass es sich um Simonetta Vespucci handelt. Gelebt hat Simonetta vor gut 500 Jahren in Florenz. Dort",weibliches_idealbildnis.txt
Wieso malt Franz Marc immer Tiere?,Weil sie deiner überdrüssig wurde,0.42284658988209434,"hast du mir das angetan? Sagst du nichts mehr?
Sprecher B: Weil sie deiner überdrüssig wurde, du Tor! Deiner Wutausbrüche, Simson. Deiner Gewalttaten!",die_blendung_simsons.txt
Wieso malt Franz Marc immer Tiere?,"Ich kenne dich nicht. Weidest du dich genüsslich an meinem Leid? Ist es so? So wisse, auch die sind schuldig, die nicht eingreifen bei einer Ungerechtigkeit, die nur zusehen und sich gar noch daran laben",0.3312450706352585," Ich kenne dich nicht. Weidest du dich genüsslich an meinem Leid? Ist es so? So wisse, auch die sind schuldig, die nicht eingreifen bei einer Ungerechtigkeit, die nur zusehen und sich gar noch daran laben",die_blendung_simsons.txt
Wieso malt Franz Marc immer Tiere?,Geograph,0.316114074492572,"kannst du ein Winkelmaß erkennen. All diese Dinge braucht, na??? – ein Geograph. Oder Kartograph. Jemand, der Landkarten von der Erde zeichnet.
Das Ge",der_geograf.txt
Wieso malt Franz Marc immer Tiere?,"Wer hält das auseinander, wer sichert das ab, wenn der Tag vorbei ist? Wer versichert mir, dass ich auf der richtigen Seite stehe.",0.3100022225334456,"ie Opfer. Wer hält das auseinander, wer sichert das ab, wenn der Tag vorbei ist? Wer versichert mir, dass ich auf der richtigen Seite stehe.
Gitarrenm",horde.txt
Wieso malt Franz Marc immer Tiere?,"Umstritten ist demgegenüber die Frage nach Jans früherer Tätigkeit, die vor allem mit den Miniaturen des sogenannten Turin-Mailänder Stundenbuches und einer Reihe erzählender Tafelbilder wie dem New nicht zuletzt im Yorker Diptychon in Verbindung gebracht wird.",0.28563102320767797," Umstritten ist demgegenüber die Frage nach Jans früherer Tätigkeit, die vor allem mit den Miniaturen des sogenannten Turin-Mailänder Stundenbuches und einer Reihe erzählender Tafelbilder wie dem New nicht zuletzt im Yorker Diptychon in Verbindung gebracht wird.",lucca_madonna.txt
"
","
"
Hat Franz Marc eigentlich auch Menschen gemalt,groß,0.6607238388600127,"ie Madonna sehr groß oder das Zimmer sehr klein? Beides richtig, Madonna groß weil ihre Bedeutung hervorgehoben werden soll.
Das kleine Bild Jan van E",lucca_madonna.txt
Hat Franz Marc eigentlich auch Menschen gemalt,Simonetta Vespucci,0.5045309297975291," hier dargestellt hat, aber vieles spricht dafür, dass es sich um Simonetta Vespucci handelt. Gelebt hat Simonetta vor gut 500 Jahren in Florenz. Dort",weibliches_idealbildnis.txt
Hat Franz Marc eigentlich auch Menschen gemalt,Geograph,0.49687866823562266,"kannst du ein Winkelmaß erkennen. All diese Dinge braucht, na??? – ein Geograph. Oder Kartograph. Jemand, der Landkarten von der Erde zeichnet.
Das Ge",der_geograf.txt
Hat Franz Marc eigentlich auch Menschen gemalt,"in der oberen Bildhälfte lassen sich wie in einem Vexierbild schemenhafte menschliche Gestalten erkennen, die in diesem unwirklichen Raum schweben",0.45816305333225876,", in der oberen Bildhälfte lassen sich wie in einem Vexierbild schemenhafte menschliche Gestalten erkennen, die in diesem unwirklichen Raum schweben.
",barrier.txt
Hat Franz Marc eigentlich auch Menschen gemalt,"Leider wissen wir nicht, WEN er dargestellt hat, aber man vermutet, dass die junge Frau aus Florenz stammte",0.45455474830156384," und knapp: Pontormo. Leider wissen wir nicht, WEN er dargestellt hat, aber man vermutet, dass die junge Frau aus Florenz stammte, aus einer begüterte",bildnis_einer_dame_in_rot.txt
Hat Franz Marc eigentlich auch Menschen gemalt,"Der Vordergrund erinnert an Spiegelungen auf nassem Untergrund, in der oberen Bildhälfte lassen sich wie in einem Vexierbild menschliche Gestalten erkennen",0.44596851284212263," Der Vordergrund erinnert an Spiegelungen auf nassem Untergrund, in der oberen Bildhälfte lassen sich wie in einem Vexierbild menschliche Gestalten erkennen",barrier.txt
Hat Franz Marc eigentlich auch Menschen gemalt,"Leider wissen wir nicht, WEN er dargestellt hat, aber man vermutet, dass die junge Frau aus Florenz stammte, aus einer begüterten Familie.",0.4345992647957522,"ormo. Leider wissen wir nicht, WEN er dargestellt hat, aber man vermutet, dass die junge Frau aus Florenz stammte, aus einer begüterten Familie. Dass ",bildnis_einer_dame_in_rot.txt
Hat Franz Marc eigentlich auch Menschen gemalt,Ganz sicher ist es nicht,0.4318319904872613,"er Mitte, von dem ein paar Reiherfedern nach hinten wegstehen. Ganz sicher ist es nicht, wen der Maler Sandro Botticelli hier dargestellt hat, aber vi",weibliches_idealbildnis.txt
Hat Franz Marc eigentlich auch Menschen gemalt,Weil sie deiner überdrüssig wurde,0.4184760758663858,"hast du mir das angetan? Sagst du nichts mehr?
Sprecher B: Weil sie deiner überdrüssig wurde, du Tor! Deiner Wutausbrüche, Simson. Deiner Gewalttaten!",die_blendung_simsons.txt
Hat Franz Marc eigentlich auch Menschen gemalt,Die Motive reichten von spektakulären Verbrechen und politischen Ereignissen wie der Ermordung Kennedys bis zu banalen Alltagsgegenständen wie Wäscheständer und Klopapierrolle.,0.41506697672723963,Die Motive reichten von spektakulären Verbrechen und politischen Ereignissen wie der Ermordung Kennedys bis zu banalen Alltagsgegenständen wie Wäscheständer und Klopapierrolle.,kahnfahrt.txt
"
","
"
Was verbindet Goethe mit Italien?,groß,0.6490672621121895,"ie Madonna sehr groß oder das Zimmer sehr klein? Beides richtig, Madonna groß weil ihre Bedeutung hervorgehoben werden soll.
Das kleine Bild Jan van E",lucca_madonna.txt
Was verbindet Goethe mit Italien?,"Goethe hatte auf seiner Italienischen Reise 1786 in Rom Station gemacht. Er wohnte bei Tischbein, der sich dank eines Stipendiums dort aufhielt.",0.6046390997653326,"n.
Goethe hatte auf seiner Italienischen Reise 1786 in Rom Station gemacht. Er wohnte bei Tischbein, der sich dank eines Stipendiums dort aufhielt. Ti",goethe_in_der_roemishen_campagna.txt
Was verbindet Goethe mit Italien?,Im Verlauf seiner Italienischen Reise,0.5321088855854096," Barock, den man als theatralisch und überladen empfand.
Im Verlauf seiner Italienischen Reise gelangte Johann Wolfgang von Goethe Ende Oktober 1786 n",goethe_in_der_roemishen_campagna.txt
Was verbindet Goethe mit Italien?,"Für Goethe war diese Reise sehr wichtig, denn er war sehr an der alten römischen Geschichte interessiert und sah sich deshalb lauter alte römische Bauwerke an. So bekam er Anregungen für seine Gedichte und Erzählungen.",0.5059831732236343,"Für Goethe war diese Reise sehr wichtig, denn er war sehr an der alten römischen Geschichte interessiert und sah sich deshalb lauter alte römische Bauwerke an. So bekam er Anregungen für seine Gedichte und Erzählungen.",goethe_in_der_roemishen_campagna.txt
Was verbindet Goethe mit Italien?,Simonetta Vespucci,0.4949344700177006," hier dargestellt hat, aber vieles spricht dafür, dass es sich um Simonetta Vespucci handelt. Gelebt hat Simonetta vor gut 500 Jahren in Florenz. Dort",weibliches_idealbildnis.txt
Was verbindet Goethe mit Italien?,Sein Hauptwerk,0.44862591774655464,"bach und niederländischen Malern, die sich in Frankfurt aufhielten. Sein Hauptwerk hier schuf er um 1603 in seiner Wahlheimat Rom. 
de_ges_262_fra // ",kreuzaltar.txt
Was verbindet Goethe mit Italien?,Die wichtigste Station in der künstlerischen Formung eines Malers war die Reise nach Italien – wenn nicht gar ein zeitlebens anhaltender Aufenthalt,0.44434922342105937,":
Die wichtigste Station in der künstlerischen Formung eines Malers war die Reise nach Italien – wenn nicht gar ein zeitlebens anhaltender Aufenthalt.",kreuzaltar.txt
Was verbindet Goethe mit Italien?,Weil sie deiner überdrüssig wurde,0.41019125516564275,"hast du mir das angetan? Sagst du nichts mehr?
Sprecher B: Weil sie deiner überdrüssig wurde, du Tor! Deiner Wutausbrüche, Simson. Deiner Gewalttaten!",die_blendung_simsons.txt
Was verbindet Goethe mit Italien?,"So wisse, auch die sind schuldig, die nicht eingreifen bei einer Ungerechtigkeit, die nur zusehen und sich gar noch daran laben",0.34470178839176363," Ist es so? So wisse, auch die sind schuldig, die nicht eingreifen bei einer Ungerechtigkeit, die nur zusehen und sich gar noch daran laben.
Sprecher ",die_blendung_simsons.txt
Was verbindet Goethe mit Italien?,Geograph,0.32282543374195566,"kannst du ein Winkelmaß erkennen. All diese Dinge braucht, na??? – ein Geograph. Oder Kartograph. Jemand, der Landkarten von der Erde zeichnet.
Das Ge",der_geograf.txt
"
","
"
Wie viele Bilder gibt es von Franz Marc?,zehn,0.7873802621071775, Reihe von ebenso kostbaren wie winzigen Bildern. Das Städel besitzt mit zehn Gemälden die umfangreichste Sammlung des bedeutendsten Frankfurter Maler,kreuzaltar.txt
Wie viele Bilder gibt es von Franz Marc?,neun,0.7452480374951015," Forschung über Jans nach 1432 entstandenes Euvre, das sich um insgesamt neun signierte und datierte Bilder gruppiert. Umstritten ist demgegenüber die",lucca_madonna.txt
Wie viele Bilder gibt es von Franz Marc?,knapp vierzig,0.7032129183289806,ich gemeinsam zu einem stimmungsvollen Ganzen zusammenschließen. Nur knapp vierzig Werke sind aus seiner Hand bekannt. Weil er sich Vollkommenheit in ,der_geograf.txt
Wie viele Bilder gibt es von Franz Marc?,weniger als 40,0.682540104493242,"t er eine sehr geringe Anzahl an Bildern geschaffen, und heute sind weniger als 40 Vermeers erhalten – Diese sind natürlich Gemälde von unschätzbarem ",der_geograf.txt
Wie viele Bilder gibt es von Franz Marc?,knapp 40,0.6573695060621823,"Kollegen hinterließ Vermeer, von dem auch sonst wenig bekannt ist, nur knapp 40 Werke. 
de_ges_456_kul // Fokus Kulturgeschichte
Ende des 17. Jahrhund",der_geograf.txt
Wie viele Bilder gibt es von Franz Marc?,sieben,0.5438814339377962,Mit großer Erzählfreude schildert Adam Elsheimer auf den sieben Kupfertafeln des kleinen Altars die sogenannte Kreuzlegende. Deren Handlung setzt im 4,kreuzaltar.txt
Wie viele Bilder gibt es von Franz Marc?,groß,0.5156004393499123,"ie Madonna sehr groß oder das Zimmer sehr klein? Beides richtig, Madonna groß weil ihre Bedeutung hervorgehoben werden soll.
Das kleine Bild Jan van E",lucca_madonna.txt
Wie viele Bilder gibt es von Franz Marc?,Weil sie deiner überdrüssig wurde,0.4207308626391953,"hast du mir das angetan? Sagst du nichts mehr?
Sprecher B: Weil sie deiner überdrüssig wurde, du Tor! Deiner Wutausbrüche, Simson. Deiner Gewalttaten!",die_blendung_simsons.txt
Wie viele Bilder gibt es von Franz Marc?,Simonetta Vespucci,0.41808157705296073," hier dargestellt hat, aber vieles spricht dafür, dass es sich um Simonetta Vespucci handelt. Gelebt hat Simonetta vor gut 500 Jahren in Florenz. Dort",weibliches_idealbildnis.txt
Wie viele Bilder gibt es von Franz Marc?,2,0.40184183792308253,"endung Simsons darzustellen, griff der Maler 1636 zu einem Format von über 2,50 Meter Breite. Komposition und Lichtdramaturgie zwingen den Betrachter ",die_blendung_simsons.txt
"
","
"
"Warum heisst das Gemälde ""Lucca-Madonna""?",weil sie im frühen 19. Jahrhundert dem Herzog von Lucca gehörte,0.8580056572328115,"lt um 1437/38. Lucca-Madonna nennt man sie, weil sie im frühen 19. Jahrhundert dem Herzog von Lucca gehörte.
Zärtlich ist Marias Blick ihrem Kind zuge",lucca_madonna.txt
"Warum heisst das Gemälde ""Lucca-Madonna""?","Er geht zurück auf den damaligen Besitzer Charles-Louis de Bourbon, Herzog von Lucca, der das Bild 1841 verkaufte.",0.8277030311910542,"nna“ überliefert. Er geht zurück auf den damaligen Besitzer Charles-Louis de Bourbon, Herzog von Lucca, der das Bild 1841 verkaufte.
Jan van Eyck stam",lucca_madonna.txt
"Warum heisst das Gemälde ""Lucca-Madonna""?",nach ihrem Aufbewahrungsort im frühen 19. Jahrhundert,0.7961975080132917,"n Jan van Eyck besitzt das Städel Museum mit der nach ihrem Aufbewahrungsort im frühen 19. Jahrhundert benannten, um 1437 entstandenen Lucca-Madonna (",lucca_madonna.txt
"Warum heisst das Gemälde ""Lucca-Madonna""?",Weil sie deiner überdrüssig wurde,0.47407358518417403,"hast du mir das angetan? Sagst du nichts mehr?
Sprecher B: Weil sie deiner überdrüssig wurde, du Tor! Deiner Wutausbrüche, Simson. Deiner Gewalttaten!",die_blendung_simsons.txt
"Warum heisst das Gemälde ""Lucca-Madonna""?",Simonetta Vespucci,0.4399828706412632," hier dargestellt hat, aber vieles spricht dafür, dass es sich um Simonetta Vespucci handelt. Gelebt hat Simonetta vor gut 500 Jahren in Florenz. Dort",weibliches_idealbildnis.txt
"Warum heisst das Gemälde ""Lucca-Madonna""?",ein Geograph,0.4147481612368174,"r kannst du ein Winkelmaß erkennen. All diese Dinge braucht, na??? – ein Geograph. Oder Kartograph. Jemand, der Landkarten von der Erde zeichnet.
Das ",der_geograf.txt
"Warum heisst das Gemälde ""Lucca-Madonna""?",Das Bild sollte vielleicht ihr Andenken bewahren,0.4049117692592386,"rne erkennen konnte.
Simonetta war jung gestorben. Das Bild sollte vielleicht ihr Andenken bewahren. Durch die Darstellung als antike Nymphe wurde sie",weibliches_idealbildnis.txt
"Warum heisst das Gemälde ""Lucca-Madonna""?","wegen des „Programms“, wie der Dichter es nannte.",0.39732745278563897,"en deutschen Dichter. Berühmt ist es auch, fraglos wegen des „Programms“, wie der Dichter es nannte. Für Goethe bildete die Ähnlichkeit eines Bildes z",goethe_in_der_roemishen_campagna.txt
"Warum heisst das Gemälde ""Lucca-Madonna""?","Leider wissen wir nicht, WEN er dargestellt hat, aber man vermutet, dass die junge Frau aus Florenz stammte, aus einer begüterten Familie.",0.3968345950026014,"ormo. Leider wissen wir nicht, WEN er dargestellt hat, aber man vermutet, dass die junge Frau aus Florenz stammte, aus einer begüterten Familie. Dass ",bildnis_einer_dame_in_rot.txt
"Warum heisst das Gemälde ""Lucca-Madonna""?","Leider wissen wir nicht, WEN er dargestellt hat, aber man vermutet, dass die junge Frau aus Florenz",0.39355992629328707,"kurz und knapp: Pontormo. Leider wissen wir nicht, WEN er dargestellt hat, aber man vermutet, dass die junge Frau aus Florenz stammte, aus einer begüt",bildnis_einer_dame_in_rot.txt
"
","
"
Was ist die Geschichte zu Barriers?,die sogenannte Kreuzlegende,0.6366924214520624,"Adam Elsheimer auf den sieben Kupfertafeln des kleinen Altars die sogenannte Kreuzlegende. Deren Handlung setzt im 4. Jahrhundert nach Christus ein, a",kreuzaltar.txt
Was ist die Geschichte zu Barriers?,"„Barrier“ sieht aus, als ob Corinne Wasmuht die Welt in einzelne Bestandteile aufgelöst und zu einer neuen zusammengefügt hätte",0.6352387110174196,"und Technik
„Barrier“ sieht aus, als ob Corinne Wasmuht die Welt in einzelne Bestandteile aufgelöst und zu einer neuen zusammengefügt hätte.
Genauso a",barrier.txt
Was ist die Geschichte zu Barriers?,"Corinne Wasmuth zeigt uns Dinge, die wir kennen -  Straßen, Plätze, Gitter, Mülleimer, Bäume, Fassaden -  aber sie befinden sich in keinem realen Raum.",0.6194776522036831,"
Corinne Wasmuth zeigt uns Dinge, die wir kennen -  Straßen, Plätze, Gitter, Mülleimer, Bäume, Fassaden -  aber sie befinden sich in keinem realen Raum.",barrier.txt
Was ist die Geschichte zu Barriers?,groß,0.5956714109876383,"ie Madonna sehr groß oder das Zimmer sehr klein? Beides richtig, Madonna groß weil ihre Bedeutung hervorgehoben werden soll.
Das kleine Bild Jan van E",lucca_madonna.txt
Was ist die Geschichte zu Barriers?,"Großflächige, quer verlaufende Strukturen wirken wie Barrieren, die das Bild vorne abschließen",0.5876811067284274," Blick nicht gesehen haben. Großflächige, quer verlaufende Strukturen wirken wie Barrieren, die das Bild vorne abschließen.
Der Wechsel zwischen Tiefe",barrier.txt
Was ist die Geschichte zu Barriers?,Simonetta Vespucci,0.5153639939255976," hier dargestellt hat, aber vieles spricht dafür, dass es sich um Simonetta Vespucci handelt. Gelebt hat Simonetta vor gut 500 Jahren in Florenz. Dort",weibliches_idealbildnis.txt
Was ist die Geschichte zu Barriers?,Weil sie deiner überdrüssig wurde,0.457078907931432,"hast du mir das angetan? Sagst du nichts mehr?
Sprecher B: Weil sie deiner überdrüssig wurde, du Tor! Deiner Wutausbrüche, Simson. Deiner Gewalttaten!",die_blendung_simsons.txt
Was ist die Geschichte zu Barriers?,die Legende vom Wahren Kreuz Christi,0.45224253180229673,"lt der Maler Adam Elsheimer, ein gebürtiger Frankfurter, die Legende vom Wahren Kreuz Christi. Auf der Mitteltafel, die die Verherrlichung des Kreuzes",kreuzaltar.txt
Was ist die Geschichte zu Barriers?,Geograph,0.41330260274915587,"kannst du ein Winkelmaß erkennen. All diese Dinge braucht, na??? – ein Geograph. Oder Kartograph. Jemand, der Landkarten von der Erde zeichnet.
Das Ge",der_geograf.txt
Was ist die Geschichte zu Barriers?,Es gibt Geschichten im Alten Testament,0.40490668504015837,"uchtkraft der Malerei.
de_ges_396_rel // Fokus Religion
Es gibt Geschichten im Alten Testament, die sind nichts für schwache Nerven. Das merkt man spä",die_blendung_simsons.txt
"
","
"
Hatte Liebermann bei diesem biblischen Motiv die zeitgenössische Frauenemanzipation im Hinterkopf?,"Es mag sein, dass hier ein Schlüssel liegt, warum sich Liebermann diesem für ihn ungewöhnlichen Thema zuwandte und sich mit dem jüdischen Helden beschäftigte, der in einem schwachen Moment der verführerischen Feindin das Geheimnis seiner Stärke offenbarte. Vielleicht ging es ihm aber auch wie vielen Künstlerkollegen, die von den ""femmes fatales"" des Alten Testamentes, von Judith, Salome, Delilah fasziniert waren.",0.7060733431435553,"Es mag sein, dass hier ein Schlüssel liegt, warum sich Liebermann diesem für ihn ungewöhnlichen Thema zuwandte und sich mit dem jüdischen Helden beschäftigte, der in einem schwachen Moment der verführerischen Feindin das Geheimnis seiner Stärke offenbarte. Vielleicht ging es ihm aber auch wie vielen Künstlerkollegen, die von den ""femmes fatales"" des Alten Testamentes, von Judith, Salome, Delilah fasziniert waren.",simson_delila.txt
Hatte Liebermann bei diesem biblischen Motiv die zeitgenössische Frauenemanzipation im Hinterkopf?,groß,0.5751581417060325,"ie Madonna sehr groß oder das Zimmer sehr klein? Beides richtig, Madonna groß weil ihre Bedeutung hervorgehoben werden soll.
Das kleine Bild Jan van E",lucca_madonna.txt
Hatte Liebermann bei diesem biblischen Motiv die zeitgenössische Frauenemanzipation im Hinterkopf?,"Vielleicht ging es ihm aber auch wie vielen Künstlerkollegen, die von den ""femmes fatales"" des Alten Testamentes, von Judith, Salome, Delilah fasziniert waren.",0.508907510877545," Vielleicht ging es ihm aber auch wie vielen Künstlerkollegen, die von den ""femmes fatales"" des Alten Testamentes, von Judith, Salome, Delilah fasziniert waren.",simson_delila.txt
Hatte Liebermann bei diesem biblischen Motiv die zeitgenössische Frauenemanzipation im Hinterkopf?,Simonetta Vespucci,0.4694061023052355," hier dargestellt hat, aber vieles spricht dafür, dass es sich um Simonetta Vespucci handelt. Gelebt hat Simonetta vor gut 500 Jahren in Florenz. Dort",weibliches_idealbildnis.txt
Hatte Liebermann bei diesem biblischen Motiv die zeitgenössische Frauenemanzipation im Hinterkopf?,"Beim Malen war sich Beckmann des Klanges der Instrumente bewusst, er integrierte ihn in die Komposition.",0.45398308590363307,"m zu schweben scheint. Beim Malen war sich Beckmann des Klanges der Instrumente bewusst, er integrierte ihn in die Komposition. Mit ihren erotischen R",stilleben_mit_saxophon.txt
Hatte Liebermann bei diesem biblischen Motiv die zeitgenössische Frauenemanzipation im Hinterkopf?,"Lange Zeit hatte man sich in den fortschrittlichen Künstlerkreisen für das Flüchtige, Unverbindliche des impressionistischen Augenblicks begeistert.",0.45205525656858403," Lange Zeit hatte man sich in den fortschrittlichen Künstlerkreisen für das Flüchtige, Unverbindliche des impressionistischen Augenblicks begeistert. ",simson_delila.txt
Hatte Liebermann bei diesem biblischen Motiv die zeitgenössische Frauenemanzipation im Hinterkopf?,Ganz sicher ist es nicht,0.45084457994478844,"er Mitte, von dem ein paar Reiherfedern nach hinten wegstehen. Ganz sicher ist es nicht, wen der Maler Sandro Botticelli hier dargestellt hat, aber vi",weibliches_idealbildnis.txt
Hatte Liebermann bei diesem biblischen Motiv die zeitgenössische Frauenemanzipation im Hinterkopf?,Weil sie deiner überdrüssig wurde,0.4461295488612366,"hast du mir das angetan? Sagst du nichts mehr?
Sprecher B: Weil sie deiner überdrüssig wurde, du Tor! Deiner Wutausbrüche, Simson. Deiner Gewalttaten!",die_blendung_simsons.txt
Hatte Liebermann bei diesem biblischen Motiv die zeitgenössische Frauenemanzipation im Hinterkopf?,"Tatsächlich geht man davon aus, dass Vermeer als Hilfsmittel sowohl zentralperspektivische Hilfslinien als auch eine Camera obscura benutzte, also einen Projektionsapparat, der es ermöglichte, das Motiv perspektivisch genau auf die Leinwand zu projizieren. Er veränderte diese Vorlage während des Malens jedoch, wenn es ihm für die Aussage wichtig schien.",0.41375905687730735,"
Tatsächlich geht man davon aus, dass Vermeer als Hilfsmittel sowohl zentralperspektivische Hilfslinien als auch eine Camera obscura benutzte, also einen Projektionsapparat, der es ermöglichte, das Motiv perspektivisch genau auf die Leinwand zu projizieren. Er veränderte diese Vorlage während des Malens jedoch, wenn es ihm für die Aussage wichtig schien.",der_geograf.txt
Hatte Liebermann bei diesem biblischen Motiv die zeitgenössische Frauenemanzipation im Hinterkopf?,Natürlich ist diese Wirkung beabsichtigt.,0.4035798233792444,"z normale junge Frau mit ihrem Kind vor sich zu haben.
Natürlich ist diese Wirkung beabsichtigt. Damals hatte sich eine neue Theologie etabliert, die ",lucca_madonna.txt
"
","
"
Wo liegt die römische Campagna?,groß,0.619596370179159,"ie Madonna sehr groß oder das Zimmer sehr klein? Beides richtig, Madonna groß weil ihre Bedeutung hervorgehoben werden soll.
Das kleine Bild Jan van E",lucca_madonna.txt
Wo liegt die römische Campagna?,tief im Hintergrunde liegenden Ruinen der Campagna die Roma,0.6126980194307626,"en Obelisken sitzend, vorgestellt werden, die tief im Hintergrunde liegenden Ruinen der Campagna die Roma überschauend.“
Tischbeins Gemälde ist heute ",goethe_in_der_roemishen_campagna.txt
Wo liegt die römische Campagna?,tief im Hintergrunde,0.5937154673926123,"uf einem umgestürzten Obelisken sitzend, vorgestellt werden, die tief im Hintergrunde liegenden Ruinen der Campagna die Roma überschauend.“
Tischbeins",goethe_in_der_roemishen_campagna.txt
Wo liegt die römische Campagna?,Simonetta Vespucci,0.4989928031226552," hier dargestellt hat, aber vieles spricht dafür, dass es sich um Simonetta Vespucci handelt. Gelebt hat Simonetta vor gut 500 Jahren in Florenz. Dort",weibliches_idealbildnis.txt
Wo liegt die römische Campagna?,Weil sie deiner überdrüssig wurde,0.4421131356743727,"hast du mir das angetan? Sagst du nichts mehr?
Sprecher B: Weil sie deiner überdrüssig wurde, du Tor! Deiner Wutausbrüche, Simson. Deiner Gewalttaten!",die_blendung_simsons.txt
Wo liegt die römische Campagna?,Geograph,0.4019064752981518,"kannst du ein Winkelmaß erkennen. All diese Dinge braucht, na??? – ein Geograph. Oder Kartograph. Jemand, der Landkarten von der Erde zeichnet.
Das Ge",der_geograf.txt
Wo liegt die römische Campagna?,Botticelli,0.3645198787458977, ganz bisschen buckelig – und ernster Blick. Das war damals angesagt. Botticelli hat Simonetta sogar noch blasser gemacht als in Wirklichkeit. Wir hab,weibliches_idealbildnis.txt
Wo liegt die römische Campagna?,Schau dir mal Goethes Füße an! Siehst du’s? Goethe hat zwei linke Füße! Außerdem ist der hintere Oberschenkel viel länger als der vordere!,0.3468165485335287,Bild. Schau dir mal Goethes Füße an! Siehst du’s? Goethe hat zwei linke Füße! Außerdem ist der hintere Oberschenkel viel länger als der vordere! Denno,goethe_in_der_roemishen_campagna.txt
Wo liegt die römische Campagna?,"So wisse, auch die sind schuldig, die nicht eingreifen bei einer Ungerechtigkeit, die nur zusehen und sich gar noch daran laben",0.3408943634226835," Ist es so? So wisse, auch die sind schuldig, die nicht eingreifen bei einer Ungerechtigkeit, die nur zusehen und sich gar noch daran laben.
Sprecher ",die_blendung_simsons.txt
Wo liegt die römische Campagna?,"Weitgehend einig ist sich die Forschung über Jans nach 1432 entstandenes Euvre, das sich um insgesamt neun signierte und datierte Bilder gruppiert. Umstritten ist demgegenüber die Frage nach Jans früherer Tätigkeit, die vor allem mit den Miniaturen des sogenannten Turin-Mailänder Stundenbuches und einer Reihe erzählender Tafelbilder wie dem New nicht zuletzt im Yorker Diptychon in Verbindung gebracht wird.",0.3069776249028792," Weitgehend einig ist sich die Forschung über Jans nach 1432 entstandenes Euvre, das sich um insgesamt neun signierte und datierte Bilder gruppiert. Umstritten ist demgegenüber die Frage nach Jans früherer Tätigkeit, die vor allem mit den Miniaturen des sogenannten Turin-Mailänder Stundenbuches und einer Reihe erzählender Tafelbilder wie dem New nicht zuletzt im Yorker Diptychon in Verbindung gebracht wird.",lucca_madonna.txt
"
","
"
Kommt Max Beckmann aus Berlin?,groß,0.647673041333387,"ie Madonna sehr groß oder das Zimmer sehr klein? Beides richtig, Madonna groß weil ihre Bedeutung hervorgehoben werden soll.
Das kleine Bild Jan van E",lucca_madonna.txt
Kommt Max Beckmann aus Berlin?,Simonetta Vespucci,0.5206843924313095," hier dargestellt hat, aber vieles spricht dafür, dass es sich um Simonetta Vespucci handelt. Gelebt hat Simonetta vor gut 500 Jahren in Florenz. Dort",weibliches_idealbildnis.txt
Kommt Max Beckmann aus Berlin?,"Der Berliner Maler Max Liebermann zählt zu den wichtigsten Vertretern des Deutschen Impressionismus, berühmt für seine ländlichen und bürgerlichen Alltagsszenen und für seine Gartenbilder",0.43703895437993967,"
Der Berliner Maler Max Liebermann zählt zu den wichtigsten Vertretern des Deutschen Impressionismus, berühmt für seine ländlichen und bürgerlichen Alltagsszenen und für seine Gartenbilder",simson_delila.txt
Kommt Max Beckmann aus Berlin?,Geograph,0.4093088141206265,"kannst du ein Winkelmaß erkennen. All diese Dinge braucht, na??? – ein Geograph. Oder Kartograph. Jemand, der Landkarten von der Erde zeichnet.
Das Ge",der_geograf.txt
Kommt Max Beckmann aus Berlin?,"Der Berliner Maler Max Liebermann zählt zu den wichtigsten Vertretern des Deutschen Impressionismus, berühmt für seine ländlichen und bürgerlichen Alltagsszenen und für seine Gartenbilder.",0.40300689909142756,"Der Berliner Maler Max Liebermann zählt zu den wichtigsten Vertretern des Deutschen Impressionismus, berühmt für seine ländlichen und bürgerlichen Alltagsszenen und für seine Gartenbilder.",simson_delila.txt
Kommt Max Beckmann aus Berlin?,Weil sie deiner überdrüssig wurde,0.39765336838633286,"hast du mir das angetan? Sagst du nichts mehr?
Sprecher B: Weil sie deiner überdrüssig wurde, du Tor! Deiner Wutausbrüche, Simson. Deiner Gewalttaten!",die_blendung_simsons.txt
Kommt Max Beckmann aus Berlin?,"So wisse, auch die sind schuldig, die nicht eingreifen bei einer Ungerechtigkeit, die nur zusehen und sich gar noch daran laben",0.3348236371088551," Ist es so? So wisse, auch die sind schuldig, die nicht eingreifen bei einer Ungerechtigkeit, die nur zusehen und sich gar noch daran laben.
Sprecher ",die_blendung_simsons.txt
Kommt Max Beckmann aus Berlin?,"Öl auf Eichenholz 65,5 x 49,5 cm",0.2998800787972053,"ung der Auferstehung und des ewigen Lebens (Abbildung 24).
Öl auf Eichenholz 65,5 x 49,5 cm
Inv. Nr. 944 1850 12. August durch J. D. Passavant in der ",lucca_madonna.txt
Kommt Max Beckmann aus Berlin?,"Wer hält das auseinander, wer sichert das ab, wenn der Tag vorbei ist? Wer versichert mir, dass ich auf der richtigen Seite stehe.",0.2985870556981028,"ie Opfer. Wer hält das auseinander, wer sichert das ab, wenn der Tag vorbei ist? Wer versichert mir, dass ich auf der richtigen Seite stehe.
Gitarrenm",horde.txt
Kommt Max Beckmann aus Berlin?,"Weitgehend einig ist sich die Forschung über Jans nach 1432 entstandenes Euvre, das sich um insgesamt neun signierte und datierte Bilder gruppiert. Umstritten ist demgegenüber die Frage nach Jans früherer Tätigkeit, die vor allem mit den Miniaturen des sogenannten Turin-Mailänder Stundenbuches und einer Reihe erzählender Tafelbilder wie dem New nicht zuletzt im Yorker Diptychon in Verbindung gebracht wird.",0.2966087389640551," Weitgehend einig ist sich die Forschung über Jans nach 1432 entstandenes Euvre, das sich um insgesamt neun signierte und datierte Bilder gruppiert. Umstritten ist demgegenüber die Frage nach Jans früherer Tätigkeit, die vor allem mit den Miniaturen des sogenannten Turin-Mailänder Stundenbuches und einer Reihe erzählender Tafelbilder wie dem New nicht zuletzt im Yorker Diptychon in Verbindung gebracht wird.",lucca_madonna.txt
"
","
"
Wieso ist der Hund grün?,von abstrahierten Bäumen oder Sträuchern,0.7664804795675936,"st wie auf einer Wolke; am Rande erkennen wir das Grün von abstrahierten Bäumen oder Sträuchern. Auch die Formen des Hundes sind leicht abstrahiert, g",liegender_hund_im_schnee.txt
Wieso ist der Hund grün?,an kolorierte Postkarten erinnert,0.7514492491626962,"em Schwarz-Weiß des Fotos wurde ein dunkles Blau-Grün, das an kolorierte Postkarten erinnert. Richter hat nur die Kahnfahrer wiedergegeben, die auf de",kahnfahrt.txt
Wieso ist der Hund grün?,Das gelblich-grüne Fell hebt den Hund sanft von der Schneefläche ab und verbindet ihn mit dem Grün im Hintergrund.,0.7438983486436229,ufgegriffen wird. Das gelblich-grüne Fell hebt den Hund sanft von der Schneefläche ab und verbindet ihn mit dem Grün im Hintergrund. Das Gemälde vermi,liegender_hund_im_schnee.txt
Wieso ist der Hund grün?,Allerdings kann es im Kontakt mit den ölhaltigen Bindemitteln der Malfarbe reagieren und ein grünes sogenanntes Kupferoleat bilden.,0.7423252304041087,ch nicht. Allerdings kann es im Kontakt mit den ölhaltigen Bindemitteln der Malfarbe reagieren und ein grünes sogenanntes Kupferoleat bilden. Dieses R,kreuzaltar.txt
Wieso ist der Hund grün?,"Aus dem Schwarz-Weiß des Fotos wurde ein dunkles Blau-Grün, das an kolorierte Postkarten erinnert",0.6876824078911201,"otorealistisch abzubilden. Aus dem Schwarz-Weiß des Fotos wurde ein dunkles Blau-Grün, das an kolorierte Postkarten erinnert. Über der heiteren Kahnfa",kahnfahrt.txt
Wieso ist der Hund grün?,groß weil ihre Bedeutung hervorgehoben werden soll,0.6610031172584566,"er das Zimmer sehr klein? Beides richtig, Madonna groß weil ihre Bedeutung hervorgehoben werden soll.
Das kleine Bild Jan van Eycks ist eines der groß",lucca_madonna.txt
Wieso ist der Hund grün?,von abstrahierten,0.5341871630573559,"eefläche, fast wie auf einer Wolke; am Rande erkennen wir das Grün von abstrahierten Bäumen oder Sträuchern. Auch die Formen des Hundes sind leicht ab",liegender_hund_im_schnee.txt
Wieso ist der Hund grün?,"Das Foto war allerdings schwarz-weiß, Richter hat stattdessen ein dunkles Blau-Grün verwendet.",0.49299085423660943," es ganz genau so abgemalt. Das Foto war allerdings schwarz-weiß, Richter hat stattdessen ein dunkles Blau-Grün verwendet. Weil das Foto so stark verg",kahnfahrt.txt
Wieso ist der Hund grün?,"Das fast knallige Aufeinandertreffen von Zinnoberrot, dunklem Blaugrün und hellem Flaschengrün",0.4599998634065425,"rken des Manierismus zählt. Das fast knallige Aufeinandertreffen von Zinnoberrot, dunklem Blaugrün und hellem Flaschengrün macht augenfällig, woher di",bildnis_einer_dame_in_rot.txt
Wieso ist der Hund grün?,Weil sie deiner überdrüssig wurde,0.4199153296281709,"hast du mir das angetan? Sagst du nichts mehr?
Sprecher B: Weil sie deiner überdrüssig wurde, du Tor! Deiner Wutausbrüche, Simson. Deiner Gewalttaten!",die_blendung_simsons.txt
"
","
"
Was hält die Frau in der rechten Hand?,die Schere,0.8538784276789284,"lenarmband geschmückt, hell erleuchtet das eigentliche Tatinstrument: die Schere.
Übrigens hat sich Simson später gerächt. Die Philister warfen ihn da",die_blendung_simsons.txt
Was hält die Frau in der rechten Hand?,das aufrecht sitzende Kind,0.836586112483184,"listischen Beobachtungen.
Mit ihrer rechten Hand umfaßt Maria das aufrecht sitzende Kind. Ihre Finger greifen in die weiche Kinderhaut und schieben si",lucca_madonna.txt
Was hält die Frau in der rechten Hand?,die Schere und das Haar,0.8250124971538967,"eschnitten werden durften. Hier sehen Sie Delila, in den Händen die Schere und das Haar. Sie hat es ihm im Schlaf abgeschnitten und den von Gott Gewei",die_blendung_simsons.txt
Was hält die Frau in der rechten Hand?,die Schere und Simsons Haar,0.8034598236864026,"nie geschnitten wurden. Hier sehen Sie Dalilah, in den Händen die Schere und Simsons Haar. Mit eiskalter Gewalt blenden die Philister den wehrlosen He",die_blendung_simsons.txt
Was hält die Frau in der rechten Hand?,eine Holzlatte,0.6411758400099696,"rgrund drängen, sind noch schwerer zu identifizieren. Einer scheint eine Holzlatte in der Hand zu halten. Sind es Polizisten oder vielleicht doch Auto",horde.txt
Was hält die Frau in der rechten Hand?,groß,0.609576139454195,"ie Madonna sehr groß oder das Zimmer sehr klein? Beides richtig, Madonna groß weil ihre Bedeutung hervorgehoben werden soll.
Das kleine Bild Jan van E",lucca_madonna.txt
Was hält die Frau in der rechten Hand?,einen Zirkel,0.6046903577002751,"ucht er die Lösung zu einem verzwickten Problem. In der Hand hält er einen Zirkel, aber das Sonnenlicht fällt so hell auf das Papier vor ihm, dass man",der_geograf.txt
Was hält die Frau in der rechten Hand?,Karaffe mit klarem Wasser,0.5789142544822842,"ragen. Ein typisches Mariensymbol im vorliegenden Bild ist die Karaffe mit klarem Wasser (Abbildung 21), rechts in der Wandnische, die die Reinheit de",lucca_madonna.txt
Was hält die Frau in der rechten Hand?,Simonetta Vespucci,0.5470548592800891," hier dargestellt hat, aber vieles spricht dafür, dass es sich um Simonetta Vespucci handelt. Gelebt hat Simonetta vor gut 500 Jahren in Florenz. Dort",weibliches_idealbildnis.txt
Was hält die Frau in der rechten Hand?,"Der Anhänger ist einer antiken Gemme nachgebildet, die sich im Besitz der Medici befand. Sie zeigt den musikalischen Wettkampf zwischen dem Gott Apoll und dem Satyr Marsyas.",0.5234525613732339," Der Anhänger ist einer antiken Gemme nachgebildet, die sich im Besitz der Medici befand. Sie zeigt den musikalischen Wettkampf zwischen dem Gott Apoll und dem Satyr Marsyas.",weibliches_idealbildnis.txt
"
","
"
Ist das ein Foto?,"Bei einer Fotografie scheint das anders zu sein – hier glauben wir, die Realität eins zu eins wiederzufinden.",0.6687724900862355,"n abstraktes Muster. Bei einer Fotografie scheint das anders zu sein – hier glauben wir, die Realität eins zu eins wiederzufinden. Aber auch der herkö",kahnfahrt.txt
Ist das ein Foto?,groß,0.6432420865873986,"ie Madonna sehr groß oder das Zimmer sehr klein? Beides richtig, Madonna groß weil ihre Bedeutung hervorgehoben werden soll.
Das kleine Bild Jan van E",lucca_madonna.txt
Ist das ein Foto?,"Unser „Geograph“ zeichnet sich, wie alle Vermeers, durch eine erstaunliche Genauigkeit der Wiedergabe aus, die beinahe etwas Fotografisches hat",0.6408987313622847,"rt.
Unser „Geograph“ zeichnet sich, wie alle Vermeers, durch eine erstaunliche Genauigkeit der Wiedergabe aus, die beinahe etwas Fotografisches hat. E",der_geograf.txt
Ist das ein Foto?,"Ein Bild kann niemals die Wirklichkeit sein, nicht mal ein Foto und natürlich auch kein Gemälde",0.5792252299956919,"Bild immer ein Bild bleibt. Ein Bild kann niemals die Wirklichkeit sein, nicht mal ein Foto und natürlich auch kein Gemälde.
Gerhard Richters Kahnfahr",kahnfahrt.txt
Ist das ein Foto?,"Das meiste bleibt unklar, ist nur angedeutet, wie auf einem alten Negativ oder einer grob gepixelten Fotografie",0.5241224172377554,"ich erkennbar sind. Das meiste bleibt unklar, ist nur angedeutet, wie auf einem alten Negativ oder einer grob gepixelten Fotografie. 
Der Vordergrund ",barrier.txt
Ist das ein Foto?,Simonetta Vespucci,0.5040893094565281," hier dargestellt hat, aber vieles spricht dafür, dass es sich um Simonetta Vespucci handelt. Gelebt hat Simonetta vor gut 500 Jahren in Florenz. Dort",weibliches_idealbildnis.txt
Ist das ein Foto?,Gerhard Richters Kahnfahrt ist die malerische Reproduktion eines Zeitungsfotos,0.4664553307352246,"n Ausschnitt aus der Wirklichkeit. 
Gerhard Richters Kahnfahrt ist die malerische Reproduktion eines Zeitungsfotos. Mit einem Projektor wird das klein",kahnfahrt.txt
Ist das ein Foto?,"Die Saxophone liegen nicht wirklich auf den Möbeln, sie scheinen zu schweben",0.457415342063692," sehr viel Bewegung auf diesem Bild. Die Saxophone liegen nicht wirklich auf den Möbeln, sie scheinen zu schweben. Max Beckmanns Bild ist eine Hommage",stilleben_mit_saxophon.txt
Ist das ein Foto?,"Es sieht aus, als ob Wasmuht die Welt in einzelne Bestandteile aufgelöst und zu einer neuen zusammengefügt hätte. Genauso ist es auch.",0.4505705178818967,"kennen. Es sieht aus, als ob Wasmuht die Welt in einzelne Bestandteile aufgelöst und zu einer neuen zusammengefügt hätte. Genauso ist es auch. Sie leg",barrier.txt
Ist das ein Foto?,Weil sie deiner überdrüssig wurde,0.4481983510917039,"hast du mir das angetan? Sagst du nichts mehr?
Sprecher B: Weil sie deiner überdrüssig wurde, du Tor! Deiner Wutausbrüche, Simson. Deiner Gewalttaten!",die_blendung_simsons.txt
"
","
"
Alles gut?,groß,0.6920752862137567,"ie Madonna sehr groß oder das Zimmer sehr klein? Beides richtig, Madonna groß weil ihre Bedeutung hervorgehoben werden soll.
Das kleine Bild Jan van E",lucca_madonna.txt
Alles gut?,"Die Saxophone liegen nicht wirklich auf den Möbeln, sie scheinen zu schweben",0.5321770697427619," sehr viel Bewegung auf diesem Bild. Die Saxophone liegen nicht wirklich auf den Möbeln, sie scheinen zu schweben. Max Beckmanns Bild ist eine Hommage",stilleben_mit_saxophon.txt
Alles gut?,Monets Familie konnte fürs erste relativ sorgenfrei das Essen genießen.,0.5228126681887952, Bilder und unterstützt ihn finanziell. Monets Familie konnte fürs erste relativ sorgenfrei das Essen genießen. Monets Geliebte und spätere Ehefrau Ca,das_mittagessen.txt
Alles gut?,Simonetta Vespucci,0.5109104905971514," hier dargestellt hat, aber vieles spricht dafür, dass es sich um Simonetta Vespucci handelt. Gelebt hat Simonetta vor gut 500 Jahren in Florenz. Dort",weibliches_idealbildnis.txt
Alles gut?,Geograph,0.508716299914448,"kannst du ein Winkelmaß erkennen. All diese Dinge braucht, na??? – ein Geograph. Oder Kartograph. Jemand, der Landkarten von der Erde zeichnet.
Das Ge",der_geograf.txt
Alles gut?,"Er vertraut mir, das Schaf, und ich werde der ganzen Welt kundtun, wie ich ihn gefällt habe.",0.44125960269645936,"e ihn, obwohl ich ihn liebe. Er vertraut mir, das Schaf, und ich werde der ganzen Welt kundtun, wie ich ihn gefällt habe. Dann opfert niemand mehr der",simson_delila.txt
Alles gut?,Dem Erfolg des Porträts tat dies jedoch keinen Abbruch,0.4386354479728838,"d sein linker Oberschenkel ist zu lang geraten.
Dem Erfolg des Porträts tat dies jedoch keinen Abbruch. 
de_ges_728_fra // Fokus Frankfurt
Johann Wolf",goethe_in_der_roemishen_campagna.txt
Alles gut?,Weil sie deiner überdrüssig wurde,0.4239270166680649,"hast du mir das angetan? Sagst du nichts mehr?
Sprecher B: Weil sie deiner überdrüssig wurde, du Tor! Deiner Wutausbrüche, Simson. Deiner Gewalttaten!",die_blendung_simsons.txt
Alles gut?,Botticelli,0.42089011179610947, ganz bisschen buckelig – und ernster Blick. Das war damals angesagt. Botticelli hat Simonetta sogar noch blasser gemacht als in Wirklichkeit. Wir hab,weibliches_idealbildnis.txt
Alles gut?,"So wisse, auch die sind schuldig, die nicht eingreifen bei einer Ungerechtigkeit, die nur zusehen und sich gar noch daran laben",0.4200568009459681," Ist es so? So wisse, auch die sind schuldig, die nicht eingreifen bei einer Ungerechtigkeit, die nur zusehen und sich gar noch daran laben.
Sprecher ",die_blendung_simsons.txt
"
","
"
wer ist Delila,"die Verbündete von Simsons Feinden, den Philistern",0.7956761245424854,"d Dalilah gewählt: die Blendung Simsons. Dalilah, die Verbündete von Simsons Feinden, den Philistern, hat den als unbesiegbar geltenden Helden verführ",die_blendung_simsons.txt
wer ist Delila,Simonetta Vespucci,0.7298712713203187," hier dargestellt hat, aber vieles spricht dafür, dass es sich um Simonetta Vespucci handelt. Gelebt hat Simonetta vor gut 500 Jahren in Florenz. Dort",weibliches_idealbildnis.txt
wer ist Delila,schönen Philisterin Delilah,0.7192280561977544,"text
1902 hat Max Liebermann die biblische Geschichte von der schönen Philisterin Delilah gemalt, die Simson, dem Anführer der feindlichen Israeliten,",simson_delila.txt
wer ist Delila,die Verbündete von Simsons Feinden,0.6562590676708292," Höhepunkt der biblischen Geschichte.
Zuvor hatte Delila, die Verbündete von Simsons Feinden, den Philistern, den als unbesiegbar geltenden Helden ver",die_blendung_simsons.txt
wer ist Delila,"Auch Delilah, die den Simson besiegt, ist eine Philisterin",0.6560650724956409,"seiner Kunst gerne als Philister bezeichnete. Auch Delilah, die den Simson besiegt, ist eine Philisterin. Es mag sein, dass hier ein Schlüssel liegt, ",simson_delila.txt
wer ist Delila,Simonettas Nachnamen,0.6556314142457451,"z, das man damals Wespennetz, „vespaio“, nannte. Ein Hinweis auf Simonettas Nachnamen: Vespucci. Dennoch wäre die echte Simonetta mit einer derartigen",weibliches_idealbildnis.txt
wer ist Delila,Weil sie deiner überdrüssig wurde,0.5724532357534026,"hast du mir das angetan? Sagst du nichts mehr?
Sprecher B: Weil sie deiner überdrüssig wurde, du Tor! Deiner Wutausbrüche, Simson. Deiner Gewalttaten!",die_blendung_simsons.txt
wer ist Delila,"Simson gewann ein Mädchen lieb, die hieß Delila",0.5712366711758714,"hwachen, die nie diesen Schritt wagten.
Sprecher B: Simson gewann ein Mädchen lieb, die hieß Delila. Und Delila sprach zu Simson: „Sage mir doch, wori",simson_delila.txt
wer ist Delila,Simonetta Vespucci,0.5662152536534384,"ntiner Familien damals die Antike zum Vorbild.
Das Bildnis stellt Simonetta Vespucci dar, eine in ganz Florenz gepriesene Schönheit – allerdings nicht",weibliches_idealbildnis.txt
wer ist Delila,groß,0.5389439575969484,"ie Madonna sehr groß oder das Zimmer sehr klein? Beides richtig, Madonna groß weil ihre Bedeutung hervorgehoben werden soll.
Das kleine Bild Jan van E",lucca_madonna.txt
