<?xml version="1.0" encoding="UTF-8" standalone="no"?>
<svg
   width="224.95985"
   height="166.29541"
   viewBox="0 0 179.96788 133.03633"
   version="1.1"
   id="svg3677"
   inkscape:version="1.3.2 (091e20ef0f, 2023-11-25)"
   sodipodi:docname="pappus_affine.svg"
   xmlns:inkscape="http://www.inkscape.org/namespaces/inkscape"
   xmlns:sodipodi="http://sodipodi.sourceforge.net/DTD/sodipodi-0.dtd"
   xmlns="http://www.w3.org/2000/svg"
   xmlns:svg="http://www.w3.org/2000/svg"
   xmlns:rdf="http://www.w3.org/1999/02/22-rdf-syntax-ns#"
   xmlns:cc="http://creativecommons.org/ns#"
   xmlns:dc="http://purl.org/dc/elements/1.1/">
  <metadata
     id="metadata3811">
    <rdf:RDF>
      <cc:Work
         rdf:about="">
        <dc:format>image/svg+xml</dc:format>
        <dc:type
           rdf:resource="http://purl.org/dc/dcmitype/StillImage" />
      </cc:Work>
    </rdf:RDF>
  </metadata>
  <sodipodi:namedview
     pagecolor="#ffffff"
     bordercolor="#666666"
     borderopacity="1"
     objecttolerance="10"
     gridtolerance="10"
     guidetolerance="10"
     inkscape:pageopacity="0"
     inkscape:pageshadow="2"
     inkscape:window-width="1536"
     inkscape:window-height="1062"
     id="namedview3809"
     showgrid="false"
     units="mm"
     fit-margin-top="2"
     fit-margin-left="2"
     fit-margin-right="2"
     fit-margin-bottom="2"
     inkscape:zoom="4.4222482"
     inkscape:cx="112.6124"
     inkscape:cy="82.876398"
     inkscape:window-x="192"
     inkscape:window-y="18"
     inkscape:window-maximized="0"
     inkscape:current-layer="surface1"
     inkscape:showpageshadow="2"
     inkscape:pagecheckerboard="0"
     inkscape:deskcolor="#d1d1d1" />
  <defs
     id="defs3679">
    <marker
       style="overflow:visible"
       id="DartArrow"
       refX="0"
       refY="0"
       orient="auto-start-reverse"
       inkscape:stockid="Dart arrow"
       markerWidth="1"
       markerHeight="1"
       viewBox="0 0 1 1"
       inkscape:isstock="true"
       inkscape:collect="always"
       preserveAspectRatio="xMidYMid">
      <path
         style="fill:context-stroke;fill-rule:evenodd;stroke:none"
         d="M 0,0 5,-5 -12.5,0 5,5 Z"
         transform="scale(-0.5)"
         id="path6" />
    </marker>
    <g
       id="g3681">
      <symbol
         overflow="visible"
         id="glyph0-0"
         style="overflow:visible">
        <path
           style="stroke:none"
           d=""
           id="path3684"
           inkscape:connector-curvature="0" />
      </symbol>
      <symbol
         overflow="visible"
         id="glyph0-1"
         style="overflow:visible">
        <path
           style="stroke:none"
           d="M 1.90625,-1.578125 C 1.5,-0.875 1.203125,-0.6875 0.640625,-0.640625 c -0.140625,0 -0.40625,0.15625 -0.40625,0.375 C 0.234375,-0.1875 0.46875,0 0.546875,0 c 0.21875,0 0.75,-0.03125 0.96875,-0.03125 C 1.859375,-0.03125 2.25,0 2.578125,0 c 0.078125,0 0.375,-0.140625 0.375,-0.375 0,-0.109375 -0.25,-0.265625 -0.328125,-0.265625 -0.265625,-0.03125 -0.34375,0.03125 -0.34375,-0.25 0,-0.171875 0.03125,-0.203125 0.1875,-0.453125 l 0.875,-1.484375 2.8125,0 c 0,-0.03125 0,0.0625 0.015625,0.171875 0.03125,0.3125 0.171875,1.5625 0.171875,1.78125 0,0.359375 -0.4375,0.234375 -0.625,0.234375 -0.140625,0 -0.4375,0.15625 -0.4375,0.359375 C 5.28125,-0.140625 5.5625,0 5.625,0 5.828125,0 6.078125,-0.03125 6.28125,-0.03125 l 0.671875,0 C 7.6875,-0.03125 8.21875,0 8.21875,0 c 0.09375,0 0.375,-0.140625 0.375,-0.375 0,-0.109375 -0.265625,-0.265625 -0.4375,-0.265625 -0.65625,0 -0.515625,0.046875 -0.546875,-0.3125 L 6.875,-8.421875 c -0.03125,-0.234375 -0.234375,-0.40625 -0.359375,-0.40625 -0.125,0 -0.3125,0.0625 -0.421875,0.25 z m 1.671875,-1.625 2.390625,-4.015625 -0.265625,-0.109375 0.375,3.859375 -2.34375,0 z m 0,0"
           id="path3687"
           inkscape:connector-curvature="0" />
      </symbol>
      <symbol
         overflow="visible"
         id="glyph0-2"
         style="overflow:visible">
        <path
           style="stroke:none"
           d="m 2.921875,-8.140625 c 0,-0.046875 0.03125,-0.125 0.03125,-0.171875 0,-0.125 -0.28125,-0.28125 -0.296875,-0.28125 -0.015625,0 -0.4375,0.03125 -0.65625,0.0625 -0.203125,0.015625 -0.390625,0.03125 -0.59375,0.046875 -0.296875,0.015625 -0.546875,0.1875 -0.546875,0.40625 0,0.125 0.28125,0.265625 0.40625,0.265625 0.609375,0 0.4375,-0.046875 0.4375,0.078125 0,0.078125 -0.09375,0.421875 -0.140625,0.640625 l -0.28125,1.140625 c -0.125,0.484375 -0.796875,3.1875 -0.84375,3.40625 C 0.375,-2.25 0.375,-2.03125 0.375,-1.875 c 0,1.21875 0.84375,2 1.625,2 1.375,0 2.96875,-1.9375 2.96875,-3.65625 0,-1.109375 -0.765625,-2.03125 -1.671875,-2.03125 -0.625,0 -1.296875,0.546875 -1.53125,0.796875 l 0.28125,0.109375 z m -0.90625,7.71875 c -0.390625,0 -0.65625,-0.125 -0.65625,-1.0625 0,-0.390625 0.046875,-0.625 0.25,-1.453125 C 1.65625,-3.09375 1.84375,-3.859375 1.890625,-4.015625 1.90625,-4.109375 2.46875,-5.03125 3.28125,-5.03125 c 0.515625,0 0.59375,0.375 0.59375,1 0,0.578125 -0.34375,1.921875 -0.640625,2.53125 C 2.9375,-0.84375 2.5625,-0.421875 2.015625,-0.421875 z m 0,0"
           id="path3690"
           inkscape:connector-curvature="0" />
      </symbol>
      <symbol
         overflow="visible"
         id="glyph0-3"
         style="overflow:visible">
        <path
           style="stroke:none"
           d="m 9.078125,-8.453125 c 0,-0.109375 -0.234375,-0.265625 -0.25,-0.265625 -0.03125,0 -0.203125,0.046875 -0.296875,0.171875 l -0.6875,0.84375 C 7.515625,-8.265625 6.75,-8.71875 5.859375,-8.71875 3.28125,-8.71875 0.4375,-5.9375 0.4375,-3.125 0.4375,-1.140625 2,0.25 3.734375,0.25 c 0.96875,0 1.90625,-0.4375 2.59375,-1.03125 1.046875,-0.875 1.40625,-2.140625 1.40625,-2.234375 0,-0.109375 -0.25,-0.265625 -0.28125,-0.265625 -0.109375,0 -0.25,0.125 -0.328125,0.296875 -0.53125,1.84375 -1.984375,2.59375 -3.1875,2.59375 -1.265625,0 -2.203125,-0.65625 -2.203125,-2.359375 0,-0.375 0.078125,-2.359375 1.421875,-3.921875 C 3.8125,-7.4375 4.828125,-8.0625 5.96875,-8.0625 c 1.3125,0 1.734375,0.9375 1.734375,2.15625 0,0.3125 -0.046875,0.578125 -0.046875,0.625 0,0.109375 0.296875,0.25 0.328125,0.25 0.125,0 0.296875,-0.15625 0.34375,-0.375 z m 0,0"
           id="path3693"
           inkscape:connector-curvature="0" />
      </symbol>
      <symbol
         overflow="visible"
         id="glyph0-4"
         style="overflow:visible">
        <path
           style="stroke:none"
           d="M 3.4375,-1.578125 C 3.375,-1.375 3.421875,-1.453125 3.25,-1.21875 c -0.265625,0.328125 -0.671875,0.796875 -1.234375,0.796875 -0.484375,0 -0.609375,-0.28125 -0.609375,-0.984375 0,-0.65625 0.375,-2 0.609375,-2.5 0.40625,-0.84375 0.8125,-1.125 1.265625,-1.125 0.796875,0 0.78125,0.828125 0.78125,0.9375 0,0 0.015625,0.046875 -0.0625,0.1875 z M 4.515625,-4.625 c -0.125,-0.3125 -0.609375,-0.9375 -1.234375,-0.9375 -1.34375,0 -2.96875,1.890625 -2.96875,3.65625 0,1.1875 0.859375,2.03125 1.671875,2.03125 0.65625,0 1.328125,-0.5625 1.453125,-0.703125 0.046875,0.34375 0.78125,0.703125 1.140625,0.703125 0.359375,0 0.75,-0.25 0.96875,-0.703125 0.234375,-0.5 0.40625,-1.234375 0.40625,-1.28125 0,-0.046875 -0.203125,-0.25 -0.28125,-0.25 -0.109375,0 -0.28125,0.203125 -0.328125,0.375 -0.1875,0.703125 -0.234375,1.3125 -0.734375,1.3125 -0.34375,0 -0.203125,-0.15625 -0.203125,-0.390625 0,-0.28125 0.03125,-0.40625 0.140625,-0.875 C 4.625,-1.984375 4.6875,-2.25 4.78125,-2.59375 c 0.4375,-1.796875 0.546875,-2.21875 0.546875,-2.296875 0,-0.171875 -0.28125,-0.453125 -0.46875,-0.453125 -0.375,0 -0.640625,0.5625 -0.65625,0.703125 z m 0,0"
           id="path3696"
           inkscape:connector-curvature="0" />
      </symbol>
      <symbol
         overflow="visible"
         id="glyph0-5"
         style="overflow:visible">
        <path
           style="stroke:none"
           d="m 4.53125,-7.5 c 0.109375,-0.4375 0,-0.3125 0.46875,-0.3125 l 1.546875,0 c 1.359375,0 1.1875,1 1.1875,1.109375 0,0.96875 -0.796875,2.046875 -2.375,2.046875 l -1.53125,0 z m 1.859375,3.234375 C 7.703125,-4.5 9.03125,-5.5625 9.03125,-6.65625 c 0,-0.9375 -0.96875,-1.8125 -2.328125,-1.8125 l -3.828125,0 c -0.234375,0 -0.515625,0.15625 -0.515625,0.390625 0,0.125 0.28125,0.265625 0.46875,0.265625 0.71875,0 0.546875,-0.046875 0.546875,0.078125 0,0.03125 0,0.078125 -0.046875,0.265625 L 1.71875,-1.046875 C 1.609375,-0.625 1.75,-0.640625 0.921875,-0.640625 0.6875,-0.640625 0.40625,-0.484375 0.40625,-0.28125 0.40625,-0.140625 0.640625,0 0.890625,0 l 4.09375,0 C 6.8125,0 8.375,-1.53125 8.375,-2.734375 8.375,-3.71875 7.359375,-4.46875 6.390625,-4.5625 z m -1.6875,3.625 -1.625,0 c -0.15625,0 -0.1875,0 -0.25,-0.015625 -0.140625,-0.015625 0,0.125 0,0.015625 0,-0.078125 0.03125,-0.140625 0.046875,-0.25 L 3.6875,-4.125 l 2.125,0 c 1.40625,0 1.234375,1.171875 1.234375,1.265625 0,1.15625 -0.859375,2.21875 -2.34375,2.21875 z m 0,0"
           id="path3699"
           inkscape:connector-curvature="0" />
      </symbol>
      <symbol
         overflow="visible"
         id="glyph0-6"
         style="overflow:visible">
        <path
           style="stroke:none"
           d="m 4.671875,-4.796875 c -0.21875,0 -0.453125,0.046875 -0.625,0.1875 -0.0625,0.0625 -0.25,0.359375 -0.25,0.546875 0,0.234375 0.34375,0.53125 0.578125,0.53125 0.28125,0 0.765625,-0.390625 0.765625,-0.875 0,-0.5625 -0.703125,-1.15625 -1.53125,-1.15625 -1.5625,0 -3.296875,1.859375 -3.296875,3.546875 0,1.046875 0.8125,2.140625 2.03125,2.140625 1.625,0 2.8125,-1.421875 2.8125,-1.578125 0,-0.0625 -0.234375,-0.28125 -0.28125,-0.28125 -0.03125,0 -0.171875,0.0625 -0.265625,0.171875 -0.765625,1.015625 -1.78125,1.140625 -2.25,1.140625 -0.8125,0 -0.921875,-0.5625 -0.921875,-1.15625 0,-0.421875 0.15625,-1.46875 0.578125,-2.28125 0.3125,-0.5625 0.859375,-1.171875 1.609375,-1.171875 0.15625,0 0.640625,-0.125 0.8125,0.234375 z m 0,0"
           id="path3702"
           inkscape:connector-curvature="0" />
      </symbol>
      <symbol
         overflow="visible"
         id="glyph0-7"
         style="overflow:visible">
        <path
           style="stroke:none"
           d="m 3.875,-1.671875 c -0.046875,0.1875 -0.03125,0.140625 -0.1875,0.328125 -0.484375,0.625 -0.859375,0.8125 -1.234375,0.8125 -0.390625,0 -0.609375,-0.15625 -0.609375,-0.984375 0,-0.640625 0.359375,-1.96875 0.53125,-2.34375 0.390625,-0.734375 0.8125,-1.171875 1.3125,-1.171875 0.796875,0 0.78125,0.828125 0.78125,0.890625 L 4.4375,-3.96875 z M 4.9375,-4.625 c -0.15625,-0.34375 -0.640625,-0.9375 -1.25,-0.9375 -1.296875,0 -2.953125,1.78125 -2.953125,3.5625 0,1.25 0.921875,2 1.6875,2 C 3.0625,0 3.734375,-0.53125 3.9375,-0.78125 L 3.671875,-0.890625 3.40625,0.171875 c -0.171875,0.671875 -0.1875,0.875 -0.625,1.28125 -0.484375,0.5 -0.828125,0.453125 -1.078125,0.453125 -0.359375,0 -0.65625,-0.03125 -0.96875,-0.125 l 0,0.296875 C 1.125,1.96875 1.375,1.5 1.375,1.359375 c 0,-0.1875 -0.296875,-0.53125 -0.5625,-0.53125 -0.28125,0 -0.765625,0.390625 -0.765625,0.78125 0,0.5 0.65625,0.828125 1.671875,0.828125 1.546875,0 2.5,-1.140625 2.65625,-1.78125 l 1.328125,-5.359375 c 0.03125,-0.140625 0.03125,-0.15625 0.03125,-0.1875 0,-0.171875 -0.28125,-0.453125 -0.46875,-0.453125 -0.28125,0 -0.609375,0.390625 -0.65625,0.703125 z m 0,0"
           id="path3705"
           inkscape:connector-curvature="0" />
      </symbol>
      <symbol
         overflow="visible"
         id="glyph0-8"
         style="overflow:visible">
        <path
           style="stroke:none"
           d="m 3.515625,-8.140625 c 0.015625,-0.046875 0.03125,-0.125 0.03125,-0.171875 0,-0.125 -0.265625,-0.28125 -0.296875,-0.28125 -0.015625,0 -0.59375,0.046875 -0.65625,0.0625 C 2.390625,-8.515625 2.21875,-8.5 2,-8.484375 c -0.296875,0.015625 -0.546875,0.1875 -0.546875,0.40625 0,0.125 0.25,0.265625 0.421875,0.265625 0.59375,0 0.4375,-0.046875 0.4375,0.078125 0,0.078125 -0.03125,0.15625 -0.046875,0.1875 L 0.53125,-0.625 c -0.046875,0.1875 -0.046875,0.21875 -0.046875,0.296875 0,0.25 0.375,0.453125 0.5,0.453125 0.203125,0 0.515625,-0.296875 0.5625,-0.4375 L 2.09375,-2.46875 C 2.15625,-2.734375 2.21875,-2.984375 2.28125,-3.25 2.421875,-3.75 2.359375,-3.65625 2.59375,-4 2.828125,-4.34375 3.25,-5.03125 4.171875,-5.03125 c 0.484375,0 0.484375,0.21875 0.484375,0.6875 0,0.671875 -0.46875,1.96875 -0.734375,2.6875 C 3.8125,-1.375 3.75,-1.203125 3.75,-0.984375 3.75,-0.453125 4.296875,0.125 4.859375,0.125 c 1.109375,0 1.6875,-1.90625 1.6875,-1.984375 0,-0.046875 -0.203125,-0.25 -0.265625,-0.25 -0.109375,0 -0.296875,0.171875 -0.359375,0.375 -0.265625,0.953125 -0.546875,1.3125 -1.015625,1.3125 -0.125,0 -0.15625,0.140625 -0.15625,-0.234375 0,-0.3125 0.140625,-0.6875 0.1875,-0.828125 0.21875,-0.578125 0.75,-1.984375 0.75,-2.671875 0,-0.71875 -0.578125,-1.40625 -1.484375,-1.40625 -0.671875,0 -1.390625,0.359375 -1.890625,0.984375 l 0.28125,0.109375 z m 0,0"
           id="path3708"
           inkscape:connector-curvature="0" />
      </symbol>
    </g>
    <clipPath
       id="clip1">
      <path
         d="m 223.55859,103.94922 170,0 0,33.05078 -170,0 z m 0,0"
         id="path3711"
         inkscape:connector-curvature="0" />
    </clipPath>
    <clipPath
       id="clip2">
      <path
         d="M 223.55859,197 390,197 l 0,21 -166.44141,0 z m 0,0"
         id="path3714"
         inkscape:connector-curvature="0" />
    </clipPath>
  </defs>
  <g
     id="surface1"
     transform="translate(-218.35786,-94.840955)">
    <path
       style="fill:none;stroke:#00ae00;stroke-width:11.39999998;stroke-linecap:butt;stroke-linejoin:miter;stroke-miterlimit:10;stroke-opacity:1;stroke-dasharray:none"
       d="m 2622.7344,6361.6406 30.3515,810.9375"
       transform="matrix(0.1,0,0,-0.1,0,842)"
       id="path3717"
       inkscape:connector-curvature="0" />
    <path
       style="fill:none;stroke:#0000ff;stroke-width:5.00388002;stroke-linecap:butt;stroke-linejoin:miter;stroke-miterlimit:10;stroke-opacity:1"
       d="m 2618.0469,6361.9531 450.3515,855.6641"
       transform="matrix(0.1,0,0,-0.1,0,842)"
       id="path3719"
       inkscape:connector-curvature="0" />
    <path
       style="fill:none;stroke:#d100d1;stroke-width:5.00388002;stroke-linecap:butt;stroke-linejoin:miter;stroke-miterlimit:10;stroke-opacity:1"
       d="m 2653.0859,7172.5781 416.6407,-824.9609"
       transform="matrix(0.1,0,0,-0.1,0,842)"
       id="path3721"
       inkscape:connector-curvature="0" />
    <path
       style="fill:none;stroke:#0000ff;stroke-width:5.00388002;stroke-linecap:butt;stroke-linejoin:miter;stroke-miterlimit:10;stroke-opacity:1"
       d="m 3068.3984,6346.9531 490.3907,930.7422"
       transform="matrix(0.1,0,0,-0.1,0,842)"
       id="path3723"
       inkscape:connector-curvature="0" />
    <path
       style="fill:none;stroke:#00ae00;stroke-width:11.39999998;stroke-linecap:butt;stroke-linejoin:miter;stroke-miterlimit:10;stroke-opacity:1;stroke-dasharray:none"
       d="m 3518.75,6331.9531 35.0391,940.7031"
       transform="matrix(0.1,0,0,-0.1,0,842)"
       id="path3725"
       inkscape:connector-curvature="0" />
    <path
       style="fill:none;stroke:#d100d1;stroke-width:5.00388002;stroke-linecap:butt;stroke-linejoin:miter;stroke-miterlimit:10;stroke-opacity:1"
       d="M 3068.3984,7217.6172 3518.75,6326.9531"
       transform="matrix(0.1,0,0,-0.1,0,842)"
       id="path3727"
       inkscape:connector-curvature="0" />
    <path
       style="fill:#000000;fill-opacity:1;fill-rule:evenodd;stroke:none"
       d="m 266.97656,124.74219 c 0,0.91797 -0.74609,1.66797 -1.66797,1.66797 -0.92187,0 -1.66797,-0.75 -1.66797,-1.66797 0,-0.92188 0.7461,-1.66797 1.66797,-1.66797 0.92188,0 1.66797,0.74609 1.66797,1.66797"
       id="path3737"
       inkscape:connector-curvature="0" />
    <path
       style="fill:none;stroke:#000000;stroke-width:2.50194001;stroke-linecap:butt;stroke-linejoin:miter;stroke-miterlimit:10;stroke-opacity:1"
       d="m 2669.7656,7172.5781 c 0,-9.1797 -7.4609,-16.6797 -16.6797,-16.6797 -9.2187,0 -16.6796,7.5 -16.6796,16.6797 0,9.2188 7.4609,16.6797 16.6796,16.6797 9.2188,0 16.6797,-7.4609 16.6797,-16.6797 z m 0,0"
       transform="matrix(0.1,0,0,-0.1,0,842)"
       id="path3739"
       inkscape:connector-curvature="0" />
    <path
       style="fill:#000000;fill-opacity:1;fill-rule:evenodd;stroke:none"
       d="m 263.97266,205.30469 c 0,0.91797 -0.7461,1.66797 -1.66797,1.66797 -0.92188,0 -1.66797,-0.75 -1.66797,-1.66797 0,-0.92188 0.74609,-1.66797 1.66797,-1.66797 0.92187,0 1.66797,0.74609 1.66797,1.66797"
       id="path3741"
       inkscape:connector-curvature="0" />
    <path
       style="fill:none;stroke:#000000;stroke-width:2.50194001;stroke-linecap:butt;stroke-linejoin:miter;stroke-miterlimit:10;stroke-opacity:1"
       d="m 2639.7266,6366.9531 c 0,-9.1797 -7.461,-16.6797 -16.6797,-16.6797 -9.2188,0 -16.6797,7.5 -16.6797,16.6797 0,9.2188 7.4609,16.6797 16.6797,16.6797 9.2187,0 16.6797,-7.4609 16.6797,-16.6797 z m 0,0"
       transform="matrix(0.1,0,0,-0.1,0,842)"
       id="path3743"
       inkscape:connector-curvature="0" />
    <path
       style="fill:#000000;fill-opacity:1;fill-rule:evenodd;stroke:none"
       d="m 308.50781,206.80469 c 0,0.92187 -0.74609,1.66797 -1.66797,1.66797 -0.92187,0 -1.66797,-0.7461 -1.66797,-1.66797 0,-0.92188 0.7461,-1.66797 1.66797,-1.66797 0.92188,0 1.66797,0.74609 1.66797,1.66797"
       id="path3745"
       inkscape:connector-curvature="0" />
    <path
       style="fill:none;stroke:#000000;stroke-width:2.50194001;stroke-linecap:butt;stroke-linejoin:miter;stroke-miterlimit:10;stroke-opacity:1"
       d="m 3085.0781,6351.9531 c 0,-9.2187 -7.4609,-16.6797 -16.6797,-16.6797 -9.2187,0 -16.6796,7.461 -16.6796,16.6797 0,9.2188 7.4609,16.6797 16.6796,16.6797 9.2188,0 16.6797,-7.4609 16.6797,-16.6797 z m 0,0"
       transform="matrix(0.1,0,0,-0.1,0,842)"
       id="path3747"
       inkscape:connector-curvature="0" />
    <path
       style="fill:#000000;fill-opacity:1;fill-rule:evenodd;stroke:none"
       d="m 353.54297,209.30469 c 0,0.92187 -0.7461,1.66797 -1.66797,1.66797 -0.92188,0 -1.66797,-0.7461 -1.66797,-1.66797 0,-0.91797 0.74609,-1.66797 1.66797,-1.66797 0.92187,0 1.66797,0.75 1.66797,1.66797"
       id="path3749"
       inkscape:connector-curvature="0" />
    <path
       style="fill:none;stroke:#000000;stroke-width:2.50194001;stroke-linecap:butt;stroke-linejoin:miter;stroke-miterlimit:10;stroke-opacity:1"
       d="m 3535.4297,6326.9531 c 0,-9.2187 -7.4609,-16.6797 -16.6797,-16.6797 -9.2187,0 -16.6797,7.461 -16.6797,16.6797 0,9.1797 7.461,16.6797 16.6797,16.6797 9.2188,0 16.6797,-7.5 16.6797,-16.6797 z m 0,0"
       transform="matrix(0.1,0,0,-0.1,0,842)"
       id="path3751"
       inkscape:connector-curvature="0" />
    <path
       style="fill:#000000;fill-opacity:1;fill-rule:evenodd;stroke:none"
       d="m 357.04687,114.73438 c 0,0.91796 -0.75,1.66796 -1.66796,1.66796 -0.92188,0 -1.66797,-0.75 -1.66797,-1.66796 0,-0.92188 0.74609,-1.66797 1.66797,-1.66797 0.91796,0 1.66796,0.74609 1.66796,1.66797"
       id="path3753"
       inkscape:connector-curvature="0" />
    <path
       style="fill:none;stroke:#000000;stroke-width:2.50194001;stroke-linecap:butt;stroke-linejoin:miter;stroke-miterlimit:10;stroke-opacity:1"
       d="m 3570.4688,7272.6562 c 0,-9.1796 -7.5,-16.6796 -16.6797,-16.6796 -9.2188,0 -16.6797,7.5 -16.6797,16.6796 0,9.2188 7.4609,16.6797 16.6797,16.6797 9.1797,0 16.6797,-7.4609 16.6797,-16.6797 z m 0,0"
       transform="matrix(0.1,0,0,-0.1,0,842)"
       id="path3755"
       inkscape:connector-curvature="0" />
    <path
       style="fill:#000000;fill-opacity:1;fill-rule:evenodd;stroke:none"
       d="m 308.33984,119.73828 c 0,0.91797 -0.74609,1.66797 -1.66797,1.66797 -0.91796,0 -1.66796,-0.75 -1.66796,-1.66797 0,-0.92187 0.75,-1.66797 1.66796,-1.66797 0.92188,0 1.66797,0.7461 1.66797,1.66797"
       id="path3757"
       inkscape:connector-curvature="0" />
    <path
       style="fill:none;stroke:#000000;stroke-width:2.50194001;stroke-linecap:butt;stroke-linejoin:miter;stroke-miterlimit:10;stroke-opacity:1"
       d="m 3083.3984,7222.6172 c 0,-9.1797 -7.4609,-16.6797 -16.6796,-16.6797 -9.1797,0 -16.6797,7.5 -16.6797,16.6797 0,9.2187 7.5,16.6797 16.6797,16.6797 9.2187,0 16.6796,-7.461 16.6796,-16.6797 z m 0,0"
       transform="matrix(0.1,0,0,-0.1,0,842)"
       id="path3759"
       inkscape:connector-curvature="0" />
    <g
       clip-path="url(#clip1)"
       clip-rule="nonzero"
       id="g3765">
      <path
         style="fill:none;stroke:#000000;stroke-width:5.00388002;stroke-linecap:butt;stroke-linejoin:miter;stroke-miterlimit:10;stroke-opacity:1"
         d="m 2242.7734,7127.5781 1681.2891,185.1172"
         transform="matrix(0.1,0,0,-0.1,0,842)"
         id="path3767"
         inkscape:connector-curvature="0" />
    </g>
    <g
       clip-path="url(#clip2)"
       clip-rule="nonzero"
       id="g3769">
      <path
         style="fill:none;stroke:#000000;stroke-width:5.00388002;stroke-linecap:butt;stroke-linejoin:miter;stroke-miterlimit:10;stroke-opacity:1"
         d="m 2242.7734,6376.9922 1586.211,-60.0781"
         transform="matrix(0.1,0,0,-0.1,0,842)"
         id="path3771"
         inkscape:connector-curvature="0" />
    </g>
    <g
       style="fill:#211e1e;fill-opacity:1"
       id="g3797" />
    <text
       xml:space="preserve"
       style="font-size:8.53336px;line-height:1.25;font-family:sans-serif;word-spacing:0px;stroke-width:0.8"
       x="383.23798"
       y="108.95185"
       id="text1"><tspan
         sodipodi:role="line"
         id="tspan1"
         style="stroke-width:0.8"
         x="383.23798"
         y="108.95185">\(l\)</tspan></text>
    <text
       xml:space="preserve"
       style="font-size:8.53336px;line-height:1.25;font-family:sans-serif;word-spacing:0px;stroke-width:0.8"
       x="374.33185"
       y="206.81729"
       id="text2"><tspan
         sodipodi:role="line"
         id="tspan2"
         style="stroke-width:0.8"
         x="374.33185"
         y="206.81729">\(l'\)</tspan></text>
    <text
       xml:space="preserve"
       style="font-size:8.53336px;line-height:1.25;font-family:sans-serif;word-spacing:0px;stroke-width:0.8"
       x="256.20007"
       y="217.5723"
       id="text3"><tspan
         sodipodi:role="line"
         id="tspan3"
         style="stroke-width:0.8"
         x="256.20007"
         y="217.5723">\(z'\)</tspan></text>
    <text
       xml:space="preserve"
       style="font-size:8.53336px;line-height:1.25;font-family:sans-serif;word-spacing:0px;stroke-width:0.8"
       x="299.40024"
       y="219.1723"
       id="text4"><tspan
         sodipodi:role="line"
         id="tspan4"
         style="stroke-width:0.8"
         x="299.40024"
         y="219.1723">\(y'\)</tspan></text>
    <text
       xml:space="preserve"
       style="font-size:8.53336px;line-height:1.25;font-family:sans-serif;word-spacing:0px;stroke-width:0.8"
       x="345.80042"
       y="220.77231"
       id="text5"><tspan
         sodipodi:role="line"
         id="tspan5"
         style="stroke-width:0.8"
         x="345.80042"
         y="220.77231">\(x'\)</tspan></text>
    <text
       xml:space="preserve"
       style="font-size:8.53336px;line-height:1.25;font-family:sans-serif;word-spacing:0px;stroke-width:0.8"
       x="261.62115"
       y="119.62856"
       id="text6"><tspan
         sodipodi:role="line"
         id="tspan6"
         style="stroke-width:0.8"
         x="261.62115"
         y="119.62856">\(x\)</tspan></text>
    <text
       xml:space="preserve"
       style="font-size:8.53336px;line-height:1.25;font-family:sans-serif;word-spacing:0px;stroke-width:0.8"
       x="303.22131"
       y="113.22856"
       id="text7"><tspan
         sodipodi:role="line"
         id="tspan7"
         style="stroke-width:0.8"
         x="303.22131"
         y="113.22856">\(y\)</tspan></text>
    <text
       xml:space="preserve"
       style="font-size:8.53336px;line-height:1.25;font-family:sans-serif;word-spacing:0px;stroke-width:0.8"
       x="352.8215"
       y="110.02856"
       id="text8"><tspan
         sodipodi:role="line"
         id="tspan8"
         style="stroke-width:0.8"
         x="352.8215"
         y="110.02856">\(z\)</tspan></text>
    <path
       style="fill:none;stroke:#ff0a0a;stroke-width:0.48;stroke-linecap:butt;stroke-linejoin:miter;stroke-opacity:1;marker-end:url(#DartArrow);stroke-dasharray:none"
       d="m 266.92048,121.42973 33.92296,-3.59266"
       id="path8"
       sodipodi:nodetypes="cc" />
    <path
       style="fill:none;stroke:#ff0a0a;stroke-width:0.48;stroke-linecap:butt;stroke-linejoin:miter;stroke-dasharray:none;stroke-opacity:1;marker-end:url(#DartArrow)"
       d="m 313.32048,116.62973 33.92296,-3.59266"
       id="path9"
       sodipodi:nodetypes="cc" />
    <path
       style="fill:none;stroke:#ff0a0a;stroke-width:0.48;stroke-linecap:butt;stroke-linejoin:miter;stroke-dasharray:none;stroke-opacity:1;marker-end:url(#DartArrow)"
       d="m 262.55618,208.73972 39.43181,1.75175"
       id="path10"
       sodipodi:nodetypes="cc" />
    <path
       style="fill:none;stroke:#ff0a0a;stroke-width:0.48;stroke-linecap:butt;stroke-linejoin:miter;stroke-dasharray:none;stroke-opacity:1;marker-end:url(#DartArrow)"
       d="m 308.95618,210.33972 39.43181,1.75175"
       id="path11"
       sodipodi:nodetypes="cc" />
    <text
       xml:space="preserve"
       style="font-size:8.53336px;line-height:1.25;font-family:sans-serif;word-spacing:0px;stroke-width:0.8"
       x="281.25323"
       y="114.9235"
       id="text11"><tspan
         sodipodi:role="line"
         id="tspan11"
         style="stroke-width:0.8"
         x="281.25323"
         y="114.9235">\(f\)</tspan></text>
    <text
       xml:space="preserve"
       style="font-size:8.53336px;line-height:1.25;font-family:sans-serif;word-spacing:0px;stroke-width:0.8"
       x="326.05341"
       y="110.1235"
       id="text12"><tspan
         sodipodi:role="line"
         id="tspan12"
         style="stroke-width:0.8"
         x="326.05341"
         y="110.1235">\(g\)</tspan></text>
    <text
       xml:space="preserve"
       style="font-size:8.53336px;line-height:1.25;font-family:sans-serif;word-spacing:0px;stroke-width:0.8"
       x="277.67035"
       y="217.72327"
       id="text13"><tspan
         sodipodi:role="line"
         id="tspan13"
         style="stroke-width:0.8"
         x="277.67035"
         y="217.72327">\(g\)</tspan></text>
    <text
       xml:space="preserve"
       style="font-size:8.53336px;line-height:1.25;font-family:sans-serif;word-spacing:0px;stroke-width:0.8"
       x="322.89993"
       y="222.52779"
       id="text14"><tspan
         sodipodi:role="line"
         id="tspan14"
         style="stroke-width:0.8"
         x="322.89993"
         y="222.52779">\(f\)</tspan></text>
  </g>
</svg>
