001111_0000000000_0000000000000000
001111_0000000001_0000000000000000
001111_0000000010_0000000000000000
001111_0000000011_0000000000000000
001111_0000000100_0000000000000000
001000_00100_00100_0000000000000001
001000_00001_00001_0000000000010000
001000_00010_00010_0000000000000001
000000_00000_00011_00011_00001_000010
000000_00000_00011_00011_00001_000011
000000_00100_00011_00011_00000_000110
000000_00100_00011_00011_00000_000111
000000_00000_00010_00010_00001_000000
000000_00011_00010_00010_00000_000100