                lui             $0, 0                   ; reg 0 = 0                 0
                lui             $1, 0                   ; reg 1 = 0                 4
                lui             $2, 0                   ; reg 2 = 0                 8
                addi            $2, $0, 68              ; reg 2 = 68                12  IF  ID  EX  ME  WB
                sw              $2, 0($1)               ; mem[0x00000000] = 68      16      IF  ID  EX  ME  WB
                addi            $0, $0, 5               ; reg 0 = 5                 20          IF  ID  EX  ME  WB
                addi            $0, $0, 5               ; reg 0 = 10                24              IF  ID  EX  ME  WB
                addi            $0, $0, 5               ; reg 0 = 15                28                  IF  ID  EX  ME  WB
                lw              $31, 0($1)              ; reg 31 = 68               32                  
                jalr            $31                     ; goto $31, set $31 = 44    36   
                addi            $0, $0, 5               ; reg 0 = 20                40
                addi            $0, $0, 5               ; reg 0 = 31                44
                addi            $0, $0, 5               ; reg 0 = 36                48
                hlt                                     ;                           52
                addi            $0, $0, 5               ; reg 0 = 35                56
                addi            $0, $0, 5               ; reg 0 = 40                60
                addi            $0, $0, 5               ; reg 0 = 45                64
rutina          addi            $0, $0, 2               ; reg 0 = 22                68
                addi            $0, $0, 2               ; reg 0 = 24                72
                jr              $31                     ;                           76
                addi            $0, $0, 2               ; reg 0 = 26                80