001111_0000000000_0000000000000000
001111_0000000001_0000000000000000
001111_0000000011_0000000000000000
001111_0000000111_0000000000000000
001000_00011_00011_0000000000000001
001111_0000000100_0000000000000000
101011_00100_00011_0000000000000000
001101_00100_00101_0000000000000001
001000_00100_00110_0000000000000100
001111_0000000010_0000000000000000
001111_0000011111_0000000000000000
000100_00100_00010_0000000000001011
001000_11111_11111_0000000000110100
001111_0000011110_0000000000000000
100011_00100_00111_0000000000000000
000101_00100_00111_0000000000001010
001000_11110_11110_0000000001000100
000000_00111_00101_01000_00000_100110
000000_01000_00010_01001_00000_100100
000100_01001_00101_0000000000001010
111110_00000_00000_00000_00000_000000
000010_00000000000000000000001010
111110_00000_00000_00000_00000_000000
001000_00000_00000_0000000000000001
000000_11111_000000000000000_001000
000000_00110_00000_00010_00000_101010
001000_00001_00001_0000000000000001
001010_00001_00011_0000000000000110
000000_11110_000000000000000_001000
101011_00100_00011_0000000000000000
111111_00000_00000_00000_00000_000000