module gitlab.com/spacetimi/shared/timi_shared_server

go 1.14

require (
	github.com/aws/aws-sdk-go v1.31.12
	github.com/dgrijalva/jwt-go v3.2.0+incompatible
	github.com/go-redis/redis/v8 v8.0.0-beta.3
	github.com/gorilla/mux v1.7.4
	go.mongodb.org/mongo-driver v1.3.4
	golang.org/x/crypto v0.0.0-20200604202706-70a84ac30bf9
	golang.org/x/net v0.0.0-20200602114024-627f9648deb9
)
