[
  {
    "id": "https://s3.amazonaws.com/scifri-episodes/scifri20181123-episode.mp3",
    "album": "Science Friday",
    "title": "A Salute To Head-Scratching Science",
    "artist": "Science Friday and WNYC Studios",
    "duration": 5740,
    "artUri": "https://media.wnyc.org/i/1400/1400/l/80/1/ScienceFriday_WNYCStudios_1400.jpg"
  },
  {
    "id": "https://s3.amazonaws.com/scifri-segments/scifri201711241.mp3",
    "album": "Science Friday",
    "title": "From Cat Rheology To Operatic Incompetence",
    "artist": "Science Friday and WNYC Studios",
    "duration": 2857,
    "artUri": "https://media.wnyc.org/i/1400/1400/l/80/1/ScienceFriday_WNYCStudios_1400.jpg"
  },
  {
    "id": "https://s3.amazonaws.com/scifri-segments/scifri202011274.mp3",
    "album": "Science Friday",
    "title": "Laugh Along At Home With The Ig Nobel Awards",
    "artist": "Science Friday and WNYC Studios",
    "duration": 1792,
    "artUri": "https://media.wnyc.org/i/1400/1400/l/80/1/ScienceFriday_WNYCStudios_1400.jpg"
  },
  {
    "id": "https://www.mboxdrive.com/sonido1.mp3",
    "album": "Cowboys From Hell",
    "title": "Cowboys From Hell",
    "artist": "Pantera",
    "duration": 246,
    "artUri": "https://raw.githubusercontent.com/soypepe/evaluacion/main/cover1.jpg"
  },
  {
    "id": "https://www.mboxdrive.com/sonido2.mp3",
    "album": "Ride The Lighting",
    "title": "From Whom The Bell Tolls",
    "artist": "Metallica",
    "duration": 314,
    "artUri": "https://raw.githubusercontent.com/soypepe/evaluacion/main/cover2.jpg"
  },
  {
    "id": "https://assets.mixkit.co/music/preview/mixkit-dance-with-me-3.mp3",
    "album": "Stay with Me",
    "title": "Dance with Me",
    "artist": "Ahjay Stelino",
    "duration": 142,
    "artUri": "https://images.pexels.com/photos/235615/pexels-photo-235615.jpeg?auto=compress&cs=tinysrgb&dpr=1&w=500"
  },
  {
    "id": "https://assets.mixkit.co/music/preview/mixkit-sleepy-cat-135.mp3",
    "album": "Sleepy Cat",
    "title": "Sleepy Cat",
    "artist": "Alejandro Magaña",
    "duration": 119,
    "artUri": "https://images.pexels.com/photos/1122868/pexels-photo-1122868.jpeg?auto=compress&cs=tinysrgb&dpr=1&w=500"
  }
]
