module gitlab.com/sourcehaven/mypass/go.keepsafe

go 1.22

require (
	buf.build/gen/go/bufbuild/protovalidate/protocolbuffers/go v1.34.1-20240508200655-46a4cf4ba109.1
	connectrpc.com/connect v1.16.2
	fyne.io/fyne/v2 v2.4.5
	github.com/gofrs/flock v0.8.1
	github.com/sethvargo/go-diceware v0.4.0
	github.com/sirupsen/logrus v1.9.3
	github.com/stretchr/testify v1.9.0
	github.com/urfave/cli/v3 v3.0.0-alpha9
	gitlab.com/sourcehaven/mypass/go.lcdbman v0.2.1-alpha
	golang.org/x/crypto v0.25.0
	golang.org/x/term v0.22.0
	google.golang.org/genproto/googleapis/api v0.0.0-20240604185151-ef581f913117
	google.golang.org/grpc v1.64.0
	google.golang.org/protobuf v1.34.1
	gorm.io/driver/sqlite v1.5.5
	gorm.io/gorm v1.25.10
)

require (
	fyne.io/systray v1.10.1-0.20231115130155-104f5ef7839e // indirect
	github.com/davecgh/go-spew v1.1.1 // indirect
	github.com/fredbi/uri v1.0.0 // indirect
	github.com/fsnotify/fsnotify v1.6.0 // indirect
	github.com/fyne-io/gl-js v0.0.0-20220119005834-d2da28d9ccfe // indirect
	github.com/fyne-io/glfw-js v0.0.0-20220120001248-ee7290d23504 // indirect
	github.com/fyne-io/image v0.0.0-20220602074514-4956b0afb3d2 // indirect
	github.com/go-gl/gl v0.0.0-20211210172815-726fda9656d6 // indirect
	github.com/go-gl/glfw/v3.3/glfw v0.0.0-20240306074159-ea2d69986ecb // indirect
	github.com/go-text/render v0.1.0 // indirect
	github.com/go-text/typesetting v0.1.0 // indirect
	github.com/godbus/dbus/v5 v5.1.0 // indirect
	github.com/gopherjs/gopherjs v1.17.2 // indirect
	github.com/jinzhu/inflection v1.0.0 // indirect
	github.com/jinzhu/now v1.1.5 // indirect
	github.com/jsummers/gobmp v0.0.0-20151104160322-e2ba15ffa76e // indirect
	github.com/mattn/go-sqlite3 v1.14.17 // indirect
	github.com/pmezard/go-difflib v1.0.0 // indirect
	github.com/srwiley/oksvg v0.0.0-20221011165216-be6e8873101c // indirect
	github.com/srwiley/rasterx v0.0.0-20220730225603-2ab79fcdd4ef // indirect
	github.com/tevino/abool v1.2.0 // indirect
	github.com/xrash/smetrics v0.0.0-20240521201337-686a1a2994c1 // indirect
	github.com/yuin/goldmark v1.5.5 // indirect
	golang.org/x/image v0.11.0 // indirect
	golang.org/x/mobile v0.0.0-20230531173138-3c911d8e3eda // indirect
	golang.org/x/net v0.23.0 // indirect
	golang.org/x/sys v0.22.0 // indirect
	golang.org/x/text v0.16.0 // indirect
	google.golang.org/genproto/googleapis/rpc v0.0.0-20240528184218-531527333157 // indirect
	gopkg.in/yaml.v3 v3.0.1 // indirect
	honnef.co/go/js/dom v0.0.0-20210725211120-f030747120f2 // indirect
)
