<?xml version="1.0" encoding="UTF-8"?>

<!-- Uploaded to: SVG Repo, www.svgrepo.com, Generator: SVG Repo Mixer Tools -->
<svg width="800px" height="800px" viewBox="0 0 48 48" id="b" xmlns="http://www.w3.org/2000/svg">

<defs>

<style>.c{fill:none;stroke:#000000;stroke-linecap:round;stroke-linejoin:round;}</style>

</defs>

<path class="c" d="m35.5,41.5V6.5c0-1.1-.9-2-2-2H14.5c-1.1,0-2,.9-2,2v35c0,1.1.9,2,2,2h19c1.1,0,2-.9,2-2Z"/>

<g>

<circle class="c" cx="24" cy="15.4275" r="2.8"/>

<path class="c" d="m29.4,23.6275c0-2.9823-2.4177-5.4-5.4-5.4s-5.4,2.4177-5.4,5.4h10.8Z"/>

</g>

<g>

<path class="c" d="m20.8388,38.2747v-1.714c0-1.7459,1.4153-3.1612,3.1612-3.1612s3.1612,1.4153,3.1612,3.1612v1.714"/>

<path class="c" d="m22.9865,37.5387v-.7931c0-.5597.4538-1.0135,1.0135-1.0135s1.0135.4538,1.0135,1.0135v2.5974"/>

<line class="c" x1="22.9865" y1="39.1531" x2="22.9865" y2="39.9603"/>

</g>

</svg>