[
    {
        "filter_name": "oplus_adfr_config"
    },
    {
        "version": 20220411
    },
    {
        "sub_version": "normal_panel_config"
    },
    {
        "touch_idle": true,
        "hw_enable": true,
        "timeout": 3500,
        "hw_brightness_limit": 4015,
        "hw_gray": true,
        "hw_gray_threshold": 55,
        "hw_gray_percent": 70,

        "special_timeout": {
            "com.tencent.mobileqq": 4000,
            "com.android.contacts": 4000,
            "com.coloros.gallery3d": 4000
        },

        "blacklist": [
            "com.android.settings",
            "com.android.mms",
            "com.oplus.engineermode",
            "com.antutu.ABenchMark",
            "com.antutu.benchmark.full",
            "com.ludashi.benchmark2",
            "com.ludashi.benchmark",
            "com.coloros.video",
            "com.tencent.tvoem",
            "com.tencent.qqlive",
            "com.youku.phone",
            "com.tencent.tmgp.speedmobile",
            "com.tencent.af",
            "com.netease.blqx.nearme.gamecenter",
            "com.netease.lztg.nearme.gamecenter",
            "com.pwrd.xxajh.nearme.gamecenter",
            "com.netease.blqx",
            "com.netease.lztg",
            "com.tencent.ig",
            "com.tencent.lolm",
            "com.riotgames.league.wildrift",
            "com.riotgames.internal.wildrift.trunk",
            "com.riotgames.internal.wildrift.test",
            "com.riotgames.league.wildriftvn",
            "com.riotgames.league.wildrifttw",
            "com.tencent.tmgp.sgame",
            "com.tencent.tmgp.cf",
            "com.tencent.tmgp.pubgmhd",
            "com.tencent.tmgp.pubgm",
            "com.pubg.krmobile",
            "com.vng.pubgmobile",
            "com.rekoo.pubgm",
            "com.tencent.tmgp.projectg",
            "com.tencent.igce",
            "com.tencent.tmgp.sgamece",
            "com.tencent.KiHan",
            "com.tencent.tmgp.KiHan",
            "com.netease.yokaikoya",
            "com.miHoYo.enterprise.NGHSoD",
            "com.miHoYo.bh3.nearme.gamecenter",
            "com.miHoYo.Yuanshen",
            "com.tencent.tmgp.eyou.ygwu",
            "com.netease.yokaikoya.nearme.gamecenter",
            "com.tencent.YiRen",
            "com.netease.wptqz",
            "com.netease.jddsaef",
            "com.netease.jddsaef.nearme.gamecenter",
            "com.tencent.tmgp.jddsaef",
            "com.tencent.tmgp.yongyong.lztg",
            "com.tencent.tmgp.eyou.blqx",
            "com.pwrd.xxajh.laohu",
            "com.tencent.tmgp.xxajh",
            "com.tencent.tmgp.eyou.blqx",
            "com.netease.moba.nearme.gamecenter",
            "com.tencent.tmgp.kaopu.jzpaj",
            "com.tencent.tmgp.kaopu.jzpaj",
            "com.pwrd.xsmdl.laohu",
            "com.xsmdl.nearme.gamecenter",
            "com.tencent.tmgp.xsmdl",
            "com.youzu.bs",
            "com.youzu.bs.nearme.gamecenter",
            "com.yingxiong.dftk.nearme.gamecenter",
            "com.yunbu.rehtona.nearme.gamecenter",
            "com.denachina.g13002010.denacn",
            "com.denachina.g13002010.nearme.gamecenter",
            "com.volvapps.ef5.x.nearme.gamecenter",
            "com.tencent.tmgp.ef5",
            "com.tencent.tmgp.hqxy",
            "com.netease.x19",
            "com.tencent.tmgp.wdsj666",
            "com.netease.mc.nearme.gamecenter",
            "com.palmpi.hcollege.nearme.gamecenter",
            "com.palmpi.hcollege.feiyu",
            "com.tencent.tmgp.supercell.brawlstars",
            "com.ztgame.bob",
            "com.netease.hyxd.nearme.gamecenter",
            "com.netease.dwrg.nearme.gamecenter",
            "com.google.android.youtube",
            "com.tencent.qqsports",
            "com.netflix.mediaclient",
            "com.pubg.impobile",
            "com.supercell.brawlstars",
            "com.tencent.tmgp.cod",
            "com.activision.callofduty.shooter",
            "com.lilithgames.rok.offical.cn",
            "com.lilithgame.roc.gp"
        ]
    },
    {
        "cvt": true
    },
    {
        "frtc": true
    }
]
