{
    "definitions": {},
    "$schema": "http://json-schema.org/draft-07/schema#",
    "$id": "http://example.com/root.json",
    "type": "object",
    "title": "The Root Schema",
    "required": [
        "owner",
        "scenario",
        "lot",
        "building",
        "coOwnership",
        "workHasBuildings"
    ],
    "properties": {
        "owner": {
            "$id": "#/properties/owner",
            "type": "object",
            "title": "The Owner Schema",
            "required": [
                "family_member_number",
                "children_number",
                "marital_status",
                "retired",
                "housing_situation",
                "tax_revenue_one",
                "tax_revenue_two",
                "got_anah",
                "sub_anah_amount",
                "got_tax_credit",
                "tax_credit_amount",
                "got_eco_credit",
                "eco_credit_amount",
                "got_ptz"
            ],
            "properties": {
                "family_member_number": {
                    "$id": "#/properties/owner/properties/family_member_number",
                    "type": [
                        "integer",
                        "null"
                    ],
                    "title": "The Family_member_number Schema",
                    "default": null,
                    "examples": [
                        null
                    ]
                },
                "children_number": {
                    "$id": "#/properties/owner/properties/children_number",
                    "type": [
                        "integer",
                        "null"
                    ],
                    "title": "The Children_number Schema",
                    "default": null,
                    "examples": [
                        null
                    ]
                },
                "marital_status": {
                    "$id": "#/properties/owner/properties/marital_status",
                    "type": "string",
                    "title": "The Marital_status Schema",
                    "default": "",
                    "examples": [
                        "personne_seule"
                    ],
                    "pattern": "^(.*)$"
                },
                "retired": {
                    "$id": "#/properties/owner/properties/retired",
                    "type": "boolean",
                    "title": "The Retired Schema",
                    "default": false,
                    "examples": [
                        true
                    ]
                },
                "housing_situation": {
                    "$id": "#/properties/owner/properties/housing_situation",
                    "type": "string",
                    "title": "The Housing_situation Schema",
                    "default": "",
                    "examples": [
                        "occupant"
                    ],
                    "pattern": "^(.*)$"
                },
                "tax_revenue_one": {
                    "$id": "#/properties/owner/properties/tax_revenue_one",
                    "type": [
                        "number",
                        "null"
                    ],
                    "title": "The Tax_revenue_one Schema",
                    "default": 0,
                    "examples": [
                        41343
                    ]
                },
                "tax_revenue_two": {
                    "$id": "#/properties/owner/properties/tax_revenue_two",
                    "type": [
                        "number",
                        "null"
                    ],
                    "title": "The Tax_revenue_two Schema",
                    "default": null,
                    "examples": [
                        null
                    ]
                },
                "got_anah": {
                    "$id": "#/properties/owner/properties/got_anah",
                    "type": "boolean",
                    "title": "The Got_anah Schema",
                    "default": false,
                    "examples": [
                        false
                    ]
                },
                "sub_anah_amount": {
                    "$id": "#/properties/owner/properties/sub_anah_amount",
                    "type": [
                        "number",
                        "null"
                    ],
                    "title": "The Sub_anah_amount Schema",
                    "default": null,
                    "examples": [
                        null
                    ]
                },
                "got_tax_credit": {
                    "$id": "#/properties/owner/properties/got_tax_credit",
                    "type": "boolean",
                    "title": "The Got_tax_credit Schema",
                    "default": false,
                    "examples": [
                        false
                    ]
                },
                "tax_credit_amount": {
                    "$id": "#/properties/owner/properties/tax_credit_amount",
                    "type": [
                        "number",
                        "null"
                    ],
                    "title": "The Tax_credit_amount Schema",
                    "default": null,
                    "examples": [
                        null
                    ]
                },
                "got_eco_credit": {
                    "$id": "#/properties/owner/properties/got_eco_credit",
                    "type": "boolean",
                    "title": "The Got_eco_credit Schema",
                    "default": false,
                    "examples": [
                        false
                    ]
                },
                "eco_credit_amount": {
                    "$id": "#/properties/owner/properties/eco_credit_amount",
                    "type": [
                        "number",
                        "null"
                    ],
                    "title": "The Eco_credit_amount Schema",
                    "default": null,
                    "examples": [
                        null
                    ]
                },
                "got_ptz": {
                    "$id": "#/properties/owner/properties/got_ptz",
                    "type": "boolean",
                    "title": "The Got_ptz Schema",
                    "default": false,
                    "examples": [
                        false
                    ]
                }
            }
        },
        "scenario": {
            "$id": "#/properties/scenario",
            "type": "object",
            "title": "The Scenario Schema",
            "required": [
                "energy_gain"
            ],
            "properties": {
                "energy_gain": {
                    "$id": "#/properties/scenario/properties/energy_gain",
                    "type": "number",
                    "title": "The Energy_gain Schema",
                    "default": 0,
                    "examples": [
                        0
                    ]
                }
            }
        },
        "lot": {
            "$id": "#/properties/lot",
            "type": "object",
            "title": "The Lot Schema",
            "required": [
                "apartment_number",
                "year_entry",
                "room_number",
                "room_area",
                "tantiemes_apartment"
            ],
            "properties": {
                "apartment_number": {
                    "$id": "#/properties/lot/properties/apartment_number",
                    "type": [
                        "integer",
                        "null"
                    ],
                    "title": "The Apartment_number Schema",
                    "default": null,
                    "examples": [
                        1
                    ]
                },
                "year_entry": {
                    "$id": "#/properties/lot/properties/year_entry",
                    "type": [
                        "integer",
                        "null"
                    ],
                    "title": "The Year_entry Schema",
                    "default": 0,
                    "examples": [
                        2000
                    ]
                },
                "room_number": {
                    "$id": "#/properties/lot/properties/room_number",
                    "type": "integer",
                    "title": "The Room_number Schema",
                    "default": 0,
                    "examples": [
                        2
                    ]
                },
                "room_area": {
                    "$id": "#/properties/lot/properties/room_area",
                    "type": [
                        "integer",
                        "null"
                    ],
                    "title": "The Room_area Schema",
                    "default": 0,
                    "examples": [
                        65
                    ]
                },
                "tantiemes_apartment": {
                    "$id": "#/properties/lot/properties/tantiemes_apartment",
                    "type": "integer",
                    "title": "The Tantiemes_apartment Schema",
                    "default": 0,
                    "examples": [
                        843
                    ]
                }
            }
        },
        "building": {
            "$id": "#/properties/building",
            "type": "object",
            "title": "The Building Schema",
            "required": [
                "tantiemes"
            ],
            "properties": {
                "tantiemes": {
                    "$id": "#/properties/building/properties/tantiemes",
                    "type": "integer",
                    "title": "The Tantiemes Schema",
                    "default": 0,
                    "examples": [
                        9595
                    ]
                }
            }
        },
        "coOwnership": {
            "$id": "#/properties/coOwnership",
            "type": "object",
            "title": "The Coownership Schema",
            "required": [
                "construction_date",
                "number_of_housings",
                "number_of_shops",
                "number_of_offices"
            ],
            "properties": {
                "construction_date": {
                    "$id": "#/properties/coOwnership/properties/construction_date",
                    "type": "string",
                    "title": "The Construction_date Schema",
                    "default": "",
                    "examples": [
                        "2014-01-01"
                    ],
                    "pattern": "^(.*)$"
                },
                "works_fund": {
                    "$id": "#/properties/coOwnership/properties/works_fund",
                    "type": "integer",
                    "title": "The works fund",
                    "default": 0,
                    "examples": [
                        76
                    ]
                },
                "number_of_housings": {
                    "$id": "#/properties/coOwnership/properties/number_of_housings",
                    "type": "integer",
                    "title": "The Number_of_housings Schema",
                    "default": 0,
                    "examples": [
                        76
                    ]
                },
                "number_of_shops": {
                    "$id": "#/properties/coOwnership/properties/number_of_shops",
                    "type": "integer",
                    "title": "The Number_of_shops Schema",
                    "default": 0,
                    "examples": [
                        0
                    ]
                },
                "number_of_offices": {
                    "$id": "#/properties/coOwnership/properties/number_of_offices",
                    "type": "integer",
                    "title": "The Number_of_offices Schema",
                    "default": 0,
                    "examples": [
                        0
                    ]
                }
            }
        },
        "workHasBuildings": {
            "$id": "#/properties/workHasBuildings",
            "type": "array",
            "title": "The Workhasbuildings Schema",
            "items": {
                "$id": "#/properties/workHasBuildings/items",
                "type": "object",
                "title": "The Items Schema",
                "required": [
                    "cost_ht",
                    "cee"
                ],
                "properties": {
                    "cost_ht": {
                        "$id": "#/properties/workHasBuildings/items/properties/cost_ht",
                        "type": "integer",
                        "title": "The Cost_ht Schema",
                        "default": 0,
                        "examples": [
                            94907
                        ]
                    },
                    "cee": {
                        "$id": "#/properties/workHasBuildings/items/properties/cee",
                        "type": "integer",
                        "title": "The Cee Schema",
                        "default": 0,
                        "examples": [
                            0
                        ]
                    },
                    "carac_type": {
                        "$id": "#/properties/workHasBuildings/items/properties/carac_type",
                        "type": "string",
                        "title": "The carac type",
                        "default": "",
                        "examples": [
                            "ventilation"
                        ]
                    },
                    "carac_value": {
                        "$id": "#/properties/workHasBuildings/items/properties/carac_value",
                        "type": [
                            "integer",
                            "null"
                        ],
                        "title": "The carac value (depending on carac_type)",
                        "default": null,
                        "examples": [
                            0
                        ]
                    }
                }
            }
        }
    }
}
