tn/esprit/spring/repository/ContratRepository.class
tn/esprit/spring/entities/Timesheet.class
tn/esprit/spring/controller/RestControlEmploye.class
tn/esprit/spring/entities/Employe.class
tn/esprit/spring/controller/RestControlTimesheet.class
tn/esprit/spring/entities/Mission.class
tn/esprit/spring/entities/Role.class
tn/esprit/spring/controller/RestControlEntreprise.class
tn/esprit/spring/services/EmployeServiceImpl.class
tn/esprit/spring/services/DepartementServiceImpl.class
tn/esprit/spring/repository/EmployeRepository.class
tn/esprit/spring/repository/DepartementRepository.class
tn/esprit/spring/services/ContratServiceImpl.class
tn/esprit/spring/services/TimesheetServiceImpl.class
tn/esprit/spring/services/IContratService.class
tn/esprit/spring/services/IEmployeService.class
tn/esprit/spring/services/EntrepriseServiceImpl.class
tn/esprit/spring/entities/MissionExterne.class
tn/esprit/spring/services/IEntrepriseService.class
tn/esprit/spring/entities/Entreprise.class
tn/esprit/spring/controller/ControllerEmployeImpl.class
tn/esprit/spring/repository/EntrepriseRepository.class
tn/esprit/spring/entities/Departement.class
tn/esprit/spring/entities/Contrat.class
tn/esprit/spring/config/LoginFilter.class
tn/esprit/spring/repository/MissionRepository.class
tn/esprit/spring/repository/TimesheetRepository.class
tn/esprit/spring/TimesheetApplication.class
tn/esprit/spring/services/ITimesheetService.class
tn/esprit/spring/controller/ControllerTimesheetImpl.class
tn/esprit/spring/controller/ControllerEntrepriseImpl.class
tn/esprit/spring/services/IDepartementService.class
tn/esprit/spring/entities/TimesheetPK.class
