+--------------------------------------+
|             Form Preview             |
|  +------------------------------+    |
|  |  [ Form Element 1 ]          |    |
|  |  [ Form Element 2 ]          |    |
|  |  ...                         |    |
|  +------------------------------+    |
|                                      |
|  [ Changes appear in real-time ]     |
+--------------------------------------+
