{
    "variables": {
        "aws_access_key": "{{env `AWS_ACCESS_KEY_ID`}}",
        "aws_secret_key": "{{env `AWS_SECRET_ACCESS_KEY`}}",
        "region":         "{{env `AWS_DEFAULT_REGION`}}",
        "project":        "{{env `PROJECT`}}" 
    },
    "builders": [
        {
            "access_key": "{{user `aws_access_key`}}",
            "ami_name": "{{user `project`}}-{{user `target`}}",
            "instance_type": "t2.micro",
            "region": "{{user `region`}}",
            "secret_key": "{{user `aws_secret_key`}}",
            "source_ami_filter": {
                "filters": {
                "virtualization-type": "hvm",
                "name": "ubuntu/images/hvm-ssd/ubuntu-bionic-18.04-amd64-server-*"
                },
                "owners": ["099720109477"],
                "most_recent": true
            },
            "ssh_username": "ubuntu",
            "type": "amazon-ebs"
        }
    ],
    "provisioners": [
        {
            "type": "shell",
            "script": "./src/client.sh"
        }
    ]
}