Profile: Function timing, sorted by time
Date:    Fri Feb 25 13:54:01 2000


Programmstatistik
-----------------
    2000 Feb 25 13:53 Befehlszeile: "D:\user\sbs\cta\cta" railroad-dos.cta 
    Startfunktion: anaRegReachForwardFixPnt::Evaluate(class ctaMap<class cConfig *> * const,class ctaModule const *,class cAutomaton const *)
    Gesamtzeit: 1079,345 Millisekunden
    Zeit ausserhalb von Funktionen: 0,148 Millisekunden
    Aufruftiefe: 16
    Gesamtfunktionen: 3169
    Gesamtaufrufe: 634983
    Funktionsabdeckung: 7,6%
    Berechneter Verwaltungsaufwand: 7
    Durchschnittlicher Aufwand: 7

Modulstatistik fuer cta.exe
---------------------------
    Zeit innerhalb des Moduls: 1079,197 Millisekunden
    100,0% Prozent im Modul
    3169 Funktionen im Modul
    Aufrufe im Modul: 634983 
    Modulfunktionsabdeckung: 7,6%

        Funkt.        Funkt.+Unterfkt.      Anzahl
        Zeit     %         Zeit       %          Aufrufe  Funktion
------------------------------------------------------------------
     395,632  36,7      395,632  36,7   112365 operator delete(void *) (delop.obj)
     118,561  11,0      118,561  11,0    20273 cDualVec::cDualVec(class cDualVec const &) (ctaautomaton.obj)
      72,680   6,7       72,680   6,7    21347 std::vector<int,class std::allocator<int> >::vector<int,class std::allocator<int> >(class vector<int,class std::allocator<int> >::vector<int,class std::allocator<int> > const &) (ctaautomaton.obj)
      34,398   3,2      171,923  15,9     5780 std::vector<class cDualVec,class std::allocator<class cDualVec> >::insert(class cDualVec *,unsigned int,class cDualVec const &) (cconstraints.obj)
      33,365   3,1       53,325   4,9     5127 cDualVec::cDualVec(class cVec) (cconstraints.obj)
      24,456   2,3       87,612   8,1     1524 cRays::processBidAndUniRays(class cDualVec *) (crays.obj)
      19,828   1,8       19,828   1,8     5356 std::vector<int,class std::allocator<int> >::vector<int,class std::allocator<int> >(unsigned int,int const &,class vector<int,class std::allocator<int> >::allocator<int> const &) (ctaautomaton.obj)
      17,672   1,6       24,123   2,2     2285 std::vector<unsigned int,class std::allocator<unsigned int> >::insert(unsigned int *,unsigned int,unsigned int const &) (cincidences.obj)
      15,638   1,4      301,661  28,0     2964 cRays::addConstraint(class cVec const &,int,int) (crays.obj)
      12,882   1,2       12,882   1,2     4365 std::vector<unsigned int,class std::allocator<unsigned int> >::vector<unsigned int,class std::allocator<unsigned int> >(class vector<unsigned int,class std::allocator<unsigned int> >::vector<unsigned int,class std::allocator<unsigned int> > const &) (ctaautomaton.obj)
      12,274   1,1       31,412   2,9     2712 cVec::mkPosDimVec(int) (cpoly.obj)
      11,753   1,1       40,410   3,7     2412 cVec::gcd(void) (cvec.obj)
      11,299   1,0       28,458   2,6      171 cPoly::~cPoly(void) (ctaautomaton.obj)
      11,049   1,0       11,049   1,0     8688 std::_Lockit::~_Lockit(void) (ana.obj)
      10,996   1,0       10,996   1,0    35663 operator==(class cVec const &,class cVec const &) (cvec.obj)
      10,416   1,0       12,939   1,2      152 cPoly::contains(class cPoly const &) (cpoly.obj)
       9,998   0,9        9,998   0,9     1560 cDualVec::cDualVec(void) (ctaconfigstate.obj)
       9,876   0,9       13,848   1,3     2058 std::vector<int,class std::allocator<int> >::insert(int *,unsigned int,int const &) (ctarestrel.obj)
       9,595   0,9        9,595   0,9    22304 operator*(class cVec const &,class cVec const &) (cvec.obj)
       9,536   0,9       28,498   2,6     1321 std::vector<class cDualVec,class std::allocator<class cDualVec> >::insert(class cDualVec *,class cDualVec const &) (crays.obj)
       8,678   0,8      162,722  15,1     1440 cRays::processUniRays(int,int) (crays.obj)
       8,320   0,8       59,981   5,6     4711 operator*(int const &,class cVec const &) (cvec.obj)
       7,652   0,7       46,385   4,3     1203 std::num_get<char,class std::istreambuf_iterator<char,struct std::char_traits<char> > >::do_get(class std::istreambuf_iterator<char,struct std::char_traits<char> >,class std::istreambuf_iterator<char,struct std::char_traits<char> >,class std::ios_base &,int &,long &) (cmat.obj)
       7,467   0,7        7,467   0,7     2203 cIncidences::cIncidences(class cIncidences const &) (ctaconfigstate.obj)
       7,235   0,7        7,235   0,7     1203 std::basic_string<char,struct std::char_traits<char>,class std::allocator<char> >::_Copy(unsigned int) (ana.obj)
       6,738   0,6        6,738   0,6    43000 std::vector<int,class std::allocator<int> >::size(void) (ctaautomaton.obj)
       6,476   0,6        6,476   0,6       47 std::basic_filebuf<char,struct std::char_traits<char> >::overflow(int) (ana.obj)
       6,100   0,6        6,100   0,6     1884 std::vector<class cDualVec,class std::allocator<class cDualVec> >::vector<class cDualVec,class std::allocator<class cDualVec> >(unsigned int,class cDualVec const &,class vector<class cDualVec,class std::allocator<class cDualVec> >::allocator<class cDualVec> const &) (ctaconfigstate.obj)
       5,882   0,5      182,075  16,9    25291 cDualVec::~cDualVec(void) (ctaautomaton.obj)
       5,471   0,5       10,207   0,9     2496 std::vector<int,class std::allocator<int> >::operator=(class std::vector<int,class std::allocator<int> > const &) (ctaautomaton.obj)
       5,158   0,5        5,158   0,5     7894 cObject::cObject(void) (ctaautomaton.obj)
       5,091   0,5       32,496   3,0      421 cMat::cMat(class cMat const &) (ctaautomaton.obj)
       5,079   0,5      232,971  21,6     3305 cConstraints::addConstraint(class cVec const &,bool &) (cconstraints.obj)
       4,117   0,4       18,682   1,7      332 std::vector<class cDualVec,class std::allocator<class cDualVec> >::vector<class cDualVec,class std::allocator<class cDualVec> >(class vector<class cDualVec,class std::allocator<class cDualVec> >::vector<class cDualVec,class std::allocator<class cDualVec> > const &) (ctaautomaton.obj)
       4,035   0,4        6,282   0,6     1071 cVec::add(int const &,class cVec const &) (cvec.obj)
       3,971   0,4       57,524   5,3     1936 std::basic_istream<char,struct std::char_traits<char> >::operator>>(int &) (cmat.obj)
       3,889   0,4        3,889   0,4     8511 cVec::operator[](unsigned int) (ctarestrel.obj)
       3,638   0,3       27,761   2,6    13888 cIncidences::setBit(int) (cincidences.obj)
       3,355   0,3        3,355   0,3     1007 cVec::cVec(int) (ctaautomaton.obj)
       3,208   0,3        8,065   0,7      730 operator&(class cIncidences const &,class cIncidences const &) (cincidences.obj)
       3,079   0,3       12,607   1,2      122 cPoly::cPoly(class cPoly const &) (cxpoly.obj)
       3,051   0,3        7,667   0,7     1936 std::basic_istream<char,struct std::char_traits<char> >::ipfx(bool) (ctahytechprinter.obj)
       2,917   0,3       10,744   1,0     4814 std::basic_string<char,struct std::char_traits<char>,class std::allocator<char> >::_Tidy(bool) (ana.obj)
       2,893   0,3       14,622   1,4      181 cConstraints::cConstraints(class cConstraints const &) (ctaconfigstate.obj)
       2,850   0,3        2,850   0,3      913 std::vector<unsigned int,class std::allocator<unsigned int> >::vector<unsigned int,class std::allocator<unsigned int> >(unsigned int,unsigned int const &,class vector<unsigned int,class std::allocator<unsigned int> >::allocator<unsigned int> const &) (cincidences.obj)
       2,838   0,3        2,838   0,3     1007 cIncidences::cIncidences(void) (ctaautomaton.obj)
       2,767   0,3       10,665   1,0     1203 std::basic_string<char,struct std::char_traits<char>,class std::allocator<char> >::basic_string<char,struct std::char_traits<char>,class std::allocator<char> >(unsigned int,char,class basic_string<char,struct std::char_traits<char>,class std::allocator<char> >::allocator<char> const &) (cmat.obj)
       2,626   0,2        5,205   0,5     1437 cVec::operator=(class cVec const &) (crays.obj)
       2,390   0,2        2,390   0,2     8688 std::_Lockit::_Lockit(void) (ios.obj)
       2,352   0,2      536,984  49,8     3305 cPoly::addConstraint(class cVec const &) (cpoly.obj)
       2,337   0,2       27,994   2,6    16387 cDualVec::setVal(int,int) (cdualvec.obj)
       2,282   0,2        2,282   0,2     9125 std::vector<int,class std::allocator<int> >::_Ucopy(int const *,int const *,int *) (ctaautomaton.obj)
       2,252   0,2       78,683   7,3      733 cVec::cVec(char const *) (cvec.obj)
       2,189   0,2        3,756   0,3     1437 cIncidences::operator=(class cIncidences const &) (crays.obj)
       2,105   0,2      137,521  12,7      324 cRays::cRays(int) (crays.obj)
       2,047   0,2        2,047   0,2      913 cIncidences::countOnes(void) (cincidences.obj)
       2,045   0,2        3,032   0,3     3204 std::vector<unsigned int,class std::allocator<unsigned int> >::operator=(class std::vector<unsigned int,class std::allocator<unsigned int> > const &) (crays.obj)
       1,937   0,2        8,031   0,7      470 cDualVec::cDualVec(class cVec,class cIncidences,int) (crays.obj)
       1,826   0,2       22,241   2,1       61 cRays::addDimensions(int,int) (crays.obj)
       1,809   0,2        1,809   0,2     4447 std::vector<int,class std::allocator<int> >::_Ufill(int *,unsigned int,int const &) (ctaconfigstate.obj)
       1,750   0,2        5,844   0,5      242 cRays::cRays(class cRays const &) (ctaconfigstate.obj)
       1,735   0,2       54,717   5,1      270 cRegion::unite(class cXPoly const &,class cRegion *) (cregion.obj)
       1,688   0,2       42,351   3,9      332 cXPoly::cXPoly(class cXPoly const &) (ctaautomaton.obj)
       1,649   0,2        1,649   0,2     1586 std::copy(int const *,int const *,int *) (ctaautomaton.obj)
       1,648   0,2        1,648   0,2     4673 ctaObject::ctaObject(void) (ana.obj)
       1,635   0,2       26,463   2,5      450 cMat::~cMat(void) (ctaautomaton.obj)
       1,599   0,1        1,599   0,1      470 cVec::cVec(class cVec const &) (crays.obj)
       1,339   0,1        1,339   0,1     6757 cIncidences::operator[](int) (cincidences.obj)
       1,334   0,1        1,334   0,1     1071 operator&=(class cIncidences &,class cIncidences const &) (cincidences.obj)
       1,259   0,1        1,561   0,1      733 std::strstreambuf::_Init(int,char *,char *,int) (strstrea.obj)
       1,252   0,1       39,311   3,6      385 cXPoly::~cXPoly(void) (ctaautomaton.obj)
       1,252   0,1        1,252   0,1      470 std::basic_streambuf<char,struct std::char_traits<char> >::sgetc(void) (ctahytechprinter.obj)
       1,240   0,1       26,658   2,5     2747 std::vector<class cDualVec,class std::allocator<class cDualVec> >::_Destroy(class cDualVec *,class cDualVec *) (cmat.obj)
       1,157   0,1        1,157   0,1     4344 std::locale::facet::_Decref(void) (ana.obj)
       1,111   0,1        2,264   0,2      873 cDualVec::operator=(class cDualVec const &) (ctaautomaton.obj)
       1,077   0,1        3,331   0,3      733 std::ios_base::_Init(void) (ios.obj)
       1,059   0,1        1,173   0,1      733 std::locale::~locale(void) (ana.obj)
       1,029   0,1      161,515  15,0      120 cXPoly::cXPoly(int) (ctaconfigstate.obj)
       1,026   0,1        3,433   0,3       91 std::copy(class cDualVec const *,class cDualVec const *,class cDualVec *) (cregion.obj)
       0,974   0,1        1,065   0,1      733 std::ios_base::_Tidy(void) (ios.obj)
       0,961   0,1        6,053   0,6      470 operator-(class cVec const &,class cVec const &) (cvec.obj)
       0,944   0,1       12,648   1,2     1203 std::use_facet(class std::locale const &,class std::numpunct<char> const *,bool) (cmat.obj)
       0,941   0,1       41,856   3,9     2412 cVec::normalize(void) (cvec.obj)
       0,916   0,1      338,538  31,4       61 cXPoly::mkProjection(class cXPoly const &,int,int) (cregion.obj)
       0,909   0,1        1,752   0,2     3611 std::locale::_Getfacet(unsigned int,bool) (locale0.obj)
       0,894   0,1        1,470   0,1      733 std::strstreambuf::underflow(void) (strstrea.obj)
       0,880   0,1        2,627   0,2      183 cDualVec::cDualVec(class cVec,class cIncidences) (crays.obj)
       0,816   0,1       13,974   1,3     3997 std::vector<unsigned int,class std::allocator<unsigned int> >::~vector<unsigned int,class std::allocator<unsigned int> >(void) (ctaautomaton.obj)
       0,791   0,1      171,411  15,9    23731 cDualVec::`scalar deleting destructor'(unsigned int) (ctaautomaton.obj)
       0,791   0,1      171,411  15,9    23731 cDualVec::`vector deleting destructor'(unsigned int) (ctaautomaton.obj)
       0,779   0,1       12,436   1,2     3611 std::locale::_Iscloc(void) (locale0.obj)
       0,765   0,1       31,824   2,9     1071 cDualVec::combineWith(class cDualVec &,int) (cdualvec.obj)
       0,739   0,1        3,518   0,3      803 cIncidences::~cIncidences(void) (ctaautomaton.obj)
       0,732   0,1        2,202   0,2     6015 std::istreambuf_iterator<char,struct std::char_traits<char> >::equal(class std::istreambuf_iterator<char,struct std::char_traits<char> > const &) (cmat.obj)
       0,730   0,1        0,730   0,1     1685 cVec::scale(int const &) (cvec.obj)
       0,725   0,1        0,725   0,1     4750 std::vector<unsigned int,class std::allocator<unsigned int> >::_Destroy(unsigned int *,unsigned int *) (ctaautomaton.obj)
       0,698   0,1        8,287   0,8       44 std::_Tree<int,struct std::pair<int,class cRegion>,struct std::map<int,class cRegion,struct std::less<int>,class std::allocator<class cRegion> >::_Kfn,struct std::less<int>,class std::allocator<class cRegion> >::erase(class std::_Tree<int,struct std::pair<int,class cRegion>,struct std::map<int,class cRegion,struct std::less<int>,class std::allocator<class cRegion> >::_Kfn,struct std::less<int>,class std::allocator<class cRegion> >::iterator,class std::_Tree<in
       0,696   0,1      729,794  67,6       14 cConfig::mkTransitionFollower(class cAutomaton const * const,class cConfig const * const,bool) (cconfig.obj)
       0,692   0,1        0,692   0,1     1562 std::vector<class cDualVec,class std::allocator<class cDualVec> >::size(void) (cconstraints.obj)
       0,675   0,1        2,524   0,2     1085 cRays::fulfill(class cVec const &) (crays.obj)
       0,640   0,1        1,581   0,1     1466 std::locale::_Init(void) (locale0.obj)
       0,618   0,1        1,059   0,1       85 std::_Tree<int,struct std::pair<int,class cRegion>,struct std::map<int,class cRegion,struct std::less<int>,class std::allocator<class cRegion> >::_Kfn,struct std::less<int>,class std::allocator<class cRegion> >::_Insert(struct std::_Tree<int,struct std::pair<int,class cRegion>,struct std::map<int,class cRegion,struct std::less<int>,class std::allocator<class cRegion> >::_Kfn,struct std::less<int>,class std::allocator<class cRegion> >::_Node *,struct std::_Tree
       0,601   0,1        1,011   0,1     1204 std::numpunct<char>::do_grouping(void) (ana.obj)
       0,596   0,1        0,596   0,1      164 std::vector<class cXPoly,class std::allocator<class cXPoly> >::vector<class cXPoly,class std::allocator<class cXPoly> >(class vector<class cXPoly,class std::allocator<class cXPoly> >::vector<class cXPoly,class std::allocator<class cXPoly> > const &) (ctaconfigstate.obj)
       0,585   0,1      479,353  44,4       55 cRegion::mkUnionForAllPairs(class cXPoly  (*)(class cXPoly const &,class cXPoly const &,int),class cRegion const &,class cRegion const &,int) (cregion.obj)
       0,580   0,1        0,580   0,1     2406 std::basic_string<char,struct std::char_traits<char>,class std::allocator<char> >::operator[](unsigned int) (cmat.obj)
       0,556   0,1        1,184   0,1      733 std::strstreambuf::~strstreambuf(void) (strstrea.obj)
       0,523   0,0        9,602   0,9      759 cVec::removeDimensions(unsigned int,unsigned int) (cvec.obj)
       0,511   0,0      471,591  43,7       61 cXPoly::mkTransitionFollower(class cXPoly const &,class cXPoly const &,int) (cxpoly.obj)
       0,505   0,0        0,505   0,0      463 cVec::descale(int const &) (cvec.obj)
       0,489   0,0        0,489   0,0      366 cXPoly::isEmpty(void) (cxpoly.obj)
       0,479   0,0        3,811   0,4      733 std::basic_ios<char,struct std::char_traits<char> >::init(class std::basic_streambuf<char,struct std::char_traits<char> > *,bool) (ctaautomaton.obj)
       0,470   0,0        2,709   0,3      733 std::ios_base::~ios_base(void) (ios.obj)
       0,467   0,0        0,467   0,0     3983 cObject::cObject(class cObject const &) (ctaautomaton.obj)
       0,456   0,0        1,467   0,1     1204 std::numpunct<char>::grouping(void) (ana.obj)
       0,453   0,0        1,783   0,2      733 std::istrstream::~istrstream(void) (strstrea.obj)
       0,452   0,0       25,957   2,4     7284 std::vector<int,class std::allocator<int> >::~vector<int,class std::allocator<int> >(void) (ctaautomaton.obj)
       0,448   0,0        8,892   0,8       44 cConfig::~cConfig(void) (ctaautomaton.obj)
       0,436   0,0      305,109  28,3       61 cPoly::mkProjection(class cPoly const &,int,int,bool) (cpoly.obj)
       0,433   0,0        0,602   0,1       88 std::pair<int,class cRegion>::pair<int,class cRegion>(struct pair<int,class cRegion>::pair<int,class cRegion> const &) (ctaconfigstate.obj)
       0,425   0,0        0,425   0,0     5517 std::istreambuf_iterator<char,struct std::char_traits<char> >::operator*(void) (cmat.obj)
       0,412   0,0        0,918   0,1      120 std::vector<int,class std::allocator<int> >::resize(unsigned int,int const &) (ctamodule.obj)
       0,399   0,0        1,811   0,2      733 std::strstreambuf::strstreambuf(char const *,int) (cvec.obj)
       0,396   0,0      243,818  22,6       55 cTransition::getInitiatedGuardedAssignment(void) (ctransition.obj)
       0,390   0,0        2,453   0,2      150 cConstraints::cConstraints(void) (ctaautomaton.obj)
       0,389   0,0      217,807  20,2       28 cXPoly::mkTimeReach(class cXPoly const &,class cXPoly const &,bool) (cxpoly.obj)
       0,389   0,0        5,914   0,5       51 std::vector<class cXPoly,class std::allocator<class cXPoly> >::insert(class cXPoly *,unsigned int,class cXPoly const &) (ctaautomaton.obj)
       0,386   0,0        0,386   0,0    12588 std::vector<int,class std::allocator<int> >::_Destroy(int *,int *) (ctaautomaton.obj)
       0,336   0,0        6,333   0,6       43 std::vector<class cXPoly,class std::allocator<class cXPoly> >::operator=(class std::vector<class cXPoly,class std::allocator<class cXPoly> > const &) (ctaautomaton.obj)
       0,334   0,0        0,334   0,0     1438 std::istreambuf_iterator<char,struct std::char_traits<char> >::_Inc(void) (cmat.obj)
       0,333   0,0        0,333   0,0     2786 cIncidences::subset(class cIncidences const &,class cIncidences const &) (cincidences.obj)
       0,333   0,0        0,333   0,0     2199 std::ios_base::clear(int,bool) (ios.obj)
       0,329   0,0        2,058   0,2      733 std::locale::locale(void) (ana.obj)
       0,324   0,0        0,324   0,0      733 std::strstreambuf::_Tidy(void) (strstrea.obj)
       0,311   0,0        0,925   0,1       89 cRays::operator=(class cRays const &) (cregion.obj)
       0,308   0,0        7,653   0,7       89 cConstraints::operator=(class cConstraints const &) (cxpoly.obj)
       0,304   0,0        0,304   0,0      733 std::basic_streambuf<char,struct std::char_traits<char> >::~basic_streambuf<char,struct std::char_traits<char> >(void) (ana.obj)
       0,300   0,0        0,300   0,0     1249 cObject::operator=(class cObject const &) (ctaconfigstate.obj)
       0,291   0,0        0,291   0,0      733 std::basic_streambuf<char,struct std::char_traits<char> >::pptr(void) (iostream.obj)
       0,290   0,0        0,290   0,0       44 cRegion::cRegion(class cRegion const &) (ctamodule.obj)
       0,290   0,0        0,290   0,0     1321 std::copy(class cDualVec *,class cDualVec *,class cDualVec *) (crays.obj)
       0,269   0,0        2,110   0,2      164 std::map<int,class cRegion,struct std::less<int>,class std::allocator<class cRegion> >::operator[](int const &) (ctaconfigstate.obj)
       0,263   0,0      301,226  27,9       14 cConfig::mkNonZeroTimeFollower(class cAutomaton const * const,class cConfig const * const) (cconfig.obj)
       0,263   0,0      170,155  15,8      263 cPoly::addConstraints(class cConstraints const &,int) (cpoly.obj)
       0,258   0,0      294,069  27,2       24 cRegion::mkUnionForAllTriples(class cXPoly  (*)(class cXPoly const &,class cXPoly const &,class cXPoly const &),class cRegion const &,class cRegion const &,class cRegion const &) (cregion.obj)
       0,249   0,0        0,249   0,0      733 std::basic_streambuf<char,struct std::char_traits<char> >::_Init(void) (ana.obj)
       0,246   0,0        0,366   0,0       28 cConstraints::addStrictnessDirectedly(class cRays const &,bool &) (cconstraints.obj)
       0,246   0,0        0,246   0,0     1466 std::basic_streambuf<char,struct std::char_traits<char> >::gptr(void) (iostream.obj)
       0,225   0,0      156,415  14,5      178 cPoly::addConstraints(class cRays const &) (cpoly.obj)
       0,221   0,0     1074,375  99,6        1 cConfig::mkReachable(class cConfig * (*)(class cAutomaton const * const,class cConfig const * const),class cConfig * (*)(class cAutomaton const * const,class cConfig const * const,bool),class cAutomaton const * const,class cConfig const * const,int &) (cconfig.obj)
       0,196   0,0        0,196   0,0     2619 std::vector<unsigned int,class std::allocator<unsigned int> >::size(void) (ctaautomaton.obj)
       0,191   0,0       20,351   1,9       54 cPoly::cPoly(int) (ctarestriction.obj)
       0,180   0,0        1,255   0,1      205 std::_Tree<int,struct std::pair<int,class cRegion>,struct std::map<int,class cRegion,struct std::less<int>,class std::allocator<class cRegion> >::_Kfn,struct std::less<int>,class std::allocator<class cRegion> >::insert(struct std::pair<int,class cRegion> const &) (ctaconfigstate.obj)
       0,170   0,0       10,222   0,9     1585 std::vector<class cDualVec,class std::allocator<class cDualVec> >::_Ucopy(class cDualVec const *,class cDualVec const *,class cDualVec *) (crays.obj)
       0,169   0,0      275,096  25,5       28 cXPoly::mkNonZeroTimeFollower(class cXPoly const &,class cXPoly const &,class cXPoly const &) (cxpoly.obj)
       0,153   0,0        0,947   0,1       13 std::vector<class cDualVec,class std::allocator<class cDualVec> >::operator=(class std::vector<class cDualVec,class std::allocator<class cDualVec> > const &) (ctaautomaton.obj)
       0,145   0,0        0,145   0,0      733 std::basic_istream<char,struct std::char_traits<char> >::~basic_istream<char,struct std::char_traits<char> >(void) (ana.obj)
       0,144   0,0        0,144   0,0     1205 std::locale::id::operator unsigned int(void) (ana.obj)
       0,143   0,0       21,605   2,0      120 cRegion::intersect(class cRegion const &) (cregion.obj)
       0,135   0,0        9,737   0,9       61 cPoly::removeDimensions(int,int) (cpoly.obj)
       0,134   0,0       25,418   2,4      188 std::vector<class cXPoly,class std::allocator<class cXPoly> >::_Ufill(class cXPoly *,unsigned int,class cXPoly const &) (ctaconfigstate.obj)
       0,132   0,0        0,132   0,0       28 std::map<int,class cRegion,struct std::less<int>,class std::allocator<class cRegion> >::map<int,class cRegion,struct std::less<int>,class std::allocator<class cRegion> >(struct map<int,class cRegion,struct std::less<int>,class std::allocator<class cRegion> >::less<int> const &,class map<int,class cRegion,struct std::less<int>,class std::allocator<class cRegion> >::allocator<class cRegion> const &) (ctaconfigstate.obj)
       0,126   0,0        0,126   0,0      938 cVec::addDimensions(unsigned int,unsigned int) (cvec.obj)
       0,119   0,0       29,942   2,8       28 cConfig::unite(class cConfig const &,class cConfig *) (cconfig.obj)
       0,117   0,0        0,117   0,0      733 std::ios_base::ios_base(void) (ctahytechprinter.obj)
       0,110   0,0        6,489   0,6       16 std::operator<<(class std::basic_ostream<char,struct std::char_traits<char> > &,char const *) (ana.obj)
       0,091   0,0        0,091   0,0      733 std::ios_base::_Callfns(enum std::ios_base::event) (ios.obj)
       0,090   0,0        6,345   0,6       16 std::basic_streambuf<char,struct std::char_traits<char> >::xsputn(char const *,int) (ana.obj)
       0,087   0,0       21,462   2,0      120 cRegion::intersect(class cXPoly const &) (cregion.obj)
       0,085   0,0        0,085   0,0      354 std::vector<class cXPoly,class std::allocator<class cXPoly> >::size(void) (ctaautomaton.obj)
       0,077   0,0       12,965   1,2      160 cRegion::~cRegion(void) (ctaautomaton.obj)
       0,076   0,0       35,132   3,3       54 cPoly::addStdConstraints(void) (ctaautomaton.obj)
       0,072   0,0        2,996   0,3      363 std::vector<class cXPoly,class std::allocator<class cXPoly> >::_Ucopy(class cXPoly const *,class cXPoly const *,class cXPoly *) (ctaautomaton.obj)
       0,070   0,0        0,070   0,0      741 std::_Tree<int,struct std::pair<int,class cRegion>,struct std::map<int,class cRegion,struct std::less<int>,class std::allocator<class cRegion> >::_Kfn,struct std::less<int>,class std::allocator<class cRegion> >::_Lbound(int const &) (cautomaton.obj)
       0,070   0,0        1,418   0,1       13 cPoly::operator=(class cPoly const &) (cregion.obj)
       0,070   0,0        0,070   0,0       42 cRegion::cRegion(int,bool) (ctaconfigstate.obj)
       0,069   0,0        0,069   0,0       60 std::_Tree<int,int,struct std::set<int,struct std::less<int>,class std::allocator<int> >::_Kfn,struct std::less<int>,class std::allocator<int> >::iterator::_Inc(void) (ctaautomaton.obj)
       0,061   0,0        0,061   0,0       17 std::_Tree<int,struct std::pair<int,class cRegion>,struct std::map<int,class cRegion,struct std::less<int>,class std::allocator<class cRegion> >::_Kfn,struct std::less<int>,class std::allocator<class cRegion> >::_Init(void) (ctaconfiguration.obj)
       0,058   0,0        0,058   0,0      183 ctaObject::ctaObject(class ctaObject const &) (ana.obj)
       0,057   0,0        0,057   0,0       91 std::_Tree<int,struct std::pair<int,class cRegion>,struct std::map<int,class cRegion,struct std::less<int>,class std::allocator<class cRegion> >::_Kfn,struct std::less<int>,class std::allocator<class cRegion> >::iterator::_Inc(void) (ctaautomaton.obj)
       0,057   0,0        6,117   0,6      101 std::vector<class cXPoly,class std::allocator<class cXPoly> >::~vector<class cXPoly,class std::allocator<class cXPoly> >(void) (ctaautomaton.obj)
       0,054   0,0        0,054   0,0       15 std::basic_filebuf<char,struct std::char_traits<char> >::sync(void) (ana.obj)
       0,053   0,0        0,053   0,0      733 std::basic_streambuf<char,struct std::char_traits<char> >::setg(char *,char *,char *) (ana.obj)
       0,053   0,0        2,511   0,2      359 std::vector<class cXPoly,class std::allocator<class cXPoly> >::_Destroy(class cXPoly *,class cXPoly *) (ctaautomaton.obj)
       0,050   0,0        0,139   0,0       13 std::_Tree<int,struct std::pair<int,class cRegion>,struct std::map<int,class cRegion,struct std::less<int>,class std::allocator<class cRegion> >::_Kfn,struct std::less<int>,class std::allocator<class cRegion> >::erase(class std::_Tree<int,struct std::pair<int,class cRegion>,struct std::map<int,class cRegion,struct std::less<int>,class std::allocator<class cRegion> >::_Kfn,struct std::less<int>,class std::allocator<class cRegion> >::iterator) (ctaautomaton.obj)
       0,049   0,0       29,603   2,7       61 cRegion::unite(class cRegion const &,class cRegion *) (cregion.obj)
       0,049   0,0        0,049   0,0      199 std::_Construct(int *,int const &) (ctaautomaton.obj)
       0,041   0,0        0,041   0,0      733 operator new(unsigned int,void *) (ios.obj)
       0,039   0,0        0,228   0,0        1 std::num_put<char,class std::ostreambuf_iterator<char,struct std::char_traits<char> > >::do_put(class std::ostreambuf_iterator<char,struct std::char_traits<char> >,class std::ios_base &,char,long) (ana.obj)
       0,039   0,0        0,039   0,0      733 std::basic_streambuf<char,struct std::char_traits<char> >::egptr(void) (iostream.obj)
       0,038   0,0        1,457   0,1       66 std::_Tree<int,struct std::pair<int,class cRegion>,struct std::map<int,class cRegion,struct std::less<int>,class std::allocator<class cRegion> >::_Kfn,struct std::less<int>,class std::allocator<class cRegion> >::_Erase(struct std::_Tree<int,struct std::pair<int,class cRegion>,struct std::map<int,class cRegion,struct std::less<int>,class std::allocator<class cRegion> >::_Kfn,struct std::less<int>,class std::allocator<class cRegion> >::_Node *) (ctaautomaton.obj
       0,037   0,0       10,079   0,9     1564 std::_Construct(class cDualVec *,class cDualVec const &) (crays.obj)
       0,036   0,0        0,039   0,0       14 cConfig::isEmpty(void) (cconfig.obj)
       0,035   0,0        0,624   0,1      149 std::vector<class cDualVec,class std::allocator<class cDualVec> >::_Ufill(class cDualVec *,unsigned int,class cDualVec const &) (ctarestriction.obj)
       0,034   0,0       28,617   2,7      265 cXPoly::`scalar deleting destructor'(unsigned int) (ctaautomaton.obj)
       0,034   0,0       28,617   2,7      265 cXPoly::`vector deleting destructor'(unsigned int) (ctaautomaton.obj)
       0,029   0,0        0,029   0,0      141 std::vector<class cXPoly,class std::allocator<class cXPoly> >::vector<class cXPoly,class std::allocator<class cXPoly> >(class vector<class cXPoly,class std::allocator<class cXPoly> >::allocator<class cXPoly> const &) (ctaconfigstate.obj)
       0,026   0,0        0,026   0,0      264 std::vector<int,class std::allocator<int> >::capacity(void) (ctaautomaton.obj)
       0,025   0,0        5,858   0,5       51 std::pair<int,class cRegion>::~pair<int,class cRegion>(void) (ctaautomaton.obj)
       0,023   0,0        0,023   0,0       18 std::basic_ostream<char,struct std::char_traits<char> >::opfx(void) (ana.obj)
       0,021   0,0        5,740   0,5       79 cRegion::`scalar deleting destructor'(unsigned int) (ctaautomaton.obj)
       0,021   0,0        5,740   0,5       79 cRegion::`vector deleting destructor'(unsigned int) (ctaautomaton.obj)
       0,019   0,0        0,019   0,0     1209 std::vector<unsigned int,class std::allocator<unsigned int> >::_Ucopy(unsigned int const *,unsigned int const *,unsigned int *) (ctaautomaton.obj)
       0,017   0,0        0,017   0,0       23 std::_Tree<int,struct std::pair<int,class cRegion>,struct std::map<int,class cRegion,struct std::less<int>,class std::allocator<class cRegion> >::_Kfn,struct std::less<int>,class std::allocator<class cRegion> >::iterator::_Dec(void) (ctaconfigstate.obj)
       0,015   0,0        0,070   0,0       14 std::_Tree<int,struct std::pair<int,class cRegion>,struct std::map<int,class cRegion,struct std::less<int>,class std::allocator<class cRegion> >::_Kfn,struct std::less<int>,class std::allocator<class cRegion> >::_Tree<int,struct std::pair<int,class cRegion>,struct std::map<int,class cRegion,struct std::less<int>,class std::allocator<class cRegion> >::_Kfn,struct std::less<int>,class std::allocator<class cRegion> >(struct _Tree<int,struct std::pair<int,class cR
       0,012   0,0        0,012   0,0       14 std::basic_ios<char,struct std::char_traits<char> >::setstate(int,bool) (ana.obj)
       0,012   0,0        0,012   0,0       20 std::vector<class cDualVec,class std::allocator<class cDualVec> >::capacity(void) (cregion.obj)
       0,011   0,0        0,011   0,0      104 cTransition::getUnmentionedVars(void) (ctransition.obj)
       0,011   0,0        0,011   0,0       18 std::uncaught_exception(void) (uncaught.obj)
       0,010   0,0        0,612   0,1       88 std::_Construct(struct std::pair<int,class cRegion> *,struct std::pair<int,class cRegion> const &) (ctaconfigstate.obj)
       0,010   0,0        0,010   0,0       21 std::pair<class std::_Tree<int,struct std::pair<int,class cRegion>,struct std::map<int,class cRegion,struct std::less<int>,class std::allocator<class cRegion> >::_Kfn,struct std::less<int>,class std::allocator<class cRegion> >::iterator,bool>::pair<class std::_Tree<int,struct std::pair<int,class cRegion>,struct std::map<int,class cRegion,struct std::less<int>,class std::allocator<class cRegion> >::_Kfn,struct std::less<int>,class std::allocator<class cRegion> 
       0,009   0,0        0,189   0,0        1 std::num_put<char,class std::ostreambuf_iterator<char,struct std::char_traits<char> > >::_Iput(class std::ostreambuf_iterator<char,struct std::char_traits<char> >,class std::ios_base &,char,char *,unsigned int) (ana.obj)
       0,009   0,0        0,009   0,0      120 std::vector<int,class std::allocator<int> >::vector<int,class std::allocator<int> >(class vector<int,class std::allocator<int> >::allocator<int> const &) (ctaconfigstate.obj)
       0,008   0,0        0,008   0,0       13 std::fill(class cXPoly *,class cXPoly *,class cXPoly const &) (ctaconfigstate.obj)
       0,008   0,0        5,867   0,5       51 std::pair<int,class cRegion>::`scalar deleting destructor'(unsigned int) (ctaautomaton.obj)
       0,008   0,0     1077,398  99,8        1 anaRegReachForwardFixPnt::Evaluate(class ctaMap<class cConfig *> * const,class ctaModule const *,class cAutomaton const *) (ctayacc.tab.obj)
       0,008   0,0        0,179   0,0        3 std::_Tree<int,struct std::pair<int,class cRegion>,struct std::map<int,class cRegion,struct std::less<int>,class std::allocator<class cRegion> >::_Kfn,struct std::less<int>,class std::allocator<class cRegion> >::_Copy(class std::_Tree<int,struct std::pair<int,class cRegion>,struct std::map<int,class cRegion,struct std::less<int>,class std::allocator<class cRegion> >::_Kfn,struct std::less<int>,class std::allocator<class cRegion> > const &) (ctaconfigstate.obj)
       0,007   0,0        0,094   0,0        1 anaRegSymbol::Evaluate(class ctaMap<class cConfig *> * const,class ctaModule const *,class cAutomaton const *) (ctayacc.tab.obj)
       0,005   0,0        0,005   0,0       95 std::fill(class cDualVec *,class cDualVec *,class cDualVec const &) (crays.obj)
       0,003   0,0        0,235   0,0        1 std::basic_ostream<char,struct std::char_traits<char> >::operator<<(int) (ana.obj)
       0,003   0,0        0,049   0,0        1 std::basic_ostream<char,struct std::char_traits<char> >::put(char) (ana.obj)
       0,003   0,0        0,179   0,0        2 std::ostreambuf_iterator<char,struct std::char_traits<char> >::operator=(char) (ana.obj)
       0,003   0,0        1,319   0,1       15 std::_Destroy(class cXPoly *) (ctaautomaton.obj)
       0,003   0,0        0,004   0,0        1 std::_Tree<class ctaString,struct std::pair<class ctaString,class cConfig *>,struct std::map<class ctaString,class cConfig *,struct std::less<class ctaString>,class std::allocator<class cConfig *> >::_Kfn,struct std::less<class ctaString>,class std::allocator<class cConfig *> >::find(class ctaString const &) (ctayacc.tab.obj)
       0,002   0,0        0,002   0,0        1 std::_Tree<class ctaString,struct std::pair<class ctaString,class cConfig *>,struct std::map<class ctaString,class cConfig *,struct std::less<class ctaString>,class std::allocator<class cConfig *> >::_Kfn,struct std::less<class ctaString>,class std::allocator<class cConfig *> >::_Lbound(class ctaString const &) (ctayacc.tab.obj)
       0,001   0,0        0,003   0,0        1 anaProgress::`scalar deleting destructor'(unsigned int) (cconfig.obj)
       0,001   0,0        0,003   0,0        1 anaProgress::`vector deleting destructor'(unsigned int) (cconfig.obj)
       0,001   0,0        9,016   0,8       44 cConfig::`scalar deleting destructor'(unsigned int) (ctaautomaton.obj)
       0,001   0,0        9,016   0,8       44 cConfig::`vector deleting destructor'(unsigned int) (ctaautomaton.obj)
       0,001   0,0        0,001   0,0        3 std::_Tree<int,struct std::pair<int,class cRegion>,struct std::map<int,class cRegion,struct std::less<int>,class std::allocator<class cRegion> >::_Kfn,struct std::less<int>,class std::allocator<class cRegion> >::_Copy(struct std::_Tree<int,struct std::pair<int,class cRegion>,struct std::map<int,class cRegion,struct std::less<int>,class std::allocator<class cRegion> >::_Kfn,struct std::less<int>,class std::allocator<class cRegion> >::_Node *,struct std::_Tree<i
       0,000   0,0        0,000   0,0        1 anaProgress::~anaProgress(void) (cconfig.obj)
       0,000   0,0       19,715   1,8      211 cConstraints::~cConstraints(void) (ctaautomaton.obj)
       0,000   0,0        0,028   0,0       61 cMat::addDimensions(unsigned int,unsigned int) (cxpoly.obj)
       0,000   0,0        3,336   0,3     1250 cVec::~cVec(void) (ctaautomaton.obj)
       0,000   0,0        0,184   0,0        3 std::_Tree<int,struct std::pair<int,class cRegion>,struct std::map<int,class cRegion,struct std::less<int>,class std::allocator<class cRegion> >::_Kfn,struct std::less<int>,class std::allocator<class cRegion> >::_Tree<int,struct std::pair<int,class cRegion>,struct std::map<int,class cRegion,struct std::less<int>,class std::allocator<class cRegion> >::_Kfn,struct std::less<int>,class std::allocator<class cRegion> >(class _Tree<int,struct std::pair<int,class cRe
       0,000   0,0        0,000   0,0      728 std::_Tree<int,struct std::pair<int,class cRegion>,struct std::map<int,class cRegion,struct std::less<int>,class std::allocator<class cRegion> >::_Kfn,struct std::less<int>,class std::allocator<class cRegion> >::find(int const &) (cautomaton.obj)
       0,000   0,0        0,000   0,0      873 std::copy(unsigned int const *,unsigned int const *,unsigned int *) (ctaautomaton.obj)
       0,000   0,0        0,000   0,0     3611 std::ios_base::getloc(void) (ana.obj)
       0,000   0,0        0,000   0,0     1204 std::numpunct<char>::do_thousands_sep(void) (ana.obj)
       0,000   0,0       17,251   1,6      507 std::vector<class cDualVec,class std::allocator<class cDualVec> >::~vector<class cDualVec,class std::allocator<class cDualVec> >(void) (ctaautomaton.obj)
