Welcome to MOCHA 1.0
Please report any problems to mocha@eecs.berkeley.edu
Module Auto is composed and checked in.
Module System4 is composed and checked in.
Module System8 is composed and checked in.
parse successful.
Ordering variables using rtm_static_order
Transition relation computed : 8 conjuncts
Done initializing image info...

WARNING: Empty Array of Smoothing Variables

WARNING: Empty Array of Smoothing Variables
Initial Region Computed...
Step 1: image mdd size =         76	 |states| =        4	
WARNING: Empty Array of Smoothing Variables

WARNING: Empty Array of Smoothing Variables
reached set mdd size =         76	 |states| =        2
Step 2: image mdd size =         77	 |states| =        4	
WARNING: Empty Array of Smoothing Variables

WARNING: Empty Array of Smoothing Variables
reached set mdd size =        111	 |states| =        3
Step 3: image mdd size =         76	 |states| =        4	
WARNING: Empty Array of Smoothing Variables

WARNING: Empty Array of Smoothing Variables
reached set mdd size =        145	 |states| =        4
Step 4: image mdd size =         78	 |states| =        4	
WARNING: Empty Array of Smoothing Variables

WARNING: Empty Array of Smoothing Variables
reached set mdd size =        180	 |states| =        5
Step 5: image mdd size =         76	 |states| =        4	
WARNING: Empty Array of Smoothing Variables

WARNING: Empty Array of Smoothing Variables
reached set mdd size =        213	 |states| =        6
Step 6: image mdd size =         77	 |states| =        4	
WARNING: Empty Array of Smoothing Variables

WARNING: Empty Array of Smoothing Variables
reached set mdd size =        247	 |states| =        7
Step 7: image mdd size =         76	 |states| =        4	
WARNING: Empty Array of Smoothing Variables

WARNING: Empty Array of Smoothing Variables
reached set mdd size =        280	 |states| =        8
Step 8: image mdd size =         79	 |states| =        4	
WARNING: Empty Array of Smoothing Variables

WARNING: Empty Array of Smoothing Variables
reached set mdd size =        315	 |states| =        9
Step 9: image mdd size =         76	 |states| =        4	
WARNING: Empty Array of Smoothing Variables

WARNING: Empty Array of Smoothing Variables
reached set mdd size =        347	 |states| =       10
Step 10: image mdd size =        108	 |states| =      514	
WARNING: Empty Array of Smoothing Variables

WARNING: Empty Array of Smoothing Variables
reached set mdd size =        407	 |states| =      266
Step 11: image mdd size =        343	 |states| =     1532	
WARNING: Empty Array of Smoothing Variables

WARNING: Empty Array of Smoothing Variables
reached set mdd size =        611	 |states| =      776
Step 12: image mdd size =        428	 |states| =    14650	
WARNING: Empty Array of Smoothing Variables

WARNING: Empty Array of Smoothing Variables
reached set mdd size =        758	 |states| =     7590
Step 13: image mdd size =        910	 |states| =    51456	
WARNING: Empty Array of Smoothing Variables

WARNING: Empty Array of Smoothing Variables
reached set mdd size =       1135	 |states| =    26503
Step 14: image mdd size =        936	 |states| =   202654	
WARNING: Empty Array of Smoothing Variables

WARNING: Empty Array of Smoothing Variables
reached set mdd size =       1176	 |states| =   108662
Step 15: image mdd size =       1411	 |states| =   528196	
WARNING: Empty Array of Smoothing Variables

WARNING: Empty Array of Smoothing Variables
reached set mdd size =       1476	 |states| =   290109
Step 16: image mdd size =       1162	 |states| =   742420	
WARNING: Empty Array of Smoothing Variables

WARNING: Empty Array of Smoothing Variables
reached set mdd size =       1267	 |states| =   475084
Step 17: image mdd size =       1369	 |states| =   487900	
WARNING: Empty Array of Smoothing Variables

WARNING: Empty Array of Smoothing Variables
reached set mdd size =       1414	 |states| =   534059
Step 18: image mdd size =       1087	 |states| =   235900	
WARNING: Empty Array of Smoothing Variables

WARNING: Empty Array of Smoothing Variables
reached set mdd size =       1491	 |states| =   593034
Step 19: image mdd size =       1118	 |states| =   235900	
WARNING: Empty Array of Smoothing Variables

WARNING: Empty Array of Smoothing Variables
reached set mdd size =       1660	 |states| =   652009
Step 20: image mdd size =       1212	 |states| =   236410	
WARNING: Empty Array of Smoothing Variables

WARNING: Empty Array of Smoothing Variables
reached set mdd size =       1855	 |states| =   711238
Step 21: image mdd size =       1573	 |states| =   273726	
WARNING: Empty Array of Smoothing Variables

WARNING: Empty Array of Smoothing Variables
reached set mdd size =       2324	 |states| =   788871
Step 22: image mdd size =       2542	 |states| =   638146	
WARNING: Empty Array of Smoothing Variables

WARNING: Empty Array of Smoothing Variables
reached set mdd size =       3387	 |states| = 1.03006e+06
Step 23: image mdd size =       3768	 |states| = 1.90723e+06	
WARNING: Empty Array of Smoothing Variables

WARNING: Empty Array of Smoothing Variables
reached set mdd size =       4547	 |states| = 1.72988e+06
Step 24: image mdd size =       6023	 |states| = 5.14131e+06	
WARNING: Empty Array of Smoothing Variables

WARNING: Empty Array of Smoothing Variables
reached set mdd size =       6506	 |states| = 3.52086e+06
Step 25: image mdd size =       7932	 |states| = 1.23898e+07	
WARNING: Empty Array of Smoothing Variables

WARNING: Empty Array of Smoothing Variables
reached set mdd size =       7801	 |states| = 7.65392e+06
Step 26: image mdd size =      10780	 |states| = 2.40428e+07	
WARNING: Empty Array of Smoothing Variables

WARNING: Empty Array of Smoothing Variables
reached set mdd size =       9716	 |states| = 1.47654e+07
Step 27: image mdd size =      13653	 |states| = 3.29624e+07	
WARNING: Empty Array of Smoothing Variables

WARNING: Empty Array of Smoothing Variables
reached set mdd size =      10912	 |states| = 2.24164e+07
Step 28: image mdd size =      12788	 |states| = 6.0231e+07	
WARNING: Empty Array of Smoothing Variables

WARNING: Empty Array of Smoothing Variables
reached set mdd size =      12788	 |states| = 3.01155e+07
Step 29: image mdd size =      17625	 |states| = 3.76594e+07	
WARNING: Empty Array of Smoothing Variables

WARNING: Empty Array of Smoothing Variables
reached set mdd size =      12483	 |states| = 3.93339e+07
Step 30: image mdd size =      12028	 |states| = 9.64142e+07	
WARNING: Empty Array of Smoothing Variables

WARNING: Empty Array of Smoothing Variables
reached set mdd size =      12028	 |states| = 4.82071e+07
Step 31: image mdd size =      11008	 |states| = 1.10225e+08	
WARNING: Empty Array of Smoothing Variables

WARNING: Empty Array of Smoothing Variables
reached set mdd size =      11008	 |states| = 5.51127e+07
Step 32: image mdd size =      11554	 |states| = 1.20275e+08	
WARNING: Empty Array of Smoothing Variables

WARNING: Empty Array of Smoothing Variables
reached set mdd size =      11554	 |states| = 6.01373e+07
Step 33: image mdd size =      13529	 |states| = 1.30959e+08	
WARNING: Empty Array of Smoothing Variables

WARNING: Empty Array of Smoothing Variables
reached set mdd size =      13529	 |states| = 6.54797e+07
Step 34: image mdd size =      20345	 |states| = 3.12219e+07	
WARNING: Empty Array of Smoothing Variables

WARNING: Empty Array of Smoothing Variables
reached set mdd size =      18894	 |states| = 7.56265e+07
Step 35: image mdd size =      27896	 |states| = 6.66091e+07	
WARNING: Empty Array of Smoothing Variables

WARNING: Empty Array of Smoothing Variables
reached set mdd size =      26246	 |states| = 9.79437e+07
Step 36: image mdd size =      39820	 |states| = 1.38603e+08	
WARNING: Empty Array of Smoothing Variables

WARNING: Empty Array of Smoothing Variables
reached set mdd size =      36178	 |states| = 1.41281e+08
Step 37: image mdd size =      53772	 |states| = 2.48959e+08	
WARNING: Empty Array of Smoothing Variables

WARNING: Empty Array of Smoothing Variables
reached set mdd size =      44970	 |states| = 2.12991e+08
Step 38: image mdd size =      52857	 |states| = 6.11468e+08	
WARNING: Empty Array of Smoothing Variables

WARNING: Empty Array of Smoothing Variables
reached set mdd size =      52857	 |states| = 3.05734e+08
Step 39: image mdd size =      57869	 |states| = 7.92576e+08	
WARNING: Empty Array of Smoothing Variables

WARNING: Empty Array of Smoothing Variables
reached set mdd size =      57869	 |states| = 3.96288e+08
Step 40: image mdd size =      62260	 |states| = 9.78994e+08	
WARNING: Empty Array of Smoothing Variables

WARNING: Empty Array of Smoothing Variables
reached set mdd size =      62260	 |states| = 4.89497e+08
Step 41: image mdd size =      66103	 |states| = 1.18526e+09	
WARNING: Empty Array of Smoothing Variables

WARNING: Empty Array of Smoothing Variables
reached set mdd size =      66103	 |states| = 5.92629e+08
Step 42: image mdd size =      64126	 |states| = 1.38842e+09	
WARNING: Empty Array of Smoothing Variables

WARNING: Empty Array of Smoothing Variables
reached set mdd size =      64126	 |states| = 6.94211e+08
Step 43: image mdd size =      62665	 |states| = 1.58199e+09	
WARNING: Empty Array of Smoothing Variables

WARNING: Empty Array of Smoothing Variables
reached set mdd size =      62665	 |states| = 7.90997e+08
Step 44: image mdd size =      63999	 |states| = 1.78196e+09	
WARNING: Empty Array of Smoothing Variables

WARNING: Empty Array of Smoothing Variables
reached set mdd size =      63999	 |states| = 8.90981e+08
Step 45: image mdd size =      75254	 |states| = 2.042e+09	
WARNING: Empty Array of Smoothing Variables

WARNING: Empty Array of Smoothing Variables
reached set mdd size =      75254	 |states| = 1.021e+09
Step 46: image mdd size =      92816	 |states| = 2.44645e+09	
WARNING: Empty Array of Smoothing Variables

WARNING: Empty Array of Smoothing Variables
reached set mdd size =      92816	 |states| = 1.22323e+09
Step 47: image mdd size =     115084	 |states| = 3.06352e+09	
WARNING: Empty Array of Smoothing Variables

WARNING: Empty Array of Smoothing Variables
reached set mdd size =     115084	 |states| = 1.53176e+09
Step 48: image mdd size =     146405	 |states| = 3.929e+09	
WARNING: Empty Array of Smoothing Variables

WARNING: Empty Array of Smoothing Variables
reached set mdd size =     146405	 |states| = 1.9645e+09
Step 49: image mdd size =     175962	 |states| = 5.0269e+09	
WARNING: Empty Array of Smoothing Variables

WARNING: Empty Array of Smoothing Variables
reached set mdd size =     175962	 |states| = 2.51345e+09
Step 50: image mdd size =     202789	 |states| = 6.23423e+09	
WARNING: Empty Array of Smoothing Variables

WARNING: Empty Array of Smoothing Variables
reached set mdd size =     202789	 |states| = 3.11711e+09
Step 51: image mdd size =     221261	 |states| = 7.43265e+09	
WARNING: Empty Array of Smoothing Variables

WARNING: Empty Array of Smoothing Variables
reached set mdd size =     221261	 |states| = 3.71633e+09
Step 52: image mdd size =     229719	 |states| = 8.60985e+09	
WARNING: Empty Array of Smoothing Variables

WARNING: Empty Array of Smoothing Variables
reached set mdd size =     229719	 |states| = 4.30492e+09
Step 53: image mdd size =     232248	 |states| = 9.78704e+09	
WARNING: Empty Array of Smoothing Variables

WARNING: Empty Array of Smoothing Variables
reached set mdd size =     232248	 |states| = 4.89352e+09
Step 54: image mdd size =     234909	 |states| = 1.10041e+10	
WARNING: Empty Array of Smoothing Variables

WARNING: Empty Array of Smoothing Variables
reached set mdd size =     234909	 |states| = 5.50204e+09
Step 55: image mdd size =     245831	 |states| = 1.246e+10	
WARNING: Empty Array of Smoothing Variables

WARNING: Empty Array of Smoothing Variables
reached set mdd size =     245831	 |states| = 6.23001e+09
Step 56: image mdd size =     268725	 |states| = 1.45415e+10	
WARNING: Empty Array of Smoothing Variables

WARNING: Empty Array of Smoothing Variables
reached set mdd size =     268725	 |states| = 7.27074e+09
Step 57: image mdd size =     307562	 |states| = 1.78365e+10	
WARNING: Empty Array of Smoothing Variables

WARNING: Empty Array of Smoothing Variables
reached set mdd size =     307562	 |states| = 8.91826e+09
Step 58: image mdd size =     362068	 |states| = 2.28855e+10	
WARNING: Empty Array of Smoothing Variables

WARNING: Empty Array of Smoothing Variables
reached set mdd size =     362068	 |states| = 1.14427e+10
Step 59: image mdd size =     411883	 |states| = 2.96406e+10	
WARNING: Empty Array of Smoothing Variables

WARNING: Empty Array of Smoothing Variables
reached set mdd size =     411883	 |states| = 1.48203e+10
Step 60: image mdd size =     436146	 |states| = 3.69309e+10	
WARNING: Empty Array of Smoothing Variables

WARNING: Empty Array of Smoothing Variables
reached set mdd size =     436146	 |states| = 1.84655e+10
Step 61: image mdd size =     442977	 |states| = 4.31695e+10	
WARNING: Empty Array of Smoothing Variables

WARNING: Empty Array of Smoothing Variables
reached set mdd size =     442977	 |states| = 2.15847e+10
Step 62: image mdd size =     442852	 |states| = 4.83446e+10	
WARNING: Empty Array of Smoothing Variables

WARNING: Empty Array of Smoothing Variables
reached set mdd size =     442852	 |states| = 2.41723e+10
Step 63: image mdd size =     452235	 |states| = 5.2986e+10	
WARNING: Empty Array of Smoothing Variables

WARNING: Empty Array of Smoothing Variables
reached set mdd size =     452235	 |states| = 2.6493e+10
Step 64: image mdd size =     481626	 |states| = 5.76416e+10	
WARNING: Empty Array of Smoothing Variables

WARNING: Empty Array of Smoothing Variables
reached set mdd size =     481626	 |states| = 2.88208e+10
Step 65: image mdd size =     508664	 |states| = 6.26986e+10	
WARNING: Empty Array of Smoothing Variables

WARNING: Empty Array of Smoothing Variables
reached set mdd size =     508664	 |states| = 3.13493e+10
Step 66: image mdd size =     552423	 |states| = 6.90426e+10	
WARNING: Empty Array of Smoothing Variables

WARNING: Empty Array of Smoothing Variables
reached set mdd size =     552423	 |states| = 3.45213e+10
Step 67: image mdd size =     624718	 |states| = 7.83417e+10	
WARNING: Empty Array of Smoothing Variables

WARNING: Empty Array of Smoothing Variables
reached set mdd size =     624718	 |states| = 3.91709e+10
Step 68: image mdd size =     730647	 |states| = 9.23588e+10	
WARNING: Empty Array of Smoothing Variables

WARNING: Empty Array of Smoothing Variables
reached set mdd size =     730647	 |states| = 4.61794e+10
