iPhysical.iPieceStore.iEmptySensor.c
1
2
iPhysical.iPieceStore.iEmptySensor.SensorBehavior
4
4
iPhysical.iPieceStore.pieceCount
5
5
iPhysical.iPieceStore.PieceHandling
5
7
9
11
iPhysical.iPieceStore.c
11
11
12
8
iController.iPieceStoreTransport.PieceStoreControl
18
19
20
iPhysical.iPieceStore.iMotor.MotorBehavior
21
iPhysical.iPieceStore.iChainSensor.SensorBehavior
19
21
iPhysical.iPieceStore.iChainSensor.c
21
22
iController.iPieceStoreTransport.emptyFlag
21
iController.iPieceStoreTransport.c
21
11
12
6
iPhysical.iBelt1.iSensorA.c
11
12
iPhysical.iBelt1.iSensorA.SensorBehavior
14
14
iPhysical.iBelt1.iSensorB.c
17
18
iPhysical.iBelt1.iSensorB.SensorBehavior
20
20
iPhysical.iBelt2.iSensor.SensorBehavior
22
25
iPhysical.iBelt2.iSensor.c
28
28
iPhysical.iMachine3.iTopPositionSensor.c
29
30
iPhysical.iMachine3.iTopPositionSensor.SensorBehavior
31
31
iPhysical.iMachine3.iBottomPositionSensor.c
33
33
iPhysical.iMachine3.iBottomPositionSensor.SensorBehavior
34
34
iPhysical.iBelt2.PieceProgress
36
34
37
iPhysical.iBelt2.c
40
5
4
iPhysical.iBelt1.c
36
38
7
iPhysical.iBelt1.PieceProgress
43
43
45
44
iController.iBelt1Transport.iBeltController.BeltControl
42
44
49
49
iPhysical.iBelt1.iBeltMotor.MotorBehavior
44
44
iController.iBelt2Transport.iBeltTransport.BeltControl
35
38
38
38
iPhysical.iBelt2.iBeltMotor.MotorBehavior
36
36
iController.iMachine3Control.PressMachineControl
33
34
34
36
iPhysical.iMachine3.MachinePosition
37
37
37
9
iPhysical.iMachine3.iPositionMotor.MotorBehavior
34
31
iController.iBelt2Transport.BeltControl
30
30
iPhysical.iMachine3.c
30
1
1
iController.iBelt2Transport.iBeltTransport.pc
28
iController.iBelt1Transport.iBeltController.pc
28
iPhysical.iBelt3.iSensorA.SensorBehavior
28
33
iPhysical.iBelt3.iSensorA.c
35
36
iPhysical.iBelt3.iSensorB.SensorBehavior
35
36
iPhysical.iBelt3.iSensorB.c
38
39
iController.iBelt1Transport.BeltControl
40
0
iController.iBelt3Transport.iBeltController.BeltControl
40
44
49
48
iController.b2pc
48
46
iPhysical.iBelt3.PieceProgress
70
68
68
66
iPhysical.iBelt3.iBeltMotor.MotorBehavior
64
64
iPhysical.iBelt3.c
60
57
3
iController.iBelt3Transport.iBeltController.pc
51
iController.iBelt4_5Transport.BeltControl
51
55
60
66
71
iPhysical.iBelt5.iSensorB.SensorBehavior
72
74
iPhysical.iBelt5.iSensorB.c
74
75
iPhysical.iBelt5.iSensorA.SensorBehavior
76
79
iPhysical.iBelt5.iSensorA.c
79
81
iPhysical.iBelt5.PieceProgress
79
77
77
77
iPhysical.iBelt5.iBeltMotor.MotorBehavior
76
76
iPhysical.iBelt5.c
71
68
6
iController.iBelt4_5Transport.c
59
59
59
59
2
2
iPhysical.iBelt4.iBeltMotor.MotorBehavior
58
58
iPhysical.iTurnTable2.iBelt.PieceProgress
56
56
59
iPhysical.iTurnTable2.iBelt.c
63
4
2
iPhysical.iTurnTable2.iSensorRight.c
60
61
iPhysical.iTurnTable2.iSensorRight.SensorBehavior
63
63
iPhysical.iTurnTable2.iSensorLeft.c
65
65
iPhysical.iTurnTable2.iSensorLeft.SensorBehavior
67
67
iPhysical.iTurnTable2.iBelt.iSensor.SensorBehavior
69
70
iPhysical.iTurnTable2.iBelt.iSensor.c
70
69
iController.iTurnTable2Transport.iTableTransport.TurnTableControl
69
71
71
72
74
iPhysical.iTurnTable2.CheckTurnControl
74
74
73
71
iPhysical.iTurnTable2.iTurnMotor.MotorBehavior
69
69
iController.iTurnTable2Transport.iBeltTransport.BeltControl
66
66
65
65
iPhysical.iTurnTable2.iBelt.iBeltMotor.MotorBehavior
63
63
iPhysical.iTurnTable2.c
61
2
2
iController.b4_5pc
57
57
56
iController.iPiece2.Piece2Control
56
62
69
67
iController.iTurnTable2Transport.iTableTransport.pc
64
iController.iTurnTable2Transport.iBeltTransport.pc
63
iController.iBelt6Transport.BeltControl
63
0
iController.iBelt6Transport.iBeltController.BeltControl
63
78
87
93
iPhysical.iBelt6.iSensorB.SensorBehavior
99
102
iPhysical.iBelt6.iSensorB.c
102
105
iPhysical.iBelt6.iSensorA.SensorBehavior
108
117
iPhysical.iBelt6.iSensorA.c
117
120
iPhysical.iBelt6.PieceProgress
117
111
111
105
iPhysical.iBelt6.iBeltMotor.MotorBehavior
99
99
iPhysical.iBelt6.c
87
78
6
iController.iBelt6Transport.iBeltController.pc
63
iController.iBelt7Transport.BeltControl
63
75
78
81
iPhysical.iBelt7.iSensor.c
81
87
iPhysical.iBelt7.iSensor.SensorBehavior
87
87
iPhysical.iBelt7.PieceProgress
87
84
84
iPhysical.iBelt7.iBeltMotor.MotorBehavior
81
81
iPhysical.iBelt7.c
75
12
6
iController.pos2
63
62
54
iController.b9_10pc
31
26
26
iController.iBelt7Transport.pc
27
iController.iBelt8Transport.iBeltController.BeltControl
27
33
38
37
iPhysical.iBelt8.iSensorA.SensorBehavior
38
41
iPhysical.iBelt8.iSensorA.c
41
42
iPhysical.iBelt8.iSensorB.SensorBehavior
41
42
iPhysical.iBelt8.iSensorB.c
42
43
iPhysical.iBelt8.PieceProgress
44
42
42
40
iPhysical.iBelt8.iBeltMotor.MotorBehavior
38
38
iPhysical.iBelt8.c
34
31
2
iController.iBelt8Transport.iBeltController.pc
26
iController.iBelt9_10Transport.iLongBeltTransport.BeltControl
26
29
35
41
41
iController.iBelt9_10Transport.BeltControl
40
iPhysical.iBelt10.c
40
43
8
iPhysical.iBelt10.PieceProgress
38
38
38
38
iPhysical.iBelt10.iSensorB.SensorBehavior
38
38
iPhysical.iBelt10.iSensorA.SensorBehavior
36
36
iPhysical.iBelt10.iBeltMotor.MotorBehavior
33
33
iPhysical.iBelt10.iSensorB.c
31
32
iPhysical.iBelt10.iSensorA.c
31
28
iPhysical.iMachine4.iBottomPositionSensor.SensorBehavior
26
27
iPhysical.iMachine4.iBottomPositionSensor.c
29
29
iController.iMachine4Control.DrillMachineControl
29
30
31
32
iPhysical.iMachine4.MachinePosition
34
35
35
9
iPhysical.iMachine4.iDrillMotor.MotorBehavior
35
35
iPhysical.iMachine4.iPositionMotor.MotorBehavior
34
32
iPhysical.iMachine4.iTopPositionSensor.SensorBehavior
31
31
iPhysical.iMachine4.iTopPositionSensor.c
28
28
iPhysical.iMachine4.c
27
1
1
iController.iTurnTable1Transport.iTableTransport.TurnTableControl
25
25
28
31
34
iController.iTurnTable1Transport.iBeltTransport.BeltControl
34
38
38
39
iController.iTurnTable1Transport.iTableTransport.pc
36
35
iPhysical.iTurnTable1.iSensorRight.SensorBehavior
33
34
iPhysical.iTurnTable1.iSensorRight.c
34
33
iPhysical.iTurnTable1.CheckTurnControl
33
34
34
33
iPhysical.iTurnTable1.iSensorLeft.SensorBehavior
34
34
iPhysical.iTurnTable1.iTurnMotor.MotorBehavior
32
32
iPhysical.iTurnTable1.iSensorLeft.c
30
30
iController.iTurnTable1Transport.iBeltTransport.pc
28
17
iPhysical.iTurnTable1.c
21
2
2
iPhysical.iTurnTable1.iBelt.PieceProgress
17
15
15
iPhysical.iTurnTable1.iBelt.iSensor.SensorBehavior
20
20
iPhysical.iTurnTable1.iBelt.iBeltMotor.MotorBehavior
15
15
iPhysical.iTurnTable1.iBelt.iSensor.c
14
9
iPhysical.iTurnTable1.iBelt.c
8
6
2
iPhysical.iBelt9.iBeltMotor.MotorBehavior
2
2
iController.iBelt9_10Transport.iLongBeltTransport.c
1
1
1
1
0
0
