%!PS-Adobe-2.0 EPSF-2.0
%%Title: stopwtch.eps
%%Creator: fig2dev Version 3.2 Patchlevel 0-beta3
%%CreationDate: Sun Nov 19 16:12:46 2000
%%For: an@birke (Andreas Noack)
%%Orientation: Portrait
%%BoundingBox: 0 0 723 97
%%Pages: 0
%%BeginSetup
%%EndSetup
%%Magnification: 1.0000
%%EndComments
/$F2psDict 200 dict def
$F2psDict begin
$F2psDict /mtrx matrix put
/col-1 {0 setgray} bind def
/col0 {0.000 0.000 0.000 srgb} bind def
/col1 {0.000 0.000 1.000 srgb} bind def
/col2 {0.000 1.000 0.000 srgb} bind def
/col3 {0.000 1.000 1.000 srgb} bind def
/col4 {1.000 0.000 0.000 srgb} bind def
/col5 {1.000 0.000 1.000 srgb} bind def
/col6 {1.000 1.000 0.000 srgb} bind def
/col7 {1.000 1.000 1.000 srgb} bind def
/col8 {0.000 0.000 0.560 srgb} bind def
/col9 {0.000 0.000 0.690 srgb} bind def
/col10 {0.000 0.000 0.820 srgb} bind def
/col11 {0.530 0.810 1.000 srgb} bind def
/col12 {0.000 0.560 0.000 srgb} bind def
/col13 {0.000 0.690 0.000 srgb} bind def
/col14 {0.000 0.820 0.000 srgb} bind def
/col15 {0.000 0.560 0.560 srgb} bind def
/col16 {0.000 0.690 0.690 srgb} bind def
/col17 {0.000 0.820 0.820 srgb} bind def
/col18 {0.560 0.000 0.000 srgb} bind def
/col19 {0.690 0.000 0.000 srgb} bind def
/col20 {0.820 0.000 0.000 srgb} bind def
/col21 {0.560 0.000 0.560 srgb} bind def
/col22 {0.690 0.000 0.690 srgb} bind def
/col23 {0.820 0.000 0.820 srgb} bind def
/col24 {0.500 0.190 0.000 srgb} bind def
/col25 {0.630 0.250 0.000 srgb} bind def
/col26 {0.750 0.380 0.000 srgb} bind def
/col27 {1.000 0.500 0.500 srgb} bind def
/col28 {1.000 0.630 0.630 srgb} bind def
/col29 {1.000 0.750 0.750 srgb} bind def
/col30 {1.000 0.880 0.880 srgb} bind def
/col31 {1.000 0.840 0.000 srgb} bind def

end
save
-88.0 158.0 translate
1 -1 scale

/cp {closepath} bind def
/ef {eofill} bind def
/gr {grestore} bind def
/gs {gsave} bind def
/sa {save} bind def
/rs {restore} bind def
/l {lineto} bind def
/m {moveto} bind def
/rm {rmoveto} bind def
/n {newpath} bind def
/s {stroke} bind def
/sh {show} bind def
/slc {setlinecap} bind def
/slj {setlinejoin} bind def
/slw {setlinewidth} bind def
/srgb {setrgbcolor} bind def
/rot {rotate} bind def
/sc {scale} bind def
/sd {setdash} bind def
/ff {findfont} bind def
/sf {setfont} bind def
/scf {scalefont} bind def
/sw {stringwidth} bind def
/tr {translate} bind def
/tnt {dup dup currentrgbcolor
  4 -2 roll dup 1 exch sub 3 -1 roll mul add
  4 -2 roll dup 1 exch sub 3 -1 roll mul add
  4 -2 roll dup 1 exch sub 3 -1 roll mul add srgb}
  bind def
/shd {dup dup currentrgbcolor 4 -2 roll mul 4 -2 roll mul
  4 -2 roll mul srgb} bind def
 /DrawEllipse {
	/endangle exch def
	/startangle exch def
	/yrad exch def
	/xrad exch def
	/y exch def
	/x exch def
	/savematrix mtrx currentmatrix def
	x y tr xrad yrad sc 0 0 1 startangle endangle arc
	closepath
	savematrix setmatrix
	} def

/$F2psBegin {$F2psDict begin /$F2psEnteredState save def} def
/$F2psEnd {$F2psEnteredState restore end} def
%%EndProlog

$F2psBegin
10 setmiterlimit
n -1000 3626 m -1000 -1000 l 14515 -1000 l 14515 3626 l cp clip
 0.06000 0.06000 sc
/Helvetica-Bold ff 180.00 scf sf
6600 1800 m
gs 1 -1 sc (1) col0 sh gr
/Times-Bold ff 270.00 scf sf
6525 1725 m
gs 1 -1 sc (l) col0 sh gr
/Helvetica-Bold ff 180.00 scf sf
3600 1950 m
gs 1 -1 sc (0) col0 sh gr
/Times-Bold ff 270.00 scf sf
3525 1875 m
gs 1 -1 sc (l) col0 sh gr
/Helvetica-Bold ff 180.00 scf sf
12600 1950 m
gs 1 -1 sc (3) col0 sh gr
/Times-Bold ff 270.00 scf sf
12525 1875 m
gs 1 -1 sc (l) col0 sh gr
15.000 slw
% Ellipse
n 3600 1800 900 600 0 360 DrawEllipse gs col0 s gr

% Ellipse
n 6600 1800 900 600 0 360 DrawEllipse gs col0 s gr

% Ellipse
n 12600 1800 900 600 0 360 DrawEllipse gs col0 s gr

% Ellipse
n 9600 1800 900 600 0 360 DrawEllipse gs col0 s gr

% Polyline
gs  clippath
2406 1740 m 2646 1800 l 2406 1860 l 2730 1860 l 2730 1740 l cp
clip
n 1500 1800 m 2700 1800 l gs col0 s gr gr

% arrowhead
n 2406 1740 m 2646 1800 l 2406 1860 l 2406 1800 l 2406 1740 l  cp gs 0.00 setgray ef gr  col0 s
% Polyline
gs  clippath
5406 1740 m 5646 1800 l 5406 1860 l 5730 1860 l 5730 1740 l cp
clip
n 4500 1800 m 5700 1800 l gs col0 s gr gr

% arrowhead
n 5406 1740 m 5646 1800 l 5406 1860 l 5406 1800 l 5406 1740 l  cp gs 0.00 setgray ef gr  col0 s
% Polyline
gs  clippath
8406 1740 m 8646 1800 l 8406 1860 l 8730 1860 l 8730 1740 l cp
clip
n 7500 1800 m 8700 1800 l gs col0 s gr gr

% arrowhead
n 8406 1740 m 8646 1800 l 8406 1860 l 8406 1800 l 8406 1740 l  cp gs 0.00 setgray ef gr  col0 s
% Polyline
gs  clippath
11406 1740 m 11646 1800 l 11406 1860 l 11730 1860 l 11730 1740 l cp
clip
n 10500 1800 m 11700 1800 l gs col0 s gr gr

% arrowhead
n 11406 1740 m 11646 1800 l 11406 1860 l 11406 1800 l 11406 1740 l  cp gs 0.00 setgray ef gr  col0 s
/Helvetica-Bold ff 270.00 scf sf
4650 2175 m
gs 1 -1 sc (z := 0) col0 sh gr
/Helvetica-Bold ff 270.00 scf sf
1650 2550 m
gs 1 -1 sc (y := 0) col0 sh gr
/Helvetica-Bold ff 270.00 scf sf
1650 2175 m
gs 1 -1 sc (x := 0,) col0 sh gr
/Helvetica-Bold ff 270.00 scf sf
5925 2100 m
gs 1 -1 sc (DER\(x\) = 0) col0 sh gr
/Helvetica-Bold ff 270.00 scf sf
7650 1650 m
gs 1 -1 sc (y = 1) col0 sh gr
/Helvetica-Bold ff 270.00 scf sf
10650 1650 m
gs 1 -1 sc (z = 1) col0 sh gr
/Helvetica-Bold ff 270.00 scf sf
10650 1275 m
gs 1 -1 sc (x = 1,) col0 sh gr
/Times-Bold ff 270.00 scf sf
9525 1875 m
gs 1 -1 sc (l) col0 sh gr
/Helvetica-Bold ff 180.00 scf sf
9600 1950 m
gs 1 -1 sc (2) col0 sh gr
$F2psEnd
rs
