%!PS-Adobe-2.0 EPSF-2.0
%%Title: klassen.eps
%%Creator: fig2dev Version 3.2 Patchlevel 0-beta3
%%CreationDate: Mon Oct 23 18:22:24 2000
%%For: an@weide (Andreas Noack)
%%Orientation: Portrait
%%BoundingBox: 0 0 634 310
%%Pages: 0
%%BeginSetup
%%EndSetup
%%Magnification: 1.0000
%%EndComments
/$F2psDict 200 dict def
$F2psDict begin
$F2psDict /mtrx matrix put
/col-1 {0 setgray} bind def
/col0 {0.000 0.000 0.000 srgb} bind def
/col1 {0.000 0.000 1.000 srgb} bind def
/col2 {0.000 1.000 0.000 srgb} bind def
/col3 {0.000 1.000 1.000 srgb} bind def
/col4 {1.000 0.000 0.000 srgb} bind def
/col5 {1.000 0.000 1.000 srgb} bind def
/col6 {1.000 1.000 0.000 srgb} bind def
/col7 {1.000 1.000 1.000 srgb} bind def
/col8 {0.000 0.000 0.560 srgb} bind def
/col9 {0.000 0.000 0.690 srgb} bind def
/col10 {0.000 0.000 0.820 srgb} bind def
/col11 {0.530 0.810 1.000 srgb} bind def
/col12 {0.000 0.560 0.000 srgb} bind def
/col13 {0.000 0.690 0.000 srgb} bind def
/col14 {0.000 0.820 0.000 srgb} bind def
/col15 {0.000 0.560 0.560 srgb} bind def
/col16 {0.000 0.690 0.690 srgb} bind def
/col17 {0.000 0.820 0.820 srgb} bind def
/col18 {0.560 0.000 0.000 srgb} bind def
/col19 {0.690 0.000 0.000 srgb} bind def
/col20 {0.820 0.000 0.000 srgb} bind def
/col21 {0.560 0.000 0.560 srgb} bind def
/col22 {0.690 0.000 0.690 srgb} bind def
/col23 {0.820 0.000 0.820 srgb} bind def
/col24 {0.500 0.190 0.000 srgb} bind def
/col25 {0.630 0.250 0.000 srgb} bind def
/col26 {0.750 0.380 0.000 srgb} bind def
/col27 {1.000 0.500 0.500 srgb} bind def
/col28 {1.000 0.630 0.630 srgb} bind def
/col29 {1.000 0.750 0.750 srgb} bind def
/col30 {1.000 0.880 0.880 srgb} bind def
/col31 {1.000 0.840 0.000 srgb} bind def

end
save
-34.0 362.0 translate
1 -1 scale

/cp {closepath} bind def
/ef {eofill} bind def
/gr {grestore} bind def
/gs {gsave} bind def
/sa {save} bind def
/rs {restore} bind def
/l {lineto} bind def
/m {moveto} bind def
/rm {rmoveto} bind def
/n {newpath} bind def
/s {stroke} bind def
/sh {show} bind def
/slc {setlinecap} bind def
/slj {setlinejoin} bind def
/slw {setlinewidth} bind def
/srgb {setrgbcolor} bind def
/rot {rotate} bind def
/sc {scale} bind def
/sd {setdash} bind def
/ff {findfont} bind def
/sf {setfont} bind def
/scf {scalefont} bind def
/sw {stringwidth} bind def
/tr {translate} bind def
/tnt {dup dup currentrgbcolor
  4 -2 roll dup 1 exch sub 3 -1 roll mul add
  4 -2 roll dup 1 exch sub 3 -1 roll mul add
  4 -2 roll dup 1 exch sub 3 -1 roll mul add srgb}
  bind def
/shd {dup dup currentrgbcolor 4 -2 roll mul 4 -2 roll mul
  4 -2 roll mul srgb} bind def
/$F2psBegin {$F2psDict begin /$F2psEnteredState save def} def
/$F2psEnd {$F2psEnteredState restore end} def
%%EndProlog

$F2psBegin
10 setmiterlimit
n -1000 7022 m -1000 -1000 l 12122 -1000 l 12122 7022 l cp clip
 0.06000 0.06000 sc
% Polyline
15.000 slw
n 7200 2400 m 9300 2400 l 9300 3000 l 7200 3000 l cp gs col0 s gr 
% Polyline
gs  clippath
8150 1840 m 8250 1540 l 8350 1840 l 8350 1470 l 8150 1470 l cp
clip
n 8250 2400 m 8250 1500 l gs col0 s gr gr

% arrowhead
n 8150 1840 m 8250 1540 l 8350 1840 l 8250 1840 l 8150 1840 l  cp gs col7 1.00 shd ef gr  col0 s
/Helvetica-Bold ff 240.00 scf sf
7425 2850 m
gs 1 -1 sc (bddAutomaton) col0 sh gr
% Polyline
n 3000 900 m 5100 900 l 5100 1500 l 3000 1500 l cp gs col0 s gr 
% Polyline
gs  clippath
3950 1840 m 4050 1540 l 4150 1840 l 4150 1470 l 3950 1470 l cp
clip
n 4050 3900 m 4050 1500 l gs col0 s gr gr

% arrowhead
n 3950 1840 m 4050 1540 l 4150 1840 l 4050 1840 l 3950 1840 l  cp gs col7 1.00 shd ef gr  col0 s
% Polyline
n 3000 3900 m 5100 3900 l 5100 4500 l 3000 4500 l cp gs col0 s gr 
% Polyline
n 7200 900 m 9300 900 l 9300 1500 l 7200 1500 l cp gs col0 s gr 
% Polyline
n 5400 4200 m 6900 4200 l gs col0 s gr 
% Polyline
n 6900 2700 m 5400 2700 l 5400 4200 l 5100 4200 l gs col0 s gr 
% Polyline
n 7200 3900 m 9300 3900 l 9300 4500 l 7200 4500 l cp gs col0 s gr 
% Polyline
n 8250 3000 m 8175 3150 l 8250 3300 l 8325 3150 l 8250 3000 l  cp gs 0.00 setgray ef gr gs col0 s gr 
% Polyline
n 8250 3300 m 8250 3900 l gs col0 s gr 
% Polyline
n 7200 2700 m 7050 2625 l 6900 2700 l 7050 2775 l 7200 2700 l  cp gs 0.00 setgray ef gr gs col0 s gr 
% Polyline
n 7200 4200 m 7050 4125 l 6900 4200 l 7050 4275 l 7200 4200 l  cp gs 0.00 setgray ef gr gs col0 s gr 
% Polyline
n 8850 3000 m 8775 3150 l 8850 3300 l 8925 3150 l 8850 3000 l  cp gs 0.00 setgray ef gr gs col0 s gr 
% Polyline
n 3000 5400 m 5100 5400 l 5100 6000 l 3000 6000 l cp gs col0 s gr 
% Polyline
n 5400 5400 m 7500 5400 l 7500 6000 l 5400 6000 l cp gs col0 s gr 
% Polyline
n 600 5400 m 2700 5400 l 2700 6000 l 600 6000 l cp gs col0 s gr 
% Polyline
n 9000 5400 m 11100 5400 l 11100 6000 l 9000 6000 l cp gs col0 s gr 
% Polyline
n 8850 3300 m 8850 3450 l 10050 3450 l 10050 5400 l gs col0 s gr 
% Polyline
gs  clippath
6660 5106 m 6600 5346 l 6540 5106 l 6540 5430 l 6660 5430 l cp
clip
n 7650 3000 m 7650 3450 l 6600 3450 l 6600 5400 l gs col0 s gr gr

% arrowhead
n 6660 5106 m 6600 5346 l 6540 5106 l  col0 s
% Polyline
gs  clippath
6060 5106 m 6000 5346 l 5940 5106 l 5940 5430 l 6060 5430 l cp
clip
n 4650 4500 m 4650 4950 l 6000 4950 l 6000 5400 l gs col0 s gr gr

% arrowhead
n 6060 5106 m 6000 5346 l 5940 5106 l  col0 s
% Polyline
gs  clippath
1710 5106 m 1650 5346 l 1590 5106 l 1590 5430 l 1710 5430 l cp
clip
n 3450 4500 m 3450 4950 l 1650 4950 l 1650 5400 l gs col0 s gr gr

% arrowhead
n 1710 5106 m 1650 5346 l 1590 5106 l  col0 s
% Polyline
n 4050 4500 m 3975 4650 l 4050 4800 l 4125 4650 l 4050 4500 l  cp gs 0.00 setgray ef gr gs col0 s gr 
% Polyline
n 4050 4800 m 4050 5400 l gs col0 s gr 
/Helvetica-Bold ff 240.00 scf sf
3450 1350 m
gs 1 -1 sc (reprConfig) col0 sh gr
/Helvetica-Bold ff 240.00 scf sf
3375 4275 m
gs 1 -1 sc (bddConfig) col0 sh gr
/Helvetica-Bold ff 240.00 scf sf
7425 1350 m
gs 1 -1 sc (reprAutomaton) col0 sh gr
/Helvetica-Bold ff 240.00 scf sf
7425 4350 m
gs 1 -1 sc (bddTransition) col0 sh gr
/Helvetica-Bold ff 240.00 scf sf
3600 5850 m
gs 1 -1 sc (bddBdd) col0 sh gr
/Helvetica-Bold ff 240.00 scf sf
750 5850 m
gs 1 -1 sc (bddExpression) col0 sh gr
/Helvetica-Bold ff 240.00 scf sf
5700 5850 m
gs 1 -1 sc (bddSymTab) col0 sh gr
/Helvetica-Bold ff 240.00 scf sf
9525 5850 m
gs 1 -1 sc (ctaIntSet) col0 sh gr
/Helvetica-Narrow ff 180.00 scf sf
1800 4875 m
gs 1 -1 sc (<<temporary>>) col0 sh gr
/Helvetica-Narrow ff 180.00 scf sf
5625 2625 m
gs 1 -1 sc (invariants) col0 sh gr
/Helvetica-Narrow ff 180.00 scf sf
5625 2400 m
gs 1 -1 sc (initial configurations,) col0 sh gr
/Helvetica-Narrow ff 180.00 scf sf
9150 3375 m
gs 1 -1 sc (synchronisation labels) col0 sh gr
$F2psEnd
rs
