{
    "covered_issues": [
        164,
        160,
        159,
        158,
        157,
        156,
        155,
        153,
        152,
        149,
        148,
        147,
        146,
        145,
        143,
        142,
        141,
        140,
        138,
        137,
        135,
        134,
        132,
        129,
        128,
        126,
        125,
        124,
        123,
        122,
        121,
        120,
        119,
        116,
        115,
        114,
        113,
        111,
        110,
        109,
        108,
        107,
        106,
        105,
        104,
        103,
        102,
        100,
        99,
        98,
        97,
        96,
        95,
        94,
        93,
        91,
        89,
        88,
        87,
        86,
        85,
        84,
        83,
        81,
        79,
        78,
        77,
        76,
        75,
        74,
        73,
        72,
        68,
        67,
        66,
        64,
        63,
        61,
        60,
        58,
        57,
        56,
        55,
        54,
        53,
        52,
        51,
        50,
        48,
        45,
        43,
        41,
        40,
        39,
        38,
        37,
        36,
        35,
        34,
        33,
        32,
        31,
        30,
        28,
        27,
        26,
        25,
        24,
        23,
        22,
        21,
        20,
        19,
        18,
        16,
        15,
        14,
        12,
        11,
        10,
        9,
        8,
        7,
        6,
        5,
        4,
        3,
        2,
        1
    ],
    "finished": true
}