{
    "commits": [
        {
            "associated_pull_request": [],
            "date": "2020-06-17 09:13:30+00:00",
            "diff": "opensips_opensips/issue_2115/commit_d105f2007bae37dde077feab9c804900d9ea0f7a.diff",
            "diff_additions": 8,
            "diff_deletions": 4,
            "diff_file_size": 26955,
            "diff_url": "https://github.com/OpenSIPS/opensips/commit/d105f2007bae37dde077feab9c804900d9ea0f7a.diff",
            "exists": true,
            "files": [
                {
                    "file_additions": 8,
                    "file_deletions": 4,
                    "file_exists": true,
                    "file_name": "modules/cgrates/cgrates_common.c",
                    "file_size": 26955
                }
            ],
            "interesting": {
                "reopen": false,
                "status": false
            },
            "is_parent": true,
            "sha": "d105f2007bae37dde077feab9c804900d9ea0f7a"
        },
        {
            "associated_pull_request": [],
            "date": "2020-06-17 13:38:45+00:00",
            "diff": "opensips_opensips/issue_2115/commit_f4227fa77a22e3439718fb9fe4b8077ea6fc659a.diff",
            "diff_additions": 2,
            "diff_deletions": 0,
            "diff_file_size": 20677,
            "diff_url": "https://github.com/OpenSIPS/opensips/commit/f4227fa77a22e3439718fb9fe4b8077ea6fc659a.diff",
            "exists": true,
            "files": [
                {
                    "file_additions": 2,
                    "file_deletions": 0,
                    "file_exists": true,
                    "file_name": "modules/rest_client/rest_client.c",
                    "file_size": 20677
                }
            ],
            "interesting": {
                "reopen": false,
                "status": false
            },
            "is_parent": false,
            "sha": "f4227fa77a22e3439718fb9fe4b8077ea6fc659a"
        },
        {
            "associated_pull_request": [],
            "date": "2020-06-17 13:38:45+00:00",
            "diff": "opensips_opensips/issue_2115/commit_b977c1ba8d7538fe5500701648becfd73821ac06.diff",
            "diff_additions": 2,
            "diff_deletions": 0,
            "diff_file_size": 20677,
            "diff_url": "https://github.com/OpenSIPS/opensips/commit/b977c1ba8d7538fe5500701648becfd73821ac06.diff",
            "exists": true,
            "files": [
                {
                    "file_additions": 2,
                    "file_deletions": 0,
                    "file_exists": true,
                    "file_name": "modules/rest_client/rest_client.c",
                    "file_size": 20677
                }
            ],
            "interesting": {
                "reopen": false,
                "status": false
            },
            "is_parent": false,
            "sha": "b977c1ba8d7538fe5500701648becfd73821ac06"
        },
        {
            "associated_pull_request": [],
            "date": "2020-06-17 13:38:45+00:00",
            "diff": "opensips_opensips/issue_2115/commit_c4b84f7a524cb7fcb559cebd42546e2dac0f916c.diff",
            "diff_additions": 2,
            "diff_deletions": 0,
            "diff_file_size": 20677,
            "diff_url": "https://github.com/OpenSIPS/opensips/commit/c4b84f7a524cb7fcb559cebd42546e2dac0f916c.diff",
            "exists": true,
            "files": [
                {
                    "file_additions": 2,
                    "file_deletions": 0,
                    "file_exists": true,
                    "file_name": "modules/rest_client/rest_client.c",
                    "file_size": 20677
                }
            ],
            "interesting": {
                "reopen": true,
                "status": false
            },
            "is_parent": false,
            "sha": "c4b84f7a524cb7fcb559cebd42546e2dac0f916c"
        },
        {
            "associated_pull_request": [],
            "date": "2020-06-21 19:52:45+00:00",
            "diff": "opensips_opensips/issue_2115/commit_31104219475b94b864c126f42f1e5abba8e41148.diff",
            "diff_additions": 55,
            "diff_deletions": 0,
            "diff_file_size": 60623,
            "diff_url": "https://github.com/OpenSIPS/opensips/commit/31104219475b94b864c126f42f1e5abba8e41148.diff",
            "exists": true,
            "files": [
                {
                    "file_additions": 2,
                    "file_deletions": 0,
                    "file_exists": true,
                    "file_name": "daemonize.c",
                    "file_size": 14156
                },
                {
                    "file_additions": 3,
                    "file_deletions": 0,
                    "file_exists": true,
                    "file_name": "main.c",
                    "file_size": 24359
                },
                {
                    "file_additions": 1,
                    "file_deletions": 0,
                    "file_exists": true,
                    "file_name": "modules/rest_client/rest_client.c",
                    "file_size": 20677
                },
                {
                    "file_additions": 49,
                    "file_deletions": 0,
                    "file_exists": true,
                    "file_name": "modules/rest_client/ssl_tweaks.c",
                    "file_size": 1431
                }
            ],
            "interesting": {
                "reopen": false,
                "status": false
            },
            "is_parent": false,
            "sha": "31104219475b94b864c126f42f1e5abba8e41148"
        },
        {
            "associated_pull_request": [],
            "date": "2020-06-21 19:52:45+00:00",
            "diff": "opensips_opensips/issue_2115/commit_113734c1c2aa586b069842a27c864b67c40dacf1.diff",
            "diff_additions": 55,
            "diff_deletions": 0,
            "diff_file_size": 60623,
            "diff_url": "https://github.com/OpenSIPS/opensips/commit/113734c1c2aa586b069842a27c864b67c40dacf1.diff",
            "exists": true,
            "files": [
                {
                    "file_additions": 2,
                    "file_deletions": 0,
                    "file_exists": true,
                    "file_name": "daemonize.c",
                    "file_size": 14156
                },
                {
                    "file_additions": 3,
                    "file_deletions": 0,
                    "file_exists": true,
                    "file_name": "main.c",
                    "file_size": 24359
                },
                {
                    "file_additions": 1,
                    "file_deletions": 0,
                    "file_exists": true,
                    "file_name": "modules/rest_client/rest_client.c",
                    "file_size": 20677
                },
                {
                    "file_additions": 49,
                    "file_deletions": 0,
                    "file_exists": true,
                    "file_name": "modules/rest_client/ssl_tweaks.c",
                    "file_size": 1431
                }
            ],
            "interesting": {
                "reopen": false,
                "status": false
            },
            "is_parent": false,
            "sha": "113734c1c2aa586b069842a27c864b67c40dacf1"
        },
        {
            "associated_pull_request": [],
            "date": "2020-06-21 19:52:45+00:00",
            "diff": "opensips_opensips/issue_2115/commit_8d63f3a523305db73630bbb776190aae989a7cf0.diff",
            "diff_additions": 55,
            "diff_deletions": 0,
            "diff_file_size": 60623,
            "diff_url": "https://github.com/OpenSIPS/opensips/commit/8d63f3a523305db73630bbb776190aae989a7cf0.diff",
            "exists": true,
            "files": [
                {
                    "file_additions": 2,
                    "file_deletions": 0,
                    "file_exists": true,
                    "file_name": "daemonize.c",
                    "file_size": 14156
                },
                {
                    "file_additions": 3,
                    "file_deletions": 0,
                    "file_exists": true,
                    "file_name": "main.c",
                    "file_size": 24359
                },
                {
                    "file_additions": 1,
                    "file_deletions": 0,
                    "file_exists": true,
                    "file_name": "modules/rest_client/rest_client.c",
                    "file_size": 20677
                },
                {
                    "file_additions": 49,
                    "file_deletions": 0,
                    "file_exists": true,
                    "file_name": "modules/rest_client/ssl_tweaks.c",
                    "file_size": 1431
                }
            ],
            "interesting": {
                "reopen": false,
                "status": false
            },
            "is_parent": false,
            "sha": "8d63f3a523305db73630bbb776190aae989a7cf0"
        },
        {
            "associated_pull_request": [],
            "date": "2020-06-21 19:52:45+00:00",
            "diff": "opensips_opensips/issue_2115/commit_66c2c4d4392eb41bcdaec13caa00c28e77fe15ef.diff",
            "diff_additions": 55,
            "diff_deletions": 0,
            "diff_file_size": 60623,
            "diff_url": "https://github.com/OpenSIPS/opensips/commit/66c2c4d4392eb41bcdaec13caa00c28e77fe15ef.diff",
            "exists": true,
            "files": [
                {
                    "file_additions": 2,
                    "file_deletions": 0,
                    "file_exists": true,
                    "file_name": "daemonize.c",
                    "file_size": 14156
                },
                {
                    "file_additions": 3,
                    "file_deletions": 0,
                    "file_exists": true,
                    "file_name": "main.c",
                    "file_size": 24359
                },
                {
                    "file_additions": 1,
                    "file_deletions": 0,
                    "file_exists": true,
                    "file_name": "modules/rest_client/rest_client.c",
                    "file_size": 20677
                },
                {
                    "file_additions": 49,
                    "file_deletions": 0,
                    "file_exists": true,
                    "file_name": "modules/rest_client/ssl_tweaks.c",
                    "file_size": 1431
                }
            ],
            "interesting": {
                "reopen": false,
                "status": false
            },
            "is_parent": false,
            "sha": "66c2c4d4392eb41bcdaec13caa00c28e77fe15ef"
        },
        {
            "associated_pull_request": [],
            "date": "2021-11-16 19:33:27+00:00",
            "diff": "opensips_opensips/issue_2115/commit_639edf25ebc9d6c1de44433cef09c5b18a1fda45.diff",
            "diff_additions": 2453,
            "diff_deletions": 1272,
            "diff_file_size": 1493686,
            "diff_url": "https://github.com/OpenSIPS/opensips/commit/639edf25ebc9d6c1de44433cef09c5b18a1fda45.diff",
            "exists": true,
            "files": [
                {
                    "file_additions": 12,
                    "file_deletions": 11,
                    "file_exists": true,
                    "file_name": "action.c",
                    "file_size": 36487
                },
                {
                    "file_additions": 7,
                    "file_deletions": 2,
                    "file_exists": true,
                    "file_name": "async.c",
                    "file_size": 11346
                },
                {
                    "file_additions": 1,
                    "file_deletions": 7,
                    "file_exists": true,
                    "file_name": "bin_interface.c",
                    "file_size": 14111
                },
                {
                    "file_additions": 3,
                    "file_deletions": 3,
                    "file_exists": true,
                    "file_name": "cachedb/cachedb.c",
                    "file_size": 17485
                },
                {
                    "file_additions": 1,
                    "file_deletions": 1,
                    "file_exists": true,
                    "file_name": "cachedb/cachedb_dict.c",
                    "file_size": 7710
                },
                {
                    "file_additions": 3,
                    "file_deletions": 1,
                    "file_exists": true,
                    "file_name": "core_stats.c",
                    "file_size": 9506
                },
                {
                    "file_additions": 24,
                    "file_deletions": 40,
                    "file_exists": true,
                    "file_name": "daemonize.c",
                    "file_size": 14156
                },
                {
                    "file_additions": 6,
                    "file_deletions": 2,
                    "file_exists": true,
                    "file_name": "db/db.c",
                    "file_size": 12090
                },
                {
                    "file_additions": 3,
                    "file_deletions": 5,
                    "file_exists": true,
                    "file_name": "db/db_id.c",
                    "file_size": 7554
                },
                {
                    "file_additions": 1,
                    "file_deletions": 1,
                    "file_exists": true,
                    "file_name": "db/db_query.c",
                    "file_size": 11658
                },
                {
                    "file_additions": 50,
                    "file_deletions": 0,
                    "file_exists": true,
                    "file_name": "db/db_ut.c",
                    "file_size": 8991
                },
                {
                    "file_additions": 3,
                    "file_deletions": 2,
                    "file_exists": true,
                    "file_name": "lib/cJSON.c",
                    "file_size": 57922
                },
                {
                    "file_additions": 120,
                    "file_deletions": 29,
                    "file_exists": true,
                    "file_name": "lib/csv.c",
                    "file_size": 4781
                },
                {
                    "file_additions": 114,
                    "file_deletions": 44,
                    "file_exists": true,
                    "file_name": "lib/dbg/struct_hist.c",
                    "file_size": 6596
                },
                {
                    "file_additions": 79,
                    "file_deletions": 63,
                    "file_exists": true,
                    "file_name": "lib/path.c",
                    "file_size": 6062
                },
                {
                    "file_additions": 5,
                    "file_deletions": 4,
                    "file_exists": true,
                    "file_name": "lib/reg/path.c",
                    "file_size": 3781
                },
                {
                    "file_additions": 184,
                    "file_deletions": 0,
                    "file_exists": true,
                    "file_name": "lib/test/test_csv.c",
                    "file_size": 5961
                },
                {
                    "file_additions": 4,
                    "file_deletions": 4,
                    "file_exists": true,
                    "file_name": "lib/url.c",
                    "file_size": 8073
                },
                {
                    "file_additions": 11,
                    "file_deletions": 11,
                    "file_exists": true,
                    "file_name": "main.c",
                    "file_size": 24359
                },
                {
                    "file_additions": 229,
                    "file_deletions": 262,
                    "file_exists": true,
                    "file_name": "mem/hp_malloc.c",
                    "file_size": 17526
                },
                {
                    "file_additions": 7,
                    "file_deletions": 7,
                    "file_exists": true,
                    "file_name": "mem/hp_malloc_stats.c",
                    "file_size": 6912
                },
                {
                    "file_additions": 340,
                    "file_deletions": 0,
                    "file_exists": false,
                    "file_name": "mem/test/test_hp_malloc.c",
                    "file_size": 0
                },
                {
                    "file_additions": 35,
                    "file_deletions": 5,
                    "file_exists": true,
                    "file_name": "menuconfig/commands.c",
                    "file_size": 13575
                },
                {
                    "file_additions": 3,
                    "file_deletions": 0,
                    "file_exists": true,
                    "file_name": "mi/mi_trace.c",
                    "file_size": 9034
                },
                {
                    "file_additions": 2,
                    "file_deletions": 0,
                    "file_exists": true,
                    "file_name": "modules/aaa_radius/aaa_radius.c",
                    "file_size": 18025
                },
                {
                    "file_additions": 160,
                    "file_deletions": 78,
                    "file_exists": true,
                    "file_name": "modules/acc/acc.c",
                    "file_size": 47056
                },
                {
                    "file_additions": 11,
                    "file_deletions": 8,
                    "file_exists": true,
                    "file_name": "modules/acc/acc_extra.c",
                    "file_size": 12294
                },
                {
                    "file_additions": 108,
                    "file_deletions": 106,
                    "file_exists": true,
                    "file_name": "modules/acc/acc_logic.c",
                    "file_size": 37460
                },
                {
                    "file_additions": 27,
                    "file_deletions": 0,
                    "file_exists": true,
                    "file_name": "modules/acc/acc_mod.c",
                    "file_size": 13179
                },
                {
                    "file_additions": 3,
                    "file_deletions": 1,
                    "file_exists": true,
                    "file_name": "modules/acc/acc_vars.c",
                    "file_size": 11676
                },
                {
                    "file_additions": 2,
                    "file_deletions": 4,
                    "file_exists": true,
                    "file_name": "modules/alias_db/alias_db.c",
                    "file_size": 5663
                },
                {
                    "file_additions": 7,
                    "file_deletions": 6,
                    "file_exists": true,
                    "file_name": "modules/auth/auth_mod.c",
                    "file_size": 12665
                },
                {
                    "file_additions": 2,
                    "file_deletions": 0,
                    "file_exists": true,
                    "file_name": "modules/auth_aaa/authaaa_mod.c",
                    "file_size": 7197
                },
                {
                    "file_additions": 2,
                    "file_deletions": 4,
                    "file_exists": true,
                    "file_name": "modules/auth_db/authdb_mod.c",
                    "file_size": 8774
                },
                {
                    "file_additions": 3,
                    "file_deletions": 2,
                    "file_exists": true,
                    "file_name": "modules/avpops/avpops.c",
                    "file_size": 36889
                },
                {
                    "file_additions": 6,
                    "file_deletions": 0,
                    "file_exists": true,
                    "file_name": "modules/avpops/avpops_db.c",
                    "file_size": 13731
                },
                {
                    "file_additions": 15,
                    "file_deletions": 4,
                    "file_exists": true,
                    "file_name": "modules/b2b_entities/b2b_entities.c",
                    "file_size": 29891
                },
                {
                    "file_additions": 13,
                    "file_deletions": 2,
                    "file_exists": true,
                    "file_name": "modules/b2b_entities/b2be_db.c",
                    "file_size": 27857
                },
                {
                    "file_additions": 7,
                    "file_deletions": 16,
                    "file_exists": true,
                    "file_name": "modules/b2b_entities/dlg.c",
                    "file_size": 99932
                },
                {
                    "file_additions": 14,
                    "file_deletions": 5,
                    "file_exists": true,
                    "file_name": "modules/b2b_logic/b2b_logic.c",
                    "file_size": 59875
                },
                {
                    "file_additions": 1,
                    "file_deletions": 1,
                    "file_exists": true,
                    "file_name": "modules/b2b_logic/logic.c",
                    "file_size": 99046
                },
                {
                    "file_additions": 3,
                    "file_deletions": 4,
                    "file_exists": true,
                    "file_name": "modules/b2b_sca/b2b_sca.c",
                    "file_size": 18820
                },
                {
                    "file_additions": 3,
                    "file_deletions": 1,
                    "file_exists": true,
                    "file_name": "modules/benchmark/benchmark.c",
                    "file_size": 15540
                },
                {
                    "file_additions": 3,
                    "file_deletions": 0,
                    "file_exists": true,
                    "file_name": "modules/cachedb_cassandra/cachedb_cassandra.c",
                    "file_size": 5660
                },
                {
                    "file_additions": 95,
                    "file_deletions": 29,
                    "file_exists": true,
                    "file_name": "modules/cachedb_cassandra/cachedb_cassandra_dbase.c",
                    "file_size": 40392
                },
                {
                    "file_additions": 3,
                    "file_deletions": 5,
                    "file_exists": true,
                    "file_name": "modules/cachedb_couchbase/cachedb_couchbase.c",
                    "file_size": 4263
                },
                {
                    "file_additions": 67,
                    "file_deletions": 111,
                    "file_exists": true,
                    "file_name": "modules/cachedb_local/cachedb_local.c",
                    "file_size": 20891
                },
                {
                    "file_additions": 2,
                    "file_deletions": 4,
                    "file_exists": true,
                    "file_name": "modules/cachedb_memcached/cachedb_memcached.c",
                    "file_size": 13232
                },
                {
                    "file_additions": 6,
                    "file_deletions": 4,
                    "file_exists": true,
                    "file_name": "modules/cachedb_mongodb/cachedb_mongodb.c",
                    "file_size": 4875
                },
                {
                    "file_additions": 63,
                    "file_deletions": 26,
                    "file_exists": true,
                    "file_name": "modules/cachedb_mongodb/cachedb_mongodb_dbase.c",
                    "file_size": 57608
                },
                {
                    "file_additions": 14,
                    "file_deletions": 1,
                    "file_exists": true,
                    "file_name": "modules/cachedb_mongodb/cachedb_mongodb_json.c",
                    "file_size": 8506
                },
                {
                    "file_additions": 79,
                    "file_deletions": 0,
                    "file_exists": true,
                    "file_name": "modules/cachedb_mongodb/ssl_tweaks.c",
                    "file_size": 2251
                },
                {
                    "file_additions": 2,
                    "file_deletions": 4,
                    "file_exists": true,
                    "file_name": "modules/cachedb_redis/cachedb_redis.c",
                    "file_size": 5537
                },
                {
                    "file_additions": 27,
                    "file_deletions": 9,
                    "file_exists": true,
                    "file_name": "modules/cachedb_redis/cachedb_redis_dbase.c",
                    "file_size": 31617
                },
                {
                    "file_additions": 2,
                    "file_deletions": 0,
                    "file_exists": true,
                    "file_name": "modules/cachedb_sql/cachedb_sql.c",
                    "file_size": 15156
                },
                {
                    "file_additions": 3,
                    "file_deletions": 1,
                    "file_exists": true,
                    "file_name": "modules/call_center/call_center.c",
                    "file_size": 61938
                },
                {
                    "file_additions": 2,
                    "file_deletions": 0,
                    "file_exists": true,
                    "file_name": "modules/call_control/call_control.c",
                    "file_size": 34304
                },
                {
                    "file_additions": 2,
                    "file_deletions": 0,
                    "file_exists": true,
                    "file_name": "modules/carrierroute/carrierroute.c",
                    "file_size": 14073
                },
                {
                    "file_additions": 25,
                    "file_deletions": 10,
                    "file_exists": true,
                    "file_name": "modules/cfgutils/cfgutils.c",
                    "file_size": 22954
                },
                {
                    "file_additions": 9,
                    "file_deletions": 3,
                    "file_exists": true,
                    "file_name": "modules/cgrates/cgrates.c",
                    "file_size": 17648
                },
                {
                    "file_additions": 16,
                    "file_deletions": 3,
                    "file_exists": true,
                    "file_name": "modules/cgrates/cgrates_common.c",
                    "file_size": 26955
                },
                {
                    "file_additions": 186,
                    "file_deletions": 187,
                    "file_exists": true,
                    "file_name": "modules/clusterer/clusterer.c",
                    "file_size": 50151
                },
                {
                    "file_additions": 35,
                    "file_deletions": 19,
                    "file_exists": true,
                    "file_name": "modules/clusterer/clusterer_mod.c",
                    "file_size": 39679
                },
                {
                    "file_additions": 64,
                    "file_deletions": 53,
                    "file_exists": true,
                    "file_name": "modules/clusterer/node_info.c",
                    "file_size": 27027
                },
                {
                    "file_additions": 100,
                    "file_deletions": 46,
                    "file_exists": true,
                    "file_name": "modules/clusterer/sync.c",
                    "file_size": 18653
                },
                {
                    "file_additions": 4,
                    "file_deletions": 2,
                    "file_exists": true,
                    "file_name": "modules/compression/compression.c",
                    "file_size": 49079
                },
                {
                    "file_additions": 0,
                    "file_deletions": 5,
                    "file_exists": true,
                    "file_name": "modules/compression/gz_helpers.c",
                    "file_size": 4531
                },
                {
                    "file_additions": 10,
                    "file_deletions": 4,
                    "file_exists": true,
                    "file_name": "modules/cpl_c/cpl.c",
                    "file_size": 25460
                }
            ],
            "interesting": {
                "reopen": false,
                "status": false
            },
            "is_parent": false,
            "sha": "639edf25ebc9d6c1de44433cef09c5b18a1fda45"
        }
    ],
    "first_commit": "2020-06-17 09:16:18+00:00",
    "last_commit": "2021-11-16 19:33:27+00:00",
    "number": 2115,
    "pull_request": "None",
    "score": {
        "accidental_reopen_likely": false,
        "all_labels": [
            "bug",
            "fixed"
        ],
        "contains_keywords": [
            "confirm",
            "work",
            "fail",
            "chang",
            "fix",
            "issu",
            "CI",
            "patch",
            "perform",
            "debug",
            "reason",
            "test",
            "attempt",
            "fault",
            "leak",
            "remov",
            "warn",
            "bug",
            "error",
            "problem",
            "crash",
            "report"
        ],
        "fix_size": 10736,
        "has_labels": [
            "bug"
        ],
        "intersecting": {
            "computed_score": 0.0010254497995711754,
            "final_commit_size": 10727,
            "intersection_size": 11,
            "previous_commits_size": 20
        },
        "is_makefile_based": true,
        "no_new_files": [
            "action.c",
            "async.c",
            "bin_interface.c",
            "cachedb/cachedb.c",
            "cachedb/cachedb_dict.c",
            "core_stats.c",
            "db/db.c",
            "db/db_id.c",
            "db/db_query.c",
            "db/db_ut.c",
            "lib/cJSON.c",
            "lib/csv.c",
            "lib/dbg/struct_hist.c",
            "lib/path.c",
            "lib/reg/path.c",
            "lib/url.c",
            "mem/hp_malloc.c",
            "mem/hp_malloc_stats.c",
            "menuconfig/commands.c",
            "mi/mi_trace.c",
            "modules/aaa_radius/aaa_radius.c",
            "modules/acc/acc.c",
            "modules/acc/acc_extra.c",
            "modules/acc/acc_logic.c",
            "modules/acc/acc_mod.c",
            "modules/acc/acc_vars.c",
            "modules/alias_db/alias_db.c",
            "modules/auth/auth_mod.c",
            "modules/auth_aaa/authaaa_mod.c",
            "modules/auth_db/authdb_mod.c",
            "modules/avpops/avpops.c",
            "modules/avpops/avpops_db.c",
            "modules/b2b_entities/b2b_entities.c",
            "modules/b2b_entities/b2be_db.c",
            "modules/b2b_entities/dlg.c",
            "modules/b2b_logic/b2b_logic.c",
            "modules/b2b_logic/logic.c",
            "modules/b2b_sca/b2b_sca.c",
            "modules/benchmark/benchmark.c",
            "modules/cachedb_cassandra/cachedb_cassandra.c",
            "modules/cachedb_cassandra/cachedb_cassandra_dbase.c",
            "modules/cachedb_couchbase/cachedb_couchbase.c",
            "modules/cachedb_local/cachedb_local.c",
            "modules/cachedb_memcached/cachedb_memcached.c",
            "modules/cachedb_mongodb/cachedb_mongodb.c",
            "modules/cachedb_mongodb/cachedb_mongodb_dbase.c",
            "modules/cachedb_mongodb/cachedb_mongodb_json.c",
            "modules/cachedb_redis/cachedb_redis.c",
            "modules/cachedb_redis/cachedb_redis_dbase.c",
            "modules/cachedb_sql/cachedb_sql.c",
            "modules/call_center/call_center.c",
            "modules/call_control/call_control.c",
            "modules/carrierroute/carrierroute.c",
            "modules/cfgutils/cfgutils.c",
            "modules/cgrates/cgrates.c",
            "modules/cgrates/cgrates_common.c",
            "modules/clusterer/clusterer.c",
            "modules/clusterer/clusterer_mod.c",
            "modules/clusterer/node_info.c",
            "modules/clusterer/sync.c",
            "modules/compression/compression.c",
            "modules/compression/gz_helpers.c",
            "modules/cpl_c/cpl.c",
            "modules/db_berkeley/bdb_res.c",
            "modules/db_berkeley/db_berkeley.c",
            "modules/db_cachedb/db_cachedb.c",
            "modules/db_flatstore/flatstore_mod.c",
            "modules/db_http/db_http.c",
            "modules/db_mysql/db_mysql.c",
            "modules/db_mysql/dbase.c",
            "modules/db_mysql/res.c",
            "modules/db_oracle/db_oracle.c",
            "modules/db_oracle/res.c",
            "modules/db_oracle/val.c",
            "modules/db_perlvdb/perlvdb.c",
            "modules/db_perlvdb/perlvdbfunc.c",
            "modules/db_postgres/db_postgres.c",
            "modules/db_sqlite/db_sqlite.c",
            "modules/db_sqlite/dbase.c",
            "modules/db_text/dbt_base.c",
            "modules/db_text/dbt_file.c",
            "modules/db_text/dbt_lib.c",
            "modules/db_text/dbt_res.c",
            "modules/db_text/dbt_tb.c",
            "modules/db_text/dbtext.c",
            "modules/db_unixodbc/db_unixodbc.c",
            "modules/db_virtual/db_virtual.c",
            "modules/db_virtual/dbase.c",
            "modules/dialog/dialog.c",
            "modules/dialog/dlg_db_handler.c",
            "modules/dialog/dlg_handlers.c",
            "modules/dialog/dlg_hash.c",
            "modules/dialog/dlg_profile.c",
            "modules/dialog/dlg_replication.c",
            "modules/dialog/dlg_req_within.c",
            "modules/dialog/dlg_timer.c",
            "modules/dialplan/dialplan.c",
            "modules/dialplan/dp_db.c",
            "modules/dispatcher/dispatch.c",
            "modules/dispatcher/dispatcher.c",
            "modules/diversion/diversion.c",
            "modules/dns_cache/dns_cache.c",
            "modules/domain/domain_mod.c",
            "modules/domainpolicy/domainpolicy_mod.c",
            "modules/drouting/dr_api_internal.c",
            "modules/drouting/drouting.c",
            "modules/drouting/routing.c",
            "modules/emergency/emergency_methods.c",
            "modules/emergency/post_curl.c",
            "modules/emergency/sip_emergency.c",
            "modules/enum/enum_mod.c",
            "modules/event_datagram/event_datagram.c",
            "modules/event_flatstore/event_flatstore.c",
            "modules/event_jsonrpc/event_jsonrpc.c",
            "modules/event_rabbitmq/event_rabbitmq.c",
            "modules/event_rabbitmq/rabbitmq_send.c",
            "modules/event_route/event_route.c",
            "modules/event_route/route_send.c",
            "modules/event_routing/ebr_data.c",
            "modules/event_routing/event_routing.c",
            "modules/event_virtual/event_virtual.c",
            "modules/event_xmlrpc/event_xmlrpc.c",
            "modules/exec/exec.c",
            "modules/exec/exec_mod.c",
            "modules/fraud_detection/fraud_detection.c",
            "modules/fraud_detection/frd_events.c",
            "modules/fraud_detection/frd_hashmap.c",
            "modules/fraud_detection/frd_load.c",
            "modules/fraud_detection/frd_stats.c",
            "modules/freeswitch/esl/src/esl.c",
            "modules/freeswitch/fs_mod.c",
            "modules/freeswitch_scripting/fss_db.c",
            "modules/freeswitch_scripting/fss_mod.c",
            "modules/gflags/gflags.c",
            "modules/group/group_mod.c",
            "modules/h350/h350_mod.c",
            "modules/httpd/httpd.c",
            "modules/identity/identity.c",
            "modules/imc/imc.c",
            "modules/jabber/jabber.c",
            "modules/jabber/xjab_wlist.c",
            "modules/jabber/xsnprintf.c",
            "modules/json/json.c",
            "modules/jsonrpc/jsonrpc.c",
            "modules/ldap/ldap_api_fn.c",
            "modules/ldap/ldap_connect.c",
            "modules/ldap/ldap_exp_fn.c",
            "modules/ldap/ldap_mod.c",
            "modules/load_balancer/lb_data.c",
            "modules/load_balancer/lb_parser.c",
            "modules/load_balancer/load_balancer.c",
            "modules/lua/siplua.c",
            "modules/lua/sipluafunc.c",
            "modules/lua/sipluami.c",
            "modules/lua/sipmysql.c",
            "modules/lua/sipstate.c",
            "modules/mangler/mangler.c",
            "modules/mathops/math_funcs.c",
            "modules/mathops/mathops.c",
            "modules/maxfwd/maxfwd.c",
            "modules/mediaproxy/mediaproxy.c",
            "modules/mi_datagram/datagram_fnc.c",
            "modules/mi_datagram/mi_datagram.c",
            "modules/mi_fifo/mi_fifo.c",
            "modules/mi_http/mi_http.c",
            "modules/mi_json/mi_json.c",
            "modules/mi_xmlrpc_ng/mi_xmlrpc_http.c",
            "modules/mid_registrar/mid_registrar.c",
            "modules/mid_registrar/save.c",
            "modules/mmgeoip/geoip2.c",
            "modules/mmgeoip/mmgeoip.c",
            "modules/msilo/msfuncs.c",
            "modules/msilo/msilo.c",
            "modules/nat_traversal/nat_traversal.c",
            "modules/nathelper/nathelper.c",
            "modules/options/mod_options.c",
            "modules/osp/cnam.c",
            "modules/osp/orig_transaction.c",
            "modules/osp/osp_mod.c",
            "modules/osp/term_transaction.c",
            "modules/osp/tm.c",
            "modules/osp/usage.c",
            "modules/path/path_mod.c",
            "modules/peering/peering.c",
            "modules/perl/perl.c",
            "modules/perl/perlfunc.c",
            "modules/permissions/address.c",
            "modules/permissions/hash.c",
            "modules/permissions/partitions.c",
            "modules/permissions/permissions.c",
            "modules/pi_http/http_fnc.c",
            "modules/pi_http/pi_http.c",
            "modules/pike/pike.c",
            "modules/presence/clustering.c",
            "modules/presence/hash.c",
            "modules/presence/presence.c",
            "modules/presence/sharing_tags.c",
            "modules/presence/subscribe.c",
            "modules/presence_callinfo/presence_callinfo.c",
            "modules/presence_dialoginfo/pidf.c",
            "modules/presence_dialoginfo/presence_dialoginfo.c",
            "modules/presence_mwi/presence_mwi.c",
            "modules/presence_xcapdiff/presence_xcapdiff.c",
            "modules/presence_xml/notify_body.c",
            "modules/presence_xml/pidf.c",
            "modules/presence_xml/presence_xml.c",
            "modules/proto_bin/proto_bin.c",
            "modules/proto_hep/hep.c",
            "modules/proto_hep/proto_hep.c",
            "modules/proto_sctp/proto_sctp.c",
            "modules/proto_tls/proto_tls.c",
            "modules/proto_ws/proto_ws.c",
            "modules/proto_wss/proto_wss.c",
            "modules/pua/pua.c",
            "modules/pua/send_publish.c",
            "modules/pua_bla/pua_bla.c",
            "modules/pua_dialoginfo/pua_dialoginfo.c",
            "modules/pua_mi/pua_mi.c",
            "modules/pua_usrloc/pua_usrloc.c",
            "modules/pua_usrloc/ul_publish.c",
            "modules/pua_xmpp/pua_xmpp.c",
            "modules/pua_xmpp/simple2xmpp.c",
            "modules/python/python_mod.c",
            "modules/qos/qos.c",
            "modules/qos/qos_ctx_helpers.c",
            "modules/rabbitmq/rabbitmq.c",
            "modules/ratelimit/ratelimit.c",
            "modules/ratelimit/ratelimit_helper.c",
            "modules/regex/regex_mod.c",
            "modules/registrar/lookup.c",
            "modules/registrar/reg_mod.c",
            "modules/registrar/save.c",
            "modules/rest_client/rest_methods.c",
            "modules/rls/notify.c",
            "modules/rls/rls.c",
            "modules/rls/subscribe.c",
            "modules/rr/record.c",
            "modules/rr/rr_mod.c",
            "modules/rtpengine/rtpengine.c",
            "modules/rtpproxy/rtpproxy.c",
            "modules/rtpproxy/timeout_process.c",
            "modules/script_helper/script_helper.c",
            "modules/seas/encode_contact.c",
            "modules/seas/seas.c",
            "modules/seas/seas_action.c",
            "modules/signaling/signaling.c",
            "modules/sip_i/sip_i.c",
            "modules/sipcapture/sipcapture.c",
            "modules/sipmsgops/list_hdr.c",
            "modules/sipmsgops/sipmsgops.c",
            "modules/siprec/siprec.c",
            "modules/siprec/siprec_body.c",
            "modules/siprec/siprec_logic.c",
            "modules/siprec/siprec_sess.c",
            "modules/siptrace/siptrace.c",
            "modules/sl/sl.c",
            "modules/sl/sl_funcs.c",
            "modules/sms/libsms_getsms.c",
            "modules/sms/libsms_modem.c",
            "modules/sms/libsms_putsms.c",
            "modules/sms/sms.c",
            "modules/sms/sms_funcs.c",
            "modules/sngtc/sngtc.c",
            "modules/speeddial/speeddial.c",
            "modules/sql_cacher/sql_cacher.c",
            "modules/sst/sst.c",
            "modules/statistics/statistics.c",
            "modules/stun/stun.c",
            "modules/textops/textops.c",
            "modules/tls_mgm/tls_domain.c",
            "modules/tls_mgm/tls_mgm.c",
            "modules/tls_mgm/tls_select.c",
            "modules/tm/async.c",
            "modules/tm/cluster.c",
            "modules/tm/dlg.c",
            "modules/tm/t_cancel.c",
            "modules/tm/t_funcs.c",
            "modules/tm/t_fwd.c",
            "modules/tm/t_msgbuilder.c",
            "modules/tm/t_reply.c",
            "modules/tm/timer.c",
            "modules/tm/tm.c",
            "modules/tm/uac.c",
            "modules/topology_hiding/topo_hiding_logic.c",
            "modules/topology_hiding/topology_hiding.c",
            "modules/uac/auth.c",
            "modules/uac/replace.c",
            "modules/uac/uac.c",
            "modules/uac_auth/uac_auth.c",
            "modules/uac_redirect/redirect.c",
            "modules/uac_registrant/registrant.c",
            "modules/uri/aaa_checks.c",
            "modules/uri/uri_mod.c",
            "modules/userblacklist/db.c",
            "modules/userblacklist/userblacklist.c",
            "modules/usrloc/dlist.c",
            "modules/usrloc/ucontact.c",
            "modules/usrloc/udomain.c",
            "modules/usrloc/ul_mod.c",
            "modules/usrloc/urecord.c",
            "modules/usrloc/ureplication.c",
            "modules/xcap/xcap_mod.c",
            "modules/xcap_client/xcap_client.c",
            "modules/xml/xml.c",
            "modules/xmpp/xmpp.c",
            "modules/xmpp/xsnprintf.c",
            "msg_translator.c",
            "net/net_tcp.c",
            "net/net_tcp_proc.c",
            "net/proto_tcp/proto_tcp.c",
            "net/proto_udp/proto_udp.c",
            "net/trans_trace.c",
            "parser/digest/digest_parser.c",
            "parser/msg_parser.c",
            "parser/parse_authenticate.c",
            "parser/parse_body.c",
            "parser/parse_content.c",
            "parser/parse_list_hdr.c",
            "parser/parse_rr.c",
            "parser/parse_to.c",
            "parser/sdp/sdp_helpr_funcs.c",
            "pt.c",
            "pt_load.c",
            "pvar.c",
            "receive.c",
            "resolve.c",
            "route.c",
            "socket_info.c",
            "sr_module.c",
            "sr_module_deps.c",
            "statistics.c",
            "test/unit_tests.c",
            "time_rec.c",
            "timer.c",
            "transformations.c",
            "ut.c",
            "utils/db_berkeley/bdb_recover.c",
            "xlog.c"
        ],
        "no_other_files": false,
        "num_prohibited_files": 523772,
        "prohibited_files": [
            "server/src/main/java/com/genymobile/scrcpy/Device.java",
            "server/src/main/java/com/genymobile/scrcpy/wrappers/SurfaceControl.java",
            "server/src/main/java/com/genymobile/scrcpy/Device.java",
            "server/src/main/java/com/genymobile/scrcpy/wrappers/SurfaceControl.java",
            "app/meson.build",
            "app/scrcpy.1",
            "app/src/common.h",
            "app/src/scrcpy.h",
            "app/src/server.h",
            "server/src/main/java/com/genymobile/scrcpy/Workarounds.java"
        ],
        "reopen": true,
        "reopen_events": [
            [
                "2020-06-17 14:14:09+00:00",
                "closed"
            ],
            [
                "2020-06-17 14:14:09+00:00",
                "commit"
            ],
            [
                "2020-06-17 14:15:45+00:00",
                "commit"
            ],
            [
                "2020-06-17 14:16:52+00:00",
                "commit"
            ],
            [
                "2020-06-17 14:17:44+00:00",
                "commit"
            ],
            [
                "2020-06-17 17:57:20+00:00",
                "reopened"
            ],
            [
                "2020-06-21 21:11:59+00:00",
                "commit"
            ],
            [
                "2020-06-21 21:12:47+00:00",
                "commit"
            ],
            [
                "2020-06-21 21:12:57+00:00",
                "commit"
            ],
            [
                "2020-06-21 21:13:07+00:00",
                "commit"
            ],
            [
                "2020-06-22 09:03:11+00:00",
                "closed"
            ],
            [
                "2021-11-16 19:33:29+00:00",
                "commit"
            ]
        ],
        "status": false,
        "strategy": true,
        "total_changes": 3963
    }
}