{
    "commits": [
        {
            "associated_pull_request": [],
            "date": "2022-09-05 05:25:12+00:00",
            "diff": "",
            "diff_additions": 0,
            "diff_deletions": 0,
            "diff_file_size": 0,
            "diff_url": "https://github.com/rusefi/rusefi/commit/aec5c60f1587fdeb034323f5472e44e105028944.diff",
            "exists": true,
            "files": [],
            "interesting": {
                "reopen": false,
                "status": false
            },
            "is_parent": true,
            "sha": "aec5c60f1587fdeb034323f5472e44e105028944"
        },
        {
            "associated_pull_request": [],
            "date": "2022-09-05 05:31:03+00:00",
            "diff": "rusefi_rusefi/issue_4536/commit_7139c21e7a2ec040806adffea1efde2d41c72f04.diff",
            "diff_additions": 1,
            "diff_deletions": 1,
            "diff_file_size": 6739,
            "diff_url": "https://github.com/rusefi/rusefi/commit/7139c21e7a2ec040806adffea1efde2d41c72f04.diff",
            "exists": true,
            "files": [
                {
                    "file_additions": 1,
                    "file_deletions": 1,
                    "file_exists": true,
                    "file_name": "firmware/controllers/engine_cycle/fuel_schedule.cpp",
                    "file_size": 6739
                }
            ],
            "interesting": {
                "reopen": true,
                "status": false
            },
            "is_parent": false,
            "sha": "7139c21e7a2ec040806adffea1efde2d41c72f04"
        },
        {
            "associated_pull_request": [
                "https://github.com/rusefi/rusefi/pull/4513"
            ],
            "date": "2022-09-05 10:12:05+00:00",
            "diff": "rusefi_rusefi/issue_4536/commit_0408c05ec80ee8b333653a56b297b40834e9a6af.diff",
            "diff_additions": 1,
            "diff_deletions": 1,
            "diff_file_size": 19315,
            "diff_url": "https://github.com/rusefi/rusefi/commit/0408c05ec80ee8b333653a56b297b40834e9a6af.diff",
            "exists": true,
            "files": [
                {
                    "file_additions": 1,
                    "file_deletions": 1,
                    "file_exists": true,
                    "file_name": "firmware/controllers/engine_cycle/spark_logic.cpp",
                    "file_size": 19315
                }
            ],
            "interesting": {
                "reopen": false,
                "status": false
            },
            "is_parent": false,
            "sha": "0408c05ec80ee8b333653a56b297b40834e9a6af"
        },
        {
            "associated_pull_request": [
                "https://github.com/rusefi/rusefi/pull/4513"
            ],
            "date": "2022-09-25 15:00:55+00:00",
            "diff": "rusefi_rusefi/issue_4536/commit_b089825a4ad6fc8e976e68e2ac24ea16fb6426cb.diff",
            "diff_additions": 63,
            "diff_deletions": 34,
            "diff_file_size": 68012,
            "diff_url": "https://github.com/rusefi/rusefi/commit/b089825a4ad6fc8e976e68e2ac24ea16fb6426cb.diff",
            "exists": true,
            "files": [
                {
                    "file_additions": 21,
                    "file_deletions": 19,
                    "file_exists": true,
                    "file_name": "firmware/controllers/engine_cycle/spark_logic.cpp",
                    "file_size": 19315
                },
                {
                    "file_additions": 38,
                    "file_deletions": 7,
                    "file_exists": true,
                    "file_name": "firmware/controllers/system/timer/trigger_scheduler.cpp",
                    "file_size": 4963
                },
                {
                    "file_additions": 4,
                    "file_deletions": 8,
                    "file_exists": true,
                    "file_name": "unit_tests/tests/trigger/test_trigger_decoder.cpp",
                    "file_size": 43734
                }
            ],
            "interesting": {
                "reopen": false,
                "status": false
            },
            "is_parent": false,
            "sha": "b089825a4ad6fc8e976e68e2ac24ea16fb6426cb"
        }
    ],
    "first_commit": "2022-09-05 05:25:12+00:00",
    "last_commit": "2022-09-25 15:00:55+00:00",
    "number": 4536,
    "pull_request": "None",
    "score": {
        "accidental_reopen_likely": true,
        "all_labels": [
            "bug"
        ],
        "contains_keywords": [
            "fix",
            "issu",
            "test"
        ],
        "fix_size": 88,
        "has_labels": [
            "bug"
        ],
        "intersecting": {
            "computed_score": 0.011764705882352941,
            "final_commit_size": 85,
            "intersection_size": 1,
            "previous_commits_size": 4
        },
        "is_makefile_based": false,
        "no_new_files": [
            "firmware/controllers/system/timer/trigger_scheduler.cpp",
            "unit_tests/tests/trigger/test_trigger_decoder.cpp"
        ],
        "no_other_files": false,
        "num_prohibited_files": 189707,
        "prohibited_files": [
            "server/src/main/java/com/genymobile/scrcpy/Device.java",
            "server/src/main/java/com/genymobile/scrcpy/wrappers/SurfaceControl.java",
            "server/src/main/java/com/genymobile/scrcpy/Device.java",
            "server/src/main/java/com/genymobile/scrcpy/wrappers/SurfaceControl.java",
            "app/meson.build",
            "app/scrcpy.1",
            "app/src/common.h",
            "app/src/scrcpy.h",
            "app/src/server.h",
            "server/src/main/java/com/genymobile/scrcpy/Workarounds.java"
        ],
        "reopen": true,
        "reopen_events": [
            [
                "2022-09-05 06:01:46+00:00",
                "closed"
            ],
            [
                "2022-09-05 06:01:46+00:00",
                "commit"
            ],
            [
                "2022-09-05 10:04:23+00:00",
                "reopened"
            ],
            [
                "2022-09-05 10:08:23+00:00",
                "closed"
            ],
            [
                "2022-09-05 10:12:10+00:00",
                "commit"
            ],
            [
                "2022-09-25 15:00:56+00:00",
                "commit"
            ]
        ],
        "status": false,
        "strategy": true,
        "total_changes": 101
    }
}