{
    "commits": [
        {
            "associated_pull_request": [
                "https://github.com/open-mpi/ompi/pull/11531"
            ],
            "date": "2023-04-20 20:00:08+00:00",
            "diff": "",
            "diff_additions": 0,
            "diff_deletions": 0,
            "diff_file_size": 0,
            "diff_url": "https://github.com/open-mpi/ompi/commit/da6d7150b16aebb81abe69d2f7dea79691adfc14.diff",
            "exists": true,
            "files": [],
            "interesting": {
                "reopen": false,
                "status": true
            },
            "is_parent": true,
            "sha": "da6d7150b16aebb81abe69d2f7dea79691adfc14"
        },
        {
            "associated_pull_request": [],
            "date": "2023-04-27 18:21:38+00:00",
            "diff": "open-mpi_ompi/issue_11627/commit_e398fc242ef8a30142d07a7c7639cbad026a3b9e.diff",
            "diff_additions": 20,
            "diff_deletions": 12,
            "diff_file_size": 57030,
            "diff_url": "https://github.com/open-mpi/ompi/commit/e398fc242ef8a30142d07a7c7639cbad026a3b9e.diff",
            "exists": true,
            "files": [
                {
                    "file_additions": 2,
                    "file_deletions": 10,
                    "file_exists": true,
                    "file_name": "opal/mca/btl/smcuda/btl_smcuda_accelerator.c",
                    "file_size": 9813
                },
                {
                    "file_additions": 18,
                    "file_deletions": 2,
                    "file_exists": true,
                    "file_name": "opal/mca/btl/smcuda/btl_smcuda_component.c",
                    "file_size": 47217
                }
            ],
            "interesting": {
                "reopen": false,
                "status": false
            },
            "is_parent": false,
            "sha": "e398fc242ef8a30142d07a7c7639cbad026a3b9e"
        },
        {
            "associated_pull_request": [],
            "date": "2023-04-27 18:21:38+00:00",
            "diff": "open-mpi_ompi/issue_11627/commit_c5681c73fb84fb816fe9fa1306786063d2cb1aca.diff",
            "diff_additions": 20,
            "diff_deletions": 12,
            "diff_file_size": 57030,
            "diff_url": "https://github.com/open-mpi/ompi/commit/c5681c73fb84fb816fe9fa1306786063d2cb1aca.diff",
            "exists": true,
            "files": [
                {
                    "file_additions": 2,
                    "file_deletions": 10,
                    "file_exists": true,
                    "file_name": "opal/mca/btl/smcuda/btl_smcuda_accelerator.c",
                    "file_size": 9813
                },
                {
                    "file_additions": 18,
                    "file_deletions": 2,
                    "file_exists": true,
                    "file_name": "opal/mca/btl/smcuda/btl_smcuda_component.c",
                    "file_size": 47217
                }
            ],
            "interesting": {
                "reopen": false,
                "status": true
            },
            "is_parent": false,
            "sha": "c5681c73fb84fb816fe9fa1306786063d2cb1aca"
        },
        {
            "associated_pull_request": [],
            "date": "2023-04-27 18:21:38+00:00",
            "diff": "open-mpi_ompi/issue_11627/commit_f843c6940d3903d5a3089aedd128b4cc22838b35.diff",
            "diff_additions": 20,
            "diff_deletions": 12,
            "diff_file_size": 57030,
            "diff_url": "https://github.com/open-mpi/ompi/commit/f843c6940d3903d5a3089aedd128b4cc22838b35.diff",
            "exists": true,
            "files": [
                {
                    "file_additions": 2,
                    "file_deletions": 10,
                    "file_exists": true,
                    "file_name": "opal/mca/btl/smcuda/btl_smcuda_accelerator.c",
                    "file_size": 9813
                },
                {
                    "file_additions": 18,
                    "file_deletions": 2,
                    "file_exists": true,
                    "file_name": "opal/mca/btl/smcuda/btl_smcuda_component.c",
                    "file_size": 47217
                }
            ],
            "interesting": {
                "reopen": false,
                "status": true
            },
            "is_parent": false,
            "sha": "f843c6940d3903d5a3089aedd128b4cc22838b35"
        },
        {
            "associated_pull_request": [
                "https://github.com/open-mpi/ompi/pull/11648"
            ],
            "date": "2023-04-27 18:21:38+00:00",
            "diff": "open-mpi_ompi/issue_11627/commit_bb3bad7c82437c92f087b5a1cb0a534faffe6b4d.diff",
            "diff_additions": 20,
            "diff_deletions": 12,
            "diff_file_size": 57030,
            "diff_url": "https://github.com/open-mpi/ompi/commit/bb3bad7c82437c92f087b5a1cb0a534faffe6b4d.diff",
            "exists": true,
            "files": [
                {
                    "file_additions": 2,
                    "file_deletions": 10,
                    "file_exists": true,
                    "file_name": "opal/mca/btl/smcuda/btl_smcuda_accelerator.c",
                    "file_size": 9813
                },
                {
                    "file_additions": 18,
                    "file_deletions": 2,
                    "file_exists": true,
                    "file_name": "opal/mca/btl/smcuda/btl_smcuda_component.c",
                    "file_size": 47217
                }
            ],
            "interesting": {
                "reopen": false,
                "status": false
            },
            "is_parent": false,
            "sha": "bb3bad7c82437c92f087b5a1cb0a534faffe6b4d"
        }
    ],
    "first_commit": "2023-04-20 20:00:08+00:00",
    "last_commit": "2023-05-09 15:23:27+00:00",
    "number": 11627,
    "pull_request": "None",
    "score": {
        "accidental_reopen_likely": false,
        "all_labels": [
            "Target: main",
            "Target: v5.0.x"
        ],
        "contains_keywords": [
            "fix",
            "patch",
            "fault"
        ],
        "fix_size": 33,
        "has_labels": [],
        "intersecting": {
            "computed_score": 1.0,
            "final_commit_size": 33,
            "intersection_size": 33,
            "previous_commits_size": 33
        },
        "is_makefile_based": true,
        "no_new_files": [],
        "no_other_files": false,
        "num_prohibited_files": 222150,
        "prohibited_files": [
            "server/src/main/java/com/genymobile/scrcpy/Device.java",
            "server/src/main/java/com/genymobile/scrcpy/wrappers/SurfaceControl.java",
            "server/src/main/java/com/genymobile/scrcpy/Device.java",
            "server/src/main/java/com/genymobile/scrcpy/wrappers/SurfaceControl.java",
            "app/meson.build",
            "app/scrcpy.1",
            "app/src/common.h",
            "app/src/scrcpy.h",
            "app/src/server.h",
            "server/src/main/java/com/genymobile/scrcpy/Workarounds.java"
        ],
        "reopen": false,
        "reopen_events": [
            [
                "2023-04-27 21:40:49+00:00",
                "commit"
            ],
            [
                "2023-04-29 13:41:51+00:00",
                "commit"
            ],
            [
                "2023-05-04 21:06:47+00:00",
                "commit"
            ],
            [
                "2023-05-04 22:10:30+00:00",
                "commit"
            ],
            [
                "2023-05-09 16:13:01+00:00",
                "commit"
            ],
            [
                "2023-05-15 19:06:02+00:00",
                "closed"
            ]
        ],
        "status": true,
        "strategy": true,
        "total_changes": 128
    }
}