{
    "commits": [
        {
            "associated_pull_request": [],
            "date": "2023-06-15 12:03:51+00:00",
            "diff": "",
            "diff_additions": 0,
            "diff_deletions": 0,
            "diff_file_size": 0,
            "diff_url": "https://github.com/php/php-src/commit/177b543764b3db0f17e30bcd8c1d5b7d5b4d668b.diff",
            "exists": true,
            "files": [],
            "interesting": {
                "reopen": false,
                "status": false
            },
            "is_parent": true,
            "sha": "177b543764b3db0f17e30bcd8c1d5b7d5b4d668b"
        },
        {
            "associated_pull_request": [],
            "date": "2023-06-19 18:09:29+00:00",
            "diff": "php_php-src/issue_11476/commit_07e837abcfdddfe46356653d76eb6a76d88e9edc.diff",
            "diff_additions": 3,
            "diff_deletions": 1,
            "diff_file_size": 203494,
            "diff_url": "https://github.com/php/php-src/commit/07e837abcfdddfe46356653d76eb6a76d88e9edc.diff",
            "exists": true,
            "files": [
                {
                    "file_additions": 3,
                    "file_deletions": 1,
                    "file_exists": true,
                    "file_name": "ext/mbstring/mbstring.c",
                    "file_size": 203494
                }
            ],
            "interesting": {
                "reopen": false,
                "status": false
            },
            "is_parent": false,
            "sha": "07e837abcfdddfe46356653d76eb6a76d88e9edc"
        },
        {
            "associated_pull_request": [],
            "date": "2023-06-19 19:50:30+00:00",
            "diff": "php_php-src/issue_11476/commit_443927e3e8a5473b5cea4921f55cddc74fd8d0ee.diff",
            "diff_additions": 4,
            "diff_deletions": 2,
            "diff_file_size": 203494,
            "diff_url": "https://github.com/php/php-src/commit/443927e3e8a5473b5cea4921f55cddc74fd8d0ee.diff",
            "exists": true,
            "files": [
                {
                    "file_additions": 4,
                    "file_deletions": 2,
                    "file_exists": true,
                    "file_name": "ext/mbstring/mbstring.c",
                    "file_size": 203494
                }
            ],
            "interesting": {
                "reopen": false,
                "status": false
            },
            "is_parent": false,
            "sha": "443927e3e8a5473b5cea4921f55cddc74fd8d0ee"
        }
    ],
    "first_commit": "2023-06-19 17:59:37+00:00",
    "last_commit": "2023-06-19 20:05:15+00:00",
    "number": 11476,
    "pull_request": "None",
    "score": {
        "accidental_reopen_likely": false,
        "all_labels": [
            "Bug",
            "Extension: mbstring",
            "Status: Verified"
        ],
        "contains_keywords": [
            "chang",
            "fix",
            "issu",
            "CI",
            "patch",
            "debug",
            "test",
            "bug",
            "crash",
            "report"
        ],
        "fix_size": 9,
        "has_labels": [],
        "intersecting": {
            "computed_score": 0.2,
            "final_commit_size": 5,
            "intersection_size": 1,
            "previous_commits_size": 5
        },
        "is_makefile_based": false,
        "no_new_files": [],
        "no_other_files": false,
        "num_prohibited_files": 1518,
        "prohibited_files": [
            "server/src/main/java/com/genymobile/scrcpy/Device.java",
            "server/src/main/java/com/genymobile/scrcpy/wrappers/SurfaceControl.java",
            "server/src/main/java/com/genymobile/scrcpy/Device.java",
            "server/src/main/java/com/genymobile/scrcpy/wrappers/SurfaceControl.java",
            "app/meson.build",
            "app/scrcpy.1",
            "app/src/common.h",
            "app/src/scrcpy.h",
            "app/src/server.h",
            "server/src/main/java/com/genymobile/scrcpy/Workarounds.java"
        ],
        "reopen": false,
        "reopen_events": [
            [
                "2023-06-19 18:10:24+00:00",
                "commit"
            ],
            [
                "2023-06-19 18:11:34+00:00",
                "commit"
            ],
            [
                "2023-06-19 18:12:00+00:00",
                "commit"
            ],
            [
                "2023-06-19 20:06:11+00:00",
                "closed"
            ],
            [
                "2023-06-19 20:06:11+00:00",
                "commit"
            ]
        ],
        "status": true,
        "strategy": true,
        "total_changes": 10
    }
}