{
    "covered_issues": [
        200,
        196,
        194,
        191,
        190,
        189,
        187,
        184,
        182,
        181,
        179,
        176,
        175,
        174,
        173,
        172,
        171,
        169,
        167,
        166,
        164,
        163,
        162,
        161,
        160,
        159,
        158,
        156,
        153,
        151,
        147,
        145,
        142,
        141,
        140,
        139,
        138,
        137,
        136,
        135,
        134,
        132,
        131,
        130,
        128,
        127,
        126,
        125,
        123,
        122,
        121,
        120,
        119,
        118,
        117,
        115,
        114,
        113,
        111,
        109,
        108,
        107,
        106,
        105,
        104,
        100,
        99,
        96,
        95,
        94,
        92,
        91,
        90,
        88,
        87,
        86,
        85,
        83,
        82,
        81,
        79,
        76,
        74,
        73,
        72,
        70,
        69,
        65,
        64,
        63,
        62,
        60,
        59,
        58,
        56,
        55,
        52,
        51,
        50,
        49,
        48,
        47,
        46,
        45,
        44,
        43,
        42,
        41,
        40,
        39,
        38,
        36,
        35,
        34,
        33,
        32,
        31,
        29,
        27,
        26,
        25,
        24,
        23,
        21,
        20,
        19,
        18,
        17,
        16,
        13,
        12,
        11,
        10,
        7,
        6,
        5,
        4,
        3,
        2,
        1
    ],
    "finished": true
}