{
    "category": [
        "build/refactor/preprocessing",
        "wrong API usage"
    ],
    "commits": [
        {
            "associated_pull_request": [
                "https://github.com/radareorg/radare2/pull/11338"
            ],
            "date": "2018-09-01 08:43:48",
            "diff": "radareorg_radare2/issue_10684/commit_f538120c04b9dedde7a2f616bd96cef39a2327ea.diff",
            "diff_additions": 4,
            "diff_deletions": 2,
            "diff_file_size": 2147,
            "diff_url": "https://github.com/radareorg/radare2/commit/f538120c04b9dedde7a2f616bd96cef39a2327ea.diff",
            "exists": true,
            "files": [
                {
                    "file_additions": 4,
                    "file_deletions": 2,
                    "file_exists": true,
                    "file_name": "binr/radare2/radare2.c",
                    "file_size": 2147
                }
            ],
            "interesting": {
                "reopen": false,
                "status": true
            },
            "is_parent": true,
            "sha": "f538120c04b9dedde7a2f616bd96cef39a2327ea"
        },
        {
            "associated_pull_request": [],
            "date": "2018-09-01 10:44:37",
            "diff": "radareorg_radare2/issue_10684/commit_8d256047db83a8a5cf51c481a2a7a01045ce7a58.diff",
            "diff_additions": 30,
            "diff_deletions": 22,
            "diff_file_size": 525966,
            "diff_url": "https://github.com/radareorg/radare2/commit/8d256047db83a8a5cf51c481a2a7a01045ce7a58.diff",
            "exists": true,
            "files": [
                {
                    "file_additions": 1,
                    "file_deletions": 1,
                    "file_exists": true,
                    "file_name": "libr/anal/var.c",
                    "file_size": 42844
                },
                {
                    "file_additions": 26,
                    "file_deletions": 21,
                    "file_exists": true,
                    "file_name": "libr/core/canal.c",
                    "file_size": 167227
                },
                {
                    "file_additions": 3,
                    "file_deletions": 0,
                    "file_exists": true,
                    "file_name": "libr/core/cmd_anal.c",
                    "file_size": 315895
                }
            ],
            "interesting": {
                "reopen": false,
                "status": true
            },
            "is_parent": false,
            "sha": "8d256047db83a8a5cf51c481a2a7a01045ce7a58"
        },
        {
            "associated_pull_request": [],
            "date": "2018-09-01 10:44:37",
            "diff": "radareorg_radare2/issue_10684/commit_fe4dcbc60b06d0e3104d7528e9ef2258e181df64.diff",
            "diff_additions": 28,
            "diff_deletions": 20,
            "diff_file_size": 525966,
            "diff_url": "https://github.com/radareorg/radare2/commit/fe4dcbc60b06d0e3104d7528e9ef2258e181df64.diff",
            "exists": true,
            "files": [
                {
                    "file_additions": 1,
                    "file_deletions": 1,
                    "file_exists": true,
                    "file_name": "libr/anal/var.c",
                    "file_size": 42844
                },
                {
                    "file_additions": 24,
                    "file_deletions": 19,
                    "file_exists": true,
                    "file_name": "libr/core/canal.c",
                    "file_size": 167227
                },
                {
                    "file_additions": 3,
                    "file_deletions": 0,
                    "file_exists": true,
                    "file_name": "libr/core/cmd_anal.c",
                    "file_size": 315895
                }
            ],
            "interesting": {
                "reopen": false,
                "status": true
            },
            "is_parent": false,
            "sha": "fe4dcbc60b06d0e3104d7528e9ef2258e181df64"
        },
        {
            "associated_pull_request": [
                "https://github.com/radareorg/radare2/pull/11343"
            ],
            "date": "2018-09-01 10:44:37",
            "diff": "radareorg_radare2/issue_10684/commit_724df7cac1b624c34c61f0f43afbf89b68159af8.diff",
            "diff_additions": 28,
            "diff_deletions": 20,
            "diff_file_size": 525966,
            "diff_url": "https://github.com/radareorg/radare2/commit/724df7cac1b624c34c61f0f43afbf89b68159af8.diff",
            "exists": true,
            "files": [
                {
                    "file_additions": 1,
                    "file_deletions": 1,
                    "file_exists": true,
                    "file_name": "libr/anal/var.c",
                    "file_size": 42844
                },
                {
                    "file_additions": 24,
                    "file_deletions": 19,
                    "file_exists": true,
                    "file_name": "libr/core/canal.c",
                    "file_size": 167227
                },
                {
                    "file_additions": 3,
                    "file_deletions": 0,
                    "file_exists": true,
                    "file_name": "libr/core/cmd_anal.c",
                    "file_size": 315895
                }
            ],
            "interesting": {
                "reopen": false,
                "status": false
            },
            "is_parent": false,
            "sha": "724df7cac1b624c34c61f0f43afbf89b68159af8"
        },
        {
            "associated_pull_request": [
                "https://github.com/radareorg/radare2/pull/11343"
            ],
            "date": "2018-09-02 13:54:45",
            "diff": "radareorg_radare2/issue_10684/commit_ce49c831b44cff68003d1b72d151a9258474d356.diff",
            "diff_additions": 28,
            "diff_deletions": 20,
            "diff_file_size": 525966,
            "diff_url": "https://github.com/radareorg/radare2/commit/ce49c831b44cff68003d1b72d151a9258474d356.diff",
            "exists": true,
            "files": [
                {
                    "file_additions": 1,
                    "file_deletions": 1,
                    "file_exists": true,
                    "file_name": "libr/anal/var.c",
                    "file_size": 42844
                },
                {
                    "file_additions": 24,
                    "file_deletions": 19,
                    "file_exists": true,
                    "file_name": "libr/core/canal.c",
                    "file_size": 167227
                },
                {
                    "file_additions": 3,
                    "file_deletions": 0,
                    "file_exists": true,
                    "file_name": "libr/core/cmd_anal.c",
                    "file_size": 315895
                }
            ],
            "interesting": {
                "reopen": false,
                "status": false
            },
            "is_parent": false,
            "sha": "ce49c831b44cff68003d1b72d151a9258474d356"
        }
    ],
    "first_commit": "2018-09-01 08:43:48",
    "last_commit": "2018-09-02 13:54:45",
    "number": 10684,
    "pull_request": "None",
    "score": {
        "accidental_reopen_likely": false,
        "all_labels": [
            "Hacktoberfest",
            "good first issue",
            "json"
        ],
        "contains_keywords": [
            "remov",
            "leak"
        ],
        "fix_size": 45,
        "has_labels": [],
        "intersecting": {
            "computed_score": 1.0,
            "final_commit_size": 45,
            "intersection_size": 45,
            "previous_commits_size": 45
        },
        "is_makefile_based": true,
        "no_new_files": [],
        "no_other_files": true,
        "num_prohibited_files": 76340,
        "prohibited_files": [
            "hal/inc/pinmap_hal.h",
            "Debug/marvin.bin",
            "Debug/marvin.elf",
            "Debug/marvin.hex",
            "Debug/marvin.bin",
            "Debug/marvin.elf",
            "Debug/marvin.hex",
            "inc/spark_utilities.h",
            "Debug/marvin.bin",
            "Debug/marvin.elf"
        ],
        "reopen": false,
        "reopen_events": [
            [
                "2018-09-01 10:45:14",
                "commit"
            ],
            [
                "2018-09-01 10:48:29",
                "commit"
            ],
            [
                "2018-09-02 12:02:29",
                "commit"
            ],
            [
                "2018-09-02 13:54:51",
                "closed"
            ],
            [
                "2018-09-02 13:54:51",
                "commit"
            ]
        ],
        "status": true,
        "strategy": true,
        "total_changes": 202
    }
}