{
    "commits": [
        {
            "diff": "spring-projects_spring-boot/issue_7226/commit_e15b3e463f312524495349673a16cb67cfaa2eae.diff",
            "diff_additions": 8,
            "diff_deletions": 13,
            "diff_file_size": 0,
            "files": [
                {
                    "file_additions": 2,
                    "file_deletions": 2,
                    "file_exists": false,
                    "file_name": "spring-boot-tools/spring-boot-configuration-processor/src/main/java/org/springframework/boot/configurationprocessor/fieldvalues/javac/ExpressionTree.java",
                    "file_size": 0
                },
                {
                    "file_additions": 2,
                    "file_deletions": 7,
                    "file_exists": false,
                    "file_name": "spring-boot-tools/spring-boot-configuration-processor/src/main/java/org/springframework/boot/configurationprocessor/fieldvalues/javac/ReflectionWrapper.java",
                    "file_size": 0
                },
                {
                    "file_additions": 2,
                    "file_deletions": 2,
                    "file_exists": false,
                    "file_name": "spring-boot-tools/spring-boot-configuration-processor/src/main/java/org/springframework/boot/configurationprocessor/fieldvalues/javac/Trees.java",
                    "file_size": 0
                },
                {
                    "file_additions": 2,
                    "file_deletions": 2,
                    "file_exists": false,
                    "file_name": "spring-boot-tools/spring-boot-configuration-processor/src/main/java/org/springframework/boot/configurationprocessor/fieldvalues/javac/VariableTree.java",
                    "file_size": 0
                }
            ],
            "interesting": {
                "reopened": false,
                "status": false
            },
            "sha": "e15b3e463f312524495349673a16cb67cfaa2eae"
        },
        {
            "diff": "spring-projects_spring-boot/issue_7226/commit_2c2b9be4be72b2dde931e910c95074a786fcfcf7.diff",
            "diff_additions": 13,
            "diff_deletions": 11,
            "diff_file_size": 0,
            "files": [
                {
                    "file_additions": 13,
                    "file_deletions": 11,
                    "file_exists": false,
                    "file_name": "spring-boot-autoconfigure/src/test/java/org/springframework/boot/autoconfigure/jackson/JacksonAutoConfigurationTests.java",
                    "file_size": 0
                }
            ],
            "interesting": {
                "reopened": false,
                "status": false
            },
            "sha": "2c2b9be4be72b2dde931e910c95074a786fcfcf7"
        },
        {
            "diff": "spring-projects_spring-boot/issue_7226/commit_6bf33774fe6d1bab138043ad0e16d3fa9dd9c444.diff",
            "diff_additions": 6,
            "diff_deletions": 2,
            "diff_file_size": 0,
            "files": [
                {
                    "file_additions": 6,
                    "file_deletions": 2,
                    "file_exists": false,
                    "file_name": "spring-boot-autoconfigure/src/test/java/org/springframework/boot/autoconfigure/condition/ConditionalOnJavaTests.java",
                    "file_size": 0
                }
            ],
            "interesting": {
                "reopened": false,
                "status": false
            },
            "sha": "6bf33774fe6d1bab138043ad0e16d3fa9dd9c444"
        },
        {
            "diff": "spring-projects_spring-boot/issue_7226/commit_46155ca5da1e517f94e668593e56e3a67009cfcf.diff",
            "diff_additions": 40,
            "diff_deletions": 10,
            "diff_file_size": 0,
            "files": [
                {
                    "file_additions": 40,
                    "file_deletions": 10,
                    "file_exists": false,
                    "file_name": "spring-boot-cli/src/it/java/org/springframework/boot/cli/JarCommandIT.java",
                    "file_size": 0
                }
            ],
            "interesting": {
                "reopened": false,
                "status": false
            },
            "sha": "46155ca5da1e517f94e668593e56e3a67009cfcf"
        }
    ],
    "first_commit": "2016-11-28 09:42:04",
    "last_commit": "2017-09-29 10:12:46",
    "number": 7226,
    "score": 304.0388349514563
}