{
    "category": [
        "memory",
        "build/refactor/preprocessing"
    ],
    "commits": [
        {
            "associated_pull_request": [],
            "date": "2020-06-18 11:44:54",
            "diff": "micropython_micropython/issue_6177/commit_3a9d948032e27f690e1fb09084c36bd47b1a75a0.diff",
            "diff_additions": 1,
            "diff_deletions": 1,
            "diff_file_size": 11272,
            "diff_url": "https://github.com/micropython/micropython/commit/3a9d948032e27f690e1fb09084c36bd47b1a75a0.diff",
            "exists": true,
            "files": [
                {
                    "file_additions": 1,
                    "file_deletions": 1,
                    "file_exists": true,
                    "file_name": "ports/esp32/esp32_rmt.c",
                    "file_size": 11272
                }
            ],
            "interesting": {
                "reopen": false,
                "status": false
            },
            "is_parent": true,
            "sha": "3a9d948032e27f690e1fb09084c36bd47b1a75a0"
        },
        {
            "associated_pull_request": [],
            "date": "2020-06-21 14:07:53",
            "diff": "micropython_micropython/issue_6177/commit_477a9d46d0bbb182a1ce7206aba75c4b6922b120.diff",
            "diff_additions": 85,
            "diff_deletions": 25,
            "diff_file_size": 126522,
            "diff_url": "https://github.com/micropython/micropython/commit/477a9d46d0bbb182a1ce7206aba75c4b6922b120.diff",
            "exists": true,
            "files": [
                {
                    "file_additions": 85,
                    "file_deletions": 25,
                    "file_exists": true,
                    "file_name": "py/emitnative.c",
                    "file_size": 126522
                }
            ],
            "interesting": {
                "reopen": false,
                "status": true
            },
            "is_parent": false,
            "sha": "477a9d46d0bbb182a1ce7206aba75c4b6922b120"
        },
        {
            "associated_pull_request": [],
            "date": "2020-06-21 14:07:53",
            "diff": "micropython_micropython/issue_6177/commit_5f2f0b1db24aa93c49c7c53f823b4724689e455a.diff",
            "diff_additions": 87,
            "diff_deletions": 27,
            "diff_file_size": 126522,
            "diff_url": "https://github.com/micropython/micropython/commit/5f2f0b1db24aa93c49c7c53f823b4724689e455a.diff",
            "exists": true,
            "files": [
                {
                    "file_additions": 87,
                    "file_deletions": 27,
                    "file_exists": true,
                    "file_name": "py/emitnative.c",
                    "file_size": 126522
                }
            ],
            "interesting": {
                "reopen": false,
                "status": false
            },
            "is_parent": false,
            "sha": "5f2f0b1db24aa93c49c7c53f823b4724689e455a"
        },
        {
            "associated_pull_request": [],
            "date": "2020-06-26 08:26:39",
            "diff": "micropython_micropython/issue_6177/commit_1d895bd590a6ea2d6209bf8b814343f200f11de1.diff",
            "diff_additions": 86,
            "diff_deletions": 27,
            "diff_file_size": 126522,
            "diff_url": "https://github.com/micropython/micropython/commit/1d895bd590a6ea2d6209bf8b814343f200f11de1.diff",
            "exists": true,
            "files": [
                {
                    "file_additions": 86,
                    "file_deletions": 27,
                    "file_exists": true,
                    "file_name": "py/emitnative.c",
                    "file_size": 126522
                }
            ],
            "interesting": {
                "reopen": false,
                "status": false
            },
            "is_parent": false,
            "sha": "1d895bd590a6ea2d6209bf8b814343f200f11de1"
        },
        {
            "associated_pull_request": [
                "https://github.com/micropython/micropython/pull/6178"
            ],
            "date": "2020-06-26 08:26:39",
            "diff": "micropython_micropython/issue_6177/commit_41fa8b5482089bdd7fa5478fe24f32913b23967c.diff",
            "diff_additions": 86,
            "diff_deletions": 27,
            "diff_file_size": 126522,
            "diff_url": "https://github.com/micropython/micropython/commit/41fa8b5482089bdd7fa5478fe24f32913b23967c.diff",
            "exists": true,
            "files": [
                {
                    "file_additions": 86,
                    "file_deletions": 27,
                    "file_exists": true,
                    "file_name": "py/emitnative.c",
                    "file_size": 126522
                }
            ],
            "interesting": {
                "reopen": false,
                "status": false
            },
            "is_parent": false,
            "sha": "41fa8b5482089bdd7fa5478fe24f32913b23967c"
        }
    ],
    "first_commit": "2020-06-19 12:11:14",
    "last_commit": "2020-06-26 14:24:04",
    "number": 6177,
    "pull_request": "None",
    "score": {
        "accidental_reopen_likely": false,
        "all_labels": [
            "py-core"
        ],
        "contains_keywords": [
            "work",
            "fix",
            "bug",
            "issu",
            "workaround"
        ],
        "fix_size": 112,
        "has_labels": [],
        "intersecting": {
            "computed_score": 1.0,
            "final_commit_size": 100,
            "intersection_size": 100,
            "previous_commits_size": 112
        },
        "is_makefile_based": false,
        "no_new_files": [],
        "no_other_files": false,
        "num_prohibited_files": 86375,
        "prohibited_files": [
            "kill.h",
            "meminfo.h",
            "kill.h",
            "meminfo.h",
            "kill.h",
            "meminfo.h",
            "testsuite_cli_test.go",
            "testsuite_cli_test.go",
            "common.mk",
            "i3bar/include/draw_util.h"
        ],
        "reopen": false,
        "reopen_events": [
            [
                "2020-06-21 14:09:31",
                "commit"
            ],
            [
                "2020-06-25 03:10:54",
                "commit"
            ],
            [
                "2020-06-26 08:27:34",
                "commit"
            ],
            [
                "2020-06-26 14:25:20",
                "commit"
            ],
            [
                "2020-06-26 14:53:03",
                "closed"
            ]
        ],
        "status": true,
        "strategy": true,
        "total_changes": 452
    }
}