{
    "all_issues": 53,
    "interesting_issues": 1,
    "last_update": "2023-11-09 16:12:39.118871",
    "license": {
        "download": "https://raw.githubusercontent.com/Feh/nocache/master/COPYING",
        "name": "BSD 2-Clause \"Simplified\" License"
    },
    "ratio": 0.018867924528301886,
    "size": 125,
    "stars": 520,
    "url": "https://github.com/Feh/nocache"
}