{
    "category": [
        "hardware/OS",
        "control flow"
    ],
    "commits": [
        {
            "associated_pull_request": [
                "https://github.com/open-mpi/ompi/pull/8313"
            ],
            "date": "2021-01-11 19:29:16",
            "diff": "open-mpi_ompi/issue_8368/commit_8c89e3c6217b25c28ce307b6a72c7f72bc0d3bd6.diff",
            "diff_additions": 52,
            "diff_deletions": 37,
            "diff_file_size": 7874,
            "diff_url": "https://github.com/open-mpi/ompi/commit/8c89e3c6217b25c28ce307b6a72c7f72bc0d3bd6.diff",
            "exists": true,
            "files": [
                {
                    "file_additions": 52,
                    "file_deletions": 37,
                    "file_exists": true,
                    "file_name": "ompi/mca/hook/comm_method/hook_comm_method_component.c",
                    "file_size": 7874
                }
            ],
            "interesting": {
                "reopen": false,
                "status": false
            },
            "is_parent": true,
            "sha": "8c89e3c6217b25c28ce307b6a72c7f72bc0d3bd6"
        },
        {
            "associated_pull_request": [],
            "date": "2021-01-12 21:58:36",
            "diff": "open-mpi_ompi/issue_8368/commit_6d7062b5c5e64b2524bbbf53e5801d1f7db5264f.diff",
            "diff_additions": 37,
            "diff_deletions": 17,
            "diff_file_size": 9997,
            "diff_url": "https://github.com/open-mpi/ompi/commit/6d7062b5c5e64b2524bbbf53e5801d1f7db5264f.diff",
            "exists": true,
            "files": [
                {
                    "file_additions": 22,
                    "file_deletions": 12,
                    "file_exists": true,
                    "file_name": "ompi/mca/fbtl/posix/fbtl_posix_ipreadv.c",
                    "file_size": 4979
                },
                {
                    "file_additions": 15,
                    "file_deletions": 5,
                    "file_exists": true,
                    "file_name": "ompi/mca/fbtl/posix/fbtl_posix_ipwritev.c",
                    "file_size": 5018
                }
            ],
            "interesting": {
                "reopen": false,
                "status": true
            },
            "is_parent": false,
            "sha": "6d7062b5c5e64b2524bbbf53e5801d1f7db5264f"
        },
        {
            "associated_pull_request": [
                "https://github.com/open-mpi/ompi/pull/8369"
            ],
            "date": "2021-01-12 21:58:36",
            "diff": "open-mpi_ompi/issue_8368/commit_0c4f4e275d7f1ec9086eb6e80fed7bee3c1940a9.diff",
            "diff_additions": 37,
            "diff_deletions": 17,
            "diff_file_size": 9997,
            "diff_url": "https://github.com/open-mpi/ompi/commit/0c4f4e275d7f1ec9086eb6e80fed7bee3c1940a9.diff",
            "exists": true,
            "files": [
                {
                    "file_additions": 22,
                    "file_deletions": 12,
                    "file_exists": true,
                    "file_name": "ompi/mca/fbtl/posix/fbtl_posix_ipreadv.c",
                    "file_size": 4979
                },
                {
                    "file_additions": 15,
                    "file_deletions": 5,
                    "file_exists": true,
                    "file_name": "ompi/mca/fbtl/posix/fbtl_posix_ipwritev.c",
                    "file_size": 5018
                }
            ],
            "interesting": {
                "reopen": false,
                "status": false
            },
            "is_parent": false,
            "sha": "0c4f4e275d7f1ec9086eb6e80fed7bee3c1940a9"
        },
        {
            "associated_pull_request": [
                "https://github.com/open-mpi/ompi/pull/8374"
            ],
            "date": "2021-01-12 21:58:36",
            "diff": "open-mpi_ompi/issue_8368/commit_b54da15ce305e136185a99a226f1491015b7f883.diff",
            "diff_additions": 37,
            "diff_deletions": 17,
            "diff_file_size": 9997,
            "diff_url": "https://github.com/open-mpi/ompi/commit/b54da15ce305e136185a99a226f1491015b7f883.diff",
            "exists": true,
            "files": [
                {
                    "file_additions": 22,
                    "file_deletions": 12,
                    "file_exists": true,
                    "file_name": "ompi/mca/fbtl/posix/fbtl_posix_ipreadv.c",
                    "file_size": 4979
                },
                {
                    "file_additions": 15,
                    "file_deletions": 5,
                    "file_exists": true,
                    "file_name": "ompi/mca/fbtl/posix/fbtl_posix_ipwritev.c",
                    "file_size": 5018
                }
            ],
            "interesting": {
                "reopen": false,
                "status": false
            },
            "is_parent": false,
            "sha": "b54da15ce305e136185a99a226f1491015b7f883"
        },
        {
            "associated_pull_request": [
                "https://github.com/open-mpi/ompi/pull/8375"
            ],
            "date": "2021-01-12 21:58:36",
            "diff": "open-mpi_ompi/issue_8368/commit_6ccca8657c2ad3fe9265886f9db922c229a706b9.diff",
            "diff_additions": 37,
            "diff_deletions": 17,
            "diff_file_size": 9997,
            "diff_url": "https://github.com/open-mpi/ompi/commit/6ccca8657c2ad3fe9265886f9db922c229a706b9.diff",
            "exists": true,
            "files": [
                {
                    "file_additions": 22,
                    "file_deletions": 12,
                    "file_exists": true,
                    "file_name": "ompi/mca/fbtl/posix/fbtl_posix_ipreadv.c",
                    "file_size": 4979
                },
                {
                    "file_additions": 15,
                    "file_deletions": 5,
                    "file_exists": true,
                    "file_name": "ompi/mca/fbtl/posix/fbtl_posix_ipwritev.c",
                    "file_size": 5018
                }
            ],
            "interesting": {
                "reopen": false,
                "status": false
            },
            "is_parent": false,
            "sha": "6ccca8657c2ad3fe9265886f9db922c229a706b9"
        }
    ],
    "first_commit": "2021-01-11 19:29:16",
    "last_commit": "2021-01-13 15:59:52",
    "number": 8368,
    "pull_request": "None",
    "score": {
        "accidental_reopen_likely": false,
        "all_labels": [
            "Target: master",
            "Target: v4.0.x",
            "Target: v4.1.x",
            "bug"
        ],
        "contains_keywords": [
            "fix",
            "bug",
            "test",
            "issu",
            "error",
            "debug"
        ],
        "fix_size": 48,
        "has_labels": [
            "bug"
        ],
        "intersecting": {
            "computed_score": 1.0,
            "final_commit_size": 48,
            "intersection_size": 48,
            "previous_commits_size": 48
        },
        "is_makefile_based": true,
        "no_new_files": [],
        "no_other_files": true,
        "num_prohibited_files": 52565,
        "prohibited_files": [
            "kill.h",
            "meminfo.h",
            "kill.h",
            "meminfo.h",
            "kill.h",
            "meminfo.h",
            "testsuite_cli_test.go",
            "testsuite_cli_test.go",
            "common.mk",
            "i3bar/include/draw_util.h"
        ],
        "reopen": false,
        "reopen_events": [
            [
                "2021-01-12 22:01:14",
                "commit"
            ],
            [
                "2021-01-12 22:08:32",
                "commit"
            ],
            [
                "2021-01-13 15:59:38",
                "commit"
            ],
            [
                "2021-01-13 16:00:00",
                "commit"
            ],
            [
                "2021-01-20 15:01:16",
                "closed"
            ]
        ],
        "status": true,
        "strategy": true,
        "total_changes": 305
    }
}