{
    "covered_issues": [
        603,
        598,
        590,
        587,
        563,
        562,
        560,
        556,
        552,
        550,
        549,
        543,
        541,
        539,
        538,
        536,
        532,
        531,
        529,
        528,
        526,
        525,
        524,
        523,
        521,
        520,
        519,
        518,
        515,
        514,
        512,
        511,
        510,
        506,
        504,
        503,
        497,
        495,
        493,
        492,
        491,
        490,
        489,
        487,
        485,
        484,
        483,
        482,
        480,
        479,
        475,
        474,
        473,
        469,
        468,
        466,
        465,
        464,
        462,
        461,
        460,
        459,
        458,
        457,
        456,
        455,
        454,
        452,
        448,
        447,
        446,
        445,
        444,
        443,
        442,
        441,
        440,
        439,
        438,
        437,
        436,
        435,
        431,
        430,
        428,
        426,
        424,
        423,
        420,
        419,
        418,
        417,
        416,
        412,
        411,
        410,
        409,
        408,
        407,
        406,
        405,
        404,
        403,
        402,
        400,
        399,
        398,
        397,
        396,
        395,
        394,
        393,
        392,
        391,
        388,
        387,
        384,
        383,
        380,
        378,
        376,
        374,
        373,
        371,
        370,
        369,
        368,
        366,
        365,
        364,
        363,
        362,
        361,
        360,
        358,
        355,
        354,
        352,
        351,
        350,
        349,
        348,
        347,
        346,
        345,
        343,
        342,
        341,
        340,
        337,
        336,
        335,
        334,
        333,
        332,
        331,
        330,
        329,
        328,
        327,
        326,
        325,
        324,
        323,
        322,
        320,
        319,
        318,
        317,
        316,
        315,
        314,
        313,
        312,
        311,
        310,
        309,
        308,
        307,
        306,
        305,
        303,
        301,
        300,
        299,
        298,
        297,
        296,
        294,
        293,
        292,
        291,
        290,
        289,
        286,
        285,
        284,
        283,
        281,
        280,
        279,
        278,
        277,
        276,
        275,
        272,
        271,
        270,
        268,
        267,
        265,
        264,
        263,
        262,
        261,
        260,
        259,
        257,
        256,
        255,
        254,
        253,
        252,
        251,
        250,
        248,
        247,
        246,
        245,
        243,
        242,
        241,
        240,
        239,
        238,
        236,
        235,
        234,
        233,
        232,
        231,
        230,
        229,
        228,
        227,
        225,
        224,
        222,
        221,
        220,
        219,
        218,
        217,
        216,
        215,
        213,
        212,
        210,
        209,
        207,
        206,
        205,
        204,
        203,
        202,
        200,
        199,
        198,
        197,
        196,
        193,
        191,
        190,
        189,
        188,
        187,
        186,
        185,
        184,
        183,
        182,
        181,
        180,
        179,
        178,
        177,
        176,
        175,
        174,
        173,
        172,
        171,
        170,
        169,
        168,
        167,
        166,
        165,
        164,
        163,
        162,
        161,
        160,
        159,
        158,
        157,
        156,
        155,
        154,
        153,
        152,
        151,
        148,
        147,
        146,
        145,
        144,
        143,
        142,
        141,
        140,
        139,
        138,
        137,
        136,
        135,
        134,
        133,
        132,
        130,
        129,
        128,
        126,
        125,
        124,
        123,
        122,
        121,
        120,
        119,
        118,
        117,
        116,
        115,
        114,
        113,
        111,
        102,
        101,
        100,
        99,
        97,
        96,
        95,
        93,
        92,
        91,
        90,
        89,
        88,
        87,
        86,
        85,
        84,
        83,
        82,
        81,
        80,
        79,
        78,
        77,
        75,
        72,
        71,
        70,
        69,
        64,
        63,
        62,
        61,
        59,
        58,
        57,
        56,
        55,
        54,
        53,
        52,
        51,
        50,
        49,
        48,
        47,
        46,
        45,
        44,
        43,
        42,
        41,
        40,
        39,
        38,
        37,
        36,
        35,
        34,
        33,
        32,
        31,
        30,
        29,
        28,
        27,
        26,
        25,
        24,
        23,
        22,
        21,
        19,
        18,
        17,
        16,
        15,
        14,
        13,
        12,
        11,
        10,
        9,
        8,
        7,
        6,
        5,
        4,
        3,
        2,
        1
    ],
    "finished": true
}