{
    "commits": [
        {
            "diff": "spring-projects_spring-boot/issue_3309/commit_31336c2dce34044bca9781711a7dd60c36df7508.diff",
            "diff_additions": 29,
            "diff_deletions": 2,
            "diff_file_size": 0,
            "files": [
                {
                    "file_additions": 29,
                    "file_deletions": 2,
                    "file_exists": false,
                    "file_name": "spring-boot/src/main/java/org/springframework/boot/test/OutputCapture.java",
                    "file_size": 0
                }
            ],
            "interesting": {
                "reopened": false,
                "status": false
            },
            "sha": "31336c2dce34044bca9781711a7dd60c36df7508"
        },
        {
            "diff": "spring-projects_spring-boot/issue_3309/commit_c3d93f70b8a4556c29e8e166edcc87b9b9e77938.diff",
            "diff_additions": 42,
            "diff_deletions": 10,
            "diff_file_size": 0,
            "files": [
                {
                    "file_additions": 5,
                    "file_deletions": 4,
                    "file_exists": false,
                    "file_name": "spring-boot/src/main/java/org/springframework/boot/logging/LoggingApplicationListener.java",
                    "file_size": 0
                },
                {
                    "file_additions": 18,
                    "file_deletions": 0,
                    "file_exists": false,
                    "file_name": "spring-boot/src/main/java/org/springframework/boot/logging/logback/LogbackLoggingSystem.java",
                    "file_size": 0
                },
                {
                    "file_additions": 19,
                    "file_deletions": 6,
                    "file_exists": false,
                    "file_name": "spring-boot/src/test/java/org/springframework/boot/logging/LoggingApplicationListenerTests.java",
                    "file_size": 0
                }
            ],
            "interesting": {
                "reopened": true,
                "status": true
            },
            "sha": "c3d93f70b8a4556c29e8e166edcc87b9b9e77938"
        },
        {
            "diff": "spring-projects_spring-boot/issue_3309/commit_5eb9cd012c96639a9d202accb15817a2e9e22f4e.diff",
            "diff_additions": 13,
            "diff_deletions": 11,
            "diff_file_size": 0,
            "files": [
                {
                    "file_additions": 13,
                    "file_deletions": 11,
                    "file_exists": false,
                    "file_name": "spring-boot/src/main/java/org/springframework/boot/logging/logback/LogbackLoggingSystem.java",
                    "file_size": 0
                }
            ],
            "interesting": {
                "reopened": false,
                "status": false
            },
            "sha": "5eb9cd012c96639a9d202accb15817a2e9e22f4e"
        }
    ],
    "first_commit": "2015-06-25 15:58:58",
    "last_commit": "2015-06-25 19:37:56",
    "number": 3309,
    "score": 400.0373831775701
}