{
    "commits": [
        {
            "associated_pull_request": [],
            "date": "2014-04-08 18:53:39+00:00",
            "diff": "open62541_open62541/issue_37/commit_db994a5894cf81ff3bebfceffb0f2eafa6dc2107.diff",
            "diff_additions": 17,
            "diff_deletions": 1,
            "diff_file_size": 0,
            "diff_url": "https://github.com/open62541/open62541/commit/db994a5894cf81ff3bebfceffb0f2eafa6dc2107.diff",
            "exists": true,
            "files": [
                {
                    "file_additions": 0,
                    "file_deletions": 1,
                    "file_exists": false,
                    "file_name": "src/opcua_basictypes.c",
                    "file_size": 0
                },
                {
                    "file_additions": 17,
                    "file_deletions": 0,
                    "file_exists": false,
                    "file_name": "tests/check_builtin.c",
                    "file_size": 0
                }
            ],
            "interesting": {
                "reopen": false,
                "status": false
            },
            "is_parent": true,
            "sha": "db994a5894cf81ff3bebfceffb0f2eafa6dc2107"
        },
        {
            "associated_pull_request": [],
            "date": "2014-04-09 09:35:39+00:00",
            "diff": "open62541_open62541/issue_37/commit_96b497ed9e16fa6c1459ed7423f289351f387002.diff",
            "diff_additions": 663,
            "diff_deletions": 582,
            "diff_file_size": 0,
            "diff_url": "https://github.com/open62541/open62541/commit/96b497ed9e16fa6c1459ed7423f289351f387002.diff",
            "exists": true,
            "files": [
                {
                    "file_additions": 28,
                    "file_deletions": 4,
                    "file_exists": false,
                    "file_name": "examples/src/simpleTest.c",
                    "file_size": 0
                },
                {
                    "file_additions": 76,
                    "file_deletions": 76,
                    "file_exists": false,
                    "file_name": "src/UA_stackInternalTypes.c",
                    "file_size": 0
                },
                {
                    "file_additions": 379,
                    "file_deletions": 381,
                    "file_exists": false,
                    "file_name": "src/opcua_basictypes.c",
                    "file_size": 0
                },
                {
                    "file_additions": 19,
                    "file_deletions": 19,
                    "file_exists": false,
                    "file_name": "src/opcua_secureLayer.c",
                    "file_size": 0
                },
                {
                    "file_additions": 5,
                    "file_deletions": 5,
                    "file_exists": false,
                    "file_name": "src/opcua_transportLayer.c",
                    "file_size": 0
                },
                {
                    "file_additions": 110,
                    "file_deletions": 60,
                    "file_exists": false,
                    "file_name": "tests/check_builtin.c",
                    "file_size": 0
                },
                {
                    "file_additions": 18,
                    "file_deletions": 15,
                    "file_exists": false,
                    "file_name": "tests/check_decode.c",
                    "file_size": 0
                },
                {
                    "file_additions": 26,
                    "file_deletions": 21,
                    "file_exists": false,
                    "file_name": "tests/check_encode.c",
                    "file_size": 0
                },
                {
                    "file_additions": 2,
                    "file_deletions": 1,
                    "file_exists": false,
                    "file_name": "tests/check_stack.c",
                    "file_size": 0
                }
            ],
            "interesting": {
                "reopen": true,
                "status": false
            },
            "is_parent": false,
            "sha": "96b497ed9e16fa6c1459ed7423f289351f387002"
        },
        {
            "associated_pull_request": [],
            "date": "2014-04-17 10:26:09+00:00",
            "diff": "open62541_open62541/issue_37/commit_3b0f800c94afddeb799fbf6d04a94cf9772af673.diff",
            "diff_additions": 16,
            "diff_deletions": 15,
            "diff_file_size": 0,
            "diff_url": "https://github.com/open62541/open62541/commit/3b0f800c94afddeb799fbf6d04a94cf9772af673.diff",
            "exists": true,
            "files": [
                {
                    "file_additions": 15,
                    "file_deletions": 14,
                    "file_exists": false,
                    "file_name": "src/ua_basictypes.c",
                    "file_size": 0
                },
                {
                    "file_additions": 1,
                    "file_deletions": 1,
                    "file_exists": false,
                    "file_name": "tests/check_builtin.c",
                    "file_size": 0
                }
            ],
            "interesting": {
                "reopen": false,
                "status": false
            },
            "is_parent": false,
            "sha": "3b0f800c94afddeb799fbf6d04a94cf9772af673"
        }
    ],
    "first_commit": "2014-04-08 18:53:39+00:00",
    "last_commit": "2014-04-17 10:26:09+00:00",
    "number": 37,
    "pull_request": "None",
    "score": {
        "accidental_reopen_likely": false,
        "all_labels": [
            "Type: Enhancement"
        ],
        "contains_keywords": [
            "work",
            "chang",
            "fix",
            "issu",
            "debug",
            "test",
            "leak",
            "bug",
            "error",
            "crash"
        ],
        "fix_size": 994,
        "has_labels": [],
        "intersecting": {
            "computed_score": 0.043478260869565216,
            "final_commit_size": 23,
            "intersection_size": 1,
            "previous_commits_size": 972
        },
        "is_makefile_based": true,
        "no_new_files": [
            "src/ua_basictypes.c"
        ],
        "no_other_files": false,
        "num_prohibited_files": 127295,
        "prohibited_files": [
            "server/src/main/java/com/genymobile/scrcpy/Device.java",
            "server/src/main/java/com/genymobile/scrcpy/wrappers/SurfaceControl.java",
            "server/src/main/java/com/genymobile/scrcpy/Device.java",
            "server/src/main/java/com/genymobile/scrcpy/wrappers/SurfaceControl.java",
            "app/meson.build",
            "app/scrcpy.1",
            "app/src/common.h",
            "app/src/scrcpy.h",
            "app/src/server.h",
            "server/src/main/java/com/genymobile/scrcpy/Workarounds.java"
        ],
        "reopen": true,
        "reopen_events": [
            [
                "2014-04-09 09:44:34+00:00",
                "closed"
            ],
            [
                "2014-04-09 09:44:34+00:00",
                "commit"
            ],
            [
                "2014-04-10 05:34:46+00:00",
                "reopened"
            ],
            [
                "2014-04-17 10:33:53+00:00",
                "commit"
            ],
            [
                "2014-04-24 10:13:49+00:00",
                "closed"
            ]
        ],
        "status": false,
        "strategy": true,
        "total_changes": 1294
    }
}