{
    "covered_issues": [
        160,
        159,
        158,
        157,
        149,
        148,
        142,
        140,
        139,
        134,
        133,
        132,
        127,
        126,
        125,
        124,
        123,
        120,
        119,
        115,
        114,
        113,
        112,
        110,
        108,
        107,
        106,
        105,
        104,
        103,
        102,
        100,
        99,
        98,
        97,
        96,
        95,
        94,
        92,
        90,
        89,
        88,
        87,
        86,
        85,
        84,
        82,
        81,
        80,
        79,
        78,
        77,
        76,
        74,
        73,
        72,
        71,
        70,
        69,
        67,
        66,
        64,
        63,
        62,
        60,
        59,
        58,
        57,
        55,
        53,
        51,
        50,
        49,
        48,
        45,
        44,
        43,
        42,
        41,
        40,
        39,
        38,
        37,
        36,
        33,
        32,
        31,
        29,
        28,
        26,
        25,
        24,
        23,
        22,
        18,
        16,
        15,
        13,
        11,
        10,
        7,
        6,
        5,
        3,
        1
    ],
    "finished": true
}