{
    "commits": [
        {
            "associated_pull_request": [],
            "date": "2020-07-30 08:36:01+00:00",
            "diff": "kamailio_kamailio/issue_2414/commit_7116c04c61cf789a371568fb593c109e195a1574.diff",
            "diff_additions": 58,
            "diff_deletions": 0,
            "diff_file_size": 20511,
            "diff_url": "https://github.com/kamailio/kamailio/commit/7116c04c61cf789a371568fb593c109e195a1574.diff",
            "exists": true,
            "files": [
                {
                    "file_additions": 58,
                    "file_deletions": 0,
                    "file_exists": true,
                    "file_name": "src/modules/evapi/evapi_mod.c",
                    "file_size": 20511
                }
            ],
            "interesting": {
                "reopen": false,
                "status": false
            },
            "is_parent": true,
            "sha": "7116c04c61cf789a371568fb593c109e195a1574"
        },
        {
            "associated_pull_request": [
                "https://github.com/kamailio/kamailio/pull/2416"
            ],
            "date": "2020-07-30 10:19:45+00:00",
            "diff": "kamailio_kamailio/issue_2414/commit_91d9441a242da4746171bfa532fa2378328e8d73.diff",
            "diff_additions": 5,
            "diff_deletions": 8,
            "diff_file_size": 20615,
            "diff_url": "https://github.com/kamailio/kamailio/commit/91d9441a242da4746171bfa532fa2378328e8d73.diff",
            "exists": true,
            "files": [
                {
                    "file_additions": 5,
                    "file_deletions": 8,
                    "file_exists": true,
                    "file_name": "src/modules/pua/send_publish.c",
                    "file_size": 20615
                }
            ],
            "interesting": {
                "reopen": true,
                "status": false
            },
            "is_parent": false,
            "sha": "91d9441a242da4746171bfa532fa2378328e8d73"
        },
        {
            "associated_pull_request": [
                "https://github.com/kamailio/kamailio/pull/2420"
            ],
            "date": "2020-07-31 14:00:06+00:00",
            "diff": "kamailio_kamailio/issue_2414/commit_733f5f240b4cf0c6e951257dc344d9b2c885331f.diff",
            "diff_additions": 4,
            "diff_deletions": 16,
            "diff_file_size": 39062,
            "diff_url": "https://github.com/kamailio/kamailio/commit/733f5f240b4cf0c6e951257dc344d9b2c885331f.diff",
            "exists": true,
            "files": [
                {
                    "file_additions": 4,
                    "file_deletions": 16,
                    "file_exists": true,
                    "file_name": "src/modules/pua/pua_db.c",
                    "file_size": 39062
                }
            ],
            "interesting": {
                "reopen": false,
                "status": false
            },
            "is_parent": false,
            "sha": "733f5f240b4cf0c6e951257dc344d9b2c885331f"
        },
        {
            "associated_pull_request": [
                "https://github.com/kamailio/kamailio/pull/2420"
            ],
            "date": "2020-07-31 14:00:06+00:00",
            "diff": "kamailio_kamailio/issue_2414/commit_e4aed5c272c8144dd1ddf58163c3ba501bb46a5b.diff",
            "diff_additions": 4,
            "diff_deletions": 16,
            "diff_file_size": 39062,
            "diff_url": "https://github.com/kamailio/kamailio/commit/e4aed5c272c8144dd1ddf58163c3ba501bb46a5b.diff",
            "exists": true,
            "files": [
                {
                    "file_additions": 4,
                    "file_deletions": 16,
                    "file_exists": true,
                    "file_name": "src/modules/pua/pua_db.c",
                    "file_size": 39062
                }
            ],
            "interesting": {
                "reopen": false,
                "status": false
            },
            "is_parent": false,
            "sha": "e4aed5c272c8144dd1ddf58163c3ba501bb46a5b"
        },
        {
            "associated_pull_request": [],
            "date": "2020-07-31 14:00:06+00:00",
            "diff": "kamailio_kamailio/issue_2414/commit_73c97ee8ca89bea202b09f6b75722396fbe05ba6.diff",
            "diff_additions": 4,
            "diff_deletions": 16,
            "diff_file_size": 39062,
            "diff_url": "https://github.com/kamailio/kamailio/commit/73c97ee8ca89bea202b09f6b75722396fbe05ba6.diff",
            "exists": true,
            "files": [
                {
                    "file_additions": 4,
                    "file_deletions": 16,
                    "file_exists": true,
                    "file_name": "src/modules/pua/pua_db.c",
                    "file_size": 39062
                }
            ],
            "interesting": {
                "reopen": false,
                "status": false
            },
            "is_parent": false,
            "sha": "73c97ee8ca89bea202b09f6b75722396fbe05ba6"
        },
        {
            "associated_pull_request": [],
            "date": "2020-07-31 14:00:06+00:00",
            "diff": "kamailio_kamailio/issue_2414/commit_e6c91219fd8202f0b1a2dd368537f3eb3516882b.diff",
            "diff_additions": 4,
            "diff_deletions": 16,
            "diff_file_size": 39062,
            "diff_url": "https://github.com/kamailio/kamailio/commit/e6c91219fd8202f0b1a2dd368537f3eb3516882b.diff",
            "exists": true,
            "files": [
                {
                    "file_additions": 4,
                    "file_deletions": 16,
                    "file_exists": true,
                    "file_name": "src/modules/pua/pua_db.c",
                    "file_size": 39062
                }
            ],
            "interesting": {
                "reopen": false,
                "status": false
            },
            "is_parent": false,
            "sha": "e6c91219fd8202f0b1a2dd368537f3eb3516882b"
        }
    ],
    "first_commit": "2020-07-30 08:36:01+00:00",
    "last_commit": "2020-08-03 07:25:00+00:00",
    "number": 2414,
    "pull_request": "None",
    "score": {
        "accidental_reopen_likely": false,
        "all_labels": [],
        "contains_keywords": [
            "confirm",
            "work",
            "chang",
            "fix",
            "issu",
            "reason",
            "test",
            "fault",
            "remov",
            "bug",
            "report"
        ],
        "fix_size": 26,
        "has_labels": [],
        "intersecting": {
            "computed_score": 1.0,
            "final_commit_size": 17,
            "intersection_size": 17,
            "previous_commits_size": 26
        },
        "is_makefile_based": true,
        "no_new_files": [],
        "no_other_files": true,
        "num_prohibited_files": 389772,
        "prohibited_files": [
            "server/src/main/java/com/genymobile/scrcpy/Device.java",
            "server/src/main/java/com/genymobile/scrcpy/wrappers/SurfaceControl.java",
            "server/src/main/java/com/genymobile/scrcpy/Device.java",
            "server/src/main/java/com/genymobile/scrcpy/wrappers/SurfaceControl.java",
            "app/meson.build",
            "app/scrcpy.1",
            "app/src/common.h",
            "app/src/scrcpy.h",
            "app/src/server.h",
            "server/src/main/java/com/genymobile/scrcpy/Workarounds.java"
        ],
        "reopen": true,
        "reopen_events": [
            [
                "2020-07-30 10:20:39+00:00",
                "commit"
            ],
            [
                "2020-07-30 13:37:56+00:00",
                "closed"
            ],
            [
                "2020-07-30 13:37:56+00:00",
                "commit"
            ],
            [
                "2020-07-31 04:22:33+00:00",
                "reopened"
            ],
            [
                "2020-07-31 14:13:36+00:00",
                "commit"
            ],
            [
                "2020-08-01 08:34:38+00:00",
                "commit"
            ],
            [
                "2020-08-01 08:44:44+00:00",
                "commit"
            ],
            [
                "2020-08-01 08:44:45+00:00",
                "commit"
            ],
            [
                "2020-08-03 07:22:25+00:00",
                "closed"
            ],
            [
                "2020-08-03 07:25:32+00:00",
                "commit"
            ],
            [
                "2020-08-03 07:25:32+00:00",
                "commit"
            ]
        ],
        "status": false,
        "strategy": true,
        "total_changes": 151
    }
}