{
    "commits": [
        {
            "diff": "spring-projects_spring-boot/issue_1250/commit_90cf722365cf03c3377cedb15eb9688598555480.diff",
            "diff_additions": 90,
            "diff_deletions": 25,
            "diff_file_size": 0,
            "files": [
                {
                    "file_additions": 7,
                    "file_deletions": 5,
                    "file_exists": false,
                    "file_name": "spring-boot-autoconfigure/src/main/java/org/springframework/boot/autoconfigure/batch/BatchAutoConfiguration.java",
                    "file_size": 0
                },
                {
                    "file_additions": 6,
                    "file_deletions": 20,
                    "file_exists": false,
                    "file_name": "spring-boot-autoconfigure/src/main/java/org/springframework/boot/autoconfigure/batch/BatchDatabaseInitializer.java",
                    "file_size": 0
                },
                {
                    "file_additions": 77,
                    "file_deletions": 0,
                    "file_exists": false,
                    "file_name": "spring-boot-autoconfigure/src/main/java/org/springframework/boot/autoconfigure/batch/BatchProperties.java",
                    "file_size": 0
                }
            ],
            "interesting": {
                "reopened": false,
                "status": false
            },
            "sha": "90cf722365cf03c3377cedb15eb9688598555480"
        },
        {
            "diff": "spring-projects_spring-boot/issue_1250/commit_65684957eabc66203cc67067c6b88060eda7c7d4.diff",
            "diff_additions": 79,
            "diff_deletions": 19,
            "diff_file_size": 0,
            "files": [
                {
                    "file_additions": 79,
                    "file_deletions": 19,
                    "file_exists": false,
                    "file_name": "spring-boot-autoconfigure/src/main/java/org/springframework/boot/autoconfigure/thymeleaf/ThymeleafAutoConfiguration.java",
                    "file_size": 0
                }
            ],
            "interesting": {
                "reopened": true,
                "status": false
            },
            "sha": "65684957eabc66203cc67067c6b88060eda7c7d4"
        },
        {
            "diff": "spring-projects_spring-boot/issue_1250/commit_8f886e22ceed5039fe1fbcd5a04c551d03319fc2.diff",
            "diff_additions": 38,
            "diff_deletions": 19,
            "diff_file_size": 0,
            "files": [
                {
                    "file_additions": 38,
                    "file_deletions": 19,
                    "file_exists": false,
                    "file_name": "spring-boot-autoconfigure/src/main/java/org/springframework/boot/autoconfigure/thymeleaf/ThymeleafAutoConfiguration.java",
                    "file_size": 0
                }
            ],
            "interesting": {
                "reopened": false,
                "status": false
            },
            "sha": "8f886e22ceed5039fe1fbcd5a04c551d03319fc2"
        }
    ],
    "first_commit": "2014-07-14 09:04:21",
    "last_commit": "2014-07-14 09:18:36",
    "number": 1250,
    "score": 160.01481481481483
}