{
    "covered_issues": [
        286,
        276,
        273,
        271,
        268,
        262,
        258,
        252,
        251,
        250,
        249,
        248,
        247,
        246,
        245,
        244,
        243,
        242,
        234,
        233,
        232,
        225,
        224,
        222,
        215,
        214,
        213,
        212,
        205,
        204,
        200,
        196,
        195,
        191,
        190,
        189,
        187,
        185,
        184,
        183,
        182,
        181,
        180,
        176,
        175,
        173,
        172,
        171,
        170,
        169,
        167,
        165,
        164,
        163,
        162,
        161,
        160,
        158,
        157,
        155,
        153,
        151,
        150,
        148,
        147,
        145,
        144,
        140,
        139,
        138,
        137,
        136,
        135,
        131,
        130,
        128,
        125,
        124,
        123,
        122,
        121,
        120,
        119,
        118,
        116,
        115,
        114,
        113,
        112,
        111,
        110,
        109,
        107,
        106,
        105,
        104,
        103,
        102,
        101,
        100,
        99,
        98,
        97,
        96,
        93,
        92,
        91,
        90,
        89,
        88,
        85,
        84,
        83,
        82,
        81,
        79,
        78,
        77,
        75,
        73,
        72,
        70,
        69,
        67,
        66,
        65,
        64,
        63,
        60,
        59,
        52,
        49,
        48,
        46,
        45,
        44,
        43,
        42,
        41,
        39,
        38,
        37,
        31,
        30,
        29,
        27,
        26,
        25,
        24,
        23,
        22,
        21,
        20,
        19,
        18,
        17,
        16,
        15,
        14,
        13,
        12,
        11,
        10,
        9,
        8,
        7,
        6,
        5,
        4,
        3,
        2,
        1,
        204,
        204
    ],
    "finished": true
}