{
    "commits": [
        {
            "diff": "elastic_elasticsearch/issue_37379/commit_6f91f06d8679bbf2bfc7563d38cc500d83deba1c.diff",
            "diff_additions": 2380,
            "diff_deletions": 0,
            "diff_file_size": 0,
            "files": [
                {
                    "file_additions": 104,
                    "file_deletions": 0,
                    "file_exists": false,
                    "file_name": "libs/geo/src/main/java/org/elasticsearch/geo/geometry/Circle.java",
                    "file_size": 0
                },
                {
                    "file_additions": 32,
                    "file_deletions": 0,
                    "file_exists": false,
                    "file_name": "libs/geo/src/main/java/org/elasticsearch/geo/geometry/Geometry.java",
                    "file_size": 0
                },
                {
                    "file_additions": 85,
                    "file_deletions": 0,
                    "file_exists": false,
                    "file_name": "libs/geo/src/main/java/org/elasticsearch/geo/geometry/GeometryCollection.java",
                    "file_size": 0
                },
                {
                    "file_additions": 70,
                    "file_deletions": 0,
                    "file_exists": false,
                    "file_name": "libs/geo/src/main/java/org/elasticsearch/geo/geometry/GeometryUtils.java",
                    "file_size": 0
                },
                {
                    "file_additions": 69,
                    "file_deletions": 0,
                    "file_exists": false,
                    "file_name": "libs/geo/src/main/java/org/elasticsearch/geo/geometry/GeometryVisitor.java",
                    "file_size": 0
                },
                {
                    "file_additions": 106,
                    "file_deletions": 0,
                    "file_exists": false,
                    "file_name": "libs/geo/src/main/java/org/elasticsearch/geo/geometry/Line.java",
                    "file_size": 0
                },
                {
                    "file_additions": 53,
                    "file_deletions": 0,
                    "file_exists": false,
                    "file_name": "libs/geo/src/main/java/org/elasticsearch/geo/geometry/LinearRing.java",
                    "file_size": 0
                },
                {
                    "file_additions": 46,
                    "file_deletions": 0,
                    "file_exists": false,
                    "file_name": "libs/geo/src/main/java/org/elasticsearch/geo/geometry/MultiLine.java",
                    "file_size": 0
                },
                {
                    "file_additions": 47,
                    "file_deletions": 0,
                    "file_exists": false,
                    "file_name": "libs/geo/src/main/java/org/elasticsearch/geo/geometry/MultiPoint.java",
                    "file_size": 0
                },
                {
                    "file_additions": 46,
                    "file_deletions": 0,
                    "file_exists": false,
                    "file_name": "libs/geo/src/main/java/org/elasticsearch/geo/geometry/MultiPolygon.java",
                    "file_size": 0
                },
                {
                    "file_additions": 95,
                    "file_deletions": 0,
                    "file_exists": false,
                    "file_name": "libs/geo/src/main/java/org/elasticsearch/geo/geometry/Point.java",
                    "file_size": 0
                },
                {
                    "file_additions": 122,
                    "file_deletions": 0,
                    "file_exists": false,
                    "file_name": "libs/geo/src/main/java/org/elasticsearch/geo/geometry/Polygon.java",
                    "file_size": 0
                },
                {
                    "file_additions": 168,
                    "file_deletions": 0,
                    "file_exists": false,
                    "file_name": "libs/geo/src/main/java/org/elasticsearch/geo/geometry/Rectangle.java",
                    "file_size": 0
                },
                {
                    "file_additions": 36,
                    "file_deletions": 0,
                    "file_exists": false,
                    "file_name": "libs/geo/src/main/java/org/elasticsearch/geo/geometry/ShapeType.java",
                    "file_size": 0
                },
                {
                    "file_additions": 24,
                    "file_deletions": 0,
                    "file_exists": false,
                    "file_name": "libs/geo/src/main/java/org/elasticsearch/geo/package-info.java",
                    "file_size": 0
                },
                {
                    "file_additions": 560,
                    "file_deletions": 0,
                    "file_exists": false,
                    "file_name": "libs/geo/src/main/java/org/elasticsearch/geo/utils/WellKnownText.java",
                    "file_size": 0
                },
                {
                    "file_additions": 203,
                    "file_deletions": 0,
                    "file_exists": false,
                    "file_name": "libs/geo/src/test/java/org/elasticsearch/geo/geometry/BaseGeometryTestCase.java",
                    "file_size": 0
                },
                {
                    "file_additions": 51,
                    "file_deletions": 0,
                    "file_exists": false,
                    "file_name": "libs/geo/src/test/java/org/elasticsearch/geo/geometry/CircleTests.java",
                    "file_size": 0
                },
                {
                    "file_additions": 54,
                    "file_deletions": 0,
                    "file_exists": false,
                    "file_name": "libs/geo/src/test/java/org/elasticsearch/geo/geometry/GeometryCollectionTests.java",
                    "file_size": 0
                },
                {
                    "file_additions": 51,
                    "file_deletions": 0,
                    "file_exists": false,
                    "file_name": "libs/geo/src/test/java/org/elasticsearch/geo/geometry/LineTests.java",
                    "file_size": 0
                },
                {
                    "file_additions": 52,
                    "file_deletions": 0,
                    "file_exists": false,
                    "file_name": "libs/geo/src/test/java/org/elasticsearch/geo/geometry/LinearRingTests.java",
                    "file_size": 0
                },
                {
                    "file_additions": 51,
                    "file_deletions": 0,
                    "file_exists": false,
                    "file_name": "libs/geo/src/test/java/org/elasticsearch/geo/geometry/MultiLineTests.java",
                    "file_size": 0
                },
                {
                    "file_additions": 51,
                    "file_deletions": 0,
                    "file_exists": false,
                    "file_name": "libs/geo/src/test/java/org/elasticsearch/geo/geometry/MultiPointTests.java",
                    "file_size": 0
                },
                {
                    "file_additions": 53,
                    "file_deletions": 0,
                    "file_exists": false,
                    "file_name": "libs/geo/src/test/java/org/elasticsearch/geo/geometry/MultiPolygonTests.java",
                    "file_size": 0
                },
                {
                    "file_additions": 48,
                    "file_deletions": 0,
                    "file_exists": false,
                    "file_name": "libs/geo/src/test/java/org/elasticsearch/geo/geometry/PointTests.java",
                    "file_size": 0
                },
                {
                    "file_additions": 52,
                    "file_deletions": 0,
                    "file_exists": false,
                    "file_name": "libs/geo/src/test/java/org/elasticsearch/geo/geometry/PolygonTests.java",
                    "file_size": 0
                },
                {
                    "file_additions": 51,
                    "file_deletions": 0,
                    "file_exists": false,
                    "file_name": "libs/geo/src/test/java/org/elasticsearch/geo/geometry/RectangleTests.java",
                    "file_size": 0
                }
            ],
            "interesting": {
                "reopened": false,
                "status": false
            },
            "sha": "6f91f06d8679bbf2bfc7563d38cc500d83deba1c"
        },
        {
            "diff": "elastic_elasticsearch/issue_37379/commit_65e42ab63bb6e764ea9f547b42bf82b3ef465881.diff",
            "diff_additions": 2,
            "diff_deletions": 0,
            "diff_file_size": 20149,
            "files": [
                {
                    "file_additions": 2,
                    "file_deletions": 0,
                    "file_exists": true,
                    "file_name": "x-pack/qa/rolling-upgrade/src/test/java/org/elasticsearch/upgrades/TokenBackwardsCompatibilityIT.java",
                    "file_size": 20149
                }
            ],
            "interesting": {
                "reopened": false,
                "status": false
            },
            "sha": "65e42ab63bb6e764ea9f547b42bf82b3ef465881"
        },
        {
            "diff": "elastic_elasticsearch/issue_37379/commit_8b5949269470583be8570c659a01633b19ab3f85.diff",
            "diff_additions": 2,
            "diff_deletions": 0,
            "diff_file_size": 20149,
            "files": [
                {
                    "file_additions": 2,
                    "file_deletions": 0,
                    "file_exists": true,
                    "file_name": "x-pack/qa/rolling-upgrade/src/test/java/org/elasticsearch/upgrades/TokenBackwardsCompatibilityIT.java",
                    "file_size": 20149
                }
            ],
            "interesting": {
                "reopened": false,
                "status": false
            },
            "sha": "8b5949269470583be8570c659a01633b19ab3f85"
        },
        {
            "diff": "elastic_elasticsearch/issue_37379/commit_37cc7f194d601f407ee7b18a0857de3e39a8a3c3.diff",
            "diff_additions": 25,
            "diff_deletions": 74,
            "diff_file_size": 158862,
            "files": [
                {
                    "file_additions": 12,
                    "file_deletions": 12,
                    "file_exists": true,
                    "file_name": "x-pack/plugin/security/src/main/java/org/elasticsearch/xpack/security/authc/TokenService.java",
                    "file_size": 138713
                },
                {
                    "file_additions": 13,
                    "file_deletions": 62,
                    "file_exists": true,
                    "file_name": "x-pack/qa/rolling-upgrade/src/test/java/org/elasticsearch/upgrades/TokenBackwardsCompatibilityIT.java",
                    "file_size": 20149
                }
            ],
            "interesting": {
                "reopened": false,
                "status": true
            },
            "sha": "37cc7f194d601f407ee7b18a0857de3e39a8a3c3"
        },
        {
            "diff": "elastic_elasticsearch/issue_37379/commit_e9bc12eb784a77a7fb558163eab4fcee52fd1bc8.diff",
            "diff_additions": 45,
            "diff_deletions": 67,
            "diff_file_size": 158862,
            "files": [
                {
                    "file_additions": 12,
                    "file_deletions": 12,
                    "file_exists": true,
                    "file_name": "x-pack/plugin/security/src/main/java/org/elasticsearch/xpack/security/authc/TokenService.java",
                    "file_size": 138713
                },
                {
                    "file_additions": 33,
                    "file_deletions": 55,
                    "file_exists": true,
                    "file_name": "x-pack/qa/rolling-upgrade/src/test/java/org/elasticsearch/upgrades/TokenBackwardsCompatibilityIT.java",
                    "file_size": 20149
                }
            ],
            "interesting": {
                "reopened": false,
                "status": false
            },
            "sha": "e9bc12eb784a77a7fb558163eab4fcee52fd1bc8"
        },
        {
            "diff": "elastic_elasticsearch/issue_37379/commit_d004d8b71c73f1f042e7454301b98ad9b7808fe5.diff",
            "diff_additions": 47,
            "diff_deletions": 70,
            "diff_file_size": 158862,
            "files": [
                {
                    "file_additions": 12,
                    "file_deletions": 12,
                    "file_exists": true,
                    "file_name": "x-pack/plugin/security/src/main/java/org/elasticsearch/xpack/security/authc/TokenService.java",
                    "file_size": 138713
                },
                {
                    "file_additions": 35,
                    "file_deletions": 58,
                    "file_exists": true,
                    "file_name": "x-pack/qa/rolling-upgrade/src/test/java/org/elasticsearch/upgrades/TokenBackwardsCompatibilityIT.java",
                    "file_size": 20149
                }
            ],
            "interesting": {
                "reopened": false,
                "status": true
            },
            "sha": "d004d8b71c73f1f042e7454301b98ad9b7808fe5"
        },
        {
            "diff": "elastic_elasticsearch/issue_37379/commit_4caca63b2937934db8792040db0f82861ca9fe8a.diff",
            "diff_additions": 45,
            "diff_deletions": 67,
            "diff_file_size": 158862,
            "files": [
                {
                    "file_additions": 12,
                    "file_deletions": 12,
                    "file_exists": true,
                    "file_name": "x-pack/plugin/security/src/main/java/org/elasticsearch/xpack/security/authc/TokenService.java",
                    "file_size": 138713
                },
                {
                    "file_additions": 33,
                    "file_deletions": 55,
                    "file_exists": true,
                    "file_name": "x-pack/qa/rolling-upgrade/src/test/java/org/elasticsearch/upgrades/TokenBackwardsCompatibilityIT.java",
                    "file_size": 20149
                }
            ],
            "interesting": {
                "reopened": false,
                "status": false
            },
            "sha": "4caca63b2937934db8792040db0f82861ca9fe8a"
        },
        {
            "diff": "elastic_elasticsearch/issue_37379/commit_7f999c43b353675424498af847cfe66d4dc938cd.diff",
            "diff_additions": 49,
            "diff_deletions": 98,
            "diff_file_size": 158862,
            "files": [
                {
                    "file_additions": 12,
                    "file_deletions": 12,
                    "file_exists": true,
                    "file_name": "x-pack/plugin/security/src/main/java/org/elasticsearch/xpack/security/authc/TokenService.java",
                    "file_size": 138713
                },
                {
                    "file_additions": 37,
                    "file_deletions": 86,
                    "file_exists": true,
                    "file_name": "x-pack/qa/rolling-upgrade/src/test/java/org/elasticsearch/upgrades/TokenBackwardsCompatibilityIT.java",
                    "file_size": 20149
                }
            ],
            "interesting": {
                "reopened": false,
                "status": false
            },
            "sha": "7f999c43b353675424498af847cfe66d4dc938cd"
        }
    ],
    "first_commit": "2019-01-15 15:52:46",
    "last_commit": "2019-02-26 08:42:36",
    "number": 37379,
    "score": 272.00134634803095
}