{
    "covered_issues": [
        112,
        109,
        107,
        106,
        104,
        99,
        98,
        73,
        69,
        68,
        67,
        64,
        59,
        56,
        50,
        49,
        45,
        44,
        43,
        42,
        37,
        36,
        35,
        34,
        33,
        31,
        30,
        29,
        28,
        27,
        26,
        25,
        24,
        23,
        22,
        21,
        20,
        19,
        18,
        17,
        16,
        15,
        14,
        12,
        11,
        10,
        9,
        8,
        7,
        6,
        5,
        4,
        3,
        2,
        1
    ],
    "finished": true
}