{
    "category": [
        "memory",
        "wrong API usage"
    ],
    "commits": [
        {
            "associated_pull_request": [
                "https://github.com/swaywm/sway/pull/2159"
            ],
            "date": "2018-06-25 00:45:03",
            "diff": "swaywm_sway/issue_1/commit_59086fabbfaa545641827b0e181100027de08205.diff",
            "diff_additions": 6,
            "diff_deletions": 3,
            "diff_file_size": 44523,
            "diff_url": "https://github.com/swaywm/sway/commit/59086fabbfaa545641827b0e181100027de08205.diff",
            "exists": true,
            "files": [
                {
                    "file_additions": 6,
                    "file_deletions": 3,
                    "file_exists": true,
                    "file_name": "sway/input/cursor.c",
                    "file_size": 44523
                }
            ],
            "interesting": {
                "reopen": false,
                "status": false
            },
            "is_parent": true,
            "sha": "59086fabbfaa545641827b0e181100027de08205"
        },
        {
            "associated_pull_request": [
                "https://github.com/swaywm/sway/pull/2163"
            ],
            "date": "2018-06-26 12:16:42",
            "diff": "swaywm_sway/issue_1/commit_08800c8ee22f2aad8c00117756c15169d6e543b1.diff",
            "diff_additions": 2,
            "diff_deletions": 0,
            "diff_file_size": 22989,
            "diff_url": "https://github.com/swaywm/sway/commit/08800c8ee22f2aad8c00117756c15169d6e543b1.diff",
            "exists": true,
            "files": [
                {
                    "file_additions": 2,
                    "file_deletions": 0,
                    "file_exists": true,
                    "file_name": "sway/desktop/layer_shell.c",
                    "file_size": 22989
                }
            ],
            "interesting": {
                "reopen": false,
                "status": false
            },
            "is_parent": false,
            "sha": "08800c8ee22f2aad8c00117756c15169d6e543b1"
        },
        {
            "associated_pull_request": [
                "https://github.com/swaywm/sway/pull/2180"
            ],
            "date": "2018-06-24 22:17:01",
            "diff": "swaywm_sway/issue_1/commit_bc1e99305a7c9b6732792c136a868cca7a3e52c4.diff",
            "diff_additions": 56,
            "diff_deletions": 56,
            "diff_file_size": 17740,
            "diff_url": "https://github.com/swaywm/sway/commit/bc1e99305a7c9b6732792c136a868cca7a3e52c4.diff",
            "exists": true,
            "files": [
                {
                    "file_additions": 28,
                    "file_deletions": 28,
                    "file_exists": true,
                    "file_name": "sway/desktop/xdg_shell.c",
                    "file_size": 17740
                },
                {
                    "file_additions": 28,
                    "file_deletions": 28,
                    "file_exists": false,
                    "file_name": "sway/desktop/xdg_shell_v6.c",
                    "file_size": 0
                }
            ],
            "interesting": {
                "reopen": false,
                "status": false
            },
            "is_parent": false,
            "sha": "bc1e99305a7c9b6732792c136a868cca7a3e52c4"
        },
        {
            "associated_pull_request": [],
            "date": "2018-07-04 05:45:35",
            "diff": "swaywm_sway/issue_1/commit_8fd6ac91461404c016afd6f0b3da79f1c1068eb6.diff",
            "diff_additions": 11,
            "diff_deletions": 0,
            "diff_file_size": 30932,
            "diff_url": "https://github.com/swaywm/sway/commit/8fd6ac91461404c016afd6f0b3da79f1c1068eb6.diff",
            "exists": true,
            "files": [
                {
                    "file_additions": 11,
                    "file_deletions": 0,
                    "file_exists": true,
                    "file_name": "sway/ipc-server.c",
                    "file_size": 30932
                }
            ],
            "interesting": {
                "reopen": false,
                "status": false
            },
            "is_parent": false,
            "sha": "8fd6ac91461404c016afd6f0b3da79f1c1068eb6"
        },
        {
            "associated_pull_request": [],
            "date": "2018-07-04 05:45:35",
            "diff": "swaywm_sway/issue_1/commit_b622396aa90613272f93cbce647db16f67a61106.diff",
            "diff_additions": 11,
            "diff_deletions": 0,
            "diff_file_size": 30932,
            "diff_url": "https://github.com/swaywm/sway/commit/b622396aa90613272f93cbce647db16f67a61106.diff",
            "exists": true,
            "files": [
                {
                    "file_additions": 11,
                    "file_deletions": 0,
                    "file_exists": true,
                    "file_name": "sway/ipc-server.c",
                    "file_size": 30932
                }
            ],
            "interesting": {
                "reopen": false,
                "status": false
            },
            "is_parent": false,
            "sha": "b622396aa90613272f93cbce647db16f67a61106"
        },
        {
            "associated_pull_request": [],
            "date": "2018-07-04 05:45:35",
            "diff": "swaywm_sway/issue_1/commit_c84d660cef420dc39d5f0135c6dc347fd1a954a1.diff",
            "diff_additions": 24,
            "diff_deletions": 16,
            "diff_file_size": 41265,
            "diff_url": "https://github.com/swaywm/sway/commit/c84d660cef420dc39d5f0135c6dc347fd1a954a1.diff",
            "exists": true,
            "files": [
                {
                    "file_additions": 24,
                    "file_deletions": 14,
                    "file_exists": true,
                    "file_name": "sway/ipc-server.c",
                    "file_size": 30932
                },
                {
                    "file_additions": 0,
                    "file_deletions": 2,
                    "file_exists": true,
                    "file_name": "sway/main.c",
                    "file_size": 10333
                }
            ],
            "interesting": {
                "reopen": false,
                "status": false
            },
            "is_parent": false,
            "sha": "c84d660cef420dc39d5f0135c6dc347fd1a954a1"
        },
        {
            "associated_pull_request": [
                "https://github.com/swaywm/sway/pull/2203"
            ],
            "date": "2018-07-04 05:45:35",
            "diff": "swaywm_sway/issue_1/commit_b0918b1058a704675fc2590ee9ff3bef6324f734.diff",
            "diff_additions": 20,
            "diff_deletions": 16,
            "diff_file_size": 41265,
            "diff_url": "https://github.com/swaywm/sway/commit/b0918b1058a704675fc2590ee9ff3bef6324f734.diff",
            "exists": true,
            "files": [
                {
                    "file_additions": 20,
                    "file_deletions": 14,
                    "file_exists": true,
                    "file_name": "sway/ipc-server.c",
                    "file_size": 30932
                },
                {
                    "file_additions": 0,
                    "file_deletions": 2,
                    "file_exists": true,
                    "file_name": "sway/main.c",
                    "file_size": 10333
                }
            ],
            "interesting": {
                "reopen": false,
                "status": false
            },
            "is_parent": false,
            "sha": "b0918b1058a704675fc2590ee9ff3bef6324f734"
        },
        {
            "associated_pull_request": [],
            "date": "2018-10-07 07:33:26",
            "diff": "swaywm_sway/issue_1/commit_656f2493833161a2cee382ee29d96f2675b30c74.diff",
            "diff_additions": 4,
            "diff_deletions": 4,
            "diff_file_size": 17044,
            "diff_url": "https://github.com/swaywm/sway/commit/656f2493833161a2cee382ee29d96f2675b30c74.diff",
            "exists": true,
            "files": [
                {
                    "file_additions": 4,
                    "file_deletions": 4,
                    "file_exists": true,
                    "file_name": "swaynag/swaynag.c",
                    "file_size": 17044
                }
            ],
            "interesting": {
                "reopen": false,
                "status": false
            },
            "is_parent": false,
            "sha": "656f2493833161a2cee382ee29d96f2675b30c74"
        },
        {
            "associated_pull_request": [
                "https://github.com/swaywm/sway/pull/2783"
            ],
            "date": "2018-10-07 07:33:26",
            "diff": "swaywm_sway/issue_1/commit_e5ece5f8b3ec14bfdbea20597ff1db82369d6331.diff",
            "diff_additions": 4,
            "diff_deletions": 4,
            "diff_file_size": 17044,
            "diff_url": "https://github.com/swaywm/sway/commit/e5ece5f8b3ec14bfdbea20597ff1db82369d6331.diff",
            "exists": true,
            "files": [
                {
                    "file_additions": 4,
                    "file_deletions": 4,
                    "file_exists": true,
                    "file_name": "swaynag/swaynag.c",
                    "file_size": 17044
                }
            ],
            "interesting": {
                "reopen": false,
                "status": false
            },
            "is_parent": false,
            "sha": "e5ece5f8b3ec14bfdbea20597ff1db82369d6331"
        },
        {
            "associated_pull_request": [],
            "date": "2019-02-21 07:36:58",
            "diff": "swaywm_sway/issue_1/commit_51646fb3ebfba9254f139ec51fad5735ffcb925f.diff",
            "diff_additions": 2,
            "diff_deletions": 1,
            "diff_file_size": 3767,
            "diff_url": "https://github.com/swaywm/sway/commit/51646fb3ebfba9254f139ec51fad5735ffcb925f.diff",
            "exists": true,
            "files": [
                {
                    "file_additions": 2,
                    "file_deletions": 1,
                    "file_exists": true,
                    "file_name": "common/ipc-client.c",
                    "file_size": 3767
                }
            ],
            "interesting": {
                "reopen": false,
                "status": false
            },
            "is_parent": false,
            "sha": "51646fb3ebfba9254f139ec51fad5735ffcb925f"
        },
        {
            "associated_pull_request": [],
            "date": "2019-02-21 07:37:23",
            "diff": "swaywm_sway/issue_1/commit_73f66b29633dcbd25976c29e304767d5ce99f061.diff",
            "diff_additions": 1,
            "diff_deletions": 0,
            "diff_file_size": 10333,
            "diff_url": "https://github.com/swaywm/sway/commit/73f66b29633dcbd25976c29e304767d5ce99f061.diff",
            "exists": true,
            "files": [
                {
                    "file_additions": 1,
                    "file_deletions": 0,
                    "file_exists": true,
                    "file_name": "sway/main.c",
                    "file_size": 10333
                }
            ],
            "interesting": {
                "reopen": false,
                "status": false
            },
            "is_parent": false,
            "sha": "73f66b29633dcbd25976c29e304767d5ce99f061"
        },
        {
            "associated_pull_request": [
                "https://github.com/swaywm/sway/pull/3740"
            ],
            "date": "2019-02-21 07:36:58",
            "diff": "swaywm_sway/issue_1/commit_a968a650e26b9f6bba134ee8dfa9865e958c29da.diff",
            "diff_additions": 1,
            "diff_deletions": 0,
            "diff_file_size": 10333,
            "diff_url": "https://github.com/swaywm/sway/commit/a968a650e26b9f6bba134ee8dfa9865e958c29da.diff",
            "exists": true,
            "files": [
                {
                    "file_additions": 1,
                    "file_deletions": 0,
                    "file_exists": true,
                    "file_name": "sway/main.c",
                    "file_size": 10333
                }
            ],
            "interesting": {
                "reopen": false,
                "status": false
            },
            "is_parent": false,
            "sha": "a968a650e26b9f6bba134ee8dfa9865e958c29da"
        },
        {
            "associated_pull_request": [
                "https://github.com/swaywm/sway/pull/3740"
            ],
            "date": "2019-02-21 07:37:23",
            "diff": "swaywm_sway/issue_1/commit_aa4ccd845cf93ac2117b12083fed748f4c01e744.diff",
            "diff_additions": 1,
            "diff_deletions": 0,
            "diff_file_size": 10333,
            "diff_url": "https://github.com/swaywm/sway/commit/aa4ccd845cf93ac2117b12083fed748f4c01e744.diff",
            "exists": true,
            "files": [
                {
                    "file_additions": 1,
                    "file_deletions": 0,
                    "file_exists": true,
                    "file_name": "sway/main.c",
                    "file_size": 10333
                }
            ],
            "interesting": {
                "reopen": false,
                "status": false
            },
            "is_parent": false,
            "sha": "aa4ccd845cf93ac2117b12083fed748f4c01e744"
        },
        {
            "associated_pull_request": [
                "https://github.com/swaywm/sway/pull/3752"
            ],
            "date": "2019-02-22 05:42:40",
            "diff": "swaywm_sway/issue_1/commit_ae102104cfd7985642ea3db82839bccc89ddbbe3.diff",
            "diff_additions": 1,
            "diff_deletions": 1,
            "diff_file_size": 33928,
            "diff_url": "https://github.com/swaywm/sway/commit/ae102104cfd7985642ea3db82839bccc89ddbbe3.diff",
            "exists": true,
            "files": [
                {
                    "file_additions": 1,
                    "file_deletions": 1,
                    "file_exists": true,
                    "file_name": "sway/commands/move.c",
                    "file_size": 33928
                }
            ],
            "interesting": {
                "reopen": false,
                "status": true
            },
            "is_parent": false,
            "sha": "ae102104cfd7985642ea3db82839bccc89ddbbe3"
        },
        {
            "associated_pull_request": [
                "https://github.com/swaywm/sway/pull/3752"
            ],
            "date": "2019-02-22 05:42:40",
            "diff": "swaywm_sway/issue_1/commit_16ddd00102c7713b7d1c404393768eb06c829751.diff",
            "diff_additions": 1,
            "diff_deletions": 1,
            "diff_file_size": 33928,
            "diff_url": "https://github.com/swaywm/sway/commit/16ddd00102c7713b7d1c404393768eb06c829751.diff",
            "exists": true,
            "files": [
                {
                    "file_additions": 1,
                    "file_deletions": 1,
                    "file_exists": true,
                    "file_name": "sway/commands/move.c",
                    "file_size": 33928
                }
            ],
            "interesting": {
                "reopen": false,
                "status": true
            },
            "is_parent": false,
            "sha": "16ddd00102c7713b7d1c404393768eb06c829751"
        },
        {
            "associated_pull_request": [],
            "date": "2019-02-23 07:28:49",
            "diff": "swaywm_sway/issue_1/commit_03590d341728f3343cd66c4031301a685990f203.diff",
            "diff_additions": 4,
            "diff_deletions": 1,
            "diff_file_size": 45228,
            "diff_url": "https://github.com/swaywm/sway/commit/03590d341728f3343cd66c4031301a685990f203.diff",
            "exists": true,
            "files": [
                {
                    "file_additions": 1,
                    "file_deletions": 0,
                    "file_exists": true,
                    "file_name": "sway/tree/view.c",
                    "file_size": 43311
                },
                {
                    "file_additions": 3,
                    "file_deletions": 1,
                    "file_exists": true,
                    "file_name": "sway/xdg_decoration.c",
                    "file_size": 1917
                }
            ],
            "interesting": {
                "reopen": false,
                "status": false
            },
            "is_parent": false,
            "sha": "03590d341728f3343cd66c4031301a685990f203"
        },
        {
            "associated_pull_request": [],
            "date": "2019-02-23 07:28:49",
            "diff": "swaywm_sway/issue_1/commit_18fd7bbc2f261ab352465a49804de728a4cbf0a9.diff",
            "diff_additions": 4,
            "diff_deletions": 1,
            "diff_file_size": 45228,
            "diff_url": "https://github.com/swaywm/sway/commit/18fd7bbc2f261ab352465a49804de728a4cbf0a9.diff",
            "exists": true,
            "files": [
                {
                    "file_additions": 1,
                    "file_deletions": 0,
                    "file_exists": true,
                    "file_name": "sway/tree/view.c",
                    "file_size": 43311
                },
                {
                    "file_additions": 3,
                    "file_deletions": 1,
                    "file_exists": true,
                    "file_name": "sway/xdg_decoration.c",
                    "file_size": 1917
                }
            ],
            "interesting": {
                "reopen": false,
                "status": false
            },
            "is_parent": false,
            "sha": "18fd7bbc2f261ab352465a49804de728a4cbf0a9"
        },
        {
            "associated_pull_request": [
                "https://github.com/swaywm/sway/pull/3760"
            ],
            "date": "2019-02-23 07:28:49",
            "diff": "swaywm_sway/issue_1/commit_a2a18729ce404acc2983f4363b49038a7dd2c149.diff",
            "diff_additions": 7,
            "diff_deletions": 1,
            "diff_file_size": 19657,
            "diff_url": "https://github.com/swaywm/sway/commit/a2a18729ce404acc2983f4363b49038a7dd2c149.diff",
            "exists": true,
            "files": [
                {
                    "file_additions": 4,
                    "file_deletions": 0,
                    "file_exists": true,
                    "file_name": "sway/desktop/xdg_shell.c",
                    "file_size": 17740
                },
                {
                    "file_additions": 3,
                    "file_deletions": 1,
                    "file_exists": true,
                    "file_name": "sway/xdg_decoration.c",
                    "file_size": 1917
                }
            ],
            "interesting": {
                "reopen": false,
                "status": false
            },
            "is_parent": false,
            "sha": "a2a18729ce404acc2983f4363b49038a7dd2c149"
        },
        {
            "associated_pull_request": [
                "https://github.com/swaywm/sway/pull/3760"
            ],
            "date": "2019-02-23 07:28:49",
            "diff": "swaywm_sway/issue_1/commit_3ead287064e8176520e7f15bf84fb179cbf1f1b1.diff",
            "diff_additions": 7,
            "diff_deletions": 1,
            "diff_file_size": 19657,
            "diff_url": "https://github.com/swaywm/sway/commit/3ead287064e8176520e7f15bf84fb179cbf1f1b1.diff",
            "exists": true,
            "files": [
                {
                    "file_additions": 4,
                    "file_deletions": 0,
                    "file_exists": true,
                    "file_name": "sway/desktop/xdg_shell.c",
                    "file_size": 17740
                },
                {
                    "file_additions": 3,
                    "file_deletions": 1,
                    "file_exists": true,
                    "file_name": "sway/xdg_decoration.c",
                    "file_size": 1917
                }
            ],
            "interesting": {
                "reopen": false,
                "status": false
            },
            "is_parent": false,
            "sha": "3ead287064e8176520e7f15bf84fb179cbf1f1b1"
        },
        {
            "associated_pull_request": [],
            "date": "2019-02-21 07:36:58",
            "diff": "swaywm_sway/issue_1/commit_dfe42cbac2c51592759c19efe8abc23f847f5bb2.diff",
            "diff_additions": 1,
            "diff_deletions": 0,
            "diff_file_size": 10333,
            "diff_url": "https://github.com/swaywm/sway/commit/dfe42cbac2c51592759c19efe8abc23f847f5bb2.diff",
            "exists": true,
            "files": [
                {
                    "file_additions": 1,
                    "file_deletions": 0,
                    "file_exists": true,
                    "file_name": "sway/main.c",
                    "file_size": 10333
                }
            ],
            "interesting": {
                "reopen": false,
                "status": false
            },
            "is_parent": false,
            "sha": "dfe42cbac2c51592759c19efe8abc23f847f5bb2"
        },
        {
            "associated_pull_request": [],
            "date": "2019-02-21 07:37:23",
            "diff": "swaywm_sway/issue_1/commit_099d25e975e811259e4e1709925f6ae3a7be4367.diff",
            "diff_additions": 1,
            "diff_deletions": 0,
            "diff_file_size": 10333,
            "diff_url": "https://github.com/swaywm/sway/commit/099d25e975e811259e4e1709925f6ae3a7be4367.diff",
            "exists": true,
            "files": [
                {
                    "file_additions": 1,
                    "file_deletions": 0,
                    "file_exists": true,
                    "file_name": "sway/main.c",
                    "file_size": 10333
                }
            ],
            "interesting": {
                "reopen": false,
                "status": false
            },
            "is_parent": false,
            "sha": "099d25e975e811259e4e1709925f6ae3a7be4367"
        },
        {
            "associated_pull_request": [],
            "date": "2019-02-22 05:42:40",
            "diff": "swaywm_sway/issue_1/commit_f4355620126216a71b0027cb1452408fb8f5e716.diff",
            "diff_additions": 1,
            "diff_deletions": 1,
            "diff_file_size": 33928,
            "diff_url": "https://github.com/swaywm/sway/commit/f4355620126216a71b0027cb1452408fb8f5e716.diff",
            "exists": true,
            "files": [
                {
                    "file_additions": 1,
                    "file_deletions": 1,
                    "file_exists": true,
                    "file_name": "sway/commands/move.c",
                    "file_size": 33928
                }
            ],
            "interesting": {
                "reopen": false,
                "status": false
            },
            "is_parent": false,
            "sha": "f4355620126216a71b0027cb1452408fb8f5e716"
        },
        {
            "associated_pull_request": [],
            "date": "2019-02-23 07:28:49",
            "diff": "swaywm_sway/issue_1/commit_b474050d7b22c9dfa425affa2c4aff551dc96a71.diff",
            "diff_additions": 7,
            "diff_deletions": 1,
            "diff_file_size": 19657,
            "diff_url": "https://github.com/swaywm/sway/commit/b474050d7b22c9dfa425affa2c4aff551dc96a71.diff",
            "exists": true,
            "files": [
                {
                    "file_additions": 4,
                    "file_deletions": 0,
                    "file_exists": true,
                    "file_name": "sway/desktop/xdg_shell.c",
                    "file_size": 17740
                },
                {
                    "file_additions": 3,
                    "file_deletions": 1,
                    "file_exists": true,
                    "file_name": "sway/xdg_decoration.c",
                    "file_size": 1917
                }
            ],
            "interesting": {
                "reopen": false,
                "status": false
            },
            "is_parent": false,
            "sha": "b474050d7b22c9dfa425affa2c4aff551dc96a71"
        },
        {
            "associated_pull_request": [],
            "date": "2019-06-02 16:22:20",
            "diff": "swaywm_sway/issue_1/commit_0d7ee81a1318e33295a715d3637ab817bd585aba.diff",
            "diff_additions": 2,
            "diff_deletions": 1,
            "diff_file_size": 30019,
            "diff_url": "https://github.com/swaywm/sway/commit/0d7ee81a1318e33295a715d3637ab817bd585aba.diff",
            "exists": true,
            "files": [
                {
                    "file_additions": 2,
                    "file_deletions": 1,
                    "file_exists": true,
                    "file_name": "sway/desktop/output.c",
                    "file_size": 30019
                }
            ],
            "interesting": {
                "reopen": false,
                "status": true
            },
            "is_parent": false,
            "sha": "0d7ee81a1318e33295a715d3637ab817bd585aba"
        },
        {
            "associated_pull_request": [
                "https://github.com/swaywm/sway/pull/4205"
            ],
            "date": "2019-06-02 16:22:20",
            "diff": "swaywm_sway/issue_1/commit_78af4ae4ca63776cfa21e097f23e47f7cef963b8.diff",
            "diff_additions": 2,
            "diff_deletions": 1,
            "diff_file_size": 30019,
            "diff_url": "https://github.com/swaywm/sway/commit/78af4ae4ca63776cfa21e097f23e47f7cef963b8.diff",
            "exists": true,
            "files": [
                {
                    "file_additions": 2,
                    "file_deletions": 1,
                    "file_exists": true,
                    "file_name": "sway/desktop/output.c",
                    "file_size": 30019
                }
            ],
            "interesting": {
                "reopen": false,
                "status": false
            },
            "is_parent": false,
            "sha": "78af4ae4ca63776cfa21e097f23e47f7cef963b8"
        },
        {
            "associated_pull_request": [
                "https://github.com/swaywm/sway/pull/4205"
            ],
            "date": "2019-06-02 16:22:20",
            "diff": "swaywm_sway/issue_1/commit_5ff330e6bc6d7400899dde768d9dfb5e41cc984a.diff",
            "diff_additions": 2,
            "diff_deletions": 1,
            "diff_file_size": 30019,
            "diff_url": "https://github.com/swaywm/sway/commit/5ff330e6bc6d7400899dde768d9dfb5e41cc984a.diff",
            "exists": true,
            "files": [
                {
                    "file_additions": 2,
                    "file_deletions": 1,
                    "file_exists": true,
                    "file_name": "sway/desktop/output.c",
                    "file_size": 30019
                }
            ],
            "interesting": {
                "reopen": false,
                "status": false
            },
            "is_parent": false,
            "sha": "5ff330e6bc6d7400899dde768d9dfb5e41cc984a"
        },
        {
            "associated_pull_request": [],
            "date": "2019-06-02 16:22:20",
            "diff": "swaywm_sway/issue_1/commit_46be87929fb01e68c4cc5a084dcaac5a71e72178.diff",
            "diff_additions": 2,
            "diff_deletions": 1,
            "diff_file_size": 30019,
            "diff_url": "https://github.com/swaywm/sway/commit/46be87929fb01e68c4cc5a084dcaac5a71e72178.diff",
            "exists": true,
            "files": [
                {
                    "file_additions": 2,
                    "file_deletions": 1,
                    "file_exists": true,
                    "file_name": "sway/desktop/output.c",
                    "file_size": 30019
                }
            ],
            "interesting": {
                "reopen": false,
                "status": true
            },
            "is_parent": false,
            "sha": "46be87929fb01e68c4cc5a084dcaac5a71e72178"
        },
        {
            "associated_pull_request": [],
            "date": "2019-06-02 16:22:20",
            "diff": "swaywm_sway/issue_1/commit_3f057eadb5336ba2ce58570484902c526993d50d.diff",
            "diff_additions": 2,
            "diff_deletions": 1,
            "diff_file_size": 30019,
            "diff_url": "https://github.com/swaywm/sway/commit/3f057eadb5336ba2ce58570484902c526993d50d.diff",
            "exists": true,
            "files": [
                {
                    "file_additions": 2,
                    "file_deletions": 1,
                    "file_exists": true,
                    "file_name": "sway/desktop/output.c",
                    "file_size": 30019
                }
            ],
            "interesting": {
                "reopen": false,
                "status": false
            },
            "is_parent": false,
            "sha": "3f057eadb5336ba2ce58570484902c526993d50d"
        },
        {
            "associated_pull_request": [
                "https://github.com/swaywm/sway/pull/4981"
            ],
            "date": "2020-02-06 14:11:24",
            "diff": "swaywm_sway/issue_1/commit_dea49e1d7b91ad656e1bbf7863288b5c70a89989.diff",
            "diff_additions": 4,
            "diff_deletions": 3,
            "diff_file_size": 22989,
            "diff_url": "https://github.com/swaywm/sway/commit/dea49e1d7b91ad656e1bbf7863288b5c70a89989.diff",
            "exists": true,
            "files": [
                {
                    "file_additions": 4,
                    "file_deletions": 3,
                    "file_exists": true,
                    "file_name": "sway/desktop/layer_shell.c",
                    "file_size": 22989
                }
            ],
            "interesting": {
                "reopen": false,
                "status": false
            },
            "is_parent": false,
            "sha": "dea49e1d7b91ad656e1bbf7863288b5c70a89989"
        },
        {
            "associated_pull_request": [
                "https://github.com/swaywm/sway/pull/4981"
            ],
            "date": "2020-02-06 14:11:24",
            "diff": "swaywm_sway/issue_1/commit_46561fc914b26d37c0ffac3c03ad09c27c2d6c2b.diff",
            "diff_additions": 4,
            "diff_deletions": 3,
            "diff_file_size": 22989,
            "diff_url": "https://github.com/swaywm/sway/commit/46561fc914b26d37c0ffac3c03ad09c27c2d6c2b.diff",
            "exists": true,
            "files": [
                {
                    "file_additions": 4,
                    "file_deletions": 3,
                    "file_exists": true,
                    "file_name": "sway/desktop/layer_shell.c",
                    "file_size": 22989
                }
            ],
            "interesting": {
                "reopen": false,
                "status": false
            },
            "is_parent": false,
            "sha": "46561fc914b26d37c0ffac3c03ad09c27c2d6c2b"
        },
        {
            "associated_pull_request": [],
            "date": "2020-02-06 14:11:24",
            "diff": "swaywm_sway/issue_1/commit_5fae87c3ca6eba8ba6ffdd062bdb26304ed6c1ff.diff",
            "diff_additions": 4,
            "diff_deletions": 3,
            "diff_file_size": 22989,
            "diff_url": "https://github.com/swaywm/sway/commit/5fae87c3ca6eba8ba6ffdd062bdb26304ed6c1ff.diff",
            "exists": true,
            "files": [
                {
                    "file_additions": 4,
                    "file_deletions": 3,
                    "file_exists": true,
                    "file_name": "sway/desktop/layer_shell.c",
                    "file_size": 22989
                }
            ],
            "interesting": {
                "reopen": false,
                "status": false
            },
            "is_parent": false,
            "sha": "5fae87c3ca6eba8ba6ffdd062bdb26304ed6c1ff"
        },
        {
            "associated_pull_request": [],
            "date": "2020-04-05 11:37:34",
            "diff": "swaywm_sway/issue_1/commit_1d44ceb144294f8215f4cc9366100305e64b3074.diff",
            "diff_additions": 4,
            "diff_deletions": 2,
            "diff_file_size": 30019,
            "diff_url": "https://github.com/swaywm/sway/commit/1d44ceb144294f8215f4cc9366100305e64b3074.diff",
            "exists": true,
            "files": [
                {
                    "file_additions": 4,
                    "file_deletions": 2,
                    "file_exists": true,
                    "file_name": "sway/desktop/output.c",
                    "file_size": 30019
                }
            ],
            "interesting": {
                "reopen": false,
                "status": false
            },
            "is_parent": false,
            "sha": "1d44ceb144294f8215f4cc9366100305e64b3074"
        },
        {
            "associated_pull_request": [],
            "date": "2020-04-05 11:37:34",
            "diff": "swaywm_sway/issue_1/commit_6a5a070ea9ccb41062aae68d89378eee03b9a6b6.diff",
            "diff_additions": 4,
            "diff_deletions": 2,
            "diff_file_size": 30019,
            "diff_url": "https://github.com/swaywm/sway/commit/6a5a070ea9ccb41062aae68d89378eee03b9a6b6.diff",
            "exists": true,
            "files": [
                {
                    "file_additions": 4,
                    "file_deletions": 2,
                    "file_exists": true,
                    "file_name": "sway/desktop/output.c",
                    "file_size": 30019
                }
            ],
            "interesting": {
                "reopen": false,
                "status": false
            },
            "is_parent": false,
            "sha": "6a5a070ea9ccb41062aae68d89378eee03b9a6b6"
        },
        {
            "associated_pull_request": [
                "https://github.com/swaywm/sway/pull/5181"
            ],
            "date": "2020-04-05 11:37:34",
            "diff": "swaywm_sway/issue_1/commit_a3085996651979605400b4f700523b694019f794.diff",
            "diff_additions": 4,
            "diff_deletions": 2,
            "diff_file_size": 30019,
            "diff_url": "https://github.com/swaywm/sway/commit/a3085996651979605400b4f700523b694019f794.diff",
            "exists": true,
            "files": [
                {
                    "file_additions": 4,
                    "file_deletions": 2,
                    "file_exists": true,
                    "file_name": "sway/desktop/output.c",
                    "file_size": 30019
                }
            ],
            "interesting": {
                "reopen": false,
                "status": false
            },
            "is_parent": false,
            "sha": "a3085996651979605400b4f700523b694019f794"
        },
        {
            "associated_pull_request": [
                "https://github.com/swaywm/sway/pull/5181"
            ],
            "date": "2020-04-05 11:37:34",
            "diff": "swaywm_sway/issue_1/commit_ac0637708f0adcf9bd754783634b9cdf5acf5a55.diff",
            "diff_additions": 4,
            "diff_deletions": 2,
            "diff_file_size": 30019,
            "diff_url": "https://github.com/swaywm/sway/commit/ac0637708f0adcf9bd754783634b9cdf5acf5a55.diff",
            "exists": true,
            "files": [
                {
                    "file_additions": 4,
                    "file_deletions": 2,
                    "file_exists": true,
                    "file_name": "sway/desktop/output.c",
                    "file_size": 30019
                }
            ],
            "interesting": {
                "reopen": false,
                "status": false
            },
            "is_parent": false,
            "sha": "ac0637708f0adcf9bd754783634b9cdf5acf5a55"
        },
        {
            "associated_pull_request": [],
            "date": "2021-04-18 00:11:59",
            "diff": "swaywm_sway/issue_1/commit_06d7969a5663066f080ad99d4ba05ec7459f2d93.diff",
            "diff_additions": 1,
            "diff_deletions": 0,
            "diff_file_size": 43311,
            "diff_url": "https://github.com/swaywm/sway/commit/06d7969a5663066f080ad99d4ba05ec7459f2d93.diff",
            "exists": true,
            "files": [
                {
                    "file_additions": 1,
                    "file_deletions": 0,
                    "file_exists": true,
                    "file_name": "sway/tree/view.c",
                    "file_size": 43311
                }
            ],
            "interesting": {
                "reopen": false,
                "status": false
            },
            "is_parent": false,
            "sha": "06d7969a5663066f080ad99d4ba05ec7459f2d93"
        },
        {
            "associated_pull_request": [
                "https://github.com/swaywm/sway/pull/6199"
            ],
            "date": "2021-04-18 00:11:59",
            "diff": "swaywm_sway/issue_1/commit_82e7cf83af1a2f7b9cfb36fa871d3aaf656dec68.diff",
            "diff_additions": 1,
            "diff_deletions": 0,
            "diff_file_size": 43311,
            "diff_url": "https://github.com/swaywm/sway/commit/82e7cf83af1a2f7b9cfb36fa871d3aaf656dec68.diff",
            "exists": true,
            "files": [
                {
                    "file_additions": 1,
                    "file_deletions": 0,
                    "file_exists": true,
                    "file_name": "sway/tree/view.c",
                    "file_size": 43311
                }
            ],
            "interesting": {
                "reopen": false,
                "status": false
            },
            "is_parent": false,
            "sha": "82e7cf83af1a2f7b9cfb36fa871d3aaf656dec68"
        },
        {
            "associated_pull_request": [
                "https://github.com/swaywm/sway/pull/6199"
            ],
            "date": "2021-04-18 00:11:59",
            "diff": "swaywm_sway/issue_1/commit_8529141150ef2d9a07b9c0fad193bdbc12d3ad42.diff",
            "diff_additions": 1,
            "diff_deletions": 0,
            "diff_file_size": 43311,
            "diff_url": "https://github.com/swaywm/sway/commit/8529141150ef2d9a07b9c0fad193bdbc12d3ad42.diff",
            "exists": true,
            "files": [
                {
                    "file_additions": 1,
                    "file_deletions": 0,
                    "file_exists": true,
                    "file_name": "sway/tree/view.c",
                    "file_size": 43311
                }
            ],
            "interesting": {
                "reopen": false,
                "status": false
            },
            "is_parent": false,
            "sha": "8529141150ef2d9a07b9c0fad193bdbc12d3ad42"
        },
        {
            "associated_pull_request": [
                "https://github.com/swaywm/sway/pull/6240"
            ],
            "date": "2021-04-29 06:49:04",
            "diff": "swaywm_sway/issue_1/commit_e8dd2adfb136e94b7e2c02038b848979bc009299.diff",
            "diff_additions": 1,
            "diff_deletions": 1,
            "diff_file_size": 43311,
            "diff_url": "https://github.com/swaywm/sway/commit/e8dd2adfb136e94b7e2c02038b848979bc009299.diff",
            "exists": true,
            "files": [
                {
                    "file_additions": 1,
                    "file_deletions": 1,
                    "file_exists": true,
                    "file_name": "sway/tree/view.c",
                    "file_size": 43311
                }
            ],
            "interesting": {
                "reopen": false,
                "status": false
            },
            "is_parent": false,
            "sha": "e8dd2adfb136e94b7e2c02038b848979bc009299"
        },
        {
            "associated_pull_request": [
                "https://github.com/swaywm/sway/pull/6240"
            ],
            "date": "2021-04-29 06:49:04",
            "diff": "swaywm_sway/issue_1/commit_30e400c0a3d5d11ba15dc4ab6cdcfe2e71cfce01.diff",
            "diff_additions": 1,
            "diff_deletions": 1,
            "diff_file_size": 43311,
            "diff_url": "https://github.com/swaywm/sway/commit/30e400c0a3d5d11ba15dc4ab6cdcfe2e71cfce01.diff",
            "exists": true,
            "files": [
                {
                    "file_additions": 1,
                    "file_deletions": 1,
                    "file_exists": true,
                    "file_name": "sway/tree/view.c",
                    "file_size": 43311
                }
            ],
            "interesting": {
                "reopen": false,
                "status": false
            },
            "is_parent": false,
            "sha": "30e400c0a3d5d11ba15dc4ab6cdcfe2e71cfce01"
        }
    ],
    "first_commit": "2018-06-25 00:45:03",
    "last_commit": "2021-04-29 07:06:05",
    "number": 1,
    "pull_request": "None",
    "score": {
        "accidental_reopen_likely": false,
        "all_labels": [],
        "contains_keywords": [
            "error",
            "bug",
            "crash",
            "fix",
            "patch",
            "remov",
            "work",
            "leak"
        ],
        "fix_size": 203,
        "has_labels": [],
        "intersecting": {
            "computed_score": 1.0,
            "final_commit_size": 2,
            "intersection_size": 2,
            "previous_commits_size": 203
        },
        "is_makefile_based": false,
        "no_new_files": [],
        "no_other_files": false,
        "num_prohibited_files": 533540,
        "prohibited_files": [
            "hal/inc/pinmap_hal.h",
            "Debug/marvin.bin",
            "Debug/marvin.elf",
            "Debug/marvin.hex",
            "Debug/marvin.bin",
            "Debug/marvin.elf",
            "Debug/marvin.hex",
            "inc/spark_utilities.h",
            "Debug/marvin.bin",
            "Debug/marvin.elf"
        ],
        "reopen": false,
        "reopen_events": [
            [
                "2015-08-06 12:39:32",
                "closed"
            ],
            [
                "2018-06-26 12:22:37",
                "commit"
            ],
            [
                "2018-06-30 13:42:59",
                "commit"
            ],
            [
                "2018-07-04 05:46:17",
                "commit"
            ],
            [
                "2018-07-04 05:47:05",
                "commit"
            ],
            [
                "2018-07-04 08:59:34",
                "commit"
            ],
            [
                "2018-07-04 09:47:46",
                "commit"
            ],
            [
                "2018-10-07 07:34:36",
                "commit"
            ],
            [
                "2018-10-07 07:36:36",
                "commit"
            ],
            [
                "2019-02-21 07:40:11",
                "commit"
            ],
            [
                "2019-02-21 07:40:11",
                "commit"
            ],
            [
                "2019-02-21 10:33:20",
                "commit"
            ],
            [
                "2019-02-21 10:33:20",
                "commit"
            ],
            [
                "2019-02-22 05:46:52",
                "commit"
            ],
            [
                "2019-02-22 05:53:01",
                "commit"
            ],
            [
                "2019-02-23 07:30:57",
                "commit"
            ],
            [
                "2019-02-23 07:31:29",
                "commit"
            ],
            [
                "2019-02-23 07:59:00",
                "commit"
            ],
            [
                "2019-02-23 08:03:08",
                "commit"
            ],
            [
                "2019-02-25 22:10:11",
                "commit"
            ],
            [
                "2019-02-25 22:10:11",
                "commit"
            ],
            [
                "2019-02-25 22:10:11",
                "commit"
            ],
            [
                "2019-02-25 22:10:11",
                "commit"
            ],
            [
                "2019-06-02 16:25:27",
                "commit"
            ],
            [
                "2019-06-02 16:31:48",
                "commit"
            ],
            [
                "2019-06-02 16:36:22",
                "commit"
            ],
            [
                "2019-06-03 12:42:22",
                "commit"
            ],
            [
                "2019-12-05 17:44:45",
                "commit"
            ],
            [
                "2020-02-06 14:15:09",
                "commit"
            ],
            [
                "2020-02-06 16:20:02",
                "commit"
            ],
            [
                "2020-02-07 14:02:02",
                "commit"
            ],
            [
                "2020-04-05 11:39:18",
                "commit"
            ],
            [
                "2020-04-05 12:00:27",
                "commit"
            ],
            [
                "2020-04-10 07:50:39",
                "commit"
            ],
            [
                "2020-04-10 08:20:23",
                "commit"
            ],
            [
                "2021-04-18 00:14:21",
                "commit"
            ],
            [
                "2021-04-18 00:17:23",
                "commit"
            ],
            [
                "2021-04-22 21:19:10",
                "commit"
            ],
            [
                "2021-04-29 06:56:09",
                "commit"
            ],
            [
                "2021-04-29 07:06:07",
                "commit"
            ]
        ],
        "status": true,
        "strategy": true,
        "total_changes": 352
    }
}