{
    "covered_issues": [
        215,
        211,
        207,
        206,
        201,
        200,
        199,
        196,
        194,
        193,
        192,
        191,
        189,
        187,
        186,
        185,
        184,
        183,
        182,
        180,
        179,
        177,
        176,
        171,
        170,
        169,
        166,
        165,
        164,
        163,
        161,
        160,
        159,
        158,
        157,
        155,
        154,
        153,
        152,
        150,
        149,
        147,
        145,
        144,
        143,
        141,
        140,
        139,
        138,
        136,
        135,
        134,
        131,
        130,
        129,
        128,
        127,
        126,
        125,
        123,
        122,
        121,
        120,
        119,
        118,
        117,
        116,
        115,
        114,
        113,
        112,
        111,
        110,
        109,
        106,
        105,
        104,
        103,
        102,
        101,
        99,
        98,
        97,
        95,
        94,
        93,
        92,
        91,
        90,
        83,
        82,
        81,
        80,
        79,
        78,
        77,
        75,
        73,
        72,
        71,
        70,
        69,
        66,
        65,
        64,
        63,
        62,
        59,
        58,
        57,
        56,
        55,
        54,
        53,
        52,
        51,
        50,
        49,
        48,
        47,
        46,
        45,
        44,
        43,
        42,
        41,
        40,
        39,
        38,
        37,
        36,
        35,
        34,
        33,
        32,
        31,
        30,
        29,
        28,
        27,
        26,
        25,
        23,
        22,
        21,
        20,
        19,
        18,
        17,
        16,
        15,
        14,
        13,
        11,
        9,
        7,
        6,
        2
    ],
    "finished": true
}