{
    "covered_issues": [
        374,
        373,
        370,
        369,
        368,
        367,
        366,
        363,
        362,
        361,
        359,
        354,
        348,
        346,
        344,
        343,
        342,
        337,
        336,
        335,
        332,
        331,
        330,
        328,
        327,
        323,
        319,
        317,
        316,
        315,
        314,
        312,
        309,
        308,
        306,
        305,
        303,
        302,
        300,
        299,
        298,
        297,
        296,
        295,
        293,
        290,
        289,
        284,
        283,
        281,
        269,
        268,
        267,
        262,
        261,
        260,
        256,
        253,
        252,
        250,
        248,
        247,
        245,
        244,
        243,
        241,
        239,
        238,
        237,
        236,
        234,
        231,
        230,
        229,
        228,
        225,
        223,
        219,
        218,
        217,
        216,
        215,
        213,
        212,
        211,
        204,
        203,
        202,
        199,
        196,
        192,
        191,
        190,
        189,
        184,
        182,
        181,
        180,
        179,
        178,
        175,
        174,
        170,
        169,
        168,
        165,
        164,
        162,
        160,
        159,
        157,
        156,
        155,
        152,
        151,
        150,
        149,
        144,
        143,
        142,
        140,
        139,
        138,
        135,
        134,
        133,
        132,
        131,
        130,
        129,
        127,
        125,
        123,
        120,
        119,
        114,
        112,
        111,
        108,
        107,
        106,
        104,
        103,
        102,
        101,
        99,
        98,
        96,
        93,
        91,
        88,
        86,
        85,
        84,
        83,
        82,
        81,
        79,
        78,
        77,
        72,
        71,
        70,
        68,
        67,
        66,
        65,
        64,
        63,
        60,
        59,
        58,
        57,
        56,
        54,
        52,
        50,
        49,
        48,
        47,
        46,
        45,
        41,
        40,
        39,
        38,
        36,
        35,
        34,
        33,
        32,
        31,
        30,
        27,
        26,
        25,
        24,
        23,
        20,
        16,
        15,
        11,
        10,
        8,
        5,
        4,
        3,
        2
    ],
    "finished": true
}