{
    "covered_issues": [
        56,
        55,
        54,
        53,
        52,
        51,
        50,
        49,
        48,
        46,
        45,
        42,
        41,
        40,
        39,
        38,
        37,
        36,
        35,
        34,
        33,
        31,
        29,
        28,
        27,
        26,
        25,
        24,
        23,
        22,
        21,
        20,
        19,
        18,
        16,
        15,
        14,
        13,
        12,
        11,
        9,
        8,
        7,
        6,
        5,
        4,
        3,
        1
    ],
    "finished": true
}