{
    "covered_issues": [
        251,
        240,
        236,
        235,
        234,
        230,
        229,
        228,
        226,
        224,
        223,
        222,
        221,
        220,
        217,
        216,
        215,
        214,
        212,
        211,
        210,
        209,
        208,
        207,
        206,
        204,
        203,
        202,
        201,
        198,
        196,
        195,
        194,
        193,
        192,
        191,
        190,
        189,
        188,
        187,
        186,
        185,
        184,
        183,
        182,
        181,
        180,
        178,
        177,
        176,
        175,
        174,
        173,
        172,
        171,
        170,
        169,
        164,
        162,
        161,
        160,
        158,
        157,
        156,
        155,
        154,
        153,
        151,
        149,
        148,
        147,
        145,
        144,
        141,
        140,
        139,
        136,
        133,
        132,
        131,
        128,
        127,
        126,
        125,
        124,
        123,
        120,
        118,
        117,
        115,
        113,
        111,
        110,
        107,
        103,
        102,
        101,
        99,
        98,
        97,
        94,
        93,
        87,
        86,
        84,
        83,
        82,
        80,
        77,
        76,
        74,
        73,
        71,
        69,
        67,
        66,
        65,
        62,
        61,
        60,
        57,
        51,
        50,
        49,
        47,
        46,
        45,
        44,
        43,
        40,
        39,
        38,
        33,
        32,
        30,
        29,
        27,
        24,
        23,
        22,
        20,
        19,
        18,
        16,
        15,
        14,
        12,
        9,
        8,
        4,
        3,
        2
    ],
    "finished": true
}