{
    "covered_issues": [
        4681,
        4677,
        4650,
        4632,
        4614,
        4609,
        4603,
        4600,
        4599,
        4598,
        4595,
        4594,
        4593,
        4592,
        4591,
        4590,
        4585,
        4566,
        4546,
        4545,
        4542,
        4539,
        4532,
        4527,
        4520,
        4518,
        4512,
        4504,
        4501,
        4498,
        4494,
        4492,
        4486,
        4482,
        4480,
        4473,
        4471,
        4449,
        4448,
        4443,
        4439,
        4433,
        4430,
        4413,
        4408,
        4403,
        4400,
        4387,
        4376,
        4371,
        4368,
        4359,
        4358,
        4349,
        4343,
        4332,
        4331,
        4315,
        4310,
        4309,
        4300,
        4296,
        4290,
        4287,
        4285,
        4284,
        4283,
        4278,
        4275,
        4274,
        4263,
        4260,
        4259,
        4258,
        4250,
        4247,
        4246,
        4236,
        4230,
        4227,
        4226,
        4223,
        4220,
        4205,
        4203,
        4199,
        4187,
        4182,
        4179,
        4178,
        4177,
        4176,
        4170,
        4159,
        4157,
        4156,
        4155,
        4149,
        4146,
        4140,
        4139,
        4138,
        4136,
        4130,
        4126,
        4122,
        4119,
        4106,
        4277,
        4100,
        4090,
        4083,
        4079,
        4072,
        4071,
        4070,
        4069,
        4062,
        4061,
        4060,
        4042,
        4036,
        4035,
        4034,
        4033,
        4027,
        4026,
        4020,
        4013,
        4006,
        4001,
        3993,
        3992,
        3989,
        3988,
        3981,
        3980,
        3961,
        3956,
        3954,
        3943,
        3931,
        3924,
        3923,
        3918,
        3917,
        3915,
        3914,
        3906,
        3904,
        3882,
        3876,
        3868,
        3867,
        3856,
        3854,
        3848,
        3829,
        3822,
        3820,
        3818,
        3812,
        3811,
        3808,
        3806,
        3787,
        3785,
        3777,
        3776,
        3765,
        3759,
        3758,
        3755,
        3749,
        3744,
        3740,
        3739,
        3738,
        3734,
        3733,
        3731,
        3728,
        3716,
        3714,
        3709,
        3701,
        3696,
        3694,
        3693,
        3691,
        3688,
        3687,
        3684,
        3683,
        3682,
        3678,
        3676,
        3674,
        3673,
        3671,
        3664,
        3652,
        3651,
        3646,
        3643,
        3642,
        3641,
        3640,
        3638,
        3636,
        3635,
        3632,
        3625,
        3623,
        3622,
        3614,
        3612,
        3609,
        3605,
        3601,
        3598,
        3596,
        3592,
        3590,
        3584,
        3581,
        3578,
        3574,
        3573,
        3571,
        3570,
        3560,
        3552,
        3551,
        3548,
        3545,
        3544,
        3542,
        3541,
        3539,
        3535,
        3534,
        3533,
        3525,
        3514,
        3510,
        3506,
        3505,
        3497,
        3494,
        3491,
        3475,
        3472,
        3469,
        3465,
        3463,
        3461,
        3460,
        3456,
        3454,
        3451,
        3450,
        3443,
        3429,
        3424,
        3422,
        3418,
        3417,
        3410,
        3409,
        3402,
        3397,
        3394,
        3391,
        3385,
        3384,
        3382,
        3377,
        3374,
        3367,
        3360,
        3350,
        3337,
        3331,
        3328,
        3321,
        3319,
        3318,
        3317,
        3314,
        3308,
        3299,
        3297,
        3296,
        3289,
        3276,
        3275,
        3274,
        3267,
        3261,
        3256,
        3255,
        3248,
        3243,
        3241,
        3240,
        3232,
        3227,
        3223,
        3219,
        3218,
        3217,
        3215,
        3210,
        3202,
        3198,
        3197,
        3184,
        3183,
        3182,
        3181,
        3178,
        3173,
        3169,
        3168,
        3167,
        3162,
        3156,
        3152,
        3148,
        3137,
        3131,
        3124,
        3118,
        3113,
        3111,
        3110,
        3105,
        3101,
        3096,
        3081,
        3080,
        3076,
        3073,
        3068,
        3065,
        3061,
        3057,
        3055,
        3053,
        3052,
        3049,
        3039,
        3030,
        3023,
        3011,
        3010,
        3009,
        3008,
        3005,
        3004,
        3003,
        2996,
        2991,
        2986,
        2981,
        2978,
        2976,
        2975,
        2962,
        2960,
        2959,
        2958,
        2957,
        2953,
        2941,
        2939,
        2938,
        2934,
        2929,
        2927,
        2924,
        2918,
        2916,
        2915,
        2913,
        2912,
        2908,
        2906,
        2904,
        2900,
        2897,
        2893,
        2891,
        2889,
        2880,
        2879,
        2877,
        2871,
        2861,
        2856,
        2852,
        2850,
        2848,
        2843,
        2842,
        2841,
        2839,
        2836,
        2831,
        2830,
        2828,
        2826,
        2825,
        2824,
        2823,
        2822,
        2821,
        2820,
        2819,
        2817,
        2814,
        2813,
        2812,
        2801,
        2800,
        2799,
        2793,
        2790,
        2777,
        2776,
        2773,
        2771,
        2765,
        2764,
        2760,
        2759,
        2751,
        2741,
        2734,
        2732,
        2730,
        2729,
        2726,
        2721,
        2720,
        2718,
        2717,
        2713,
        2712,
        2703,
        2702,
        2697,
        2694,
        2692,
        2690,
        2689,
        2682,
        2681,
        2679,
        2677,
        2675,
        2674,
        2670,
        2667,
        2658,
        2649,
        2646,
        2642,
        2641,
        2635,
        2631,
        2630,
        2625,
        2614,
        2613,
        2612,
        2611,
        2610,
        2609,
        2598,
        2597,
        2595,
        2585,
        2581,
        2580,
        2579,
        2578,
        2577,
        2576,
        2575,
        2574,
        2573,
        2572,
        2568,
        2566,
        2560,
        2545,
        2540,
        2532,
        2521,
        2518,
        2513,
        2508,
        2504,
        2498,
        2497,
        2491,
        2488,
        2484,
        2480,
        2479,
        2476,
        2474,
        2473,
        2470,
        2466,
        2463,
        2462,
        2461,
        2460,
        2457,
        2456,
        2454,
        2452,
        2450,
        2448,
        2447,
        2446,
        2444,
        2431,
        2428,
        2424,
        2420,
        2407,
        2400,
        2393,
        2390,
        2380,
        2377,
        2374,
        2369,
        2368,
        2365,
        2364,
        2362,
        2361,
        2360,
        2357,
        2353,
        2349,
        2344,
        2340,
        2336,
        2334,
        2328,
        2324,
        2322,
        2317,
        2309,
        2307,
        2306,
        2304,
        2298,
        2292,
        2284,
        2276,
        2270,
        2264,
        2263,
        2262,
        2246,
        2239,
        2238,
        2237,
        2234,
        2233,
        2229,
        2228,
        2212,
        2206,
        2203,
        2202,
        2200,
        2195,
        2187,
        2180,
        2179,
        2177,
        2176,
        2172,
        2171,
        2165,
        2163,
        2156,
        2152,
        2148,
        2141,
        2138,
        2131,
        2126,
        2124,
        2116,
        2112,
        2106,
        2105,
        2094,
        2093,
        2090,
        2084,
        2080,
        2078,
        2073,
        2071,
        2070,
        2065,
        2053,
        2051,
        2048,
        2042,
        2040,
        2038,
        2030,
        2020,
        2014,
        2010,
        2004,
        2002,
        1993,
        1990,
        1988,
        1986,
        1982,
        1969,
        1964,
        1963,
        1962,
        1961,
        1960,
        1959,
        1953,
        1949,
        1945,
        1943,
        1936,
        1934,
        1925,
        1921,
        1919,
        1916,
        1912,
        1909,
        1901,
        1896,
        1891,
        1882,
        1877,
        1873,
        1870,
        1866,
        1863,
        1859,
        1857,
        1855,
        1851,
        1835,
        1832,
        1831,
        1827,
        1825,
        1824,
        1822,
        1821,
        1820,
        1804,
        1803,
        1793,
        1786,
        1780,
        1779,
        1778,
        1776,
        1775,
        1774,
        1773,
        1772,
        1771,
        1770,
        1769,
        1768,
        1761,
        1760,
        1759,
        1757,
        1756,
        1755,
        1751,
        1747,
        1738,
        1737,
        1736,
        1734,
        1733,
        1731,
        1730,
        1726,
        1722,
        1720,
        1719,
        1714,
        1712,
        1705,
        1703,
        1699,
        1696,
        1695,
        1692,
        1690,
        1682,
        1681,
        1678,
        1677,
        1676,
        1673,
        1672,
        1669,
        1667,
        1656,
        1655,
        1653,
        1652,
        1648,
        1640,
        1635,
        1626,
        1616,
        1609,
        1599,
        1598,
        1591,
        1587,
        1586,
        1583,
        1581,
        1576,
        1570,
        1563,
        1562,
        1557,
        1545,
        1543,
        1534,
        1533,
        1521,
        1514,
        1513,
        1509,
        1506,
        1504,
        1503,
        1502,
        1501,
        1500,
        1499,
        1494,
        1492,
        1489,
        1471,
        1468,
        1465,
        1460,
        1455,
        1453,
        1452,
        1447,
        1446,
        1445,
        1440,
        1439,
        1436,
        1431,
        1430,
        1428,
        1426,
        1425,
        1424,
        1423,
        1422,
        1415,
        1413,
        1411,
        1410,
        1409,
        1408,
        1407,
        1406,
        1403,
        1400,
        1396,
        1395,
        1392,
        1391,
        1386,
        1384,
        1383,
        1380,
        1379,
        1378,
        1377,
        1375,
        1374,
        1373,
        1372,
        1370,
        1366,
        1365,
        1364,
        1363,
        1362,
        1361,
        1360,
        1356,
        1351,
        1350,
        1349,
        1343,
        1341,
        1339,
        1334,
        1329,
        1328,
        1325,
        1323,
        1320,
        1318,
        1317,
        1310,
        1308,
        1306,
        1305,
        1300,
        1298,
        1296,
        1295,
        1294,
        1293,
        1292,
        1290,
        1279,
        1277,
        1276,
        1275,
        1274,
        1273,
        1270,
        1269,
        1264,
        1261,
        1258,
        1253,
        1249,
        1248,
        1247,
        1245,
        1242,
        1241,
        1240,
        1239,
        1237,
        1234,
        1231,
        1229,
        1227,
        1226,
        1224,
        1222,
        1221,
        1220,
        1217,
        1212,
        1207,
        1205,
        1204,
        1202,
        1200,
        1199,
        1198,
        1197,
        1191,
        1189,
        1188,
        1187,
        1185,
        1182,
        1179,
        1178,
        1177,
        1176,
        1175,
        1174,
        1173,
        1169,
        1168,
        1167,
        1166,
        1162,
        1156,
        1153,
        1152,
        1151,
        1150,
        1149,
        1146,
        1145,
        1144,
        1143,
        1140,
        1138,
        1137,
        1134,
        1132,
        1127,
        1118,
        1111,
        1107,
        1106,
        1105,
        1101,
        1099,
        1098,
        1095,
        1090,
        1089,
        1087,
        1083,
        1078,
        1077,
        1076,
        1074,
        1073,
        1072,
        1068,
        1065,
        1064,
        1063,
        1057,
        1056,
        1055,
        1054,
        1048,
        1047,
        1044,
        1043,
        1042,
        1036,
        1034,
        1029,
        1028,
        1027,
        1022,
        1019,
        1017,
        1014,
        1011,
        1009,
        1008,
        1005,
        1002,
        1001,
        1000,
        999,
        998,
        994,
        990,
        987,
        979,
        973,
        971,
        970,
        968,
        967,
        966,
        964,
        959,
        958,
        957,
        956,
        949,
        946,
        945,
        943,
        942,
        940,
        935,
        934,
        933,
        932,
        931,
        920,
        919,
        917,
        916,
        914,
        910,
        908,
        906,
        904,
        903,
        894,
        893,
        892,
        889,
        888,
        883,
        881,
        878,
        874,
        870,
        869,
        865,
        863,
        862,
        859,
        854,
        849,
        848,
        841,
        839,
        833,
        831,
        827,
        826,
        824,
        821,
        808,
        807,
        806,
        805,
        804,
        799,
        798,
        796,
        793,
        792,
        788,
        786,
        781,
        780,
        776,
        773,
        772,
        766,
        765,
        758,
        754,
        753,
        748,
        746,
        745,
        742,
        726,
        716,
        714,
        713,
        712,
        710,
        701,
        700,
        697,
        695,
        693,
        692,
        690,
        688,
        687,
        685,
        680,
        679,
        677,
        676,
        674,
        673,
        670,
        669,
        668,
        667,
        663,
        662,
        661,
        659,
        658,
        656,
        655,
        653,
        652,
        651,
        648,
        647,
        646,
        645,
        644,
        643,
        641,
        640,
        639,
        638,
        631,
        624,
        623,
        620,
        617,
        614,
        612,
        610,
        605,
        600,
        599,
        597,
        596,
        595,
        594,
        593,
        591,
        589,
        588,
        587,
        586,
        585,
        584,
        583,
        582,
        577,
        576,
        575,
        573,
        572,
        570,
        560,
        558,
        553,
        551,
        549,
        547,
        545,
        542,
        539,
        537,
        535,
        534,
        529,
        525,
        521,
        520,
        518,
        515,
        514,
        513,
        507,
        506,
        504,
        498,
        495,
        487,
        485,
        484,
        478,
        477,
        476,
        472,
        470,
        469,
        467,
        465,
        464,
        459,
        458,
        454,
        450,
        449,
        446,
        441,
        439,
        437,
        436,
        434,
        430,
        428,
        427,
        424,
        423,
        421,
        420,
        418,
        417,
        414,
        407,
        406,
        403,
        402,
        401,
        396,
        395,
        394,
        390,
        385,
        384,
        383,
        374,
        372,
        366,
        365,
        362,
        361,
        360,
        357,
        356,
        355,
        353,
        352,
        339,
        331,
        329,
        323,
        319,
        318,
        317,
        314,
        308,
        307,
        306,
        304,
        299,
        298,
        294,
        290,
        288,
        287,
        286,
        284,
        283,
        281,
        276,
        274,
        273,
        271,
        268,
        266,
        265,
        261,
        260,
        258,
        257,
        254,
        253,
        249,
        248,
        247,
        244,
        242,
        241,
        240,
        228,
        227,
        226,
        225,
        221,
        219,
        218,
        213,
        206,
        205,
        203,
        202,
        201,
        199,
        197,
        194,
        193,
        192,
        190,
        189,
        186,
        185,
        183,
        182,
        181,
        180,
        178,
        176,
        175,
        174,
        173,
        168,
        161,
        154,
        150,
        149,
        147,
        146,
        144,
        142,
        141,
        140,
        138,
        137,
        132,
        131,
        129,
        124,
        121,
        117,
        111,
        109,
        105,
        102,
        96,
        95,
        94,
        93,
        92,
        87,
        86,
        85,
        83,
        80,
        76,
        75,
        67,
        62,
        59,
        49
    ],
    "finished": true
}