{
    "covered_issues": [
        163,
        150,
        132,
        125,
        121,
        111,
        93,
        88,
        73,
        67,
        63,
        52,
        45,
        43,
        38,
        34,
        28,
        15,
        7,
        5,
        2,
        1
    ],
    "finished": true
}