{
    "category": [
        "build/refactor/preprocessing"
    ],
    "commits": [
        {
            "associated_pull_request": [],
            "date": "2019-05-31 21:21:23",
            "diff": "openssl_openssl/issue_9043/commit_b6af19d4c231807054a929d038102eda106e5382.diff",
            "diff_additions": 4,
            "diff_deletions": 2,
            "diff_file_size": 7073,
            "diff_url": "https://github.com/openssl/openssl/commit/b6af19d4c231807054a929d038102eda106e5382.diff",
            "exists": true,
            "files": [
                {
                    "file_additions": 4,
                    "file_deletions": 2,
                    "file_exists": true,
                    "file_name": "crypto/x509/t_req.c",
                    "file_size": 7073
                }
            ],
            "interesting": {
                "reopen": false,
                "status": false
            },
            "is_parent": false,
            "sha": "b6af19d4c231807054a929d038102eda106e5382"
        },
        {
            "associated_pull_request": [],
            "date": "2019-07-08 10:14:50",
            "diff": "openssl_openssl/issue_9043/commit_9fd6f7d1cd2a3c8e2bc69dcb8bde8406eb6c2623.diff",
            "diff_additions": 18,
            "diff_deletions": 2,
            "diff_file_size": 65381,
            "diff_url": "https://github.com/openssl/openssl/commit/9fd6f7d1cd2a3c8e2bc69dcb8bde8406eb6c2623.diff",
            "exists": true,
            "files": [
                {
                    "file_additions": 12,
                    "file_deletions": 2,
                    "file_exists": true,
                    "file_name": "apps/req.c",
                    "file_size": 53892
                },
                {
                    "file_additions": 4,
                    "file_deletions": 0,
                    "file_exists": true,
                    "file_name": "crypto/x509/t_req.c",
                    "file_size": 7073
                },
                {
                    "file_additions": 2,
                    "file_deletions": 0,
                    "file_exists": true,
                    "file_name": "crypto/x509/x509_err.c",
                    "file_size": 4416
                }
            ],
            "interesting": {
                "reopen": false,
                "status": true
            },
            "is_parent": false,
            "sha": "9fd6f7d1cd2a3c8e2bc69dcb8bde8406eb6c2623"
        },
        {
            "associated_pull_request": [],
            "date": "2019-07-08 10:14:50",
            "diff": "openssl_openssl/issue_9043/commit_9fd6f7d1cd2a3c8e2bc69dcb8bde8406eb6c2623.diff",
            "diff_additions": 18,
            "diff_deletions": 2,
            "diff_file_size": 65381,
            "diff_url": "https://github.com/openssl/openssl/commit/9fd6f7d1cd2a3c8e2bc69dcb8bde8406eb6c2623.diff",
            "exists": true,
            "files": [
                {
                    "file_additions": 12,
                    "file_deletions": 2,
                    "file_exists": true,
                    "file_name": "apps/req.c",
                    "file_size": 53892
                },
                {
                    "file_additions": 4,
                    "file_deletions": 0,
                    "file_exists": true,
                    "file_name": "crypto/x509/t_req.c",
                    "file_size": 7073
                },
                {
                    "file_additions": 2,
                    "file_deletions": 0,
                    "file_exists": true,
                    "file_name": "crypto/x509/x509_err.c",
                    "file_size": 4416
                }
            ],
            "interesting": {
                "reopen": false,
                "status": true
            },
            "is_parent": false,
            "sha": "9fd6f7d1cd2a3c8e2bc69dcb8bde8406eb6c2623"
        },
        {
            "associated_pull_request": [],
            "date": "2019-07-08 10:14:50",
            "diff": "openssl_openssl/issue_9043/commit_a48cd0c5b9fef42321fc16ea6a40c30c0e1712d4.diff",
            "diff_additions": 18,
            "diff_deletions": 2,
            "diff_file_size": 65381,
            "diff_url": "https://github.com/openssl/openssl/commit/a48cd0c5b9fef42321fc16ea6a40c30c0e1712d4.diff",
            "exists": true,
            "files": [
                {
                    "file_additions": 12,
                    "file_deletions": 2,
                    "file_exists": true,
                    "file_name": "apps/req.c",
                    "file_size": 53892
                },
                {
                    "file_additions": 4,
                    "file_deletions": 0,
                    "file_exists": true,
                    "file_name": "crypto/x509/t_req.c",
                    "file_size": 7073
                },
                {
                    "file_additions": 2,
                    "file_deletions": 0,
                    "file_exists": true,
                    "file_name": "crypto/x509/x509_err.c",
                    "file_size": 4416
                }
            ],
            "interesting": {
                "reopen": false,
                "status": true
            },
            "is_parent": false,
            "sha": "a48cd0c5b9fef42321fc16ea6a40c30c0e1712d4"
        },
        {
            "associated_pull_request": [],
            "date": "2019-07-08 03:39:20",
            "diff": "openssl_openssl/issue_9043/commit_ce4452b60cd3cb4786c3b73b0af1d7cb7702dbe5.diff",
            "diff_additions": 18,
            "diff_deletions": 3,
            "diff_file_size": 65381,
            "diff_url": "https://github.com/openssl/openssl/commit/ce4452b60cd3cb4786c3b73b0af1d7cb7702dbe5.diff",
            "exists": true,
            "files": [
                {
                    "file_additions": 12,
                    "file_deletions": 2,
                    "file_exists": true,
                    "file_name": "apps/req.c",
                    "file_size": 53892
                },
                {
                    "file_additions": 4,
                    "file_deletions": 0,
                    "file_exists": true,
                    "file_name": "crypto/x509/t_req.c",
                    "file_size": 7073
                },
                {
                    "file_additions": 2,
                    "file_deletions": 1,
                    "file_exists": true,
                    "file_name": "crypto/x509/x509_err.c",
                    "file_size": 4416
                }
            ],
            "interesting": {
                "reopen": false,
                "status": true
            },
            "is_parent": false,
            "sha": "ce4452b60cd3cb4786c3b73b0af1d7cb7702dbe5"
        },
        {
            "associated_pull_request": [
                "https://github.com/EktapopaT/openssl/pull/1"
            ],
            "date": "2019-07-08 03:39:20",
            "diff": "openssl_openssl/issue_9043/commit_04151456b9d896a7825a5ac77c0310c97fa5f650.diff",
            "diff_additions": 18,
            "diff_deletions": 3,
            "diff_file_size": 65381,
            "diff_url": "https://github.com/openssl/openssl/commit/04151456b9d896a7825a5ac77c0310c97fa5f650.diff",
            "exists": true,
            "files": [
                {
                    "file_additions": 12,
                    "file_deletions": 2,
                    "file_exists": true,
                    "file_name": "apps/req.c",
                    "file_size": 53892
                },
                {
                    "file_additions": 4,
                    "file_deletions": 0,
                    "file_exists": true,
                    "file_name": "crypto/x509/t_req.c",
                    "file_size": 7073
                },
                {
                    "file_additions": 2,
                    "file_deletions": 1,
                    "file_exists": true,
                    "file_name": "crypto/x509/x509_err.c",
                    "file_size": 4416
                }
            ],
            "interesting": {
                "reopen": false,
                "status": false
            },
            "is_parent": false,
            "sha": "04151456b9d896a7825a5ac77c0310c97fa5f650"
        }
    ],
    "first_commit": "2019-05-31 21:21:23",
    "last_commit": "2019-07-08 03:39:20",
    "number": 9043,
    "pull_request": "None",
    "score": {
        "accidental_reopen_likely": false,
        "all_labels": [],
        "contains_keywords": [],
        "fix_size": 53,
        "has_labels": [],
        "intersecting": {
            "computed_score": 1.0,
            "final_commit_size": 21,
            "intersection_size": 21,
            "previous_commits_size": 53
        },
        "is_makefile_based": false,
        "no_new_files": [],
        "no_other_files": false,
        "num_prohibited_files": 154689,
        "prohibited_files": [
            "hal/inc/pinmap_hal.h",
            "Debug/marvin.bin",
            "Debug/marvin.elf",
            "Debug/marvin.hex",
            "Debug/marvin.bin",
            "Debug/marvin.elf",
            "Debug/marvin.hex",
            "inc/spark_utilities.h",
            "Debug/marvin.bin",
            "Debug/marvin.elf"
        ],
        "reopen": false,
        "reopen_events": [
            [
                "2019-05-31 20:40:43",
                "commit"
            ],
            [
                "2019-05-31 21:05:29",
                "commit"
            ],
            [
                "2019-05-31 21:15:27",
                "commit"
            ],
            [
                "2019-05-31 21:22:17",
                "commit"
            ],
            [
                "2019-07-08 10:15:49",
                "commit"
            ],
            [
                "2019-07-08 10:16:59",
                "closed"
            ],
            [
                "2019-07-08 10:16:59",
                "commit"
            ],
            [
                "2019-07-08 10:18:34",
                "commit"
            ],
            [
                "2019-07-08 10:32:59",
                "commit"
            ],
            [
                "2019-07-08 10:38:11",
                "commit"
            ],
            [
                "2019-07-08 21:26:05",
                "commit"
            ],
            [
                "2019-07-08 21:43:32",
                "commit"
            ],
            [
                "2019-07-08 23:45:54",
                "commit"
            ]
        ],
        "status": true,
        "strategy": true,
        "total_changes": 108
    }
}