{
    "commits": [
        {
            "associated_pull_request": [],
            "date": "2022-04-15 09:47:03+00:00",
            "diff": "haproxy_haproxy/issue_1660/commit_f7ff9cbfe123131d9ffa215d5cfca9a5357d1b6d.diff",
            "diff_additions": 33,
            "diff_deletions": 4,
            "diff_file_size": 4762,
            "diff_url": "https://github.com/haproxy/haproxy/commit/f7ff9cbfe123131d9ffa215d5cfca9a5357d1b6d.diff",
            "exists": true,
            "files": [
                {
                    "file_additions": 33,
                    "file_deletions": 4,
                    "file_exists": true,
                    "file_name": "src/xprt_quic.c",
                    "file_size": 4762
                }
            ],
            "interesting": {
                "reopen": false,
                "status": false
            },
            "is_parent": true,
            "sha": "f7ff9cbfe123131d9ffa215d5cfca9a5357d1b6d"
        },
        {
            "associated_pull_request": [],
            "date": "2022-04-15 13:26:24+00:00",
            "diff": "haproxy_haproxy/issue_1660/commit_32af9a78303cc798eaf1dc506552862cc197e561.diff",
            "diff_additions": 4,
            "diff_deletions": 2,
            "diff_file_size": 32581,
            "diff_url": "https://github.com/haproxy/haproxy/commit/32af9a78303cc798eaf1dc506552862cc197e561.diff",
            "exists": true,
            "files": [
                {
                    "file_additions": 4,
                    "file_deletions": 2,
                    "file_exists": true,
                    "file_name": "src/fcgi-app.c",
                    "file_size": 32581
                }
            ],
            "interesting": {
                "reopen": false,
                "status": false
            },
            "is_parent": false,
            "sha": "32af9a78303cc798eaf1dc506552862cc197e561"
        },
        {
            "associated_pull_request": [],
            "date": "2022-04-15 13:32:03+00:00",
            "diff": "haproxy_haproxy/issue_1660/commit_39e436e222236c4e6c0efe95c304fe89fd01e111.diff",
            "diff_additions": 9,
            "diff_deletions": 0,
            "diff_file_size": 29812,
            "diff_url": "https://github.com/haproxy/haproxy/commit/39e436e222236c4e6c0efe95c304fe89fd01e111.diff",
            "exists": true,
            "files": [
                {
                    "file_additions": 9,
                    "file_deletions": 0,
                    "file_exists": true,
                    "file_name": "src/flt_http_comp.c",
                    "file_size": 29812
                }
            ],
            "interesting": {
                "reopen": true,
                "status": false
            },
            "is_parent": false,
            "sha": "39e436e222236c4e6c0efe95c304fe89fd01e111"
        },
        {
            "associated_pull_request": [],
            "date": "2022-04-15 13:32:03+00:00",
            "diff": "haproxy_haproxy/issue_1660/commit_06df3e9411bbd278b47fbbd35477caeb9510416e.diff",
            "diff_additions": 9,
            "diff_deletions": 0,
            "diff_file_size": 29812,
            "diff_url": "https://github.com/haproxy/haproxy/commit/06df3e9411bbd278b47fbbd35477caeb9510416e.diff",
            "exists": true,
            "files": [
                {
                    "file_additions": 9,
                    "file_deletions": 0,
                    "file_exists": true,
                    "file_name": "src/flt_http_comp.c",
                    "file_size": 29812
                }
            ],
            "interesting": {
                "reopen": false,
                "status": false
            },
            "is_parent": false,
            "sha": "06df3e9411bbd278b47fbbd35477caeb9510416e"
        },
        {
            "associated_pull_request": [],
            "date": "2022-04-15 13:32:03+00:00",
            "diff": "haproxy_haproxy/issue_1660/commit_38e92f96456249e1e685f76cb1b11f1d77b490ae.diff",
            "diff_additions": 9,
            "diff_deletions": 0,
            "diff_file_size": 29812,
            "diff_url": "https://github.com/haproxy/haproxy/commit/38e92f96456249e1e685f76cb1b11f1d77b490ae.diff",
            "exists": true,
            "files": [
                {
                    "file_additions": 9,
                    "file_deletions": 0,
                    "file_exists": true,
                    "file_name": "src/flt_http_comp.c",
                    "file_size": 29812
                }
            ],
            "interesting": {
                "reopen": false,
                "status": false
            },
            "is_parent": false,
            "sha": "38e92f96456249e1e685f76cb1b11f1d77b490ae"
        },
        {
            "associated_pull_request": [],
            "date": "2022-04-15 13:26:24+00:00",
            "diff": "haproxy_haproxy/issue_1660/commit_88b5f86eaea37ef8ca8ab476421b804bd364e93d.diff",
            "diff_additions": 4,
            "diff_deletions": 2,
            "diff_file_size": 32581,
            "diff_url": "https://github.com/haproxy/haproxy/commit/88b5f86eaea37ef8ca8ab476421b804bd364e93d.diff",
            "exists": true,
            "files": [
                {
                    "file_additions": 4,
                    "file_deletions": 2,
                    "file_exists": true,
                    "file_name": "src/fcgi-app.c",
                    "file_size": 32581
                }
            ],
            "interesting": {
                "reopen": false,
                "status": false
            },
            "is_parent": false,
            "sha": "88b5f86eaea37ef8ca8ab476421b804bd364e93d"
        },
        {
            "associated_pull_request": [],
            "date": "2022-04-15 13:32:03+00:00",
            "diff": "haproxy_haproxy/issue_1660/commit_17107317048f01b6b1bead7385a3a6e3ee0d24e8.diff",
            "diff_additions": 9,
            "diff_deletions": 0,
            "diff_file_size": 29812,
            "diff_url": "https://github.com/haproxy/haproxy/commit/17107317048f01b6b1bead7385a3a6e3ee0d24e8.diff",
            "exists": true,
            "files": [
                {
                    "file_additions": 9,
                    "file_deletions": 0,
                    "file_exists": true,
                    "file_name": "src/flt_http_comp.c",
                    "file_size": 29812
                }
            ],
            "interesting": {
                "reopen": false,
                "status": false
            },
            "is_parent": false,
            "sha": "17107317048f01b6b1bead7385a3a6e3ee0d24e8"
        },
        {
            "associated_pull_request": [],
            "date": "2022-04-15 13:26:24+00:00",
            "diff": "haproxy_haproxy/issue_1660/commit_9d180e2b560de148867a2c40b5b9c5c84beb5fc4.diff",
            "diff_additions": 4,
            "diff_deletions": 2,
            "diff_file_size": 32581,
            "diff_url": "https://github.com/haproxy/haproxy/commit/9d180e2b560de148867a2c40b5b9c5c84beb5fc4.diff",
            "exists": true,
            "files": [
                {
                    "file_additions": 4,
                    "file_deletions": 2,
                    "file_exists": true,
                    "file_name": "src/fcgi-app.c",
                    "file_size": 32581
                }
            ],
            "interesting": {
                "reopen": false,
                "status": false
            },
            "is_parent": false,
            "sha": "9d180e2b560de148867a2c40b5b9c5c84beb5fc4"
        },
        {
            "associated_pull_request": [],
            "date": "2022-04-15 13:32:03+00:00",
            "diff": "haproxy_haproxy/issue_1660/commit_c39ee683a0b738e8941419f193a8acbb6559a3e3.diff",
            "diff_additions": 9,
            "diff_deletions": 0,
            "diff_file_size": 29812,
            "diff_url": "https://github.com/haproxy/haproxy/commit/c39ee683a0b738e8941419f193a8acbb6559a3e3.diff",
            "exists": true,
            "files": [
                {
                    "file_additions": 9,
                    "file_deletions": 0,
                    "file_exists": true,
                    "file_name": "src/flt_http_comp.c",
                    "file_size": 29812
                }
            ],
            "interesting": {
                "reopen": false,
                "status": false
            },
            "is_parent": false,
            "sha": "c39ee683a0b738e8941419f193a8acbb6559a3e3"
        },
        {
            "associated_pull_request": [],
            "date": "2022-04-15 13:32:03+00:00",
            "diff": "haproxy_haproxy/issue_1660/commit_32180c73cf89c1a363c54d7078f87a0b330cdff2.diff",
            "diff_additions": 9,
            "diff_deletions": 0,
            "diff_file_size": 29812,
            "diff_url": "https://github.com/haproxy/haproxy/commit/32180c73cf89c1a363c54d7078f87a0b330cdff2.diff",
            "exists": true,
            "files": [
                {
                    "file_additions": 9,
                    "file_deletions": 0,
                    "file_exists": true,
                    "file_name": "src/flt_http_comp.c",
                    "file_size": 29812
                }
            ],
            "interesting": {
                "reopen": false,
                "status": false
            },
            "is_parent": false,
            "sha": "32180c73cf89c1a363c54d7078f87a0b330cdff2"
        }
    ],
    "first_commit": "2022-04-15 11:45:28+00:00",
    "last_commit": "2022-05-13 13:21:12+00:00",
    "number": 1660,
    "pull_request": "None",
    "score": {
        "accidental_reopen_likely": false,
        "all_labels": [
            "type: bug",
            "status: fixed"
        ],
        "contains_keywords": [
            "confirm",
            "fail",
            "fix",
            "issu",
            "patch",
            "test",
            "leak",
            "remov",
            "bug",
            "crash"
        ],
        "fix_size": 36,
        "has_labels": [],
        "intersecting": {
            "computed_score": 0.1,
            "final_commit_size": 10,
            "intersection_size": 1,
            "previous_commits_size": 27
        },
        "is_makefile_based": true,
        "no_new_files": [],
        "no_other_files": true,
        "num_prohibited_files": 384792,
        "prohibited_files": [
            "server/src/main/java/com/genymobile/scrcpy/Device.java",
            "server/src/main/java/com/genymobile/scrcpy/wrappers/SurfaceControl.java",
            "server/src/main/java/com/genymobile/scrcpy/Device.java",
            "server/src/main/java/com/genymobile/scrcpy/wrappers/SurfaceControl.java",
            "app/meson.build",
            "app/scrcpy.1",
            "app/src/common.h",
            "app/src/scrcpy.h",
            "app/src/server.h",
            "server/src/main/java/com/genymobile/scrcpy/Workarounds.java"
        ],
        "reopen": true,
        "reopen_events": [
            [
                "2022-04-15 15:04:24+00:00",
                "commit"
            ],
            [
                "2022-04-15 15:04:24+00:00",
                "commit"
            ],
            [
                "2022-04-27 09:21:27+00:00",
                "closed"
            ],
            [
                "2022-04-27 09:23:39+00:00",
                "reopened"
            ],
            [
                "2022-04-28 11:50:26+00:00",
                "commit"
            ],
            [
                "2022-04-28 11:50:26+00:00",
                "commit"
            ],
            [
                "2022-04-30 05:25:23+00:00",
                "commit"
            ],
            [
                "2022-04-30 05:25:23+00:00",
                "commit"
            ],
            [
                "2022-04-30 05:25:27+00:00",
                "commit"
            ],
            [
                "2022-04-30 05:25:27+00:00",
                "commit"
            ],
            [
                "2022-05-05 10:14:40+00:00",
                "closed"
            ],
            [
                "2022-05-06 05:25:22+00:00",
                "commit"
            ],
            [
                "2022-05-06 05:25:22+00:00",
                "commit"
            ],
            [
                "2022-05-14 05:25:28+00:00",
                "commit"
            ]
        ],
        "status": false,
        "strategy": true,
        "total_changes": 109
    }
}