{
    "covered_issues": [
        41,
        36,
        35,
        33,
        31,
        29,
        28,
        24,
        23,
        22,
        21,
        19,
        18,
        13,
        12,
        11,
        10,
        9,
        8,
        5,
        4,
        3,
        1
    ],
    "finished": true
}