{
    "covered_issues": [
        60,
        58,
        56,
        55,
        54,
        52,
        50,
        49,
        48,
        47,
        46,
        45,
        44,
        41,
        40,
        39,
        38,
        37,
        32,
        31,
        24,
        23,
        22,
        20,
        17,
        16,
        15,
        14,
        9,
        8,
        5,
        2,
        1
    ],
    "finished": true
}