{
    "covered_issues": [
        152,
        151,
        144,
        134,
        133,
        132,
        131,
        129,
        124,
        123,
        121,
        119,
        118,
        117,
        113,
        112,
        110,
        109,
        108,
        107,
        85,
        84,
        83,
        81,
        80,
        79,
        78,
        76,
        75,
        73,
        72,
        70,
        69,
        68,
        67,
        66,
        65,
        64,
        63,
        62,
        61,
        60,
        59,
        58,
        57,
        54,
        53,
        50,
        48,
        47,
        46,
        45,
        44,
        42,
        41,
        40,
        39,
        38,
        37,
        36,
        35,
        34,
        32,
        31,
        30,
        29,
        28,
        24,
        23,
        22,
        19,
        18,
        17,
        16,
        15,
        14,
        13,
        12,
        10,
        9,
        8,
        6,
        5,
        2,
        1
    ],
    "finished": true
}