{
    "category": [
        "memory",
        "GUI"
    ],
    "commits": [
        {
            "associated_pull_request": [],
            "date": "2017-09-29 13:10:52",
            "diff": "neomutt_neomutt/issue_789/commit_557653d5f16457fae19c0e69be82ad1fd06beb21.diff",
            "diff_additions": 6,
            "diff_deletions": 2,
            "diff_file_size": 13909,
            "diff_url": "https://github.com/neomutt/neomutt/commit/557653d5f16457fae19c0e69be82ad1fd06beb21.diff",
            "exists": true,
            "files": [
                {
                    "file_additions": 2,
                    "file_deletions": 1,
                    "file_exists": false,
                    "file_name": "pager.c",
                    "file_size": 0
                },
                {
                    "file_additions": 2,
                    "file_deletions": 1,
                    "file_exists": false,
                    "file_name": "sendlib.c",
                    "file_size": 0
                },
                {
                    "file_additions": 2,
                    "file_deletions": 0,
                    "file_exists": true,
                    "file_name": "version.c",
                    "file_size": 13909
                }
            ],
            "interesting": {
                "reopen": false,
                "status": false
            },
            "is_parent": true,
            "sha": "557653d5f16457fae19c0e69be82ad1fd06beb21"
        },
        {
            "associated_pull_request": [],
            "date": "2017-09-29 16:23:16",
            "diff": "neomutt_neomutt/issue_789/commit_8b788bacabf455a2c2e4c24bf514182d136ef47d.diff",
            "diff_additions": 12,
            "diff_deletions": 8,
            "diff_file_size": 57272,
            "diff_url": "https://github.com/neomutt/neomutt/commit/8b788bacabf455a2c2e4c24bf514182d136ef47d.diff",
            "exists": true,
            "files": [
                {
                    "file_additions": 12,
                    "file_deletions": 8,
                    "file_exists": true,
                    "file_name": "recvattach.c",
                    "file_size": 57272
                }
            ],
            "interesting": {
                "reopen": false,
                "status": true
            },
            "is_parent": false,
            "sha": "8b788bacabf455a2c2e4c24bf514182d136ef47d"
        },
        {
            "associated_pull_request": [
                "https://github.com/neomutt/neomutt/pull/801"
            ],
            "date": "2017-09-29 16:23:16",
            "diff": "neomutt_neomutt/issue_789/commit_bebeaddd8ad276d353e45a6c685adc97a9467a06.diff",
            "diff_additions": 12,
            "diff_deletions": 8,
            "diff_file_size": 57272,
            "diff_url": "https://github.com/neomutt/neomutt/commit/bebeaddd8ad276d353e45a6c685adc97a9467a06.diff",
            "exists": true,
            "files": [
                {
                    "file_additions": 12,
                    "file_deletions": 8,
                    "file_exists": true,
                    "file_name": "recvattach.c",
                    "file_size": 57272
                }
            ],
            "interesting": {
                "reopen": false,
                "status": false
            },
            "is_parent": false,
            "sha": "bebeaddd8ad276d353e45a6c685adc97a9467a06"
        },
        {
            "associated_pull_request": [
                "https://github.com/neomutt/neomutt/pull/801"
            ],
            "date": "2017-09-29 18:30:18",
            "diff": "neomutt_neomutt/issue_789/commit_4426a0b047a6ee931e6387993dcbfbd5d9f0802b.diff",
            "diff_additions": 12,
            "diff_deletions": 8,
            "diff_file_size": 57272,
            "diff_url": "https://github.com/neomutt/neomutt/commit/4426a0b047a6ee931e6387993dcbfbd5d9f0802b.diff",
            "exists": true,
            "files": [
                {
                    "file_additions": 12,
                    "file_deletions": 8,
                    "file_exists": true,
                    "file_name": "recvattach.c",
                    "file_size": 57272
                }
            ],
            "interesting": {
                "reopen": true,
                "status": false
            },
            "is_parent": false,
            "sha": "4426a0b047a6ee931e6387993dcbfbd5d9f0802b"
        }
    ],
    "first_commit": "2017-09-29 13:10:52",
    "last_commit": "2017-09-29 18:30:18",
    "number": 789,
    "pull_request": "None",
    "score": {
        "accidental_reopen_likely": false,
        "all_labels": [
            "bug:confirmed",
            "type:bug"
        ],
        "contains_keywords": [
            "report",
            "chang",
            "problem",
            "test",
            "fix",
            "issu",
            "work"
        ],
        "fix_size": 14,
        "has_labels": [],
        "intersecting": {
            "computed_score": 1.0,
            "final_commit_size": 14,
            "intersection_size": 14,
            "previous_commits_size": 14
        },
        "is_makefile_based": true,
        "no_new_files": [],
        "no_other_files": true,
        "num_prohibited_files": 65440,
        "prohibited_files": [
            "hal/inc/pinmap_hal.h",
            "Debug/marvin.bin",
            "Debug/marvin.elf",
            "Debug/marvin.hex",
            "Debug/marvin.bin",
            "Debug/marvin.elf",
            "Debug/marvin.hex",
            "inc/spark_utilities.h",
            "Debug/marvin.bin",
            "Debug/marvin.elf"
        ],
        "reopen": false,
        "reopen_events": [
            [
                "2017-09-29 16:29:27",
                "commit"
            ],
            [
                "2017-09-29 16:33:57",
                "commit"
            ],
            [
                "2017-09-29 18:30:19",
                "closed"
            ],
            [
                "2017-09-29 18:30:22",
                "commit"
            ],
            [
                "2018-08-21 16:14:59",
                "reopened"
            ],
            [
                "2019-03-26 14:47:01",
                "closed"
            ]
        ],
        "status": true,
        "strategy": true,
        "total_changes": 68
    }
}