{
    "category": [
        "build/refactor/preprocessing",
        "GUI"
    ],
    "commits": [
        {
            "associated_pull_request": [],
            "date": "2015-01-01 16:42:21",
            "diff": "vifm_vifm/issue_68/commit_5599101b55f43f1a31284ad5abee28cafa5d3823.diff",
            "diff_additions": 1,
            "diff_deletions": 1,
            "diff_file_size": 0,
            "diff_url": "https://github.com/vifm/vifm/commit/5599101b55f43f1a31284ad5abee28cafa5d3823.diff",
            "exists": true,
            "files": [
                {
                    "file_additions": 1,
                    "file_deletions": 1,
                    "file_exists": false,
                    "file_name": "src/fuse.c",
                    "file_size": 0
                }
            ],
            "interesting": {
                "reopen": false,
                "status": false
            },
            "is_parent": true,
            "sha": "5599101b55f43f1a31284ad5abee28cafa5d3823"
        },
        {
            "associated_pull_request": [],
            "date": "2015-01-01 16:44:35",
            "diff": "vifm_vifm/issue_68/commit_790c009462ccb3ceec807b81ac0468f55e9df68c.diff",
            "diff_additions": 2,
            "diff_deletions": 1,
            "diff_file_size": 99265,
            "diff_url": "https://github.com/vifm/vifm/commit/790c009462ccb3ceec807b81ac0468f55e9df68c.diff",
            "exists": true,
            "files": [
                {
                    "file_additions": 2,
                    "file_deletions": 1,
                    "file_exists": true,
                    "file_name": "src/filelist.c",
                    "file_size": 99265
                }
            ],
            "interesting": {
                "reopen": true,
                "status": false
            },
            "is_parent": false,
            "sha": "790c009462ccb3ceec807b81ac0468f55e9df68c"
        },
        {
            "associated_pull_request": [],
            "date": "2015-01-02 16:43:31",
            "diff": "vifm_vifm/issue_68/commit_0914981d77967c59346618a856501ba55a737daf.diff",
            "diff_additions": 7,
            "diff_deletions": 2,
            "diff_file_size": 99265,
            "diff_url": "https://github.com/vifm/vifm/commit/0914981d77967c59346618a856501ba55a737daf.diff",
            "exists": true,
            "files": [
                {
                    "file_additions": 7,
                    "file_deletions": 2,
                    "file_exists": true,
                    "file_name": "src/filelist.c",
                    "file_size": 99265
                }
            ],
            "interesting": {
                "reopen": false,
                "status": false
            },
            "is_parent": false,
            "sha": "0914981d77967c59346618a856501ba55a737daf"
        }
    ],
    "first_commit": "2015-01-01 16:53:20",
    "last_commit": "2015-01-02 16:43:31",
    "number": 68,
    "pull_request": "None",
    "score": {
        "accidental_reopen_likely": false,
        "all_labels": [
            "bug",
            "improvement/addition"
        ],
        "contains_keywords": [
            "report",
            "fix",
            "remov",
            "issu",
            "work"
        ],
        "fix_size": 9,
        "has_labels": [
            "bug"
        ],
        "intersecting": {
            "computed_score": 0.3333333333333333,
            "final_commit_size": 9,
            "intersection_size": 3,
            "previous_commits_size": 3
        },
        "is_makefile_based": true,
        "no_new_files": [],
        "no_other_files": false,
        "num_prohibited_files": 63229,
        "prohibited_files": [
            "hal/inc/pinmap_hal.h",
            "Debug/marvin.bin",
            "Debug/marvin.elf",
            "Debug/marvin.hex",
            "Debug/marvin.bin",
            "Debug/marvin.elf",
            "Debug/marvin.hex",
            "inc/spark_utilities.h",
            "Debug/marvin.bin",
            "Debug/marvin.elf"
        ],
        "reopen": true,
        "reopen_events": [
            [
                "2015-01-01 17:06:06",
                "commit"
            ],
            [
                "2015-01-01 17:06:09",
                "closed"
            ],
            [
                "2015-01-01 17:06:09",
                "commit"
            ],
            [
                "2015-01-02 13:06:16",
                "reopened"
            ],
            [
                "2015-01-02 16:44:49",
                "commit"
            ],
            [
                "2015-01-03 16:22:24",
                "closed"
            ]
        ],
        "status": false,
        "strategy": true,
        "total_changes": 14
    }
}