{
    "commits": [
        {
            "associated_pull_request": [],
            "date": "2021-04-30 18:37:59+00:00",
            "diff": "universal-ctags_ctags/issue_2935/commit_0e93097da246b7ead2e4de75ca727374add932c7.diff",
            "diff_additions": 32,
            "diff_deletions": 0,
            "diff_file_size": 7947,
            "diff_url": "https://github.com/universal-ctags/ctags/commit/0e93097da246b7ead2e4de75ca727374add932c7.diff",
            "exists": true,
            "files": [
                {
                    "file_additions": 32,
                    "file_deletions": 0,
                    "file_exists": true,
                    "file_name": "main/vstring.c",
                    "file_size": 7947
                }
            ],
            "interesting": {
                "reopen": false,
                "status": false
            },
            "is_parent": true,
            "sha": "0e93097da246b7ead2e4de75ca727374add932c7"
        },
        {
            "associated_pull_request": [],
            "date": "2021-04-30 19:38:22+00:00",
            "diff": "universal-ctags_ctags/issue_2935/commit_3141e043ca2c5eda32c10b6476c1c6bc69217291.diff",
            "diff_additions": 49,
            "diff_deletions": 3,
            "diff_file_size": 264679,
            "diff_url": "https://github.com/universal-ctags/ctags/commit/3141e043ca2c5eda32c10b6476c1c6bc69217291.diff",
            "exists": true,
            "files": [
                {
                    "file_additions": 44,
                    "file_deletions": 1,
                    "file_exists": true,
                    "file_name": "main/error.c",
                    "file_size": 2751
                },
                {
                    "file_additions": 2,
                    "file_deletions": 0,
                    "file_exists": true,
                    "file_name": "main/options.c",
                    "file_size": 110219
                },
                {
                    "file_additions": 3,
                    "file_deletions": 2,
                    "file_exists": true,
                    "file_name": "main/parse.c",
                    "file_size": 151709
                }
            ],
            "interesting": {
                "reopen": false,
                "status": false
            },
            "is_parent": false,
            "sha": "3141e043ca2c5eda32c10b6476c1c6bc69217291"
        },
        {
            "associated_pull_request": [],
            "date": "2021-04-30 19:38:22+00:00",
            "diff": "universal-ctags_ctags/issue_2935/commit_5ad1afff4a415459fa920719573450325b068fa9.diff",
            "diff_additions": 52,
            "diff_deletions": 3,
            "diff_file_size": 264679,
            "diff_url": "https://github.com/universal-ctags/ctags/commit/5ad1afff4a415459fa920719573450325b068fa9.diff",
            "exists": true,
            "files": [
                {
                    "file_additions": 47,
                    "file_deletions": 1,
                    "file_exists": true,
                    "file_name": "main/error.c",
                    "file_size": 2751
                },
                {
                    "file_additions": 2,
                    "file_deletions": 0,
                    "file_exists": true,
                    "file_name": "main/options.c",
                    "file_size": 110219
                },
                {
                    "file_additions": 3,
                    "file_deletions": 2,
                    "file_exists": true,
                    "file_name": "main/parse.c",
                    "file_size": 151709
                }
            ],
            "interesting": {
                "reopen": false,
                "status": false
            },
            "is_parent": false,
            "sha": "5ad1afff4a415459fa920719573450325b068fa9"
        },
        {
            "associated_pull_request": [],
            "date": "2021-04-30 19:38:22+00:00",
            "diff": "universal-ctags_ctags/issue_2935/commit_83bf60b7a02c35dfc6a5c0019760086fb1d19bf4.diff",
            "diff_additions": 50,
            "diff_deletions": 5,
            "diff_file_size": 264679,
            "diff_url": "https://github.com/universal-ctags/ctags/commit/83bf60b7a02c35dfc6a5c0019760086fb1d19bf4.diff",
            "exists": true,
            "files": [
                {
                    "file_additions": 47,
                    "file_deletions": 1,
                    "file_exists": true,
                    "file_name": "main/error.c",
                    "file_size": 2751
                },
                {
                    "file_additions": 2,
                    "file_deletions": 0,
                    "file_exists": true,
                    "file_name": "main/options.c",
                    "file_size": 110219
                },
                {
                    "file_additions": 1,
                    "file_deletions": 4,
                    "file_exists": true,
                    "file_name": "main/parse.c",
                    "file_size": 151709
                }
            ],
            "interesting": {
                "reopen": false,
                "status": false
            },
            "is_parent": false,
            "sha": "83bf60b7a02c35dfc6a5c0019760086fb1d19bf4"
        },
        {
            "associated_pull_request": [],
            "date": "2021-04-30 19:38:22+00:00",
            "diff": "universal-ctags_ctags/issue_2935/commit_b99aa0c678b3f65df0b6244bbf2ded2520b86132.diff",
            "diff_additions": 51,
            "diff_deletions": 5,
            "diff_file_size": 264679,
            "diff_url": "https://github.com/universal-ctags/ctags/commit/b99aa0c678b3f65df0b6244bbf2ded2520b86132.diff",
            "exists": true,
            "files": [
                {
                    "file_additions": 1,
                    "file_deletions": 0,
                    "file_exists": false,
                    "file_name": "Tmain/delayed-error.d/input.c",
                    "file_size": 0
                },
                {
                    "file_additions": 47,
                    "file_deletions": 1,
                    "file_exists": true,
                    "file_name": "main/error.c",
                    "file_size": 2751
                },
                {
                    "file_additions": 2,
                    "file_deletions": 0,
                    "file_exists": true,
                    "file_name": "main/options.c",
                    "file_size": 110219
                },
                {
                    "file_additions": 1,
                    "file_deletions": 4,
                    "file_exists": true,
                    "file_name": "main/parse.c",
                    "file_size": 151709
                }
            ],
            "interesting": {
                "reopen": false,
                "status": false
            },
            "is_parent": false,
            "sha": "b99aa0c678b3f65df0b6244bbf2ded2520b86132"
        },
        {
            "associated_pull_request": [
                "https://github.com/universal-ctags/ctags/pull/2987"
            ],
            "date": "2021-04-30 19:38:22+00:00",
            "diff": "universal-ctags_ctags/issue_2935/commit_b658e74d553763552b1de423caa3231db62eedea.diff",
            "diff_additions": 51,
            "diff_deletions": 5,
            "diff_file_size": 264679,
            "diff_url": "https://github.com/universal-ctags/ctags/commit/b658e74d553763552b1de423caa3231db62eedea.diff",
            "exists": true,
            "files": [
                {
                    "file_additions": 1,
                    "file_deletions": 0,
                    "file_exists": false,
                    "file_name": "Tmain/delayed-error.d/input.c",
                    "file_size": 0
                },
                {
                    "file_additions": 47,
                    "file_deletions": 1,
                    "file_exists": true,
                    "file_name": "main/error.c",
                    "file_size": 2751
                },
                {
                    "file_additions": 2,
                    "file_deletions": 0,
                    "file_exists": true,
                    "file_name": "main/options.c",
                    "file_size": 110219
                },
                {
                    "file_additions": 1,
                    "file_deletions": 4,
                    "file_exists": true,
                    "file_name": "main/parse.c",
                    "file_size": 151709
                }
            ],
            "interesting": {
                "reopen": true,
                "status": false
            },
            "is_parent": false,
            "sha": "b658e74d553763552b1de423caa3231db62eedea"
        },
        {
            "associated_pull_request": [],
            "date": "2021-04-30 19:38:22+00:00",
            "diff": "universal-ctags_ctags/issue_2935/commit_1d36efcdcb0f1ac940d001a53c8a7314b20d72ac.diff",
            "diff_additions": 51,
            "diff_deletions": 5,
            "diff_file_size": 264679,
            "diff_url": "https://github.com/universal-ctags/ctags/commit/1d36efcdcb0f1ac940d001a53c8a7314b20d72ac.diff",
            "exists": true,
            "files": [
                {
                    "file_additions": 1,
                    "file_deletions": 0,
                    "file_exists": false,
                    "file_name": "Tmain/delayed-error.d/input.c",
                    "file_size": 0
                },
                {
                    "file_additions": 47,
                    "file_deletions": 1,
                    "file_exists": true,
                    "file_name": "main/error.c",
                    "file_size": 2751
                },
                {
                    "file_additions": 2,
                    "file_deletions": 0,
                    "file_exists": true,
                    "file_name": "main/options.c",
                    "file_size": 110219
                },
                {
                    "file_additions": 1,
                    "file_deletions": 4,
                    "file_exists": true,
                    "file_name": "main/parse.c",
                    "file_size": 151709
                }
            ],
            "interesting": {
                "reopen": false,
                "status": false
            },
            "is_parent": false,
            "sha": "1d36efcdcb0f1ac940d001a53c8a7314b20d72ac"
        },
        {
            "associated_pull_request": [],
            "date": "2021-04-30 19:38:22+00:00",
            "diff": "universal-ctags_ctags/issue_2935/commit_a381f30954eaa4b5c32c7216c7ec0ff77e25641d.diff",
            "diff_additions": 51,
            "diff_deletions": 5,
            "diff_file_size": 264679,
            "diff_url": "https://github.com/universal-ctags/ctags/commit/a381f30954eaa4b5c32c7216c7ec0ff77e25641d.diff",
            "exists": true,
            "files": [
                {
                    "file_additions": 1,
                    "file_deletions": 0,
                    "file_exists": false,
                    "file_name": "Tmain/delayed-error.d/input.c",
                    "file_size": 0
                },
                {
                    "file_additions": 47,
                    "file_deletions": 1,
                    "file_exists": true,
                    "file_name": "main/error.c",
                    "file_size": 2751
                },
                {
                    "file_additions": 2,
                    "file_deletions": 0,
                    "file_exists": true,
                    "file_name": "main/options.c",
                    "file_size": 110219
                },
                {
                    "file_additions": 1,
                    "file_deletions": 4,
                    "file_exists": true,
                    "file_name": "main/parse.c",
                    "file_size": 151709
                }
            ],
            "interesting": {
                "reopen": false,
                "status": true
            },
            "is_parent": false,
            "sha": "a381f30954eaa4b5c32c7216c7ec0ff77e25641d"
        },
        {
            "associated_pull_request": [],
            "date": "2023-07-03 02:32:35+00:00",
            "diff": "universal-ctags_ctags/issue_2935/commit_c33e61f09e817ecfb01228b9f422063c1eb76b87.diff",
            "diff_additions": 9,
            "diff_deletions": 1,
            "diff_file_size": 110219,
            "diff_url": "https://github.com/universal-ctags/ctags/commit/c33e61f09e817ecfb01228b9f422063c1eb76b87.diff",
            "exists": true,
            "files": [
                {
                    "file_additions": 9,
                    "file_deletions": 1,
                    "file_exists": true,
                    "file_name": "main/options.c",
                    "file_size": 110219
                }
            ],
            "interesting": {
                "reopen": false,
                "status": false
            },
            "is_parent": false,
            "sha": "c33e61f09e817ecfb01228b9f422063c1eb76b87"
        },
        {
            "associated_pull_request": [],
            "date": "2023-07-03 02:32:35+00:00",
            "diff": "universal-ctags_ctags/issue_2935/commit_eca129db1491f077bee35f0746f195ba9e1e0f07.diff",
            "diff_additions": 9,
            "diff_deletions": 1,
            "diff_file_size": 110219,
            "diff_url": "https://github.com/universal-ctags/ctags/commit/eca129db1491f077bee35f0746f195ba9e1e0f07.diff",
            "exists": true,
            "files": [
                {
                    "file_additions": 9,
                    "file_deletions": 1,
                    "file_exists": true,
                    "file_name": "main/options.c",
                    "file_size": 110219
                }
            ],
            "interesting": {
                "reopen": false,
                "status": false
            },
            "is_parent": false,
            "sha": "eca129db1491f077bee35f0746f195ba9e1e0f07"
        },
        {
            "associated_pull_request": [
                "https://github.com/universal-ctags/ctags/pull/3756"
            ],
            "date": "2023-07-03 02:32:35+00:00",
            "diff": "universal-ctags_ctags/issue_2935/commit_30c420a0a3254bdd24711673c23e10937234bdc3.diff",
            "diff_additions": 9,
            "diff_deletions": 1,
            "diff_file_size": 110219,
            "diff_url": "https://github.com/universal-ctags/ctags/commit/30c420a0a3254bdd24711673c23e10937234bdc3.diff",
            "exists": true,
            "files": [
                {
                    "file_additions": 9,
                    "file_deletions": 1,
                    "file_exists": true,
                    "file_name": "main/options.c",
                    "file_size": 110219
                }
            ],
            "interesting": {
                "reopen": false,
                "status": false
            },
            "is_parent": false,
            "sha": "30c420a0a3254bdd24711673c23e10937234bdc3"
        }
    ],
    "first_commit": "2021-04-30 19:38:43+00:00",
    "last_commit": "2023-07-04 14:46:39+00:00",
    "number": 2935,
    "pull_request": "None",
    "score": {
        "accidental_reopen_likely": false,
        "all_labels": [
            "next-release"
        ],
        "contains_keywords": [
            "work",
            "fail",
            "fix",
            "fault",
            "warn",
            "error",
            "crash"
        ],
        "fix_size": 80,
        "has_labels": [],
        "intersecting": {
            "computed_score": 1.0,
            "final_commit_size": 10,
            "intersection_size": 10,
            "previous_commits_size": 80
        },
        "is_makefile_based": true,
        "no_new_files": [],
        "no_other_files": false,
        "num_prohibited_files": 231693,
        "prohibited_files": [
            "server/src/main/java/com/genymobile/scrcpy/Device.java",
            "server/src/main/java/com/genymobile/scrcpy/wrappers/SurfaceControl.java",
            "server/src/main/java/com/genymobile/scrcpy/Device.java",
            "server/src/main/java/com/genymobile/scrcpy/wrappers/SurfaceControl.java",
            "app/meson.build",
            "app/scrcpy.1",
            "app/src/common.h",
            "app/src/scrcpy.h",
            "app/src/server.h",
            "server/src/main/java/com/genymobile/scrcpy/Workarounds.java"
        ],
        "reopen": true,
        "reopen_events": [
            [
                "2021-04-30 19:39:09+00:00",
                "commit"
            ],
            [
                "2021-05-01 03:41:24+00:00",
                "commit"
            ],
            [
                "2021-05-01 03:42:15+00:00",
                "commit"
            ],
            [
                "2021-05-01 04:15:34+00:00",
                "commit"
            ],
            [
                "2021-05-01 13:04:45+00:00",
                "commit"
            ],
            [
                "2021-05-04 14:49:39+00:00",
                "closed"
            ],
            [
                "2021-05-04 18:52:26+00:00",
                "reopened"
            ],
            [
                "2021-05-05 09:09:58+00:00",
                "commit"
            ],
            [
                "2023-07-01 19:49:34+00:00",
                "commit"
            ],
            [
                "2023-07-03 09:27:28+00:00",
                "commit"
            ],
            [
                "2023-07-03 09:45:37+00:00",
                "commit"
            ],
            [
                "2023-07-04 14:46:58+00:00",
                "commit"
            ],
            [
                "2023-07-04 16:33:35+00:00",
                "closed"
            ]
        ],
        "status": true,
        "strategy": true,
        "total_changes": 448
    }
}