{
    "all_issues": 4620,
    "interesting_issues": 3,
    "last_update": "2023-10-31 01:57:51.437456",
    "license": {
        "download": "https://raw.githubusercontent.com/syslog-ng/syslog-ng/master/COPYING",
        "name": "Other"
    },
    "ratio": 0.0006493506493506494,
    "size": 36874,
    "stars": 1925,
    "url": "https://github.com/syslog-ng/syslog-ng"
}