{
    "covered_issues": [
        43,
        40,
        39,
        38,
        37,
        36,
        35,
        34,
        30,
        24,
        21,
        16,
        7,
        2,
        1
    ],
    "finished": true
}