{
    "covered_issues": [
        38,
        36,
        34,
        33,
        32,
        31,
        30,
        29,
        27,
        26,
        24,
        23,
        22,
        21,
        20,
        19,
        18,
        17,
        16,
        15,
        14,
        13,
        12,
        10,
        9,
        8,
        7,
        5,
        3,
        2,
        1
    ],
    "finished": true
}