{
    "covered_issues": [
        587,
        586,
        584,
        583,
        577,
        576,
        575,
        573,
        569,
        568,
        565,
        562,
        561,
        560,
        559,
        558,
        555,
        552,
        551,
        549,
        547,
        546,
        545,
        544,
        543,
        540,
        538,
        537,
        536,
        535,
        534,
        533,
        532,
        531,
        530,
        528,
        526,
        522,
        521,
        520,
        518,
        515,
        514,
        513,
        512,
        510,
        509,
        508,
        507,
        506,
        505,
        504,
        503,
        502,
        501,
        499,
        498,
        497,
        496,
        495,
        494,
        492,
        490,
        489,
        488,
        486,
        485,
        483,
        482,
        481,
        477,
        473,
        472,
        471,
        469,
        468,
        467,
        466,
        465,
        464,
        463,
        461,
        460,
        459,
        458,
        457,
        455,
        454,
        453,
        450,
        449,
        447,
        446,
        444,
        443,
        440,
        439,
        436,
        435,
        434,
        433,
        432,
        431,
        429,
        427,
        426,
        424,
        423,
        422,
        420,
        418,
        417,
        416,
        415,
        411,
        410,
        409,
        406,
        404,
        403,
        402,
        401,
        400,
        399,
        393,
        392,
        391,
        390,
        389,
        388,
        387,
        386,
        385,
        384,
        383,
        381,
        380,
        379,
        378,
        377,
        376,
        375,
        373,
        372,
        371,
        370,
        369,
        368,
        367,
        366,
        364,
        363,
        361,
        360,
        359,
        358,
        357,
        355,
        354,
        347,
        346,
        345,
        344,
        343,
        342,
        341,
        339,
        338,
        336,
        334,
        332,
        331,
        330,
        329,
        328,
        327,
        326,
        325,
        324,
        323,
        322,
        321,
        320,
        319,
        318,
        317,
        316,
        315,
        314,
        312,
        310,
        309,
        308,
        307,
        306,
        305,
        304,
        303,
        301,
        300,
        299,
        297,
        295,
        294,
        291,
        290,
        289,
        287,
        286,
        285,
        284,
        283,
        282,
        281,
        278,
        277,
        276,
        275,
        274,
        273,
        272,
        271,
        270,
        266,
        264,
        262,
        261,
        260,
        259,
        258,
        257,
        256,
        255,
        254,
        252,
        251,
        250,
        249,
        248,
        247,
        246,
        245,
        244,
        243,
        242,
        239,
        238,
        237,
        236,
        235,
        234,
        233,
        232,
        231,
        230,
        229,
        228,
        227,
        225,
        224,
        223,
        222,
        221,
        220,
        218,
        217,
        214,
        213,
        212,
        211,
        210,
        209,
        208,
        207,
        206,
        205,
        204,
        203,
        202,
        201,
        200,
        199,
        198,
        197,
        196,
        195,
        193,
        192,
        191,
        190,
        189,
        187,
        186,
        185,
        184,
        183,
        182,
        180,
        179,
        175,
        174,
        172,
        171,
        170,
        169,
        168,
        167,
        166,
        165,
        163,
        162,
        160,
        159,
        158,
        157,
        156,
        155,
        154,
        153,
        152,
        151,
        150,
        149,
        148,
        147,
        146,
        144,
        143,
        142,
        141,
        140,
        136,
        135,
        134,
        133,
        131,
        130,
        128,
        127,
        126,
        125,
        123,
        122,
        121,
        119,
        118,
        117,
        116,
        115,
        113,
        112,
        111,
        110,
        107,
        108,
        105,
        104,
        103,
        102,
        101,
        99,
        98,
        97,
        96,
        95,
        94,
        93,
        92,
        91,
        90,
        89,
        87,
        86,
        85,
        84,
        83,
        82,
        81,
        80,
        79,
        78,
        77,
        76,
        75,
        74,
        73,
        72,
        71,
        69,
        68,
        66,
        65,
        64,
        63,
        62,
        60,
        59,
        58,
        57,
        56,
        55,
        54,
        52,
        53,
        51,
        49,
        48,
        47,
        46,
        45,
        44,
        43,
        41,
        40,
        39,
        38,
        37,
        36,
        35,
        34,
        33,
        32,
        31,
        29,
        28,
        26,
        25,
        24,
        23,
        22,
        21,
        20,
        19,
        18,
        17,
        16,
        15,
        14,
        13,
        12,
        10,
        9,
        8,
        7,
        5,
        4,
        3,
        2
    ],
    "finished": true
}