{
    "commits": [
        {
            "associated_pull_request": [],
            "date": "2014-08-30 18:03:31+00:00",
            "diff": "mpv-player_mpv/issue_1045/commit_c80adac07772f5b3c7a6c31e3e05480252f84171.diff",
            "diff_additions": 2,
            "diff_deletions": 1,
            "diff_file_size": 0,
            "diff_url": "https://github.com/mpv-player/mpv/commit/c80adac07772f5b3c7a6c31e3e05480252f84171.diff",
            "exists": true,
            "files": [
                {
                    "file_additions": 2,
                    "file_deletions": 1,
                    "file_exists": false,
                    "file_name": "stream/cache_file.c",
                    "file_size": 0
                }
            ],
            "interesting": {
                "reopen": false,
                "status": false
            },
            "is_parent": true,
            "sha": "c80adac07772f5b3c7a6c31e3e05480252f84171"
        },
        {
            "associated_pull_request": [],
            "date": "2014-08-30 21:24:46+00:00",
            "diff": "mpv-player_mpv/issue_1045/commit_8599c959fe9334bc4d226faf813166ef8bc8efd5.diff",
            "diff_additions": 109,
            "diff_deletions": 1,
            "diff_file_size": 446893,
            "diff_url": "https://github.com/mpv-player/mpv/commit/8599c959fe9334bc4d226faf813166ef8bc8efd5.diff",
            "exists": true,
            "files": [
                {
                    "file_additions": 12,
                    "file_deletions": 0,
                    "file_exists": true,
                    "file_name": "demux/demux_mkv.c",
                    "file_size": 117166
                },
                {
                    "file_additions": 53,
                    "file_deletions": 0,
                    "file_exists": true,
                    "file_name": "options/m_option.c",
                    "file_size": 115381
                },
                {
                    "file_additions": 1,
                    "file_deletions": 0,
                    "file_exists": true,
                    "file_name": "options/options.c",
                    "file_size": 38885
                },
                {
                    "file_additions": 12,
                    "file_deletions": 0,
                    "file_exists": true,
                    "file_name": "player/video.c",
                    "file_size": 45474
                },
                {
                    "file_additions": 22,
                    "file_deletions": 0,
                    "file_exists": true,
                    "file_name": "video/csputils.c",
                    "file_size": 37232
                },
                {
                    "file_additions": 2,
                    "file_deletions": 0,
                    "file_exists": true,
                    "file_name": "video/decode/vd_lavc.c",
                    "file_size": 47867
                },
                {
                    "file_additions": 2,
                    "file_deletions": 0,
                    "file_exists": false,
                    "file_name": "video/filter/vf_stereo3d.c",
                    "file_size": 0
                },
                {
                    "file_additions": 5,
                    "file_deletions": 1,
                    "file_exists": true,
                    "file_name": "video/mp_image.c",
                    "file_size": 44888
                }
            ],
            "interesting": {
                "reopen": true,
                "status": false
            },
            "is_parent": false,
            "sha": "8599c959fe9334bc4d226faf813166ef8bc8efd5"
        },
        {
            "associated_pull_request": [],
            "date": "2014-08-31 12:41:21+00:00",
            "diff": "mpv-player_mpv/issue_1045/commit_fd4045965e8926ef994028fffdf7e928038e4714.diff",
            "diff_additions": 2,
            "diff_deletions": 2,
            "diff_file_size": 37232,
            "diff_url": "https://github.com/mpv-player/mpv/commit/fd4045965e8926ef994028fffdf7e928038e4714.diff",
            "exists": true,
            "files": [
                {
                    "file_additions": 2,
                    "file_deletions": 2,
                    "file_exists": true,
                    "file_name": "video/csputils.c",
                    "file_size": 37232
                }
            ],
            "interesting": {
                "reopen": false,
                "status": false
            },
            "is_parent": false,
            "sha": "fd4045965e8926ef994028fffdf7e928038e4714"
        }
    ],
    "first_commit": "2014-08-30 18:03:31+00:00",
    "last_commit": "2014-08-31 12:48:58+00:00",
    "number": 1045,
    "pull_request": "None",
    "score": {
        "accidental_reopen_likely": false,
        "all_labels": [
            "meta:feature-request"
        ],
        "contains_keywords": [
            "work",
            "chang",
            "issu",
            "patch",
            "perform",
            "reason",
            "test",
            "fault",
            "bug",
            "error",
            "problem"
        ],
        "fix_size": 118,
        "has_labels": [],
        "intersecting": {
            "computed_score": 1.0,
            "final_commit_size": 3,
            "intersection_size": 3,
            "previous_commits_size": 118
        },
        "is_makefile_based": false,
        "no_new_files": [],
        "no_other_files": false,
        "num_prohibited_files": 11198,
        "prohibited_files": [
            "server/src/main/java/com/genymobile/scrcpy/Device.java",
            "server/src/main/java/com/genymobile/scrcpy/wrappers/SurfaceControl.java",
            "server/src/main/java/com/genymobile/scrcpy/Device.java",
            "server/src/main/java/com/genymobile/scrcpy/wrappers/SurfaceControl.java",
            "app/meson.build",
            "app/scrcpy.1",
            "app/src/common.h",
            "app/src/scrcpy.h",
            "app/src/server.h",
            "server/src/main/java/com/genymobile/scrcpy/Workarounds.java"
        ],
        "reopen": true,
        "reopen_events": [
            [
                "2014-08-30 21:25:12+00:00",
                "commit"
            ],
            [
                "2014-08-31 07:57:34+00:00",
                "closed"
            ],
            [
                "2014-08-31 11:46:57+00:00",
                "reopened"
            ],
            [
                "2014-08-31 12:49:53+00:00",
                "commit"
            ],
            [
                "2014-08-31 21:55:10+00:00",
                "closed"
            ],
            [
                "2016-06-23 12:00:14+00:00",
                "commit"
            ]
        ],
        "status": false,
        "strategy": true,
        "total_changes": 117
    }
}