{
    "commits": [
        {
            "associated_pull_request": [],
            "date": "2020-11-14 14:02:08+00:00",
            "diff": "",
            "diff_additions": 0,
            "diff_deletions": 0,
            "diff_file_size": 0,
            "diff_url": "https://github.com/koekeishiya/yabai/commit/11daa7d190d5f115171daa30f7894c6fc91427f0.diff",
            "exists": true,
            "files": [],
            "interesting": {
                "reopen": false,
                "status": false
            },
            "is_parent": true,
            "sha": "11daa7d190d5f115171daa30f7894c6fc91427f0"
        },
        {
            "associated_pull_request": [],
            "date": "2020-11-14 16:57:25+00:00",
            "diff": "koekeishiya_yabai/issue_707/commit_6fec962e3ab1df762a32989ca257d2a727f57365.diff",
            "diff_additions": 8,
            "diff_deletions": 2,
            "diff_file_size": 100979,
            "diff_url": "https://github.com/koekeishiya/yabai/commit/6fec962e3ab1df762a32989ca257d2a727f57365.diff",
            "exists": true,
            "files": [
                {
                    "file_additions": 3,
                    "file_deletions": 1,
                    "file_exists": true,
                    "file_name": "src/window.c",
                    "file_size": 15561
                },
                {
                    "file_additions": 5,
                    "file_deletions": 1,
                    "file_exists": true,
                    "file_name": "src/window_manager.c",
                    "file_size": 85418
                }
            ],
            "interesting": {
                "reopen": true,
                "status": false
            },
            "is_parent": false,
            "sha": "6fec962e3ab1df762a32989ca257d2a727f57365"
        },
        {
            "associated_pull_request": [],
            "date": "2020-11-14 16:57:25+00:00",
            "diff": "koekeishiya_yabai/issue_707/commit_5c2f5a6190255caaae5ec339ab94aad1b5cf3b27.diff",
            "diff_additions": 8,
            "diff_deletions": 2,
            "diff_file_size": 100979,
            "diff_url": "https://github.com/koekeishiya/yabai/commit/5c2f5a6190255caaae5ec339ab94aad1b5cf3b27.diff",
            "exists": true,
            "files": [
                {
                    "file_additions": 3,
                    "file_deletions": 1,
                    "file_exists": true,
                    "file_name": "src/window.c",
                    "file_size": 15561
                },
                {
                    "file_additions": 5,
                    "file_deletions": 1,
                    "file_exists": true,
                    "file_name": "src/window_manager.c",
                    "file_size": 85418
                }
            ],
            "interesting": {
                "reopen": false,
                "status": false
            },
            "is_parent": false,
            "sha": "5c2f5a6190255caaae5ec339ab94aad1b5cf3b27"
        }
    ],
    "first_commit": "2020-11-14 14:02:08+00:00",
    "last_commit": "2020-11-14 16:57:25+00:00",
    "number": 707,
    "pull_request": "None",
    "score": {
        "accidental_reopen_likely": true,
        "all_labels": [
            "bug"
        ],
        "contains_keywords": [
            "confirm",
            "chang",
            "fix",
            "issu",
            "perform",
            "report"
        ],
        "fix_size": 13,
        "has_labels": [
            "bug"
        ],
        "intersecting": {
            "computed_score": 0.7,
            "final_commit_size": 10,
            "intersection_size": 7,
            "previous_commits_size": 10
        },
        "is_makefile_based": true,
        "no_new_files": [],
        "no_other_files": false,
        "num_prohibited_files": 10173,
        "prohibited_files": [
            "server/src/main/java/com/genymobile/scrcpy/Device.java",
            "server/src/main/java/com/genymobile/scrcpy/wrappers/SurfaceControl.java",
            "server/src/main/java/com/genymobile/scrcpy/Device.java",
            "server/src/main/java/com/genymobile/scrcpy/wrappers/SurfaceControl.java",
            "app/meson.build",
            "app/scrcpy.1",
            "app/src/common.h",
            "app/src/scrcpy.h",
            "app/src/server.h",
            "server/src/main/java/com/genymobile/scrcpy/Workarounds.java"
        ],
        "reopen": true,
        "reopen_events": [
            [
                "2020-11-14 16:57:32+00:00",
                "commit"
            ],
            [
                "2020-11-21 23:53:25+00:00",
                "closed"
            ],
            [
                "2020-12-03 19:58:29+00:00",
                "reopened"
            ],
            [
                "2020-12-03 19:58:30+00:00",
                "closed"
            ],
            [
                "2022-01-26 20:30:53+00:00",
                "commit"
            ]
        ],
        "status": false,
        "strategy": true,
        "total_changes": 20
    }
}