{
    "commits": [
        {
            "associated_pull_request": [
                "https://github.com/EdgeTX/edgetx/pull/872"
            ],
            "date": "2021-10-06 06:31:58+00:00",
            "diff": "",
            "diff_additions": 0,
            "diff_deletions": 0,
            "diff_file_size": 0,
            "diff_url": "https://github.com/EdgeTX/edgetx/commit/36d4a8ac321a3ad428d987b3d7e55ab2a4b3a0e2.diff",
            "exists": true,
            "files": [],
            "interesting": {
                "reopen": false,
                "status": false
            },
            "is_parent": true,
            "sha": "36d4a8ac321a3ad428d987b3d7e55ab2a4b3a0e2"
        },
        {
            "associated_pull_request": [
                "https://github.com/EdgeTX/edgetx/pull/872"
            ],
            "date": "2021-10-06 09:43:30+00:00",
            "diff": "edgetx_edgetx/issue_841/commit_b6df60b1725faf0fabecffa4f117d78c5599ab90.diff",
            "diff_additions": 2,
            "diff_deletions": 2,
            "diff_file_size": 12574,
            "diff_url": "https://github.com/EdgeTX/edgetx/commit/b6df60b1725faf0fabecffa4f117d78c5599ab90.diff",
            "exists": true,
            "files": [
                {
                    "file_additions": 2,
                    "file_deletions": 2,
                    "file_exists": true,
                    "file_name": "radio/src/gui/colorlcd/view_statistics.cpp",
                    "file_size": 12574
                }
            ],
            "interesting": {
                "reopen": false,
                "status": false
            },
            "is_parent": false,
            "sha": "b6df60b1725faf0fabecffa4f117d78c5599ab90"
        },
        {
            "associated_pull_request": [
                "https://github.com/EdgeTX/edgetx/pull/872"
            ],
            "date": "2021-10-06 11:14:49+00:00",
            "diff": "edgetx_edgetx/issue_841/commit_247d2b0fd889f6b285e75b3c902ce2f337cf660e.diff",
            "diff_additions": 166,
            "diff_deletions": 138,
            "diff_file_size": 12574,
            "diff_url": "https://github.com/EdgeTX/edgetx/commit/247d2b0fd889f6b285e75b3c902ce2f337cf660e.diff",
            "exists": true,
            "files": [
                {
                    "file_additions": 166,
                    "file_deletions": 138,
                    "file_exists": true,
                    "file_name": "radio/src/gui/colorlcd/view_statistics.cpp",
                    "file_size": 12574
                }
            ],
            "interesting": {
                "reopen": false,
                "status": false
            },
            "is_parent": false,
            "sha": "247d2b0fd889f6b285e75b3c902ce2f337cf660e"
        },
        {
            "associated_pull_request": [],
            "date": "2021-10-06 11:14:49+00:00",
            "diff": "edgetx_edgetx/issue_841/commit_72b92e1f966d5d3ad6a13df2e460e34676134032.diff",
            "diff_additions": 166,
            "diff_deletions": 138,
            "diff_file_size": 12574,
            "diff_url": "https://github.com/EdgeTX/edgetx/commit/72b92e1f966d5d3ad6a13df2e460e34676134032.diff",
            "exists": true,
            "files": [
                {
                    "file_additions": 166,
                    "file_deletions": 138,
                    "file_exists": true,
                    "file_name": "radio/src/gui/colorlcd/view_statistics.cpp",
                    "file_size": 12574
                }
            ],
            "interesting": {
                "reopen": true,
                "status": false
            },
            "is_parent": false,
            "sha": "72b92e1f966d5d3ad6a13df2e460e34676134032"
        },
        {
            "associated_pull_request": [],
            "date": "2021-10-12 11:34:37+00:00",
            "diff": "edgetx_edgetx/issue_841/commit_ac100a3b85157fb26ffdf9dc2186c7fb6b1d2c9f.diff",
            "diff_additions": 4,
            "diff_deletions": 0,
            "diff_file_size": 12574,
            "diff_url": "https://github.com/EdgeTX/edgetx/commit/ac100a3b85157fb26ffdf9dc2186c7fb6b1d2c9f.diff",
            "exists": true,
            "files": [
                {
                    "file_additions": 4,
                    "file_deletions": 0,
                    "file_exists": true,
                    "file_name": "radio/src/gui/colorlcd/view_statistics.cpp",
                    "file_size": 12574
                }
            ],
            "interesting": {
                "reopen": false,
                "status": false
            },
            "is_parent": false,
            "sha": "ac100a3b85157fb26ffdf9dc2186c7fb6b1d2c9f"
        },
        {
            "associated_pull_request": [
                "https://github.com/EdgeTX/edgetx/pull/902"
            ],
            "date": "2021-10-12 11:34:37+00:00",
            "diff": "edgetx_edgetx/issue_841/commit_4e538f6c63d1a7427dcf16c543f59941699d6aa2.diff",
            "diff_additions": 4,
            "diff_deletions": 0,
            "diff_file_size": 12574,
            "diff_url": "https://github.com/EdgeTX/edgetx/commit/4e538f6c63d1a7427dcf16c543f59941699d6aa2.diff",
            "exists": true,
            "files": [
                {
                    "file_additions": 4,
                    "file_deletions": 0,
                    "file_exists": true,
                    "file_name": "radio/src/gui/colorlcd/view_statistics.cpp",
                    "file_size": 12574
                }
            ],
            "interesting": {
                "reopen": false,
                "status": false
            },
            "is_parent": false,
            "sha": "4e538f6c63d1a7427dcf16c543f59941699d6aa2"
        },
        {
            "associated_pull_request": [
                "https://github.com/EdgeTX/edgetx/pull/902"
            ],
            "date": "2021-10-12 11:34:37+00:00",
            "diff": "edgetx_edgetx/issue_841/commit_38aba6a8cc32d10c5a52908adeb1e9e79184ad7f.diff",
            "diff_additions": 4,
            "diff_deletions": 0,
            "diff_file_size": 12574,
            "diff_url": "https://github.com/EdgeTX/edgetx/commit/38aba6a8cc32d10c5a52908adeb1e9e79184ad7f.diff",
            "exists": true,
            "files": [
                {
                    "file_additions": 4,
                    "file_deletions": 0,
                    "file_exists": true,
                    "file_name": "radio/src/gui/colorlcd/view_statistics.cpp",
                    "file_size": 12574
                }
            ],
            "interesting": {
                "reopen": false,
                "status": false
            },
            "is_parent": false,
            "sha": "38aba6a8cc32d10c5a52908adeb1e9e79184ad7f"
        }
    ],
    "first_commit": "2021-10-06 06:31:58+00:00",
    "last_commit": "2021-10-13 05:54:36+00:00",
    "number": 841,
    "pull_request": "None",
    "score": {
        "accidental_reopen_likely": false,
        "all_labels": [
            "bug \ud83e\udeb2",
            "color",
            "UX-UI"
        ],
        "contains_keywords": [
            "work",
            "chang",
            "fix",
            "test",
            "remov",
            "bug"
        ],
        "fix_size": 222,
        "has_labels": [],
        "intersecting": {
            "computed_score": 1.0,
            "final_commit_size": 5,
            "intersection_size": 5,
            "previous_commits_size": 222
        },
        "is_makefile_based": true,
        "no_new_files": [],
        "no_other_files": false,
        "num_prohibited_files": 305835,
        "prohibited_files": [
            "server/src/main/java/com/genymobile/scrcpy/Device.java",
            "server/src/main/java/com/genymobile/scrcpy/wrappers/SurfaceControl.java",
            "server/src/main/java/com/genymobile/scrcpy/Device.java",
            "server/src/main/java/com/genymobile/scrcpy/wrappers/SurfaceControl.java",
            "app/meson.build",
            "app/scrcpy.1",
            "app/src/common.h",
            "app/src/scrcpy.h",
            "app/src/server.h",
            "server/src/main/java/com/genymobile/scrcpy/Workarounds.java"
        ],
        "reopen": true,
        "reopen_events": [
            [
                "2021-10-06 09:43:36+00:00",
                "commit"
            ],
            [
                "2021-10-06 11:14:50+00:00",
                "closed"
            ],
            [
                "2021-10-06 11:14:50+00:00",
                "commit"
            ],
            [
                "2021-10-06 12:13:06+00:00",
                "commit"
            ],
            [
                "2021-10-12 10:29:21+00:00",
                "reopened"
            ],
            [
                "2021-10-12 11:34:38+00:00",
                "commit"
            ],
            [
                "2021-10-13 04:51:04+00:00",
                "commit"
            ],
            [
                "2021-10-13 05:54:37+00:00",
                "closed"
            ],
            [
                "2021-10-13 05:54:39+00:00",
                "commit"
            ]
        ],
        "status": false,
        "strategy": true,
        "total_changes": 624
    }
}