{
    "category": [
        "build/refactor/preprocessing",
        "network/protocol"
    ],
    "commits": [
        {
            "associated_pull_request": [
                "https://github.com/open-mpi/ompi/pull/4631"
            ],
            "date": "2017-12-17 16:23:03",
            "diff": "",
            "diff_additions": 0,
            "diff_deletions": 0,
            "diff_file_size": 0,
            "diff_url": "https://github.com/open-mpi/ompi/commit/3d80794df2261e402075f3a04627d14288903db7.diff",
            "exists": true,
            "files": [],
            "interesting": {
                "reopen": false,
                "status": true
            },
            "is_parent": true,
            "sha": "3d80794df2261e402075f3a04627d14288903db7"
        },
        {
            "associated_pull_request": [],
            "date": "2017-12-18 07:39:15",
            "diff": "open-mpi_ompi/issue_4098/commit_18bad4834c9ed2b0b99745e84a92af1aebf70df9.diff",
            "diff_additions": 0,
            "diff_deletions": 2,
            "diff_file_size": 3792,
            "diff_url": "https://github.com/open-mpi/ompi/commit/18bad4834c9ed2b0b99745e84a92af1aebf70df9.diff",
            "exists": true,
            "files": [
                {
                    "file_additions": 0,
                    "file_deletions": 2,
                    "file_exists": true,
                    "file_name": "oshmem/shmem/c/shmem_broadcast.c",
                    "file_size": 3792
                }
            ],
            "interesting": {
                "reopen": false,
                "status": true
            },
            "is_parent": false,
            "sha": "18bad4834c9ed2b0b99745e84a92af1aebf70df9"
        },
        {
            "associated_pull_request": [
                "https://github.com/open-mpi/ompi/pull/4635"
            ],
            "date": "2017-12-18 07:39:15",
            "diff": "open-mpi_ompi/issue_4098/commit_f6818af1abae8c54ca3b95c4460301830606e0ef.diff",
            "diff_additions": 1,
            "diff_deletions": 3,
            "diff_file_size": 3792,
            "diff_url": "https://github.com/open-mpi/ompi/commit/f6818af1abae8c54ca3b95c4460301830606e0ef.diff",
            "exists": true,
            "files": [
                {
                    "file_additions": 1,
                    "file_deletions": 3,
                    "file_exists": true,
                    "file_name": "oshmem/shmem/c/shmem_broadcast.c",
                    "file_size": 3792
                }
            ],
            "interesting": {
                "reopen": false,
                "status": false
            },
            "is_parent": false,
            "sha": "f6818af1abae8c54ca3b95c4460301830606e0ef"
        }
    ],
    "first_commit": "2017-12-17 16:23:03",
    "last_commit": "2017-12-19 08:41:12",
    "number": 4098,
    "pull_request": "None",
    "score": {
        "accidental_reopen_likely": false,
        "all_labels": [
            "bug"
        ],
        "contains_keywords": [
            "fix",
            "remov",
            "issu",
            "confirm"
        ],
        "fix_size": 4,
        "has_labels": [
            "bug"
        ],
        "intersecting": {
            "computed_score": 0.75,
            "final_commit_size": 4,
            "intersection_size": 3,
            "previous_commits_size": 3
        },
        "is_makefile_based": true,
        "no_new_files": [],
        "no_other_files": false,
        "num_prohibited_files": 39849,
        "prohibited_files": [
            "kill.h",
            "meminfo.h",
            "kill.h",
            "meminfo.h",
            "kill.h",
            "meminfo.h",
            "testsuite_cli_test.go",
            "testsuite_cli_test.go",
            "common.mk",
            "i3bar/include/draw_util.h"
        ],
        "reopen": false,
        "reopen_events": [
            [
                "2017-12-18 07:42:19",
                "commit"
            ],
            [
                "2017-12-18 07:47:26",
                "commit"
            ],
            [
                "2017-12-19 08:41:45",
                "commit"
            ],
            [
                "2018-01-17 17:11:10",
                "closed"
            ]
        ],
        "status": true,
        "strategy": true,
        "total_changes": 6
    }
}