{
    "category": [
        "control flow",
        "wrong API usage"
    ],
    "commits": [
        {
            "associated_pull_request": [],
            "date": "2019-02-15 00:18:28",
            "diff": "",
            "diff_additions": 0,
            "diff_deletions": 0,
            "diff_file_size": 0,
            "diff_url": "https://github.com/libratbag/libratbag/commit/9110ccb73cef15cb9d025b3d4b5d16fdae0e4714.diff",
            "exists": true,
            "files": [],
            "interesting": {
                "reopen": false,
                "status": false
            },
            "is_parent": true,
            "sha": "9110ccb73cef15cb9d025b3d4b5d16fdae0e4714"
        },
        {
            "associated_pull_request": [],
            "date": "2019-02-17 22:38:01",
            "diff": "libratbag_libratbag/issue_617/commit_20ef5c693f1184e08755ce5ec943cfa26d49038c.diff",
            "diff_additions": 8,
            "diff_deletions": 1,
            "diff_file_size": 12995,
            "diff_url": "https://github.com/libratbag/libratbag/commit/20ef5c693f1184e08755ce5ec943cfa26d49038c.diff",
            "exists": true,
            "files": [
                {
                    "file_additions": 8,
                    "file_deletions": 1,
                    "file_exists": true,
                    "file_name": "ratbagd/ratbagd-device.c",
                    "file_size": 12995
                }
            ],
            "interesting": {
                "reopen": false,
                "status": false
            },
            "is_parent": false,
            "sha": "20ef5c693f1184e08755ce5ec943cfa26d49038c"
        },
        {
            "associated_pull_request": [],
            "date": "2019-02-17 22:38:01",
            "diff": "libratbag_libratbag/issue_617/commit_33a35d397fd3651b2571e858ab2d85bdd268485b.diff",
            "diff_additions": 8,
            "diff_deletions": 1,
            "diff_file_size": 23793,
            "diff_url": "https://github.com/libratbag/libratbag/commit/33a35d397fd3651b2571e858ab2d85bdd268485b.diff",
            "exists": true,
            "files": [
                {
                    "file_additions": 8,
                    "file_deletions": 1,
                    "file_exists": true,
                    "file_name": "ratbagd/ratbagd-profile.c",
                    "file_size": 23793
                }
            ],
            "interesting": {
                "reopen": false,
                "status": true
            },
            "is_parent": false,
            "sha": "33a35d397fd3651b2571e858ab2d85bdd268485b"
        },
        {
            "associated_pull_request": [
                "https://github.com/libratbag/libratbag/pull/619"
            ],
            "date": "2019-02-17 22:38:01",
            "diff": "libratbag_libratbag/issue_617/commit_1511e70b873acab0efbda9d4fd1b398935e0c284.diff",
            "diff_additions": 8,
            "diff_deletions": 1,
            "diff_file_size": 23793,
            "diff_url": "https://github.com/libratbag/libratbag/commit/1511e70b873acab0efbda9d4fd1b398935e0c284.diff",
            "exists": true,
            "files": [
                {
                    "file_additions": 8,
                    "file_deletions": 1,
                    "file_exists": true,
                    "file_name": "ratbagd/ratbagd-profile.c",
                    "file_size": 23793
                }
            ],
            "interesting": {
                "reopen": false,
                "status": false
            },
            "is_parent": false,
            "sha": "1511e70b873acab0efbda9d4fd1b398935e0c284"
        },
        {
            "associated_pull_request": [
                "https://github.com/libratbag/libratbag/pull/619"
            ],
            "date": "2019-02-17 22:38:01",
            "diff": "libratbag_libratbag/issue_617/commit_caa75d170d5ed5d538370b38d7e96d6f81df3e66.diff",
            "diff_additions": 8,
            "diff_deletions": 1,
            "diff_file_size": 23793,
            "diff_url": "https://github.com/libratbag/libratbag/commit/caa75d170d5ed5d538370b38d7e96d6f81df3e66.diff",
            "exists": true,
            "files": [
                {
                    "file_additions": 8,
                    "file_deletions": 1,
                    "file_exists": true,
                    "file_name": "ratbagd/ratbagd-profile.c",
                    "file_size": 23793
                }
            ],
            "interesting": {
                "reopen": false,
                "status": true
            },
            "is_parent": false,
            "sha": "caa75d170d5ed5d538370b38d7e96d6f81df3e66"
        },
        {
            "associated_pull_request": [
                "https://github.com/libratbag/libratbag/pull/658"
            ],
            "date": "2019-02-27 06:29:26",
            "diff": "libratbag_libratbag/issue_617/commit_3589db85e543ee7f11b05f14aee7cdc6ac3f3169.diff",
            "diff_additions": 19,
            "diff_deletions": 12,
            "diff_file_size": 23793,
            "diff_url": "https://github.com/libratbag/libratbag/commit/3589db85e543ee7f11b05f14aee7cdc6ac3f3169.diff",
            "exists": true,
            "files": [
                {
                    "file_additions": 19,
                    "file_deletions": 12,
                    "file_exists": true,
                    "file_name": "ratbagd/ratbagd-profile.c",
                    "file_size": 23793
                }
            ],
            "interesting": {
                "reopen": false,
                "status": false
            },
            "is_parent": false,
            "sha": "3589db85e543ee7f11b05f14aee7cdc6ac3f3169"
        },
        {
            "associated_pull_request": [
                "https://github.com/libratbag/libratbag/pull/658"
            ],
            "date": "2019-02-27 06:29:26",
            "diff": "libratbag_libratbag/issue_617/commit_94d32930e2f6888d01c8088a0a9fe6c40518799e.diff",
            "diff_additions": 19,
            "diff_deletions": 12,
            "diff_file_size": 23793,
            "diff_url": "https://github.com/libratbag/libratbag/commit/94d32930e2f6888d01c8088a0a9fe6c40518799e.diff",
            "exists": true,
            "files": [
                {
                    "file_additions": 19,
                    "file_deletions": 12,
                    "file_exists": true,
                    "file_name": "ratbagd/ratbagd-profile.c",
                    "file_size": 23793
                }
            ],
            "interesting": {
                "reopen": false,
                "status": false
            },
            "is_parent": false,
            "sha": "94d32930e2f6888d01c8088a0a9fe6c40518799e"
        }
    ],
    "first_commit": "2019-02-15 00:18:28",
    "last_commit": "2019-03-15 07:25:00",
    "number": 617,
    "pull_request": "None",
    "score": {
        "accidental_reopen_likely": false,
        "all_labels": [
            "libratbag"
        ],
        "contains_keywords": [
            "fail",
            "chang",
            "error",
            "workaround",
            "test",
            "fix",
            "issu",
            "work",
            "CI",
            "fault"
        ],
        "fix_size": 32,
        "has_labels": [],
        "intersecting": {
            "computed_score": 1.0,
            "final_commit_size": 22,
            "intersection_size": 22,
            "previous_commits_size": 32
        },
        "is_makefile_based": false,
        "no_new_files": [],
        "no_other_files": false,
        "num_prohibited_files": 142768,
        "prohibited_files": [
            "hal/inc/pinmap_hal.h",
            "Debug/marvin.bin",
            "Debug/marvin.elf",
            "Debug/marvin.hex",
            "Debug/marvin.bin",
            "Debug/marvin.elf",
            "Debug/marvin.hex",
            "inc/spark_utilities.h",
            "Debug/marvin.bin",
            "Debug/marvin.elf"
        ],
        "reopen": false,
        "reopen_events": [
            [
                "2019-02-17 23:07:12",
                "commit"
            ],
            [
                "2019-02-17 23:07:43",
                "commit"
            ],
            [
                "2019-02-17 23:21:18",
                "commit"
            ],
            [
                "2019-02-17 23:48:19",
                "commit"
            ],
            [
                "2019-02-20 01:13:45",
                "commit"
            ],
            [
                "2019-02-20 01:26:25",
                "closed"
            ],
            [
                "2019-02-20 01:26:27",
                "commit"
            ],
            [
                "2019-03-14 23:59:20",
                "commit"
            ],
            [
                "2019-03-15 07:25:03",
                "commit"
            ]
        ],
        "status": true,
        "strategy": true,
        "total_changes": 98
    }
}