{
    "category": [
        "memory"
    ],
    "commits": [
        {
            "associated_pull_request": [],
            "date": "2020-03-27 05:43:29",
            "diff": "",
            "diff_additions": 0,
            "diff_deletions": 0,
            "diff_file_size": 0,
            "diff_url": "https://github.com/gluster/glusterfs/commit/4398f68dada29418d2ec68ec538ec1378108221a.diff",
            "exists": true,
            "files": [],
            "interesting": {
                "reopen": false,
                "status": false
            },
            "is_parent": true,
            "sha": "4398f68dada29418d2ec68ec538ec1378108221a"
        },
        {
            "associated_pull_request": [],
            "date": "2020-04-07 10:35:16",
            "diff": "gluster_glusterfs/issue_1152/commit_9115dd39e953953495d48c6d6f24f44828f8bd5f.diff",
            "diff_additions": 27,
            "diff_deletions": 0,
            "diff_file_size": 217307,
            "diff_url": "https://github.com/gluster/glusterfs/commit/9115dd39e953953495d48c6d6f24f44828f8bd5f.diff",
            "exists": true,
            "files": [
                {
                    "file_additions": 27,
                    "file_deletions": 0,
                    "file_exists": true,
                    "file_name": "xlators/mount/fuse/src/fuse-bridge.c",
                    "file_size": 217307
                }
            ],
            "interesting": {
                "reopen": true,
                "status": false
            },
            "is_parent": false,
            "sha": "9115dd39e953953495d48c6d6f24f44828f8bd5f"
        },
        {
            "associated_pull_request": [],
            "date": "2020-04-07 10:35:16",
            "diff": "gluster_glusterfs/issue_1152/commit_03f6c600b201d672a251df95cd8a11decf94e7ef.diff",
            "diff_additions": 27,
            "diff_deletions": 0,
            "diff_file_size": 217307,
            "diff_url": "https://github.com/gluster/glusterfs/commit/03f6c600b201d672a251df95cd8a11decf94e7ef.diff",
            "exists": true,
            "files": [
                {
                    "file_additions": 27,
                    "file_deletions": 0,
                    "file_exists": true,
                    "file_name": "xlators/mount/fuse/src/fuse-bridge.c",
                    "file_size": 217307
                }
            ],
            "interesting": {
                "reopen": false,
                "status": false
            },
            "is_parent": false,
            "sha": "03f6c600b201d672a251df95cd8a11decf94e7ef"
        },
        {
            "associated_pull_request": [],
            "date": "2020-04-07 10:35:16",
            "diff": "gluster_glusterfs/issue_1152/commit_ce037b615c46c27278fa91065643ec51ceb764df.diff",
            "diff_additions": 27,
            "diff_deletions": 0,
            "diff_file_size": 217307,
            "diff_url": "https://github.com/gluster/glusterfs/commit/ce037b615c46c27278fa91065643ec51ceb764df.diff",
            "exists": true,
            "files": [
                {
                    "file_additions": 27,
                    "file_deletions": 0,
                    "file_exists": true,
                    "file_name": "xlators/mount/fuse/src/fuse-bridge.c",
                    "file_size": 217307
                }
            ],
            "interesting": {
                "reopen": false,
                "status": false
            },
            "is_parent": false,
            "sha": "ce037b615c46c27278fa91065643ec51ceb764df"
        }
    ],
    "first_commit": "2020-04-08 11:22:56",
    "last_commit": "2020-04-22 05:21:08",
    "number": 1152,
    "pull_request": "None",
    "score": {
        "accidental_reopen_likely": false,
        "all_labels": [
            "Type:Bug",
            "release 7",
            "release-6",
            "wontfix"
        ],
        "contains_keywords": [
            "fail",
            "bug",
            "test",
            "patch",
            "issu"
        ],
        "fix_size": 82,
        "has_labels": [],
        "intersecting": {
            "computed_score": 0.03571428571428571,
            "final_commit_size": 28,
            "intersection_size": 1,
            "previous_commits_size": 55
        },
        "is_makefile_based": true,
        "no_new_files": [],
        "no_other_files": false,
        "num_prohibited_files": 54703,
        "prohibited_files": [
            "hal/inc/pinmap_hal.h",
            "Debug/marvin.bin",
            "Debug/marvin.elf",
            "Debug/marvin.hex",
            "Debug/marvin.bin",
            "Debug/marvin.elf",
            "Debug/marvin.hex",
            "inc/spark_utilities.h",
            "Debug/marvin.bin",
            "Debug/marvin.elf"
        ],
        "reopen": true,
        "reopen_events": [
            [
                "2020-04-09 04:15:39",
                "closed"
            ],
            [
                "2020-04-09 04:15:39",
                "commit"
            ],
            [
                "2020-04-13 04:40:28",
                "reopened"
            ],
            [
                "2020-04-14 12:49:55",
                "commit"
            ],
            [
                "2020-04-22 05:21:29",
                "commit"
            ],
            [
                "2020-12-03 08:27:22",
                "closed"
            ]
        ],
        "status": false,
        "strategy": true,
        "total_changes": 81
    }
}