{
    "category": [
        "",
        "network/protocols"
    ],
    "commits": [
        {
            "associated_pull_request": [],
            "date": "2016-05-30 04:20:51",
            "diff": "nanomsg_nanomsg/issue_732/commit_e2c1073e272242916ce384c49ec5cd91e71d162b.diff",
            "diff_additions": 13,
            "diff_deletions": 2,
            "diff_file_size": 6009,
            "diff_url": "https://github.com/nanomsg/nanomsg/commit/e2c1073e272242916ce384c49ec5cd91e71d162b.diff",
            "exists": true,
            "files": [
                {
                    "file_additions": 13,
                    "file_deletions": 2,
                    "file_exists": true,
                    "file_name": "src/aio/fsm.c",
                    "file_size": 6009
                }
            ],
            "interesting": {
                "reopen": false,
                "status": false
            },
            "is_parent": true,
            "sha": "e2c1073e272242916ce384c49ec5cd91e71d162b"
        },
        {
            "associated_pull_request": [],
            "date": "2016-05-30 04:46:35",
            "diff": "nanomsg_nanomsg/issue_732/commit_c1c5421646cab28b89f507fd144daa173bc20641.diff",
            "diff_additions": 34,
            "diff_deletions": 0,
            "diff_file_size": 10954,
            "diff_url": "https://github.com/nanomsg/nanomsg/commit/c1c5421646cab28b89f507fd144daa173bc20641.diff",
            "exists": true,
            "files": [
                {
                    "file_additions": 9,
                    "file_deletions": 0,
                    "file_exists": true,
                    "file_name": "perf/local_lat.c",
                    "file_size": 2676
                },
                {
                    "file_additions": 9,
                    "file_deletions": 0,
                    "file_exists": true,
                    "file_name": "perf/local_thr.c",
                    "file_size": 2907
                },
                {
                    "file_additions": 3,
                    "file_deletions": 0,
                    "file_exists": true,
                    "file_name": "perf/remote_lat.c",
                    "file_size": 2816
                },
                {
                    "file_additions": 13,
                    "file_deletions": 0,
                    "file_exists": true,
                    "file_name": "perf/remote_thr.c",
                    "file_size": 2555
                }
            ],
            "interesting": {
                "reopen": false,
                "status": true
            },
            "is_parent": false,
            "sha": "c1c5421646cab28b89f507fd144daa173bc20641"
        },
        {
            "associated_pull_request": [],
            "date": "2016-05-30 19:03:43",
            "diff": "nanomsg_nanomsg/issue_732/commit_3ace215edf845b4f32bc9bec2a3550e562a328b2.diff",
            "diff_additions": 2,
            "diff_deletions": 2,
            "diff_file_size": 5231,
            "diff_url": "https://github.com/nanomsg/nanomsg/commit/3ace215edf845b4f32bc9bec2a3550e562a328b2.diff",
            "exists": true,
            "files": [
                {
                    "file_additions": 1,
                    "file_deletions": 1,
                    "file_exists": true,
                    "file_name": "perf/local_lat.c",
                    "file_size": 2676
                },
                {
                    "file_additions": 1,
                    "file_deletions": 1,
                    "file_exists": true,
                    "file_name": "perf/remote_thr.c",
                    "file_size": 2555
                }
            ],
            "interesting": {
                "reopen": false,
                "status": false
            },
            "is_parent": false,
            "sha": "3ace215edf845b4f32bc9bec2a3550e562a328b2"
        }
    ],
    "first_commit": "2016-05-30 04:23:08",
    "last_commit": "2016-05-30 19:03:43",
    "number": 732,
    "pull_request": "None",
    "score": {
        "accidental_reopen_likely": false,
        "all_labels": [],
        "contains_keywords": [
            "fix",
            "test",
            "perform"
        ],
        "fix_size": 38,
        "has_labels": [],
        "intersecting": {
            "computed_score": 1.0,
            "final_commit_size": 4,
            "intersection_size": 4,
            "previous_commits_size": 38
        },
        "is_makefile_based": true,
        "no_new_files": [],
        "no_other_files": true,
        "num_prohibited_files": 66492,
        "prohibited_files": [
            "kill.h",
            "meminfo.h",
            "kill.h",
            "meminfo.h",
            "kill.h",
            "meminfo.h",
            "testsuite_cli_test.go",
            "testsuite_cli_test.go",
            "common.mk",
            "i3bar/include/draw_util.h"
        ],
        "reopen": false,
        "reopen_events": [
            [
                "2016-05-30 04:47:08",
                "commit"
            ],
            [
                "2016-05-30 04:47:15",
                "closed"
            ],
            [
                "2016-05-30 04:47:15",
                "commit"
            ],
            [
                "2016-05-30 19:04:11",
                "commit"
            ]
        ],
        "status": true,
        "strategy": true,
        "total_changes": 53
    }
}