{
    "commits": [
        {
            "diff": "elastic_elasticsearch/issue_36872/commit_21703fedffadee5ee5e583d67bed4f77eaf59ca4.diff",
            "diff_additions": 697,
            "diff_deletions": 299,
            "diff_file_size": 358851,
            "files": [
                {
                    "file_additions": 9,
                    "file_deletions": 10,
                    "file_exists": true,
                    "file_name": "x-pack/plugin/core/src/main/java/org/elasticsearch/xpack/core/security/authc/support/TokensInvalidationResult.java",
                    "file_size": 4590
                },
                {
                    "file_additions": 3,
                    "file_deletions": 6,
                    "file_exists": true,
                    "file_name": "x-pack/plugin/core/src/test/java/org/elasticsearch/xpack/core/security/action/token/InvalidateTokenResponseTests.java",
                    "file_size": 5416
                },
                {
                    "file_additions": 1,
                    "file_deletions": 1,
                    "file_exists": true,
                    "file_name": "x-pack/plugin/security/src/main/java/org/elasticsearch/xpack/security/action/saml/TransportSamlAuthenticateAction.java",
                    "file_size": 4640
                },
                {
                    "file_additions": 1,
                    "file_deletions": 1,
                    "file_exists": true,
                    "file_name": "x-pack/plugin/security/src/main/java/org/elasticsearch/xpack/security/action/token/TransportCreateTokenAction.java",
                    "file_size": 9622
                },
                {
                    "file_additions": 1,
                    "file_deletions": 1,
                    "file_exists": true,
                    "file_name": "x-pack/plugin/security/src/main/java/org/elasticsearch/xpack/security/action/token/TransportRefreshTokenAction.java",
                    "file_size": 2114
                },
                {
                    "file_additions": 525,
                    "file_deletions": 252,
                    "file_exists": true,
                    "file_name": "x-pack/plugin/security/src/main/java/org/elasticsearch/xpack/security/authc/TokenService.java",
                    "file_size": 138713
                },
                {
                    "file_additions": 1,
                    "file_deletions": 1,
                    "file_exists": true,
                    "file_name": "x-pack/plugin/security/src/test/java/org/elasticsearch/xpack/security/action/saml/TransportSamlLogoutActionTests.java",
                    "file_size": 15447
                },
                {
                    "file_additions": 2,
                    "file_deletions": 2,
                    "file_exists": true,
                    "file_name": "x-pack/plugin/security/src/test/java/org/elasticsearch/xpack/security/authc/AuthenticationServiceTests.java",
                    "file_size": 112054
                },
                {
                    "file_additions": 101,
                    "file_deletions": 2,
                    "file_exists": false,
                    "file_name": "x-pack/plugin/security/src/test/java/org/elasticsearch/xpack/security/authc/TokenAuthIntegTests.java",
                    "file_size": 0
                },
                {
                    "file_additions": 50,
                    "file_deletions": 18,
                    "file_exists": true,
                    "file_name": "x-pack/plugin/security/src/test/java/org/elasticsearch/xpack/security/authc/TokenServiceTests.java",
                    "file_size": 63124
                },
                {
                    "file_additions": 3,
                    "file_deletions": 5,
                    "file_exists": true,
                    "file_name": "x-pack/plugin/security/src/test/java/org/elasticsearch/xpack/security/authc/support/TokensInvalidationResultTests.java",
                    "file_size": 3131
                }
            ],
            "interesting": {
                "reopened": false,
                "status": false
            },
            "sha": "21703fedffadee5ee5e583d67bed4f77eaf59ca4"
        },
        {
            "diff": "elastic_elasticsearch/issue_36872/commit_7145f64590c6cebf65d7592acf48f9e7b2b1fdc4.diff",
            "diff_additions": 697,
            "diff_deletions": 299,
            "diff_file_size": 358851,
            "files": [
                {
                    "file_additions": 9,
                    "file_deletions": 10,
                    "file_exists": true,
                    "file_name": "x-pack/plugin/core/src/main/java/org/elasticsearch/xpack/core/security/authc/support/TokensInvalidationResult.java",
                    "file_size": 4590
                },
                {
                    "file_additions": 3,
                    "file_deletions": 6,
                    "file_exists": true,
                    "file_name": "x-pack/plugin/core/src/test/java/org/elasticsearch/xpack/core/security/action/token/InvalidateTokenResponseTests.java",
                    "file_size": 5416
                },
                {
                    "file_additions": 1,
                    "file_deletions": 1,
                    "file_exists": true,
                    "file_name": "x-pack/plugin/security/src/main/java/org/elasticsearch/xpack/security/action/saml/TransportSamlAuthenticateAction.java",
                    "file_size": 4640
                },
                {
                    "file_additions": 1,
                    "file_deletions": 1,
                    "file_exists": true,
                    "file_name": "x-pack/plugin/security/src/main/java/org/elasticsearch/xpack/security/action/token/TransportCreateTokenAction.java",
                    "file_size": 9622
                },
                {
                    "file_additions": 1,
                    "file_deletions": 1,
                    "file_exists": true,
                    "file_name": "x-pack/plugin/security/src/main/java/org/elasticsearch/xpack/security/action/token/TransportRefreshTokenAction.java",
                    "file_size": 2114
                },
                {
                    "file_additions": 525,
                    "file_deletions": 252,
                    "file_exists": true,
                    "file_name": "x-pack/plugin/security/src/main/java/org/elasticsearch/xpack/security/authc/TokenService.java",
                    "file_size": 138713
                },
                {
                    "file_additions": 1,
                    "file_deletions": 1,
                    "file_exists": true,
                    "file_name": "x-pack/plugin/security/src/test/java/org/elasticsearch/xpack/security/action/saml/TransportSamlLogoutActionTests.java",
                    "file_size": 15447
                },
                {
                    "file_additions": 2,
                    "file_deletions": 2,
                    "file_exists": true,
                    "file_name": "x-pack/plugin/security/src/test/java/org/elasticsearch/xpack/security/authc/AuthenticationServiceTests.java",
                    "file_size": 112054
                },
                {
                    "file_additions": 101,
                    "file_deletions": 2,
                    "file_exists": false,
                    "file_name": "x-pack/plugin/security/src/test/java/org/elasticsearch/xpack/security/authc/TokenAuthIntegTests.java",
                    "file_size": 0
                },
                {
                    "file_additions": 50,
                    "file_deletions": 18,
                    "file_exists": true,
                    "file_name": "x-pack/plugin/security/src/test/java/org/elasticsearch/xpack/security/authc/TokenServiceTests.java",
                    "file_size": 63124
                },
                {
                    "file_additions": 3,
                    "file_deletions": 5,
                    "file_exists": true,
                    "file_name": "x-pack/plugin/security/src/test/java/org/elasticsearch/xpack/security/authc/support/TokensInvalidationResultTests.java",
                    "file_size": 3131
                }
            ],
            "interesting": {
                "reopened": false,
                "status": false
            },
            "sha": "7145f64590c6cebf65d7592acf48f9e7b2b1fdc4"
        },
        {
            "diff": "elastic_elasticsearch/issue_36872/commit_e2599214e0e4635c066f420277c30dce76278168.diff",
            "diff_additions": 697,
            "diff_deletions": 299,
            "diff_file_size": 358851,
            "files": [
                {
                    "file_additions": 9,
                    "file_deletions": 10,
                    "file_exists": true,
                    "file_name": "x-pack/plugin/core/src/main/java/org/elasticsearch/xpack/core/security/authc/support/TokensInvalidationResult.java",
                    "file_size": 4590
                },
                {
                    "file_additions": 3,
                    "file_deletions": 6,
                    "file_exists": true,
                    "file_name": "x-pack/plugin/core/src/test/java/org/elasticsearch/xpack/core/security/action/token/InvalidateTokenResponseTests.java",
                    "file_size": 5416
                },
                {
                    "file_additions": 1,
                    "file_deletions": 1,
                    "file_exists": true,
                    "file_name": "x-pack/plugin/security/src/main/java/org/elasticsearch/xpack/security/action/saml/TransportSamlAuthenticateAction.java",
                    "file_size": 4640
                },
                {
                    "file_additions": 1,
                    "file_deletions": 1,
                    "file_exists": true,
                    "file_name": "x-pack/plugin/security/src/main/java/org/elasticsearch/xpack/security/action/token/TransportCreateTokenAction.java",
                    "file_size": 9622
                },
                {
                    "file_additions": 1,
                    "file_deletions": 1,
                    "file_exists": true,
                    "file_name": "x-pack/plugin/security/src/main/java/org/elasticsearch/xpack/security/action/token/TransportRefreshTokenAction.java",
                    "file_size": 2114
                },
                {
                    "file_additions": 525,
                    "file_deletions": 252,
                    "file_exists": true,
                    "file_name": "x-pack/plugin/security/src/main/java/org/elasticsearch/xpack/security/authc/TokenService.java",
                    "file_size": 138713
                },
                {
                    "file_additions": 1,
                    "file_deletions": 1,
                    "file_exists": true,
                    "file_name": "x-pack/plugin/security/src/test/java/org/elasticsearch/xpack/security/action/saml/TransportSamlLogoutActionTests.java",
                    "file_size": 15447
                },
                {
                    "file_additions": 2,
                    "file_deletions": 2,
                    "file_exists": true,
                    "file_name": "x-pack/plugin/security/src/test/java/org/elasticsearch/xpack/security/authc/AuthenticationServiceTests.java",
                    "file_size": 112054
                },
                {
                    "file_additions": 101,
                    "file_deletions": 2,
                    "file_exists": false,
                    "file_name": "x-pack/plugin/security/src/test/java/org/elasticsearch/xpack/security/authc/TokenAuthIntegTests.java",
                    "file_size": 0
                },
                {
                    "file_additions": 50,
                    "file_deletions": 18,
                    "file_exists": true,
                    "file_name": "x-pack/plugin/security/src/test/java/org/elasticsearch/xpack/security/authc/TokenServiceTests.java",
                    "file_size": 63124
                },
                {
                    "file_additions": 3,
                    "file_deletions": 5,
                    "file_exists": true,
                    "file_name": "x-pack/plugin/security/src/test/java/org/elasticsearch/xpack/security/authc/support/TokensInvalidationResultTests.java",
                    "file_size": 3131
                }
            ],
            "interesting": {
                "reopened": true,
                "status": false
            },
            "sha": "e2599214e0e4635c066f420277c30dce76278168"
        },
        {
            "diff": "elastic_elasticsearch/issue_36872/commit_578c019ffcc70f725db0f9c3d9aa01dd599b3d51.diff",
            "diff_additions": 697,
            "diff_deletions": 299,
            "diff_file_size": 358851,
            "files": [
                {
                    "file_additions": 9,
                    "file_deletions": 10,
                    "file_exists": true,
                    "file_name": "x-pack/plugin/core/src/main/java/org/elasticsearch/xpack/core/security/authc/support/TokensInvalidationResult.java",
                    "file_size": 4590
                },
                {
                    "file_additions": 3,
                    "file_deletions": 6,
                    "file_exists": true,
                    "file_name": "x-pack/plugin/core/src/test/java/org/elasticsearch/xpack/core/security/action/token/InvalidateTokenResponseTests.java",
                    "file_size": 5416
                },
                {
                    "file_additions": 1,
                    "file_deletions": 1,
                    "file_exists": true,
                    "file_name": "x-pack/plugin/security/src/main/java/org/elasticsearch/xpack/security/action/saml/TransportSamlAuthenticateAction.java",
                    "file_size": 4640
                },
                {
                    "file_additions": 1,
                    "file_deletions": 1,
                    "file_exists": true,
                    "file_name": "x-pack/plugin/security/src/main/java/org/elasticsearch/xpack/security/action/token/TransportCreateTokenAction.java",
                    "file_size": 9622
                },
                {
                    "file_additions": 1,
                    "file_deletions": 1,
                    "file_exists": true,
                    "file_name": "x-pack/plugin/security/src/main/java/org/elasticsearch/xpack/security/action/token/TransportRefreshTokenAction.java",
                    "file_size": 2114
                },
                {
                    "file_additions": 525,
                    "file_deletions": 252,
                    "file_exists": true,
                    "file_name": "x-pack/plugin/security/src/main/java/org/elasticsearch/xpack/security/authc/TokenService.java",
                    "file_size": 138713
                },
                {
                    "file_additions": 1,
                    "file_deletions": 1,
                    "file_exists": true,
                    "file_name": "x-pack/plugin/security/src/test/java/org/elasticsearch/xpack/security/action/saml/TransportSamlLogoutActionTests.java",
                    "file_size": 15447
                },
                {
                    "file_additions": 2,
                    "file_deletions": 2,
                    "file_exists": true,
                    "file_name": "x-pack/plugin/security/src/test/java/org/elasticsearch/xpack/security/authc/AuthenticationServiceTests.java",
                    "file_size": 112054
                },
                {
                    "file_additions": 101,
                    "file_deletions": 2,
                    "file_exists": false,
                    "file_name": "x-pack/plugin/security/src/test/java/org/elasticsearch/xpack/security/authc/TokenAuthIntegTests.java",
                    "file_size": 0
                },
                {
                    "file_additions": 50,
                    "file_deletions": 18,
                    "file_exists": true,
                    "file_name": "x-pack/plugin/security/src/test/java/org/elasticsearch/xpack/security/authc/TokenServiceTests.java",
                    "file_size": 63124
                },
                {
                    "file_additions": 3,
                    "file_deletions": 5,
                    "file_exists": true,
                    "file_name": "x-pack/plugin/security/src/test/java/org/elasticsearch/xpack/security/authc/support/TokensInvalidationResultTests.java",
                    "file_size": 3131
                }
            ],
            "interesting": {
                "reopened": false,
                "status": false
            },
            "sha": "578c019ffcc70f725db0f9c3d9aa01dd599b3d51"
        },
        {
            "diff": "elastic_elasticsearch/issue_36872/commit_7ed9d52824f466ddfecedc85e73d5bc8827a8fa7.diff",
            "diff_additions": 697,
            "diff_deletions": 299,
            "diff_file_size": 358851,
            "files": [
                {
                    "file_additions": 9,
                    "file_deletions": 10,
                    "file_exists": true,
                    "file_name": "x-pack/plugin/core/src/main/java/org/elasticsearch/xpack/core/security/authc/support/TokensInvalidationResult.java",
                    "file_size": 4590
                },
                {
                    "file_additions": 3,
                    "file_deletions": 6,
                    "file_exists": true,
                    "file_name": "x-pack/plugin/core/src/test/java/org/elasticsearch/xpack/core/security/action/token/InvalidateTokenResponseTests.java",
                    "file_size": 5416
                },
                {
                    "file_additions": 1,
                    "file_deletions": 1,
                    "file_exists": true,
                    "file_name": "x-pack/plugin/security/src/main/java/org/elasticsearch/xpack/security/action/saml/TransportSamlAuthenticateAction.java",
                    "file_size": 4640
                },
                {
                    "file_additions": 1,
                    "file_deletions": 1,
                    "file_exists": true,
                    "file_name": "x-pack/plugin/security/src/main/java/org/elasticsearch/xpack/security/action/token/TransportCreateTokenAction.java",
                    "file_size": 9622
                },
                {
                    "file_additions": 1,
                    "file_deletions": 1,
                    "file_exists": true,
                    "file_name": "x-pack/plugin/security/src/main/java/org/elasticsearch/xpack/security/action/token/TransportRefreshTokenAction.java",
                    "file_size": 2114
                },
                {
                    "file_additions": 525,
                    "file_deletions": 252,
                    "file_exists": true,
                    "file_name": "x-pack/plugin/security/src/main/java/org/elasticsearch/xpack/security/authc/TokenService.java",
                    "file_size": 138713
                },
                {
                    "file_additions": 1,
                    "file_deletions": 1,
                    "file_exists": true,
                    "file_name": "x-pack/plugin/security/src/test/java/org/elasticsearch/xpack/security/action/saml/TransportSamlLogoutActionTests.java",
                    "file_size": 15447
                },
                {
                    "file_additions": 2,
                    "file_deletions": 2,
                    "file_exists": true,
                    "file_name": "x-pack/plugin/security/src/test/java/org/elasticsearch/xpack/security/authc/AuthenticationServiceTests.java",
                    "file_size": 112054
                },
                {
                    "file_additions": 101,
                    "file_deletions": 2,
                    "file_exists": false,
                    "file_name": "x-pack/plugin/security/src/test/java/org/elasticsearch/xpack/security/authc/TokenAuthIntegTests.java",
                    "file_size": 0
                },
                {
                    "file_additions": 50,
                    "file_deletions": 18,
                    "file_exists": true,
                    "file_name": "x-pack/plugin/security/src/test/java/org/elasticsearch/xpack/security/authc/TokenServiceTests.java",
                    "file_size": 63124
                },
                {
                    "file_additions": 3,
                    "file_deletions": 5,
                    "file_exists": true,
                    "file_name": "x-pack/plugin/security/src/test/java/org/elasticsearch/xpack/security/authc/support/TokensInvalidationResultTests.java",
                    "file_size": 3131
                }
            ],
            "interesting": {
                "reopened": false,
                "status": false
            },
            "sha": "7ed9d52824f466ddfecedc85e73d5bc8827a8fa7"
        }
    ],
    "first_commit": "2019-03-01 09:12:07",
    "last_commit": "2019-03-05 12:55:59",
    "number": 36872,
    "score": 208.0008032128514
}