{
    "covered_issues": [
        315,
        296,
        290,
        262,
        257,
        253,
        252,
        251,
        250,
        249,
        248,
        247,
        246,
        245,
        244,
        243,
        241,
        240,
        239,
        238,
        233,
        232,
        231,
        229,
        228,
        227,
        226,
        225,
        224,
        219,
        217,
        216,
        215,
        214,
        212,
        211,
        209,
        206,
        205,
        202,
        201,
        199,
        198,
        188,
        186,
        185,
        184,
        183,
        182,
        181,
        180,
        179,
        176,
        175,
        174,
        170,
        166,
        165,
        163,
        161,
        159,
        157,
        153,
        151,
        150,
        149,
        148,
        146,
        144,
        143,
        138,
        137,
        136,
        135,
        134,
        133,
        132,
        129,
        125,
        124,
        115,
        113,
        110,
        109,
        108,
        106,
        102,
        101,
        100,
        99,
        98,
        97,
        96,
        95,
        94,
        93,
        92,
        91,
        90,
        89,
        88,
        87,
        86,
        85,
        84,
        83,
        82,
        81,
        80,
        79,
        78,
        77,
        75,
        74,
        68,
        65,
        64,
        62,
        61,
        57,
        56,
        55,
        54,
        53,
        49,
        48,
        47,
        46,
        45,
        43,
        42,
        41,
        39,
        38,
        36,
        35,
        34,
        33,
        32,
        31,
        29,
        28,
        26,
        23,
        22,
        21,
        19,
        18,
        17,
        16,
        15,
        14,
        13,
        12,
        11,
        10,
        9,
        8,
        7,
        6,
        5,
        4
    ],
    "finished": true
}