{
    "covered_issues": [
        1217,
        1216,
        1201,
        1194,
        1184,
        1179,
        1172,
        1169,
        1168,
        1160,
        1140,
        1134,
        1131,
        1113,
        1112,
        1107,
        1106,
        1102,
        1095,
        1094,
        1090,
        1089,
        1086,
        1085,
        1083,
        1077,
        1076,
        1068,
        1067,
        1065,
        1064,
        1063,
        1062,
        1060,
        1057,
        1056,
        1055,
        1054,
        1052,
        1051,
        1050,
        1047,
        1044,
        1040,
        1037,
        1035,
        1032,
        1031,
        1030,
        1017,
        1014,
        1012,
        1011,
        1010,
        1009,
        1006,
        1001,
        996,
        994,
        979,
        972,
        969,
        964,
        959,
        952,
        949,
        948,
        947,
        945,
        943,
        938,
        926,
        925,
        922,
        919,
        918,
        913,
        906,
        905,
        904,
        903,
        901,
        900,
        899,
        894,
        891,
        890,
        889,
        882,
        881,
        875,
        860,
        853,
        843,
        841,
        840,
        838,
        835,
        823,
        822,
        816,
        808,
        804,
        803,
        802,
        798,
        793,
        792,
        791,
        790,
        789,
        787,
        784,
        780,
        777,
        768,
        767,
        766,
        761,
        759,
        757,
        748,
        744,
        743,
        741,
        740,
        737,
        734,
        733,
        730,
        727,
        726,
        725,
        724,
        710,
        692,
        691,
        688,
        687,
        685,
        680,
        672,
        671,
        664,
        663,
        659,
        652,
        651,
        646,
        644,
        636,
        634,
        632,
        629,
        628,
        620,
        619,
        606,
        595,
        590,
        586,
        582,
        577,
        564,
        563,
        562,
        558,
        557,
        555,
        541,
        540,
        534,
        524,
        517,
        514,
        506,
        504,
        503,
        498,
        492,
        491,
        490,
        482,
        478,
        477,
        475,
        467,
        464,
        454,
        452,
        451,
        450,
        446,
        445,
        428,
        425,
        423,
        422,
        418,
        417,
        415,
        414,
        401,
        399,
        397,
        395,
        392,
        378,
        375,
        374,
        364,
        361,
        351,
        346,
        344,
        341,
        328,
        322,
        319,
        318,
        315,
        314,
        308,
        307,
        298,
        297,
        296,
        295,
        294,
        291,
        290,
        289,
        286,
        285,
        283,
        279,
        278,
        277,
        276,
        274,
        273,
        272,
        271,
        270,
        268,
        267,
        266,
        265,
        261,
        259,
        258,
        254,
        252,
        251,
        249,
        248,
        247,
        246,
        245,
        244,
        242,
        241,
        239,
        238,
        236,
        232,
        231,
        226,
        225,
        223,
        220,
        218,
        217,
        216,
        215,
        214,
        213,
        209,
        208,
        205,
        203,
        202,
        198,
        197,
        196,
        195,
        194,
        193,
        190,
        189,
        188,
        186,
        184,
        183,
        182,
        180,
        179,
        177,
        176,
        173,
        172,
        171,
        170,
        169,
        168,
        165,
        164,
        161,
        160,
        159,
        158,
        157,
        156,
        154,
        153,
        152,
        151,
        150,
        149,
        148,
        146,
        145,
        144,
        143,
        142,
        141,
        140,
        139,
        138,
        137,
        136,
        135,
        134,
        133,
        132,
        129,
        128,
        127,
        126,
        125,
        124,
        123,
        122,
        120,
        117,
        116,
        115,
        114,
        112,
        111,
        110,
        109,
        108,
        107,
        106,
        105,
        104,
        103,
        102,
        101,
        100,
        99,
        98,
        97,
        96,
        95,
        94,
        92,
        91,
        90,
        89,
        88,
        86,
        85,
        84,
        83,
        82,
        81,
        80,
        79,
        78,
        74,
        73,
        72,
        71,
        70,
        69,
        68,
        67,
        66,
        64,
        62,
        61,
        60,
        59,
        58,
        55,
        54,
        53,
        52,
        51,
        50,
        49,
        46,
        45,
        43,
        42,
        40,
        37,
        36,
        35,
        33,
        31,
        27,
        26,
        25,
        24,
        23,
        21,
        20,
        19,
        18,
        17,
        15,
        14,
        13,
        12,
        11,
        10,
        9,
        8,
        7,
        6,
        5,
        4,
        3,
        2,
        1
    ],
    "finished": true
}