{
    "commits": [
        {
            "associated_pull_request": [],
            "date": "2016-09-13 08:26:01+00:00",
            "diff": "herculesws_hercules/issue_1425/commit_3119f6e757ec0c0b43a312954a5a3c09b27bbaf3.diff",
            "diff_additions": 2,
            "diff_deletions": 2,
            "diff_file_size": 863458,
            "diff_url": "https://github.com/HerculesWS/Hercules/commit/3119f6e757ec0c0b43a312954a5a3c09b27bbaf3.diff",
            "exists": true,
            "files": [
                {
                    "file_additions": 2,
                    "file_deletions": 2,
                    "file_exists": true,
                    "file_name": "src/map/skill.c",
                    "file_size": 863458
                }
            ],
            "interesting": {
                "reopen": false,
                "status": false
            },
            "is_parent": true,
            "sha": "3119f6e757ec0c0b43a312954a5a3c09b27bbaf3"
        },
        {
            "associated_pull_request": [],
            "date": "2016-09-13 09:56:02+00:00",
            "diff": "herculesws_hercules/issue_1425/commit_4aa5286929b14ac52bef6959b295e189788e2578.diff",
            "diff_additions": 1,
            "diff_deletions": 1,
            "diff_file_size": 224296,
            "diff_url": "https://github.com/HerculesWS/Hercules/commit/4aa5286929b14ac52bef6959b295e189788e2578.diff",
            "exists": true,
            "files": [
                {
                    "file_additions": 1,
                    "file_deletions": 1,
                    "file_exists": true,
                    "file_name": "src/map/map.c",
                    "file_size": 224296
                }
            ],
            "interesting": {
                "reopen": true,
                "status": false
            },
            "is_parent": false,
            "sha": "4aa5286929b14ac52bef6959b295e189788e2578"
        },
        {
            "associated_pull_request": [
                "https://github.com/HerculesWS/Hercules/pull/1435"
            ],
            "date": "2016-09-17 23:30:36+00:00",
            "diff": "herculesws_hercules/issue_1425/commit_53dcedee75954229dcd56c2f04e42e725a1a7359.diff",
            "diff_additions": 8,
            "diff_deletions": 4,
            "diff_file_size": 224296,
            "diff_url": "https://github.com/HerculesWS/Hercules/commit/53dcedee75954229dcd56c2f04e42e725a1a7359.diff",
            "exists": true,
            "files": [
                {
                    "file_additions": 8,
                    "file_deletions": 4,
                    "file_exists": true,
                    "file_name": "src/map/map.c",
                    "file_size": 224296
                }
            ],
            "interesting": {
                "reopen": false,
                "status": false
            },
            "is_parent": false,
            "sha": "53dcedee75954229dcd56c2f04e42e725a1a7359"
        },
        {
            "associated_pull_request": [
                "https://github.com/HerculesWS/Hercules/pull/1435"
            ],
            "date": "2016-09-17 23:30:36+00:00",
            "diff": "herculesws_hercules/issue_1425/commit_53dcedee75954229dcd56c2f04e42e725a1a7359.diff",
            "diff_additions": 8,
            "diff_deletions": 4,
            "diff_file_size": 224296,
            "diff_url": "https://github.com/HerculesWS/Hercules/commit/53dcedee75954229dcd56c2f04e42e725a1a7359.diff",
            "exists": true,
            "files": [
                {
                    "file_additions": 8,
                    "file_deletions": 4,
                    "file_exists": true,
                    "file_name": "src/map/map.c",
                    "file_size": 224296
                }
            ],
            "interesting": {
                "reopen": false,
                "status": false
            },
            "is_parent": false,
            "sha": "53dcedee75954229dcd56c2f04e42e725a1a7359"
        }
    ],
    "first_commit": "2016-09-13 08:26:01+00:00",
    "last_commit": "2016-09-17 23:44:06+00:00",
    "number": 1425,
    "pull_request": "None",
    "score": {
        "accidental_reopen_likely": false,
        "all_labels": [
            "type:bug",
            "component:core"
        ],
        "contains_keywords": [
            "chang",
            "fix",
            "remov",
            "error"
        ],
        "fix_size": 12,
        "has_labels": [],
        "intersecting": {
            "computed_score": 1.0,
            "final_commit_size": 11,
            "intersection_size": 11,
            "previous_commits_size": 12
        },
        "is_makefile_based": true,
        "no_new_files": [],
        "no_other_files": true,
        "num_prohibited_files": 239444,
        "prohibited_files": [
            "server/src/main/java/com/genymobile/scrcpy/Device.java",
            "server/src/main/java/com/genymobile/scrcpy/wrappers/SurfaceControl.java",
            "server/src/main/java/com/genymobile/scrcpy/Device.java",
            "server/src/main/java/com/genymobile/scrcpy/wrappers/SurfaceControl.java",
            "app/meson.build",
            "app/scrcpy.1",
            "app/src/common.h",
            "app/src/scrcpy.h",
            "app/src/server.h",
            "server/src/main/java/com/genymobile/scrcpy/Workarounds.java"
        ],
        "reopen": true,
        "reopen_events": [
            [
                "2016-09-13 10:43:07+00:00",
                "closed"
            ],
            [
                "2016-09-13 10:43:07+00:00",
                "commit"
            ],
            [
                "2016-09-14 13:08:53+00:00",
                "reopened"
            ],
            [
                "2016-09-17 23:45:14+00:00",
                "commit"
            ],
            [
                "2016-09-18 00:10:42+00:00",
                "closed"
            ],
            [
                "2016-09-18 00:10:42+00:00",
                "commit"
            ]
        ],
        "status": false,
        "strategy": true,
        "total_changes": 30
    }
}