{
    "covered_issues": [
        75,
        73,
        72,
        66,
        65,
        63,
        61,
        59,
        58,
        57,
        54,
        53,
        50,
        49,
        48,
        42,
        39,
        38,
        30,
        28,
        27,
        26,
        25,
        22,
        21,
        16,
        15,
        14,
        13,
        12,
        10,
        9,
        8,
        7,
        6,
        5,
        4,
        3,
        1
    ],
    "finished": true
}