{
    "category": [
        "hardware/OS"
    ],
    "commits": [
        {
            "associated_pull_request": [],
            "date": "2020-02-29 22:39:42",
            "diff": "",
            "diff_additions": 0,
            "diff_deletions": 0,
            "diff_file_size": 0,
            "diff_url": "https://github.com/curl/curl/commit/d6e3273bb004013ce56bc97fae2d576696ca7579.diff",
            "exists": true,
            "files": [],
            "interesting": {
                "reopen": false,
                "status": true
            },
            "is_parent": true,
            "sha": "d6e3273bb004013ce56bc97fae2d576696ca7579"
        },
        {
            "associated_pull_request": [],
            "date": "2020-02-19 06:35:55",
            "diff": "curl_curl/issue_4915/commit_fec02db806bced13a293358c6d5775aa3e91e6f6.diff",
            "diff_additions": 91,
            "diff_deletions": 105,
            "diff_file_size": 258011,
            "diff_url": "https://github.com/curl/curl/commit/fec02db806bced13a293358c6d5775aa3e91e6f6.diff",
            "exists": true,
            "files": [
                {
                    "file_additions": 40,
                    "file_deletions": 47,
                    "file_exists": true,
                    "file_name": "lib/conncache.c",
                    "file_size": 16454
                },
                {
                    "file_additions": 21,
                    "file_deletions": 20,
                    "file_exists": true,
                    "file_name": "lib/multi.c",
                    "file_size": 107956
                },
                {
                    "file_additions": 29,
                    "file_deletions": 33,
                    "file_exists": true,
                    "file_name": "lib/url.c",
                    "file_size": 130879
                },
                {
                    "file_additions": 1,
                    "file_deletions": 5,
                    "file_exists": true,
                    "file_name": "tests/unit/unit1620.c",
                    "file_size": 2722
                }
            ],
            "interesting": {
                "reopen": false,
                "status": true
            },
            "is_parent": false,
            "sha": "fec02db806bced13a293358c6d5775aa3e91e6f6"
        },
        {
            "associated_pull_request": [],
            "date": "2020-03-23 12:38:07",
            "diff": "curl_curl/issue_4915/commit_36f750db34326aea98681cb7433db950b9918736.diff",
            "diff_additions": 105,
            "diff_deletions": 113,
            "diff_file_size": 258011,
            "diff_url": "https://github.com/curl/curl/commit/36f750db34326aea98681cb7433db950b9918736.diff",
            "exists": true,
            "files": [
                {
                    "file_additions": 40,
                    "file_deletions": 47,
                    "file_exists": true,
                    "file_name": "lib/conncache.c",
                    "file_size": 16454
                },
                {
                    "file_additions": 27,
                    "file_deletions": 29,
                    "file_exists": true,
                    "file_name": "lib/multi.c",
                    "file_size": 107956
                },
                {
                    "file_additions": 37,
                    "file_deletions": 32,
                    "file_exists": true,
                    "file_name": "lib/url.c",
                    "file_size": 130879
                },
                {
                    "file_additions": 1,
                    "file_deletions": 5,
                    "file_exists": true,
                    "file_name": "tests/unit/unit1620.c",
                    "file_size": 2722
                }
            ],
            "interesting": {
                "reopen": false,
                "status": true
            },
            "is_parent": false,
            "sha": "36f750db34326aea98681cb7433db950b9918736"
        },
        {
            "associated_pull_request": [],
            "date": "2020-03-23 12:38:07",
            "diff": "curl_curl/issue_4915/commit_8881719830ebef00ff357263cb7f95e06728d3b1.diff",
            "diff_additions": 105,
            "diff_deletions": 113,
            "diff_file_size": 258011,
            "diff_url": "https://github.com/curl/curl/commit/8881719830ebef00ff357263cb7f95e06728d3b1.diff",
            "exists": true,
            "files": [
                {
                    "file_additions": 40,
                    "file_deletions": 47,
                    "file_exists": true,
                    "file_name": "lib/conncache.c",
                    "file_size": 16454
                },
                {
                    "file_additions": 27,
                    "file_deletions": 29,
                    "file_exists": true,
                    "file_name": "lib/multi.c",
                    "file_size": 107956
                },
                {
                    "file_additions": 37,
                    "file_deletions": 32,
                    "file_exists": true,
                    "file_name": "lib/url.c",
                    "file_size": 130879
                },
                {
                    "file_additions": 1,
                    "file_deletions": 5,
                    "file_exists": true,
                    "file_name": "tests/unit/unit1620.c",
                    "file_size": 2722
                }
            ],
            "interesting": {
                "reopen": false,
                "status": true
            },
            "is_parent": false,
            "sha": "8881719830ebef00ff357263cb7f95e06728d3b1"
        },
        {
            "associated_pull_request": [],
            "date": "2020-03-23 12:38:07",
            "diff": "curl_curl/issue_4915/commit_42ce210e466fa73e2a65c2e0794e4364b0216eaf.diff",
            "diff_additions": 112,
            "diff_deletions": 118,
            "diff_file_size": 291894,
            "diff_url": "https://github.com/curl/curl/commit/42ce210e466fa73e2a65c2e0794e4364b0216eaf.diff",
            "exists": true,
            "files": [
                {
                    "file_additions": 40,
                    "file_deletions": 47,
                    "file_exists": true,
                    "file_name": "lib/conncache.c",
                    "file_size": 16454
                },
                {
                    "file_additions": 7,
                    "file_deletions": 5,
                    "file_exists": true,
                    "file_name": "lib/hostip.c",
                    "file_size": 33883
                },
                {
                    "file_additions": 27,
                    "file_deletions": 29,
                    "file_exists": true,
                    "file_name": "lib/multi.c",
                    "file_size": 107956
                },
                {
                    "file_additions": 37,
                    "file_deletions": 32,
                    "file_exists": true,
                    "file_name": "lib/url.c",
                    "file_size": 130879
                },
                {
                    "file_additions": 1,
                    "file_deletions": 5,
                    "file_exists": true,
                    "file_name": "tests/unit/unit1620.c",
                    "file_size": 2722
                }
            ],
            "interesting": {
                "reopen": false,
                "status": false
            },
            "is_parent": false,
            "sha": "42ce210e466fa73e2a65c2e0794e4364b0216eaf"
        },
        {
            "associated_pull_request": [],
            "date": "2020-03-23 12:38:07",
            "diff": "curl_curl/issue_4915/commit_d1b34ca2566f4e12c0b0ca582e2faa0a72598b9a.diff",
            "diff_additions": 112,
            "diff_deletions": 118,
            "diff_file_size": 291894,
            "diff_url": "https://github.com/curl/curl/commit/d1b34ca2566f4e12c0b0ca582e2faa0a72598b9a.diff",
            "exists": true,
            "files": [
                {
                    "file_additions": 40,
                    "file_deletions": 47,
                    "file_exists": true,
                    "file_name": "lib/conncache.c",
                    "file_size": 16454
                },
                {
                    "file_additions": 7,
                    "file_deletions": 5,
                    "file_exists": true,
                    "file_name": "lib/hostip.c",
                    "file_size": 33883
                },
                {
                    "file_additions": 27,
                    "file_deletions": 29,
                    "file_exists": true,
                    "file_name": "lib/multi.c",
                    "file_size": 107956
                },
                {
                    "file_additions": 37,
                    "file_deletions": 32,
                    "file_exists": true,
                    "file_name": "lib/url.c",
                    "file_size": 130879
                },
                {
                    "file_additions": 1,
                    "file_deletions": 5,
                    "file_exists": true,
                    "file_name": "tests/unit/unit1620.c",
                    "file_size": 2722
                }
            ],
            "interesting": {
                "reopen": false,
                "status": true
            },
            "is_parent": false,
            "sha": "d1b34ca2566f4e12c0b0ca582e2faa0a72598b9a"
        },
        {
            "associated_pull_request": [],
            "date": "2020-04-26 22:33:21",
            "diff": "curl_curl/issue_4915/commit_cd650660a82fa4c3fdc96e5014cf242979806355.diff",
            "diff_additions": 112,
            "diff_deletions": 118,
            "diff_file_size": 291894,
            "diff_url": "https://github.com/curl/curl/commit/cd650660a82fa4c3fdc96e5014cf242979806355.diff",
            "exists": true,
            "files": [
                {
                    "file_additions": 40,
                    "file_deletions": 47,
                    "file_exists": true,
                    "file_name": "lib/conncache.c",
                    "file_size": 16454
                },
                {
                    "file_additions": 7,
                    "file_deletions": 5,
                    "file_exists": true,
                    "file_name": "lib/hostip.c",
                    "file_size": 33883
                },
                {
                    "file_additions": 27,
                    "file_deletions": 29,
                    "file_exists": true,
                    "file_name": "lib/multi.c",
                    "file_size": 107956
                },
                {
                    "file_additions": 37,
                    "file_deletions": 32,
                    "file_exists": true,
                    "file_name": "lib/url.c",
                    "file_size": 130879
                },
                {
                    "file_additions": 1,
                    "file_deletions": 5,
                    "file_exists": true,
                    "file_name": "tests/unit/unit1620.c",
                    "file_size": 2722
                }
            ],
            "interesting": {
                "reopen": false,
                "status": true
            },
            "is_parent": false,
            "sha": "cd650660a82fa4c3fdc96e5014cf242979806355"
        },
        {
            "associated_pull_request": [],
            "date": "2020-04-26 22:33:21",
            "diff": "curl_curl/issue_4915/commit_c06902713998d68202c5a764de910ba8d0e8f54d.diff",
            "diff_additions": 112,
            "diff_deletions": 118,
            "diff_file_size": 291894,
            "diff_url": "https://github.com/curl/curl/commit/c06902713998d68202c5a764de910ba8d0e8f54d.diff",
            "exists": true,
            "files": [
                {
                    "file_additions": 40,
                    "file_deletions": 47,
                    "file_exists": true,
                    "file_name": "lib/conncache.c",
                    "file_size": 16454
                },
                {
                    "file_additions": 7,
                    "file_deletions": 5,
                    "file_exists": true,
                    "file_name": "lib/hostip.c",
                    "file_size": 33883
                },
                {
                    "file_additions": 27,
                    "file_deletions": 29,
                    "file_exists": true,
                    "file_name": "lib/multi.c",
                    "file_size": 107956
                },
                {
                    "file_additions": 37,
                    "file_deletions": 32,
                    "file_exists": true,
                    "file_name": "lib/url.c",
                    "file_size": 130879
                },
                {
                    "file_additions": 1,
                    "file_deletions": 5,
                    "file_exists": true,
                    "file_name": "tests/unit/unit1620.c",
                    "file_size": 2722
                }
            ],
            "interesting": {
                "reopen": false,
                "status": true
            },
            "is_parent": false,
            "sha": "c06902713998d68202c5a764de910ba8d0e8f54d"
        },
        {
            "associated_pull_request": [],
            "date": "2021-03-26 03:53:46",
            "diff": "curl_curl/issue_4915/commit_cc875754375e8d8aaf8ff794bae2161bebb3825c.diff",
            "diff_additions": 0,
            "diff_deletions": 156,
            "diff_file_size": 0,
            "diff_url": "https://github.com/curl/curl/commit/cc875754375e8d8aaf8ff794bae2161bebb3825c.diff",
            "exists": true,
            "files": [
                {
                    "file_additions": 0,
                    "file_deletions": 156,
                    "file_exists": false,
                    "file_name": "docs/examples/threaded-shared-conn.c",
                    "file_size": 0
                }
            ],
            "interesting": {
                "reopen": false,
                "status": false
            },
            "is_parent": false,
            "sha": "cc875754375e8d8aaf8ff794bae2161bebb3825c"
        },
        {
            "associated_pull_request": [],
            "date": "2021-03-26 03:53:46",
            "diff": "curl_curl/issue_4915/commit_a8da0302a796d64f422647718ca8443e3fcdf30f.diff",
            "diff_additions": 0,
            "diff_deletions": 156,
            "diff_file_size": 0,
            "diff_url": "https://github.com/curl/curl/commit/a8da0302a796d64f422647718ca8443e3fcdf30f.diff",
            "exists": true,
            "files": [
                {
                    "file_additions": 0,
                    "file_deletions": 156,
                    "file_exists": false,
                    "file_name": "docs/examples/threaded-shared-conn.c",
                    "file_size": 0
                }
            ],
            "interesting": {
                "reopen": false,
                "status": false
            },
            "is_parent": false,
            "sha": "a8da0302a796d64f422647718ca8443e3fcdf30f"
        }
    ],
    "first_commit": "2020-03-01 10:06:28",
    "last_commit": "2021-03-26 07:14:50",
    "number": 4915,
    "pull_request": "None",
    "score": {
        "accidental_reopen_likely": false,
        "all_labels": [
            "KNOWN_BUGS material",
            "connecting & proxies",
            "crash"
        ],
        "contains_keywords": [
            "work",
            "report",
            "fix",
            "CI",
            "patch",
            "bug",
            "test",
            "remov",
            "issu",
            "chang",
            "problem"
        ],
        "fix_size": 448,
        "has_labels": [
            "crash",
            "crash report"
        ],
        "intersecting": {
            "computed_score": 1.0,
            "final_commit_size": 157,
            "intersection_size": 157,
            "previous_commits_size": 448
        },
        "is_makefile_based": true,
        "no_new_files": [],
        "no_other_files": false,
        "num_prohibited_files": 72952,
        "prohibited_files": [
            "kill.h",
            "meminfo.h",
            "kill.h",
            "meminfo.h",
            "kill.h",
            "meminfo.h",
            "testsuite_cli_test.go",
            "testsuite_cli_test.go",
            "common.mk",
            "i3bar/include/draw_util.h"
        ],
        "reopen": false,
        "reopen_events": [
            [
                "2020-03-01 12:01:27",
                "commit"
            ],
            [
                "2020-03-01 14:39:45",
                "commit"
            ],
            [
                "2020-03-23 12:38:20",
                "commit"
            ],
            [
                "2020-03-27 16:10:59",
                "commit"
            ],
            [
                "2020-03-31 07:45:41",
                "commit"
            ],
            [
                "2020-04-14 21:38:50",
                "commit"
            ],
            [
                "2020-04-20 01:09:58",
                "commit"
            ],
            [
                "2020-04-20 10:21:34",
                "commit"
            ],
            [
                "2020-04-26 22:34:44",
                "commit"
            ],
            [
                "2020-04-30 12:38:14",
                "commit"
            ],
            [
                "2020-08-11 13:44:23",
                "commit"
            ],
            [
                "2020-08-12 05:56:15",
                "closed"
            ],
            [
                "2020-08-12 05:56:15",
                "commit"
            ],
            [
                "2021-03-26 03:54:05",
                "commit"
            ],
            [
                "2021-03-26 07:17:17",
                "commit"
            ]
        ],
        "status": true,
        "strategy": true,
        "total_changes": 1864
    }
}