{
    "covered_issues": [
        303,
        291,
        289,
        280,
        269,
        256,
        252,
        242,
        239,
        232,
        215,
        212,
        203,
        200,
        197,
        196,
        191,
        190,
        179,
        178,
        176,
        174,
        173,
        171,
        170,
        166,
        162,
        161,
        159,
        158,
        157,
        153,
        151,
        147,
        146,
        145,
        144,
        142,
        138,
        134,
        131,
        130,
        120,
        115,
        99,
        98,
        97,
        91,
        90,
        89,
        88,
        79,
        69,
        68,
        65,
        60,
        57,
        50,
        49,
        44,
        32,
        26,
        23,
        11,
        6,
        5,
        2
    ],
    "finished": true
}