{
    "covered_issues": [
        47,
        46,
        37,
        34,
        33,
        32,
        26,
        25,
        19,
        18,
        14,
        12,
        10,
        9,
        8,
        7,
        6,
        5,
        3,
        2,
        1
    ],
    "finished": true
}