{
    "category": [
        "hardware/OS",
        "control flow"
    ],
    "commits": [
        {
            "associated_pull_request": [],
            "date": "2020-03-12 18:42:27",
            "diff": "greenplum-db_gpdb/issue_9733/commit_daa8cfce42d86a2479224e8afb59660eca465fe0.diff",
            "diff_additions": 22,
            "diff_deletions": 17,
            "diff_file_size": 16386,
            "diff_url": "https://github.com/greenplum-db/gpdb/commit/daa8cfce42d86a2479224e8afb59660eca465fe0.diff",
            "exists": true,
            "files": [
                {
                    "file_additions": 2,
                    "file_deletions": 2,
                    "file_exists": true,
                    "file_name": "src/backend/access/transam/test/varsup_test.c",
                    "file_size": 6184
                },
                {
                    "file_additions": 1,
                    "file_deletions": 1,
                    "file_exists": true,
                    "file_name": "src/backend/access/transam/test/xact_test.c",
                    "file_size": 6032
                },
                {
                    "file_additions": 19,
                    "file_deletions": 14,
                    "file_exists": true,
                    "file_name": "src/backend/access/transam/test/xlog_test.c",
                    "file_size": 4170
                }
            ],
            "interesting": {
                "reopen": false,
                "status": false
            },
            "is_parent": true,
            "sha": "daa8cfce42d86a2479224e8afb59660eca465fe0"
        },
        {
            "associated_pull_request": [],
            "date": "2020-03-18 11:27:50",
            "diff": "greenplum-db_gpdb/issue_9733/commit_53e9f8c6f04bb4163ce87c18307847041834cd79.diff",
            "diff_additions": 347,
            "diff_deletions": 1,
            "diff_file_size": 174942,
            "diff_url": "https://github.com/greenplum-db/gpdb/commit/53e9f8c6f04bb4163ce87c18307847041834cd79.diff",
            "exists": true,
            "files": [
                {
                    "file_additions": 26,
                    "file_deletions": 1,
                    "file_exists": true,
                    "file_name": "src/backend/optimizer/path/allpaths.c",
                    "file_size": 148593
                },
                {
                    "file_additions": 321,
                    "file_deletions": 0,
                    "file_exists": true,
                    "file_name": "src/backend/optimizer/util/walkers.c",
                    "file_size": 26349
                }
            ],
            "interesting": {
                "reopen": false,
                "status": true
            },
            "is_parent": false,
            "sha": "53e9f8c6f04bb4163ce87c18307847041834cd79"
        },
        {
            "associated_pull_request": [
                "https://github.com/greenplum-db/gpdb/pull/9814"
            ],
            "date": "2020-03-24 13:19:51",
            "diff": "greenplum-db_gpdb/issue_9733/commit_2a4c4ec2a3ba283f8b210f8d56fcd74fcd0a24db.diff",
            "diff_additions": 24,
            "diff_deletions": 0,
            "diff_file_size": 148593,
            "diff_url": "https://github.com/greenplum-db/gpdb/commit/2a4c4ec2a3ba283f8b210f8d56fcd74fcd0a24db.diff",
            "exists": true,
            "files": [
                {
                    "file_additions": 24,
                    "file_deletions": 0,
                    "file_exists": true,
                    "file_name": "src/backend/optimizer/path/allpaths.c",
                    "file_size": 148593
                }
            ],
            "interesting": {
                "reopen": false,
                "status": false
            },
            "is_parent": false,
            "sha": "2a4c4ec2a3ba283f8b210f8d56fcd74fcd0a24db"
        },
        {
            "associated_pull_request": [
                "https://github.com/greenplum-db/gpdb/pull/9814"
            ],
            "date": "2020-04-10 03:57:09",
            "diff": "greenplum-db_gpdb/issue_9733/commit_ef0a34d1152277925883942a85ba06b202f6e14f.diff",
            "diff_additions": 24,
            "diff_deletions": 0,
            "diff_file_size": 148593,
            "diff_url": "https://github.com/greenplum-db/gpdb/commit/ef0a34d1152277925883942a85ba06b202f6e14f.diff",
            "exists": true,
            "files": [
                {
                    "file_additions": 24,
                    "file_deletions": 0,
                    "file_exists": true,
                    "file_name": "src/backend/optimizer/path/allpaths.c",
                    "file_size": 148593
                }
            ],
            "interesting": {
                "reopen": false,
                "status": false
            },
            "is_parent": false,
            "sha": "ef0a34d1152277925883942a85ba06b202f6e14f"
        },
        {
            "associated_pull_request": [
                "https://github.com/greenplum-db/gpdb/pull/9905"
            ],
            "date": "2020-04-10 03:57:09",
            "diff": "greenplum-db_gpdb/issue_9733/commit_a5af311e935d59b08d389dbfe74aa9a0dc48fef8.diff",
            "diff_additions": 12,
            "diff_deletions": 0,
            "diff_file_size": 148593,
            "diff_url": "https://github.com/greenplum-db/gpdb/commit/a5af311e935d59b08d389dbfe74aa9a0dc48fef8.diff",
            "exists": true,
            "files": [
                {
                    "file_additions": 12,
                    "file_deletions": 0,
                    "file_exists": true,
                    "file_name": "src/backend/optimizer/path/allpaths.c",
                    "file_size": 148593
                }
            ],
            "interesting": {
                "reopen": false,
                "status": true
            },
            "is_parent": false,
            "sha": "a5af311e935d59b08d389dbfe74aa9a0dc48fef8"
        },
        {
            "associated_pull_request": [
                "https://github.com/greenplum-db/gpdb/pull/11736",
                "https://github.com/greenplum-db/gpdb/pull/9905"
            ],
            "date": "2020-04-13 05:30:39",
            "diff": "greenplum-db_gpdb/issue_9733/commit_2fbc274bc15a19b5de3c6e44ad5073464cd4f47b.diff",
            "diff_additions": 12,
            "diff_deletions": 0,
            "diff_file_size": 148593,
            "diff_url": "https://github.com/greenplum-db/gpdb/commit/2fbc274bc15a19b5de3c6e44ad5073464cd4f47b.diff",
            "exists": true,
            "files": [
                {
                    "file_additions": 12,
                    "file_deletions": 0,
                    "file_exists": true,
                    "file_name": "src/backend/optimizer/path/allpaths.c",
                    "file_size": 148593
                }
            ],
            "interesting": {
                "reopen": false,
                "status": false
            },
            "is_parent": false,
            "sha": "2fbc274bc15a19b5de3c6e44ad5073464cd4f47b"
        }
    ],
    "first_commit": "2020-03-12 18:42:27",
    "last_commit": "2020-04-13 05:30:39",
    "number": 9733,
    "pull_request": "None",
    "score": {
        "accidental_reopen_likely": false,
        "all_labels": [],
        "contains_keywords": [
            "work",
            "fix",
            "reason",
            "patch",
            "fault",
            "bug",
            "test",
            "issu",
            "error",
            "chang",
            "crash",
            "fail"
        ],
        "fix_size": 372,
        "has_labels": [],
        "intersecting": {
            "computed_score": 1.0,
            "final_commit_size": 13,
            "intersection_size": 13,
            "previous_commits_size": 372
        },
        "is_makefile_based": true,
        "no_new_files": [],
        "no_other_files": false,
        "num_prohibited_files": 84811,
        "prohibited_files": [
            "kill.h",
            "meminfo.h",
            "kill.h",
            "meminfo.h",
            "kill.h",
            "meminfo.h",
            "testsuite_cli_test.go",
            "testsuite_cli_test.go",
            "common.mk",
            "i3bar/include/draw_util.h"
        ],
        "reopen": false,
        "reopen_events": [
            [
                "2020-03-12 21:20:42",
                "commit"
            ],
            [
                "2020-03-23 09:45:36",
                "commit"
            ],
            [
                "2020-03-24 13:23:28",
                "commit"
            ],
            [
                "2020-04-09 05:27:24",
                "commit"
            ],
            [
                "2020-04-10 01:11:02",
                "commit"
            ],
            [
                "2020-04-10 03:57:11",
                "commit"
            ],
            [
                "2020-04-13 00:28:55",
                "commit"
            ],
            [
                "2020-04-13 05:30:42",
                "commit"
            ],
            [
                "2020-04-13 05:31:43",
                "closed"
            ]
        ],
        "status": true,
        "strategy": true,
        "total_changes": 459
    }
}