{
    "category": [
        "memory",
        "control flow"
    ],
    "commits": [
        {
            "associated_pull_request": [
                "https://github.com/namhyung/uftrace/pull/861"
            ],
            "date": "2019-09-09 09:57:01",
            "diff": "namhyung_uftrace/issue_858/commit_a9ef15c582e1ec0acece5cbb8c4c5fa959e3f5b6.diff",
            "diff_additions": 3,
            "diff_deletions": 1,
            "diff_file_size": 40354,
            "diff_url": "https://github.com/namhyung/uftrace/commit/a9ef15c582e1ec0acece5cbb8c4c5fa959e3f5b6.diff",
            "exists": true,
            "files": [
                {
                    "file_additions": 3,
                    "file_deletions": 1,
                    "file_exists": true,
                    "file_name": "uftrace.c",
                    "file_size": 40354
                }
            ],
            "interesting": {
                "reopen": false,
                "status": false
            },
            "is_parent": true,
            "sha": "a9ef15c582e1ec0acece5cbb8c4c5fa959e3f5b6"
        },
        {
            "associated_pull_request": [],
            "date": "2019-09-10 06:23:04",
            "diff": "namhyung_uftrace/issue_858/commit_9750afbc96f9a35c3358a0c59117a5bbd8871c0d.diff",
            "diff_additions": 32,
            "diff_deletions": 4,
            "diff_file_size": 31677,
            "diff_url": "https://github.com/namhyung/uftrace/commit/9750afbc96f9a35c3358a0c59117a5bbd8871c0d.diff",
            "exists": true,
            "files": [
                {
                    "file_additions": 8,
                    "file_deletions": 1,
                    "file_exists": true,
                    "file_name": "arch/aarch64/mcount-support.c",
                    "file_size": 6851
                },
                {
                    "file_additions": 8,
                    "file_deletions": 1,
                    "file_exists": true,
                    "file_name": "arch/arm/mcount-support.c",
                    "file_size": 11764
                },
                {
                    "file_additions": 8,
                    "file_deletions": 1,
                    "file_exists": true,
                    "file_name": "arch/i386/mcount-support.c",
                    "file_size": 7366
                },
                {
                    "file_additions": 8,
                    "file_deletions": 1,
                    "file_exists": true,
                    "file_name": "arch/x86_64/mcount-support.c",
                    "file_size": 5696
                }
            ],
            "interesting": {
                "reopen": false,
                "status": false
            },
            "is_parent": false,
            "sha": "9750afbc96f9a35c3358a0c59117a5bbd8871c0d"
        },
        {
            "associated_pull_request": [],
            "date": "2019-09-10 11:11:20",
            "diff": "namhyung_uftrace/issue_858/commit_be0c3fd441b9fdb4211df79e9edcdf9ea1cd717d.diff",
            "diff_additions": 62,
            "diff_deletions": 4,
            "diff_file_size": 60511,
            "diff_url": "https://github.com/namhyung/uftrace/commit/be0c3fd441b9fdb4211df79e9edcdf9ea1cd717d.diff",
            "exists": true,
            "files": [
                {
                    "file_additions": 7,
                    "file_deletions": 1,
                    "file_exists": true,
                    "file_name": "arch/aarch64/mcount-support.c",
                    "file_size": 6851
                },
                {
                    "file_additions": 7,
                    "file_deletions": 1,
                    "file_exists": true,
                    "file_name": "arch/arm/mcount-support.c",
                    "file_size": 11764
                },
                {
                    "file_additions": 7,
                    "file_deletions": 1,
                    "file_exists": true,
                    "file_name": "arch/i386/mcount-support.c",
                    "file_size": 7366
                },
                {
                    "file_additions": 40,
                    "file_deletions": 1,
                    "file_exists": true,
                    "file_name": "arch/x86_64/mcount-support.c",
                    "file_size": 5696
                },
                {
                    "file_additions": 1,
                    "file_deletions": 0,
                    "file_exists": true,
                    "file_name": "libmcount/record.c",
                    "file_size": 28834
                }
            ],
            "interesting": {
                "reopen": false,
                "status": false
            },
            "is_parent": false,
            "sha": "be0c3fd441b9fdb4211df79e9edcdf9ea1cd717d"
        },
        {
            "associated_pull_request": [],
            "date": "2019-09-10 11:18:48",
            "diff": "namhyung_uftrace/issue_858/commit_bbd0e196aea31334ead98e018276bacfaf7f1557.diff",
            "diff_additions": 161,
            "diff_deletions": 4,
            "diff_file_size": 60511,
            "diff_url": "https://github.com/namhyung/uftrace/commit/bbd0e196aea31334ead98e018276bacfaf7f1557.diff",
            "exists": true,
            "files": [
                {
                    "file_additions": 40,
                    "file_deletions": 1,
                    "file_exists": true,
                    "file_name": "arch/aarch64/mcount-support.c",
                    "file_size": 6851
                },
                {
                    "file_additions": 40,
                    "file_deletions": 1,
                    "file_exists": true,
                    "file_name": "arch/arm/mcount-support.c",
                    "file_size": 11764
                },
                {
                    "file_additions": 40,
                    "file_deletions": 1,
                    "file_exists": true,
                    "file_name": "arch/i386/mcount-support.c",
                    "file_size": 7366
                },
                {
                    "file_additions": 40,
                    "file_deletions": 1,
                    "file_exists": true,
                    "file_name": "arch/x86_64/mcount-support.c",
                    "file_size": 5696
                },
                {
                    "file_additions": 1,
                    "file_deletions": 0,
                    "file_exists": true,
                    "file_name": "libmcount/record.c",
                    "file_size": 28834
                }
            ],
            "interesting": {
                "reopen": false,
                "status": false
            },
            "is_parent": false,
            "sha": "bbd0e196aea31334ead98e018276bacfaf7f1557"
        },
        {
            "associated_pull_request": [],
            "date": "2019-09-10 11:23:42",
            "diff": "namhyung_uftrace/issue_858/commit_d818e85c4ca4f21d8eac303385b40e2265e9a969.diff",
            "diff_additions": 161,
            "diff_deletions": 4,
            "diff_file_size": 60511,
            "diff_url": "https://github.com/namhyung/uftrace/commit/d818e85c4ca4f21d8eac303385b40e2265e9a969.diff",
            "exists": true,
            "files": [
                {
                    "file_additions": 40,
                    "file_deletions": 1,
                    "file_exists": true,
                    "file_name": "arch/aarch64/mcount-support.c",
                    "file_size": 6851
                },
                {
                    "file_additions": 40,
                    "file_deletions": 1,
                    "file_exists": true,
                    "file_name": "arch/arm/mcount-support.c",
                    "file_size": 11764
                },
                {
                    "file_additions": 40,
                    "file_deletions": 1,
                    "file_exists": true,
                    "file_name": "arch/i386/mcount-support.c",
                    "file_size": 7366
                },
                {
                    "file_additions": 40,
                    "file_deletions": 1,
                    "file_exists": true,
                    "file_name": "arch/x86_64/mcount-support.c",
                    "file_size": 5696
                },
                {
                    "file_additions": 1,
                    "file_deletions": 0,
                    "file_exists": true,
                    "file_name": "libmcount/record.c",
                    "file_size": 28834
                }
            ],
            "interesting": {
                "reopen": false,
                "status": false
            },
            "is_parent": false,
            "sha": "d818e85c4ca4f21d8eac303385b40e2265e9a969"
        },
        {
            "associated_pull_request": [],
            "date": "2019-09-12 12:54:03",
            "diff": "namhyung_uftrace/issue_858/commit_9fc9087efe4c5062c6d482759741a50881d3d69f.diff",
            "diff_additions": 16,
            "diff_deletions": 143,
            "diff_file_size": 60511,
            "diff_url": "https://github.com/namhyung/uftrace/commit/9fc9087efe4c5062c6d482759741a50881d3d69f.diff",
            "exists": true,
            "files": [
                {
                    "file_additions": 2,
                    "file_deletions": 35,
                    "file_exists": true,
                    "file_name": "arch/aarch64/mcount-support.c",
                    "file_size": 6851
                },
                {
                    "file_additions": 2,
                    "file_deletions": 35,
                    "file_exists": true,
                    "file_name": "arch/arm/mcount-support.c",
                    "file_size": 11764
                },
                {
                    "file_additions": 2,
                    "file_deletions": 35,
                    "file_exists": true,
                    "file_name": "arch/i386/mcount-support.c",
                    "file_size": 7366
                },
                {
                    "file_additions": 2,
                    "file_deletions": 35,
                    "file_exists": true,
                    "file_name": "arch/x86_64/mcount-support.c",
                    "file_size": 5696
                },
                {
                    "file_additions": 8,
                    "file_deletions": 3,
                    "file_exists": true,
                    "file_name": "libmcount/record.c",
                    "file_size": 28834
                }
            ],
            "interesting": {
                "reopen": false,
                "status": false
            },
            "is_parent": false,
            "sha": "9fc9087efe4c5062c6d482759741a50881d3d69f"
        },
        {
            "associated_pull_request": [],
            "date": "2019-09-10 11:23:42",
            "diff": "namhyung_uftrace/issue_858/commit_9ddf00d56ccf3b11dbf57982e50335aa95c65ca8.diff",
            "diff_additions": 36,
            "diff_deletions": 6,
            "diff_file_size": 60511,
            "diff_url": "https://github.com/namhyung/uftrace/commit/9ddf00d56ccf3b11dbf57982e50335aa95c65ca8.diff",
            "exists": true,
            "files": [
                {
                    "file_additions": 7,
                    "file_deletions": 1,
                    "file_exists": true,
                    "file_name": "arch/aarch64/mcount-support.c",
                    "file_size": 6851
                },
                {
                    "file_additions": 7,
                    "file_deletions": 1,
                    "file_exists": true,
                    "file_name": "arch/arm/mcount-support.c",
                    "file_size": 11764
                },
                {
                    "file_additions": 7,
                    "file_deletions": 1,
                    "file_exists": true,
                    "file_name": "arch/i386/mcount-support.c",
                    "file_size": 7366
                },
                {
                    "file_additions": 7,
                    "file_deletions": 1,
                    "file_exists": true,
                    "file_name": "arch/x86_64/mcount-support.c",
                    "file_size": 5696
                },
                {
                    "file_additions": 8,
                    "file_deletions": 2,
                    "file_exists": true,
                    "file_name": "libmcount/record.c",
                    "file_size": 28834
                }
            ],
            "interesting": {
                "reopen": false,
                "status": false
            },
            "is_parent": false,
            "sha": "9ddf00d56ccf3b11dbf57982e50335aa95c65ca8"
        },
        {
            "associated_pull_request": [],
            "date": "2019-09-10 11:23:42",
            "diff": "namhyung_uftrace/issue_858/commit_58fcc26f655ee0171ee97d42c8fedb4d3a5f124e.diff",
            "diff_additions": 36,
            "diff_deletions": 6,
            "diff_file_size": 60511,
            "diff_url": "https://github.com/namhyung/uftrace/commit/58fcc26f655ee0171ee97d42c8fedb4d3a5f124e.diff",
            "exists": true,
            "files": [
                {
                    "file_additions": 7,
                    "file_deletions": 1,
                    "file_exists": true,
                    "file_name": "arch/aarch64/mcount-support.c",
                    "file_size": 6851
                },
                {
                    "file_additions": 7,
                    "file_deletions": 1,
                    "file_exists": true,
                    "file_name": "arch/arm/mcount-support.c",
                    "file_size": 11764
                },
                {
                    "file_additions": 7,
                    "file_deletions": 1,
                    "file_exists": true,
                    "file_name": "arch/i386/mcount-support.c",
                    "file_size": 7366
                },
                {
                    "file_additions": 7,
                    "file_deletions": 1,
                    "file_exists": true,
                    "file_name": "arch/x86_64/mcount-support.c",
                    "file_size": 5696
                },
                {
                    "file_additions": 8,
                    "file_deletions": 2,
                    "file_exists": true,
                    "file_name": "libmcount/record.c",
                    "file_size": 28834
                }
            ],
            "interesting": {
                "reopen": false,
                "status": false
            },
            "is_parent": false,
            "sha": "58fcc26f655ee0171ee97d42c8fedb4d3a5f124e"
        },
        {
            "associated_pull_request": [],
            "date": "2019-09-10 11:23:42",
            "diff": "namhyung_uftrace/issue_858/commit_c3515c2204691b34274b59217365ff0bc44f9677.diff",
            "diff_additions": 44,
            "diff_deletions": 6,
            "diff_file_size": 60511,
            "diff_url": "https://github.com/namhyung/uftrace/commit/c3515c2204691b34274b59217365ff0bc44f9677.diff",
            "exists": true,
            "files": [
                {
                    "file_additions": 9,
                    "file_deletions": 1,
                    "file_exists": true,
                    "file_name": "arch/aarch64/mcount-support.c",
                    "file_size": 6851
                },
                {
                    "file_additions": 9,
                    "file_deletions": 1,
                    "file_exists": true,
                    "file_name": "arch/arm/mcount-support.c",
                    "file_size": 11764
                },
                {
                    "file_additions": 9,
                    "file_deletions": 1,
                    "file_exists": true,
                    "file_name": "arch/i386/mcount-support.c",
                    "file_size": 7366
                },
                {
                    "file_additions": 9,
                    "file_deletions": 1,
                    "file_exists": true,
                    "file_name": "arch/x86_64/mcount-support.c",
                    "file_size": 5696
                },
                {
                    "file_additions": 8,
                    "file_deletions": 2,
                    "file_exists": true,
                    "file_name": "libmcount/record.c",
                    "file_size": 28834
                }
            ],
            "interesting": {
                "reopen": false,
                "status": true
            },
            "is_parent": false,
            "sha": "c3515c2204691b34274b59217365ff0bc44f9677"
        },
        {
            "associated_pull_request": [],
            "date": "2019-09-10 11:23:42",
            "diff": "namhyung_uftrace/issue_858/commit_58e74a91d8a44dafe2ef4ba9510452fc5298cac0.diff",
            "diff_additions": 44,
            "diff_deletions": 6,
            "diff_file_size": 60511,
            "diff_url": "https://github.com/namhyung/uftrace/commit/58e74a91d8a44dafe2ef4ba9510452fc5298cac0.diff",
            "exists": true,
            "files": [
                {
                    "file_additions": 9,
                    "file_deletions": 1,
                    "file_exists": true,
                    "file_name": "arch/aarch64/mcount-support.c",
                    "file_size": 6851
                },
                {
                    "file_additions": 9,
                    "file_deletions": 1,
                    "file_exists": true,
                    "file_name": "arch/arm/mcount-support.c",
                    "file_size": 11764
                },
                {
                    "file_additions": 9,
                    "file_deletions": 1,
                    "file_exists": true,
                    "file_name": "arch/i386/mcount-support.c",
                    "file_size": 7366
                },
                {
                    "file_additions": 9,
                    "file_deletions": 1,
                    "file_exists": true,
                    "file_name": "arch/x86_64/mcount-support.c",
                    "file_size": 5696
                },
                {
                    "file_additions": 8,
                    "file_deletions": 2,
                    "file_exists": true,
                    "file_name": "libmcount/record.c",
                    "file_size": 28834
                }
            ],
            "interesting": {
                "reopen": false,
                "status": true
            },
            "is_parent": false,
            "sha": "58e74a91d8a44dafe2ef4ba9510452fc5298cac0"
        },
        {
            "associated_pull_request": [],
            "date": "2019-09-10 11:23:42",
            "diff": "namhyung_uftrace/issue_858/commit_30574f5b6d6660d90c5d857cd075807a5f1f46bc.diff",
            "diff_additions": 44,
            "diff_deletions": 6,
            "diff_file_size": 60511,
            "diff_url": "https://github.com/namhyung/uftrace/commit/30574f5b6d6660d90c5d857cd075807a5f1f46bc.diff",
            "exists": true,
            "files": [
                {
                    "file_additions": 9,
                    "file_deletions": 1,
                    "file_exists": true,
                    "file_name": "arch/aarch64/mcount-support.c",
                    "file_size": 6851
                },
                {
                    "file_additions": 9,
                    "file_deletions": 1,
                    "file_exists": true,
                    "file_name": "arch/arm/mcount-support.c",
                    "file_size": 11764
                },
                {
                    "file_additions": 9,
                    "file_deletions": 1,
                    "file_exists": true,
                    "file_name": "arch/i386/mcount-support.c",
                    "file_size": 7366
                },
                {
                    "file_additions": 9,
                    "file_deletions": 1,
                    "file_exists": true,
                    "file_name": "arch/x86_64/mcount-support.c",
                    "file_size": 5696
                },
                {
                    "file_additions": 8,
                    "file_deletions": 2,
                    "file_exists": true,
                    "file_name": "libmcount/record.c",
                    "file_size": 28834
                }
            ],
            "interesting": {
                "reopen": false,
                "status": false
            },
            "is_parent": false,
            "sha": "30574f5b6d6660d90c5d857cd075807a5f1f46bc"
        },
        {
            "associated_pull_request": [],
            "date": "2019-09-20 10:59:23",
            "diff": "namhyung_uftrace/issue_858/commit_dc2880696c6b6e61511f3390a813a3f74efb5aab.diff",
            "diff_additions": 44,
            "diff_deletions": 6,
            "diff_file_size": 60511,
            "diff_url": "https://github.com/namhyung/uftrace/commit/dc2880696c6b6e61511f3390a813a3f74efb5aab.diff",
            "exists": true,
            "files": [
                {
                    "file_additions": 9,
                    "file_deletions": 1,
                    "file_exists": true,
                    "file_name": "arch/aarch64/mcount-support.c",
                    "file_size": 6851
                },
                {
                    "file_additions": 9,
                    "file_deletions": 1,
                    "file_exists": true,
                    "file_name": "arch/arm/mcount-support.c",
                    "file_size": 11764
                },
                {
                    "file_additions": 9,
                    "file_deletions": 1,
                    "file_exists": true,
                    "file_name": "arch/i386/mcount-support.c",
                    "file_size": 7366
                },
                {
                    "file_additions": 9,
                    "file_deletions": 1,
                    "file_exists": true,
                    "file_name": "arch/x86_64/mcount-support.c",
                    "file_size": 5696
                },
                {
                    "file_additions": 8,
                    "file_deletions": 2,
                    "file_exists": true,
                    "file_name": "libmcount/record.c",
                    "file_size": 28834
                }
            ],
            "interesting": {
                "reopen": false,
                "status": false
            },
            "is_parent": false,
            "sha": "dc2880696c6b6e61511f3390a813a3f74efb5aab"
        },
        {
            "associated_pull_request": [],
            "date": "2019-09-20 10:59:23",
            "diff": "namhyung_uftrace/issue_858/commit_071273677a7b8ea0c6cf729e9ac502bb9c425346.diff",
            "diff_additions": 60,
            "diff_deletions": 10,
            "diff_file_size": 60511,
            "diff_url": "https://github.com/namhyung/uftrace/commit/071273677a7b8ea0c6cf729e9ac502bb9c425346.diff",
            "exists": true,
            "files": [
                {
                    "file_additions": 13,
                    "file_deletions": 2,
                    "file_exists": true,
                    "file_name": "arch/aarch64/mcount-support.c",
                    "file_size": 6851
                },
                {
                    "file_additions": 13,
                    "file_deletions": 2,
                    "file_exists": true,
                    "file_name": "arch/arm/mcount-support.c",
                    "file_size": 11764
                },
                {
                    "file_additions": 13,
                    "file_deletions": 2,
                    "file_exists": true,
                    "file_name": "arch/i386/mcount-support.c",
                    "file_size": 7366
                },
                {
                    "file_additions": 13,
                    "file_deletions": 2,
                    "file_exists": true,
                    "file_name": "arch/x86_64/mcount-support.c",
                    "file_size": 5696
                },
                {
                    "file_additions": 8,
                    "file_deletions": 2,
                    "file_exists": true,
                    "file_name": "libmcount/record.c",
                    "file_size": 28834
                }
            ],
            "interesting": {
                "reopen": false,
                "status": false
            },
            "is_parent": false,
            "sha": "071273677a7b8ea0c6cf729e9ac502bb9c425346"
        },
        {
            "associated_pull_request": [
                "https://github.com/namhyung/uftrace/pull/865"
            ],
            "date": "2019-09-23 08:41:38",
            "diff": "namhyung_uftrace/issue_858/commit_d884ef901fe4c4b8f48301d2dd33e351a55a1dac.diff",
            "diff_additions": 60,
            "diff_deletions": 10,
            "diff_file_size": 60511,
            "diff_url": "https://github.com/namhyung/uftrace/commit/d884ef901fe4c4b8f48301d2dd33e351a55a1dac.diff",
            "exists": true,
            "files": [
                {
                    "file_additions": 13,
                    "file_deletions": 2,
                    "file_exists": true,
                    "file_name": "arch/aarch64/mcount-support.c",
                    "file_size": 6851
                },
                {
                    "file_additions": 13,
                    "file_deletions": 2,
                    "file_exists": true,
                    "file_name": "arch/arm/mcount-support.c",
                    "file_size": 11764
                },
                {
                    "file_additions": 13,
                    "file_deletions": 2,
                    "file_exists": true,
                    "file_name": "arch/i386/mcount-support.c",
                    "file_size": 7366
                },
                {
                    "file_additions": 13,
                    "file_deletions": 2,
                    "file_exists": true,
                    "file_name": "arch/x86_64/mcount-support.c",
                    "file_size": 5696
                },
                {
                    "file_additions": 8,
                    "file_deletions": 2,
                    "file_exists": true,
                    "file_name": "libmcount/record.c",
                    "file_size": 28834
                }
            ],
            "interesting": {
                "reopen": false,
                "status": false
            },
            "is_parent": false,
            "sha": "d884ef901fe4c4b8f48301d2dd33e351a55a1dac"
        }
    ],
    "first_commit": "2019-09-09 12:28:03",
    "last_commit": "2019-09-23 08:44:16",
    "number": 858,
    "pull_request": "None",
    "score": {
        "accidental_reopen_likely": false,
        "all_labels": [
            "args",
            "contributon2019"
        ],
        "contains_keywords": [
            "problem",
            "crash",
            "test",
            "fix",
            "patch",
            "issu",
            "work",
            "perform",
            "fault"
        ],
        "fix_size": 196,
        "has_labels": [],
        "intersecting": {
            "computed_score": 1.0,
            "final_commit_size": 69,
            "intersection_size": 69,
            "previous_commits_size": 196
        },
        "is_makefile_based": true,
        "no_new_files": [],
        "no_other_files": false,
        "num_prohibited_files": 362954,
        "prohibited_files": [
            "hal/inc/pinmap_hal.h",
            "Debug/marvin.bin",
            "Debug/marvin.elf",
            "Debug/marvin.hex",
            "Debug/marvin.bin",
            "Debug/marvin.elf",
            "Debug/marvin.hex",
            "inc/spark_utilities.h",
            "Debug/marvin.bin",
            "Debug/marvin.elf"
        ],
        "reopen": false,
        "reopen_events": [
            [
                "2019-09-10 06:34:06",
                "commit"
            ],
            [
                "2019-09-10 11:13:23",
                "commit"
            ],
            [
                "2019-09-10 11:20:36",
                "commit"
            ],
            [
                "2019-09-10 11:24:22",
                "commit"
            ],
            [
                "2019-09-12 13:01:47",
                "commit"
            ],
            [
                "2019-09-15 15:06:52",
                "commit"
            ],
            [
                "2019-09-16 16:11:40",
                "commit"
            ],
            [
                "2019-09-19 09:38:43",
                "commit"
            ],
            [
                "2019-09-19 09:42:58",
                "commit"
            ],
            [
                "2019-09-19 09:44:31",
                "commit"
            ],
            [
                "2019-09-20 11:06:16",
                "commit"
            ],
            [
                "2019-09-22 14:14:00",
                "commit"
            ],
            [
                "2019-09-23 08:45:51",
                "commit"
            ],
            [
                "2019-09-23 08:45:51",
                "commit"
            ],
            [
                "2019-09-23 15:33:38",
                "closed"
            ]
        ],
        "status": true,
        "strategy": true,
        "total_changes": 1019
    }
}