{
    "covered_issues": [
        702,
        701,
        700,
        698,
        695,
        692,
        688,
        686,
        684,
        683,
        682,
        679,
        675,
        673,
        672,
        671,
        669,
        668,
        667,
        666,
        665,
        663,
        661,
        660,
        657,
        655,
        653,
        649,
        648,
        647,
        639,
        638,
        637,
        636,
        635,
        631,
        628,
        627,
        625,
        620,
        617,
        609,
        608,
        607,
        606,
        604,
        602,
        601,
        596,
        591,
        589,
        588,
        584,
        579,
        577,
        576,
        575,
        566,
        565,
        564,
        562,
        561,
        560,
        558,
        557,
        556,
        554,
        550,
        548,
        545,
        544,
        543,
        542,
        541,
        540,
        538,
        537,
        536,
        532,
        529,
        528,
        527,
        526,
        525,
        524,
        523,
        521,
        520,
        518,
        517,
        514,
        513,
        512,
        510,
        509,
        507,
        506,
        505,
        504,
        502,
        501,
        500,
        498,
        311,
        310,
        309,
        307,
        306,
        304,
        303,
        302,
        297,
        295,
        292,
        288,
        283,
        314,
        281,
        280,
        276,
        274,
        273,
        272,
        315,
        270,
        269,
        268,
        267,
        266,
        262,
        255,
        251,
        250,
        245,
        244,
        243,
        241,
        240,
        236,
        235,
        234,
        233,
        232,
        230,
        229,
        228,
        227,
        226,
        225,
        224,
        223,
        222,
        220,
        219,
        218,
        217,
        215,
        213,
        210,
        209,
        208,
        207,
        206,
        205,
        203,
        202,
        201,
        199,
        198,
        197,
        196,
        195,
        194,
        191,
        189,
        188,
        186,
        185,
        184,
        183,
        182,
        181,
        179,
        178,
        176,
        174,
        173,
        170,
        169,
        167,
        26,
        168,
        102,
        106,
        107,
        108,
        109,
        316,
        110,
        111,
        317,
        318,
        319,
        113,
        33,
        117,
        320,
        321,
        322,
        323,
        120,
        324,
        325,
        326,
        327,
        328,
        329,
        330,
        122,
        331,
        39,
        123,
        40,
        332,
        333,
        125,
        126,
        127,
        129,
        334,
        131,
        44,
        132,
        45,
        133,
        46,
        134,
        335,
        336,
        47,
        48,
        337,
        338,
        50,
        339,
        136,
        137,
        139,
        51,
        340,
        141,
        341,
        142,
        342,
        52,
        144,
        145,
        53,
        343,
        344,
        345,
        346,
        347,
        348,
        349,
        350,
        56,
        351,
        352,
        57,
        147,
        353,
        354,
        355,
        356,
        148,
        357,
        58,
        150,
        387,
        358,
        308,
        151,
        59,
        60,
        61,
        152,
        359,
        360,
        361,
        153,
        362,
        363,
        154,
        364,
        365,
        155,
        366,
        313,
        156,
        367,
        67,
        368,
        369,
        157,
        370,
        68,
        69,
        371,
        159,
        372,
        70,
        71,
        373,
        72,
        374,
        160,
        375,
        376,
        116,
        377,
        161,
        162,
        378,
        379,
        380,
        381,
        382,
        383,
        79,
        80,
        384,
        385,
        386,
        388,
        389,
        390,
        164,
        391,
        392,
        393,
        394,
        165,
        395,
        396,
        397,
        398,
        399,
        400,
        90,
        401,
        402,
        92,
        403,
        404,
        405,
        94,
        406,
        407,
        408,
        409,
        410,
        411,
        412,
        413,
        414,
        415,
        416,
        417,
        418,
        419,
        420,
        421,
        422,
        423,
        424,
        425,
        426,
        427,
        428,
        429,
        96,
        430,
        431,
        432,
        433,
        434,
        435,
        436,
        437,
        438,
        439,
        440,
        441,
        442,
        443,
        444,
        445,
        446,
        447,
        448,
        449,
        450,
        451,
        452,
        453,
        454,
        455,
        456,
        457,
        458,
        459,
        460,
        461,
        462,
        463,
        464,
        465,
        466,
        467,
        468,
        469,
        470,
        471,
        472,
        473,
        474,
        475,
        476,
        477,
        478,
        479,
        480,
        481,
        482,
        483,
        484,
        485,
        486,
        487,
        488,
        489,
        490,
        491,
        492,
        493,
        494,
        495,
        496
    ],
    "finished": true
}