{
    "category": [
        "memory",
        "control flow"
    ],
    "commits": [
        {
            "associated_pull_request": [],
            "date": "2020-01-13 10:45:45",
            "diff": "opensips_opensips/issue_1935/commit_f67f38e2914ff8ba44bbab98cb5d85ef58779d56.diff",
            "diff_additions": 47,
            "diff_deletions": 35,
            "diff_file_size": 44921,
            "diff_url": "https://github.com/OpenSIPS/opensips/commit/f67f38e2914ff8ba44bbab98cb5d85ef58779d56.diff",
            "exists": true,
            "files": [
                {
                    "file_additions": 47,
                    "file_deletions": 35,
                    "file_exists": true,
                    "file_name": "modules/proto_smpp/smpp.c",
                    "file_size": 44921
                }
            ],
            "interesting": {
                "reopen": false,
                "status": false
            },
            "is_parent": true,
            "sha": "f67f38e2914ff8ba44bbab98cb5d85ef58779d56"
        },
        {
            "associated_pull_request": [],
            "date": "2020-01-13 12:22:20",
            "diff": "opensips_opensips/issue_1935/commit_417ac1185809d80315548ba5a4d5dd75c61ce93a.diff",
            "diff_additions": 93,
            "diff_deletions": 2,
            "diff_file_size": 44921,
            "diff_url": "https://github.com/OpenSIPS/opensips/commit/417ac1185809d80315548ba5a4d5dd75c61ce93a.diff",
            "exists": true,
            "files": [
                {
                    "file_additions": 93,
                    "file_deletions": 2,
                    "file_exists": true,
                    "file_name": "modules/proto_smpp/smpp.c",
                    "file_size": 44921
                }
            ],
            "interesting": {
                "reopen": false,
                "status": false
            },
            "is_parent": false,
            "sha": "417ac1185809d80315548ba5a4d5dd75c61ce93a"
        },
        {
            "associated_pull_request": [],
            "date": "2020-01-13 12:22:20",
            "diff": "opensips_opensips/issue_1935/commit_2e2143f0003eb64cbf68db984a4538948d086fcb.diff",
            "diff_additions": 94,
            "diff_deletions": 6,
            "diff_file_size": 44921,
            "diff_url": "https://github.com/OpenSIPS/opensips/commit/2e2143f0003eb64cbf68db984a4538948d086fcb.diff",
            "exists": true,
            "files": [
                {
                    "file_additions": 94,
                    "file_deletions": 6,
                    "file_exists": true,
                    "file_name": "modules/proto_smpp/smpp.c",
                    "file_size": 44921
                }
            ],
            "interesting": {
                "reopen": false,
                "status": true
            },
            "is_parent": false,
            "sha": "2e2143f0003eb64cbf68db984a4538948d086fcb"
        },
        {
            "associated_pull_request": [],
            "date": "2020-01-17 10:36:11",
            "diff": "opensips_opensips/issue_1935/commit_0838b2de27c50ee7eb7824b239119526c0ecbffe.diff",
            "diff_additions": 1,
            "diff_deletions": 1,
            "diff_file_size": 44921,
            "diff_url": "https://github.com/OpenSIPS/opensips/commit/0838b2de27c50ee7eb7824b239119526c0ecbffe.diff",
            "exists": true,
            "files": [
                {
                    "file_additions": 1,
                    "file_deletions": 1,
                    "file_exists": true,
                    "file_name": "modules/proto_smpp/smpp.c",
                    "file_size": 44921
                }
            ],
            "interesting": {
                "reopen": false,
                "status": false
            },
            "is_parent": false,
            "sha": "0838b2de27c50ee7eb7824b239119526c0ecbffe"
        },
        {
            "associated_pull_request": [],
            "date": "2020-01-17 10:36:11",
            "diff": "opensips_opensips/issue_1935/commit_88624ba2afe8c7b3320c9144d28f74e51cb78533.diff",
            "diff_additions": 1,
            "diff_deletions": 1,
            "diff_file_size": 44921,
            "diff_url": "https://github.com/OpenSIPS/opensips/commit/88624ba2afe8c7b3320c9144d28f74e51cb78533.diff",
            "exists": true,
            "files": [
                {
                    "file_additions": 1,
                    "file_deletions": 1,
                    "file_exists": true,
                    "file_name": "modules/proto_smpp/smpp.c",
                    "file_size": 44921
                }
            ],
            "interesting": {
                "reopen": false,
                "status": false
            },
            "is_parent": false,
            "sha": "88624ba2afe8c7b3320c9144d28f74e51cb78533"
        },
        {
            "associated_pull_request": [],
            "date": "2020-01-28 09:24:36",
            "diff": "opensips_opensips/issue_1935/commit_4b65de9238d5851703ee18a84da1b4fd34eb968c.diff",
            "diff_additions": 10,
            "diff_deletions": 3,
            "diff_file_size": 44921,
            "diff_url": "https://github.com/OpenSIPS/opensips/commit/4b65de9238d5851703ee18a84da1b4fd34eb968c.diff",
            "exists": true,
            "files": [
                {
                    "file_additions": 10,
                    "file_deletions": 3,
                    "file_exists": true,
                    "file_name": "modules/proto_smpp/smpp.c",
                    "file_size": 44921
                }
            ],
            "interesting": {
                "reopen": false,
                "status": false
            },
            "is_parent": false,
            "sha": "4b65de9238d5851703ee18a84da1b4fd34eb968c"
        }
    ],
    "first_commit": "2020-01-13 12:49:37",
    "last_commit": "2020-01-28 09:25:21",
    "number": 1935,
    "pull_request": "None",
    "score": {
        "accidental_reopen_likely": false,
        "all_labels": [
            "bug"
        ],
        "contains_keywords": [
            "fail",
            "report",
            "warn",
            "chang",
            "confirm",
            "error",
            "bug",
            "problem",
            "test",
            "fix",
            "patch",
            "remov",
            "attempt",
            "issu",
            "work",
            "fault",
            "leak"
        ],
        "fix_size": 124,
        "has_labels": [
            "bug"
        ],
        "intersecting": {
            "computed_score": 1.0,
            "final_commit_size": 12,
            "intersection_size": 12,
            "previous_commits_size": 124
        },
        "is_makefile_based": true,
        "no_new_files": [],
        "no_other_files": false,
        "num_prohibited_files": 67348,
        "prohibited_files": [
            "hal/inc/pinmap_hal.h",
            "Debug/marvin.bin",
            "Debug/marvin.elf",
            "Debug/marvin.hex",
            "Debug/marvin.bin",
            "Debug/marvin.elf",
            "Debug/marvin.hex",
            "inc/spark_utilities.h",
            "Debug/marvin.bin",
            "Debug/marvin.elf"
        ],
        "reopen": false,
        "reopen_events": [
            [
                "2020-01-13 12:49:48",
                "commit"
            ],
            [
                "2020-01-14 13:50:12",
                "commit"
            ],
            [
                "2020-01-17 10:37:46",
                "commit"
            ],
            [
                "2020-01-17 10:38:00",
                "commit"
            ],
            [
                "2020-01-28 09:25:34",
                "commit"
            ],
            [
                "2020-01-31 08:13:25",
                "closed"
            ]
        ],
        "status": true,
        "strategy": true,
        "total_changes": 294
    }
}