{
    "covered_issues": [
        1296,
        1293,
        1289,
        1287,
        1285,
        1284,
        1283,
        1279,
        1272,
        1270,
        1269,
        1267,
        1262,
        1260,
        1258,
        1254,
        1248,
        1243,
        1235,
        1228,
        1227,
        1226,
        1225,
        1222,
        1221,
        1219,
        1216,
        1214,
        1210,
        1203,
        1193,
        1192,
        1189,
        1185,
        1184,
        1175,
        1162,
        1159,
        1158,
        1156,
        1154,
        1152,
        1151,
        1149,
        1148,
        1145,
        1143,
        1141,
        1140,
        1139,
        1134,
        1131,
        1130,
        1129,
        1127,
        1126,
        1125,
        1123,
        1122,
        1121,
        1120,
        1118,
        1114,
        1113,
        1108,
        1104,
        1100,
        1099,
        1098,
        1097,
        1095,
        1094,
        1091,
        1087,
        1086,
        1085,
        1084,
        1083,
        1082,
        1079,
        1078,
        1068,
        1067,
        1066,
        1062,
        1061,
        1060,
        1058,
        1057,
        1056,
        1055,
        1051,
        1049,
        1044,
        1043,
        1042,
        1041,
        1040,
        1037,
        1034,
        1031,
        1029,
        1027,
        1026,
        1022,
        1021,
        1020,
        1018,
        1016,
        1013,
        1008,
        1007,
        1006,
        1004,
        1000,
        999,
        997,
        993,
        990,
        987,
        985,
        983,
        980,
        979,
        975,
        974,
        973,
        967,
        965,
        964,
        963,
        961,
        960,
        959,
        958,
        957,
        956,
        955,
        953,
        952,
        951,
        949,
        948,
        947,
        943,
        939,
        938,
        934,
        933,
        932,
        931,
        930,
        929,
        928,
        926,
        925,
        924,
        921,
        920,
        919,
        918,
        916,
        915,
        912,
        911,
        910,
        909,
        908,
        907,
        906,
        905,
        904,
        903,
        902,
        901,
        900,
        899,
        898,
        897,
        896,
        893,
        891,
        890,
        888,
        886,
        883,
        880,
        879,
        878,
        874,
        873,
        871,
        869,
        868,
        867,
        866,
        864,
        861,
        857,
        849,
        848,
        846,
        845,
        844,
        841,
        837,
        836,
        833,
        832,
        831,
        829,
        828,
        827,
        826,
        824,
        823,
        822,
        821,
        820,
        817,
        815,
        814,
        813,
        812,
        811,
        808,
        807,
        806,
        805,
        804,
        801,
        800,
        799,
        798,
        796,
        792,
        791,
        790,
        787,
        786,
        782,
        781,
        780,
        779,
        777,
        776,
        774,
        772,
        770,
        769,
        768,
        767,
        766,
        765,
        764,
        763,
        762,
        761,
        760,
        759,
        758,
        757,
        754,
        753,
        752,
        751,
        750,
        749,
        748,
        742,
        740,
        738,
        734,
        732,
        731,
        730,
        729,
        720,
        718,
        716,
        709,
        708,
        703,
        701,
        698,
        697,
        689,
        688,
        686,
        683,
        682,
        680,
        679,
        677,
        675,
        674,
        670,
        669,
        668,
        665,
        652,
        650,
        649,
        644,
        640,
        638,
        637,
        636,
        635,
        633,
        628,
        627,
        626,
        624,
        623,
        622,
        621,
        616,
        615,
        614,
        612,
        611,
        609,
        607,
        601,
        600,
        599,
        597,
        593,
        592,
        591,
        590,
        587,
        586,
        585,
        584,
        583,
        582,
        581,
        580,
        579,
        578,
        577,
        575,
        569,
        568,
        567,
        566,
        565,
        562,
        561,
        558,
        556,
        555,
        553,
        551,
        545,
        544,
        542,
        538,
        536,
        533,
        532,
        530,
        529,
        528,
        527,
        526,
        524,
        523,
        520,
        519,
        518,
        515,
        512,
        507,
        502,
        500,
        494,
        491,
        489,
        487,
        485,
        484,
        483,
        482,
        481,
        479,
        478,
        476,
        475,
        474,
        469,
        468,
        467,
        466,
        462,
        459,
        455,
        454,
        453,
        452,
        451,
        450,
        449,
        448,
        447,
        445,
        444,
        443,
        441,
        440,
        438,
        437,
        436,
        435,
        434,
        431,
        429,
        422,
        421,
        419,
        418,
        416,
        415,
        413,
        412,
        410,
        408,
        407,
        406,
        405,
        403,
        400,
        397,
        396,
        395,
        393,
        387,
        386,
        385,
        383,
        377,
        376,
        375,
        373,
        372,
        371,
        370,
        369,
        368,
        367,
        365,
        362,
        361,
        360,
        359,
        357,
        355,
        354,
        353,
        352,
        351,
        350,
        349,
        347,
        346,
        344,
        342,
        340,
        339,
        338,
        337,
        336,
        335,
        332,
        329,
        327,
        326,
        325,
        324,
        323,
        322,
        320,
        319,
        317,
        315,
        314,
        313,
        312,
        311,
        310,
        309,
        308,
        306,
        304,
        303,
        302,
        301,
        300,
        299,
        297,
        296,
        294,
        292,
        291,
        290,
        287,
        286,
        284,
        283,
        282,
        281,
        280,
        279,
        277,
        276,
        275,
        274,
        273,
        272,
        270,
        268,
        267,
        266,
        264,
        263,
        262,
        260,
        259,
        256,
        255,
        252,
        251,
        249,
        246,
        243,
        242,
        241,
        240,
        238,
        237,
        227,
        225,
        224,
        223,
        222,
        221,
        220,
        217,
        216,
        215,
        213,
        212,
        210,
        209,
        207,
        206,
        205,
        204,
        203,
        202,
        201,
        200,
        199,
        198,
        196,
        194,
        192,
        191,
        188,
        187,
        186,
        184,
        183,
        182,
        179,
        178,
        177,
        176,
        174,
        173,
        172,
        171,
        169,
        168,
        163,
        160,
        159,
        157,
        156,
        155,
        154,
        153,
        152,
        151,
        150,
        149,
        145,
        144,
        141,
        139,
        138,
        137,
        136,
        135,
        134,
        133,
        130,
        129,
        126,
        125,
        122,
        121,
        120,
        119,
        117,
        115,
        114,
        112,
        111,
        110,
        109,
        108,
        107,
        106,
        105,
        104,
        102,
        101,
        97,
        96,
        95,
        93,
        92,
        91,
        90,
        88,
        87,
        86,
        85,
        84,
        83,
        82,
        81,
        80,
        79,
        78,
        76,
        74,
        73,
        71,
        69,
        68,
        66,
        65,
        64,
        63,
        61,
        60,
        59,
        58,
        57,
        56,
        54,
        53,
        52,
        50,
        49,
        48,
        47,
        46,
        45,
        43,
        42,
        41,
        40,
        39,
        38,
        36,
        34,
        33,
        32,
        31,
        30,
        29,
        28,
        27,
        26,
        25,
        24,
        23,
        22,
        21,
        20,
        19,
        18,
        14,
        13,
        12,
        11,
        10,
        9,
        8,
        7,
        6,
        5,
        4,
        3
    ],
    "finished": true
}