{
    "covered_issues": [
        34,
        29,
        21,
        20,
        19,
        17,
        15,
        12,
        11,
        10,
        9,
        8,
        7,
        6,
        2,
        1
    ],
    "finished": true
}