{
    "covered_issues": [
        274,
        273,
        271,
        269,
        265,
        263,
        260,
        259,
        258,
        255,
        253,
        252,
        248,
        245,
        242,
        240,
        238,
        237,
        236,
        230,
        229,
        228,
        226,
        224,
        223,
        222,
        221,
        220,
        219,
        218,
        216,
        215,
        214,
        213,
        212,
        210,
        209,
        208,
        207,
        201,
        200,
        199,
        197,
        196,
        195,
        191,
        189,
        183,
        182,
        181,
        180,
        179,
        177,
        175,
        174,
        173,
        171,
        169,
        168,
        161,
        160,
        157,
        153,
        152,
        150,
        148,
        146,
        142,
        141,
        140,
        139,
        137,
        135,
        131,
        130,
        128,
        127,
        125,
        124,
        123,
        122,
        121,
        114,
        112,
        110,
        109,
        108,
        107,
        106,
        100,
        96,
        92,
        87,
        85,
        84,
        79,
        77,
        74,
        73,
        72,
        70,
        68,
        67,
        66,
        63,
        62,
        57,
        56,
        54,
        52,
        50,
        49,
        48,
        46,
        45,
        44,
        43,
        42,
        41,
        40,
        39,
        37,
        36,
        35,
        34,
        33,
        32,
        31,
        30,
        29,
        28,
        27,
        26,
        25,
        24,
        23,
        22,
        21,
        20,
        19,
        18,
        16,
        15,
        14,
        13,
        10,
        9,
        8,
        3
    ],
    "finished": true
}