{
    "commits": [
        {
            "associated_pull_request": [],
            "date": "2020-12-31 23:06:10+00:00",
            "diff": "dosemu2_dosemu2/issue_1380/commit_3e815c0f8c257ea86731e6c427bf95d00b01c4af.diff",
            "diff_additions": 14,
            "diff_deletions": 0,
            "diff_file_size": 61783,
            "diff_url": "https://github.com/dosemu2/dosemu2/commit/3e815c0f8c257ea86731e6c427bf95d00b01c4af.diff",
            "exists": true,
            "files": [
                {
                    "file_additions": 14,
                    "file_deletions": 0,
                    "file_exists": true,
                    "file_name": "src/dosext/dpmi/msdos/msdos.c",
                    "file_size": 61783
                }
            ],
            "interesting": {
                "reopen": false,
                "status": false
            },
            "is_parent": true,
            "sha": "3e815c0f8c257ea86731e6c427bf95d00b01c4af"
        },
        {
            "associated_pull_request": [],
            "date": "2021-01-01 18:55:57+00:00",
            "diff": "dosemu2_dosemu2/issue_1380/commit_31e498dd8e7fb004d0b08743a81c519b7a15393d.diff",
            "diff_additions": 11,
            "diff_deletions": 0,
            "diff_file_size": 184308,
            "diff_url": "https://github.com/dosemu2/dosemu2/commit/31e498dd8e7fb004d0b08743a81c519b7a15393d.diff",
            "exists": true,
            "files": [
                {
                    "file_additions": 1,
                    "file_deletions": 0,
                    "file_exists": true,
                    "file_name": "src/base/emu-i386/simx86/codegen-x86.c",
                    "file_size": 90067
                },
                {
                    "file_additions": 10,
                    "file_deletions": 0,
                    "file_exists": true,
                    "file_name": "src/base/emu-i386/simx86/interp.c",
                    "file_size": 94241
                }
            ],
            "interesting": {
                "reopen": false,
                "status": false
            },
            "is_parent": false,
            "sha": "31e498dd8e7fb004d0b08743a81c519b7a15393d"
        },
        {
            "associated_pull_request": [],
            "date": "2021-01-01 21:03:25+00:00",
            "diff": "dosemu2_dosemu2/issue_1380/commit_d1c9dbdfb82d30592f28f961dbc0354f35ff4744.diff",
            "diff_additions": 1,
            "diff_deletions": 0,
            "diff_file_size": 90067,
            "diff_url": "https://github.com/dosemu2/dosemu2/commit/d1c9dbdfb82d30592f28f961dbc0354f35ff4744.diff",
            "exists": true,
            "files": [
                {
                    "file_additions": 1,
                    "file_deletions": 0,
                    "file_exists": true,
                    "file_name": "src/base/emu-i386/simx86/codegen-x86.c",
                    "file_size": 90067
                }
            ],
            "interesting": {
                "reopen": false,
                "status": false
            },
            "is_parent": false,
            "sha": "d1c9dbdfb82d30592f28f961dbc0354f35ff4744"
        },
        {
            "associated_pull_request": [],
            "date": "2021-01-01 21:20:17+00:00",
            "diff": "dosemu2_dosemu2/issue_1380/commit_b6e05edd2bb3fc990d79f29892efe1710f46f4e2.diff",
            "diff_additions": 8,
            "diff_deletions": 5,
            "diff_file_size": 50343,
            "diff_url": "https://github.com/dosemu2/dosemu2/commit/b6e05edd2bb3fc990d79f29892efe1710f46f4e2.diff",
            "exists": true,
            "files": [
                {
                    "file_additions": 4,
                    "file_deletions": 4,
                    "file_exists": true,
                    "file_name": "src/base/emu-i386/simx86/memory.c",
                    "file_size": 12723
                },
                {
                    "file_additions": 4,
                    "file_deletions": 1,
                    "file_exists": true,
                    "file_name": "src/base/emu-i386/simx86/trees.c",
                    "file_size": 37620
                }
            ],
            "interesting": {
                "reopen": true,
                "status": false
            },
            "is_parent": false,
            "sha": "b6e05edd2bb3fc990d79f29892efe1710f46f4e2"
        },
        {
            "associated_pull_request": [
                "https://github.com/dosemu2/dosemu2/pull/1383"
            ],
            "date": "2021-01-01 22:31:40+00:00",
            "diff": "dosemu2_dosemu2/issue_1380/commit_f10d25bcf110009244a6b449b58da02e5370776e.diff",
            "diff_additions": 5,
            "diff_deletions": 2,
            "diff_file_size": 94241,
            "diff_url": "https://github.com/dosemu2/dosemu2/commit/f10d25bcf110009244a6b449b58da02e5370776e.diff",
            "exists": true,
            "files": [
                {
                    "file_additions": 5,
                    "file_deletions": 2,
                    "file_exists": true,
                    "file_name": "src/base/emu-i386/simx86/interp.c",
                    "file_size": 94241
                }
            ],
            "interesting": {
                "reopen": false,
                "status": false
            },
            "is_parent": false,
            "sha": "f10d25bcf110009244a6b449b58da02e5370776e"
        },
        {
            "associated_pull_request": [
                "https://github.com/dosemu2/dosemu2/pull/1383"
            ],
            "date": "2021-01-02 01:00:58+00:00",
            "diff": "dosemu2_dosemu2/issue_1380/commit_e4845932dd76fd65a0b6e4be9f2b724666b779ec.diff",
            "diff_additions": 3,
            "diff_deletions": 2,
            "diff_file_size": 127698,
            "diff_url": "https://github.com/dosemu2/dosemu2/commit/e4845932dd76fd65a0b6e4be9f2b724666b779ec.diff",
            "exists": true,
            "files": [
                {
                    "file_additions": 2,
                    "file_deletions": 1,
                    "file_exists": true,
                    "file_name": "src/base/emu-i386/simx86/cpu-emu.c",
                    "file_size": 33457
                },
                {
                    "file_additions": 1,
                    "file_deletions": 1,
                    "file_exists": true,
                    "file_name": "src/base/emu-i386/simx86/interp.c",
                    "file_size": 94241
                }
            ],
            "interesting": {
                "reopen": false,
                "status": false
            },
            "is_parent": false,
            "sha": "e4845932dd76fd65a0b6e4be9f2b724666b779ec"
        },
        {
            "associated_pull_request": [
                "https://github.com/dosemu2/dosemu2/pull/1383"
            ],
            "date": "2021-01-02 01:00:58+00:00",
            "diff": "dosemu2_dosemu2/issue_1380/commit_e4845932dd76fd65a0b6e4be9f2b724666b779ec.diff",
            "diff_additions": 3,
            "diff_deletions": 2,
            "diff_file_size": 127698,
            "diff_url": "https://github.com/dosemu2/dosemu2/commit/e4845932dd76fd65a0b6e4be9f2b724666b779ec.diff",
            "exists": true,
            "files": [
                {
                    "file_additions": 2,
                    "file_deletions": 1,
                    "file_exists": true,
                    "file_name": "src/base/emu-i386/simx86/cpu-emu.c",
                    "file_size": 33457
                },
                {
                    "file_additions": 1,
                    "file_deletions": 1,
                    "file_exists": true,
                    "file_name": "src/base/emu-i386/simx86/interp.c",
                    "file_size": 94241
                }
            ],
            "interesting": {
                "reopen": true,
                "status": false
            },
            "is_parent": false,
            "sha": "e4845932dd76fd65a0b6e4be9f2b724666b779ec"
        },
        {
            "associated_pull_request": [],
            "date": "2021-01-02 20:23:24+00:00",
            "diff": "dosemu2_dosemu2/issue_1380/commit_7f21a1f380d83c28c818be0041951514a17daba3.diff",
            "diff_additions": 4,
            "diff_deletions": 16,
            "diff_file_size": 184308,
            "diff_url": "https://github.com/dosemu2/dosemu2/commit/7f21a1f380d83c28c818be0041951514a17daba3.diff",
            "exists": true,
            "files": [
                {
                    "file_additions": 2,
                    "file_deletions": 1,
                    "file_exists": true,
                    "file_name": "src/base/emu-i386/simx86/codegen-x86.c",
                    "file_size": 90067
                },
                {
                    "file_additions": 2,
                    "file_deletions": 15,
                    "file_exists": true,
                    "file_name": "src/base/emu-i386/simx86/interp.c",
                    "file_size": 94241
                }
            ],
            "interesting": {
                "reopen": false,
                "status": false
            },
            "is_parent": false,
            "sha": "7f21a1f380d83c28c818be0041951514a17daba3"
        }
    ],
    "first_commit": "2021-01-01 01:59:50+00:00",
    "last_commit": "2021-01-02 20:23:24+00:00",
    "number": 1380,
    "pull_request": "None",
    "score": {
        "accidental_reopen_likely": false,
        "all_labels": [],
        "contains_keywords": [
            "confirm",
            "work",
            "fail",
            "chang",
            "fix",
            "issu",
            "debug",
            "reason",
            "test",
            "fault",
            "remov",
            "warn",
            "bug",
            "error",
            "problem",
            "crash",
            "report"
        ],
        "fix_size": 43,
        "has_labels": [],
        "intersecting": {
            "computed_score": 0.5714285714285714,
            "final_commit_size": 21,
            "intersection_size": 12,
            "previous_commits_size": 34
        },
        "is_makefile_based": true,
        "no_new_files": [],
        "no_other_files": false,
        "num_prohibited_files": 563398,
        "prohibited_files": [
            "server/src/main/java/com/genymobile/scrcpy/Device.java",
            "server/src/main/java/com/genymobile/scrcpy/wrappers/SurfaceControl.java",
            "server/src/main/java/com/genymobile/scrcpy/Device.java",
            "server/src/main/java/com/genymobile/scrcpy/wrappers/SurfaceControl.java",
            "app/meson.build",
            "app/scrcpy.1",
            "app/src/common.h",
            "app/src/scrcpy.h",
            "app/src/server.h",
            "server/src/main/java/com/genymobile/scrcpy/Workarounds.java"
        ],
        "reopen": true,
        "reopen_events": [
            [
                "2021-01-01 21:22:39+00:00",
                "closed"
            ],
            [
                "2021-01-01 21:22:39+00:00",
                "commit"
            ],
            [
                "2021-01-01 21:22:39+00:00",
                "commit"
            ],
            [
                "2021-01-01 21:22:39+00:00",
                "commit"
            ],
            [
                "2021-01-01 21:56:04+00:00",
                "reopened"
            ],
            [
                "2021-01-02 01:45:41+00:00",
                "commit"
            ],
            [
                "2021-01-02 01:45:41+00:00",
                "commit"
            ],
            [
                "2021-01-02 01:45:41+00:00",
                "commit"
            ],
            [
                "2021-01-02 01:45:41+00:00",
                "commit"
            ],
            [
                "2021-01-02 02:09:16+00:00",
                "closed"
            ],
            [
                "2021-01-02 02:09:16+00:00",
                "commit"
            ],
            [
                "2021-01-02 18:37:28+00:00",
                "reopened"
            ],
            [
                "2021-01-02 20:25:10+00:00",
                "closed"
            ],
            [
                "2021-01-02 20:25:10+00:00",
                "commit"
            ]
        ],
        "status": false,
        "strategy": true,
        "total_changes": 76
    }
}