{
    "category": [
        "memory",
        "multithreading"
    ],
    "commits": [
        {
            "associated_pull_request": [
                "https://github.com/collectd/collectd/pull/1392"
            ],
            "date": "2015-11-30 21:22:51",
            "diff": "collectd_collectd/issue_1110/commit_079f57da9f9ff75d62f8d3c637ef16d06c87c253.diff",
            "diff_additions": 19,
            "diff_deletions": 1,
            "diff_file_size": 80913,
            "diff_url": "https://github.com/collectd/collectd/commit/079f57da9f9ff75d62f8d3c637ef16d06c87c253.diff",
            "exists": true,
            "files": [
                {
                    "file_additions": 19,
                    "file_deletions": 1,
                    "file_exists": true,
                    "file_name": "src/processes.c",
                    "file_size": 80913
                }
            ],
            "interesting": {
                "reopen": false,
                "status": false
            },
            "is_parent": true,
            "sha": "079f57da9f9ff75d62f8d3c637ef16d06c87c253"
        },
        {
            "associated_pull_request": [],
            "date": "2015-12-01 10:27:13",
            "diff": "collectd_collectd/issue_1110/commit_3ba3bdfa3d71a63ee1d275c949d9da527abd31a6.diff",
            "diff_additions": 28,
            "diff_deletions": 24,
            "diff_file_size": 73836,
            "diff_url": "https://github.com/collectd/collectd/commit/3ba3bdfa3d71a63ee1d275c949d9da527abd31a6.diff",
            "exists": true,
            "files": [
                {
                    "file_additions": 28,
                    "file_deletions": 24,
                    "file_exists": true,
                    "file_name": "src/daemon/plugin.c",
                    "file_size": 73836
                }
            ],
            "interesting": {
                "reopen": true,
                "status": false
            },
            "is_parent": false,
            "sha": "3ba3bdfa3d71a63ee1d275c949d9da527abd31a6"
        },
        {
            "associated_pull_request": [
                "https://github.com/collectd/collectd/pull/1837"
            ],
            "date": "2016-08-03 20:27:26",
            "diff": "collectd_collectd/issue_1110/commit_924bfe28d5be1058ccf50931d77639212fb28346.diff",
            "diff_additions": 11,
            "diff_deletions": 4,
            "diff_file_size": 102705,
            "diff_url": "https://github.com/collectd/collectd/commit/924bfe28d5be1058ccf50931d77639212fb28346.diff",
            "exists": true,
            "files": [
                {
                    "file_additions": 5,
                    "file_deletions": 0,
                    "file_exists": true,
                    "file_name": "src/network.c",
                    "file_size": 102705
                },
                {
                    "file_additions": 6,
                    "file_deletions": 4,
                    "file_exists": false,
                    "file_name": "src/plugin.c",
                    "file_size": 0
                }
            ],
            "interesting": {
                "reopen": false,
                "status": false
            },
            "is_parent": false,
            "sha": "924bfe28d5be1058ccf50931d77639212fb28346"
        }
    ],
    "first_commit": "2015-11-30 21:22:51",
    "last_commit": "2016-08-03 20:27:26",
    "number": 1110,
    "pull_request": "None",
    "score": {
        "accidental_reopen_likely": false,
        "all_labels": [
            "Bug",
            "core"
        ],
        "contains_keywords": [
            "error",
            "bug",
            "problem",
            "crash",
            "test",
            "fix",
            "patch",
            "issu",
            "work",
            "fault",
            "debug"
        ],
        "fix_size": 48,
        "has_labels": [],
        "intersecting": {
            "computed_score": 0.0,
            "final_commit_size": 17,
            "intersection_size": 0,
            "previous_commits_size": 31
        },
        "is_makefile_based": true,
        "no_new_files": [
            "src/network.c",
            "src/plugin.c"
        ],
        "no_other_files": true,
        "num_prohibited_files": 45336,
        "prohibited_files": [
            "hal/inc/pinmap_hal.h",
            "Debug/marvin.bin",
            "Debug/marvin.elf",
            "Debug/marvin.hex",
            "Debug/marvin.bin",
            "Debug/marvin.elf",
            "Debug/marvin.hex",
            "inc/spark_utilities.h",
            "Debug/marvin.bin",
            "Debug/marvin.elf"
        ],
        "reopen": true,
        "reopen_events": [
            [
                "2015-12-01 10:28:13",
                "closed"
            ],
            [
                "2015-12-01 10:28:13",
                "commit"
            ],
            [
                "2015-12-01 10:28:45",
                "reopened"
            ],
            [
                "2016-08-03 20:27:43",
                "commit"
            ],
            [
                "2016-08-04 12:33:13",
                "closed"
            ]
        ],
        "status": false,
        "strategy": true,
        "total_changes": 87
    }
}