{
    "commits": [
        {
            "associated_pull_request": [
                "https://github.com/openzfs/zfs/pull/9180"
            ],
            "date": "2019-08-27 20:45:53+00:00",
            "diff": "openzfs_zfs/issue_9185/commit_e6203d288a787f7196bdc206edfc9148f9a58780.diff",
            "diff_additions": 16,
            "diff_deletions": 10,
            "diff_file_size": 206970,
            "diff_url": "https://github.com/openzfs/zfs/commit/e6203d288a787f7196bdc206edfc9148f9a58780.diff",
            "exists": true,
            "files": [
                {
                    "file_additions": 16,
                    "file_deletions": 10,
                    "file_exists": true,
                    "file_name": "module/zfs/zfs_ioctl.c",
                    "file_size": 206970
                }
            ],
            "interesting": {
                "reopen": false,
                "status": false
            },
            "is_parent": true,
            "sha": "e6203d288a787f7196bdc206edfc9148f9a58780"
        },
        {
            "associated_pull_request": [
                "https://github.com/openzfs/zfs/pull/9231"
            ],
            "date": "2019-08-30 16:28:31+00:00",
            "diff": "openzfs_zfs/issue_9185/commit_475aa97cab771b3b2b9ddab03f5c14a1d4e985da.diff",
            "diff_additions": 9,
            "diff_deletions": 2,
            "diff_file_size": 197472,
            "diff_url": "https://github.com/openzfs/zfs/commit/475aa97cab771b3b2b9ddab03f5c14a1d4e985da.diff",
            "exists": true,
            "files": [
                {
                    "file_additions": 9,
                    "file_deletions": 2,
                    "file_exists": true,
                    "file_name": "module/zfs/metaslab.c",
                    "file_size": 197472
                }
            ],
            "interesting": {
                "reopen": true,
                "status": false
            },
            "is_parent": false,
            "sha": "475aa97cab771b3b2b9ddab03f5c14a1d4e985da"
        },
        {
            "associated_pull_request": [
                "https://github.com/openzfs/zfs/pull/9282"
            ],
            "date": "2019-09-05 16:57:55+00:00",
            "diff": "openzfs_zfs/issue_9185/commit_65a91b166e66a57c44b62bb5ca20ccb6f0ecc46d.diff",
            "diff_additions": 24,
            "diff_deletions": 15,
            "diff_file_size": 197472,
            "diff_url": "https://github.com/openzfs/zfs/commit/65a91b166e66a57c44b62bb5ca20ccb6f0ecc46d.diff",
            "exists": true,
            "files": [
                {
                    "file_additions": 24,
                    "file_deletions": 15,
                    "file_exists": true,
                    "file_name": "module/zfs/metaslab.c",
                    "file_size": 197472
                }
            ],
            "interesting": {
                "reopen": false,
                "status": false
            },
            "is_parent": false,
            "sha": "65a91b166e66a57c44b62bb5ca20ccb6f0ecc46d"
        },
        {
            "associated_pull_request": [],
            "date": "2019-08-30 16:28:31+00:00",
            "diff": "openzfs_zfs/issue_9185/commit_d667e5d9b79dda8b976488b9c01ef2469b785176.diff",
            "diff_additions": 9,
            "diff_deletions": 2,
            "diff_file_size": 197472,
            "diff_url": "https://github.com/openzfs/zfs/commit/d667e5d9b79dda8b976488b9c01ef2469b785176.diff",
            "exists": true,
            "files": [
                {
                    "file_additions": 9,
                    "file_deletions": 2,
                    "file_exists": true,
                    "file_name": "module/zfs/metaslab.c",
                    "file_size": 197472
                }
            ],
            "interesting": {
                "reopen": false,
                "status": false
            },
            "is_parent": false,
            "sha": "d667e5d9b79dda8b976488b9c01ef2469b785176"
        },
        {
            "associated_pull_request": [],
            "date": "2019-08-30 16:28:31+00:00",
            "diff": "openzfs_zfs/issue_9185/commit_f187167fb74e5ad47da6a9fb99e088295854e26d.diff",
            "diff_additions": 9,
            "diff_deletions": 2,
            "diff_file_size": 197472,
            "diff_url": "https://github.com/openzfs/zfs/commit/f187167fb74e5ad47da6a9fb99e088295854e26d.diff",
            "exists": true,
            "files": [
                {
                    "file_additions": 9,
                    "file_deletions": 2,
                    "file_exists": true,
                    "file_name": "module/zfs/metaslab.c",
                    "file_size": 197472
                }
            ],
            "interesting": {
                "reopen": false,
                "status": false
            },
            "is_parent": false,
            "sha": "f187167fb74e5ad47da6a9fb99e088295854e26d"
        },
        {
            "associated_pull_request": [],
            "date": "2019-08-30 16:28:31+00:00",
            "diff": "openzfs_zfs/issue_9185/commit_ebdb7705549f608200e74ed040fe1829b8bea4ab.diff",
            "diff_additions": 9,
            "diff_deletions": 2,
            "diff_file_size": 197472,
            "diff_url": "https://github.com/openzfs/zfs/commit/ebdb7705549f608200e74ed040fe1829b8bea4ab.diff",
            "exists": true,
            "files": [
                {
                    "file_additions": 9,
                    "file_deletions": 2,
                    "file_exists": true,
                    "file_name": "module/zfs/metaslab.c",
                    "file_size": 197472
                }
            ],
            "interesting": {
                "reopen": false,
                "status": false
            },
            "is_parent": false,
            "sha": "ebdb7705549f608200e74ed040fe1829b8bea4ab"
        },
        {
            "associated_pull_request": [],
            "date": "2019-08-30 16:28:31+00:00",
            "diff": "openzfs_zfs/issue_9185/commit_97dd071d9ad260e1ed9ef9177011cef1dd99c14e.diff",
            "diff_additions": 9,
            "diff_deletions": 2,
            "diff_file_size": 197472,
            "diff_url": "https://github.com/openzfs/zfs/commit/97dd071d9ad260e1ed9ef9177011cef1dd99c14e.diff",
            "exists": true,
            "files": [
                {
                    "file_additions": 9,
                    "file_deletions": 2,
                    "file_exists": true,
                    "file_name": "module/zfs/metaslab.c",
                    "file_size": 197472
                }
            ],
            "interesting": {
                "reopen": false,
                "status": false
            },
            "is_parent": false,
            "sha": "97dd071d9ad260e1ed9ef9177011cef1dd99c14e"
        },
        {
            "associated_pull_request": [],
            "date": "2019-09-05 16:57:55+00:00",
            "diff": "openzfs_zfs/issue_9185/commit_8812bac575d307837abb16b16d70263209582c6a.diff",
            "diff_additions": 24,
            "diff_deletions": 15,
            "diff_file_size": 197472,
            "diff_url": "https://github.com/openzfs/zfs/commit/8812bac575d307837abb16b16d70263209582c6a.diff",
            "exists": true,
            "files": [
                {
                    "file_additions": 24,
                    "file_deletions": 15,
                    "file_exists": true,
                    "file_name": "module/zfs/metaslab.c",
                    "file_size": 197472
                }
            ],
            "interesting": {
                "reopen": false,
                "status": false
            },
            "is_parent": false,
            "sha": "8812bac575d307837abb16b16d70263209582c6a"
        }
    ],
    "first_commit": "2019-08-27 20:45:53+00:00",
    "last_commit": "2019-11-14 23:54:26+00:00",
    "number": 9185,
    "pull_request": "None",
    "score": {
        "accidental_reopen_likely": false,
        "all_labels": [
            "Type: Defect"
        ],
        "contains_keywords": [
            "fail",
            "chang",
            "issu",
            "CI",
            "patch",
            "perform",
            "test"
        ],
        "fix_size": 85,
        "has_labels": [],
        "intersecting": {
            "computed_score": 0.15625,
            "final_commit_size": 32,
            "intersection_size": 5,
            "previous_commits_size": 58
        },
        "is_makefile_based": true,
        "no_new_files": [],
        "no_other_files": false,
        "num_prohibited_files": 63885,
        "prohibited_files": [
            "server/src/main/java/com/genymobile/scrcpy/Device.java",
            "server/src/main/java/com/genymobile/scrcpy/wrappers/SurfaceControl.java",
            "server/src/main/java/com/genymobile/scrcpy/Device.java",
            "server/src/main/java/com/genymobile/scrcpy/wrappers/SurfaceControl.java",
            "app/meson.build",
            "app/scrcpy.1",
            "app/src/common.h",
            "app/src/scrcpy.h",
            "app/src/server.h",
            "server/src/main/java/com/genymobile/scrcpy/Workarounds.java"
        ],
        "reopen": true,
        "reopen_events": [
            [
                "2019-08-28 17:28:13+00:00",
                "commit"
            ],
            [
                "2019-08-28 21:52:09+00:00",
                "commit"
            ],
            [
                "2019-08-30 16:28:33+00:00",
                "closed"
            ],
            [
                "2019-08-30 16:28:33+00:00",
                "commit"
            ],
            [
                "2019-09-03 21:31:28+00:00",
                "reopened"
            ],
            [
                "2019-09-05 16:57:57+00:00",
                "closed"
            ],
            [
                "2019-09-05 16:57:57+00:00",
                "commit"
            ],
            [
                "2019-12-24 01:25:55+00:00",
                "commit"
            ],
            [
                "2019-12-27 18:31:43+00:00",
                "commit"
            ],
            [
                "2020-01-23 22:57:19+00:00",
                "commit"
            ],
            [
                "2020-04-28 21:32:20+00:00",
                "commit"
            ],
            [
                "2020-04-28 21:32:21+00:00",
                "commit"
            ]
        ],
        "status": false,
        "strategy": true,
        "total_changes": 159
    }
}