{
    "commits": [
        {
            "associated_pull_request": [],
            "date": "2016-11-09 14:39:23+00:00",
            "diff": "",
            "diff_additions": 0,
            "diff_deletions": 0,
            "diff_file_size": 0,
            "diff_url": "https://github.com/tats/w3m/commit/fcaef5dfc87973970a52544df5f2f5f3017da86b.diff",
            "exists": true,
            "files": [],
            "interesting": {
                "reopen": false,
                "status": false
            },
            "is_parent": true,
            "sha": "fcaef5dfc87973970a52544df5f2f5f3017da86b"
        },
        {
            "associated_pull_request": [],
            "date": "2016-11-12 13:19:12+00:00",
            "diff": "tats_w3m/issue_20/commit_f393faf55975a94217df479e1bd06ee4403c6958.diff",
            "diff_additions": 13,
            "diff_deletions": 0,
            "diff_file_size": 88590,
            "diff_url": "https://github.com/tats/w3m/commit/f393faf55975a94217df479e1bd06ee4403c6958.diff",
            "exists": true,
            "files": [
                {
                    "file_additions": 13,
                    "file_deletions": 0,
                    "file_exists": true,
                    "file_name": "table.c",
                    "file_size": 88590
                }
            ],
            "interesting": {
                "reopen": false,
                "status": false
            },
            "is_parent": false,
            "sha": "f393faf55975a94217df479e1bd06ee4403c6958"
        },
        {
            "associated_pull_request": [],
            "date": "2016-11-15 11:11:52+00:00",
            "diff": "tats_w3m/issue_20/commit_2a4a2fb9f116b50e7c80d573db06c0fdc6c69272.diff",
            "diff_additions": 14,
            "diff_deletions": 0,
            "diff_file_size": 304517,
            "diff_url": "https://github.com/tats/w3m/commit/2a4a2fb9f116b50e7c80d573db06c0fdc6c69272.diff",
            "exists": true,
            "files": [
                {
                    "file_additions": 1,
                    "file_deletions": 0,
                    "file_exists": true,
                    "file_name": "file.c",
                    "file_size": 215927
                },
                {
                    "file_additions": 13,
                    "file_deletions": 0,
                    "file_exists": true,
                    "file_name": "table.c",
                    "file_size": 88590
                }
            ],
            "interesting": {
                "reopen": true,
                "status": false
            },
            "is_parent": false,
            "sha": "2a4a2fb9f116b50e7c80d573db06c0fdc6c69272"
        },
        {
            "associated_pull_request": [],
            "date": "2016-11-15 14:54:46+00:00",
            "diff": "tats_w3m/issue_20/commit_ec99f186380d26ebf791569fdbc56dae60632365.diff",
            "diff_additions": 2,
            "diff_deletions": 0,
            "diff_file_size": 88590,
            "diff_url": "https://github.com/tats/w3m/commit/ec99f186380d26ebf791569fdbc56dae60632365.diff",
            "exists": true,
            "files": [
                {
                    "file_additions": 2,
                    "file_deletions": 0,
                    "file_exists": true,
                    "file_name": "table.c",
                    "file_size": 88590
                }
            ],
            "interesting": {
                "reopen": false,
                "status": false
            },
            "is_parent": false,
            "sha": "ec99f186380d26ebf791569fdbc56dae60632365"
        },
        {
            "associated_pull_request": [],
            "date": "2016-11-15 11:11:52+00:00",
            "diff": "tats_w3m/issue_20/commit_0a04bf8a1cb3868ace621b092d26cefdeb5ec359.diff",
            "diff_additions": 14,
            "diff_deletions": 0,
            "diff_file_size": 304517,
            "diff_url": "https://github.com/tats/w3m/commit/0a04bf8a1cb3868ace621b092d26cefdeb5ec359.diff",
            "exists": true,
            "files": [
                {
                    "file_additions": 1,
                    "file_deletions": 0,
                    "file_exists": true,
                    "file_name": "file.c",
                    "file_size": 215927
                },
                {
                    "file_additions": 13,
                    "file_deletions": 0,
                    "file_exists": true,
                    "file_name": "table.c",
                    "file_size": 88590
                }
            ],
            "interesting": {
                "reopen": false,
                "status": false
            },
            "is_parent": false,
            "sha": "0a04bf8a1cb3868ace621b092d26cefdeb5ec359"
        },
        {
            "associated_pull_request": [],
            "date": "2016-11-15 14:54:46+00:00",
            "diff": "tats_w3m/issue_20/commit_f70aecd15ac2806755f11659a3e839085ec6304c.diff",
            "diff_additions": 2,
            "diff_deletions": 0,
            "diff_file_size": 88590,
            "diff_url": "https://github.com/tats/w3m/commit/f70aecd15ac2806755f11659a3e839085ec6304c.diff",
            "exists": true,
            "files": [
                {
                    "file_additions": 2,
                    "file_deletions": 0,
                    "file_exists": true,
                    "file_name": "table.c",
                    "file_size": 88590
                }
            ],
            "interesting": {
                "reopen": false,
                "status": false
            },
            "is_parent": false,
            "sha": "f70aecd15ac2806755f11659a3e839085ec6304c"
        }
    ],
    "first_commit": "2016-11-09 14:39:23+00:00",
    "last_commit": "2016-11-19 05:47:54+00:00",
    "number": 20,
    "pull_request": "None",
    "score": {
        "accidental_reopen_likely": false,
        "all_labels": [],
        "contains_keywords": [
            "work",
            "fix",
            "issu",
            "test",
            "fault",
            "error",
            "workaround"
        ],
        "fix_size": 31,
        "has_labels": [],
        "intersecting": {
            "computed_score": 0.6666666666666666,
            "final_commit_size": 3,
            "intersection_size": 2,
            "previous_commits_size": 30
        },
        "is_makefile_based": true,
        "no_new_files": [],
        "no_other_files": false,
        "num_prohibited_files": 311106,
        "prohibited_files": [
            "server/src/main/java/com/genymobile/scrcpy/Device.java",
            "server/src/main/java/com/genymobile/scrcpy/wrappers/SurfaceControl.java",
            "server/src/main/java/com/genymobile/scrcpy/Device.java",
            "server/src/main/java/com/genymobile/scrcpy/wrappers/SurfaceControl.java",
            "app/meson.build",
            "app/scrcpy.1",
            "app/src/common.h",
            "app/src/scrcpy.h",
            "app/src/server.h",
            "server/src/main/java/com/genymobile/scrcpy/Workarounds.java"
        ],
        "reopen": true,
        "reopen_events": [
            [
                "2016-11-12 14:14:33+00:00",
                "commit"
            ],
            [
                "2016-11-12 14:15:17+00:00",
                "closed"
            ],
            [
                "2016-11-15 11:21:37+00:00",
                "commit"
            ],
            [
                "2016-11-15 14:45:20+00:00",
                "reopened"
            ],
            [
                "2016-11-15 15:09:58+00:00",
                "commit"
            ],
            [
                "2016-11-15 15:10:48+00:00",
                "closed"
            ],
            [
                "2016-12-18 15:59:54+00:00",
                "commit"
            ],
            [
                "2016-12-18 15:59:54+00:00",
                "commit"
            ]
        ],
        "status": false,
        "strategy": true,
        "total_changes": 45
    }
}