{
    "commits": [
        {
            "associated_pull_request": [
                "https://github.com/open62541/open62541/pull/732"
            ],
            "date": "2017-02-16 14:27:02+00:00",
            "diff": "open62541_open62541/issue_938/commit_3380dd43ba2e7d5031b47925ffb0a954fe667025.diff",
            "diff_additions": 445,
            "diff_deletions": 445,
            "diff_file_size": 66351,
            "diff_url": "https://github.com/open62541/open62541/commit/3380dd43ba2e7d5031b47925ffb0a954fe667025.diff",
            "exists": true,
            "files": [
                {
                    "file_additions": 7,
                    "file_deletions": 7,
                    "file_exists": false,
                    "file_name": "plugins/ua_config_standard.c",
                    "file_size": 0
                },
                {
                    "file_additions": 311,
                    "file_deletions": 311,
                    "file_exists": false,
                    "file_name": "src/server/ua_mdns.c",
                    "file_size": 0
                },
                {
                    "file_additions": 5,
                    "file_deletions": 5,
                    "file_exists": true,
                    "file_name": "src/server/ua_server.c",
                    "file_size": 33114
                },
                {
                    "file_additions": 111,
                    "file_deletions": 111,
                    "file_exists": true,
                    "file_name": "src/server/ua_services_discovery.c",
                    "file_size": 33237
                },
                {
                    "file_additions": 11,
                    "file_deletions": 11,
                    "file_exists": false,
                    "file_name": "tests/check_discovery.c",
                    "file_size": 0
                }
            ],
            "interesting": {
                "reopen": false,
                "status": false
            },
            "is_parent": true,
            "sha": "3380dd43ba2e7d5031b47925ffb0a954fe667025"
        },
        {
            "associated_pull_request": [
                "https://github.com/open62541/open62541/pull/732"
            ],
            "date": "2017-02-20 15:09:09+00:00",
            "diff": "open62541_open62541/issue_938/commit_9b00e647c892f96cec91905dd64892ff95e151a9.diff",
            "diff_additions": 291,
            "diff_deletions": 130,
            "diff_file_size": 141294,
            "diff_url": "https://github.com/open62541/open62541/commit/9b00e647c892f96cec91905dd64892ff95e151a9.diff",
            "exists": true,
            "files": [
                {
                    "file_additions": 68,
                    "file_deletions": 92,
                    "file_exists": true,
                    "file_name": "examples/discovery/client_find_servers.c",
                    "file_size": 8164
                },
                {
                    "file_additions": 3,
                    "file_deletions": 3,
                    "file_exists": true,
                    "file_name": "examples/discovery/server_lds.c",
                    "file_size": 2906
                },
                {
                    "file_additions": 178,
                    "file_deletions": 0,
                    "file_exists": true,
                    "file_name": "examples/discovery/server_multicast.c",
                    "file_size": 15080
                },
                {
                    "file_additions": 24,
                    "file_deletions": 24,
                    "file_exists": true,
                    "file_name": "examples/discovery/server_register.c",
                    "file_size": 6186
                },
                {
                    "file_additions": 14,
                    "file_deletions": 5,
                    "file_exists": true,
                    "file_name": "src/client/ua_client.c",
                    "file_size": 42607
                },
                {
                    "file_additions": 1,
                    "file_deletions": 3,
                    "file_exists": true,
                    "file_name": "src/server/ua_server.c",
                    "file_size": 33114
                },
                {
                    "file_additions": 1,
                    "file_deletions": 1,
                    "file_exists": true,
                    "file_name": "src/server/ua_services_discovery.c",
                    "file_size": 33237
                },
                {
                    "file_additions": 2,
                    "file_deletions": 2,
                    "file_exists": false,
                    "file_name": "tests/check_discovery.c",
                    "file_size": 0
                }
            ],
            "interesting": {
                "reopen": true,
                "status": false
            },
            "is_parent": false,
            "sha": "9b00e647c892f96cec91905dd64892ff95e151a9"
        },
        {
            "associated_pull_request": [
                "https://github.com/open62541/open62541/pull/732"
            ],
            "date": "2017-03-07 22:07:18+00:00",
            "diff": "open62541_open62541/issue_938/commit_d85758f84a35d6adf3e7e91f38d77e1c46bd2376.diff",
            "diff_additions": 2560,
            "diff_deletions": 502,
            "diff_file_size": 309889,
            "diff_url": "https://github.com/open62541/open62541/commit/d85758f84a35d6adf3e7e91f38d77e1c46bd2376.diff",
            "exists": true,
            "files": [
                {
                    "file_additions": 87,
                    "file_deletions": 120,
                    "file_exists": true,
                    "file_name": "examples/discovery/client_find_servers.c",
                    "file_size": 8164
                },
                {
                    "file_additions": 11,
                    "file_deletions": 3,
                    "file_exists": true,
                    "file_name": "examples/discovery/server_lds.c",
                    "file_size": 2906
                },
                {
                    "file_additions": 192,
                    "file_deletions": 0,
                    "file_exists": true,
                    "file_name": "examples/discovery/server_multicast.c",
                    "file_size": 15080
                },
                {
                    "file_additions": 43,
                    "file_deletions": 109,
                    "file_exists": true,
                    "file_name": "examples/discovery/server_register.c",
                    "file_size": 6186
                },
                {
                    "file_additions": 4,
                    "file_deletions": 0,
                    "file_exists": true,
                    "file_name": "examples/server_mainloop.c",
                    "file_size": 1087
                },
                {
                    "file_additions": 2,
                    "file_deletions": 2,
                    "file_exists": true,
                    "file_name": "examples/tutorial_datatypes.c",
                    "file_size": 5766
                },
                {
                    "file_additions": 1,
                    "file_deletions": 1,
                    "file_exists": true,
                    "file_name": "examples/tutorial_server_method.c",
                    "file_size": 7789
                },
                {
                    "file_additions": 6,
                    "file_deletions": 1,
                    "file_exists": false,
                    "file_name": "plugins/ua_config_standard.c",
                    "file_size": 0
                },
                {
                    "file_additions": 0,
                    "file_deletions": 4,
                    "file_exists": false,
                    "file_name": "plugins/ua_network_tcp.c",
                    "file_size": 0
                },
                {
                    "file_additions": 133,
                    "file_deletions": 45,
                    "file_exists": true,
                    "file_name": "src/client/ua_client.c",
                    "file_size": 42607
                },
                {
                    "file_additions": 519,
                    "file_deletions": 0,
                    "file_exists": false,
                    "file_name": "src/server/ua_mdns.c",
                    "file_size": 0
                },
                {
                    "file_additions": 128,
                    "file_deletions": 25,
                    "file_exists": true,
                    "file_name": "src/server/ua_server.c",
                    "file_size": 33114
                },
                {
                    "file_additions": 15,
                    "file_deletions": 0,
                    "file_exists": true,
                    "file_name": "src/server/ua_server_binary.c",
                    "file_size": 80511
                },
                {
                    "file_additions": 102,
                    "file_deletions": 0,
                    "file_exists": false,
                    "file_name": "src/server/ua_server_worker.c",
                    "file_size": 0
                },
                {
                    "file_additions": 419,
                    "file_deletions": 129,
                    "file_exists": true,
                    "file_name": "src/server/ua_services_discovery.c",
                    "file_size": 33237
                },
                {
                    "file_additions": 551,
                    "file_deletions": 0,
                    "file_exists": true,
                    "file_name": "src/server/ua_services_discovery_multicast.c",
                    "file_size": 34003
                },
                {
                    "file_additions": 4,
                    "file_deletions": 1,
                    "file_exists": true,
                    "file_name": "src/ua_securechannel.c",
                    "file_size": 39439
                },
                {
                    "file_additions": 343,
                    "file_deletions": 62,
                    "file_exists": false,
                    "file_name": "tests/check_discovery.c",
                    "file_size": 0
                }
            ],
            "interesting": {
                "reopen": false,
                "status": false
            },
            "is_parent": false,
            "sha": "d85758f84a35d6adf3e7e91f38d77e1c46bd2376"
        },
        {
            "associated_pull_request": [],
            "date": "2017-03-07 22:07:18+00:00",
            "diff": "open62541_open62541/issue_938/commit_14df3364305572a4df20a09adafc7f8257376496.diff",
            "diff_additions": 2560,
            "diff_deletions": 502,
            "diff_file_size": 309889,
            "diff_url": "https://github.com/open62541/open62541/commit/14df3364305572a4df20a09adafc7f8257376496.diff",
            "exists": true,
            "files": [
                {
                    "file_additions": 87,
                    "file_deletions": 120,
                    "file_exists": true,
                    "file_name": "examples/discovery/client_find_servers.c",
                    "file_size": 8164
                },
                {
                    "file_additions": 11,
                    "file_deletions": 3,
                    "file_exists": true,
                    "file_name": "examples/discovery/server_lds.c",
                    "file_size": 2906
                },
                {
                    "file_additions": 192,
                    "file_deletions": 0,
                    "file_exists": true,
                    "file_name": "examples/discovery/server_multicast.c",
                    "file_size": 15080
                },
                {
                    "file_additions": 43,
                    "file_deletions": 109,
                    "file_exists": true,
                    "file_name": "examples/discovery/server_register.c",
                    "file_size": 6186
                },
                {
                    "file_additions": 4,
                    "file_deletions": 0,
                    "file_exists": true,
                    "file_name": "examples/server_mainloop.c",
                    "file_size": 1087
                },
                {
                    "file_additions": 2,
                    "file_deletions": 2,
                    "file_exists": true,
                    "file_name": "examples/tutorial_datatypes.c",
                    "file_size": 5766
                },
                {
                    "file_additions": 1,
                    "file_deletions": 1,
                    "file_exists": true,
                    "file_name": "examples/tutorial_server_method.c",
                    "file_size": 7789
                },
                {
                    "file_additions": 6,
                    "file_deletions": 1,
                    "file_exists": false,
                    "file_name": "plugins/ua_config_standard.c",
                    "file_size": 0
                },
                {
                    "file_additions": 0,
                    "file_deletions": 4,
                    "file_exists": false,
                    "file_name": "plugins/ua_network_tcp.c",
                    "file_size": 0
                },
                {
                    "file_additions": 133,
                    "file_deletions": 45,
                    "file_exists": true,
                    "file_name": "src/client/ua_client.c",
                    "file_size": 42607
                },
                {
                    "file_additions": 519,
                    "file_deletions": 0,
                    "file_exists": false,
                    "file_name": "src/server/ua_mdns.c",
                    "file_size": 0
                },
                {
                    "file_additions": 128,
                    "file_deletions": 25,
                    "file_exists": true,
                    "file_name": "src/server/ua_server.c",
                    "file_size": 33114
                },
                {
                    "file_additions": 15,
                    "file_deletions": 0,
                    "file_exists": true,
                    "file_name": "src/server/ua_server_binary.c",
                    "file_size": 80511
                },
                {
                    "file_additions": 102,
                    "file_deletions": 0,
                    "file_exists": false,
                    "file_name": "src/server/ua_server_worker.c",
                    "file_size": 0
                },
                {
                    "file_additions": 419,
                    "file_deletions": 129,
                    "file_exists": true,
                    "file_name": "src/server/ua_services_discovery.c",
                    "file_size": 33237
                },
                {
                    "file_additions": 551,
                    "file_deletions": 0,
                    "file_exists": true,
                    "file_name": "src/server/ua_services_discovery_multicast.c",
                    "file_size": 34003
                },
                {
                    "file_additions": 4,
                    "file_deletions": 1,
                    "file_exists": true,
                    "file_name": "src/ua_securechannel.c",
                    "file_size": 39439
                },
                {
                    "file_additions": 343,
                    "file_deletions": 62,
                    "file_exists": false,
                    "file_name": "tests/check_discovery.c",
                    "file_size": 0
                }
            ],
            "interesting": {
                "reopen": false,
                "status": false
            },
            "is_parent": false,
            "sha": "14df3364305572a4df20a09adafc7f8257376496"
        },
        {
            "associated_pull_request": [],
            "date": "2018-03-26 14:33:05+00:00",
            "diff": "open62541_open62541/issue_938/commit_975f279681fe8cf68a8b2dd9c33cdc720f3b03fb.diff",
            "diff_additions": 231,
            "diff_deletions": 62,
            "diff_file_size": 196724,
            "diff_url": "https://github.com/open62541/open62541/commit/975f279681fe8cf68a8b2dd9c33cdc720f3b03fb.diff",
            "exists": true,
            "files": [
                {
                    "file_additions": 207,
                    "file_deletions": 6,
                    "file_exists": true,
                    "file_name": "examples/discovery/server_multicast.c",
                    "file_size": 15080
                },
                {
                    "file_additions": 0,
                    "file_deletions": 5,
                    "file_exists": true,
                    "file_name": "plugins/ua_config_default.c",
                    "file_size": 52950
                },
                {
                    "file_additions": 2,
                    "file_deletions": 0,
                    "file_exists": false,
                    "file_name": "plugins/ua_securitypolicy_basic128rsa15.c",
                    "file_size": 0
                },
                {
                    "file_additions": 8,
                    "file_deletions": 2,
                    "file_exists": true,
                    "file_name": "src/client/ua_client_connect.c",
                    "file_size": 90119
                },
                {
                    "file_additions": 5,
                    "file_deletions": 28,
                    "file_exists": true,
                    "file_name": "src/server/ua_server_discovery.c",
                    "file_size": 5338
                },
                {
                    "file_additions": 9,
                    "file_deletions": 21,
                    "file_exists": true,
                    "file_name": "src/server/ua_services_discovery.c",
                    "file_size": 33237
                }
            ],
            "interesting": {
                "reopen": false,
                "status": false
            },
            "is_parent": false,
            "sha": "975f279681fe8cf68a8b2dd9c33cdc720f3b03fb"
        },
        {
            "associated_pull_request": [],
            "date": "2018-03-26 14:33:05+00:00",
            "diff": "open62541_open62541/issue_938/commit_5b14c838c801d0c529ca95442fad531df7f2f8cc.diff",
            "diff_additions": 252,
            "diff_deletions": 65,
            "diff_file_size": 202910,
            "diff_url": "https://github.com/open62541/open62541/commit/5b14c838c801d0c529ca95442fad531df7f2f8cc.diff",
            "exists": true,
            "files": [
                {
                    "file_additions": 207,
                    "file_deletions": 6,
                    "file_exists": true,
                    "file_name": "examples/discovery/server_multicast.c",
                    "file_size": 15080
                },
                {
                    "file_additions": 21,
                    "file_deletions": 3,
                    "file_exists": true,
                    "file_name": "examples/discovery/server_register.c",
                    "file_size": 6186
                },
                {
                    "file_additions": 0,
                    "file_deletions": 5,
                    "file_exists": true,
                    "file_name": "plugins/ua_config_default.c",
                    "file_size": 52950
                },
                {
                    "file_additions": 2,
                    "file_deletions": 0,
                    "file_exists": false,
                    "file_name": "plugins/ua_securitypolicy_basic128rsa15.c",
                    "file_size": 0
                },
                {
                    "file_additions": 8,
                    "file_deletions": 2,
                    "file_exists": true,
                    "file_name": "src/client/ua_client_connect.c",
                    "file_size": 90119
                },
                {
                    "file_additions": 5,
                    "file_deletions": 28,
                    "file_exists": true,
                    "file_name": "src/server/ua_server_discovery.c",
                    "file_size": 5338
                },
                {
                    "file_additions": 9,
                    "file_deletions": 21,
                    "file_exists": true,
                    "file_name": "src/server/ua_services_discovery.c",
                    "file_size": 33237
                }
            ],
            "interesting": {
                "reopen": false,
                "status": false
            },
            "is_parent": false,
            "sha": "5b14c838c801d0c529ca95442fad531df7f2f8cc"
        },
        {
            "associated_pull_request": [],
            "date": "2018-03-26 14:33:05+00:00",
            "diff": "open62541_open62541/issue_938/commit_c98e107c990dc21ef9e2ac76b05ce2ef85dd2e94.diff",
            "diff_additions": 256,
            "diff_deletions": 65,
            "diff_file_size": 202910,
            "diff_url": "https://github.com/open62541/open62541/commit/c98e107c990dc21ef9e2ac76b05ce2ef85dd2e94.diff",
            "exists": true,
            "files": [
                {
                    "file_additions": 211,
                    "file_deletions": 6,
                    "file_exists": true,
                    "file_name": "examples/discovery/server_multicast.c",
                    "file_size": 15080
                },
                {
                    "file_additions": 21,
                    "file_deletions": 3,
                    "file_exists": true,
                    "file_name": "examples/discovery/server_register.c",
                    "file_size": 6186
                },
                {
                    "file_additions": 0,
                    "file_deletions": 5,
                    "file_exists": true,
                    "file_name": "plugins/ua_config_default.c",
                    "file_size": 52950
                },
                {
                    "file_additions": 2,
                    "file_deletions": 0,
                    "file_exists": false,
                    "file_name": "plugins/ua_securitypolicy_basic128rsa15.c",
                    "file_size": 0
                },
                {
                    "file_additions": 8,
                    "file_deletions": 2,
                    "file_exists": true,
                    "file_name": "src/client/ua_client_connect.c",
                    "file_size": 90119
                },
                {
                    "file_additions": 5,
                    "file_deletions": 28,
                    "file_exists": true,
                    "file_name": "src/server/ua_server_discovery.c",
                    "file_size": 5338
                },
                {
                    "file_additions": 9,
                    "file_deletions": 21,
                    "file_exists": true,
                    "file_name": "src/server/ua_services_discovery.c",
                    "file_size": 33237
                }
            ],
            "interesting": {
                "reopen": false,
                "status": false
            },
            "is_parent": false,
            "sha": "c98e107c990dc21ef9e2ac76b05ce2ef85dd2e94"
        },
        {
            "associated_pull_request": [],
            "date": "2018-03-26 14:33:05+00:00",
            "diff": "open62541_open62541/issue_938/commit_4960fd8b4777b73cb9ad73c5a1e5f52ed60a2268.diff",
            "diff_additions": 258,
            "diff_deletions": 65,
            "diff_file_size": 202910,
            "diff_url": "https://github.com/open62541/open62541/commit/4960fd8b4777b73cb9ad73c5a1e5f52ed60a2268.diff",
            "exists": true,
            "files": [
                {
                    "file_additions": 213,
                    "file_deletions": 6,
                    "file_exists": true,
                    "file_name": "examples/discovery/server_multicast.c",
                    "file_size": 15080
                },
                {
                    "file_additions": 21,
                    "file_deletions": 3,
                    "file_exists": true,
                    "file_name": "examples/discovery/server_register.c",
                    "file_size": 6186
                },
                {
                    "file_additions": 0,
                    "file_deletions": 5,
                    "file_exists": true,
                    "file_name": "plugins/ua_config_default.c",
                    "file_size": 52950
                },
                {
                    "file_additions": 2,
                    "file_deletions": 0,
                    "file_exists": false,
                    "file_name": "plugins/ua_securitypolicy_basic128rsa15.c",
                    "file_size": 0
                },
                {
                    "file_additions": 8,
                    "file_deletions": 2,
                    "file_exists": true,
                    "file_name": "src/client/ua_client_connect.c",
                    "file_size": 90119
                },
                {
                    "file_additions": 5,
                    "file_deletions": 28,
                    "file_exists": true,
                    "file_name": "src/server/ua_server_discovery.c",
                    "file_size": 5338
                },
                {
                    "file_additions": 9,
                    "file_deletions": 21,
                    "file_exists": true,
                    "file_name": "src/server/ua_services_discovery.c",
                    "file_size": 33237
                }
            ],
            "interesting": {
                "reopen": false,
                "status": false
            },
            "is_parent": false,
            "sha": "4960fd8b4777b73cb9ad73c5a1e5f52ed60a2268"
        },
        {
            "associated_pull_request": [],
            "date": "2018-03-26 14:33:05+00:00",
            "diff": "open62541_open62541/issue_938/commit_3f21b88497a8b401364fdb27e6be2aecaebbbc71.diff",
            "diff_additions": 286,
            "diff_deletions": 75,
            "diff_file_size": 227151,
            "diff_url": "https://github.com/open62541/open62541/commit/3f21b88497a8b401364fdb27e6be2aecaebbbc71.diff",
            "exists": true,
            "files": [
                {
                    "file_additions": 213,
                    "file_deletions": 6,
                    "file_exists": true,
                    "file_name": "examples/discovery/server_multicast.c",
                    "file_size": 15080
                },
                {
                    "file_additions": 21,
                    "file_deletions": 3,
                    "file_exists": true,
                    "file_name": "examples/discovery/server_register.c",
                    "file_size": 6186
                },
                {
                    "file_additions": 0,
                    "file_deletions": 5,
                    "file_exists": true,
                    "file_name": "plugins/ua_config_default.c",
                    "file_size": 52950
                },
                {
                    "file_additions": 2,
                    "file_deletions": 0,
                    "file_exists": false,
                    "file_name": "plugins/ua_securitypolicy_basic128rsa15.c",
                    "file_size": 0
                },
                {
                    "file_additions": 8,
                    "file_deletions": 2,
                    "file_exists": true,
                    "file_name": "src/client/ua_client_connect.c",
                    "file_size": 90119
                },
                {
                    "file_additions": 5,
                    "file_deletions": 28,
                    "file_exists": true,
                    "file_name": "src/server/ua_server_discovery.c",
                    "file_size": 5338
                },
                {
                    "file_additions": 9,
                    "file_deletions": 21,
                    "file_exists": true,
                    "file_name": "src/server/ua_services_discovery.c",
                    "file_size": 33237
                },
                {
                    "file_additions": 28,
                    "file_deletions": 10,
                    "file_exists": true,
                    "file_name": "tests/server/check_discovery.c",
                    "file_size": 24241
                }
            ],
            "interesting": {
                "reopen": false,
                "status": false
            },
            "is_parent": false,
            "sha": "3f21b88497a8b401364fdb27e6be2aecaebbbc71"
        },
        {
            "associated_pull_request": [],
            "date": "2018-03-26 14:33:05+00:00",
            "diff": "open62541_open62541/issue_938/commit_1f4060f58a69d0673be2cb721b1efe45fc1b1aaf.diff",
            "diff_additions": 293,
            "diff_deletions": 77,
            "diff_file_size": 227151,
            "diff_url": "https://github.com/open62541/open62541/commit/1f4060f58a69d0673be2cb721b1efe45fc1b1aaf.diff",
            "exists": true,
            "files": [
                {
                    "file_additions": 213,
                    "file_deletions": 6,
                    "file_exists": true,
                    "file_name": "examples/discovery/server_multicast.c",
                    "file_size": 15080
                },
                {
                    "file_additions": 21,
                    "file_deletions": 3,
                    "file_exists": true,
                    "file_name": "examples/discovery/server_register.c",
                    "file_size": 6186
                },
                {
                    "file_additions": 0,
                    "file_deletions": 5,
                    "file_exists": true,
                    "file_name": "plugins/ua_config_default.c",
                    "file_size": 52950
                },
                {
                    "file_additions": 2,
                    "file_deletions": 0,
                    "file_exists": false,
                    "file_name": "plugins/ua_securitypolicy_basic128rsa15.c",
                    "file_size": 0
                },
                {
                    "file_additions": 8,
                    "file_deletions": 2,
                    "file_exists": true,
                    "file_name": "src/client/ua_client_connect.c",
                    "file_size": 90119
                },
                {
                    "file_additions": 5,
                    "file_deletions": 28,
                    "file_exists": true,
                    "file_name": "src/server/ua_server_discovery.c",
                    "file_size": 5338
                },
                {
                    "file_additions": 9,
                    "file_deletions": 21,
                    "file_exists": true,
                    "file_name": "src/server/ua_services_discovery.c",
                    "file_size": 33237
                },
                {
                    "file_additions": 35,
                    "file_deletions": 12,
                    "file_exists": true,
                    "file_name": "tests/server/check_discovery.c",
                    "file_size": 24241
                }
            ],
            "interesting": {
                "reopen": false,
                "status": false
            },
            "is_parent": false,
            "sha": "1f4060f58a69d0673be2cb721b1efe45fc1b1aaf"
        },
        {
            "associated_pull_request": [],
            "date": "2018-03-26 14:33:05+00:00",
            "diff": "open62541_open62541/issue_938/commit_024ecdd33fd32f95f235247d08e1b49a5b9c1571.diff",
            "diff_additions": 290,
            "diff_deletions": 79,
            "diff_file_size": 227151,
            "diff_url": "https://github.com/open62541/open62541/commit/024ecdd33fd32f95f235247d08e1b49a5b9c1571.diff",
            "exists": true,
            "files": [
                {
                    "file_additions": 213,
                    "file_deletions": 6,
                    "file_exists": true,
                    "file_name": "examples/discovery/server_multicast.c",
                    "file_size": 15080
                },
                {
                    "file_additions": 21,
                    "file_deletions": 3,
                    "file_exists": true,
                    "file_name": "examples/discovery/server_register.c",
                    "file_size": 6186
                },
                {
                    "file_additions": 0,
                    "file_deletions": 5,
                    "file_exists": true,
                    "file_name": "plugins/ua_config_default.c",
                    "file_size": 52950
                },
                {
                    "file_additions": 2,
                    "file_deletions": 0,
                    "file_exists": false,
                    "file_name": "plugins/ua_securitypolicy_basic128rsa15.c",
                    "file_size": 0
                },
                {
                    "file_additions": 8,
                    "file_deletions": 2,
                    "file_exists": true,
                    "file_name": "src/client/ua_client_connect.c",
                    "file_size": 90119
                },
                {
                    "file_additions": 5,
                    "file_deletions": 30,
                    "file_exists": true,
                    "file_name": "src/server/ua_server_discovery.c",
                    "file_size": 5338
                },
                {
                    "file_additions": 9,
                    "file_deletions": 21,
                    "file_exists": true,
                    "file_name": "src/server/ua_services_discovery.c",
                    "file_size": 33237
                },
                {
                    "file_additions": 32,
                    "file_deletions": 12,
                    "file_exists": true,
                    "file_name": "tests/server/check_discovery.c",
                    "file_size": 24241
                }
            ],
            "interesting": {
                "reopen": false,
                "status": false
            },
            "is_parent": false,
            "sha": "024ecdd33fd32f95f235247d08e1b49a5b9c1571"
        },
        {
            "associated_pull_request": [],
            "date": "2018-03-26 14:33:05+00:00",
            "diff": "open62541_open62541/issue_938/commit_7a20cfc930419d3df9735f325c35dd2b0160a055.diff",
            "diff_additions": 290,
            "diff_deletions": 79,
            "diff_file_size": 227151,
            "diff_url": "https://github.com/open62541/open62541/commit/7a20cfc930419d3df9735f325c35dd2b0160a055.diff",
            "exists": true,
            "files": [
                {
                    "file_additions": 213,
                    "file_deletions": 6,
                    "file_exists": true,
                    "file_name": "examples/discovery/server_multicast.c",
                    "file_size": 15080
                },
                {
                    "file_additions": 21,
                    "file_deletions": 3,
                    "file_exists": true,
                    "file_name": "examples/discovery/server_register.c",
                    "file_size": 6186
                },
                {
                    "file_additions": 0,
                    "file_deletions": 5,
                    "file_exists": true,
                    "file_name": "plugins/ua_config_default.c",
                    "file_size": 52950
                },
                {
                    "file_additions": 2,
                    "file_deletions": 0,
                    "file_exists": false,
                    "file_name": "plugins/ua_securitypolicy_basic128rsa15.c",
                    "file_size": 0
                },
                {
                    "file_additions": 8,
                    "file_deletions": 2,
                    "file_exists": true,
                    "file_name": "src/client/ua_client_connect.c",
                    "file_size": 90119
                },
                {
                    "file_additions": 5,
                    "file_deletions": 30,
                    "file_exists": true,
                    "file_name": "src/server/ua_server_discovery.c",
                    "file_size": 5338
                },
                {
                    "file_additions": 9,
                    "file_deletions": 21,
                    "file_exists": true,
                    "file_name": "src/server/ua_services_discovery.c",
                    "file_size": 33237
                },
                {
                    "file_additions": 32,
                    "file_deletions": 12,
                    "file_exists": true,
                    "file_name": "tests/server/check_discovery.c",
                    "file_size": 24241
                }
            ],
            "interesting": {
                "reopen": false,
                "status": false
            },
            "is_parent": false,
            "sha": "7a20cfc930419d3df9735f325c35dd2b0160a055"
        },
        {
            "associated_pull_request": [
                "https://github.com/open62541/open62541/pull/1689"
            ],
            "date": "2018-03-26 14:33:05+00:00",
            "diff": "open62541_open62541/issue_938/commit_e512b40badda52af13bc3f3c18ff3e72484b3b36.diff",
            "diff_additions": 318,
            "diff_deletions": 78,
            "diff_file_size": 228367,
            "diff_url": "https://github.com/open62541/open62541/commit/e512b40badda52af13bc3f3c18ff3e72484b3b36.diff",
            "exists": true,
            "files": [
                {
                    "file_additions": 202,
                    "file_deletions": 6,
                    "file_exists": true,
                    "file_name": "examples/discovery/server_multicast.c",
                    "file_size": 15080
                },
                {
                    "file_additions": 9,
                    "file_deletions": 2,
                    "file_exists": true,
                    "file_name": "examples/discovery/server_register.c",
                    "file_size": 6186
                },
                {
                    "file_additions": 0,
                    "file_deletions": 5,
                    "file_exists": true,
                    "file_name": "plugins/ua_config_default.c",
                    "file_size": 52950
                },
                {
                    "file_additions": 28,
                    "file_deletions": 10,
                    "file_exists": false,
                    "file_name": "plugins/ua_network_tcp.c",
                    "file_size": 0
                },
                {
                    "file_additions": 2,
                    "file_deletions": 0,
                    "file_exists": false,
                    "file_name": "plugins/ua_securitypolicy_basic128rsa15.c",
                    "file_size": 0
                },
                {
                    "file_additions": 8,
                    "file_deletions": 2,
                    "file_exists": true,
                    "file_name": "src/client/ua_client_connect.c",
                    "file_size": 90119
                },
                {
                    "file_additions": 5,
                    "file_deletions": 30,
                    "file_exists": true,
                    "file_name": "src/server/ua_server_discovery.c",
                    "file_size": 5338
                },
                {
                    "file_additions": 28,
                    "file_deletions": 11,
                    "file_exists": true,
                    "file_name": "src/server/ua_services_discovery.c",
                    "file_size": 33237
                },
                {
                    "file_additions": 30,
                    "file_deletions": 12,
                    "file_exists": true,
                    "file_name": "tests/server/check_discovery.c",
                    "file_size": 24241
                },
                {
                    "file_additions": 6,
                    "file_deletions": 0,
                    "file_exists": true,
                    "file_name": "tests/testing-plugins/testing_clock.c",
                    "file_size": 1216
                }
            ],
            "interesting": {
                "reopen": false,
                "status": false
            },
            "is_parent": false,
            "sha": "e512b40badda52af13bc3f3c18ff3e72484b3b36"
        },
        {
            "associated_pull_request": [
                "https://github.com/open62541/open62541/pull/1689"
            ],
            "date": "2018-03-26 14:33:05+00:00",
            "diff": "open62541_open62541/issue_938/commit_dd9696dede3139cb15ad8066364a00936497b0a0.diff",
            "diff_additions": 318,
            "diff_deletions": 78,
            "diff_file_size": 228367,
            "diff_url": "https://github.com/open62541/open62541/commit/dd9696dede3139cb15ad8066364a00936497b0a0.diff",
            "exists": true,
            "files": [
                {
                    "file_additions": 202,
                    "file_deletions": 6,
                    "file_exists": true,
                    "file_name": "examples/discovery/server_multicast.c",
                    "file_size": 15080
                },
                {
                    "file_additions": 9,
                    "file_deletions": 2,
                    "file_exists": true,
                    "file_name": "examples/discovery/server_register.c",
                    "file_size": 6186
                },
                {
                    "file_additions": 0,
                    "file_deletions": 5,
                    "file_exists": true,
                    "file_name": "plugins/ua_config_default.c",
                    "file_size": 52950
                },
                {
                    "file_additions": 28,
                    "file_deletions": 10,
                    "file_exists": false,
                    "file_name": "plugins/ua_network_tcp.c",
                    "file_size": 0
                },
                {
                    "file_additions": 2,
                    "file_deletions": 0,
                    "file_exists": false,
                    "file_name": "plugins/ua_securitypolicy_basic128rsa15.c",
                    "file_size": 0
                },
                {
                    "file_additions": 8,
                    "file_deletions": 2,
                    "file_exists": true,
                    "file_name": "src/client/ua_client_connect.c",
                    "file_size": 90119
                },
                {
                    "file_additions": 5,
                    "file_deletions": 30,
                    "file_exists": true,
                    "file_name": "src/server/ua_server_discovery.c",
                    "file_size": 5338
                },
                {
                    "file_additions": 28,
                    "file_deletions": 11,
                    "file_exists": true,
                    "file_name": "src/server/ua_services_discovery.c",
                    "file_size": 33237
                },
                {
                    "file_additions": 30,
                    "file_deletions": 12,
                    "file_exists": true,
                    "file_name": "tests/server/check_discovery.c",
                    "file_size": 24241
                },
                {
                    "file_additions": 6,
                    "file_deletions": 0,
                    "file_exists": true,
                    "file_name": "tests/testing-plugins/testing_clock.c",
                    "file_size": 1216
                }
            ],
            "interesting": {
                "reopen": false,
                "status": false
            },
            "is_parent": false,
            "sha": "dd9696dede3139cb15ad8066364a00936497b0a0"
        }
    ],
    "first_commit": "2017-02-16 14:27:02+00:00",
    "last_commit": "2018-03-28 21:41:09+00:00",
    "number": 938,
    "pull_request": "None",
    "score": {
        "accidental_reopen_likely": false,
        "all_labels": [],
        "contains_keywords": [
            "work",
            "fail",
            "chang",
            "fix",
            "issu",
            "perform",
            "test",
            "fault",
            "leak",
            "remov",
            "warn",
            "bug",
            "error",
            "problem",
            "crash"
        ],
        "fix_size": 2087,
        "has_labels": [],
        "intersecting": {
            "computed_score": 1.0,
            "final_commit_size": 383,
            "intersection_size": 383,
            "previous_commits_size": 2087
        },
        "is_makefile_based": true,
        "no_new_files": [],
        "no_other_files": false,
        "num_prohibited_files": 593544,
        "prohibited_files": [
            "server/src/main/java/com/genymobile/scrcpy/Device.java",
            "server/src/main/java/com/genymobile/scrcpy/wrappers/SurfaceControl.java",
            "server/src/main/java/com/genymobile/scrcpy/Device.java",
            "server/src/main/java/com/genymobile/scrcpy/wrappers/SurfaceControl.java",
            "app/meson.build",
            "app/scrcpy.1",
            "app/src/common.h",
            "app/src/scrcpy.h",
            "app/src/server.h",
            "server/src/main/java/com/genymobile/scrcpy/Workarounds.java"
        ],
        "reopen": true,
        "reopen_events": [
            [
                "2017-02-20 15:09:31+00:00",
                "commit"
            ],
            [
                "2017-02-20 15:15:36+00:00",
                "closed"
            ],
            [
                "2017-03-07 15:51:47+00:00",
                "reopened"
            ],
            [
                "2017-03-07 22:07:20+00:00",
                "commit"
            ],
            [
                "2017-03-07 22:11:09+00:00",
                "commit"
            ],
            [
                "2018-03-26 14:33:16+00:00",
                "commit"
            ],
            [
                "2018-03-26 14:58:27+00:00",
                "commit"
            ],
            [
                "2018-03-26 15:31:21+00:00",
                "commit"
            ],
            [
                "2018-03-27 05:53:34+00:00",
                "commit"
            ],
            [
                "2018-03-27 20:35:22+00:00",
                "commit"
            ],
            [
                "2018-03-28 04:50:15+00:00",
                "commit"
            ],
            [
                "2018-03-28 12:44:17+00:00",
                "commit"
            ],
            [
                "2018-03-28 12:45:40+00:00",
                "commit"
            ],
            [
                "2018-03-28 14:54:31+00:00",
                "commit"
            ],
            [
                "2018-03-28 21:41:11+00:00",
                "closed"
            ],
            [
                "2018-03-28 21:41:15+00:00",
                "commit"
            ]
        ],
        "status": false,
        "strategy": true,
        "total_changes": 10950
    }
}