{
    "covered_issues": [
        3489,
        3485,
        3483,
        3480,
        3475,
        3473,
        3471,
        3467,
        3466,
        3465,
        3463,
        3462,
        3458,
        3456,
        3454,
        3451,
        3445,
        3443,
        3440,
        3438,
        3436,
        3430,
        3417,
        3398,
        3388,
        3387,
        3384,
        3382,
        3381,
        3374,
        3372,
        3369,
        3367,
        3364,
        3361,
        3360,
        3358,
        3348,
        3341,
        3333,
        3330,
        3329,
        3328,
        3326,
        3324,
        3323,
        3322,
        3321,
        3319,
        3318,
        3317,
        3315,
        3314,
        3308,
        3307,
        3306,
        3304,
        3302,
        3301,
        3300,
        3299,
        3298,
        3297,
        3296,
        3295,
        3294,
        3293,
        3292,
        3291,
        3290,
        3288,
        3283,
        3282,
        3280,
        3279,
        3278,
        3276,
        3275,
        3274,
        3273,
        3272,
        3270,
        3269,
        3268,
        3267,
        3266,
        3264,
        3261,
        3260,
        3259,
        3257,
        3256,
        3255,
        3254,
        3252,
        3250,
        3248,
        3247,
        3246,
        3245,
        3244,
        3243,
        3242,
        3241,
        3240,
        3239,
        3238,
        3236,
        3234,
        3233,
        3232,
        3231,
        3230,
        3229,
        3228,
        3227,
        3226,
        3225,
        3224,
        3222,
        3221,
        3220,
        3219,
        3218,
        3217,
        3215,
        3214,
        3213,
        3210,
        3209,
        3200,
        3199,
        3197,
        3177,
        3175,
        3172,
        3170,
        3164,
        3162,
        3161,
        3157,
        3155,
        3154,
        3153,
        3152,
        3150,
        3149,
        3148,
        3143,
        3142,
        3138,
        3134,
        3132,
        3131,
        3130,
        3129,
        3127,
        3125,
        3122,
        3117,
        3112,
        3107,
        3103,
        3098,
        3093,
        3092,
        3091,
        3086,
        3084,
        3082,
        3081,
        3080,
        3077,
        3074,
        3073,
        3072,
        3071,
        3066,
        3059,
        3058,
        3056,
        3055,
        3054,
        3053,
        3052,
        3048,
        3047,
        3044,
        3042,
        3041,
        3038,
        3037,
        3036,
        3035,
        3034,
        3030,
        3029,
        3025,
        3023,
        3021,
        3020,
        3019,
        3016,
        3011,
        3008,
        3007,
        3006,
        3004,
        3003,
        3002,
        3001,
        2999,
        2998,
        2997,
        2994,
        2990,
        2989,
        2988,
        2983,
        2974,
        2973,
        2971,
        2970,
        2969,
        2968,
        2964,
        2963,
        2962,
        2961,
        2960,
        2959,
        2958,
        2957,
        2956,
        2955,
        2954,
        2953,
        2952,
        2951,
        2950,
        2949,
        2948,
        2947,
        2946,
        2945,
        2943,
        2942,
        2939,
        2935,
        2933,
        2931,
        2930,
        2929,
        2927,
        2926,
        2925,
        2923,
        2911,
        2907,
        2905,
        2903,
        2902,
        2901,
        2900,
        2896,
        2894,
        2893,
        2892,
        2891,
        2890,
        2888,
        2882,
        2881,
        2880,
        2875,
        2871,
        2870,
        2869,
        2868,
        2867,
        2866,
        2865,
        2861,
        2860,
        2857,
        2856,
        2855,
        2854,
        2851,
        2850,
        2849,
        2848,
        2847,
        2846,
        2845,
        2837,
        2834,
        2833,
        2832,
        2830,
        2829,
        2828,
        2827,
        2826,
        2825,
        2824,
        2821,
        2820,
        2809,
        2808,
        2800,
        2799,
        2782,
        2778,
        2773,
        2763,
        2753,
        2752,
        2750,
        2749,
        2747,
        2745,
        2744,
        2743,
        2736,
        2728,
        2724,
        2721,
        2714,
        2712,
        2708,
        2706,
        2705,
        2698,
        2696,
        2694,
        2693,
        2685,
        2684,
        2681,
        2680,
        2679,
        2676,
        2674,
        2673,
        2661,
        2660,
        2659,
        2658,
        2657,
        2653,
        2647,
        2646,
        2645,
        2643,
        2638,
        2637,
        2633,
        2631,
        2628,
        2625,
        2624,
        2623,
        2622,
        2621,
        2620,
        2619,
        2618,
        2617,
        2614,
        2613,
        2612,
        2611,
        2610,
        2608,
        2605,
        2602,
        2601,
        2598,
        2597,
        2596,
        2594,
        2587,
        2585,
        2583,
        2581,
        2576,
        2574,
        2570,
        2569,
        2568,
        2567,
        2564,
        2563,
        2562,
        2561,
        2560,
        2559,
        2558,
        2555,
        2553,
        2552,
        2551,
        2549,
        2541,
        2540,
        2538,
        2536,
        2535,
        2534,
        2530,
        2529,
        2528,
        2527,
        2526,
        2525,
        2524,
        2523,
        2521,
        2519,
        2518,
        2517,
        2516,
        2512,
        2503,
        2496,
        2494,
        2492,
        2488,
        2486,
        2485,
        2484,
        2481,
        2478,
        2476,
        2475,
        2474,
        2470,
        2469,
        2468,
        2464,
        2463,
        2460,
        2459,
        2458,
        2457,
        2456,
        2452,
        2451,
        2446,
        2444,
        2443,
        2442,
        2437,
        2435,
        2433,
        2432,
        2431,
        2430,
        2424,
        2422,
        2421,
        2419,
        2418,
        2415,
        2414,
        2413,
        2411,
        2409,
        2407,
        2405,
        2404,
        2400,
        2399,
        2398,
        2396,
        2394,
        2390,
        2384,
        2383,
        2382,
        2380,
        2379,
        2377,
        2376,
        2373,
        2370,
        2366,
        2365,
        2361,
        2358,
        2354,
        2350,
        2349,
        2342,
        2340,
        2338,
        2334,
        2331,
        2322,
        2321,
        2319,
        2317,
        2316,
        2315,
        2313,
        2312,
        2311,
        2310,
        2309,
        2308,
        2306,
        2305,
        2300,
        2298,
        2296,
        2295,
        2292,
        2290,
        2289,
        2288,
        2287,
        2286,
        2285,
        2283,
        2282,
        2281,
        2278,
        2277,
        2273,
        2271,
        2270,
        2269,
        2267,
        2266,
        2257,
        2256,
        2255,
        2254,
        2253,
        2250,
        2248,
        2241,
        2236,
        2235,
        2234,
        2231,
        2229,
        2214,
        2213,
        2210,
        2207,
        2206,
        2205,
        2204,
        2201,
        2200,
        2199,
        2198,
        2197,
        2194,
        2193,
        2189,
        2187,
        2186,
        2185,
        2181,
        2179,
        2178,
        2177,
        2176,
        2175,
        2174,
        2173,
        2169,
        2168,
        2165,
        2164,
        2163,
        2161,
        2160,
        2158,
        2157,
        2153,
        2152,
        2151,
        2150,
        2149,
        2148,
        2147,
        2145,
        2142,
        2141,
        2140,
        2138,
        2132,
        2131,
        2129,
        2128,
        2125,
        2121,
        2119,
        2116,
        2114,
        2110,
        2106,
        2105,
        2103,
        2102,
        2101,
        2100,
        2099,
        2098,
        2097,
        2096,
        2095,
        2094,
        2093,
        2092,
        2091,
        2089,
        2088,
        2086,
        2085,
        2083,
        2080,
        2079,
        2078,
        2076,
        2075,
        2074,
        2073,
        2071,
        2069,
        2067,
        2066,
        2065,
        2064,
        2062,
        2061,
        2059,
        2058,
        2055,
        2054,
        2053,
        2051,
        2049,
        2047,
        2044,
        2042,
        2041,
        2040,
        2035,
        2034,
        2033,
        2031,
        2030,
        2029,
        2028,
        2027,
        2025,
        2019,
        2018,
        2016,
        2015,
        2013,
        2012,
        2011,
        2008,
        2006,
        2005,
        2003,
        2002,
        2000,
        1999,
        1997,
        1996,
        1995,
        1994,
        1993,
        1991,
        1990,
        1989,
        1988,
        1987,
        1985,
        1984,
        1982,
        1979,
        1977,
        1976,
        1975,
        1973,
        1971,
        1970,
        1967,
        1966,
        1965,
        1964,
        1963,
        1962,
        1960,
        1957,
        1956,
        1953,
        1952,
        1950,
        1948,
        1947,
        1945,
        1944,
        1943,
        1942,
        1941,
        1940,
        1939,
        1935,
        1934,
        1933,
        1931,
        1930,
        1929,
        1928,
        1926,
        1924,
        1922,
        1921,
        1919,
        1918,
        1917,
        1915,
        1914,
        1913,
        1909,
        1908,
        1901,
        1900,
        1899,
        1898,
        1897,
        1895,
        1894,
        1893,
        1891,
        1889,
        1888,
        1887,
        1886,
        1885,
        1884,
        1883,
        1882,
        1881,
        1880,
        1879,
        1878,
        1877,
        1876,
        1874,
        1872,
        1870,
        1865,
        1864,
        1863,
        1860,
        1859,
        1856,
        1852,
        1850,
        1849,
        1846,
        1845,
        1844,
        1843,
        1842,
        1841,
        1840,
        1839,
        1838,
        1837,
        1836,
        1835,
        1834,
        1833,
        1832,
        1830,
        1829,
        1828,
        1827,
        1826,
        1825,
        1824,
        1823,
        1822,
        1821,
        1820,
        1819,
        1818,
        1817,
        1816,
        1815,
        1814,
        1813,
        1812,
        1811,
        1808,
        1807,
        1806,
        1805,
        1804,
        1803,
        1802,
        1799,
        1798,
        1797,
        1791,
        1787,
        1786,
        1785,
        1784,
        1782,
        1779,
        1776,
        1775,
        1774,
        1773,
        1772,
        1767,
        1766,
        1764,
        1763,
        2225,
        1762,
        1761,
        1756,
        1755,
        1753,
        1752,
        1751,
        1744,
        1741,
        1738,
        1736,
        1734,
        1731,
        1729,
        1728,
        1718,
        1716,
        1715,
        1713,
        1712,
        1709,
        1708,
        1707,
        1706,
        1705,
        1704,
        1701,
        1698,
        1696,
        1695,
        1694,
        1693,
        1692,
        1689,
        1688,
        1687,
        1686,
        1685,
        1681,
        1677,
        1676,
        1674,
        1673,
        1670,
        1667,
        1666,
        1665,
        1662,
        1658,
        1657,
        1656,
        1652,
        1643,
        1642,
        1641,
        1640,
        1639,
        1638,
        1637,
        1636,
        1635,
        1633,
        1628,
        1627,
        1626,
        1623,
        1622,
        1621,
        1619,
        1618,
        1617,
        1616,
        1613,
        1612,
        1611,
        1610,
        1609,
        1607,
        1606,
        1605,
        1604,
        1602,
        1600,
        1598,
        1596,
        1594,
        1592,
        1591,
        1586,
        1585,
        1584,
        1583,
        1579,
        1578,
        1577,
        1576,
        1575,
        1574,
        1573,
        1572,
        1571,
        1570,
        1569,
        1568,
        1567,
        1566,
        1564,
        1563,
        1562,
        1561,
        1560,
        1559,
        1557,
        1556,
        1555,
        1552,
        1551,
        1549,
        1548,
        1547,
        1546,
        1544,
        1543,
        1542,
        1541,
        1540,
        1538,
        1537,
        1536,
        1535,
        1534,
        1531,
        1530,
        1527,
        1525,
        1524,
        1522,
        1521,
        1520,
        1519,
        1517,
        1516,
        1511,
        1510,
        1504,
        1500,
        1497,
        1496,
        1494,
        1493,
        1490,
        1489,
        1488,
        1487,
        1484,
        1483,
        1482,
        1481,
        1480,
        1479,
        1478,
        1477,
        1469,
        1464,
        1463,
        1461,
        1459,
        1454,
        1453,
        1451,
        1450,
        1448,
        1447,
        1445,
        1443,
        1442,
        1441,
        1439,
        1438,
        1437,
        1436,
        1435,
        1434,
        1433,
        1432,
        1430,
        1426,
        1425,
        1423,
        1422,
        1419,
        1416,
        1414,
        1413,
        1412,
        1411,
        1409,
        1408,
        1406,
        1403,
        1402,
        1401,
        1400,
        1399,
        1398,
        1396,
        1394,
        1393,
        1389,
        1388,
        1387,
        1386,
        1384,
        1383,
        1380,
        1377,
        1373,
        1372,
        1370,
        1369,
        1367,
        1364,
        1362,
        1358,
        1355,
        1353,
        1351,
        1350,
        1349,
        1347,
        1345,
        1344,
        1343,
        1339,
        1338,
        1337,
        1336,
        1332,
        1331,
        1329,
        1326,
        1324,
        1322,
        1321,
        1313,
        1312,
        1310,
        1309,
        1308,
        1303,
        1295,
        1294,
        1290,
        1284,
        1277,
        1276,
        1269,
        1266,
        1265,
        1263,
        1261,
        1259,
        1250,
        1240,
        1239,
        1238,
        1230,
        1229,
        1227,
        1225,
        1218,
        1213,
        1212,
        1211,
        1193,
        1186,
        1184,
        1179,
        1170,
        1168,
        1167,
        1166,
        1161,
        1159,
        1158,
        1157,
        1156,
        1149,
        1146,
        1144,
        1142,
        1141,
        1140,
        1138,
        1137,
        1136,
        1132,
        1131,
        1126,
        1124,
        1120,
        1118,
        1113,
        1109,
        1108,
        1107,
        1104,
        1103,
        1101,
        1099,
        1097,
        1095,
        1079,
        1073,
        1071,
        1070,
        1069,
        1065,
        1059,
        1057,
        1056,
        1051,
        1050,
        1049,
        1043,
        1042,
        1041,
        1040,
        1024,
        1020,
        1019,
        1018,
        1016,
        1015,
        1013,
        1011,
        1009,
        989,
        986,
        984,
        982,
        977,
        972,
        968,
        957,
        922,
        916,
        915,
        901,
        895,
        892,
        889,
        888,
        886,
        884,
        879,
        868,
        867,
        866,
        861,
        857,
        854,
        853,
        851,
        842,
        841,
        837,
        836,
        826,
        821,
        820,
        809,
        808,
        779,
        773,
        767,
        765,
        763,
        762,
        757,
        753,
        750,
        738,
        717,
        716,
        709,
        694,
        687,
        686,
        680,
        676,
        672,
        654,
        624,
        613,
        606,
        603,
        598,
        594,
        575,
        544,
        512,
        493,
        408,
        391,
        379,
        378,
        376,
        299,
        284,
        283,
        272,
        261,
        252,
        246,
        220,
        214,
        198,
        179,
        161,
        157,
        131,
        103,
        99,
        98,
        97,
        81,
        40,
        26,
        25,
        2
    ],
    "finished": true
}