{
    "commits": [
        {
            "associated_pull_request": [],
            "date": "2020-04-20 03:20:12+00:00",
            "diff": "joncampbell123_dosbox-x/issue_1483/commit_a14533b3d8a73b7e7f3e3e2b83160758e11380b1.diff",
            "diff_additions": 2,
            "diff_deletions": 4,
            "diff_file_size": 13635,
            "diff_url": "https://github.com/joncampbell123/dosbox-x/commit/a14533b3d8a73b7e7f3e3e2b83160758e11380b1.diff",
            "exists": true,
            "files": [
                {
                    "file_additions": 2,
                    "file_deletions": 4,
                    "file_exists": true,
                    "file_name": "src/hardware/tandy_sound.cpp",
                    "file_size": 13635
                }
            ],
            "interesting": {
                "reopen": false,
                "status": false
            },
            "is_parent": true,
            "sha": "a14533b3d8a73b7e7f3e3e2b83160758e11380b1"
        },
        {
            "associated_pull_request": [],
            "date": "2020-04-21 08:33:50+00:00",
            "diff": "joncampbell123_dosbox-x/issue_1483/commit_06da77003a5ea7e19ccee3a009812787149d0635.diff",
            "diff_additions": 310,
            "diff_deletions": 97,
            "diff_file_size": 1967208,
            "diff_url": "https://github.com/joncampbell123/dosbox-x/commit/06da77003a5ea7e19ccee3a009812787149d0635.diff",
            "exists": true,
            "files": [
                {
                    "file_additions": 1,
                    "file_deletions": 1,
                    "file_exists": true,
                    "file_name": "src/debug/debug_win32.cpp",
                    "file_size": 2824
                },
                {
                    "file_additions": 8,
                    "file_deletions": 2,
                    "file_exists": true,
                    "file_name": "src/dos/dos_misc.cpp",
                    "file_size": 27320
                },
                {
                    "file_additions": 36,
                    "file_deletions": 29,
                    "file_exists": true,
                    "file_name": "src/dos/dos_programs.cpp",
                    "file_size": 399921
                },
                {
                    "file_additions": 2,
                    "file_deletions": 7,
                    "file_exists": true,
                    "file_name": "src/dosbox.cpp",
                    "file_size": 302936
                },
                {
                    "file_additions": 2,
                    "file_deletions": 2,
                    "file_exists": true,
                    "file_name": "src/gui/sdl_gui.cpp",
                    "file_size": 150171
                },
                {
                    "file_additions": 134,
                    "file_deletions": 31,
                    "file_exists": true,
                    "file_name": "src/gui/sdlmain.cpp",
                    "file_size": 383866
                },
                {
                    "file_additions": 2,
                    "file_deletions": 2,
                    "file_exists": true,
                    "file_name": "src/hardware/ide.cpp",
                    "file_size": 193373
                },
                {
                    "file_additions": 71,
                    "file_deletions": 0,
                    "file_exists": true,
                    "file_name": "src/ints/mouse.cpp",
                    "file_size": 91548
                },
                {
                    "file_additions": 7,
                    "file_deletions": 7,
                    "file_exists": true,
                    "file_name": "src/misc/programs.cpp",
                    "file_size": 90817
                },
                {
                    "file_additions": 3,
                    "file_deletions": 0,
                    "file_exists": true,
                    "file_name": "src/shell/shell.cpp",
                    "file_size": 96847
                },
                {
                    "file_additions": 37,
                    "file_deletions": 13,
                    "file_exists": true,
                    "file_name": "src/shell/shell_cmds.cpp",
                    "file_size": 165851
                },
                {
                    "file_additions": 7,
                    "file_deletions": 3,
                    "file_exists": true,
                    "file_name": "src/shell/shell_misc.cpp",
                    "file_size": 61734
                }
            ],
            "interesting": {
                "reopen": true,
                "status": false
            },
            "is_parent": false,
            "sha": "06da77003a5ea7e19ccee3a009812787149d0635"
        },
        {
            "associated_pull_request": [],
            "date": "2020-04-21 23:30:07+00:00",
            "diff": "joncampbell123_dosbox-x/issue_1483/commit_278294663ea46eb616cd2e760464caa4f106982f.diff",
            "diff_additions": 25,
            "diff_deletions": 14,
            "diff_file_size": 262698,
            "diff_url": "https://github.com/joncampbell123/dosbox-x/commit/278294663ea46eb616cd2e760464caa4f106982f.diff",
            "exists": true,
            "files": [
                {
                    "file_additions": 11,
                    "file_deletions": 11,
                    "file_exists": true,
                    "file_name": "src/shell/shell.cpp",
                    "file_size": 96847
                },
                {
                    "file_additions": 14,
                    "file_deletions": 3,
                    "file_exists": true,
                    "file_name": "src/shell/shell_cmds.cpp",
                    "file_size": 165851
                }
            ],
            "interesting": {
                "reopen": false,
                "status": false
            },
            "is_parent": false,
            "sha": "278294663ea46eb616cd2e760464caa4f106982f"
        },
        {
            "associated_pull_request": [],
            "date": "2020-04-21 23:30:07+00:00",
            "diff": "joncampbell123_dosbox-x/issue_1483/commit_ab85e403b9572ce850d5e7b543272a8e3c90b971.diff",
            "diff_additions": 25,
            "diff_deletions": 14,
            "diff_file_size": 262698,
            "diff_url": "https://github.com/joncampbell123/dosbox-x/commit/ab85e403b9572ce850d5e7b543272a8e3c90b971.diff",
            "exists": true,
            "files": [
                {
                    "file_additions": 11,
                    "file_deletions": 11,
                    "file_exists": true,
                    "file_name": "src/shell/shell.cpp",
                    "file_size": 96847
                },
                {
                    "file_additions": 14,
                    "file_deletions": 3,
                    "file_exists": true,
                    "file_name": "src/shell/shell_cmds.cpp",
                    "file_size": 165851
                }
            ],
            "interesting": {
                "reopen": false,
                "status": false
            },
            "is_parent": false,
            "sha": "ab85e403b9572ce850d5e7b543272a8e3c90b971"
        },
        {
            "associated_pull_request": [],
            "date": "2020-04-21 23:30:07+00:00",
            "diff": "joncampbell123_dosbox-x/issue_1483/commit_919f9533ebdef615a4c371630a5331896b969f9d.diff",
            "diff_additions": 25,
            "diff_deletions": 14,
            "diff_file_size": 262698,
            "diff_url": "https://github.com/joncampbell123/dosbox-x/commit/919f9533ebdef615a4c371630a5331896b969f9d.diff",
            "exists": true,
            "files": [
                {
                    "file_additions": 11,
                    "file_deletions": 11,
                    "file_exists": true,
                    "file_name": "src/shell/shell.cpp",
                    "file_size": 96847
                },
                {
                    "file_additions": 14,
                    "file_deletions": 3,
                    "file_exists": true,
                    "file_name": "src/shell/shell_cmds.cpp",
                    "file_size": 165851
                }
            ],
            "interesting": {
                "reopen": false,
                "status": false
            },
            "is_parent": false,
            "sha": "919f9533ebdef615a4c371630a5331896b969f9d"
        }
    ],
    "first_commit": "2020-04-20 03:20:12+00:00",
    "last_commit": "2020-04-26 12:36:18+00:00",
    "number": 1483,
    "pull_request": "None",
    "score": {
        "accidental_reopen_likely": false,
        "all_labels": [],
        "contains_keywords": [
            "chang",
            "issu",
            "patch"
        ],
        "fix_size": 417,
        "has_labels": [],
        "intersecting": {
            "computed_score": 1.0,
            "final_commit_size": 28,
            "intersection_size": 28,
            "previous_commits_size": 417
        },
        "is_makefile_based": true,
        "no_new_files": [],
        "no_other_files": false,
        "num_prohibited_files": 297520,
        "prohibited_files": [
            "server/src/main/java/com/genymobile/scrcpy/Device.java",
            "server/src/main/java/com/genymobile/scrcpy/wrappers/SurfaceControl.java",
            "server/src/main/java/com/genymobile/scrcpy/Device.java",
            "server/src/main/java/com/genymobile/scrcpy/wrappers/SurfaceControl.java",
            "app/meson.build",
            "app/scrcpy.1",
            "app/src/common.h",
            "app/src/scrcpy.h",
            "app/src/server.h",
            "server/src/main/java/com/genymobile/scrcpy/Workarounds.java"
        ],
        "reopen": true,
        "reopen_events": [
            [
                "2020-04-21 08:34:25+00:00",
                "commit"
            ],
            [
                "2020-04-21 12:59:43+00:00",
                "closed"
            ],
            [
                "2020-04-21 22:48:00+00:00",
                "reopened"
            ],
            [
                "2020-04-21 23:30:30+00:00",
                "commit"
            ],
            [
                "2020-04-22 11:20:53+00:00",
                "closed"
            ],
            [
                "2020-04-26 09:58:36+00:00",
                "commit"
            ],
            [
                "2020-04-26 09:58:36+00:00",
                "commit"
            ],
            [
                "2020-04-26 12:36:37+00:00",
                "commit"
            ],
            [
                "2020-04-26 12:36:37+00:00",
                "commit"
            ]
        ],
        "status": false,
        "strategy": true,
        "total_changes": 530
    }
}