{
    "covered_issues": [
        1107,
        1105,
        1104,
        1103,
        1100,
        1089,
        1074,
        1073,
        1071,
        1055,
        1048,
        1039,
        1027,
        999,
        985,
        970,
        964,
        937,
        912,
        909,
        900,
        888,
        887,
        886,
        875,
        859,
        857,
        852,
        849,
        834,
        828,
        826,
        825,
        818,
        797,
        782,
        781,
        776,
        775,
        772,
        770,
        769,
        763,
        751,
        747,
        745,
        744,
        738,
        735,
        734,
        726,
        724,
        723,
        696,
        695,
        693,
        690,
        679,
        676,
        672,
        661,
        654,
        645,
        644,
        643,
        640,
        630,
        627,
        624,
        617,
        611,
        608,
        606,
        605,
        602,
        597,
        595,
        592,
        591,
        574,
        573,
        572,
        566,
        565,
        558,
        556,
        553,
        552,
        534,
        533,
        529,
        516,
        502,
        485,
        467,
        462,
        459,
        457,
        455,
        452,
        449,
        442,
        439,
        433,
        432,
        426,
        420,
        418,
        406,
        402,
        383,
        381,
        377,
        376,
        365,
        360,
        352,
        348,
        347,
        346,
        345,
        322,
        314,
        313,
        302,
        299,
        298,
        297,
        296,
        285,
        268,
        266,
        265,
        260,
        255,
        252,
        232,
        219,
        214,
        213,
        209,
        207,
        206,
        205,
        204,
        190,
        184,
        180,
        179,
        178,
        177,
        176,
        175,
        172,
        170,
        163,
        159,
        155,
        147,
        145,
        143,
        133,
        132,
        131,
        125,
        124,
        123,
        122,
        120,
        119,
        118,
        117,
        116,
        115,
        113,
        112,
        110,
        109,
        108,
        104,
        103,
        102,
        99,
        98,
        96,
        95,
        94,
        92,
        90,
        89,
        86,
        84,
        83,
        82,
        79,
        77,
        69,
        66,
        63,
        62,
        61,
        44,
        43,
        40,
        39,
        30,
        29,
        28,
        20,
        18,
        16,
        15,
        12
    ],
    "finished": true
}