{
    "commits": [
        {
            "associated_pull_request": [],
            "date": "2020-01-31 15:15:23+00:00",
            "diff": "libredwg_libredwg/issue_197/commit_29800bacd37fc495424bf1af6f66db6cc063f7c9.diff",
            "diff_additions": 13,
            "diff_deletions": 12,
            "diff_file_size": 192130,
            "diff_url": "https://github.com/LibreDWG/libredwg/commit/29800bacd37fc495424bf1af6f66db6cc063f7c9.diff",
            "exists": true,
            "files": [
                {
                    "file_additions": 13,
                    "file_deletions": 12,
                    "file_exists": true,
                    "file_name": "src/in_json.c",
                    "file_size": 192130
                }
            ],
            "interesting": {
                "reopen": false,
                "status": false
            },
            "is_parent": true,
            "sha": "29800bacd37fc495424bf1af6f66db6cc063f7c9"
        },
        {
            "associated_pull_request": [],
            "date": "2020-01-31 15:45:38+00:00",
            "diff": "libredwg_libredwg/issue_197/commit_cfc1ebb5221b8f3b3ba58b1d91cb4617531612c2.diff",
            "diff_additions": 18,
            "diff_deletions": 7,
            "diff_file_size": 192130,
            "diff_url": "https://github.com/LibreDWG/libredwg/commit/cfc1ebb5221b8f3b3ba58b1d91cb4617531612c2.diff",
            "exists": true,
            "files": [
                {
                    "file_additions": 18,
                    "file_deletions": 7,
                    "file_exists": true,
                    "file_name": "src/in_json.c",
                    "file_size": 192130
                }
            ],
            "interesting": {
                "reopen": false,
                "status": false
            },
            "is_parent": false,
            "sha": "cfc1ebb5221b8f3b3ba58b1d91cb4617531612c2"
        },
        {
            "associated_pull_request": [],
            "date": "2020-01-31 16:46:34+00:00",
            "diff": "libredwg_libredwg/issue_197/commit_79bb3aab1aa7c426d32fb9d031d59e19c344bccb.diff",
            "diff_additions": 7,
            "diff_deletions": 2,
            "diff_file_size": 192130,
            "diff_url": "https://github.com/LibreDWG/libredwg/commit/79bb3aab1aa7c426d32fb9d031d59e19c344bccb.diff",
            "exists": true,
            "files": [
                {
                    "file_additions": 7,
                    "file_deletions": 2,
                    "file_exists": true,
                    "file_name": "src/in_json.c",
                    "file_size": 192130
                }
            ],
            "interesting": {
                "reopen": false,
                "status": false
            },
            "is_parent": false,
            "sha": "79bb3aab1aa7c426d32fb9d031d59e19c344bccb"
        },
        {
            "associated_pull_request": [],
            "date": "2020-01-31 17:46:00+00:00",
            "diff": "libredwg_libredwg/issue_197/commit_e0270a2c9658bfa54a8be4e690fffb34a67eec4b.diff",
            "diff_additions": 68,
            "diff_deletions": 3,
            "diff_file_size": 192130,
            "diff_url": "https://github.com/LibreDWG/libredwg/commit/e0270a2c9658bfa54a8be4e690fffb34a67eec4b.diff",
            "exists": true,
            "files": [
                {
                    "file_additions": 68,
                    "file_deletions": 3,
                    "file_exists": true,
                    "file_name": "src/in_json.c",
                    "file_size": 192130
                }
            ],
            "interesting": {
                "reopen": false,
                "status": false
            },
            "is_parent": false,
            "sha": "e0270a2c9658bfa54a8be4e690fffb34a67eec4b"
        },
        {
            "associated_pull_request": [],
            "date": "2020-02-01 08:05:19+00:00",
            "diff": "libredwg_libredwg/issue_197/commit_665bcd173fc545f3182dc3c3ed786821688597c1.diff",
            "diff_additions": 15,
            "diff_deletions": 0,
            "diff_file_size": 300554,
            "diff_url": "https://github.com/LibreDWG/libredwg/commit/665bcd173fc545f3182dc3c3ed786821688597c1.diff",
            "exists": true,
            "files": [
                {
                    "file_additions": 2,
                    "file_deletions": 0,
                    "file_exists": true,
                    "file_name": "src/dwg.c",
                    "file_size": 108424
                },
                {
                    "file_additions": 13,
                    "file_deletions": 0,
                    "file_exists": true,
                    "file_name": "src/in_json.c",
                    "file_size": 192130
                }
            ],
            "interesting": {
                "reopen": false,
                "status": false
            },
            "is_parent": false,
            "sha": "665bcd173fc545f3182dc3c3ed786821688597c1"
        },
        {
            "associated_pull_request": [],
            "date": "2020-02-01 08:42:24+00:00",
            "diff": "libredwg_libredwg/issue_197/commit_78c04fa71a261183bce78fa8c87c879bba79a0b1.diff",
            "diff_additions": 25,
            "diff_deletions": 24,
            "diff_file_size": 192130,
            "diff_url": "https://github.com/LibreDWG/libredwg/commit/78c04fa71a261183bce78fa8c87c879bba79a0b1.diff",
            "exists": true,
            "files": [
                {
                    "file_additions": 25,
                    "file_deletions": 24,
                    "file_exists": true,
                    "file_name": "src/in_json.c",
                    "file_size": 192130
                }
            ],
            "interesting": {
                "reopen": false,
                "status": false
            },
            "is_parent": false,
            "sha": "78c04fa71a261183bce78fa8c87c879bba79a0b1"
        },
        {
            "associated_pull_request": [],
            "date": "2020-02-01 10:02:51+00:00",
            "diff": "libredwg_libredwg/issue_197/commit_cba37030532f2ba538b64fed4489ad0647f0c693.diff",
            "diff_additions": 11,
            "diff_deletions": 8,
            "diff_file_size": 192130,
            "diff_url": "https://github.com/LibreDWG/libredwg/commit/cba37030532f2ba538b64fed4489ad0647f0c693.diff",
            "exists": true,
            "files": [
                {
                    "file_additions": 11,
                    "file_deletions": 8,
                    "file_exists": true,
                    "file_name": "src/in_json.c",
                    "file_size": 192130
                }
            ],
            "interesting": {
                "reopen": false,
                "status": false
            },
            "is_parent": false,
            "sha": "cba37030532f2ba538b64fed4489ad0647f0c693"
        },
        {
            "associated_pull_request": [],
            "date": "2020-02-01 16:18:21+00:00",
            "diff": "libredwg_libredwg/issue_197/commit_e4f18c50cf76b5d7253ee0adf911a9a758b25234.diff",
            "diff_additions": 14,
            "diff_deletions": 0,
            "diff_file_size": 192130,
            "diff_url": "https://github.com/LibreDWG/libredwg/commit/e4f18c50cf76b5d7253ee0adf911a9a758b25234.diff",
            "exists": true,
            "files": [
                {
                    "file_additions": 14,
                    "file_deletions": 0,
                    "file_exists": true,
                    "file_name": "src/in_json.c",
                    "file_size": 192130
                }
            ],
            "interesting": {
                "reopen": false,
                "status": false
            },
            "is_parent": false,
            "sha": "e4f18c50cf76b5d7253ee0adf911a9a758b25234"
        },
        {
            "associated_pull_request": [],
            "date": "2020-02-01 22:12:49+00:00",
            "diff": "libredwg_libredwg/issue_197/commit_a0ef43b3f819ec9171cc9685284c493438526337.diff",
            "diff_additions": 2,
            "diff_deletions": 0,
            "diff_file_size": 192130,
            "diff_url": "https://github.com/LibreDWG/libredwg/commit/a0ef43b3f819ec9171cc9685284c493438526337.diff",
            "exists": true,
            "files": [
                {
                    "file_additions": 2,
                    "file_deletions": 0,
                    "file_exists": true,
                    "file_name": "src/in_json.c",
                    "file_size": 192130
                }
            ],
            "interesting": {
                "reopen": false,
                "status": false
            },
            "is_parent": false,
            "sha": "a0ef43b3f819ec9171cc9685284c493438526337"
        },
        {
            "associated_pull_request": [],
            "date": "2020-02-02 09:42:50+00:00",
            "diff": "libredwg_libredwg/issue_197/commit_733e068af00b226da23a5ad8adb1992b1cf4a3f2.diff",
            "diff_additions": 1,
            "diff_deletions": 1,
            "diff_file_size": 286856,
            "diff_url": "https://github.com/LibreDWG/libredwg/commit/733e068af00b226da23a5ad8adb1992b1cf4a3f2.diff",
            "exists": true,
            "files": [
                {
                    "file_additions": 1,
                    "file_deletions": 1,
                    "file_exists": true,
                    "file_name": "src/encode.c",
                    "file_size": 286856
                }
            ],
            "interesting": {
                "reopen": true,
                "status": false
            },
            "is_parent": false,
            "sha": "733e068af00b226da23a5ad8adb1992b1cf4a3f2"
        },
        {
            "associated_pull_request": [],
            "date": "2020-02-03 09:06:36+00:00",
            "diff": "libredwg_libredwg/issue_197/commit_036514ad8b033972ed7f6425a580dc0d3aa6bc12.diff",
            "diff_additions": 20,
            "diff_deletions": 0,
            "diff_file_size": 192130,
            "diff_url": "https://github.com/LibreDWG/libredwg/commit/036514ad8b033972ed7f6425a580dc0d3aa6bc12.diff",
            "exists": true,
            "files": [
                {
                    "file_additions": 20,
                    "file_deletions": 0,
                    "file_exists": true,
                    "file_name": "src/in_json.c",
                    "file_size": 192130
                }
            ],
            "interesting": {
                "reopen": false,
                "status": false
            },
            "is_parent": false,
            "sha": "036514ad8b033972ed7f6425a580dc0d3aa6bc12"
        },
        {
            "associated_pull_request": [],
            "date": "2020-02-03 09:15:23+00:00",
            "diff": "libredwg_libredwg/issue_197/commit_aa6d68d9ccb87c4abac6065cc3d759d2e25891dd.diff",
            "diff_additions": 2,
            "diff_deletions": 1,
            "diff_file_size": 192130,
            "diff_url": "https://github.com/LibreDWG/libredwg/commit/aa6d68d9ccb87c4abac6065cc3d759d2e25891dd.diff",
            "exists": true,
            "files": [
                {
                    "file_additions": 2,
                    "file_deletions": 1,
                    "file_exists": true,
                    "file_name": "src/in_json.c",
                    "file_size": 192130
                }
            ],
            "interesting": {
                "reopen": false,
                "status": false
            },
            "is_parent": false,
            "sha": "aa6d68d9ccb87c4abac6065cc3d759d2e25891dd"
        },
        {
            "associated_pull_request": [],
            "date": "2020-02-03 09:06:36+00:00",
            "diff": "libredwg_libredwg/issue_197/commit_2450eafcf6ff6c10a92fe3c21d31027fa9829a52.diff",
            "diff_additions": 20,
            "diff_deletions": 0,
            "diff_file_size": 192130,
            "diff_url": "https://github.com/LibreDWG/libredwg/commit/2450eafcf6ff6c10a92fe3c21d31027fa9829a52.diff",
            "exists": true,
            "files": [
                {
                    "file_additions": 20,
                    "file_deletions": 0,
                    "file_exists": true,
                    "file_name": "src/in_json.c",
                    "file_size": 192130
                }
            ],
            "interesting": {
                "reopen": false,
                "status": false
            },
            "is_parent": false,
            "sha": "2450eafcf6ff6c10a92fe3c21d31027fa9829a52"
        },
        {
            "associated_pull_request": [],
            "date": "2020-02-03 09:15:23+00:00",
            "diff": "libredwg_libredwg/issue_197/commit_e5ba8913719b220c53699294f9faf59a35ca76a0.diff",
            "diff_additions": 2,
            "diff_deletions": 1,
            "diff_file_size": 192130,
            "diff_url": "https://github.com/LibreDWG/libredwg/commit/e5ba8913719b220c53699294f9faf59a35ca76a0.diff",
            "exists": true,
            "files": [
                {
                    "file_additions": 2,
                    "file_deletions": 1,
                    "file_exists": true,
                    "file_name": "src/in_json.c",
                    "file_size": 192130
                }
            ],
            "interesting": {
                "reopen": false,
                "status": false
            },
            "is_parent": false,
            "sha": "e5ba8913719b220c53699294f9faf59a35ca76a0"
        },
        {
            "associated_pull_request": [],
            "date": "2020-02-07 15:31:22+00:00",
            "diff": "libredwg_libredwg/issue_197/commit_d176220f916c8410e094ded05329705f46043258.diff",
            "diff_additions": 4,
            "diff_deletions": 5,
            "diff_file_size": 192130,
            "diff_url": "https://github.com/LibreDWG/libredwg/commit/d176220f916c8410e094ded05329705f46043258.diff",
            "exists": true,
            "files": [
                {
                    "file_additions": 4,
                    "file_deletions": 5,
                    "file_exists": true,
                    "file_name": "src/in_json.c",
                    "file_size": 192130
                }
            ],
            "interesting": {
                "reopen": false,
                "status": false
            },
            "is_parent": false,
            "sha": "d176220f916c8410e094ded05329705f46043258"
        },
        {
            "associated_pull_request": [],
            "date": "2020-02-07 15:43:39+00:00",
            "diff": "libredwg_libredwg/issue_197/commit_ffcff4e11f35450b471bd760b3894f368bb1b2ce.diff",
            "diff_additions": 13,
            "diff_deletions": 3,
            "diff_file_size": 192130,
            "diff_url": "https://github.com/LibreDWG/libredwg/commit/ffcff4e11f35450b471bd760b3894f368bb1b2ce.diff",
            "exists": true,
            "files": [
                {
                    "file_additions": 13,
                    "file_deletions": 3,
                    "file_exists": true,
                    "file_name": "src/in_json.c",
                    "file_size": 192130
                }
            ],
            "interesting": {
                "reopen": false,
                "status": false
            },
            "is_parent": false,
            "sha": "ffcff4e11f35450b471bd760b3894f368bb1b2ce"
        },
        {
            "associated_pull_request": [],
            "date": "2020-02-08 19:46:15+00:00",
            "diff": "libredwg_libredwg/issue_197/commit_c4e7cc169e49bd4da22b1d49b28165a766b68cb1.diff",
            "diff_additions": 1,
            "diff_deletions": 1,
            "diff_file_size": 192130,
            "diff_url": "https://github.com/LibreDWG/libredwg/commit/c4e7cc169e49bd4da22b1d49b28165a766b68cb1.diff",
            "exists": true,
            "files": [
                {
                    "file_additions": 1,
                    "file_deletions": 1,
                    "file_exists": true,
                    "file_name": "src/in_json.c",
                    "file_size": 192130
                }
            ],
            "interesting": {
                "reopen": false,
                "status": false
            },
            "is_parent": false,
            "sha": "c4e7cc169e49bd4da22b1d49b28165a766b68cb1"
        },
        {
            "associated_pull_request": [],
            "date": "2020-02-08 19:46:15+00:00",
            "diff": "libredwg_libredwg/issue_197/commit_e85cb1a3f052a40cc5440efbe9c720057f146385.diff",
            "diff_additions": 1,
            "diff_deletions": 1,
            "diff_file_size": 192130,
            "diff_url": "https://github.com/LibreDWG/libredwg/commit/e85cb1a3f052a40cc5440efbe9c720057f146385.diff",
            "exists": true,
            "files": [
                {
                    "file_additions": 1,
                    "file_deletions": 1,
                    "file_exists": true,
                    "file_name": "src/in_json.c",
                    "file_size": 192130
                }
            ],
            "interesting": {
                "reopen": false,
                "status": false
            },
            "is_parent": false,
            "sha": "e85cb1a3f052a40cc5440efbe9c720057f146385"
        }
    ],
    "first_commit": "2020-01-31 15:25:21+00:00",
    "last_commit": "2020-02-08 20:47:38+00:00",
    "number": 197,
    "pull_request": "None",
    "score": {
        "accidental_reopen_likely": false,
        "all_labels": [
            "bug",
            "fuzzing"
        ],
        "contains_keywords": [
            "fix",
            "test",
            "fault",
            "leak",
            "remov",
            "error",
            "crash"
        ],
        "fix_size": 208,
        "has_labels": [
            "bug"
        ],
        "intersecting": {
            "computed_score": 1.0,
            "final_commit_size": 2,
            "intersection_size": 2,
            "previous_commits_size": 208
        },
        "is_makefile_based": true,
        "no_new_files": [],
        "no_other_files": false,
        "num_prohibited_files": 1110446,
        "prohibited_files": [
            "server/src/main/java/com/genymobile/scrcpy/Device.java",
            "server/src/main/java/com/genymobile/scrcpy/wrappers/SurfaceControl.java",
            "server/src/main/java/com/genymobile/scrcpy/Device.java",
            "server/src/main/java/com/genymobile/scrcpy/wrappers/SurfaceControl.java",
            "app/meson.build",
            "app/scrcpy.1",
            "app/src/common.h",
            "app/src/scrcpy.h",
            "app/src/server.h",
            "server/src/main/java/com/genymobile/scrcpy/Workarounds.java"
        ],
        "reopen": true,
        "reopen_events": [
            [
                "2020-02-02 08:23:15+00:00",
                "commit"
            ],
            [
                "2020-02-02 08:23:15+00:00",
                "commit"
            ],
            [
                "2020-02-02 08:23:15+00:00",
                "commit"
            ],
            [
                "2020-02-02 08:23:15+00:00",
                "commit"
            ],
            [
                "2020-02-02 08:23:15+00:00",
                "commit"
            ],
            [
                "2020-02-02 08:23:15+00:00",
                "commit"
            ],
            [
                "2020-02-02 08:23:15+00:00",
                "commit"
            ],
            [
                "2020-02-02 08:23:15+00:00",
                "commit"
            ],
            [
                "2020-02-02 09:44:52+00:00",
                "commit"
            ],
            [
                "2020-02-02 20:38:38+00:00",
                "closed"
            ],
            [
                "2020-02-03 07:50:07+00:00",
                "reopened"
            ],
            [
                "2020-02-03 10:24:54+00:00",
                "commit"
            ],
            [
                "2020-02-03 10:24:54+00:00",
                "commit"
            ],
            [
                "2020-02-03 12:17:13+00:00",
                "commit"
            ],
            [
                "2020-02-03 12:17:13+00:00",
                "commit"
            ],
            [
                "2020-02-03 19:05:08+00:00",
                "closed"
            ],
            [
                "2020-02-07 15:46:00+00:00",
                "commit"
            ],
            [
                "2020-02-07 15:46:00+00:00",
                "commit"
            ],
            [
                "2020-02-08 20:02:49+00:00",
                "commit"
            ],
            [
                "2020-02-08 20:02:49+00:00",
                "commit"
            ],
            [
                "2020-02-08 20:49:13+00:00",
                "commit"
            ]
        ],
        "status": false,
        "strategy": true,
        "total_changes": 306
    }
}