{
    "commits": [
        {
            "associated_pull_request": [],
            "date": "2013-08-16 22:20:07+00:00",
            "diff": "",
            "diff_additions": 0,
            "diff_deletions": 0,
            "diff_file_size": 0,
            "diff_url": "https://github.com/openzfs/zfs/commit/0c28fb480836ab7bb1bbf8de6e572d2443273396.diff",
            "exists": true,
            "files": [],
            "interesting": {
                "reopen": false,
                "status": false
            },
            "is_parent": true,
            "sha": "0c28fb480836ab7bb1bbf8de6e572d2443273396"
        },
        {
            "associated_pull_request": [],
            "date": "2011-07-01 22:56:35+00:00",
            "diff": "openzfs_zfs/issue_1691/commit_683e585c578d2b61b42d36ae6b73dc665b09fd28.diff",
            "diff_additions": 31,
            "diff_deletions": 2,
            "diff_file_size": 0,
            "diff_url": "https://github.com/openzfs/zfs/commit/683e585c578d2b61b42d36ae6b73dc665b09fd28.diff",
            "exists": true,
            "files": [
                {
                    "file_additions": 31,
                    "file_deletions": 2,
                    "file_exists": false,
                    "file_name": "module/zfs/zpl_file.c",
                    "file_size": 0
                }
            ],
            "interesting": {
                "reopen": true,
                "status": false
            },
            "is_parent": false,
            "sha": "683e585c578d2b61b42d36ae6b73dc665b09fd28"
        },
        {
            "associated_pull_request": [],
            "date": "2011-07-01 22:56:35+00:00",
            "diff": "openzfs_zfs/issue_1691/commit_6de24f7c2e945e0cf8190b88f5d63b018626113f.diff",
            "diff_additions": 95,
            "diff_deletions": 3,
            "diff_file_size": 0,
            "diff_url": "https://github.com/openzfs/zfs/commit/6de24f7c2e945e0cf8190b88f5d63b018626113f.diff",
            "exists": true,
            "files": [
                {
                    "file_additions": 95,
                    "file_deletions": 3,
                    "file_exists": false,
                    "file_name": "module/zfs/zpl_file.c",
                    "file_size": 0
                }
            ],
            "interesting": {
                "reopen": false,
                "status": false
            },
            "is_parent": false,
            "sha": "6de24f7c2e945e0cf8190b88f5d63b018626113f"
        },
        {
            "associated_pull_request": [],
            "date": "2011-07-01 22:56:35+00:00",
            "diff": "openzfs_zfs/issue_1691/commit_ddd722b597a2daaf35eb5d50ad6a949aa00c74ed.diff",
            "diff_additions": 101,
            "diff_deletions": 3,
            "diff_file_size": 0,
            "diff_url": "https://github.com/openzfs/zfs/commit/ddd722b597a2daaf35eb5d50ad6a949aa00c74ed.diff",
            "exists": true,
            "files": [
                {
                    "file_additions": 101,
                    "file_deletions": 3,
                    "file_exists": false,
                    "file_name": "module/zfs/zpl_file.c",
                    "file_size": 0
                }
            ],
            "interesting": {
                "reopen": false,
                "status": false
            },
            "is_parent": false,
            "sha": "ddd722b597a2daaf35eb5d50ad6a949aa00c74ed"
        },
        {
            "associated_pull_request": [],
            "date": "2011-07-01 22:56:35+00:00",
            "diff": "openzfs_zfs/issue_1691/commit_7d42e1414004863fdc77e50e35a73e75752d7233.diff",
            "diff_additions": 93,
            "diff_deletions": 3,
            "diff_file_size": 0,
            "diff_url": "https://github.com/openzfs/zfs/commit/7d42e1414004863fdc77e50e35a73e75752d7233.diff",
            "exists": true,
            "files": [
                {
                    "file_additions": 93,
                    "file_deletions": 3,
                    "file_exists": false,
                    "file_name": "module/zfs/zpl_file.c",
                    "file_size": 0
                }
            ],
            "interesting": {
                "reopen": false,
                "status": false
            },
            "is_parent": false,
            "sha": "7d42e1414004863fdc77e50e35a73e75752d7233"
        },
        {
            "associated_pull_request": [],
            "date": "2011-07-01 22:56:35+00:00",
            "diff": "openzfs_zfs/issue_1691/commit_94588e3ad4f53c39a71941a6e99450fbc7a2da4d.diff",
            "diff_additions": 93,
            "diff_deletions": 3,
            "diff_file_size": 0,
            "diff_url": "https://github.com/openzfs/zfs/commit/94588e3ad4f53c39a71941a6e99450fbc7a2da4d.diff",
            "exists": true,
            "files": [
                {
                    "file_additions": 93,
                    "file_deletions": 3,
                    "file_exists": false,
                    "file_name": "module/zfs/zpl_file.c",
                    "file_size": 0
                }
            ],
            "interesting": {
                "reopen": false,
                "status": false
            },
            "is_parent": false,
            "sha": "94588e3ad4f53c39a71941a6e99450fbc7a2da4d"
        },
        {
            "associated_pull_request": [],
            "date": "2011-07-01 22:56:35+00:00",
            "diff": "openzfs_zfs/issue_1691/commit_667055ea952ca3f16d62b0b5fc211bb1efc81bf2.diff",
            "diff_additions": 93,
            "diff_deletions": 3,
            "diff_file_size": 0,
            "diff_url": "https://github.com/openzfs/zfs/commit/667055ea952ca3f16d62b0b5fc211bb1efc81bf2.diff",
            "exists": true,
            "files": [
                {
                    "file_additions": 93,
                    "file_deletions": 3,
                    "file_exists": false,
                    "file_name": "module/zfs/zpl_file.c",
                    "file_size": 0
                }
            ],
            "interesting": {
                "reopen": false,
                "status": false
            },
            "is_parent": false,
            "sha": "667055ea952ca3f16d62b0b5fc211bb1efc81bf2"
        },
        {
            "associated_pull_request": [],
            "date": "2011-07-01 22:56:35+00:00",
            "diff": "openzfs_zfs/issue_1691/commit_f9a133075c9fcc10236773a86441dc5c255acff4.diff",
            "diff_additions": 93,
            "diff_deletions": 3,
            "diff_file_size": 0,
            "diff_url": "https://github.com/openzfs/zfs/commit/f9a133075c9fcc10236773a86441dc5c255acff4.diff",
            "exists": true,
            "files": [
                {
                    "file_additions": 93,
                    "file_deletions": 3,
                    "file_exists": false,
                    "file_name": "module/zfs/zpl_file.c",
                    "file_size": 0
                }
            ],
            "interesting": {
                "reopen": false,
                "status": false
            },
            "is_parent": false,
            "sha": "f9a133075c9fcc10236773a86441dc5c255acff4"
        },
        {
            "associated_pull_request": [],
            "date": "2011-07-01 22:56:35+00:00",
            "diff": "openzfs_zfs/issue_1691/commit_79f280c7b230e5493f430a1bea1aefbe4a90d018.diff",
            "diff_additions": 93,
            "diff_deletions": 3,
            "diff_file_size": 0,
            "diff_url": "https://github.com/openzfs/zfs/commit/79f280c7b230e5493f430a1bea1aefbe4a90d018.diff",
            "exists": true,
            "files": [
                {
                    "file_additions": 93,
                    "file_deletions": 3,
                    "file_exists": false,
                    "file_name": "module/zfs/zpl_file.c",
                    "file_size": 0
                }
            ],
            "interesting": {
                "reopen": false,
                "status": false
            },
            "is_parent": false,
            "sha": "79f280c7b230e5493f430a1bea1aefbe4a90d018"
        },
        {
            "associated_pull_request": [],
            "date": "2011-07-01 22:56:35+00:00",
            "diff": "openzfs_zfs/issue_1691/commit_57e47d0d612d60d219c3e51644c7f3b178506b8d.diff",
            "diff_additions": 93,
            "diff_deletions": 3,
            "diff_file_size": 0,
            "diff_url": "https://github.com/openzfs/zfs/commit/57e47d0d612d60d219c3e51644c7f3b178506b8d.diff",
            "exists": true,
            "files": [
                {
                    "file_additions": 93,
                    "file_deletions": 3,
                    "file_exists": false,
                    "file_name": "module/zfs/zpl_file.c",
                    "file_size": 0
                }
            ],
            "interesting": {
                "reopen": false,
                "status": false
            },
            "is_parent": false,
            "sha": "57e47d0d612d60d219c3e51644c7f3b178506b8d"
        },
        {
            "associated_pull_request": [],
            "date": "2011-07-01 22:56:35+00:00",
            "diff": "openzfs_zfs/issue_1691/commit_fb05f98e90e41ec3a8e713cb2b22fed4d7587da9.diff",
            "diff_additions": 93,
            "diff_deletions": 3,
            "diff_file_size": 0,
            "diff_url": "https://github.com/openzfs/zfs/commit/fb05f98e90e41ec3a8e713cb2b22fed4d7587da9.diff",
            "exists": true,
            "files": [
                {
                    "file_additions": 93,
                    "file_deletions": 3,
                    "file_exists": false,
                    "file_name": "module/zfs/zpl_file.c",
                    "file_size": 0
                }
            ],
            "interesting": {
                "reopen": false,
                "status": false
            },
            "is_parent": false,
            "sha": "fb05f98e90e41ec3a8e713cb2b22fed4d7587da9"
        },
        {
            "associated_pull_request": [],
            "date": "2011-07-01 22:56:35+00:00",
            "diff": "openzfs_zfs/issue_1691/commit_b43c6d144e65f7783e08ed22e379a7c2f2fef43e.diff",
            "diff_additions": 93,
            "diff_deletions": 3,
            "diff_file_size": 0,
            "diff_url": "https://github.com/openzfs/zfs/commit/b43c6d144e65f7783e08ed22e379a7c2f2fef43e.diff",
            "exists": true,
            "files": [
                {
                    "file_additions": 93,
                    "file_deletions": 3,
                    "file_exists": false,
                    "file_name": "module/zfs/zpl_file.c",
                    "file_size": 0
                }
            ],
            "interesting": {
                "reopen": false,
                "status": false
            },
            "is_parent": false,
            "sha": "b43c6d144e65f7783e08ed22e379a7c2f2fef43e"
        },
        {
            "associated_pull_request": [],
            "date": "2011-07-01 22:56:35+00:00",
            "diff": "openzfs_zfs/issue_1691/commit_69640512b453c3e74b53169d239389debd023acc.diff",
            "diff_additions": 93,
            "diff_deletions": 3,
            "diff_file_size": 0,
            "diff_url": "https://github.com/openzfs/zfs/commit/69640512b453c3e74b53169d239389debd023acc.diff",
            "exists": true,
            "files": [
                {
                    "file_additions": 93,
                    "file_deletions": 3,
                    "file_exists": false,
                    "file_name": "module/zfs/zpl_file.c",
                    "file_size": 0
                }
            ],
            "interesting": {
                "reopen": false,
                "status": false
            },
            "is_parent": false,
            "sha": "69640512b453c3e74b53169d239389debd023acc"
        },
        {
            "associated_pull_request": [],
            "date": "2011-07-01 22:56:35+00:00",
            "diff": "openzfs_zfs/issue_1691/commit_7a726f64d2d24892dab63c6e8e220ca53738549f.diff",
            "diff_additions": 121,
            "diff_deletions": 3,
            "diff_file_size": 0,
            "diff_url": "https://github.com/openzfs/zfs/commit/7a726f64d2d24892dab63c6e8e220ca53738549f.diff",
            "exists": true,
            "files": [
                {
                    "file_additions": 32,
                    "file_deletions": 0,
                    "file_exists": false,
                    "file_name": "module/zfs/zfs_znode.c",
                    "file_size": 0
                },
                {
                    "file_additions": 89,
                    "file_deletions": 3,
                    "file_exists": false,
                    "file_name": "module/zfs/zpl_file.c",
                    "file_size": 0
                }
            ],
            "interesting": {
                "reopen": false,
                "status": false
            },
            "is_parent": false,
            "sha": "7a726f64d2d24892dab63c6e8e220ca53738549f"
        },
        {
            "associated_pull_request": [],
            "date": "2011-07-01 22:56:35+00:00",
            "diff": "openzfs_zfs/issue_1691/commit_aafb58e373e00ac3b20687805b3dd93e4b9455b3.diff",
            "diff_additions": 121,
            "diff_deletions": 3,
            "diff_file_size": 0,
            "diff_url": "https://github.com/openzfs/zfs/commit/aafb58e373e00ac3b20687805b3dd93e4b9455b3.diff",
            "exists": true,
            "files": [
                {
                    "file_additions": 32,
                    "file_deletions": 0,
                    "file_exists": false,
                    "file_name": "module/zfs/zfs_znode.c",
                    "file_size": 0
                },
                {
                    "file_additions": 89,
                    "file_deletions": 3,
                    "file_exists": false,
                    "file_name": "module/zfs/zpl_file.c",
                    "file_size": 0
                }
            ],
            "interesting": {
                "reopen": false,
                "status": false
            },
            "is_parent": false,
            "sha": "aafb58e373e00ac3b20687805b3dd93e4b9455b3"
        },
        {
            "associated_pull_request": [],
            "date": "2011-07-01 22:56:35+00:00",
            "diff": "openzfs_zfs/issue_1691/commit_9160cdb646fbe759c8eab7bd7b8d7ac5eedb39b7.diff",
            "diff_additions": 121,
            "diff_deletions": 3,
            "diff_file_size": 0,
            "diff_url": "https://github.com/openzfs/zfs/commit/9160cdb646fbe759c8eab7bd7b8d7ac5eedb39b7.diff",
            "exists": true,
            "files": [
                {
                    "file_additions": 32,
                    "file_deletions": 0,
                    "file_exists": false,
                    "file_name": "module/zfs/zfs_znode.c",
                    "file_size": 0
                },
                {
                    "file_additions": 89,
                    "file_deletions": 3,
                    "file_exists": false,
                    "file_name": "module/zfs/zpl_file.c",
                    "file_size": 0
                }
            ],
            "interesting": {
                "reopen": false,
                "status": false
            },
            "is_parent": false,
            "sha": "9160cdb646fbe759c8eab7bd7b8d7ac5eedb39b7"
        },
        {
            "associated_pull_request": [],
            "date": "2011-07-01 22:56:35+00:00",
            "diff": "openzfs_zfs/issue_1691/commit_face856b926b1b90030fa9b2a2e27ad77fb9ad44.diff",
            "diff_additions": 114,
            "diff_deletions": 3,
            "diff_file_size": 0,
            "diff_url": "https://github.com/openzfs/zfs/commit/face856b926b1b90030fa9b2a2e27ad77fb9ad44.diff",
            "exists": true,
            "files": [
                {
                    "file_additions": 20,
                    "file_deletions": 0,
                    "file_exists": false,
                    "file_name": "module/zfs/zfs_znode.c",
                    "file_size": 0
                },
                {
                    "file_additions": 94,
                    "file_deletions": 3,
                    "file_exists": false,
                    "file_name": "module/zfs/zpl_file.c",
                    "file_size": 0
                }
            ],
            "interesting": {
                "reopen": false,
                "status": false
            },
            "is_parent": false,
            "sha": "face856b926b1b90030fa9b2a2e27ad77fb9ad44"
        },
        {
            "associated_pull_request": [],
            "date": "2011-07-01 22:56:35+00:00",
            "diff": "openzfs_zfs/issue_1691/commit_4bdfa999d5741df13d66cab8e0d067670aacffe3.diff",
            "diff_additions": 114,
            "diff_deletions": 3,
            "diff_file_size": 0,
            "diff_url": "https://github.com/openzfs/zfs/commit/4bdfa999d5741df13d66cab8e0d067670aacffe3.diff",
            "exists": true,
            "files": [
                {
                    "file_additions": 20,
                    "file_deletions": 0,
                    "file_exists": false,
                    "file_name": "module/zfs/zfs_znode.c",
                    "file_size": 0
                },
                {
                    "file_additions": 94,
                    "file_deletions": 3,
                    "file_exists": false,
                    "file_name": "module/zfs/zpl_file.c",
                    "file_size": 0
                }
            ],
            "interesting": {
                "reopen": false,
                "status": false
            },
            "is_parent": false,
            "sha": "4bdfa999d5741df13d66cab8e0d067670aacffe3"
        },
        {
            "associated_pull_request": [],
            "date": "2011-07-01 22:56:35+00:00",
            "diff": "openzfs_zfs/issue_1691/commit_9d317793aa66d05a8c44410ea24a9a4166a89bbd.diff",
            "diff_additions": 114,
            "diff_deletions": 3,
            "diff_file_size": 0,
            "diff_url": "https://github.com/openzfs/zfs/commit/9d317793aa66d05a8c44410ea24a9a4166a89bbd.diff",
            "exists": true,
            "files": [
                {
                    "file_additions": 20,
                    "file_deletions": 0,
                    "file_exists": false,
                    "file_name": "module/zfs/zfs_znode.c",
                    "file_size": 0
                },
                {
                    "file_additions": 94,
                    "file_deletions": 3,
                    "file_exists": false,
                    "file_name": "module/zfs/zpl_file.c",
                    "file_size": 0
                }
            ],
            "interesting": {
                "reopen": false,
                "status": false
            },
            "is_parent": false,
            "sha": "9d317793aa66d05a8c44410ea24a9a4166a89bbd"
        },
        {
            "associated_pull_request": [],
            "date": "2011-07-01 22:56:35+00:00",
            "diff": "openzfs_zfs/issue_1691/commit_9d317793aa66d05a8c44410ea24a9a4166a89bbd.diff",
            "diff_additions": 114,
            "diff_deletions": 3,
            "diff_file_size": 0,
            "diff_url": "https://github.com/openzfs/zfs/commit/9d317793aa66d05a8c44410ea24a9a4166a89bbd.diff",
            "exists": true,
            "files": [
                {
                    "file_additions": 20,
                    "file_deletions": 0,
                    "file_exists": false,
                    "file_name": "module/zfs/zfs_znode.c",
                    "file_size": 0
                },
                {
                    "file_additions": 94,
                    "file_deletions": 3,
                    "file_exists": false,
                    "file_name": "module/zfs/zpl_file.c",
                    "file_size": 0
                }
            ],
            "interesting": {
                "reopen": false,
                "status": false
            },
            "is_parent": false,
            "sha": "9d317793aa66d05a8c44410ea24a9a4166a89bbd"
        }
    ],
    "first_commit": "2013-08-22 20:33:26+00:00",
    "last_commit": "2014-05-01 17:11:18+00:00",
    "number": 1691,
    "pull_request": "None",
    "score": {
        "accidental_reopen_likely": false,
        "all_labels": [
            "Type: Feature"
        ],
        "contains_keywords": [
            "work",
            "fail",
            "chang",
            "fix",
            "issu",
            "patch",
            "reason",
            "test",
            "remov",
            "bug",
            "error"
        ],
        "fix_size": 181,
        "has_labels": [],
        "intersecting": {
            "computed_score": 1.0,
            "final_commit_size": 116,
            "intersection_size": 116,
            "previous_commits_size": 181
        },
        "is_makefile_based": true,
        "no_new_files": [],
        "no_other_files": false,
        "num_prohibited_files": 205179,
        "prohibited_files": [
            "server/src/main/java/com/genymobile/scrcpy/Device.java",
            "server/src/main/java/com/genymobile/scrcpy/wrappers/SurfaceControl.java",
            "server/src/main/java/com/genymobile/scrcpy/Device.java",
            "server/src/main/java/com/genymobile/scrcpy/wrappers/SurfaceControl.java",
            "app/meson.build",
            "app/scrcpy.1",
            "app/src/common.h",
            "app/src/scrcpy.h",
            "app/src/server.h",
            "server/src/main/java/com/genymobile/scrcpy/Workarounds.java"
        ],
        "reopen": true,
        "reopen_events": [
            [
                "2013-09-03 23:00:05+00:00",
                "closed"
            ],
            [
                "2013-09-04 01:35:16+00:00",
                "commit"
            ],
            [
                "2013-09-04 01:40:27+00:00",
                "commit"
            ],
            [
                "2013-09-04 02:11:59+00:00",
                "reopened"
            ],
            [
                "2013-09-04 02:18:15+00:00",
                "commit"
            ],
            [
                "2013-09-04 02:18:58+00:00",
                "commit"
            ],
            [
                "2013-09-04 06:39:28+00:00",
                "commit"
            ],
            [
                "2013-09-04 09:42:24+00:00",
                "commit"
            ],
            [
                "2013-10-05 22:10:44+00:00",
                "commit"
            ],
            [
                "2013-10-06 21:53:35+00:00",
                "commit"
            ],
            [
                "2013-10-07 13:53:00+00:00",
                "commit"
            ],
            [
                "2013-10-12 02:19:31+00:00",
                "commit"
            ],
            [
                "2013-10-12 02:58:38+00:00",
                "commit"
            ],
            [
                "2013-10-24 17:18:05+00:00",
                "commit"
            ],
            [
                "2013-11-09 15:51:48+00:00",
                "commit"
            ],
            [
                "2013-11-21 13:22:58+00:00",
                "commit"
            ],
            [
                "2014-01-23 18:50:48+00:00",
                "commit"
            ],
            [
                "2014-04-25 03:17:47+00:00",
                "commit"
            ],
            [
                "2014-04-25 03:20:48+00:00",
                "commit"
            ],
            [
                "2014-04-25 14:32:32+00:00",
                "commit"
            ],
            [
                "2014-04-30 02:58:33+00:00",
                "commit"
            ],
            [
                "2014-05-01 03:05:28+00:00",
                "commit"
            ],
            [
                "2014-05-01 17:14:21+00:00",
                "commit"
            ],
            [
                "2014-05-01 17:14:21+00:00",
                "commit"
            ],
            [
                "2014-05-01 17:14:29+00:00",
                "closed"
            ],
            [
                "2014-05-01 17:14:29+00:00",
                "commit"
            ]
        ],
        "status": false,
        "strategy": true,
        "total_changes": 1939
    }
}