{
    "category": [
        "build/refactor/preprocessing"
    ],
    "commits": [
        {
            "associated_pull_request": [
                "https://github.com/rizinorg/rizin/pull/199"
            ],
            "date": "2020-12-16 12:50:25",
            "diff": "rizinorg_rizin/issue_187/commit_4a6627929142627fdd55a56ce9abafa6565f9c22.diff",
            "diff_additions": 11,
            "diff_deletions": 164,
            "diff_file_size": 304157,
            "diff_url": "https://github.com/rizinorg/rizin/commit/4a6627929142627fdd55a56ce9abafa6565f9c22.diff",
            "exists": true,
            "files": [
                {
                    "file_additions": 9,
                    "file_deletions": 105,
                    "file_exists": true,
                    "file_name": "librz/core/panels.c",
                    "file_size": 193663
                },
                {
                    "file_additions": 2,
                    "file_deletions": 59,
                    "file_exists": true,
                    "file_name": "librz/core/visual.c",
                    "file_size": 110494
                }
            ],
            "interesting": {
                "reopen": false,
                "status": false
            },
            "is_parent": true,
            "sha": "4a6627929142627fdd55a56ce9abafa6565f9c22"
        },
        {
            "associated_pull_request": [
                "https://github.com/rizinorg/rizin/pull/205"
            ],
            "date": "2020-12-17 12:59:46",
            "diff": "rizinorg_rizin/issue_187/commit_503a66322055762a97d17ef30f5a0d6638f3f3c0.diff",
            "diff_additions": 438,
            "diff_deletions": 550,
            "diff_file_size": 1984568,
            "diff_url": "https://github.com/rizinorg/rizin/commit/503a66322055762a97d17ef30f5a0d6638f3f3c0.diff",
            "exists": true,
            "files": [
                {
                    "file_additions": 0,
                    "file_deletions": 8,
                    "file_exists": true,
                    "file_name": "librz/analysis/analysis.c",
                    "file_size": 19957
                },
                {
                    "file_additions": 0,
                    "file_deletions": 120,
                    "file_exists": false,
                    "file_name": "librz/analysis/bb.c",
                    "file_size": 0
                },
                {
                    "file_additions": 160,
                    "file_deletions": 6,
                    "file_exists": true,
                    "file_name": "librz/analysis/block.c",
                    "file_size": 33418
                },
                {
                    "file_additions": 10,
                    "file_deletions": 22,
                    "file_exists": true,
                    "file_name": "librz/analysis/fcn.c",
                    "file_size": 72458
                },
                {
                    "file_additions": 3,
                    "file_deletions": 3,
                    "file_exists": true,
                    "file_name": "librz/analysis/op.c",
                    "file_size": 20068
                },
                {
                    "file_additions": 2,
                    "file_deletions": 25,
                    "file_exists": true,
                    "file_name": "librz/analysis/serialize_analysis.c",
                    "file_size": 55746
                },
                {
                    "file_additions": 1,
                    "file_deletions": 1,
                    "file_exists": true,
                    "file_name": "librz/analysis/xrefs.c",
                    "file_size": 9769
                },
                {
                    "file_additions": 1,
                    "file_deletions": 1,
                    "file_exists": true,
                    "file_name": "librz/bin/mangling/rust.c",
                    "file_size": 1437
                },
                {
                    "file_additions": 12,
                    "file_deletions": 37,
                    "file_exists": true,
                    "file_name": "librz/core/agraph.c",
                    "file_size": 129250
                },
                {
                    "file_additions": 10,
                    "file_deletions": 14,
                    "file_exists": true,
                    "file_name": "librz/core/canalysis.c",
                    "file_size": 224478
                },
                {
                    "file_additions": 35,
                    "file_deletions": 39,
                    "file_exists": true,
                    "file_name": "librz/core/cconfig.c",
                    "file_size": 134242
                },
                {
                    "file_additions": 8,
                    "file_deletions": 7,
                    "file_exists": true,
                    "file_name": "librz/core/cmd.c",
                    "file_size": 177679
                },
                {
                    "file_additions": 8,
                    "file_deletions": 38,
                    "file_exists": true,
                    "file_name": "librz/core/cmd_analysis.c",
                    "file_size": 282148
                },
                {
                    "file_additions": 4,
                    "file_deletions": 4,
                    "file_exists": true,
                    "file_name": "librz/core/cmd_print.c",
                    "file_size": 194524
                },
                {
                    "file_additions": 1,
                    "file_deletions": 1,
                    "file_exists": true,
                    "file_name": "librz/core/core.c",
                    "file_size": 100415
                },
                {
                    "file_additions": 5,
                    "file_deletions": 66,
                    "file_exists": true,
                    "file_name": "librz/core/disasm.c",
                    "file_size": 194774
                },
                {
                    "file_additions": 21,
                    "file_deletions": 83,
                    "file_exists": true,
                    "file_name": "librz/core/visual.c",
                    "file_size": 110494
                },
                {
                    "file_additions": 1,
                    "file_deletions": 1,
                    "file_exists": true,
                    "file_name": "librz/debug/dsession.c",
                    "file_size": 19674
                },
                {
                    "file_additions": 14,
                    "file_deletions": 10,
                    "file_exists": true,
                    "file_name": "librz/reg/arena.c",
                    "file_size": 7996
                },
                {
                    "file_additions": 8,
                    "file_deletions": 0,
                    "file_exists": true,
                    "file_name": "librz/util/mem.c",
                    "file_size": 7560
                },
                {
                    "file_additions": 2,
                    "file_deletions": 2,
                    "file_exists": true,
                    "file_name": "librz/util/str.c",
                    "file_size": 82320
                },
                {
                    "file_additions": 9,
                    "file_deletions": 2,
                    "file_exists": true,
                    "file_name": "shlr/rizin-shell-parser/src/scanner.c",
                    "file_size": 5654
                },
                {
                    "file_additions": 121,
                    "file_deletions": 50,
                    "file_exists": true,
                    "file_name": "test/unit/test_analysis_block.c",
                    "file_size": 28717
                },
                {
                    "file_additions": 2,
                    "file_deletions": 10,
                    "file_exists": true,
                    "file_name": "test/unit/test_serialize_analysis.c",
                    "file_size": 71790
                }
            ],
            "interesting": {
                "reopen": false,
                "status": false
            },
            "is_parent": false,
            "sha": "503a66322055762a97d17ef30f5a0d6638f3f3c0"
        },
        {
            "associated_pull_request": [
                "https://github.com/rizinorg/rizin/pull/205"
            ],
            "date": "2020-12-18 00:09:56",
            "diff": "rizinorg_rizin/issue_187/commit_f29358d5d5be1bf637fcacbfd543c04cfed9fc5d.diff",
            "diff_additions": 7,
            "diff_deletions": 2,
            "diff_file_size": 134737,
            "diff_url": "https://github.com/rizinorg/rizin/commit/f29358d5d5be1bf637fcacbfd543c04cfed9fc5d.diff",
            "exists": true,
            "files": [
                {
                    "file_additions": 7,
                    "file_deletions": 2,
                    "file_exists": true,
                    "file_name": "librz/core/cbin.c",
                    "file_size": 134737
                }
            ],
            "interesting": {
                "reopen": false,
                "status": false
            },
            "is_parent": false,
            "sha": "f29358d5d5be1bf637fcacbfd543c04cfed9fc5d"
        }
    ],
    "first_commit": "2020-12-16 12:50:25",
    "last_commit": "2020-12-18 04:44:55",
    "number": 187,
    "pull_request": "None",
    "score": {
        "accidental_reopen_likely": false,
        "all_labels": [
            "buildsystem",
            "infrastructure"
        ],
        "contains_keywords": [
            "CI",
            "issu",
            "problem",
            "chang",
            "work",
            "error",
            "test",
            "bug"
        ],
        "fix_size": 915,
        "has_labels": [],
        "intersecting": {
            "computed_score": 0.0,
            "final_commit_size": 9,
            "intersection_size": 0,
            "previous_commits_size": 906
        },
        "is_makefile_based": false,
        "no_new_files": [
            "librz/core/cbin.c"
        ],
        "no_other_files": false,
        "num_prohibited_files": 33585,
        "prohibited_files": [
            "tools/building.py",
            "tools/building.py",
            "tools/building.py",
            "emcc.py",
            "src/library_emmalloc.js",
            "src/shell.js",
            "tests/test_core.py",
            "src/shell.js",
            "tests/test_core.py",
            "src/library.js"
        ],
        "reopen": false,
        "reopen_events": [
            [
                "2020-12-16 19:34:12",
                "commit"
            ],
            [
                "2020-12-16 21:32:00",
                "commit"
            ],
            [
                "2020-12-16 21:36:08",
                "commit"
            ],
            [
                "2020-12-16 23:13:47",
                "commit"
            ],
            [
                "2020-12-17 12:51:13",
                "commit"
            ],
            [
                "2020-12-17 12:59:47",
                "commit"
            ],
            [
                "2020-12-17 18:35:18",
                "commit"
            ],
            [
                "2020-12-17 19:42:09",
                "commit"
            ],
            [
                "2020-12-18 00:09:57",
                "commit"
            ],
            [
                "2020-12-18 04:44:55",
                "closed"
            ],
            [
                "2020-12-18 04:44:57",
                "commit"
            ],
            [
                "2021-01-05 08:08:00",
                "reopened"
            ],
            [
                "2021-01-07 12:03:18",
                "closed"
            ]
        ],
        "status": true,
        "strategy": true,
        "total_changes": 1172
    }
}