{
    "commits": [
        {
            "associated_pull_request": [
                "https://github.com/adobe-type-tools/afdko/pull/687"
            ],
            "date": "2018-11-30 00:14:36+00:00",
            "diff": "adobe-type-tools_afdko/issue_684/commit_6b49b170d504c28059f7f6586a68647aabe78d9a.diff",
            "diff_additions": 9,
            "diff_deletions": 9,
            "diff_file_size": 0,
            "diff_url": "https://github.com/adobe-type-tools/afdko/commit/6b49b170d504c28059f7f6586a68647aabe78d9a.diff",
            "exists": true,
            "files": [
                {
                    "file_additions": 9,
                    "file_deletions": 9,
                    "file_exists": false,
                    "file_name": "c/public/lib/source/cffwrite/cffwrite_subr.c",
                    "file_size": 0
                }
            ],
            "interesting": {
                "reopen": false,
                "status": false
            },
            "is_parent": true,
            "sha": "6b49b170d504c28059f7f6586a68647aabe78d9a"
        },
        {
            "associated_pull_request": [
                "https://github.com/adobe-type-tools/afdko/pull/697"
            ],
            "date": "2018-12-01 00:38:38+00:00",
            "diff": "adobe-type-tools_afdko/issue_684/commit_6ccdf61ba192f8c9cc22d9db09a20af45dda472b.diff",
            "diff_additions": 28,
            "diff_deletions": 9,
            "diff_file_size": 0,
            "diff_url": "https://github.com/adobe-type-tools/afdko/commit/6ccdf61ba192f8c9cc22d9db09a20af45dda472b.diff",
            "exists": true,
            "files": [
                {
                    "file_additions": 28,
                    "file_deletions": 9,
                    "file_exists": false,
                    "file_name": "c/public/lib/source/cffwrite/cffwrite_t2cstr.c",
                    "file_size": 0
                }
            ],
            "interesting": {
                "reopen": false,
                "status": false
            },
            "is_parent": false,
            "sha": "6ccdf61ba192f8c9cc22d9db09a20af45dda472b"
        },
        {
            "associated_pull_request": [
                "https://github.com/adobe-type-tools/afdko/pull/697"
            ],
            "date": "2018-12-18 18:12:27+00:00",
            "diff": "adobe-type-tools_afdko/issue_684/commit_89a04799d32139e80644ba3831bc934a598085c4.diff",
            "diff_additions": 37,
            "diff_deletions": 9,
            "diff_file_size": 0,
            "diff_url": "https://github.com/adobe-type-tools/afdko/commit/89a04799d32139e80644ba3831bc934a598085c4.diff",
            "exists": true,
            "files": [
                {
                    "file_additions": 37,
                    "file_deletions": 9,
                    "file_exists": false,
                    "file_name": "c/public/lib/source/cffwrite/cffwrite_t2cstr.c",
                    "file_size": 0
                }
            ],
            "interesting": {
                "reopen": true,
                "status": false
            },
            "is_parent": false,
            "sha": "89a04799d32139e80644ba3831bc934a598085c4"
        },
        {
            "associated_pull_request": [],
            "date": "2019-03-04 07:43:35+00:00",
            "diff": "adobe-type-tools_afdko/issue_684/commit_0b74668130b33644d994ba251ada7ba0f83cf77d.diff",
            "diff_additions": 4,
            "diff_deletions": 1,
            "diff_file_size": 0,
            "diff_url": "https://github.com/adobe-type-tools/afdko/commit/0b74668130b33644d994ba251ada7ba0f83cf77d.diff",
            "exists": true,
            "files": [
                {
                    "file_additions": 4,
                    "file_deletions": 1,
                    "file_exists": false,
                    "file_name": "c/public/lib/source/cffwrite/cffwrite_t2cstr.c",
                    "file_size": 0
                }
            ],
            "interesting": {
                "reopen": false,
                "status": false
            },
            "is_parent": false,
            "sha": "0b74668130b33644d994ba251ada7ba0f83cf77d"
        },
        {
            "associated_pull_request": [],
            "date": "2019-03-04 07:43:35+00:00",
            "diff": "adobe-type-tools_afdko/issue_684/commit_2f5a69119be6f26d85dc932e6c4b81f44a9ba3b9.diff",
            "diff_additions": 4,
            "diff_deletions": 1,
            "diff_file_size": 0,
            "diff_url": "https://github.com/adobe-type-tools/afdko/commit/2f5a69119be6f26d85dc932e6c4b81f44a9ba3b9.diff",
            "exists": true,
            "files": [
                {
                    "file_additions": 4,
                    "file_deletions": 1,
                    "file_exists": false,
                    "file_name": "c/public/lib/source/cffwrite/cffwrite_t2cstr.c",
                    "file_size": 0
                }
            ],
            "interesting": {
                "reopen": false,
                "status": false
            },
            "is_parent": false,
            "sha": "2f5a69119be6f26d85dc932e6c4b81f44a9ba3b9"
        },
        {
            "associated_pull_request": [],
            "date": "2019-03-04 07:43:35+00:00",
            "diff": "adobe-type-tools_afdko/issue_684/commit_b43133b3acd1ef9847f8e23fcbe0c57a45474858.diff",
            "diff_additions": 4,
            "diff_deletions": 1,
            "diff_file_size": 0,
            "diff_url": "https://github.com/adobe-type-tools/afdko/commit/b43133b3acd1ef9847f8e23fcbe0c57a45474858.diff",
            "exists": true,
            "files": [
                {
                    "file_additions": 4,
                    "file_deletions": 1,
                    "file_exists": false,
                    "file_name": "c/public/lib/source/cffwrite/cffwrite_t2cstr.c",
                    "file_size": 0
                }
            ],
            "interesting": {
                "reopen": false,
                "status": false
            },
            "is_parent": false,
            "sha": "b43133b3acd1ef9847f8e23fcbe0c57a45474858"
        }
    ],
    "first_commit": "2018-11-30 00:14:36+00:00",
    "last_commit": "2019-03-06 07:24:34+00:00",
    "number": 684,
    "pull_request": "None",
    "score": {
        "accidental_reopen_likely": false,
        "all_labels": [
            "tx",
            "c-tools"
        ],
        "contains_keywords": [
            "work",
            "fail",
            "fix",
            "issu",
            "test",
            "fault",
            "error",
            "problem"
        ],
        "fix_size": 54,
        "has_labels": [],
        "intersecting": {
            "computed_score": 1.0,
            "final_commit_size": 5,
            "intersection_size": 5,
            "previous_commits_size": 54
        },
        "is_makefile_based": true,
        "no_new_files": [],
        "no_other_files": false,
        "num_prohibited_files": 346992,
        "prohibited_files": [
            "server/src/main/java/com/genymobile/scrcpy/Device.java",
            "server/src/main/java/com/genymobile/scrcpy/wrappers/SurfaceControl.java",
            "server/src/main/java/com/genymobile/scrcpy/Device.java",
            "server/src/main/java/com/genymobile/scrcpy/wrappers/SurfaceControl.java",
            "app/meson.build",
            "app/scrcpy.1",
            "app/src/common.h",
            "app/src/scrcpy.h",
            "app/src/server.h",
            "server/src/main/java/com/genymobile/scrcpy/Workarounds.java"
        ],
        "reopen": true,
        "reopen_events": [
            [
                "2018-12-01 00:38:49+00:00",
                "commit"
            ],
            [
                "2018-12-18 18:12:28+00:00",
                "closed"
            ],
            [
                "2018-12-18 18:12:28+00:00",
                "commit"
            ],
            [
                "2019-03-04 17:26:53+00:00",
                "reopened"
            ],
            [
                "2019-03-05 03:18:45+00:00",
                "commit"
            ],
            [
                "2019-03-05 03:18:45+00:00",
                "commit"
            ],
            [
                "2019-03-05 03:45:14+00:00",
                "commit"
            ],
            [
                "2019-03-06 05:23:45+00:00",
                "commit"
            ],
            [
                "2019-03-06 05:23:45+00:00",
                "commit"
            ],
            [
                "2019-03-06 06:11:11+00:00",
                "commit"
            ],
            [
                "2019-03-06 07:25:10+00:00",
                "closed"
            ],
            [
                "2019-03-06 07:25:10+00:00",
                "commit"
            ],
            [
                "2019-03-06 07:25:10+00:00",
                "commit"
            ]
        ],
        "status": false,
        "strategy": true,
        "total_changes": 116
    }
}