{
    "covered_issues": [
        53,
        50,
        48,
        47,
        45,
        44,
        43,
        42,
        41,
        40,
        39,
        38,
        37,
        36,
        35,
        33,
        32,
        31,
        30,
        29,
        28,
        27,
        26,
        25,
        24,
        23,
        22,
        20,
        19,
        18,
        17,
        16,
        15,
        14,
        13,
        11,
        10,
        9,
        8,
        7,
        6,
        5,
        4,
        3
    ],
    "finished": true
}