{
    "commits": [
        {
            "associated_pull_request": [],
            "date": "2016-07-19 03:10:25+00:00",
            "diff": "elementsproject_lightning/issue_29/commit_6199b886fa07f14b36aa8fd832f66ac080fec6f9.diff",
            "diff_additions": 5,
            "diff_deletions": 10,
            "diff_file_size": 0,
            "diff_url": "https://github.com/ElementsProject/lightning/commit/6199b886fa07f14b36aa8fd832f66ac080fec6f9.diff",
            "exists": true,
            "files": [
                {
                    "file_additions": 3,
                    "file_deletions": 7,
                    "file_exists": false,
                    "file_name": "daemon/secrets.c",
                    "file_size": 0
                },
                {
                    "file_additions": 2,
                    "file_deletions": 3,
                    "file_exists": false,
                    "file_name": "daemon/wallet.c",
                    "file_size": 0
                }
            ],
            "interesting": {
                "reopen": false,
                "status": false
            },
            "is_parent": true,
            "sha": "6199b886fa07f14b36aa8fd832f66ac080fec6f9"
        },
        {
            "associated_pull_request": [],
            "date": "2016-07-19 06:30:38+00:00",
            "diff": "elementsproject_lightning/issue_29/commit_e90bba317be5d2dfe3544c31139f060085cda320.diff",
            "diff_additions": 23,
            "diff_deletions": 26,
            "diff_file_size": 0,
            "diff_url": "https://github.com/ElementsProject/lightning/commit/e90bba317be5d2dfe3544c31139f060085cda320.diff",
            "exists": true,
            "files": [
                {
                    "file_additions": 23,
                    "file_deletions": 26,
                    "file_exists": false,
                    "file_name": "daemon/peer.c",
                    "file_size": 0
                }
            ],
            "interesting": {
                "reopen": true,
                "status": false
            },
            "is_parent": false,
            "sha": "e90bba317be5d2dfe3544c31139f060085cda320"
        },
        {
            "associated_pull_request": [],
            "date": "2016-11-08 10:59:04+00:00",
            "diff": "elementsproject_lightning/issue_29/commit_bd1cdf6a4012be76a0fb1296ca0fe2ce745b4734.diff",
            "diff_additions": 4,
            "diff_deletions": 0,
            "diff_file_size": 0,
            "diff_url": "https://github.com/ElementsProject/lightning/commit/bd1cdf6a4012be76a0fb1296ca0fe2ce745b4734.diff",
            "exists": true,
            "files": [
                {
                    "file_additions": 4,
                    "file_deletions": 0,
                    "file_exists": false,
                    "file_name": "daemon/peer.c",
                    "file_size": 0
                }
            ],
            "interesting": {
                "reopen": false,
                "status": false
            },
            "is_parent": false,
            "sha": "bd1cdf6a4012be76a0fb1296ca0fe2ce745b4734"
        },
        {
            "associated_pull_request": [
                "https://github.com/ElementsProject/lightning/pull/78"
            ],
            "date": "2016-11-08 11:29:55+00:00",
            "diff": "elementsproject_lightning/issue_29/commit_4151537b7169b0c56032a62c2369fec5ac3f1737.diff",
            "diff_additions": 4,
            "diff_deletions": 0,
            "diff_file_size": 0,
            "diff_url": "https://github.com/ElementsProject/lightning/commit/4151537b7169b0c56032a62c2369fec5ac3f1737.diff",
            "exists": true,
            "files": [
                {
                    "file_additions": 4,
                    "file_deletions": 0,
                    "file_exists": false,
                    "file_name": "daemon/peer.c",
                    "file_size": 0
                }
            ],
            "interesting": {
                "reopen": false,
                "status": false
            },
            "is_parent": false,
            "sha": "4151537b7169b0c56032a62c2369fec5ac3f1737"
        },
        {
            "associated_pull_request": [
                "https://github.com/ElementsProject/lightning/pull/78"
            ],
            "date": "2016-11-08 11:29:55+00:00",
            "diff": "elementsproject_lightning/issue_29/commit_4151537b7169b0c56032a62c2369fec5ac3f1737.diff",
            "diff_additions": 4,
            "diff_deletions": 0,
            "diff_file_size": 0,
            "diff_url": "https://github.com/ElementsProject/lightning/commit/4151537b7169b0c56032a62c2369fec5ac3f1737.diff",
            "exists": true,
            "files": [
                {
                    "file_additions": 4,
                    "file_deletions": 0,
                    "file_exists": false,
                    "file_name": "daemon/peer.c",
                    "file_size": 0
                }
            ],
            "interesting": {
                "reopen": false,
                "status": false
            },
            "is_parent": false,
            "sha": "4151537b7169b0c56032a62c2369fec5ac3f1737"
        },
        {
            "associated_pull_request": [],
            "date": "2019-01-15 05:52:05+00:00",
            "diff": "elementsproject_lightning/issue_29/commit_ae1a2705266b36c6611eecf4541b0c6608f8cb02.diff",
            "diff_additions": 37,
            "diff_deletions": 16,
            "diff_file_size": 38245,
            "diff_url": "https://github.com/ElementsProject/lightning/commit/ae1a2705266b36c6611eecf4541b0c6608f8cb02.diff",
            "exists": true,
            "files": [
                {
                    "file_additions": 37,
                    "file_deletions": 16,
                    "file_exists": true,
                    "file_name": "gossipd/gossipd.c",
                    "file_size": 38245
                }
            ],
            "interesting": {
                "reopen": false,
                "status": false
            },
            "is_parent": false,
            "sha": "ae1a2705266b36c6611eecf4541b0c6608f8cb02"
        },
        {
            "associated_pull_request": [],
            "date": "2019-01-15 09:37:57+00:00",
            "diff": "elementsproject_lightning/issue_29/commit_2ffaa46aeeeabbebe5c2999180f629766a4e915a.diff",
            "diff_additions": 44,
            "diff_deletions": 16,
            "diff_file_size": 38245,
            "diff_url": "https://github.com/ElementsProject/lightning/commit/2ffaa46aeeeabbebe5c2999180f629766a4e915a.diff",
            "exists": true,
            "files": [
                {
                    "file_additions": 44,
                    "file_deletions": 16,
                    "file_exists": true,
                    "file_name": "gossipd/gossipd.c",
                    "file_size": 38245
                }
            ],
            "interesting": {
                "reopen": false,
                "status": false
            },
            "is_parent": false,
            "sha": "2ffaa46aeeeabbebe5c2999180f629766a4e915a"
        },
        {
            "associated_pull_request": [],
            "date": "2019-01-15 09:37:57+00:00",
            "diff": "elementsproject_lightning/issue_29/commit_72ce63e592c28ca7488d7a78335a58c99419cdab.diff",
            "diff_additions": 44,
            "diff_deletions": 16,
            "diff_file_size": 38245,
            "diff_url": "https://github.com/ElementsProject/lightning/commit/72ce63e592c28ca7488d7a78335a58c99419cdab.diff",
            "exists": true,
            "files": [
                {
                    "file_additions": 44,
                    "file_deletions": 16,
                    "file_exists": true,
                    "file_name": "gossipd/gossipd.c",
                    "file_size": 38245
                }
            ],
            "interesting": {
                "reopen": false,
                "status": false
            },
            "is_parent": false,
            "sha": "72ce63e592c28ca7488d7a78335a58c99419cdab"
        },
        {
            "associated_pull_request": [
                "https://github.com/ElementsProject/lightning/pull/2268"
            ],
            "date": "2019-01-15 09:37:57+00:00",
            "diff": "elementsproject_lightning/issue_29/commit_e81f61b319b84ab248d8ca5c65cbc2176714f737.diff",
            "diff_additions": 44,
            "diff_deletions": 16,
            "diff_file_size": 38245,
            "diff_url": "https://github.com/ElementsProject/lightning/commit/e81f61b319b84ab248d8ca5c65cbc2176714f737.diff",
            "exists": true,
            "files": [
                {
                    "file_additions": 44,
                    "file_deletions": 16,
                    "file_exists": true,
                    "file_name": "gossipd/gossipd.c",
                    "file_size": 38245
                }
            ],
            "interesting": {
                "reopen": false,
                "status": false
            },
            "is_parent": false,
            "sha": "e81f61b319b84ab248d8ca5c65cbc2176714f737"
        },
        {
            "associated_pull_request": [
                "https://github.com/ElementsProject/lightning/pull/2268"
            ],
            "date": "2019-01-15 09:37:57+00:00",
            "diff": "elementsproject_lightning/issue_29/commit_0ba547ee101efe7c5b14a7fbcf41b5088efc2504.diff",
            "diff_additions": 44,
            "diff_deletions": 16,
            "diff_file_size": 38245,
            "diff_url": "https://github.com/ElementsProject/lightning/commit/0ba547ee101efe7c5b14a7fbcf41b5088efc2504.diff",
            "exists": true,
            "files": [
                {
                    "file_additions": 44,
                    "file_deletions": 16,
                    "file_exists": true,
                    "file_name": "gossipd/gossipd.c",
                    "file_size": 38245
                }
            ],
            "interesting": {
                "reopen": false,
                "status": false
            },
            "is_parent": false,
            "sha": "0ba547ee101efe7c5b14a7fbcf41b5088efc2504"
        },
        {
            "associated_pull_request": [],
            "date": "2019-01-15 09:37:57+00:00",
            "diff": "elementsproject_lightning/issue_29/commit_36bfe3a4e06d08ca874343eea584be88dc68b97a.diff",
            "diff_additions": 44,
            "diff_deletions": 16,
            "diff_file_size": 38245,
            "diff_url": "https://github.com/ElementsProject/lightning/commit/36bfe3a4e06d08ca874343eea584be88dc68b97a.diff",
            "exists": true,
            "files": [
                {
                    "file_additions": 44,
                    "file_deletions": 16,
                    "file_exists": true,
                    "file_name": "gossipd/gossipd.c",
                    "file_size": 38245
                }
            ],
            "interesting": {
                "reopen": false,
                "status": false
            },
            "is_parent": false,
            "sha": "36bfe3a4e06d08ca874343eea584be88dc68b97a"
        },
        {
            "associated_pull_request": [],
            "date": "2019-01-15 09:37:57+00:00",
            "diff": "elementsproject_lightning/issue_29/commit_8ad3cd01dfb051246873ace608866fa080d4bcba.diff",
            "diff_additions": 44,
            "diff_deletions": 16,
            "diff_file_size": 38245,
            "diff_url": "https://github.com/ElementsProject/lightning/commit/8ad3cd01dfb051246873ace608866fa080d4bcba.diff",
            "exists": true,
            "files": [
                {
                    "file_additions": 44,
                    "file_deletions": 16,
                    "file_exists": true,
                    "file_name": "gossipd/gossipd.c",
                    "file_size": 38245
                }
            ],
            "interesting": {
                "reopen": false,
                "status": false
            },
            "is_parent": false,
            "sha": "8ad3cd01dfb051246873ace608866fa080d4bcba"
        },
        {
            "associated_pull_request": [],
            "date": "2019-01-15 09:37:57+00:00",
            "diff": "elementsproject_lightning/issue_29/commit_846c60cd0872de7ece362d9a76aabb46315158f1.diff",
            "diff_additions": 44,
            "diff_deletions": 16,
            "diff_file_size": 38245,
            "diff_url": "https://github.com/ElementsProject/lightning/commit/846c60cd0872de7ece362d9a76aabb46315158f1.diff",
            "exists": true,
            "files": [
                {
                    "file_additions": 44,
                    "file_deletions": 16,
                    "file_exists": true,
                    "file_name": "gossipd/gossipd.c",
                    "file_size": 38245
                }
            ],
            "interesting": {
                "reopen": false,
                "status": false
            },
            "is_parent": false,
            "sha": "846c60cd0872de7ece362d9a76aabb46315158f1"
        }
    ],
    "first_commit": "2016-07-19 03:10:25+00:00",
    "last_commit": "2019-02-15 06:28:46+00:00",
    "number": 29,
    "pull_request": "None",
    "score": {
        "accidental_reopen_likely": false,
        "all_labels": [],
        "contains_keywords": [
            "fail",
            "chang",
            "fix",
            "issu",
            "test",
            "bug",
            "problem",
            "report"
        ],
        "fix_size": 115,
        "has_labels": [],
        "intersecting": {
            "computed_score": 1.0,
            "final_commit_size": 58,
            "intersection_size": 58,
            "previous_commits_size": 115
        },
        "is_makefile_based": true,
        "no_new_files": [],
        "no_other_files": false,
        "num_prohibited_files": 560128,
        "prohibited_files": [
            "server/src/main/java/com/genymobile/scrcpy/Device.java",
            "server/src/main/java/com/genymobile/scrcpy/wrappers/SurfaceControl.java",
            "server/src/main/java/com/genymobile/scrcpy/Device.java",
            "server/src/main/java/com/genymobile/scrcpy/wrappers/SurfaceControl.java",
            "app/meson.build",
            "app/scrcpy.1",
            "app/src/common.h",
            "app/src/scrcpy.h",
            "app/src/server.h",
            "server/src/main/java/com/genymobile/scrcpy/Workarounds.java"
        ],
        "reopen": true,
        "reopen_events": [
            [
                "2016-07-19 06:32:16+00:00",
                "commit"
            ],
            [
                "2016-07-20 02:17:36+00:00",
                "commit"
            ],
            [
                "2016-10-31 01:04:44+00:00",
                "closed"
            ],
            [
                "2016-11-04 03:48:43+00:00",
                "reopened"
            ],
            [
                "2016-11-08 11:00:17+00:00",
                "commit"
            ],
            [
                "2016-11-08 21:24:47+00:00",
                "commit"
            ],
            [
                "2016-11-08 21:25:35+00:00",
                "closed"
            ],
            [
                "2016-11-08 21:25:35+00:00",
                "commit"
            ],
            [
                "2019-01-15 05:52:29+00:00",
                "commit"
            ],
            [
                "2019-01-15 09:40:01+00:00",
                "commit"
            ],
            [
                "2019-01-15 16:49:58+00:00",
                "commit"
            ],
            [
                "2019-01-15 17:13:20+00:00",
                "commit"
            ],
            [
                "2019-01-15 19:34:53+00:00",
                "commit"
            ],
            [
                "2019-01-17 09:45:25+00:00",
                "commit"
            ],
            [
                "2019-01-18 19:33:28+00:00",
                "commit"
            ],
            [
                "2019-02-15 07:10:12+00:00",
                "commit"
            ]
        ],
        "status": false,
        "strategy": true,
        "total_changes": 549
    }
}