{
    "category": [
        "hardware/OS",
        "GUI"
    ],
    "commits": [
        {
            "associated_pull_request": [],
            "date": "2018-03-03 21:21:53",
            "diff": "syslog-ng_syslog-ng/issue_1936/commit_fd518c93c7acd39d8e1666bbafdee34e0142a1cb.diff",
            "diff_additions": 1,
            "diff_deletions": 1,
            "diff_file_size": 19894,
            "diff_url": "https://github.com/syslog-ng/syslog-ng/commit/fd518c93c7acd39d8e1666bbafdee34e0142a1cb.diff",
            "exists": true,
            "files": [
                {
                    "file_additions": 1,
                    "file_deletions": 1,
                    "file_exists": true,
                    "file_name": "lib/mainloop.c",
                    "file_size": 19894
                }
            ],
            "interesting": {
                "reopen": false,
                "status": true
            },
            "is_parent": true,
            "sha": "fd518c93c7acd39d8e1666bbafdee34e0142a1cb"
        },
        {
            "associated_pull_request": [],
            "date": "2018-03-23 05:51:46",
            "diff": "syslog-ng_syslog-ng/issue_1936/commit_01344d7c68c385693007cf64cb28900db2fdbb04.diff",
            "diff_additions": 4,
            "diff_deletions": 1,
            "diff_file_size": 33040,
            "diff_url": "https://github.com/syslog-ng/syslog-ng/commit/01344d7c68c385693007cf64cb28900db2fdbb04.diff",
            "exists": true,
            "files": [
                {
                    "file_additions": 4,
                    "file_deletions": 1,
                    "file_exists": true,
                    "file_name": "lib/tlscontext.c",
                    "file_size": 33040
                }
            ],
            "interesting": {
                "reopen": false,
                "status": true
            },
            "is_parent": false,
            "sha": "01344d7c68c385693007cf64cb28900db2fdbb04"
        },
        {
            "associated_pull_request": [
                "https://github.com/syslog-ng/syslog-ng/pull/2000"
            ],
            "date": "2018-03-23 05:51:46",
            "diff": "syslog-ng_syslog-ng/issue_1936/commit_7601cfb4e1eb80db86e38a16ce7a84a458e0d263.diff",
            "diff_additions": 4,
            "diff_deletions": 1,
            "diff_file_size": 33040,
            "diff_url": "https://github.com/syslog-ng/syslog-ng/commit/7601cfb4e1eb80db86e38a16ce7a84a458e0d263.diff",
            "exists": true,
            "files": [
                {
                    "file_additions": 4,
                    "file_deletions": 1,
                    "file_exists": true,
                    "file_name": "lib/tlscontext.c",
                    "file_size": 33040
                }
            ],
            "interesting": {
                "reopen": false,
                "status": false
            },
            "is_parent": false,
            "sha": "7601cfb4e1eb80db86e38a16ce7a84a458e0d263"
        }
    ],
    "first_commit": "2018-03-23 04:17:15",
    "last_commit": "2018-04-21 13:04:16",
    "number": 1936,
    "pull_request": "None",
    "score": {
        "accidental_reopen_likely": false,
        "all_labels": [],
        "contains_keywords": [
            "fail",
            "report",
            "bug",
            "test",
            "fix",
            "patch",
            "issu"
        ],
        "fix_size": 9,
        "has_labels": [],
        "intersecting": {
            "computed_score": 0.2,
            "final_commit_size": 5,
            "intersection_size": 1,
            "previous_commits_size": 5
        },
        "is_makefile_based": true,
        "no_new_files": [],
        "no_other_files": true,
        "num_prohibited_files": 32196,
        "prohibited_files": [
            "hal/inc/pinmap_hal.h",
            "Debug/marvin.bin",
            "Debug/marvin.elf",
            "Debug/marvin.hex",
            "Debug/marvin.bin",
            "Debug/marvin.elf",
            "Debug/marvin.hex",
            "inc/spark_utilities.h",
            "Debug/marvin.bin",
            "Debug/marvin.elf"
        ],
        "reopen": false,
        "reopen_events": [
            [
                "2018-03-23 05:54:07",
                "commit"
            ],
            [
                "2018-04-21 12:04:08",
                "commit"
            ],
            [
                "2018-04-21 13:04:26",
                "commit"
            ],
            [
                "2018-04-24 08:54:08",
                "closed"
            ]
        ],
        "status": true,
        "strategy": true,
        "total_changes": 12
    }
}