{
    "covered_issues": [
        107,
        103,
        98,
        91,
        83,
        66,
        55,
        51,
        50,
        42,
        37,
        36,
        35,
        29,
        28,
        27,
        26,
        24,
        22,
        21,
        17,
        16,
        14,
        12,
        11,
        9,
        8,
        6,
        5,
        4,
        3,
        2,
        1
    ],
    "finished": true
}