{
    "covered_issues": [
        299,
        290,
        289,
        288,
        287,
        285,
        283,
        279,
        275,
        274,
        272,
        271,
        270,
        269,
        266,
        264,
        262,
        261,
        259,
        253,
        251,
        245,
        241,
        238,
        233,
        232,
        230,
        228,
        225,
        223,
        221,
        220,
        215,
        214,
        213,
        209,
        204,
        196,
        195,
        194,
        193,
        189,
        187,
        185,
        184,
        178,
        172,
        168,
        167,
        166,
        163,
        161,
        160,
        159,
        158,
        156,
        152,
        150,
        149,
        145,
        143,
        142,
        141,
        140,
        138,
        137,
        132,
        128,
        125,
        109,
        104,
        100,
        99,
        98,
        97,
        94,
        90,
        89,
        87,
        84,
        80,
        79,
        78,
        75,
        74,
        66,
        65,
        63,
        62,
        61,
        59,
        58,
        57,
        56,
        54,
        52,
        51,
        47,
        46,
        45,
        43,
        42,
        41,
        38,
        35,
        34,
        33,
        31,
        28,
        27,
        22,
        20,
        18,
        15,
        10,
        8,
        7,
        1
    ],
    "finished": true
}