{
    "covered_issues": [
        605,
        604,
        603,
        602,
        601,
        600,
        599,
        598,
        596,
        595,
        594,
        592,
        591,
        590,
        589,
        588,
        587,
        586,
        585,
        584,
        583,
        582,
        581,
        580,
        579,
        576,
        575,
        574,
        572,
        571,
        570,
        569,
        568,
        567,
        566,
        565,
        564,
        563,
        562,
        561,
        560,
        559,
        558,
        557,
        556,
        555,
        554,
        553,
        551,
        549,
        546,
        545,
        543,
        542,
        540,
        539,
        538,
        537,
        536,
        535,
        533,
        532,
        531,
        530,
        529,
        528,
        527,
        526,
        525,
        523,
        522,
        521,
        519,
        518,
        517,
        516,
        515,
        514,
        512,
        510,
        509,
        508,
        507,
        506,
        505,
        504,
        503,
        502,
        501,
        500,
        499,
        498,
        497,
        496,
        495,
        494,
        493,
        492,
        491,
        490,
        489,
        488,
        487,
        486,
        485,
        482,
        480,
        479,
        478,
        477,
        476,
        475,
        474,
        473,
        472,
        471,
        469,
        467,
        464,
        462,
        461,
        460,
        459,
        458,
        457,
        456,
        454,
        451,
        450,
        449,
        448,
        447,
        444,
        443,
        442,
        437,
        436,
        435,
        434,
        433,
        432,
        431,
        430,
        429,
        428,
        427,
        426,
        425,
        424,
        423,
        422,
        420,
        419,
        417,
        416,
        415,
        414,
        413,
        411,
        408,
        407,
        406,
        405,
        404,
        403,
        402,
        400,
        399,
        397,
        396,
        395,
        393,
        392,
        391,
        390,
        388,
        387,
        386,
        385,
        384,
        383,
        380,
        378,
        377,
        376,
        374,
        373,
        372,
        371,
        370,
        369,
        368,
        367,
        366,
        365,
        364,
        363,
        361,
        360,
        359,
        356,
        354,
        353,
        352,
        351,
        350,
        348,
        347,
        346,
        345,
        344,
        343,
        342,
        341,
        340,
        339,
        338,
        337,
        336,
        335,
        332,
        331,
        329,
        327,
        326,
        325,
        324,
        323,
        322,
        318,
        317,
        316,
        315,
        314,
        313,
        312,
        311,
        310,
        309,
        308,
        307,
        306,
        305,
        303,
        302,
        301,
        300,
        299,
        298,
        297,
        296,
        295,
        294,
        293,
        292,
        291,
        290,
        288,
        287,
        286,
        285,
        284,
        282,
        280,
        279,
        278,
        277,
        275,
        274,
        273,
        272,
        271,
        270,
        269,
        268,
        267,
        266,
        265,
        264,
        263,
        262,
        261,
        260,
        259,
        258,
        257,
        256,
        255,
        253,
        252,
        251,
        250,
        249,
        248,
        246,
        245,
        243,
        242,
        241,
        240,
        239,
        238,
        237,
        236,
        235,
        234,
        233,
        232,
        231,
        230,
        229,
        228,
        227,
        223,
        221,
        220,
        219,
        218,
        217,
        216,
        215,
        214,
        213,
        212,
        210,
        209,
        208,
        207,
        205,
        204,
        199,
        198,
        197,
        196,
        195,
        192,
        191,
        189,
        188,
        187,
        186,
        185,
        184,
        182,
        181,
        180,
        179,
        178,
        177,
        176,
        174,
        173,
        171,
        170,
        169,
        168,
        166,
        165,
        163,
        162,
        160,
        159,
        158,
        157,
        156,
        155,
        154,
        153,
        152,
        151,
        148,
        146,
        145,
        144,
        142,
        141,
        140,
        139,
        136,
        135,
        133,
        132,
        131,
        130,
        129,
        128,
        124,
        123,
        122,
        120,
        119,
        117,
        116,
        115,
        110,
        109,
        108,
        107,
        106,
        105,
        103,
        102,
        99,
        98,
        97,
        94,
        93,
        92,
        88,
        86,
        85,
        82,
        81,
        80,
        79,
        76,
        74,
        72,
        71,
        70,
        69,
        68,
        65,
        61,
        60,
        59,
        58,
        57,
        56,
        55,
        54,
        53,
        52,
        51,
        50,
        49,
        48,
        47,
        46,
        45,
        44,
        43,
        40,
        39,
        36,
        35,
        34,
        32,
        31,
        28,
        26,
        23,
        22,
        21,
        20,
        19,
        18,
        17,
        16,
        14,
        13,
        12,
        11,
        9,
        8,
        7,
        6,
        5,
        4,
        2,
        497,
        205,
        306,
        198,
        110,
        388,
        215,
        538,
        180,
        498,
        223,
        220,
        501,
        519,
        235,
        221,
        302,
        422,
        529,
        497,
        205,
        306,
        198,
        110,
        388,
        215,
        538,
        180,
        498,
        223,
        220,
        501,
        519,
        235,
        221,
        302,
        422,
        529
    ],
    "finished": true
}