{
    "covered_issues": [
        241,
        238,
        237,
        227,
        222,
        221,
        220,
        219,
        213,
        212,
        211,
        207,
        204,
        203,
        202,
        199,
        190,
        185,
        184,
        183,
        182,
        181,
        180,
        179,
        177,
        176,
        174,
        171,
        170,
        169,
        163,
        161,
        160,
        158,
        157,
        156,
        155,
        154,
        153,
        152,
        151,
        149,
        148,
        146,
        145,
        144,
        143,
        142,
        141,
        140,
        137,
        136,
        135,
        134,
        133,
        131,
        129,
        128,
        127,
        126,
        125,
        122,
        121,
        120,
        119,
        118,
        117,
        116,
        115,
        114,
        110,
        109,
        108,
        106,
        105,
        102,
        101,
        100,
        96,
        93,
        92,
        91,
        90,
        89,
        88,
        87,
        86,
        85,
        84,
        82,
        81,
        80,
        79,
        78,
        77,
        76,
        75,
        74,
        73,
        70,
        67,
        66,
        63,
        61,
        60,
        59,
        57,
        55,
        52,
        51,
        50,
        49,
        47,
        44,
        42,
        40,
        38,
        37,
        36,
        34,
        33,
        32,
        31,
        30,
        29,
        28,
        27,
        26,
        25,
        24,
        23,
        22,
        21,
        20,
        19,
        18,
        17,
        16,
        15,
        14,
        12,
        11,
        8,
        7,
        6,
        5,
        4,
        3,
        2,
        1
    ],
    "finished": true
}