{
    "covered_issues": [
        356,
        348,
        346,
        344,
        343,
        342,
        341,
        338,
        334,
        332,
        331,
        330,
        325,
        323,
        321,
        319,
        318,
        316,
        315,
        314,
        312,
        311,
        309,
        308,
        306,
        305,
        304,
        303,
        302,
        301,
        300,
        299,
        298,
        296,
        295,
        294,
        293,
        292,
        291,
        290,
        289,
        288,
        287,
        286,
        285,
        284,
        283,
        282,
        281,
        279,
        278,
        277,
        276,
        275,
        274,
        273,
        272,
        271,
        270,
        269,
        268,
        267,
        266,
        265,
        264,
        263,
        262,
        254,
        253,
        252,
        251,
        250,
        249,
        248,
        247,
        246,
        245,
        244,
        242,
        241,
        240,
        239,
        238,
        237,
        236,
        235,
        233,
        232,
        231,
        230,
        229,
        228,
        227,
        226,
        225,
        223,
        221,
        219,
        218,
        217,
        216,
        215,
        214,
        213,
        212,
        211,
        210,
        209,
        206,
        205,
        204,
        203,
        202,
        201,
        200,
        199,
        198,
        197,
        196,
        195,
        194,
        193,
        192,
        191,
        190,
        189,
        188,
        187,
        185,
        184,
        183,
        182,
        181,
        180,
        179,
        178,
        177,
        176,
        175,
        174,
        172,
        171,
        170,
        169,
        168,
        167,
        166,
        165,
        164,
        163,
        162,
        160,
        156,
        154,
        153,
        152,
        151,
        150,
        149,
        148,
        147,
        146,
        145,
        144,
        143,
        141,
        139,
        137,
        136,
        135,
        134,
        133,
        132,
        131,
        130,
        129,
        128,
        127,
        126,
        125,
        124,
        123,
        122,
        121,
        120,
        119,
        118,
        117,
        116,
        115,
        114,
        113,
        112,
        111,
        110,
        109,
        108,
        107,
        106,
        105,
        104,
        103,
        102,
        101,
        100,
        99,
        98,
        97,
        96,
        95,
        94,
        93,
        92,
        91,
        90,
        89,
        88,
        86,
        84,
        83,
        82,
        81,
        80,
        78,
        77,
        76,
        75,
        74,
        73,
        72,
        71,
        68,
        66,
        65,
        64,
        63,
        62,
        61,
        57,
        56,
        55,
        54,
        53,
        52,
        51,
        50,
        49,
        48,
        47,
        46,
        45,
        44,
        43,
        42,
        41,
        40,
        39,
        38,
        34,
        33,
        32,
        31,
        30,
        29,
        28,
        27,
        26,
        25,
        24,
        23,
        22,
        21,
        20,
        19,
        18,
        17,
        15,
        14,
        13,
        12,
        11,
        9,
        8,
        7,
        6,
        5,
        4,
        3,
        2,
        1
    ],
    "finished": true
}