{
    "all_issues": 3612,
    "interesting_issues": 29,
    "last_update": "2021-05-16 11:01:11.270586",
    "license": {
        "download": "https://raw.githubusercontent.com/varnishcache/varnish-cache/master/LICENSE",
        "name": "Other"
    },
    "ratio": 0.008028792912513842,
    "size": 30825,
    "stars": 2551,
    "url": "https://github.com/varnishcache/varnish-cache"
}