{
    "covered_issues": [
        422,
        416,
        415,
        414,
        409,
        402,
        401,
        399,
        393,
        388,
        387,
        385,
        383,
        382,
        381,
        380,
        378,
        377,
        376,
        375,
        373,
        370,
        367,
        365,
        364,
        361,
        358,
        357,
        356,
        354,
        353,
        352,
        351,
        350,
        347,
        345,
        344,
        343,
        341,
        340,
        339,
        338,
        337,
        336,
        335,
        334,
        333,
        331,
        329,
        327,
        326,
        325,
        322,
        321,
        320,
        319,
        318,
        315,
        313,
        312,
        310,
        308,
        307,
        306,
        305,
        304,
        303,
        302,
        301,
        297,
        294,
        293,
        291,
        289,
        288,
        285,
        284,
        283,
        282,
        281,
        280,
        279,
        277,
        276,
        275,
        274,
        273,
        272,
        271,
        270,
        269,
        266,
        265,
        263,
        260,
        259,
        256,
        255,
        253,
        252,
        250,
        249,
        248,
        247,
        245,
        244,
        243,
        241,
        240,
        239,
        238,
        237,
        236,
        235,
        233,
        232,
        231,
        230,
        229,
        228,
        226,
        225,
        224,
        223,
        221,
        220,
        219,
        218,
        217,
        216,
        215,
        214,
        213,
        212,
        211,
        210,
        209,
        208,
        207,
        206,
        205,
        204,
        203,
        202,
        201,
        200,
        199,
        198,
        197,
        196,
        195,
        193,
        192,
        191,
        190,
        189,
        188,
        187,
        186,
        185,
        184,
        182,
        180,
        179,
        178,
        177,
        176,
        175,
        174,
        173,
        172,
        171,
        170,
        168,
        167,
        166,
        165,
        164,
        163,
        162,
        161,
        157,
        155,
        154,
        153,
        152,
        151,
        150,
        149,
        148,
        147,
        143,
        142,
        141,
        140,
        139,
        138,
        137,
        136,
        135,
        134,
        133,
        132,
        131,
        130,
        128,
        127,
        126,
        125,
        123,
        122,
        121,
        120,
        118,
        117,
        114,
        112,
        109,
        107,
        106,
        105,
        103,
        101,
        96,
        95,
        94,
        92,
        91,
        90,
        89,
        88,
        87,
        86,
        85,
        84,
        83,
        81,
        79,
        77,
        75,
        74,
        73,
        72,
        71,
        70,
        69,
        68,
        67,
        66,
        65,
        64,
        63,
        61,
        59,
        55,
        54,
        53,
        52,
        51,
        49,
        48,
        47,
        46,
        45,
        44,
        43,
        42,
        41,
        40,
        39,
        38,
        37,
        36,
        35,
        34,
        33,
        32,
        30,
        28,
        27,
        25,
        24,
        23,
        22,
        21,
        20,
        19,
        18,
        17,
        16,
        15,
        13,
        10,
        9,
        8,
        7,
        6,
        5,
        4,
        2,
        1,
        44,
        44,
        44,
        44,
        44,
        44
    ],
    "finished": true
}