{
    "covered_issues": [
        754,
        738,
        735,
        734,
        733,
        730,
        727,
        726,
        721,
        720,
        719,
        705,
        687,
        684,
        679,
        675,
        674,
        673,
        666,
        657,
        656,
        654,
        650,
        641,
        633,
        632,
        624,
        623,
        619,
        618,
        613,
        606,
        598,
        593,
        589,
        588,
        586,
        581,
        577,
        573,
        572,
        570,
        569,
        568,
        566,
        562,
        559,
        555,
        550,
        539,
        537,
        534,
        533,
        499,
        497,
        489,
        488,
        482,
        480,
        477,
        476,
        473,
        471,
        467,
        456,
        454,
        435,
        427,
        425,
        424,
        414,
        409,
        400,
        399,
        396,
        395,
        392,
        383,
        381,
        374,
        373,
        371,
        363,
        362,
        361,
        354,
        351,
        349,
        345,
        342,
        335,
        333,
        332,
        329,
        328,
        326,
        325,
        313,
        312,
        311,
        306,
        300,
        294,
        293,
        287,
        282,
        273,
        270,
        260,
        251,
        248,
        247,
        243,
        241,
        240,
        238,
        236,
        233,
        231,
        229,
        227,
        223,
        206,
        201,
        200,
        197,
        188,
        184,
        183,
        182,
        179,
        177,
        176,
        172,
        162,
        161,
        156,
        152,
        147,
        143,
        140,
        139,
        132,
        128,
        127,
        126,
        125,
        120,
        119,
        115,
        109,
        108,
        103,
        101,
        96,
        95,
        93,
        82,
        81,
        80,
        79,
        78,
        76,
        75,
        74,
        71,
        69,
        68,
        66,
        64,
        61,
        60,
        57,
        56,
        54,
        52,
        48,
        47,
        45,
        44,
        43,
        42,
        41,
        39,
        37,
        35,
        25,
        22,
        19,
        18,
        15,
        13,
        12,
        11,
        10,
        9,
        7,
        5,
        3,
        2,
        1,
        42,
        76,
        471,
        42,
        76,
        471
    ],
    "finished": true
}