{
    "covered_issues": [
        45,
        39,
        36,
        32,
        25,
        24,
        20,
        19,
        15,
        13,
        10,
        4,
        2
    ],
    "finished": true
}