{
    "commits": [
        {
            "associated_pull_request": [],
            "date": "2016-07-18 15:36:50+00:00",
            "diff": "coreos_rpm-ostree/issue_392/commit_8dff109133e3c31e18b4e2ba89b1093902f1c04e.diff",
            "diff_additions": 9,
            "diff_deletions": 10,
            "diff_file_size": 0,
            "diff_url": "https://github.com/coreos/rpm-ostree/commit/8dff109133e3c31e18b4e2ba89b1093902f1c04e.diff",
            "exists": true,
            "files": [
                {
                    "file_additions": 2,
                    "file_deletions": 6,
                    "file_exists": false,
                    "file_name": "src/daemon/rpmostreed-deployment-utils.c",
                    "file_size": 0
                },
                {
                    "file_additions": 7,
                    "file_deletions": 4,
                    "file_exists": false,
                    "file_name": "src/daemon/rpmostreed-os.c",
                    "file_size": 0
                }
            ],
            "interesting": {
                "reopen": false,
                "status": false
            },
            "is_parent": true,
            "sha": "8dff109133e3c31e18b4e2ba89b1093902f1c04e"
        },
        {
            "associated_pull_request": [],
            "date": "2016-07-18 16:54:28+00:00",
            "diff": "coreos_rpm-ostree/issue_392/commit_0d03b1cf444f876d7ee0ef79e0f814a92964b00d.diff",
            "diff_additions": 10,
            "diff_deletions": 2,
            "diff_file_size": 0,
            "diff_url": "https://github.com/coreos/rpm-ostree/commit/0d03b1cf444f876d7ee0ef79e0f814a92964b00d.diff",
            "exists": true,
            "files": [
                {
                    "file_additions": 10,
                    "file_deletions": 2,
                    "file_exists": false,
                    "file_name": "src/daemon/rpmostreed-deployment-utils.c",
                    "file_size": 0
                }
            ],
            "interesting": {
                "reopen": false,
                "status": false
            },
            "is_parent": false,
            "sha": "0d03b1cf444f876d7ee0ef79e0f814a92964b00d"
        },
        {
            "associated_pull_request": [],
            "date": "2016-07-21 20:10:10+00:00",
            "diff": "coreos_rpm-ostree/issue_392/commit_a98ecb19db7c985c3da26b0c5ab0b5b993c77abe.diff",
            "diff_additions": 17,
            "diff_deletions": 3,
            "diff_file_size": 0,
            "diff_url": "https://github.com/coreos/rpm-ostree/commit/a98ecb19db7c985c3da26b0c5ab0b5b993c77abe.diff",
            "exists": true,
            "files": [
                {
                    "file_additions": 17,
                    "file_deletions": 3,
                    "file_exists": false,
                    "file_name": "src/daemon/rpmostreed-sysroot.c",
                    "file_size": 0
                }
            ],
            "interesting": {
                "reopen": false,
                "status": false
            },
            "is_parent": false,
            "sha": "a98ecb19db7c985c3da26b0c5ab0b5b993c77abe"
        },
        {
            "associated_pull_request": [],
            "date": "2016-07-21 20:10:10+00:00",
            "diff": "coreos_rpm-ostree/issue_392/commit_d2d0b21bffb2e55ef65273e72a45fe110215b075.diff",
            "diff_additions": 17,
            "diff_deletions": 3,
            "diff_file_size": 0,
            "diff_url": "https://github.com/coreos/rpm-ostree/commit/d2d0b21bffb2e55ef65273e72a45fe110215b075.diff",
            "exists": true,
            "files": [
                {
                    "file_additions": 17,
                    "file_deletions": 3,
                    "file_exists": false,
                    "file_name": "src/daemon/rpmostreed-sysroot.c",
                    "file_size": 0
                }
            ],
            "interesting": {
                "reopen": false,
                "status": false
            },
            "is_parent": false,
            "sha": "d2d0b21bffb2e55ef65273e72a45fe110215b075"
        },
        {
            "associated_pull_request": [],
            "date": "2016-07-21 20:10:10+00:00",
            "diff": "coreos_rpm-ostree/issue_392/commit_d2d0b21bffb2e55ef65273e72a45fe110215b075.diff",
            "diff_additions": 17,
            "diff_deletions": 3,
            "diff_file_size": 0,
            "diff_url": "https://github.com/coreos/rpm-ostree/commit/d2d0b21bffb2e55ef65273e72a45fe110215b075.diff",
            "exists": true,
            "files": [
                {
                    "file_additions": 17,
                    "file_deletions": 3,
                    "file_exists": false,
                    "file_name": "src/daemon/rpmostreed-sysroot.c",
                    "file_size": 0
                }
            ],
            "interesting": {
                "reopen": false,
                "status": false
            },
            "is_parent": false,
            "sha": "d2d0b21bffb2e55ef65273e72a45fe110215b075"
        }
    ],
    "first_commit": "2016-07-18 15:36:50+00:00",
    "last_commit": "2016-07-21 20:44:28+00:00",
    "number": 392,
    "pull_request": "None",
    "score": {
        "accidental_reopen_likely": false,
        "all_labels": [
            "bug"
        ],
        "contains_keywords": [
            "work",
            "chang",
            "fix",
            "bug",
            "error"
        ],
        "fix_size": 30,
        "has_labels": [
            "bug"
        ],
        "intersecting": {
            "computed_score": 1.0,
            "final_commit_size": 19,
            "intersection_size": 19,
            "previous_commits_size": 30
        },
        "is_makefile_based": true,
        "no_new_files": [],
        "no_other_files": true,
        "num_prohibited_files": 425670,
        "prohibited_files": [
            "server/src/main/java/com/genymobile/scrcpy/Device.java",
            "server/src/main/java/com/genymobile/scrcpy/wrappers/SurfaceControl.java",
            "server/src/main/java/com/genymobile/scrcpy/Device.java",
            "server/src/main/java/com/genymobile/scrcpy/wrappers/SurfaceControl.java",
            "app/meson.build",
            "app/scrcpy.1",
            "app/src/common.h",
            "app/src/scrcpy.h",
            "app/src/server.h",
            "server/src/main/java/com/genymobile/scrcpy/Workarounds.java"
        ],
        "reopen": true,
        "reopen_events": [
            [
                "2016-07-18 16:56:33+00:00",
                "commit"
            ],
            [
                "2016-07-18 18:12:31+00:00",
                "commit"
            ],
            [
                "2016-07-18 18:17:16+00:00",
                "closed"
            ],
            [
                "2016-07-18 18:17:16+00:00",
                "commit"
            ],
            [
                "2016-07-20 20:47:42+00:00",
                "reopened"
            ],
            [
                "2016-07-21 20:11:29+00:00",
                "commit"
            ],
            [
                "2016-07-21 20:44:31+00:00",
                "commit"
            ],
            [
                "2016-07-21 20:48:56+00:00",
                "closed"
            ],
            [
                "2016-07-21 20:48:56+00:00",
                "commit"
            ]
        ],
        "status": false,
        "strategy": true,
        "total_changes": 91
    }
}