{
    "all_issues": 643,
    "interesting_issues": 20,
    "last_update": "2023-11-02 10:50:37.180003",
    "license": {
        "download": "https://raw.githubusercontent.com/kevinlawler/kona/master/LICENSE",
        "name": "ISC License"
    },
    "ratio": 0.03110419906687403,
    "size": 2594,
    "stars": 1333,
    "url": "https://github.com/kevinlawler/kona"
}