{
    "commits": [
        {
            "diff": "spring-projects_spring-boot/issue_2525/commit_7b2b11903a7ef01049fe5fca15557c9aaf10b3a4.diff",
            "diff_additions": 99,
            "diff_deletions": 1,
            "diff_file_size": 0,
            "files": [
                {
                    "file_additions": 3,
                    "file_deletions": 0,
                    "file_exists": false,
                    "file_name": "spring-boot/src/main/java/org/springframework/boot/SpringApplication.java",
                    "file_size": 0
                },
                {
                    "file_additions": 52,
                    "file_deletions": 0,
                    "file_exists": false,
                    "file_name": "spring-boot/src/main/java/org/springframework/boot/context/event/ApplicationReadyEvent.java",
                    "file_size": 0
                },
                {
                    "file_additions": 44,
                    "file_deletions": 1,
                    "file_exists": false,
                    "file_name": "spring-boot/src/test/java/org/springframework/boot/SpringApplicationTests.java",
                    "file_size": 0
                }
            ],
            "interesting": {
                "reopened": false,
                "status": false
            },
            "sha": "7b2b11903a7ef01049fe5fca15557c9aaf10b3a4"
        },
        {
            "diff": "spring-projects_spring-boot/issue_2525/commit_04e30c0084fd6f7e7037bd6ef44b4961fb3d8257.diff",
            "diff_additions": 822,
            "diff_deletions": 355,
            "diff_file_size": 0,
            "files": [
                {
                    "file_additions": 56,
                    "file_deletions": 0,
                    "file_exists": false,
                    "file_name": "spring-boot-autoconfigure/src/main/java/org/springframework/boot/autoconfigure/test/SpringApplicationLifecycleAutoConfiguration.java",
                    "file_size": 0
                },
                {
                    "file_additions": 39,
                    "file_deletions": 0,
                    "file_exists": false,
                    "file_name": "spring-boot-autoconfigure/src/main/java/org/springframework/boot/autoconfigure/test/SpringApplicationLifecycleMXBean.java",
                    "file_size": 0
                },
                {
                    "file_additions": 100,
                    "file_deletions": 0,
                    "file_exists": false,
                    "file_name": "spring-boot-autoconfigure/src/main/java/org/springframework/boot/autoconfigure/test/SpringApplicationLifecycleRegistrar.java",
                    "file_size": 0
                },
                {
                    "file_additions": 105,
                    "file_deletions": 0,
                    "file_exists": false,
                    "file_name": "spring-boot-autoconfigure/src/test/java/org/springframework/boot/autoconfigure/test/SpringApplicationLifecycleAutoConfigurationTests.java",
                    "file_size": 0
                },
                {
                    "file_additions": 385,
                    "file_deletions": 0,
                    "file_exists": false,
                    "file_name": "spring-boot-tools/spring-boot-maven-plugin/src/main/java/org/springframework/boot/maven/AbstractRunMojo.java",
                    "file_size": 0
                },
                {
                    "file_additions": 1,
                    "file_deletions": 1,
                    "file_exists": false,
                    "file_name": "spring-boot-tools/spring-boot-maven-plugin/src/main/java/org/springframework/boot/maven/RunArguments.java",
                    "file_size": 0
                },
                {
                    "file_additions": 7,
                    "file_deletions": 354,
                    "file_exists": false,
                    "file_name": "spring-boot-tools/spring-boot-maven-plugin/src/main/java/org/springframework/boot/maven/RunMojo.java",
                    "file_size": 0
                },
                {
                    "file_additions": 67,
                    "file_deletions": 0,
                    "file_exists": false,
                    "file_name": "spring-boot-tools/spring-boot-maven-plugin/src/main/java/org/springframework/boot/maven/StartMojo.java",
                    "file_size": 0
                },
                {
                    "file_additions": 62,
                    "file_deletions": 0,
                    "file_exists": false,
                    "file_name": "spring-boot-tools/spring-boot-maven-plugin/src/main/java/org/springframework/boot/maven/StopMojo.java",
                    "file_size": 0
                }
            ],
            "interesting": {
                "reopened": false,
                "status": false
            },
            "sha": "04e30c0084fd6f7e7037bd6ef44b4961fb3d8257"
        },
        {
            "diff": "spring-projects_spring-boot/issue_2525/commit_e86bc2c74480120521cd316e63999a9a94a88537.diff",
            "diff_additions": 471,
            "diff_deletions": 86,
            "diff_file_size": 0,
            "files": [
                {
                    "file_additions": 4,
                    "file_deletions": 4,
                    "file_exists": false,
                    "file_name": "spring-boot-autoconfigure/src/main/java/org/springframework/boot/autoconfigure/test/SpringApplicationLifecycleRegistrar.java",
                    "file_size": 0
                },
                {
                    "file_additions": 53,
                    "file_deletions": 14,
                    "file_exists": false,
                    "file_name": "spring-boot-autoconfigure/src/test/java/org/springframework/boot/autoconfigure/test/SpringApplicationLifecycleAutoConfigurationTests.java",
                    "file_size": 0
                },
                {
                    "file_additions": 3,
                    "file_deletions": 2,
                    "file_exists": false,
                    "file_name": "spring-boot-cli/src/main/java/org/springframework/boot/cli/command/shell/RunProcessCommand.java",
                    "file_size": 0
                },
                {
                    "file_additions": 25,
                    "file_deletions": 12,
                    "file_exists": false,
                    "file_name": "spring-boot-tools/spring-boot-loader-tools/src/main/java/org/springframework/boot/loader/tools/RunProcess.java",
                    "file_size": 0
                },
                {
                    "file_additions": 26,
                    "file_deletions": 6,
                    "file_exists": false,
                    "file_name": "spring-boot-tools/spring-boot-maven-plugin/src/main/java/org/springframework/boot/maven/AbstractRunMojo.java",
                    "file_size": 0
                },
                {
                    "file_additions": 16,
                    "file_deletions": 7,
                    "file_exists": false,
                    "file_name": "spring-boot-tools/spring-boot-maven-plugin/src/main/java/org/springframework/boot/maven/RunArguments.java",
                    "file_size": 0
                },
                {
                    "file_additions": 4,
                    "file_deletions": 9,
                    "file_exists": false,
                    "file_name": "spring-boot-tools/spring-boot-maven-plugin/src/main/java/org/springframework/boot/maven/RunMojo.java",
                    "file_size": 0
                },
                {
                    "file_additions": 81,
                    "file_deletions": 0,
                    "file_exists": false,
                    "file_name": "spring-boot-tools/spring-boot-maven-plugin/src/main/java/org/springframework/boot/maven/SpringApplicationLifecycleHelper.java",
                    "file_size": 0
                },
                {
                    "file_additions": 191,
                    "file_deletions": 17,
                    "file_exists": false,
                    "file_name": "spring-boot-tools/spring-boot-maven-plugin/src/main/java/org/springframework/boot/maven/StartMojo.java",
                    "file_size": 0
                },
                {
                    "file_additions": 68,
                    "file_deletions": 15,
                    "file_exists": false,
                    "file_name": "spring-boot-tools/spring-boot-maven-plugin/src/main/java/org/springframework/boot/maven/StopMojo.java",
                    "file_size": 0
                }
            ],
            "interesting": {
                "reopened": false,
                "status": false
            },
            "sha": "e86bc2c74480120521cd316e63999a9a94a88537"
        },
        {
            "diff": "spring-projects_spring-boot/issue_2525/commit_918741aee7b0dfbe67cc4c85022056f89e3670bc.diff",
            "diff_additions": 1063,
            "diff_deletions": 351,
            "diff_file_size": 0,
            "files": [
                {
                    "file_additions": 70,
                    "file_deletions": 0,
                    "file_exists": false,
                    "file_name": "spring-boot-autoconfigure/src/main/java/org/springframework/boot/autoconfigure/test/SpringApplicationLifecycleAutoConfiguration.java",
                    "file_size": 0
                },
                {
                    "file_additions": 40,
                    "file_deletions": 0,
                    "file_exists": false,
                    "file_name": "spring-boot-autoconfigure/src/main/java/org/springframework/boot/autoconfigure/test/SpringApplicationLifecycleMXBean.java",
                    "file_size": 0
                },
                {
                    "file_additions": 101,
                    "file_deletions": 0,
                    "file_exists": false,
                    "file_name": "spring-boot-autoconfigure/src/main/java/org/springframework/boot/autoconfigure/test/SpringApplicationLifecycleRegistrar.java",
                    "file_size": 0
                },
                {
                    "file_additions": 180,
                    "file_deletions": 0,
                    "file_exists": false,
                    "file_name": "spring-boot-autoconfigure/src/test/java/org/springframework/boot/autoconfigure/test/SpringApplicationLifecycleAutoConfigurationTests.java",
                    "file_size": 0
                },
                {
                    "file_additions": 385,
                    "file_deletions": 0,
                    "file_exists": false,
                    "file_name": "spring-boot-tools/spring-boot-maven-plugin/src/main/java/org/springframework/boot/maven/AbstractRunMojo.java",
                    "file_size": 0
                },
                {
                    "file_additions": 1,
                    "file_deletions": 1,
                    "file_exists": false,
                    "file_name": "spring-boot-tools/spring-boot-maven-plugin/src/main/java/org/springframework/boot/maven/RunArguments.java",
                    "file_size": 0
                },
                {
                    "file_additions": 6,
                    "file_deletions": 350,
                    "file_exists": false,
                    "file_name": "spring-boot-tools/spring-boot-maven-plugin/src/main/java/org/springframework/boot/maven/RunMojo.java",
                    "file_size": 0
                },
                {
                    "file_additions": 93,
                    "file_deletions": 0,
                    "file_exists": false,
                    "file_name": "spring-boot-tools/spring-boot-maven-plugin/src/main/java/org/springframework/boot/maven/SpringApplicationLifecycleClient.java",
                    "file_size": 0
                },
                {
                    "file_additions": 115,
                    "file_deletions": 0,
                    "file_exists": false,
                    "file_name": "spring-boot-tools/spring-boot-maven-plugin/src/main/java/org/springframework/boot/maven/StartMojo.java",
                    "file_size": 0
                },
                {
                    "file_additions": 72,
                    "file_deletions": 0,
                    "file_exists": false,
                    "file_name": "spring-boot-tools/spring-boot-maven-plugin/src/main/java/org/springframework/boot/maven/StopMojo.java",
                    "file_size": 0
                }
            ],
            "interesting": {
                "reopened": false,
                "status": false
            },
            "sha": "918741aee7b0dfbe67cc4c85022056f89e3670bc"
        },
        {
            "diff": "spring-projects_spring-boot/issue_2525/commit_d154089240655927ad5b4e01bf3ef01bc5b8ca54.diff",
            "diff_additions": 1153,
            "diff_deletions": 351,
            "diff_file_size": 0,
            "files": [
                {
                    "file_additions": 70,
                    "file_deletions": 0,
                    "file_exists": false,
                    "file_name": "spring-boot-autoconfigure/src/main/java/org/springframework/boot/autoconfigure/lifecycle/SpringApplicationLifecycleAutoConfiguration.java",
                    "file_size": 0
                },
                {
                    "file_additions": 41,
                    "file_deletions": 0,
                    "file_exists": false,
                    "file_name": "spring-boot-autoconfigure/src/main/java/org/springframework/boot/autoconfigure/lifecycle/SpringApplicationLifecycleMXBean.java",
                    "file_size": 0
                },
                {
                    "file_additions": 101,
                    "file_deletions": 0,
                    "file_exists": false,
                    "file_name": "spring-boot-autoconfigure/src/main/java/org/springframework/boot/autoconfigure/lifecycle/SpringApplicationLifecycleRegistrar.java",
                    "file_size": 0
                },
                {
                    "file_additions": 180,
                    "file_deletions": 0,
                    "file_exists": false,
                    "file_name": "spring-boot-autoconfigure/src/test/java/org/springframework/boot/autoconfigure/lifecycle/SpringApplicationLifecycleAutoConfigurationTests.java",
                    "file_size": 0
                },
                {
                    "file_additions": 40,
                    "file_deletions": 0,
                    "file_exists": false,
                    "file_name": "spring-boot-integration-tests/spring-boot-maven-tests/spring-boot-maven-tests-it/src/main/java/sample/IntegrationTestApplication.java",
                    "file_size": 0
                },
                {
                    "file_additions": 49,
                    "file_deletions": 0,
                    "file_exists": false,
                    "file_name": "spring-boot-integration-tests/spring-boot-maven-tests/spring-boot-maven-tests-it/src/test/java/sample/IntegrationTestApplicationIT.java",
                    "file_size": 0
                },
                {
                    "file_additions": 385,
                    "file_deletions": 0,
                    "file_exists": false,
                    "file_name": "spring-boot-tools/spring-boot-maven-plugin/src/main/java/org/springframework/boot/maven/AbstractRunMojo.java",
                    "file_size": 0
                },
                {
                    "file_additions": 1,
                    "file_deletions": 1,
                    "file_exists": false,
                    "file_name": "spring-boot-tools/spring-boot-maven-plugin/src/main/java/org/springframework/boot/maven/RunArguments.java",
                    "file_size": 0
                },
                {
                    "file_additions": 6,
                    "file_deletions": 350,
                    "file_exists": false,
                    "file_name": "spring-boot-tools/spring-boot-maven-plugin/src/main/java/org/springframework/boot/maven/RunMojo.java",
                    "file_size": 0
                },
                {
                    "file_additions": 93,
                    "file_deletions": 0,
                    "file_exists": false,
                    "file_name": "spring-boot-tools/spring-boot-maven-plugin/src/main/java/org/springframework/boot/maven/SpringApplicationLifecycleClient.java",
                    "file_size": 0
                },
                {
                    "file_additions": 115,
                    "file_deletions": 0,
                    "file_exists": false,
                    "file_name": "spring-boot-tools/spring-boot-maven-plugin/src/main/java/org/springframework/boot/maven/StartMojo.java",
                    "file_size": 0
                },
                {
                    "file_additions": 72,
                    "file_deletions": 0,
                    "file_exists": false,
                    "file_name": "spring-boot-tools/spring-boot-maven-plugin/src/main/java/org/springframework/boot/maven/StopMojo.java",
                    "file_size": 0
                }
            ],
            "interesting": {
                "reopened": false,
                "status": false
            },
            "sha": "d154089240655927ad5b4e01bf3ef01bc5b8ca54"
        },
        {
            "diff": "spring-projects_spring-boot/issue_2525/commit_420879b305b600e5b93aa8f219d07a5f2172e5d9.diff",
            "diff_additions": 494,
            "diff_deletions": 89,
            "diff_file_size": 0,
            "files": [
                {
                    "file_additions": 2,
                    "file_deletions": 2,
                    "file_exists": false,
                    "file_name": "spring-boot-cli/src/main/java/org/springframework/boot/cli/command/shell/RunProcessCommand.java",
                    "file_size": 0
                },
                {
                    "file_additions": 40,
                    "file_deletions": 0,
                    "file_exists": false,
                    "file_name": "spring-boot-integration-tests/spring-boot-maven-tests/spring-boot-maven-tests-it-fork/src/main/java/sample/IntegrationTestApplication.java",
                    "file_size": 0
                },
                {
                    "file_additions": 49,
                    "file_deletions": 0,
                    "file_exists": false,
                    "file_name": "spring-boot-integration-tests/spring-boot-maven-tests/spring-boot-maven-tests-it-fork/src/test/java/sample/IntegrationTestApplicationIT.java",
                    "file_size": 0
                },
                {
                    "file_additions": 29,
                    "file_deletions": 12,
                    "file_exists": false,
                    "file_name": "spring-boot-tools/spring-boot-loader-tools/src/main/java/org/springframework/boot/loader/tools/RunProcess.java",
                    "file_size": 0
                },
                {
                    "file_additions": 84,
                    "file_deletions": 28,
                    "file_exists": false,
                    "file_name": "spring-boot-tools/spring-boot-maven-plugin/src/main/java/org/springframework/boot/maven/AbstractRunMojo.java",
                    "file_size": 0
                },
                {
                    "file_additions": 20,
                    "file_deletions": 9,
                    "file_exists": false,
                    "file_name": "spring-boot-tools/spring-boot-maven-plugin/src/main/java/org/springframework/boot/maven/RunArguments.java",
                    "file_size": 0
                },
                {
                    "file_additions": 3,
                    "file_deletions": 9,
                    "file_exists": false,
                    "file_name": "spring-boot-tools/spring-boot-maven-plugin/src/main/java/org/springframework/boot/maven/RunMojo.java",
                    "file_size": 0
                },
                {
                    "file_additions": 32,
                    "file_deletions": 2,
                    "file_exists": false,
                    "file_name": "spring-boot-tools/spring-boot-maven-plugin/src/main/java/org/springframework/boot/maven/SpringApplicationLifecycleClient.java",
                    "file_size": 0
                },
                {
                    "file_additions": 183,
                    "file_deletions": 11,
                    "file_exists": false,
                    "file_name": "spring-boot-tools/spring-boot-maven-plugin/src/main/java/org/springframework/boot/maven/StartMojo.java",
                    "file_size": 0
                },
                {
                    "file_additions": 52,
                    "file_deletions": 16,
                    "file_exists": false,
                    "file_name": "spring-boot-tools/spring-boot-maven-plugin/src/main/java/org/springframework/boot/maven/StopMojo.java",
                    "file_size": 0
                }
            ],
            "interesting": {
                "reopened": false,
                "status": false
            },
            "sha": "420879b305b600e5b93aa8f219d07a5f2172e5d9"
        },
        {
            "diff": "spring-projects_spring-boot/issue_2525/commit_d44b288e3a871534d622b1083427f4a80dedbe8a.diff",
            "diff_additions": 1586,
            "diff_deletions": 380,
            "diff_file_size": 0,
            "files": [
                {
                    "file_additions": 70,
                    "file_deletions": 0,
                    "file_exists": false,
                    "file_name": "spring-boot-autoconfigure/src/main/java/org/springframework/boot/autoconfigure/lifecycle/SpringApplicationLifecycleAutoConfiguration.java",
                    "file_size": 0
                },
                {
                    "file_additions": 41,
                    "file_deletions": 0,
                    "file_exists": false,
                    "file_name": "spring-boot-autoconfigure/src/main/java/org/springframework/boot/autoconfigure/lifecycle/SpringApplicationLifecycleMXBean.java",
                    "file_size": 0
                },
                {
                    "file_additions": 101,
                    "file_deletions": 0,
                    "file_exists": false,
                    "file_name": "spring-boot-autoconfigure/src/main/java/org/springframework/boot/autoconfigure/lifecycle/SpringApplicationLifecycleRegistrar.java",
                    "file_size": 0
                },
                {
                    "file_additions": 179,
                    "file_deletions": 0,
                    "file_exists": false,
                    "file_name": "spring-boot-autoconfigure/src/test/java/org/springframework/boot/autoconfigure/lifecycle/SpringApplicationLifecycleAutoConfigurationTests.java",
                    "file_size": 0
                },
                {
                    "file_additions": 2,
                    "file_deletions": 2,
                    "file_exists": false,
                    "file_name": "spring-boot-cli/src/main/java/org/springframework/boot/cli/command/shell/RunProcessCommand.java",
                    "file_size": 0
                },
                {
                    "file_additions": 40,
                    "file_deletions": 0,
                    "file_exists": false,
                    "file_name": "spring-boot-integration-tests/spring-boot-maven-tests/spring-boot-maven-tests-it-fork/src/main/java/sample/IntegrationTestApplication.java",
                    "file_size": 0
                },
                {
                    "file_additions": 49,
                    "file_deletions": 0,
                    "file_exists": false,
                    "file_name": "spring-boot-integration-tests/spring-boot-maven-tests/spring-boot-maven-tests-it-fork/src/test/java/sample/IntegrationTestApplicationIT.java",
                    "file_size": 0
                },
                {
                    "file_additions": 40,
                    "file_deletions": 0,
                    "file_exists": false,
                    "file_name": "spring-boot-integration-tests/spring-boot-maven-tests/spring-boot-maven-tests-it/src/main/java/sample/IntegrationTestApplication.java",
                    "file_size": 0
                },
                {
                    "file_additions": 49,
                    "file_deletions": 0,
                    "file_exists": false,
                    "file_name": "spring-boot-integration-tests/spring-boot-maven-tests/spring-boot-maven-tests-it/src/test/java/sample/IntegrationTestApplicationIT.java",
                    "file_size": 0
                },
                {
                    "file_additions": 29,
                    "file_deletions": 12,
                    "file_exists": false,
                    "file_name": "spring-boot-tools/spring-boot-loader-tools/src/main/java/org/springframework/boot/loader/tools/RunProcess.java",
                    "file_size": 0
                },
                {
                    "file_additions": 441,
                    "file_deletions": 0,
                    "file_exists": false,
                    "file_name": "spring-boot-tools/spring-boot-maven-plugin/src/main/java/org/springframework/boot/maven/AbstractRunMojo.java",
                    "file_size": 0
                },
                {
                    "file_additions": 20,
                    "file_deletions": 9,
                    "file_exists": false,
                    "file_name": "spring-boot-tools/spring-boot-maven-plugin/src/main/java/org/springframework/boot/maven/RunArguments.java",
                    "file_size": 0
                },
                {
                    "file_additions": 7,
                    "file_deletions": 357,
                    "file_exists": false,
                    "file_name": "spring-boot-tools/spring-boot-maven-plugin/src/main/java/org/springframework/boot/maven/RunMojo.java",
                    "file_size": 0
                },
                {
                    "file_additions": 123,
                    "file_deletions": 0,
                    "file_exists": false,
                    "file_name": "spring-boot-tools/spring-boot-maven-plugin/src/main/java/org/springframework/boot/maven/SpringApplicationLifecycleClient.java",
                    "file_size": 0
                },
                {
                    "file_additions": 287,
                    "file_deletions": 0,
                    "file_exists": false,
                    "file_name": "spring-boot-tools/spring-boot-maven-plugin/src/main/java/org/springframework/boot/maven/StartMojo.java",
                    "file_size": 0
                },
                {
                    "file_additions": 108,
                    "file_deletions": 0,
                    "file_exists": false,
                    "file_name": "spring-boot-tools/spring-boot-maven-plugin/src/main/java/org/springframework/boot/maven/StopMojo.java",
                    "file_size": 0
                }
            ],
            "interesting": {
                "reopened": false,
                "status": false
            },
            "sha": "d44b288e3a871534d622b1083427f4a80dedbe8a"
        },
        {
            "diff": "spring-projects_spring-boot/issue_2525/commit_e0dfe9fb8635d5558a5839891f2f34d803c1d325.diff",
            "diff_additions": 1659,
            "diff_deletions": 380,
            "diff_file_size": 0,
            "files": [
                {
                    "file_additions": 72,
                    "file_deletions": 0,
                    "file_exists": false,
                    "file_name": "spring-boot-autoconfigure/src/main/java/org/springframework/boot/autoconfigure/context/SpringApplicationLifecycleAutoConfiguration.java",
                    "file_size": 0
                },
                {
                    "file_additions": 128,
                    "file_deletions": 0,
                    "file_exists": false,
                    "file_name": "spring-boot-autoconfigure/src/test/java/org/springframework/boot/autoconfigure/context/SpringApplicationLifecycleAutoConfigurationTests.java",
                    "file_size": 0
                },
                {
                    "file_additions": 2,
                    "file_deletions": 2,
                    "file_exists": false,
                    "file_name": "spring-boot-cli/src/main/java/org/springframework/boot/cli/command/shell/RunProcessCommand.java",
                    "file_size": 0
                },
                {
                    "file_additions": 29,
                    "file_deletions": 12,
                    "file_exists": false,
                    "file_name": "spring-boot-tools/spring-boot-loader-tools/src/main/java/org/springframework/boot/loader/tools/RunProcess.java",
                    "file_size": 0
                },
                {
                    "file_additions": 79,
                    "file_deletions": 0,
                    "file_exists": false,
                    "file_name": "spring-boot-tools/spring-boot-maven-plugin/src/it/start-stop-fork/src/main/java/org/test/SampleApplication.java",
                    "file_size": 0
                },
                {
                    "file_additions": 79,
                    "file_deletions": 0,
                    "file_exists": false,
                    "file_name": "spring-boot-tools/spring-boot-maven-plugin/src/it/start-stop/src/main/java/org/test/SampleApplication.java",
                    "file_size": 0
                },
                {
                    "file_additions": 441,
                    "file_deletions": 0,
                    "file_exists": false,
                    "file_name": "spring-boot-tools/spring-boot-maven-plugin/src/main/java/org/springframework/boot/maven/AbstractRunMojo.java",
                    "file_size": 0
                },
                {
                    "file_additions": 20,
                    "file_deletions": 9,
                    "file_exists": false,
                    "file_name": "spring-boot-tools/spring-boot-maven-plugin/src/main/java/org/springframework/boot/maven/RunArguments.java",
                    "file_size": 0
                },
                {
                    "file_additions": 7,
                    "file_deletions": 357,
                    "file_exists": false,
                    "file_name": "spring-boot-tools/spring-boot-maven-plugin/src/main/java/org/springframework/boot/maven/RunMojo.java",
                    "file_size": 0
                },
                {
                    "file_additions": 123,
                    "file_deletions": 0,
                    "file_exists": false,
                    "file_name": "spring-boot-tools/spring-boot-maven-plugin/src/main/java/org/springframework/boot/maven/SpringApplicationLifecycleClient.java",
                    "file_size": 0
                },
                {
                    "file_additions": 287,
                    "file_deletions": 0,
                    "file_exists": false,
                    "file_name": "spring-boot-tools/spring-boot-maven-plugin/src/main/java/org/springframework/boot/maven/StartMojo.java",
                    "file_size": 0
                },
                {
                    "file_additions": 108,
                    "file_deletions": 0,
                    "file_exists": false,
                    "file_name": "spring-boot-tools/spring-boot-maven-plugin/src/main/java/org/springframework/boot/maven/StopMojo.java",
                    "file_size": 0
                },
                {
                    "file_additions": 41,
                    "file_deletions": 0,
                    "file_exists": false,
                    "file_name": "spring-boot/src/main/java/org/springframework/boot/context/SpringApplicationLifecycleMXBean.java",
                    "file_size": 0
                },
                {
                    "file_additions": 101,
                    "file_deletions": 0,
                    "file_exists": false,
                    "file_name": "spring-boot/src/main/java/org/springframework/boot/context/SpringApplicationLifecycleRegistrar.java",
                    "file_size": 0
                },
                {
                    "file_additions": 142,
                    "file_deletions": 0,
                    "file_exists": false,
                    "file_name": "spring-boot/src/test/java/org/springframework/boot/context/SpringApplicationLifecycleRegistrarTests.java",
                    "file_size": 0
                }
            ],
            "interesting": {
                "reopened": false,
                "status": false
            },
            "sha": "e0dfe9fb8635d5558a5839891f2f34d803c1d325"
        },
        {
            "diff": "spring-projects_spring-boot/issue_2525/commit_b7a02feda8c3990ffce41a90eaccdd46ee63033e.diff",
            "diff_additions": 3,
            "diff_deletions": 2,
            "diff_file_size": 0,
            "files": [
                {
                    "file_additions": 2,
                    "file_deletions": 1,
                    "file_exists": false,
                    "file_name": "spring-boot-tools/spring-boot-maven-plugin/src/it/start-stop-fork/src/main/java/org/test/SampleApplication.java",
                    "file_size": 0
                },
                {
                    "file_additions": 1,
                    "file_deletions": 1,
                    "file_exists": false,
                    "file_name": "spring-boot-tools/spring-boot-maven-plugin/src/it/start-stop/src/main/java/org/test/SampleApplication.java",
                    "file_size": 0
                }
            ],
            "interesting": {
                "reopened": false,
                "status": true
            },
            "sha": "b7a02feda8c3990ffce41a90eaccdd46ee63033e"
        }
    ],
    "first_commit": "2015-03-12 08:23:29",
    "last_commit": "2015-05-19 14:26:03",
    "number": 2525,
    "score": 208.00042803638308
}