{
    "covered_issues": [
        198,
        197,
        195,
        193,
        192,
        191,
        189,
        184,
        183,
        181,
        175,
        174,
        173,
        168,
        167,
        166,
        162,
        161,
        158,
        147,
        146,
        144,
        143,
        142,
        141,
        140,
        139,
        138,
        137,
        132,
        131,
        129,
        127,
        126,
        124,
        123,
        121,
        120,
        113,
        112,
        107,
        106,
        94,
        59,
        57,
        56,
        54,
        53,
        52,
        51,
        47,
        46,
        44,
        43,
        23,
        19,
        18,
        14,
        13,
        12,
        11,
        10,
        7,
        6,
        5,
        4,
        3,
        2,
        1
    ],
    "finished": true
}