{
    "commits": [
        {
            "associated_pull_request": [],
            "date": "2015-01-21 16:04:01+00:00",
            "diff": "opensips_opensips/issue_402/commit_444b6802980edd4931106b4db1d8c99dd479bb32.diff",
            "diff_additions": 153,
            "diff_deletions": 60,
            "diff_file_size": 122655,
            "diff_url": "https://github.com/OpenSIPS/opensips/commit/444b6802980edd4931106b4db1d8c99dd479bb32.diff",
            "exists": true,
            "files": [
                {
                    "file_additions": 148,
                    "file_deletions": 57,
                    "file_exists": true,
                    "file_name": "modules/dispatcher/dispatch.c",
                    "file_size": 76606
                },
                {
                    "file_additions": 5,
                    "file_deletions": 3,
                    "file_exists": true,
                    "file_name": "modules/dispatcher/dispatcher.c",
                    "file_size": 46049
                }
            ],
            "interesting": {
                "reopen": false,
                "status": false
            },
            "is_parent": true,
            "sha": "444b6802980edd4931106b4db1d8c99dd479bb32"
        },
        {
            "associated_pull_request": [],
            "date": "2015-01-21 17:32:57+00:00",
            "diff": "opensips_opensips/issue_402/commit_2fdeba6fa8ee56d256e465f63317785798f7826d.diff",
            "diff_additions": 48,
            "diff_deletions": 32,
            "diff_file_size": 25052,
            "diff_url": "https://github.com/OpenSIPS/opensips/commit/2fdeba6fa8ee56d256e465f63317785798f7826d.diff",
            "exists": true,
            "files": [
                {
                    "file_additions": 48,
                    "file_deletions": 32,
                    "file_exists": true,
                    "file_name": "modules/usrloc/ucontact.c",
                    "file_size": 25052
                }
            ],
            "interesting": {
                "reopen": true,
                "status": false
            },
            "is_parent": false,
            "sha": "2fdeba6fa8ee56d256e465f63317785798f7826d"
        },
        {
            "associated_pull_request": [],
            "date": "2015-01-21 17:32:57+00:00",
            "diff": "opensips_opensips/issue_402/commit_ebadc34dcd20ccb07af1c2a4cead0cfb5924932b.diff",
            "diff_additions": 48,
            "diff_deletions": 32,
            "diff_file_size": 25052,
            "diff_url": "https://github.com/OpenSIPS/opensips/commit/ebadc34dcd20ccb07af1c2a4cead0cfb5924932b.diff",
            "exists": true,
            "files": [
                {
                    "file_additions": 48,
                    "file_deletions": 32,
                    "file_exists": true,
                    "file_name": "modules/usrloc/ucontact.c",
                    "file_size": 25052
                }
            ],
            "interesting": {
                "reopen": false,
                "status": false
            },
            "is_parent": false,
            "sha": "ebadc34dcd20ccb07af1c2a4cead0cfb5924932b"
        },
        {
            "associated_pull_request": [],
            "date": "2015-01-21 17:32:57+00:00",
            "diff": "opensips_opensips/issue_402/commit_7d3a2209e2502e55ea962b1f95352e17338f1bba.diff",
            "diff_additions": 49,
            "diff_deletions": 33,
            "diff_file_size": 25052,
            "diff_url": "https://github.com/OpenSIPS/opensips/commit/7d3a2209e2502e55ea962b1f95352e17338f1bba.diff",
            "exists": true,
            "files": [
                {
                    "file_additions": 49,
                    "file_deletions": 33,
                    "file_exists": true,
                    "file_name": "modules/usrloc/ucontact.c",
                    "file_size": 25052
                }
            ],
            "interesting": {
                "reopen": false,
                "status": false
            },
            "is_parent": false,
            "sha": "7d3a2209e2502e55ea962b1f95352e17338f1bba"
        },
        {
            "associated_pull_request": [],
            "date": "2015-01-21 17:32:57+00:00",
            "diff": "opensips_opensips/issue_402/commit_d8dc224ac41218783ae7d1436570a7591f2d89b6.diff",
            "diff_additions": 50,
            "diff_deletions": 34,
            "diff_file_size": 25052,
            "diff_url": "https://github.com/OpenSIPS/opensips/commit/d8dc224ac41218783ae7d1436570a7591f2d89b6.diff",
            "exists": true,
            "files": [
                {
                    "file_additions": 50,
                    "file_deletions": 34,
                    "file_exists": true,
                    "file_name": "modules/usrloc/ucontact.c",
                    "file_size": 25052
                }
            ],
            "interesting": {
                "reopen": false,
                "status": false
            },
            "is_parent": false,
            "sha": "d8dc224ac41218783ae7d1436570a7591f2d89b6"
        }
    ],
    "first_commit": "2015-01-21 16:37:21+00:00",
    "last_commit": "2015-01-22 13:11:16+00:00",
    "number": 402,
    "pull_request": "None",
    "score": {
        "accidental_reopen_likely": false,
        "all_labels": [
            "bug"
        ],
        "contains_keywords": [
            "work",
            "fail",
            "chang",
            "fix",
            "patch",
            "test",
            "fault",
            "error",
            "problem"
        ],
        "fix_size": 170,
        "has_labels": [
            "bug"
        ],
        "intersecting": {
            "computed_score": 0.5384615384615384,
            "final_commit_size": 65,
            "intersection_size": 35,
            "previous_commits_size": 140
        },
        "is_makefile_based": true,
        "no_new_files": [],
        "no_other_files": false,
        "num_prohibited_files": 265875,
        "prohibited_files": [
            "server/src/main/java/com/genymobile/scrcpy/Device.java",
            "server/src/main/java/com/genymobile/scrcpy/wrappers/SurfaceControl.java",
            "server/src/main/java/com/genymobile/scrcpy/Device.java",
            "server/src/main/java/com/genymobile/scrcpy/wrappers/SurfaceControl.java",
            "app/meson.build",
            "app/scrcpy.1",
            "app/src/common.h",
            "app/src/scrcpy.h",
            "app/src/server.h",
            "server/src/main/java/com/genymobile/scrcpy/Workarounds.java"
        ],
        "reopen": true,
        "reopen_events": [
            [
                "2015-01-21 17:34:39+00:00",
                "closed"
            ],
            [
                "2015-01-21 17:34:39+00:00",
                "commit"
            ],
            [
                "2015-01-21 17:36:19+00:00",
                "reopened"
            ],
            [
                "2015-01-22 13:03:19+00:00",
                "commit"
            ],
            [
                "2015-01-22 13:05:35+00:00",
                "commit"
            ],
            [
                "2015-01-22 13:11:25+00:00",
                "commit"
            ],
            [
                "2015-01-22 13:12:50+00:00",
                "closed"
            ]
        ],
        "status": false,
        "strategy": true,
        "total_changes": 539
    }
}