{
    "commits": [
        {
            "associated_pull_request": [],
            "date": "2014-02-06 22:56:19+00:00",
            "diff": "openwall_john/issue_380/commit_ba908568216b18c5a3c4ebf4f3a73c2804af6cc6.diff",
            "diff_additions": 5,
            "diff_deletions": 0,
            "diff_file_size": 21796,
            "diff_url": "https://github.com/openwall/john/commit/ba908568216b18c5a3c4ebf4f3a73c2804af6cc6.diff",
            "exists": true,
            "files": [
                {
                    "file_additions": 5,
                    "file_deletions": 0,
                    "file_exists": true,
                    "file_name": "src/c3_fmt.c",
                    "file_size": 21796
                }
            ],
            "interesting": {
                "reopen": false,
                "status": false
            },
            "is_parent": true,
            "sha": "ba908568216b18c5a3c4ebf4f3a73c2804af6cc6"
        },
        {
            "associated_pull_request": [],
            "date": "2014-02-06 23:06:49+00:00",
            "diff": "openwall_john/issue_380/commit_6fc5ed87b381aa9b264673e5520f1ed407bb8258.diff",
            "diff_additions": 6,
            "diff_deletions": 0,
            "diff_file_size": 72846,
            "diff_url": "https://github.com/openwall/john/commit/6fc5ed87b381aa9b264673e5520f1ed407bb8258.diff",
            "exists": true,
            "files": [
                {
                    "file_additions": 6,
                    "file_deletions": 0,
                    "file_exists": true,
                    "file_name": "src/mask.c",
                    "file_size": 72846
                }
            ],
            "interesting": {
                "reopen": true,
                "status": false
            },
            "is_parent": false,
            "sha": "6fc5ed87b381aa9b264673e5520f1ed407bb8258"
        },
        {
            "associated_pull_request": [],
            "date": "2014-10-01 13:29:21+00:00",
            "diff": "openwall_john/issue_380/commit_da9c5b823bafa2b392e413a709ca78a2fb802473.diff",
            "diff_additions": 4,
            "diff_deletions": 1,
            "diff_file_size": 103359,
            "diff_url": "https://github.com/openwall/john/commit/da9c5b823bafa2b392e413a709ca78a2fb802473.diff",
            "exists": true,
            "files": [
                {
                    "file_additions": 3,
                    "file_deletions": 0,
                    "file_exists": true,
                    "file_name": "src/john.c",
                    "file_size": 59563
                },
                {
                    "file_additions": 1,
                    "file_deletions": 1,
                    "file_exists": true,
                    "file_name": "src/options.c",
                    "file_size": 43796
                }
            ],
            "interesting": {
                "reopen": false,
                "status": false
            },
            "is_parent": false,
            "sha": "da9c5b823bafa2b392e413a709ca78a2fb802473"
        }
    ],
    "first_commit": "2014-02-06 22:57:49+00:00",
    "last_commit": "2014-10-01 13:30:17+00:00",
    "number": 380,
    "pull_request": "None",
    "score": {
        "accidental_reopen_likely": false,
        "all_labels": [
            "enhancement"
        ],
        "contains_keywords": [
            "fix",
            "issu",
            "fault",
            "bug",
            "error",
            "problem"
        ],
        "fix_size": 13,
        "has_labels": [],
        "intersecting": {
            "computed_score": 0.0,
            "final_commit_size": 6,
            "intersection_size": 0,
            "previous_commits_size": 7
        },
        "is_makefile_based": false,
        "no_new_files": [
            "src/john.c",
            "src/options.c"
        ],
        "no_other_files": false,
        "num_prohibited_files": 41143,
        "prohibited_files": [
            "server/src/main/java/com/genymobile/scrcpy/Device.java",
            "server/src/main/java/com/genymobile/scrcpy/wrappers/SurfaceControl.java",
            "server/src/main/java/com/genymobile/scrcpy/Device.java",
            "server/src/main/java/com/genymobile/scrcpy/wrappers/SurfaceControl.java",
            "app/meson.build",
            "app/scrcpy.1",
            "app/src/common.h",
            "app/src/scrcpy.h",
            "app/src/server.h",
            "server/src/main/java/com/genymobile/scrcpy/Workarounds.java"
        ],
        "reopen": true,
        "reopen_events": [
            [
                "2014-02-06 23:05:10+00:00",
                "closed"
            ],
            [
                "2014-02-06 23:05:10+00:00",
                "commit"
            ],
            [
                "2014-02-06 23:06:46+00:00",
                "reopened"
            ],
            [
                "2014-10-01 09:16:14+00:00",
                "commit"
            ],
            [
                "2014-10-01 15:33:57+00:00",
                "commit"
            ],
            [
                "2014-11-05 18:00:37+00:00",
                "closed"
            ]
        ],
        "status": false,
        "strategy": true,
        "total_changes": 16
    }
}