{
    "all_issues": 4673,
    "interesting_issues": 2,
    "last_update": "2023-11-06 20:01:04.151872",
    "license": {
        "download": "https://raw.githubusercontent.com/coreos/rpm-ostree/main/LICENSE",
        "name": "Other"
    },
    "ratio": 0.00042799058420714745,
    "size": 15084,
    "stars": 771,
    "url": "https://github.com/coreos/rpm-ostree"
}