{
    "covered_issues": [
        223,
        220,
        218,
        216,
        215,
        209,
        208,
        206,
        205,
        204,
        196,
        195,
        194,
        190,
        186,
        184,
        183,
        182,
        181,
        179,
        176,
        174,
        170,
        166,
        163,
        160,
        159,
        157,
        156,
        155,
        153,
        152,
        150,
        149,
        147,
        145,
        140,
        138,
        136,
        134,
        132,
        131,
        129,
        120,
        119,
        116,
        113,
        112,
        111,
        110,
        107,
        106,
        105,
        103,
        102,
        99,
        93,
        92,
        89,
        44,
        43,
        42,
        41,
        34,
        33,
        31,
        30,
        26,
        25,
        24,
        22,
        21,
        20,
        19,
        18,
        16,
        15,
        11,
        8,
        7,
        6,
        5
    ],
    "finished": true
}