{
    "covered_issues": [
        36,
        33,
        32,
        29,
        24,
        18,
        13,
        10,
        9,
        8,
        6,
        5,
        4,
        3,
        2,
        1
    ],
    "finished": true
}