{
    "category": [
        "memory",
        "hardware/OS"
    ],
    "commits": [
        {
            "associated_pull_request": [
                "https://github.com/ponylang/ponyc/pull/2243"
            ],
            "date": "2017-09-21 15:57:09",
            "diff": "",
            "diff_additions": 0,
            "diff_deletions": 0,
            "diff_file_size": 0,
            "diff_url": "https://github.com/ponylang/ponyc/commit/5c1f46641dffe2402f751abbf247b344dc4de158.diff",
            "exists": true,
            "files": [],
            "interesting": {
                "reopen": false,
                "status": false
            },
            "is_parent": true,
            "sha": "5c1f46641dffe2402f751abbf247b344dc4de158"
        },
        {
            "associated_pull_request": [],
            "date": "2017-09-22 15:52:49",
            "diff": "ponylang_ponyc/issue_2245/commit_d33f877333e6e384214836f0dba1f950b203b8fe.diff",
            "diff_additions": 30,
            "diff_deletions": 2,
            "diff_file_size": 92471,
            "diff_url": "https://github.com/ponylang/ponyc/commit/d33f877333e6e384214836f0dba1f950b203b8fe.diff",
            "exists": true,
            "files": [
                {
                    "file_additions": 2,
                    "file_deletions": 2,
                    "file_exists": true,
                    "file_name": "src/libponyc/codegen/genprim.c",
                    "file_size": 68932
                },
                {
                    "file_additions": 28,
                    "file_deletions": 0,
                    "file_exists": true,
                    "file_name": "test/libponyc/codegen.cc",
                    "file_size": 23539
                }
            ],
            "interesting": {
                "reopen": false,
                "status": false
            },
            "is_parent": false,
            "sha": "d33f877333e6e384214836f0dba1f950b203b8fe"
        },
        {
            "associated_pull_request": [],
            "date": "2017-09-22 15:52:49",
            "diff": "ponylang_ponyc/issue_2245/commit_a5c494822f75c67f9886bd2984a267e004b87f6f.diff",
            "diff_additions": 30,
            "diff_deletions": 2,
            "diff_file_size": 92471,
            "diff_url": "https://github.com/ponylang/ponyc/commit/a5c494822f75c67f9886bd2984a267e004b87f6f.diff",
            "exists": true,
            "files": [
                {
                    "file_additions": 2,
                    "file_deletions": 2,
                    "file_exists": true,
                    "file_name": "src/libponyc/codegen/genprim.c",
                    "file_size": 68932
                },
                {
                    "file_additions": 28,
                    "file_deletions": 0,
                    "file_exists": true,
                    "file_name": "test/libponyc/codegen.cc",
                    "file_size": 23539
                }
            ],
            "interesting": {
                "reopen": false,
                "status": true
            },
            "is_parent": false,
            "sha": "a5c494822f75c67f9886bd2984a267e004b87f6f"
        },
        {
            "associated_pull_request": [
                "https://github.com/ponylang/ponyc/pull/2247"
            ],
            "date": "2017-09-24 15:37:29",
            "diff": "ponylang_ponyc/issue_2245/commit_5bbb316b1fb15e51617b1f06400fb096b642353f.diff",
            "diff_additions": 28,
            "diff_deletions": 13,
            "diff_file_size": 92471,
            "diff_url": "https://github.com/ponylang/ponyc/commit/5bbb316b1fb15e51617b1f06400fb096b642353f.diff",
            "exists": true,
            "files": [
                {
                    "file_additions": 0,
                    "file_deletions": 13,
                    "file_exists": true,
                    "file_name": "src/libponyc/codegen/genprim.c",
                    "file_size": 68932
                },
                {
                    "file_additions": 28,
                    "file_deletions": 0,
                    "file_exists": true,
                    "file_name": "test/libponyc/codegen.cc",
                    "file_size": 23539
                }
            ],
            "interesting": {
                "reopen": false,
                "status": false
            },
            "is_parent": false,
            "sha": "5bbb316b1fb15e51617b1f06400fb096b642353f"
        },
        {
            "associated_pull_request": [
                "https://github.com/ponylang/ponyc/pull/2247"
            ],
            "date": "2017-09-24 15:37:29",
            "diff": "ponylang_ponyc/issue_2245/commit_8343d058ff498e5daf58a5689053c033d23f5383.diff",
            "diff_additions": 28,
            "diff_deletions": 13,
            "diff_file_size": 92471,
            "diff_url": "https://github.com/ponylang/ponyc/commit/8343d058ff498e5daf58a5689053c033d23f5383.diff",
            "exists": true,
            "files": [
                {
                    "file_additions": 0,
                    "file_deletions": 13,
                    "file_exists": true,
                    "file_name": "src/libponyc/codegen/genprim.c",
                    "file_size": 68932
                },
                {
                    "file_additions": 28,
                    "file_deletions": 0,
                    "file_exists": true,
                    "file_name": "test/libponyc/codegen.cc",
                    "file_size": 23539
                }
            ],
            "interesting": {
                "reopen": false,
                "status": false
            },
            "is_parent": false,
            "sha": "8343d058ff498e5daf58a5689053c033d23f5383"
        }
    ],
    "first_commit": "2017-09-21 15:57:09",
    "last_commit": "2017-09-24 16:52:59",
    "number": 2245,
    "pull_request": "None",
    "score": {
        "accidental_reopen_likely": false,
        "all_labels": [],
        "contains_keywords": [
            "fix",
            "reason",
            "patch",
            "fault",
            "bug",
            "warn",
            "chang"
        ],
        "fix_size": 61,
        "has_labels": [],
        "intersecting": {
            "computed_score": 1.0,
            "final_commit_size": 43,
            "intersection_size": 43,
            "previous_commits_size": 61
        },
        "is_makefile_based": true,
        "no_new_files": [],
        "no_other_files": true,
        "num_prohibited_files": 57904,
        "prohibited_files": [
            "kill.h",
            "meminfo.h",
            "kill.h",
            "meminfo.h",
            "kill.h",
            "meminfo.h",
            "testsuite_cli_test.go",
            "testsuite_cli_test.go",
            "common.mk",
            "i3bar/include/draw_util.h"
        ],
        "reopen": false,
        "reopen_events": [
            [
                "2017-09-22 14:50:39",
                "closed"
            ],
            [
                "2017-09-22 14:55:59",
                "reopened"
            ],
            [
                "2017-09-22 15:54:12",
                "commit"
            ],
            [
                "2017-09-22 15:55:54",
                "commit"
            ],
            [
                "2017-09-24 15:42:25",
                "commit"
            ],
            [
                "2017-09-24 16:53:00",
                "closed"
            ],
            [
                "2017-09-24 16:53:03",
                "commit"
            ]
        ],
        "status": true,
        "strategy": true,
        "total_changes": 146
    }
}