{
    "commits": [
        {
            "associated_pull_request": [],
            "date": "2015-10-06 22:07:28+00:00",
            "diff": "sumatrapdfreader_sumatrapdf/issue_310/commit_d24d0eefa4b65f733f329042fb5ade3b4e658968.diff",
            "diff_additions": 5,
            "diff_deletions": 2,
            "diff_file_size": 0,
            "diff_url": "https://github.com/sumatrapdfreader/sumatrapdf/commit/d24d0eefa4b65f733f329042fb5ade3b4e658968.diff",
            "exists": true,
            "files": [
                {
                    "file_additions": 5,
                    "file_deletions": 2,
                    "file_exists": false,
                    "file_name": "src/ImagesEngine.cpp",
                    "file_size": 0
                }
            ],
            "interesting": {
                "reopen": false,
                "status": false
            },
            "is_parent": true,
            "sha": "d24d0eefa4b65f733f329042fb5ade3b4e658968"
        },
        {
            "associated_pull_request": [],
            "date": "2015-10-07 09:06:04+00:00",
            "diff": "sumatrapdfreader_sumatrapdf/issue_310/commit_9eab3631d4cbe8b645f1776e6e812ad03ddd18f8.diff",
            "diff_additions": 6,
            "diff_deletions": 3,
            "diff_file_size": 270899,
            "diff_url": "https://github.com/sumatrapdfreader/sumatrapdf/commit/9eab3631d4cbe8b645f1776e6e812ad03ddd18f8.diff",
            "exists": true,
            "files": [
                {
                    "file_additions": 3,
                    "file_deletions": 0,
                    "file_exists": true,
                    "file_name": "src/SumatraPDF.cpp",
                    "file_size": 193823
                },
                {
                    "file_additions": 3,
                    "file_deletions": 3,
                    "file_exists": true,
                    "file_name": "src/utils/HtmlWindow.cpp",
                    "file_size": 77076
                }
            ],
            "interesting": {
                "reopen": true,
                "status": false
            },
            "is_parent": false,
            "sha": "9eab3631d4cbe8b645f1776e6e812ad03ddd18f8"
        },
        {
            "associated_pull_request": [],
            "date": "2015-10-10 04:10:32+00:00",
            "diff": "sumatrapdfreader_sumatrapdf/issue_310/commit_9360d182ea2f238c098bd10aba0893ba33ca33f9.diff",
            "diff_additions": 6,
            "diff_deletions": 3,
            "diff_file_size": 270899,
            "diff_url": "https://github.com/sumatrapdfreader/sumatrapdf/commit/9360d182ea2f238c098bd10aba0893ba33ca33f9.diff",
            "exists": true,
            "files": [
                {
                    "file_additions": 3,
                    "file_deletions": 0,
                    "file_exists": true,
                    "file_name": "src/SumatraPDF.cpp",
                    "file_size": 193823
                },
                {
                    "file_additions": 3,
                    "file_deletions": 3,
                    "file_exists": true,
                    "file_name": "src/utils/HtmlWindow.cpp",
                    "file_size": 77076
                }
            ],
            "interesting": {
                "reopen": false,
                "status": false
            },
            "is_parent": false,
            "sha": "9360d182ea2f238c098bd10aba0893ba33ca33f9"
        }
    ],
    "first_commit": "2015-10-06 22:07:28+00:00",
    "last_commit": "2015-10-10 04:10:32+00:00",
    "number": 310,
    "pull_request": "None",
    "score": {
        "accidental_reopen_likely": false,
        "all_labels": [],
        "contains_keywords": [
            "work",
            "chang",
            "fix",
            "issu",
            "patch",
            "test",
            "fault",
            "remov",
            "bug",
            "error",
            "crash"
        ],
        "fix_size": 10,
        "has_labels": [],
        "intersecting": {
            "computed_score": 0.75,
            "final_commit_size": 8,
            "intersection_size": 6,
            "previous_commits_size": 8
        },
        "is_makefile_based": false,
        "no_new_files": [],
        "no_other_files": false,
        "num_prohibited_files": 23469,
        "prohibited_files": [
            "server/src/main/java/com/genymobile/scrcpy/Device.java",
            "server/src/main/java/com/genymobile/scrcpy/wrappers/SurfaceControl.java",
            "server/src/main/java/com/genymobile/scrcpy/Device.java",
            "server/src/main/java/com/genymobile/scrcpy/wrappers/SurfaceControl.java",
            "app/meson.build",
            "app/scrcpy.1",
            "app/src/common.h",
            "app/src/scrcpy.h",
            "app/src/server.h",
            "server/src/main/java/com/genymobile/scrcpy/Workarounds.java"
        ],
        "reopen": true,
        "reopen_events": [
            [
                "2015-10-07 09:06:36+00:00",
                "commit"
            ],
            [
                "2015-10-07 17:01:57+00:00",
                "closed"
            ],
            [
                "2015-10-07 23:56:51+00:00",
                "reopened"
            ],
            [
                "2015-10-10 04:10:38+00:00",
                "commit"
            ],
            [
                "2015-10-10 05:02:51+00:00",
                "closed"
            ]
        ],
        "status": false,
        "strategy": true,
        "total_changes": 25
    }
}