{
    "commits": [
        {
            "associated_pull_request": [
                "https://github.com/surge-synthesizer/surge/pull/1033"
            ],
            "date": "2019-08-16 17:00:00+00:00",
            "diff": "surge-synthesizer_surge/issue_1035/commit_80984a63e694418fa6e709f1a0f6a8c419a09004.diff",
            "diff_additions": 22,
            "diff_deletions": 20,
            "diff_file_size": 4811,
            "diff_url": "https://github.com/surge-synthesizer/surge/commit/80984a63e694418fa6e709f1a0f6a8c419a09004.diff",
            "exists": true,
            "files": [
                {
                    "file_additions": 22,
                    "file_deletions": 20,
                    "file_exists": true,
                    "file_name": "src/common/dsp/Oscillator.cpp",
                    "file_size": 4811
                }
            ],
            "interesting": {
                "reopen": false,
                "status": false
            },
            "is_parent": true,
            "sha": "80984a63e694418fa6e709f1a0f6a8c419a09004"
        },
        {
            "associated_pull_request": [
                "https://github.com/surge-synthesizer/surge/pull/1036"
            ],
            "date": "2019-08-16 21:53:43+00:00",
            "diff": "surge-synthesizer_surge/issue_1035/commit_f752d12849e34f190f42ae2216dc928809604293.diff",
            "diff_additions": 16,
            "diff_deletions": 37,
            "diff_file_size": 4811,
            "diff_url": "https://github.com/surge-synthesizer/surge/commit/f752d12849e34f190f42ae2216dc928809604293.diff",
            "exists": true,
            "files": [
                {
                    "file_additions": 16,
                    "file_deletions": 37,
                    "file_exists": true,
                    "file_name": "src/common/dsp/Oscillator.cpp",
                    "file_size": 4811
                }
            ],
            "interesting": {
                "reopen": true,
                "status": false
            },
            "is_parent": false,
            "sha": "f752d12849e34f190f42ae2216dc928809604293"
        },
        {
            "associated_pull_request": [
                "https://github.com/surge-synthesizer/surge/pull/1038"
            ],
            "date": "2019-08-16 16:11:57+00:00",
            "diff": "surge-synthesizer_surge/issue_1035/commit_7c9b151e5e33b2443eb93241e64df2423ab10006.diff",
            "diff_additions": 355,
            "diff_deletions": 89,
            "diff_file_size": 175283,
            "diff_url": "https://github.com/surge-synthesizer/surge/commit/7c9b151e5e33b2443eb93241e64df2423ab10006.diff",
            "exists": true,
            "files": [
                {
                    "file_additions": 27,
                    "file_deletions": 1,
                    "file_exists": true,
                    "file_name": "src/common/SurgePatch.cpp",
                    "file_size": 150229
                },
                {
                    "file_additions": 19,
                    "file_deletions": 0,
                    "file_exists": true,
                    "file_name": "src/common/SurgeSynthesizerIO.cpp",
                    "file_size": 20243
                },
                {
                    "file_additions": 12,
                    "file_deletions": 0,
                    "file_exists": true,
                    "file_name": "src/common/dsp/Oscillator.cpp",
                    "file_size": 4811
                },
                {
                    "file_additions": 0,
                    "file_deletions": 2,
                    "file_exists": false,
                    "file_name": "src/common/gui/CPatchBrowser.cpp",
                    "file_size": 0
                },
                {
                    "file_additions": 94,
                    "file_deletions": 0,
                    "file_exists": false,
                    "file_name": "src/common/gui/CStatusPanel.cpp",
                    "file_size": 0
                },
                {
                    "file_additions": 203,
                    "file_deletions": 86,
                    "file_exists": false,
                    "file_name": "src/common/gui/SurgeGUIEditor.cpp",
                    "file_size": 0
                }
            ],
            "interesting": {
                "reopen": false,
                "status": false
            },
            "is_parent": false,
            "sha": "7c9b151e5e33b2443eb93241e64df2423ab10006"
        },
        {
            "associated_pull_request": [
                "https://github.com/surge-synthesizer/surge/pull/1038"
            ],
            "date": "2019-08-17 21:06:31+00:00",
            "diff": "surge-synthesizer_surge/issue_1035/commit_89d0367fb3033a406d0bddf98bc3b722b7a58b48.diff",
            "diff_additions": 355,
            "diff_deletions": 89,
            "diff_file_size": 175283,
            "diff_url": "https://github.com/surge-synthesizer/surge/commit/89d0367fb3033a406d0bddf98bc3b722b7a58b48.diff",
            "exists": true,
            "files": [
                {
                    "file_additions": 27,
                    "file_deletions": 1,
                    "file_exists": true,
                    "file_name": "src/common/SurgePatch.cpp",
                    "file_size": 150229
                },
                {
                    "file_additions": 19,
                    "file_deletions": 0,
                    "file_exists": true,
                    "file_name": "src/common/SurgeSynthesizerIO.cpp",
                    "file_size": 20243
                },
                {
                    "file_additions": 12,
                    "file_deletions": 0,
                    "file_exists": true,
                    "file_name": "src/common/dsp/Oscillator.cpp",
                    "file_size": 4811
                },
                {
                    "file_additions": 0,
                    "file_deletions": 2,
                    "file_exists": false,
                    "file_name": "src/common/gui/CPatchBrowser.cpp",
                    "file_size": 0
                },
                {
                    "file_additions": 94,
                    "file_deletions": 0,
                    "file_exists": false,
                    "file_name": "src/common/gui/CStatusPanel.cpp",
                    "file_size": 0
                },
                {
                    "file_additions": 203,
                    "file_deletions": 86,
                    "file_exists": false,
                    "file_name": "src/common/gui/SurgeGUIEditor.cpp",
                    "file_size": 0
                }
            ],
            "interesting": {
                "reopen": false,
                "status": false
            },
            "is_parent": false,
            "sha": "89d0367fb3033a406d0bddf98bc3b722b7a58b48"
        },
        {
            "associated_pull_request": [
                "https://github.com/surge-synthesizer/surge/pull/1056"
            ],
            "date": "2019-08-19 15:04:18+00:00",
            "diff": "surge-synthesizer_surge/issue_1035/commit_af4bbd37ed4d75df90368747fd4e456d36ac4646.diff",
            "diff_additions": 76,
            "diff_deletions": 0,
            "diff_file_size": 156669,
            "diff_url": "https://github.com/surge-synthesizer/surge/commit/af4bbd37ed4d75df90368747fd4e456d36ac4646.diff",
            "exists": true,
            "files": [
                {
                    "file_additions": 12,
                    "file_deletions": 0,
                    "file_exists": true,
                    "file_name": "src/common/Parameter.cpp",
                    "file_size": 151858
                },
                {
                    "file_additions": 64,
                    "file_deletions": 0,
                    "file_exists": true,
                    "file_name": "src/common/dsp/Oscillator.cpp",
                    "file_size": 4811
                }
            ],
            "interesting": {
                "reopen": false,
                "status": false
            },
            "is_parent": false,
            "sha": "af4bbd37ed4d75df90368747fd4e456d36ac4646"
        },
        {
            "associated_pull_request": [
                "https://github.com/surge-synthesizer/surge/pull/1056"
            ],
            "date": "2019-08-19 15:12:04+00:00",
            "diff": "surge-synthesizer_surge/issue_1035/commit_6769ad27faf678b236c3a73a08c7eb012cdc7ce2.diff",
            "diff_additions": 76,
            "diff_deletions": 0,
            "diff_file_size": 156669,
            "diff_url": "https://github.com/surge-synthesizer/surge/commit/6769ad27faf678b236c3a73a08c7eb012cdc7ce2.diff",
            "exists": true,
            "files": [
                {
                    "file_additions": 12,
                    "file_deletions": 0,
                    "file_exists": true,
                    "file_name": "src/common/Parameter.cpp",
                    "file_size": 151858
                },
                {
                    "file_additions": 64,
                    "file_deletions": 0,
                    "file_exists": true,
                    "file_name": "src/common/dsp/Oscillator.cpp",
                    "file_size": 4811
                }
            ],
            "interesting": {
                "reopen": true,
                "status": false
            },
            "is_parent": false,
            "sha": "6769ad27faf678b236c3a73a08c7eb012cdc7ce2"
        },
        {
            "associated_pull_request": [
                "https://github.com/surge-synthesizer/surge/pull/1070"
            ],
            "date": "2019-08-21 00:41:35+00:00",
            "diff": "surge-synthesizer_surge/issue_1035/commit_b87f72384fa951eab0806142c6b4b93a9cd899d9.diff",
            "diff_additions": 9,
            "diff_deletions": 5,
            "diff_file_size": 170472,
            "diff_url": "https://github.com/surge-synthesizer/surge/commit/b87f72384fa951eab0806142c6b4b93a9cd899d9.diff",
            "exists": true,
            "files": [
                {
                    "file_additions": 8,
                    "file_deletions": 4,
                    "file_exists": true,
                    "file_name": "src/common/SurgePatch.cpp",
                    "file_size": 150229
                },
                {
                    "file_additions": 1,
                    "file_deletions": 1,
                    "file_exists": true,
                    "file_name": "src/common/SurgeSynthesizerIO.cpp",
                    "file_size": 20243
                }
            ],
            "interesting": {
                "reopen": false,
                "status": false
            },
            "is_parent": false,
            "sha": "b87f72384fa951eab0806142c6b4b93a9cd899d9"
        },
        {
            "associated_pull_request": [
                "https://github.com/surge-synthesizer/surge/pull/1070"
            ],
            "date": "2019-08-21 00:52:54+00:00",
            "diff": "surge-synthesizer_surge/issue_1035/commit_c6bb0ab3d8d806101fb8e729adc8631dd9997bae.diff",
            "diff_additions": 9,
            "diff_deletions": 5,
            "diff_file_size": 170472,
            "diff_url": "https://github.com/surge-synthesizer/surge/commit/c6bb0ab3d8d806101fb8e729adc8631dd9997bae.diff",
            "exists": true,
            "files": [
                {
                    "file_additions": 8,
                    "file_deletions": 4,
                    "file_exists": true,
                    "file_name": "src/common/SurgePatch.cpp",
                    "file_size": 150229
                },
                {
                    "file_additions": 1,
                    "file_deletions": 1,
                    "file_exists": true,
                    "file_name": "src/common/SurgeSynthesizerIO.cpp",
                    "file_size": 20243
                }
            ],
            "interesting": {
                "reopen": false,
                "status": false
            },
            "is_parent": false,
            "sha": "c6bb0ab3d8d806101fb8e729adc8631dd9997bae"
        }
    ],
    "first_commit": "2019-08-16 17:00:00+00:00",
    "last_commit": "2019-08-21 00:52:54+00:00",
    "number": 1035,
    "pull_request": "None",
    "score": {
        "accidental_reopen_likely": false,
        "all_labels": [
            "FM Enhancements"
        ],
        "contains_keywords": [
            "confirm",
            "work",
            "chang",
            "fix",
            "issu",
            "patch",
            "debug",
            "reason",
            "test",
            "fault",
            "bug",
            "problem",
            "report"
        ],
        "fix_size": 464,
        "has_labels": [],
        "intersecting": {
            "computed_score": 1.0,
            "final_commit_size": 12,
            "intersection_size": 12,
            "previous_commits_size": 464
        },
        "is_makefile_based": true,
        "no_new_files": [],
        "no_other_files": false,
        "num_prohibited_files": 359355,
        "prohibited_files": [
            "server/src/main/java/com/genymobile/scrcpy/Device.java",
            "server/src/main/java/com/genymobile/scrcpy/wrappers/SurfaceControl.java",
            "server/src/main/java/com/genymobile/scrcpy/Device.java",
            "server/src/main/java/com/genymobile/scrcpy/wrappers/SurfaceControl.java",
            "app/meson.build",
            "app/scrcpy.1",
            "app/src/common.h",
            "app/src/scrcpy.h",
            "app/src/server.h",
            "server/src/main/java/com/genymobile/scrcpy/Workarounds.java"
        ],
        "reopen": true,
        "reopen_events": [
            [
                "2019-08-16 21:46:31+00:00",
                "commit"
            ],
            [
                "2019-08-16 21:53:44+00:00",
                "closed"
            ],
            [
                "2019-08-16 21:53:45+00:00",
                "commit"
            ],
            [
                "2019-08-16 21:53:57+00:00",
                "reopened"
            ],
            [
                "2019-08-17 20:58:42+00:00",
                "commit"
            ],
            [
                "2019-08-17 21:06:33+00:00",
                "commit"
            ],
            [
                "2019-08-19 15:05:37+00:00",
                "commit"
            ],
            [
                "2019-08-19 15:12:06+00:00",
                "commit"
            ],
            [
                "2019-08-19 18:29:15+00:00",
                "closed"
            ],
            [
                "2019-08-20 23:39:56+00:00",
                "reopened"
            ],
            [
                "2019-08-21 00:42:45+00:00",
                "commit"
            ],
            [
                "2019-08-21 00:52:55+00:00",
                "closed"
            ],
            [
                "2019-08-21 00:52:56+00:00",
                "commit"
            ]
        ],
        "status": false,
        "strategy": true,
        "total_changes": 1163
    }
}