{
    "category": [
        "hardware/OS",
        "build/refactor/preprocessing"
    ],
    "commits": [
        {
            "associated_pull_request": [
                "https://github.com/surge-synthesizer/surge/pull/1733"
            ],
            "date": "2020-04-15 23:27:13",
            "diff": "surge-synthesizer_surge/issue_1731/commit_6eaf2b2e20c98e31bed91ac45cd4178304516bbd.diff",
            "diff_additions": 1,
            "diff_deletions": 0,
            "diff_file_size": 0,
            "diff_url": "https://github.com/surge-synthesizer/surge/commit/6eaf2b2e20c98e31bed91ac45cd4178304516bbd.diff",
            "exists": true,
            "files": [
                {
                    "file_additions": 1,
                    "file_deletions": 0,
                    "file_exists": false,
                    "file_name": "src/linux/UserInteractionsLinux.cpp",
                    "file_size": 0
                }
            ],
            "interesting": {
                "reopen": false,
                "status": false
            },
            "is_parent": true,
            "sha": "6eaf2b2e20c98e31bed91ac45cd4178304516bbd"
        },
        {
            "associated_pull_request": [],
            "date": "2020-04-16 00:27:42",
            "diff": "surge-synthesizer_surge/issue_1731/commit_2f69ce1b08ec0cd18e9ab86c447598019ce9b9a8.diff",
            "diff_additions": 13,
            "diff_deletions": 13,
            "diff_file_size": 274719,
            "diff_url": "https://github.com/surge-synthesizer/surge/commit/2f69ce1b08ec0cd18e9ab86c447598019ce9b9a8.diff",
            "exists": true,
            "files": [
                {
                    "file_additions": 4,
                    "file_deletions": 4,
                    "file_exists": true,
                    "file_name": "src/common/Parameter.cpp",
                    "file_size": 122346
                },
                {
                    "file_additions": 4,
                    "file_deletions": 4,
                    "file_exists": true,
                    "file_name": "src/common/SurgeSynthesizer.cpp",
                    "file_size": 135414
                },
                {
                    "file_additions": 1,
                    "file_deletions": 1,
                    "file_exists": true,
                    "file_name": "src/common/SurgeSynthesizerIO.cpp",
                    "file_size": 16959
                },
                {
                    "file_additions": 3,
                    "file_deletions": 3,
                    "file_exists": false,
                    "file_name": "src/common/WavSupport.cpp",
                    "file_size": 0
                },
                {
                    "file_additions": 1,
                    "file_deletions": 1,
                    "file_exists": false,
                    "file_name": "src/common/gui/CSnapshotMenu.cpp",
                    "file_size": 0
                }
            ],
            "interesting": {
                "reopen": false,
                "status": true
            },
            "is_parent": false,
            "sha": "2f69ce1b08ec0cd18e9ab86c447598019ce9b9a8"
        },
        {
            "associated_pull_request": [
                "https://github.com/surge-synthesizer/surge/pull/1734"
            ],
            "date": "2020-04-16 00:27:42",
            "diff": "surge-synthesizer_surge/issue_1731/commit_9042385081ec439f0b3c339f54add27bbe0b5881.diff",
            "diff_additions": 14,
            "diff_deletions": 14,
            "diff_file_size": 322240,
            "diff_url": "https://github.com/surge-synthesizer/surge/commit/9042385081ec439f0b3c339f54add27bbe0b5881.diff",
            "exists": true,
            "files": [
                {
                    "file_additions": 4,
                    "file_deletions": 4,
                    "file_exists": true,
                    "file_name": "src/common/Parameter.cpp",
                    "file_size": 122346
                },
                {
                    "file_additions": 4,
                    "file_deletions": 4,
                    "file_exists": true,
                    "file_name": "src/common/SurgeSynthesizer.cpp",
                    "file_size": 135414
                },
                {
                    "file_additions": 1,
                    "file_deletions": 1,
                    "file_exists": true,
                    "file_name": "src/common/SurgeSynthesizerIO.cpp",
                    "file_size": 16959
                },
                {
                    "file_additions": 3,
                    "file_deletions": 3,
                    "file_exists": false,
                    "file_name": "src/common/WavSupport.cpp",
                    "file_size": 0
                },
                {
                    "file_additions": 1,
                    "file_deletions": 1,
                    "file_exists": false,
                    "file_name": "src/common/gui/CSnapshotMenu.cpp",
                    "file_size": 0
                },
                {
                    "file_additions": 1,
                    "file_deletions": 1,
                    "file_exists": true,
                    "file_name": "src/headless/UnitTestsMOD.cpp",
                    "file_size": 47521
                }
            ],
            "interesting": {
                "reopen": false,
                "status": false
            },
            "is_parent": false,
            "sha": "9042385081ec439f0b3c339f54add27bbe0b5881"
        },
        {
            "associated_pull_request": [
                "https://github.com/surge-synthesizer/surge/pull/1734"
            ],
            "date": "2020-04-16 00:48:44",
            "diff": "surge-synthesizer_surge/issue_1731/commit_c2c229b5d965bd15d0ea1ff71b8060d5732cb61d.diff",
            "diff_additions": 14,
            "diff_deletions": 14,
            "diff_file_size": 322240,
            "diff_url": "https://github.com/surge-synthesizer/surge/commit/c2c229b5d965bd15d0ea1ff71b8060d5732cb61d.diff",
            "exists": true,
            "files": [
                {
                    "file_additions": 4,
                    "file_deletions": 4,
                    "file_exists": true,
                    "file_name": "src/common/Parameter.cpp",
                    "file_size": 122346
                },
                {
                    "file_additions": 4,
                    "file_deletions": 4,
                    "file_exists": true,
                    "file_name": "src/common/SurgeSynthesizer.cpp",
                    "file_size": 135414
                },
                {
                    "file_additions": 1,
                    "file_deletions": 1,
                    "file_exists": true,
                    "file_name": "src/common/SurgeSynthesizerIO.cpp",
                    "file_size": 16959
                },
                {
                    "file_additions": 3,
                    "file_deletions": 3,
                    "file_exists": false,
                    "file_name": "src/common/WavSupport.cpp",
                    "file_size": 0
                },
                {
                    "file_additions": 1,
                    "file_deletions": 1,
                    "file_exists": false,
                    "file_name": "src/common/gui/CSnapshotMenu.cpp",
                    "file_size": 0
                },
                {
                    "file_additions": 1,
                    "file_deletions": 1,
                    "file_exists": true,
                    "file_name": "src/headless/UnitTestsMOD.cpp",
                    "file_size": 47521
                }
            ],
            "interesting": {
                "reopen": false,
                "status": false
            },
            "is_parent": false,
            "sha": "c2c229b5d965bd15d0ea1ff71b8060d5732cb61d"
        },
        {
            "associated_pull_request": [],
            "date": "2020-05-29 13:49:05",
            "diff": "surge-synthesizer_surge/issue_1731/commit_d543367ec6f1067452306e1e663c1a173306fe1e.diff",
            "diff_additions": 12,
            "diff_deletions": 86,
            "diff_file_size": 148437,
            "diff_url": "https://github.com/surge-synthesizer/surge/commit/d543367ec6f1067452306e1e663c1a173306fe1e.diff",
            "exists": true,
            "files": [
                {
                    "file_additions": 3,
                    "file_deletions": 3,
                    "file_exists": true,
                    "file_name": "src/common/Parameter.cpp",
                    "file_size": 122346
                },
                {
                    "file_additions": 3,
                    "file_deletions": 14,
                    "file_exists": true,
                    "file_name": "src/common/SurgeSynthesizerIO.cpp",
                    "file_size": 16959
                },
                {
                    "file_additions": 1,
                    "file_deletions": 14,
                    "file_exists": true,
                    "file_name": "src/common/UserDefaults.cpp",
                    "file_size": 9132
                },
                {
                    "file_additions": 1,
                    "file_deletions": 13,
                    "file_exists": false,
                    "file_name": "src/common/WavSupport.cpp",
                    "file_size": 0
                },
                {
                    "file_additions": 2,
                    "file_deletions": 15,
                    "file_exists": false,
                    "file_name": "src/common/gui/COscillatorDisplay.cpp",
                    "file_size": 0
                },
                {
                    "file_additions": 1,
                    "file_deletions": 11,
                    "file_exists": false,
                    "file_name": "src/common/gui/SkinSupport.cpp",
                    "file_size": 0
                },
                {
                    "file_additions": 1,
                    "file_deletions": 16,
                    "file_exists": false,
                    "file_name": "src/common/gui/SurgeGUIEditor.cpp",
                    "file_size": 0
                }
            ],
            "interesting": {
                "reopen": false,
                "status": true
            },
            "is_parent": false,
            "sha": "d543367ec6f1067452306e1e663c1a173306fe1e"
        },
        {
            "associated_pull_request": [],
            "date": "2020-05-29 13:49:05",
            "diff": "surge-synthesizer_surge/issue_1731/commit_417687894a357aabf0f5a0852810942f9cbc7844.diff",
            "diff_additions": 12,
            "diff_deletions": 86,
            "diff_file_size": 148437,
            "diff_url": "https://github.com/surge-synthesizer/surge/commit/417687894a357aabf0f5a0852810942f9cbc7844.diff",
            "exists": true,
            "files": [
                {
                    "file_additions": 3,
                    "file_deletions": 3,
                    "file_exists": true,
                    "file_name": "src/common/Parameter.cpp",
                    "file_size": 122346
                },
                {
                    "file_additions": 3,
                    "file_deletions": 14,
                    "file_exists": true,
                    "file_name": "src/common/SurgeSynthesizerIO.cpp",
                    "file_size": 16959
                },
                {
                    "file_additions": 1,
                    "file_deletions": 14,
                    "file_exists": true,
                    "file_name": "src/common/UserDefaults.cpp",
                    "file_size": 9132
                },
                {
                    "file_additions": 1,
                    "file_deletions": 13,
                    "file_exists": false,
                    "file_name": "src/common/WavSupport.cpp",
                    "file_size": 0
                },
                {
                    "file_additions": 2,
                    "file_deletions": 15,
                    "file_exists": false,
                    "file_name": "src/common/gui/COscillatorDisplay.cpp",
                    "file_size": 0
                },
                {
                    "file_additions": 1,
                    "file_deletions": 11,
                    "file_exists": false,
                    "file_name": "src/common/gui/SkinSupport.cpp",
                    "file_size": 0
                },
                {
                    "file_additions": 1,
                    "file_deletions": 16,
                    "file_exists": false,
                    "file_name": "src/common/gui/SurgeGUIEditor.cpp",
                    "file_size": 0
                }
            ],
            "interesting": {
                "reopen": false,
                "status": true
            },
            "is_parent": false,
            "sha": "417687894a357aabf0f5a0852810942f9cbc7844"
        },
        {
            "associated_pull_request": [
                "https://github.com/surge-synthesizer/surge/pull/1981"
            ],
            "date": "2020-05-29 13:49:05",
            "diff": "surge-synthesizer_surge/issue_1731/commit_bad2728ca29c0e941df5b097118642725abe48de.diff",
            "diff_additions": 12,
            "diff_deletions": 83,
            "diff_file_size": 148437,
            "diff_url": "https://github.com/surge-synthesizer/surge/commit/bad2728ca29c0e941df5b097118642725abe48de.diff",
            "exists": true,
            "files": [
                {
                    "file_additions": 3,
                    "file_deletions": 3,
                    "file_exists": true,
                    "file_name": "src/common/Parameter.cpp",
                    "file_size": 122346
                },
                {
                    "file_additions": 3,
                    "file_deletions": 14,
                    "file_exists": true,
                    "file_name": "src/common/SurgeSynthesizerIO.cpp",
                    "file_size": 16959
                },
                {
                    "file_additions": 1,
                    "file_deletions": 14,
                    "file_exists": true,
                    "file_name": "src/common/UserDefaults.cpp",
                    "file_size": 9132
                },
                {
                    "file_additions": 1,
                    "file_deletions": 13,
                    "file_exists": false,
                    "file_name": "src/common/WavSupport.cpp",
                    "file_size": 0
                },
                {
                    "file_additions": 2,
                    "file_deletions": 15,
                    "file_exists": false,
                    "file_name": "src/common/gui/COscillatorDisplay.cpp",
                    "file_size": 0
                },
                {
                    "file_additions": 1,
                    "file_deletions": 11,
                    "file_exists": false,
                    "file_name": "src/common/gui/SkinSupport.cpp",
                    "file_size": 0
                },
                {
                    "file_additions": 1,
                    "file_deletions": 13,
                    "file_exists": false,
                    "file_name": "src/common/gui/SurgeGUIEditor.cpp",
                    "file_size": 0
                }
            ],
            "interesting": {
                "reopen": false,
                "status": false
            },
            "is_parent": false,
            "sha": "bad2728ca29c0e941df5b097118642725abe48de"
        },
        {
            "associated_pull_request": [
                "https://github.com/surge-synthesizer/surge/pull/1981"
            ],
            "date": "2020-05-29 14:16:43",
            "diff": "surge-synthesizer_surge/issue_1731/commit_50a0c27201db8a82769081161c489d855f12ebab.diff",
            "diff_additions": 12,
            "diff_deletions": 83,
            "diff_file_size": 148437,
            "diff_url": "https://github.com/surge-synthesizer/surge/commit/50a0c27201db8a82769081161c489d855f12ebab.diff",
            "exists": true,
            "files": [
                {
                    "file_additions": 3,
                    "file_deletions": 3,
                    "file_exists": true,
                    "file_name": "src/common/Parameter.cpp",
                    "file_size": 122346
                },
                {
                    "file_additions": 3,
                    "file_deletions": 14,
                    "file_exists": true,
                    "file_name": "src/common/SurgeSynthesizerIO.cpp",
                    "file_size": 16959
                },
                {
                    "file_additions": 1,
                    "file_deletions": 14,
                    "file_exists": true,
                    "file_name": "src/common/UserDefaults.cpp",
                    "file_size": 9132
                },
                {
                    "file_additions": 1,
                    "file_deletions": 13,
                    "file_exists": false,
                    "file_name": "src/common/WavSupport.cpp",
                    "file_size": 0
                },
                {
                    "file_additions": 2,
                    "file_deletions": 15,
                    "file_exists": false,
                    "file_name": "src/common/gui/COscillatorDisplay.cpp",
                    "file_size": 0
                },
                {
                    "file_additions": 1,
                    "file_deletions": 11,
                    "file_exists": false,
                    "file_name": "src/common/gui/SkinSupport.cpp",
                    "file_size": 0
                },
                {
                    "file_additions": 1,
                    "file_deletions": 13,
                    "file_exists": false,
                    "file_name": "src/common/gui/SurgeGUIEditor.cpp",
                    "file_size": 0
                }
            ],
            "interesting": {
                "reopen": false,
                "status": false
            },
            "is_parent": false,
            "sha": "50a0c27201db8a82769081161c489d855f12ebab"
        }
    ],
    "first_commit": "2020-04-15 23:27:13",
    "last_commit": "2020-05-29 14:16:43",
    "number": 1731,
    "pull_request": "None",
    "score": {
        "accidental_reopen_likely": false,
        "all_labels": [
            "Infrastructure"
        ],
        "contains_keywords": [
            "warn",
            "problem",
            "chang",
            "work",
            "error"
        ],
        "fix_size": 113,
        "has_labels": [],
        "intersecting": {
            "computed_score": 1.0,
            "final_commit_size": 91,
            "intersection_size": 91,
            "previous_commits_size": 113
        },
        "is_makefile_based": true,
        "no_new_files": [],
        "no_other_files": false,
        "num_prohibited_files": 78565,
        "prohibited_files": [
            "tools/building.py",
            "tools/building.py",
            "tools/building.py",
            "emcc.py",
            "src/library_emmalloc.js",
            "src/shell.js",
            "tests/test_core.py",
            "src/shell.js",
            "tests/test_core.py",
            "src/library.js"
        ],
        "reopen": false,
        "reopen_events": [
            [
                "2020-04-16 00:30:10",
                "commit"
            ],
            [
                "2020-04-16 00:39:10",
                "commit"
            ],
            [
                "2020-04-16 00:48:46",
                "commit"
            ],
            [
                "2020-05-29 13:50:02",
                "commit"
            ],
            [
                "2020-05-29 13:55:59",
                "commit"
            ],
            [
                "2020-05-29 14:06:39",
                "commit"
            ],
            [
                "2020-05-29 14:16:44",
                "closed"
            ],
            [
                "2020-05-29 14:16:46",
                "commit"
            ]
        ],
        "status": true,
        "strategy": true,
        "total_changes": 469
    }
}