{
    "commits": [
        {
            "associated_pull_request": [
                "https://github.com/FRRouting/frr/pull/1403"
            ],
            "date": "2017-11-06 16:07:21+00:00",
            "diff": "frrouting_frr/issue_1404/commit_fa74cda30a5bd77d1c42df9b6fcfcdf090543ea1.diff",
            "diff_additions": 43,
            "diff_deletions": 10,
            "diff_file_size": 54564,
            "diff_url": "https://github.com/FRRouting/frr/commit/fa74cda30a5bd77d1c42df9b6fcfcdf090543ea1.diff",
            "exists": true,
            "files": [
                {
                    "file_additions": 43,
                    "file_deletions": 10,
                    "file_exists": true,
                    "file_name": "zebra/zebra_routemap.c",
                    "file_size": 54564
                }
            ],
            "interesting": {
                "reopen": false,
                "status": false
            },
            "is_parent": true,
            "sha": "fa74cda30a5bd77d1c42df9b6fcfcdf090543ea1"
        },
        {
            "associated_pull_request": [
                "https://github.com/FRRouting/frr/pull/1414"
            ],
            "date": "2017-11-06 16:20:40+00:00",
            "diff": "frrouting_frr/issue_1404/commit_ae2158fecf0a6f63927e6bb4404f762a32328555.diff",
            "diff_additions": 1,
            "diff_deletions": 1,
            "diff_file_size": 93295,
            "diff_url": "https://github.com/FRRouting/frr/commit/ae2158fecf0a6f63927e6bb4404f762a32328555.diff",
            "exists": true,
            "files": [
                {
                    "file_additions": 1,
                    "file_deletions": 1,
                    "file_exists": true,
                    "file_name": "lib/routemap.c",
                    "file_size": 93295
                }
            ],
            "interesting": {
                "reopen": true,
                "status": false
            },
            "is_parent": false,
            "sha": "ae2158fecf0a6f63927e6bb4404f762a32328555"
        },
        {
            "associated_pull_request": [],
            "date": "2017-11-06 16:20:40+00:00",
            "diff": "frrouting_frr/issue_1404/commit_eaee01c2294cce421d5928514ba5246ba759ca3c.diff",
            "diff_additions": 1,
            "diff_deletions": 1,
            "diff_file_size": 93295,
            "diff_url": "https://github.com/FRRouting/frr/commit/eaee01c2294cce421d5928514ba5246ba759ca3c.diff",
            "exists": true,
            "files": [
                {
                    "file_additions": 1,
                    "file_deletions": 1,
                    "file_exists": true,
                    "file_name": "lib/routemap.c",
                    "file_size": 93295
                }
            ],
            "interesting": {
                "reopen": false,
                "status": false
            },
            "is_parent": false,
            "sha": "eaee01c2294cce421d5928514ba5246ba759ca3c"
        }
    ],
    "first_commit": "2017-11-06 16:07:21+00:00",
    "last_commit": "2017-11-06 23:47:20+00:00",
    "number": 1404,
    "pull_request": "None",
    "score": {
        "accidental_reopen_likely": false,
        "all_labels": [],
        "contains_keywords": [
            "confirm",
            "work",
            "fix"
        ],
        "fix_size": 3,
        "has_labels": [],
        "intersecting": {
            "computed_score": 0.5,
            "final_commit_size": 2,
            "intersection_size": 1,
            "previous_commits_size": 2
        },
        "is_makefile_based": true,
        "no_new_files": [],
        "no_other_files": false,
        "num_prohibited_files": 107256,
        "prohibited_files": [
            "server/src/main/java/com/genymobile/scrcpy/Device.java",
            "server/src/main/java/com/genymobile/scrcpy/wrappers/SurfaceControl.java",
            "server/src/main/java/com/genymobile/scrcpy/Device.java",
            "server/src/main/java/com/genymobile/scrcpy/wrappers/SurfaceControl.java",
            "app/meson.build",
            "app/scrcpy.1",
            "app/src/common.h",
            "app/src/scrcpy.h",
            "app/src/server.h",
            "server/src/main/java/com/genymobile/scrcpy/Workarounds.java"
        ],
        "reopen": true,
        "reopen_events": [
            [
                "2017-11-06 16:24:10+00:00",
                "commit"
            ],
            [
                "2017-11-06 18:52:21+00:00",
                "closed"
            ],
            [
                "2017-11-06 18:58:58+00:00",
                "reopened"
            ],
            [
                "2017-11-06 23:50:13+00:00",
                "commit"
            ],
            [
                "2017-11-06 23:50:40+00:00",
                "closed"
            ]
        ],
        "status": false,
        "strategy": true,
        "total_changes": 57
    }
}