{
    "commits": [
        {
            "associated_pull_request": [
                "https://github.com/FRRouting/frr/pull/13608"
            ],
            "date": "2023-05-27 12:35:25+00:00",
            "diff": "frrouting_frr/issue_13454/commit_607c84f406b01fcd8cbe3e7f5bdd9e06d59fd950.diff",
            "diff_additions": 9,
            "diff_deletions": 6,
            "diff_file_size": 4574,
            "diff_url": "https://github.com/FRRouting/frr/commit/607c84f406b01fcd8cbe3e7f5bdd9e06d59fd950.diff",
            "exists": true,
            "files": [
                {
                    "file_additions": 9,
                    "file_deletions": 6,
                    "file_exists": true,
                    "file_name": "vtysh/vtysh_user.c",
                    "file_size": 4574
                }
            ],
            "interesting": {
                "reopen": false,
                "status": false
            },
            "is_parent": true,
            "sha": "607c84f406b01fcd8cbe3e7f5bdd9e06d59fd950"
        },
        {
            "associated_pull_request": [],
            "date": "2023-05-27 15:14:45+00:00",
            "diff": "frrouting_frr/issue_13454/commit_e0cdf717a7a6a7478e88a4f435c4d3726d13220b.diff",
            "diff_additions": 0,
            "diff_deletions": 8,
            "diff_file_size": 43676,
            "diff_url": "https://github.com/FRRouting/frr/commit/e0cdf717a7a6a7478e88a4f435c4d3726d13220b.diff",
            "exists": true,
            "files": [
                {
                    "file_additions": 0,
                    "file_deletions": 8,
                    "file_exists": true,
                    "file_name": "pimd/pim_iface.c",
                    "file_size": 43676
                }
            ],
            "interesting": {
                "reopen": false,
                "status": true
            },
            "is_parent": false,
            "sha": "e0cdf717a7a6a7478e88a4f435c4d3726d13220b"
        },
        {
            "associated_pull_request": [
                "https://github.com/FRRouting/frr/pull/13617"
            ],
            "date": "2023-05-30 08:45:45+00:00",
            "diff": "frrouting_frr/issue_13454/commit_b016b552a6169e0e2f6c3a8d10429f9fe63b4add.diff",
            "diff_additions": 10,
            "diff_deletions": 3,
            "diff_file_size": 43676,
            "diff_url": "https://github.com/FRRouting/frr/commit/b016b552a6169e0e2f6c3a8d10429f9fe63b4add.diff",
            "exists": true,
            "files": [
                {
                    "file_additions": 10,
                    "file_deletions": 3,
                    "file_exists": true,
                    "file_name": "pimd/pim_iface.c",
                    "file_size": 43676
                }
            ],
            "interesting": {
                "reopen": false,
                "status": false
            },
            "is_parent": false,
            "sha": "b016b552a6169e0e2f6c3a8d10429f9fe63b4add"
        },
        {
            "associated_pull_request": [
                "https://github.com/FRRouting/frr/pull/14558"
            ],
            "date": "2023-05-30 08:45:45+00:00",
            "diff": "frrouting_frr/issue_13454/commit_8593ef268cd90b1feec8cfcc6fa923f1fac4b8e3.diff",
            "diff_additions": 10,
            "diff_deletions": 3,
            "diff_file_size": 43676,
            "diff_url": "https://github.com/FRRouting/frr/commit/8593ef268cd90b1feec8cfcc6fa923f1fac4b8e3.diff",
            "exists": true,
            "files": [
                {
                    "file_additions": 10,
                    "file_deletions": 3,
                    "file_exists": true,
                    "file_name": "pimd/pim_iface.c",
                    "file_size": 43676
                }
            ],
            "interesting": {
                "reopen": false,
                "status": false
            },
            "is_parent": false,
            "sha": "8593ef268cd90b1feec8cfcc6fa923f1fac4b8e3"
        }
    ],
    "first_commit": "2023-05-27 12:35:25+00:00",
    "last_commit": "2023-10-10 16:52:23+00:00",
    "number": 13454,
    "pull_request": "None",
    "score": {
        "accidental_reopen_likely": false,
        "all_labels": [
            "triage",
            "pim"
        ],
        "contains_keywords": [
            "work",
            "chang",
            "fault",
            "remov",
            "error"
        ],
        "fix_size": 17,
        "has_labels": [],
        "intersecting": {
            "computed_score": 0.5454545454545454,
            "final_commit_size": 11,
            "intersection_size": 6,
            "previous_commits_size": 12
        },
        "is_makefile_based": true,
        "no_new_files": [],
        "no_other_files": true,
        "num_prohibited_files": 142808,
        "prohibited_files": [
            "server/src/main/java/com/genymobile/scrcpy/Device.java",
            "server/src/main/java/com/genymobile/scrcpy/wrappers/SurfaceControl.java",
            "server/src/main/java/com/genymobile/scrcpy/Device.java",
            "server/src/main/java/com/genymobile/scrcpy/wrappers/SurfaceControl.java",
            "app/meson.build",
            "app/scrcpy.1",
            "app/src/common.h",
            "app/src/scrcpy.h",
            "app/src/server.h",
            "server/src/main/java/com/genymobile/scrcpy/Workarounds.java"
        ],
        "reopen": false,
        "reopen_events": [
            [
                "2023-05-27 15:31:04+00:00",
                "commit"
            ],
            [
                "2023-05-30 09:32:47+00:00",
                "commit"
            ],
            [
                "2023-10-10 16:40:26+00:00",
                "closed"
            ],
            [
                "2023-10-10 16:52:25+00:00",
                "commit"
            ]
        ],
        "status": true,
        "strategy": true,
        "total_changes": 49
    }
}