{
    "covered_issues": [
        226,
        223,
        221,
        220,
        209,
        208,
        205,
        203,
        198,
        191,
        189,
        187,
        186,
        181,
        179,
        162,
        156,
        155,
        151,
        150,
        147,
        145,
        142,
        139,
        138,
        137,
        136,
        135,
        134,
        133,
        132,
        131,
        130,
        125,
        123,
        122,
        115,
        114,
        113,
        111,
        105,
        103,
        101,
        98,
        96,
        95,
        89,
        88,
        87,
        85,
        83,
        81,
        78,
        72,
        71,
        70,
        60,
        57,
        56,
        54,
        52,
        51,
        50,
        49,
        47,
        44,
        43,
        40,
        33,
        30,
        29,
        28,
        25,
        24,
        23,
        22,
        21,
        20,
        18,
        15,
        14,
        12,
        11,
        10,
        8,
        6,
        5,
        3
    ],
    "finished": true
}