{
    "commits": [
        {
            "diff": "elastic_elasticsearch/issue_44669/commit_4f75526a5666b94f4e7db977d796835085ec19b8.diff",
            "diff_additions": 1,
            "diff_deletions": 1,
            "diff_file_size": 20666,
            "files": [
                {
                    "file_additions": 1,
                    "file_deletions": 1,
                    "file_exists": true,
                    "file_name": "server/src/test/java/org/elasticsearch/persistent/TestPersistentTasksPlugin.java",
                    "file_size": 20666
                }
            ],
            "interesting": {
                "reopened": false,
                "status": false
            },
            "sha": "4f75526a5666b94f4e7db977d796835085ec19b8"
        },
        {
            "diff": "elastic_elasticsearch/issue_44669/commit_9e53d6dcb07a629d7c6a26384302dc866a39595e.diff",
            "diff_additions": 9,
            "diff_deletions": 0,
            "diff_file_size": 8438,
            "files": [
                {
                    "file_additions": 9,
                    "file_deletions": 0,
                    "file_exists": true,
                    "file_name": "distribution/tools/launchers/src/test/java/org/elasticsearch/tools/launchers/JvmErgonomicsTests.java",
                    "file_size": 8438
                }
            ],
            "interesting": {
                "reopened": false,
                "status": false
            },
            "sha": "9e53d6dcb07a629d7c6a26384302dc866a39595e"
        },
        {
            "diff": "elastic_elasticsearch/issue_44669/commit_8e0b5ea03dec353aacb7da24f089cdfd665b291d.diff",
            "diff_additions": 9,
            "diff_deletions": 0,
            "diff_file_size": 8438,
            "files": [
                {
                    "file_additions": 9,
                    "file_deletions": 0,
                    "file_exists": true,
                    "file_name": "distribution/tools/launchers/src/test/java/org/elasticsearch/tools/launchers/JvmErgonomicsTests.java",
                    "file_size": 8438
                }
            ],
            "interesting": {
                "reopened": false,
                "status": false
            },
            "sha": "8e0b5ea03dec353aacb7da24f089cdfd665b291d"
        },
        {
            "diff": "elastic_elasticsearch/issue_44669/commit_45d573af30579012ca0fd8bb7aee56ee92028e68.diff",
            "diff_additions": 9,
            "diff_deletions": 0,
            "diff_file_size": 8438,
            "files": [
                {
                    "file_additions": 9,
                    "file_deletions": 0,
                    "file_exists": true,
                    "file_name": "distribution/tools/launchers/src/test/java/org/elasticsearch/tools/launchers/JvmErgonomicsTests.java",
                    "file_size": 8438
                }
            ],
            "interesting": {
                "reopened": false,
                "status": false
            },
            "sha": "45d573af30579012ca0fd8bb7aee56ee92028e68"
        },
        {
            "diff": "elastic_elasticsearch/issue_44669/commit_3febe78e8e1d76843e73b9396b21f7c46edd3e53.diff",
            "diff_additions": 25,
            "diff_deletions": 4,
            "diff_file_size": 81373,
            "files": [
                {
                    "file_additions": 9,
                    "file_deletions": 0,
                    "file_exists": true,
                    "file_name": "distribution/tools/launchers/src/test/java/org/elasticsearch/tools/launchers/JvmErgonomicsTests.java",
                    "file_size": 8438
                },
                {
                    "file_additions": 3,
                    "file_deletions": 0,
                    "file_exists": true,
                    "file_name": "modules/ingest-geoip/src/test/java/org/elasticsearch/ingest/geoip/GeoIpProcessorFactoryTests.java",
                    "file_size": 18541
                },
                {
                    "file_additions": 1,
                    "file_deletions": 0,
                    "file_exists": true,
                    "file_name": "qa/evil-tests/src/test/java/org/elasticsearch/bootstrap/EvilSecurityTests.java",
                    "file_size": 12169
                },
                {
                    "file_additions": 3,
                    "file_deletions": 3,
                    "file_exists": true,
                    "file_name": "qa/logging-config/src/test/java/org/elasticsearch/common/logging/ESJsonLayoutTests.java",
                    "file_size": 2799
                },
                {
                    "file_additions": 2,
                    "file_deletions": 0,
                    "file_exists": true,
                    "file_name": "server/src/test/java/org/elasticsearch/node/NodeTests.java",
                    "file_size": 18760
                },
                {
                    "file_additions": 1,
                    "file_deletions": 1,
                    "file_exists": true,
                    "file_name": "server/src/test/java/org/elasticsearch/persistent/TestPersistentTasksPlugin.java",
                    "file_size": 20666
                },
                {
                    "file_additions": 2,
                    "file_deletions": 0,
                    "file_exists": false,
                    "file_name": "server/src/test/java/org/elasticsearch/snapshots/SharedClusterSnapshotRestoreIT.java",
                    "file_size": 0
                },
                {
                    "file_additions": 2,
                    "file_deletions": 0,
                    "file_exists": false,
                    "file_name": "x-pack/plugin/ml/qa/native-multi-node-tests/src/test/java/org/elasticsearch/xpack/ml/integration/BasicRenormalizationIT.java",
                    "file_size": 0
                },
                {
                    "file_additions": 2,
                    "file_deletions": 0,
                    "file_exists": false,
                    "file_name": "x-pack/plugin/ml/qa/native-multi-node-tests/src/test/java/org/elasticsearch/xpack/ml/integration/ForecastIT.java",
                    "file_size": 0
                }
            ],
            "interesting": {
                "reopened": false,
                "status": false
            },
            "sha": "3febe78e8e1d76843e73b9396b21f7c46edd3e53"
        },
        {
            "diff": "elastic_elasticsearch/issue_44669/commit_b34ac66d96cae456529e5e04c1852593551c3e13.diff",
            "diff_additions": 25,
            "diff_deletions": 4,
            "diff_file_size": 81373,
            "files": [
                {
                    "file_additions": 9,
                    "file_deletions": 0,
                    "file_exists": true,
                    "file_name": "distribution/tools/launchers/src/test/java/org/elasticsearch/tools/launchers/JvmErgonomicsTests.java",
                    "file_size": 8438
                },
                {
                    "file_additions": 3,
                    "file_deletions": 0,
                    "file_exists": true,
                    "file_name": "modules/ingest-geoip/src/test/java/org/elasticsearch/ingest/geoip/GeoIpProcessorFactoryTests.java",
                    "file_size": 18541
                },
                {
                    "file_additions": 1,
                    "file_deletions": 0,
                    "file_exists": true,
                    "file_name": "qa/evil-tests/src/test/java/org/elasticsearch/bootstrap/EvilSecurityTests.java",
                    "file_size": 12169
                },
                {
                    "file_additions": 3,
                    "file_deletions": 3,
                    "file_exists": true,
                    "file_name": "qa/logging-config/src/test/java/org/elasticsearch/common/logging/ESJsonLayoutTests.java",
                    "file_size": 2799
                },
                {
                    "file_additions": 2,
                    "file_deletions": 0,
                    "file_exists": true,
                    "file_name": "server/src/test/java/org/elasticsearch/node/NodeTests.java",
                    "file_size": 18760
                },
                {
                    "file_additions": 1,
                    "file_deletions": 1,
                    "file_exists": true,
                    "file_name": "server/src/test/java/org/elasticsearch/persistent/TestPersistentTasksPlugin.java",
                    "file_size": 20666
                },
                {
                    "file_additions": 2,
                    "file_deletions": 0,
                    "file_exists": false,
                    "file_name": "server/src/test/java/org/elasticsearch/snapshots/SharedClusterSnapshotRestoreIT.java",
                    "file_size": 0
                },
                {
                    "file_additions": 2,
                    "file_deletions": 0,
                    "file_exists": false,
                    "file_name": "x-pack/plugin/ml/qa/native-multi-node-tests/src/test/java/org/elasticsearch/xpack/ml/integration/BasicRenormalizationIT.java",
                    "file_size": 0
                },
                {
                    "file_additions": 2,
                    "file_deletions": 0,
                    "file_exists": false,
                    "file_name": "x-pack/plugin/ml/qa/native-multi-node-tests/src/test/java/org/elasticsearch/xpack/ml/integration/ForecastIT.java",
                    "file_size": 0
                }
            ],
            "interesting": {
                "reopened": false,
                "status": false
            },
            "sha": "b34ac66d96cae456529e5e04c1852593551c3e13"
        },
        {
            "diff": "elastic_elasticsearch/issue_44669/commit_9cb2ab3e35261a9c9e43ef3c979d966212bab1d4.diff",
            "diff_additions": 22,
            "diff_deletions": 1,
            "diff_file_size": 78574,
            "files": [
                {
                    "file_additions": 9,
                    "file_deletions": 0,
                    "file_exists": true,
                    "file_name": "distribution/tools/launchers/src/test/java/org/elasticsearch/tools/launchers/JvmErgonomicsTests.java",
                    "file_size": 8438
                },
                {
                    "file_additions": 3,
                    "file_deletions": 0,
                    "file_exists": true,
                    "file_name": "modules/ingest-geoip/src/test/java/org/elasticsearch/ingest/geoip/GeoIpProcessorFactoryTests.java",
                    "file_size": 18541
                },
                {
                    "file_additions": 1,
                    "file_deletions": 0,
                    "file_exists": true,
                    "file_name": "qa/evil-tests/src/test/java/org/elasticsearch/bootstrap/EvilSecurityTests.java",
                    "file_size": 12169
                },
                {
                    "file_additions": 2,
                    "file_deletions": 0,
                    "file_exists": true,
                    "file_name": "server/src/test/java/org/elasticsearch/node/NodeTests.java",
                    "file_size": 18760
                },
                {
                    "file_additions": 1,
                    "file_deletions": 1,
                    "file_exists": true,
                    "file_name": "server/src/test/java/org/elasticsearch/persistent/TestPersistentTasksPlugin.java",
                    "file_size": 20666
                },
                {
                    "file_additions": 2,
                    "file_deletions": 0,
                    "file_exists": false,
                    "file_name": "server/src/test/java/org/elasticsearch/snapshots/SharedClusterSnapshotRestoreIT.java",
                    "file_size": 0
                },
                {
                    "file_additions": 2,
                    "file_deletions": 0,
                    "file_exists": false,
                    "file_name": "x-pack/plugin/ml/qa/native-multi-node-tests/src/test/java/org/elasticsearch/xpack/ml/integration/BasicRenormalizationIT.java",
                    "file_size": 0
                },
                {
                    "file_additions": 2,
                    "file_deletions": 0,
                    "file_exists": false,
                    "file_name": "x-pack/plugin/ml/qa/native-multi-node-tests/src/test/java/org/elasticsearch/xpack/ml/integration/ForecastIT.java",
                    "file_size": 0
                }
            ],
            "interesting": {
                "reopened": false,
                "status": false
            },
            "sha": "9cb2ab3e35261a9c9e43ef3c979d966212bab1d4"
        },
        {
            "diff": "elastic_elasticsearch/issue_44669/commit_797fb70e24bca542ffd8367c38040a9ac128f0b5.diff",
            "diff_additions": 22,
            "diff_deletions": 1,
            "diff_file_size": 78574,
            "files": [
                {
                    "file_additions": 9,
                    "file_deletions": 0,
                    "file_exists": true,
                    "file_name": "distribution/tools/launchers/src/test/java/org/elasticsearch/tools/launchers/JvmErgonomicsTests.java",
                    "file_size": 8438
                },
                {
                    "file_additions": 3,
                    "file_deletions": 0,
                    "file_exists": true,
                    "file_name": "modules/ingest-geoip/src/test/java/org/elasticsearch/ingest/geoip/GeoIpProcessorFactoryTests.java",
                    "file_size": 18541
                },
                {
                    "file_additions": 1,
                    "file_deletions": 0,
                    "file_exists": true,
                    "file_name": "qa/evil-tests/src/test/java/org/elasticsearch/bootstrap/EvilSecurityTests.java",
                    "file_size": 12169
                },
                {
                    "file_additions": 2,
                    "file_deletions": 0,
                    "file_exists": true,
                    "file_name": "server/src/test/java/org/elasticsearch/node/NodeTests.java",
                    "file_size": 18760
                },
                {
                    "file_additions": 1,
                    "file_deletions": 1,
                    "file_exists": true,
                    "file_name": "server/src/test/java/org/elasticsearch/persistent/TestPersistentTasksPlugin.java",
                    "file_size": 20666
                },
                {
                    "file_additions": 2,
                    "file_deletions": 0,
                    "file_exists": false,
                    "file_name": "server/src/test/java/org/elasticsearch/snapshots/SharedClusterSnapshotRestoreIT.java",
                    "file_size": 0
                },
                {
                    "file_additions": 2,
                    "file_deletions": 0,
                    "file_exists": false,
                    "file_name": "x-pack/plugin/ml/qa/native-multi-node-tests/src/test/java/org/elasticsearch/xpack/ml/integration/BasicRenormalizationIT.java",
                    "file_size": 0
                },
                {
                    "file_additions": 2,
                    "file_deletions": 0,
                    "file_exists": false,
                    "file_name": "x-pack/plugin/ml/qa/native-multi-node-tests/src/test/java/org/elasticsearch/xpack/ml/integration/ForecastIT.java",
                    "file_size": 0
                }
            ],
            "interesting": {
                "reopened": true,
                "status": false
            },
            "sha": "797fb70e24bca542ffd8367c38040a9ac128f0b5"
        },
        {
            "diff": "elastic_elasticsearch/issue_44669/commit_beb32f2d8ff44dbcd1ec5390f0a449ce62576cdc.diff",
            "diff_additions": 25,
            "diff_deletions": 4,
            "diff_file_size": 81373,
            "files": [
                {
                    "file_additions": 9,
                    "file_deletions": 0,
                    "file_exists": true,
                    "file_name": "distribution/tools/launchers/src/test/java/org/elasticsearch/tools/launchers/JvmErgonomicsTests.java",
                    "file_size": 8438
                },
                {
                    "file_additions": 3,
                    "file_deletions": 0,
                    "file_exists": true,
                    "file_name": "modules/ingest-geoip/src/test/java/org/elasticsearch/ingest/geoip/GeoIpProcessorFactoryTests.java",
                    "file_size": 18541
                },
                {
                    "file_additions": 1,
                    "file_deletions": 0,
                    "file_exists": true,
                    "file_name": "qa/evil-tests/src/test/java/org/elasticsearch/bootstrap/EvilSecurityTests.java",
                    "file_size": 12169
                },
                {
                    "file_additions": 3,
                    "file_deletions": 3,
                    "file_exists": true,
                    "file_name": "qa/logging-config/src/test/java/org/elasticsearch/common/logging/ESJsonLayoutTests.java",
                    "file_size": 2799
                },
                {
                    "file_additions": 2,
                    "file_deletions": 0,
                    "file_exists": true,
                    "file_name": "server/src/test/java/org/elasticsearch/node/NodeTests.java",
                    "file_size": 18760
                },
                {
                    "file_additions": 1,
                    "file_deletions": 1,
                    "file_exists": true,
                    "file_name": "server/src/test/java/org/elasticsearch/persistent/TestPersistentTasksPlugin.java",
                    "file_size": 20666
                },
                {
                    "file_additions": 2,
                    "file_deletions": 0,
                    "file_exists": false,
                    "file_name": "server/src/test/java/org/elasticsearch/snapshots/SharedClusterSnapshotRestoreIT.java",
                    "file_size": 0
                },
                {
                    "file_additions": 2,
                    "file_deletions": 0,
                    "file_exists": false,
                    "file_name": "x-pack/plugin/ml/qa/native-multi-node-tests/src/test/java/org/elasticsearch/xpack/ml/integration/BasicRenormalizationIT.java",
                    "file_size": 0
                },
                {
                    "file_additions": 2,
                    "file_deletions": 0,
                    "file_exists": false,
                    "file_name": "x-pack/plugin/ml/qa/native-multi-node-tests/src/test/java/org/elasticsearch/xpack/ml/integration/ForecastIT.java",
                    "file_size": 0
                }
            ],
            "interesting": {
                "reopened": false,
                "status": false
            },
            "sha": "beb32f2d8ff44dbcd1ec5390f0a449ce62576cdc"
        }
    ],
    "first_commit": "2019-07-21 06:56:29",
    "last_commit": "2019-07-29 19:44:14",
    "number": 44669,
    "score": 192.02469135802468
}