{
    "covered_issues": [
        58,
        55,
        54,
        50,
        44,
        42,
        40,
        37,
        35,
        33,
        28,
        27,
        26,
        25,
        24,
        23,
        21,
        18,
        17,
        13,
        11,
        8,
        2
    ],
    "finished": true
}