{
    "covered_issues": [
        4666,
        4665,
        4653,
        4651,
        4635,
        4606,
        4593,
        4589,
        4580,
        4568,
        4566,
        4565,
        4564,
        4563,
        4555,
        4546,
        4545,
        4535,
        4533,
        4531,
        4526,
        4525,
        4516,
        4511,
        4510,
        4502,
        4493,
        4491,
        4489,
        4487,
        4484,
        4483,
        4474,
        4472,
        4456,
        4455,
        4451,
        4450,
        4445,
        4442,
        4441,
        4439,
        4433,
        4432,
        4426,
        4425,
        4421,
        4419,
        4418,
        4409,
        4400,
        4379,
        4373,
        4366,
        4344,
        4343,
        4329,
        4321,
        4319,
        4318,
        4315,
        4309,
        4301,
        4295,
        4293,
        4292,
        4290,
        4289,
        4288,
        4287,
        4281,
        4279,
        4278,
        4275,
        4272,
        4271,
        4269,
        4261,
        4255,
        4247,
        4245,
        4243,
        4241,
        4238,
        4234,
        4221,
        4219,
        4218,
        4217,
        4213,
        4212,
        4205,
        4202,
        4201,
        4200,
        4198,
        4187,
        4186,
        4182,
        4181,
        4172,
        4170,
        4169,
        4164,
        4162,
        4161,
        4157,
        4156,
        4149,
        4148,
        4145,
        4139,
        4136,
        4134,
        4133,
        4132,
        4124,
        4118,
        4117,
        4104,
        4101,
        4099,
        4096,
        4088,
        4084,
        4081,
        4080,
        4078,
        4076,
        4065,
        4059,
        4058,
        4057,
        4053,
        4051,
        4050,
        4048,
        4045,
        4043,
        4037,
        4036,
        4035,
        4026,
        4025,
        4024,
        4023,
        4022,
        4018,
        4017,
        4016,
        4012,
        4007,
        4006,
        4000,
        3997,
        3987,
        3983,
        3975,
        3970,
        3966,
        3961,
        3957,
        3956,
        3955,
        3952,
        3951,
        3950,
        3949,
        3948,
        3947,
        3945,
        3944,
        3940,
        3930,
        3928,
        3924,
        3922,
        3921,
        3920,
        3919,
        3918,
        3917,
        3916,
        3911,
        3906,
        3900,
        3896,
        3893,
        3887,
        3886,
        3882,
        3879,
        3878,
        3877,
        3876,
        3872,
        3871,
        3870,
        3864,
        3859,
        3858,
        3857,
        3856,
        3853,
        3851,
        3850,
        3848,
        3847,
        3842,
        3839,
        3836,
        3826,
        3821,
        3818,
        3812,
        3811,
        3807,
        3806,
        3796,
        3794,
        3790,
        3787,
        3783,
        3782,
        3781,
        3779,
        3778,
        3775,
        3765,
        3762,
        3761,
        3749,
        3748,
        3745,
        3743,
        3742,
        3741,
        3732,
        3730,
        3729,
        3728,
        3726,
        3724,
        3721,
        3720,
        3719,
        3716,
        3715,
        3714,
        3706,
        3698,
        3691,
        3688,
        3687,
        3683,
        3682,
        3680,
        3674,
        3670,
        3667,
        3666,
        3665,
        3664,
        3659,
        3656,
        3655,
        3654,
        3651,
        3650,
        3647,
        3646,
        3645,
        3644,
        3643,
        3642,
        3641,
        3640,
        3637,
        3630,
        3629,
        3627,
        3617,
        3616,
        3615,
        3614,
        3613,
        3609,
        3606,
        3605,
        3604,
        3602,
        3601,
        3596,
        3594,
        3592,
        3590,
        3584,
        3569,
        3568,
        3566,
        3565,
        3563,
        3562,
        3557,
        3556,
        3552,
        3549,
        3546,
        3545,
        3541,
        3536,
        3535,
        3534,
        3533,
        3531,
        3528,
        3527,
        3526,
        3525,
        3522,
        3517,
        3516,
        3514,
        3512,
        3506,
        3503,
        3500,
        3499,
        3498,
        3497,
        3495,
        3490,
        3489,
        3487,
        3486,
        3482,
        3481,
        3475,
        3473,
        3470,
        3465,
        3459,
        3456,
        3452,
        3451,
        3450,
        3446,
        3445,
        3440,
        3437,
        3436,
        3435,
        3431,
        3430,
        3429,
        3426,
        3420,
        3417,
        3416,
        3415,
        3412,
        3410,
        3408,
        3407,
        3406,
        3405,
        3404,
        3400,
        3399,
        3398,
        3395,
        3394,
        3393,
        3391,
        3386,
        3382,
        3381,
        3378,
        3377,
        3376,
        3371,
        3370,
        3365,
        3364,
        3361,
        3360,
        3354,
        3353,
        3352,
        3351,
        3350,
        3349,
        3348,
        3347,
        3339,
        3338,
        3337,
        3335,
        3334,
        3333,
        3330,
        3328,
        3325,
        3324,
        3323,
        3322,
        3321,
        3319,
        3317,
        3316,
        3314,
        3312,
        3310,
        3308,
        3306,
        3305,
        3304,
        3303,
        3300,
        3299,
        3297,
        3296,
        3295,
        3290,
        3287,
        3285,
        3284,
        3283,
        3282,
        3280,
        3279,
        3278,
        3276,
        3275,
        3274,
        3272,
        3271,
        3270,
        3269,
        3268,
        3267,
        3262,
        3259,
        3257,
        3256,
        3255,
        3254,
        3251,
        3249,
        3248,
        3247,
        3244,
        3243,
        3242,
        3237,
        3232,
        3230,
        3229,
        3222,
        3221,
        3211,
        3208,
        3207,
        3205,
        3204,
        3203,
        3200,
        3197,
        3195,
        3194,
        3193,
        3192,
        3191,
        3190,
        3189,
        3185,
        3184,
        3183,
        3182,
        3181,
        3180,
        3178,
        3176,
        3175,
        3174,
        3173,
        3170,
        3169,
        3168,
        3167,
        3165,
        3164,
        3162,
        3159,
        3156,
        3155,
        3152,
        3149,
        3146,
        3145,
        3143,
        3142,
        3141,
        3140,
        3137,
        3136,
        3135,
        3133,
        3131,
        3130,
        3129,
        3127,
        3125,
        3124,
        3123,
        3119,
        3117,
        3116,
        3113,
        3110,
        3109,
        3108,
        3107,
        3106,
        3105,
        3103,
        3102,
        3100,
        3099,
        3098,
        3097,
        3096,
        3095,
        3092,
        3090,
        3089,
        3088,
        3087,
        3086,
        3085,
        3083,
        3082,
        3080,
        3079,
        3078,
        3077,
        3075,
        3074,
        3071,
        3070,
        3069,
        3066,
        3065,
        3064,
        3062,
        3060,
        3056,
        3054,
        3052,
        3049,
        3048,
        3046,
        3041,
        3038,
        3036,
        3035,
        3031,
        3026,
        3020,
        3017,
        3015,
        3011,
        3009,
        3007,
        3006,
        3004,
        3003,
        3000,
        2999,
        2998,
        2996,
        2995,
        2994,
        2993,
        2992,
        2991,
        2989,
        2987,
        2986,
        2985,
        2984,
        2982,
        2980,
        2979,
        2978,
        2974,
        2972,
        2971,
        2970,
        2966,
        2965,
        2964,
        2963,
        2960,
        2959,
        2957,
        2955,
        2953,
        2952,
        2951,
        2950,
        2948,
        2945,
        2943,
        2942,
        2941,
        2938,
        2936,
        2933,
        2932,
        2930,
        2929,
        2928,
        2925,
        2924,
        2923,
        2922,
        2920,
        2919,
        2918,
        2914,
        2913,
        2912,
        2910,
        2909,
        2908,
        2907,
        2906,
        2905,
        2904,
        2903,
        2902,
        2901,
        2900,
        2899,
        2898,
        2895,
        2894,
        2893,
        2892,
        2890,
        2889,
        2888,
        2885,
        2884,
        2883,
        2881,
        2880,
        2879,
        2877,
        2876,
        2875,
        2874,
        2873,
        2872,
        2871,
        2870,
        2869,
        2868,
        2867,
        2866,
        2865,
        2862,
        2861,
        2859,
        2858,
        2857,
        2856,
        2853,
        2849,
        2848,
        2847,
        2846,
        2844,
        2842,
        2841,
        2840,
        2839,
        2838,
        2836,
        2835,
        2832,
        2831,
        2830,
        2828,
        2826,
        2824,
        2823,
        2821,
        2820,
        2819,
        2818,
        2816,
        2814,
        2812,
        2811,
        2810,
        2809,
        2808,
        2806,
        2805,
        2804,
        2803,
        2802,
        2801,
        2800,
        2799,
        2798,
        2797,
        2796,
        2795,
        2794,
        2793,
        2792,
        2791,
        2790,
        2789,
        2787,
        2786,
        2785,
        2783,
        2781,
        2780,
        2779,
        2778,
        2777,
        2776,
        2775,
        2774,
        2773,
        2772,
        2769,
        2768,
        2767,
        2766,
        2765,
        2764,
        2763,
        2762,
        2760,
        2759,
        2757,
        2755,
        2753,
        2752,
        2751,
        2750,
        2749,
        2748,
        2747,
        2746,
        2745,
        2744,
        2743,
        2742,
        2738,
        2733,
        2729,
        2728,
        2727,
        2726,
        2725,
        2724,
        2721,
        2719,
        2716,
        2714,
        2713,
        2708,
        2707,
        2706,
        2705,
        2704,
        2703,
        2702,
        2701,
        2700,
        2699,
        2698,
        2697,
        2695,
        2694,
        2693,
        2692,
        2691,
        2689,
        2687,
        2684,
        2683,
        2682,
        2681,
        2680,
        2679,
        2678,
        2677,
        2676,
        2675,
        2674,
        2671,
        2670,
        2669,
        2668,
        2667,
        2666,
        2665,
        2664,
        2663,
        2661,
        2660,
        2659,
        2658,
        2655,
        2654,
        2653,
        2652,
        2651,
        2650,
        2649,
        2648,
        2647,
        2646,
        2645,
        2643,
        2641,
        2639,
        2637,
        2636,
        2634,
        2633,
        2631,
        2629,
        2627,
        2626,
        2625,
        2623,
        2622,
        2621,
        2620,
        2615,
        2613,
        2611,
        2608,
        2600,
        2594,
        2591,
        2585,
        2584,
        2583,
        2582,
        2578,
        2569,
        2568,
        2567,
        2564,
        2561,
        2560,
        2555,
        2553,
        2550,
        2546,
        2545,
        2542,
        2541,
        2538,
        2536,
        2532,
        2526,
        2523,
        2505,
        2499,
        2498,
        2496,
        2494,
        2490,
        2482,
        2481,
        2467,
        2465,
        2462,
        2460,
        2459,
        2455,
        2453,
        2452,
        2448,
        2440,
        2437,
        2436,
        2435,
        2431,
        2429,
        2427,
        2425,
        2419,
        2410,
        2409,
        2405,
        2401,
        2399,
        2397,
        2390,
        2389,
        2386,
        2383,
        2379,
        2378,
        2373,
        2372,
        2371,
        2370,
        2369,
        2367,
        2366,
        2365,
        2360,
        2357,
        2355,
        2354,
        2353,
        2351,
        2349,
        2348,
        2347,
        2346,
        2345,
        2342,
        2340,
        2337,
        2333,
        2332,
        2330,
        2329,
        2327,
        2321,
        2320,
        2317,
        2316,
        2315,
        2314,
        2313,
        2312,
        2311,
        2306,
        2304,
        2303,
        2300,
        2299,
        2298,
        2297,
        2295,
        2294,
        2293,
        2291,
        2289,
        2288,
        2286,
        2285,
        2284,
        2282,
        2280,
        2279,
        2278,
        2277,
        2276,
        2275,
        2274,
        2273,
        2272,
        2268,
        2265,
        2263,
        2261,
        2260,
        2259,
        2258,
        2257,
        2254,
        2252,
        2251,
        2250,
        2248,
        2247,
        2246,
        2245,
        2242,
        2241,
        2238,
        2237,
        2236,
        2235,
        2234,
        2232,
        2231,
        2230,
        2229,
        2228,
        2226,
        2225,
        2222,
        2221,
        2218,
        2216,
        2215,
        2214,
        2213,
        2211,
        2210,
        2209,
        2207,
        2204,
        2203,
        2202,
        2201,
        2199,
        2197,
        2196,
        2195,
        2194,
        2190,
        2189,
        2188,
        2186,
        2184,
        2181,
        2178,
        2177,
        2175,
        2174,
        2173,
        2172,
        2171,
        2169,
        2166,
        2162,
        2160,
        2154,
        2152,
        2151,
        2150,
        2149,
        2148,
        2147,
        2146,
        2145,
        2144,
        2143,
        2140,
        2137,
        2136,
        2135,
        2132,
        2131,
        2130,
        2124,
        2123,
        2121,
        2120,
        2119,
        2118,
        2113,
        2112,
        2109,
        2106,
        2104,
        2101,
        2099,
        2091,
        2090,
        2088,
        2087,
        2085,
        2083,
        2082,
        2081,
        2080,
        2079,
        2078,
        2077,
        2076,
        2075,
        2074,
        2073,
        2071,
        2069,
        2068,
        2060,
        2054,
        2053,
        2051,
        2049,
        2047,
        2045,
        2044,
        2042,
        2035,
        2034,
        2033,
        2032,
        2029,
        2028,
        2025,
        2024,
        2023,
        2022,
        2020,
        2019,
        2015,
        2014,
        2013,
        2011,
        2010,
        2005,
        2004,
        2003,
        2001,
        1998,
        1997,
        1996,
        1995,
        1994,
        1993,
        1992,
        1991,
        1990,
        1988,
        1987,
        1986,
        1985,
        1984,
        1983,
        1981,
        1980,
        1979,
        1978,
        1977,
        1976,
        1975,
        1974,
        1973,
        1969,
        1968,
        1967,
        1966,
        1965,
        1964,
        1963,
        1960,
        1959,
        1958,
        1957,
        1956,
        1955,
        1954,
        1952,
        1949,
        1943,
        1942,
        1940,
        1937,
        1935,
        1934,
        1933,
        1931,
        1930,
        1929,
        1928,
        1927,
        1926,
        1923,
        1922,
        1920,
        1918,
        1917,
        1916,
        1915,
        1914,
        1912,
        1910,
        1909,
        1907,
        1905,
        1904,
        1902,
        1901,
        1900,
        1897,
        1896,
        1893,
        1892,
        1891,
        1889,
        1887,
        1886,
        1885,
        1883,
        1880,
        1878,
        1875,
        1874,
        1873,
        1872,
        1871,
        1869,
        1866,
        1864,
        1862,
        1861,
        1860,
        1859,
        1856,
        1855,
        1853,
        1851,
        1850,
        1849,
        1848,
        1844,
        1843,
        1842,
        1841,
        1840,
        1839,
        1837,
        1835,
        1834,
        1833,
        1832,
        1831,
        1830,
        1828,
        1827,
        1826,
        1825,
        1824,
        1823,
        1822,
        1819,
        1816,
        1815,
        1812,
        1811,
        1810,
        1809,
        1808,
        1807,
        1803,
        1802,
        1801,
        1795,
        1793,
        1792,
        1790,
        1789,
        1788,
        1784,
        1783,
        1778,
        1777,
        1776,
        1775,
        1774,
        1773,
        1768,
        1766,
        1765,
        1764,
        1763,
        1760,
        1759,
        1758,
        1757,
        1755,
        1754,
        1752,
        1750,
        1745,
        1741,
        1740,
        1738,
        1737,
        1736,
        1733,
        1732,
        1731,
        1730,
        1729,
        1728,
        1727,
        1726,
        1725,
        1724,
        1723,
        1722,
        1721,
        1720,
        1719,
        1718,
        1717,
        1716,
        1715,
        1709,
        1708,
        1707,
        1706,
        1703,
        1702,
        1701,
        1699,
        1698,
        1697,
        1696,
        1694,
        1693,
        1692,
        1691,
        1690,
        1689,
        1687,
        1686,
        1685,
        1684,
        1683,
        1682,
        1681,
        1680,
        1679,
        1678,
        1677,
        1676,
        1673,
        1672,
        1671,
        1669,
        1668,
        1667,
        1663,
        1662,
        1657,
        1655,
        1653,
        1651,
        1650,
        1648,
        1647,
        1646,
        1642,
        1641,
        1640,
        1638,
        1637,
        1635,
        1633,
        1632,
        1631,
        1630,
        1629,
        1628,
        1627,
        1626,
        1625,
        1623,
        1621,
        1620,
        1618,
        1617,
        1616,
        1611,
        1609,
        1606,
        1605,
        1604,
        1603,
        1600,
        1598,
        1597,
        1595,
        1594,
        1593,
        1592,
        1591,
        1590,
        1587,
        1585,
        1582,
        1581,
        1579,
        1575,
        1573,
        1572,
        1569,
        1567,
        1565,
        1564,
        1563,
        1561,
        1560,
        1558,
        1557,
        1553,
        1552,
        1551,
        1547,
        1545,
        1544,
        1543,
        1542,
        1541,
        1540,
        1539,
        1538,
        1536,
        1535,
        1530,
        1529,
        1527,
        1521,
        1520,
        1515,
        1514,
        1510,
        1509,
        1503,
        1502,
        1498,
        1497,
        1496,
        1492,
        1491,
        1486,
        1482,
        1481,
        1480,
        1477,
        1474,
        1473,
        1470,
        1469,
        1468,
        1457,
        1452,
        1450,
        1441,
        1435,
        1429,
        1425,
        1424,
        1423,
        1416,
        1415,
        1412,
        1410,
        1403,
        1400,
        1396,
        1393,
        1385,
        1383,
        1377,
        1374,
        1370,
        1366,
        1365,
        1359,
        1355,
        1353,
        1351,
        1350,
        1343,
        1341,
        1338,
        1335,
        1334,
        1332,
        1325,
        1324,
        1323,
        1322,
        1320,
        1312,
        1311,
        1310,
        1309,
        1308,
        1307,
        1306,
        1305,
        1301,
        1300,
        1299,
        1293,
        1289,
        1288,
        1287,
        1286,
        1285,
        1283,
        1279,
        1277,
        1272,
        1270,
        1268,
        1267,
        1263,
        1262,
        1256,
        1248,
        1244,
        1243,
        1237,
        1235,
        1234,
        1233,
        1232,
        1230,
        1229,
        1228,
        1227,
        1226,
        1225,
        1224,
        1220,
        1218,
        1217,
        1212,
        1210,
        1200,
        1193,
        1191,
        1190,
        1187,
        1186,
        1185,
        1184,
        1179,
        1178,
        1177,
        1176,
        1173,
        1169,
        1166,
        1164,
        1160,
        1159,
        1155,
        1149,
        1147,
        1143,
        1136,
        1134,
        1133,
        1120,
        1113,
        1110,
        1101,
        1095,
        1093,
        1092,
        1090,
        1089,
        1081,
        1080,
        1071,
        1069,
        1066,
        1065,
        1063,
        1062,
        1058,
        1056,
        1046,
        1035,
        1032,
        1027,
        1025,
        1023,
        1016,
        1014,
        1010,
        1009,
        1001,
        992,
        981,
        977,
        972,
        971,
        970,
        969,
        968,
        967,
        966,
        965,
        964,
        963,
        962,
        961,
        959,
        957,
        955,
        954,
        953,
        947,
        944,
        933,
        932,
        931,
        925,
        921,
        920,
        913,
        907,
        902,
        900,
        894,
        893,
        891,
        888,
        886,
        885,
        883,
        881,
        880,
        878,
        874,
        871,
        859,
        855,
        854,
        851,
        842,
        841,
        838,
        835,
        831,
        829,
        825,
        824,
        822,
        821,
        820,
        817,
        807,
        802,
        801,
        799,
        797,
        791,
        783,
        782,
        773,
        772,
        769,
        766,
        765,
        764,
        763,
        761,
        760,
        759,
        758,
        755,
        748,
        747,
        746,
        745,
        744,
        740,
        725,
        723,
        722,
        720,
        717,
        714,
        712,
        709,
        703,
        700,
        699,
        698,
        697,
        696,
        695,
        690,
        688,
        685,
        684,
        680,
        679,
        676,
        675,
        674,
        673,
        672,
        670,
        665,
        663,
        662,
        661,
        660,
        655,
        654,
        653,
        652,
        651,
        650,
        649,
        648,
        647,
        646,
        645,
        644,
        643,
        642,
        641,
        640,
        639,
        637,
        635,
        634,
        633,
        631,
        628,
        627,
        626,
        624,
        623,
        621,
        620,
        619,
        617,
        616,
        615,
        613,
        612,
        611,
        610,
        609,
        605,
        603,
        602,
        597,
        596,
        595,
        593,
        591,
        590,
        588,
        587,
        585,
        584,
        582,
        581,
        580,
        578,
        577,
        576,
        575,
        574,
        573,
        572,
        571,
        570,
        569,
        566,
        565,
        563,
        562,
        561,
        560,
        558,
        556,
        555,
        554,
        553,
        552,
        551,
        550,
        549,
        548,
        545,
        544,
        542,
        541,
        540,
        539,
        538,
        537,
        536,
        534,
        533,
        531,
        528,
        527,
        526,
        525,
        522,
        521,
        520,
        519,
        518,
        516,
        515,
        514,
        513,
        512,
        511,
        510,
        508,
        507,
        506,
        505,
        503,
        502,
        501,
        500,
        498,
        497,
        496,
        495,
        494,
        493,
        492,
        491,
        490,
        489,
        488,
        487,
        486,
        485,
        483,
        482,
        481,
        480,
        479,
        478,
        477,
        475,
        474,
        473,
        466,
        463,
        461,
        460,
        459,
        458,
        457,
        456,
        455,
        454,
        452,
        451,
        450,
        449,
        448,
        446,
        445,
        443,
        442,
        441,
        440,
        439,
        438,
        437,
        436,
        435,
        434,
        433,
        432,
        431,
        430,
        429,
        428,
        427,
        425,
        424,
        422,
        421,
        420,
        419,
        418,
        416,
        415,
        414,
        413,
        412,
        411,
        410,
        409,
        407,
        406,
        405,
        404,
        403,
        402,
        401,
        400,
        399,
        396,
        394,
        393,
        392,
        391,
        390,
        389,
        388,
        387,
        386,
        385,
        384,
        383,
        382,
        381,
        380,
        379,
        378,
        377,
        376,
        375,
        374,
        372,
        369,
        368,
        367,
        366,
        365,
        364,
        363,
        362,
        361,
        360,
        359,
        358,
        357,
        356,
        355,
        352,
        351,
        350,
        348,
        347,
        343,
        342,
        341,
        340,
        339,
        338,
        337,
        335,
        332,
        331,
        330,
        329,
        327,
        326,
        323,
        318,
        315,
        308,
        305,
        304,
        299,
        298,
        297,
        296,
        295,
        294,
        293,
        292,
        291,
        289,
        288,
        286,
        285,
        283,
        282,
        280,
        275,
        274,
        269,
        268,
        267,
        263,
        262,
        261,
        254,
        252,
        251,
        247,
        242,
        241,
        234,
        224,
        222,
        216,
        215,
        202,
        197,
        196,
        195,
        194,
        193,
        192,
        191,
        190,
        186,
        182,
        181,
        179,
        135,
        132,
        120,
        119,
        118,
        116,
        115,
        110,
        109,
        107,
        106,
        105,
        104,
        103,
        102,
        101,
        99,
        98,
        97,
        96,
        95,
        94,
        93,
        92,
        88,
        87,
        86,
        85,
        83,
        82,
        81,
        79,
        78,
        67,
        66,
        65,
        64,
        63,
        61,
        60,
        59,
        56,
        53,
        52,
        48,
        43,
        42,
        38,
        37,
        33,
        25,
        13,
        10,
        9,
        8,
        1
    ],
    "finished": true
}