{
    "category": [
        "hardware/OS",
        "GUI",
        "feature request"
    ],
    "commits": [
        {
            "associated_pull_request": [
                "https://github.com/lc-soft/LCUI/pull/120"
            ],
            "date": "2017-11-07 15:27:52",
            "diff": "lc-soft_lcui/issue_71/commit_ba2c790d1c75b8d0260827f9321e7adfd572d189.diff",
            "diff_additions": 8,
            "diff_deletions": 4,
            "diff_file_size": 31452,
            "diff_url": "https://github.com/lc-soft/LCUI/commit/ba2c790d1c75b8d0260827f9321e7adfd572d189.diff",
            "exists": true,
            "files": [
                {
                    "file_additions": 1,
                    "file_deletions": 3,
                    "file_exists": true,
                    "file_name": "src/gui/widget_base.c",
                    "file_size": 16229
                },
                {
                    "file_additions": 7,
                    "file_deletions": 1,
                    "file_exists": true,
                    "file_name": "src/gui/widget_task.c",
                    "file_size": 15223
                }
            ],
            "interesting": {
                "reopen": false,
                "status": false
            },
            "is_parent": true,
            "sha": "ba2c790d1c75b8d0260827f9321e7adfd572d189"
        },
        {
            "associated_pull_request": [
                "https://github.com/lc-soft/LCUI/pull/120"
            ],
            "date": "2017-11-08 15:37:23",
            "diff": "lc-soft_lcui/issue_71/commit_b56504f78c31fe6968caf72a112ccaec0f6007b6.diff",
            "diff_additions": 131,
            "diff_deletions": 134,
            "diff_file_size": 38516,
            "diff_url": "https://github.com/lc-soft/LCUI/commit/b56504f78c31fe6968caf72a112ccaec0f6007b6.diff",
            "exists": true,
            "files": [
                {
                    "file_additions": 131,
                    "file_deletions": 134,
                    "file_exists": true,
                    "file_name": "src/font/textlayer.c",
                    "file_size": 38516
                }
            ],
            "interesting": {
                "reopen": false,
                "status": true
            },
            "is_parent": false,
            "sha": "b56504f78c31fe6968caf72a112ccaec0f6007b6"
        },
        {
            "associated_pull_request": [
                "https://github.com/lc-soft/LCUI/pull/120"
            ],
            "date": "2018-01-19 15:18:36",
            "diff": "lc-soft_lcui/issue_71/commit_9193c0a562f85c4863e35455488250354776d471.diff",
            "diff_additions": 50,
            "diff_deletions": 44,
            "diff_file_size": 51029,
            "diff_url": "https://github.com/lc-soft/LCUI/commit/9193c0a562f85c4863e35455488250354776d471.diff",
            "exists": true,
            "files": [
                {
                    "file_additions": 13,
                    "file_deletions": 7,
                    "file_exists": true,
                    "file_name": "src/font/textlayer.c",
                    "file_size": 38516
                },
                {
                    "file_additions": 37,
                    "file_deletions": 37,
                    "file_exists": true,
                    "file_name": "src/gui/widget/textview.c",
                    "file_size": 12513
                }
            ],
            "interesting": {
                "reopen": false,
                "status": false
            },
            "is_parent": false,
            "sha": "9193c0a562f85c4863e35455488250354776d471"
        }
    ],
    "first_commit": "2017-11-07 15:27:52",
    "last_commit": "2018-01-19 15:18:55",
    "number": 71,
    "pull_request": "None",
    "score": {
        "accidental_reopen_likely": false,
        "all_labels": [
            "enhancement"
        ],
        "contains_keywords": [],
        "fix_size": 324,
        "has_labels": [],
        "intersecting": {
            "computed_score": 0.011494252873563218,
            "final_commit_size": 87,
            "intersection_size": 1,
            "previous_commits_size": 238
        },
        "is_makefile_based": true,
        "no_new_files": [
            "src/gui/widget/textview.c"
        ],
        "no_other_files": false,
        "num_prohibited_files": 36234,
        "prohibited_files": [
            "hal/inc/pinmap_hal.h",
            "Debug/marvin.bin",
            "Debug/marvin.elf",
            "Debug/marvin.hex",
            "Debug/marvin.bin",
            "Debug/marvin.elf",
            "Debug/marvin.hex",
            "inc/spark_utilities.h",
            "Debug/marvin.bin",
            "Debug/marvin.elf"
        ],
        "reopen": false,
        "reopen_events": [
            [
                "2017-11-08 15:37:32",
                "commit"
            ],
            [
                "2018-01-19 15:18:38",
                "closed"
            ],
            [
                "2018-01-19 15:18:38",
                "commit"
            ]
        ],
        "status": true,
        "strategy": true,
        "total_changes": 371
    }
}