{
    "covered_issues": [
        458,
        455,
        454,
        451,
        447,
        446,
        443,
        439,
        432,
        431,
        427,
        425,
        419,
        417,
        415,
        414,
        412,
        411,
        410,
        403,
        402,
        398,
        397,
        396,
        393,
        392,
        389,
        388,
        382,
        370,
        369,
        362,
        360,
        358,
        354,
        351,
        350,
        349,
        344,
        343,
        342,
        330,
        327,
        325,
        323,
        322,
        321,
        319,
        318,
        317,
        316,
        315,
        314,
        313,
        312,
        311,
        309,
        305,
        304,
        299,
        296,
        294,
        292,
        289,
        282,
        268,
        266,
        260,
        258,
        255,
        252,
        251,
        245,
        243,
        241,
        240,
        237,
        235,
        232,
        231,
        230,
        226,
        224,
        222,
        221,
        220,
        215,
        213,
        211,
        208,
        205,
        202,
        200,
        198,
        196,
        195,
        192,
        190,
        189,
        188,
        186,
        185,
        182,
        181,
        176,
        175,
        173,
        172,
        169,
        166,
        165,
        161,
        159,
        157,
        155,
        153,
        152,
        150,
        148,
        147,
        146,
        145,
        143,
        141,
        140,
        139,
        137,
        136,
        133,
        132,
        131,
        129,
        128,
        126,
        125,
        123,
        122,
        121,
        120,
        119,
        118,
        117,
        114,
        112,
        110,
        109,
        105,
        100,
        99,
        97,
        93,
        92,
        91,
        90,
        89,
        88,
        87,
        85,
        84,
        83,
        82,
        81,
        80,
        79,
        78,
        77,
        76,
        75,
        74,
        73,
        72,
        65,
        64,
        63,
        62,
        60,
        59,
        58,
        56,
        54,
        53,
        52,
        51,
        49,
        46,
        45,
        44,
        43,
        42,
        41,
        40,
        39,
        38,
        37,
        36,
        34,
        33,
        32,
        31,
        30,
        29,
        27,
        23,
        22,
        21,
        20,
        17,
        16,
        15,
        13,
        11,
        9,
        8,
        7,
        6,
        4
    ],
    "finished": true
}