{
    "category": [
        "hardware/OS",
        "multithreading"
    ],
    "commits": [
        {
            "associated_pull_request": [],
            "date": "2018-06-18 10:04:20",
            "diff": "varnishcache_varnish-cache/issue_2623/commit_44d289316908ead3defe7cf576ef7587a2d2d871.diff",
            "diff_additions": 0,
            "diff_deletions": 4,
            "diff_file_size": 19298,
            "diff_url": "https://github.com/varnishcache/varnish-cache/commit/44d289316908ead3defe7cf576ef7587a2d2d871.diff",
            "exists": true,
            "files": [
                {
                    "file_additions": 0,
                    "file_deletions": 4,
                    "file_exists": true,
                    "file_name": "bin/varnishtest/vtc_main.c",
                    "file_size": 19298
                }
            ],
            "interesting": {
                "reopen": false,
                "status": false
            },
            "is_parent": true,
            "sha": "44d289316908ead3defe7cf576ef7587a2d2d871"
        },
        {
            "associated_pull_request": [],
            "date": "2018-06-19 13:40:03",
            "diff": "varnishcache_varnish-cache/issue_2623/commit_c8bfae704dcb25002daaf5206d5b4c1a9b7cf753.diff",
            "diff_additions": 6,
            "diff_deletions": 0,
            "diff_file_size": 30067,
            "diff_url": "https://github.com/varnishcache/varnish-cache/commit/c8bfae704dcb25002daaf5206d5b4c1a9b7cf753.diff",
            "exists": true,
            "files": [
                {
                    "file_additions": 6,
                    "file_deletions": 0,
                    "file_exists": true,
                    "file_name": "bin/varnishd/http2/cache_http2_proto.c",
                    "file_size": 30067
                }
            ],
            "interesting": {
                "reopen": true,
                "status": false
            },
            "is_parent": false,
            "sha": "c8bfae704dcb25002daaf5206d5b4c1a9b7cf753"
        },
        {
            "associated_pull_request": [],
            "date": "2018-06-22 09:20:12",
            "diff": "varnishcache_varnish-cache/issue_2623/commit_ace8e8fe1a3601f0a6b760a2b50cd3cbb4fc75fe.diff",
            "diff_additions": 12,
            "diff_deletions": 4,
            "diff_file_size": 30067,
            "diff_url": "https://github.com/varnishcache/varnish-cache/commit/ace8e8fe1a3601f0a6b760a2b50cd3cbb4fc75fe.diff",
            "exists": true,
            "files": [
                {
                    "file_additions": 12,
                    "file_deletions": 4,
                    "file_exists": true,
                    "file_name": "bin/varnishd/http2/cache_http2_proto.c",
                    "file_size": 30067
                }
            ],
            "interesting": {
                "reopen": false,
                "status": false
            },
            "is_parent": false,
            "sha": "ace8e8fe1a3601f0a6b760a2b50cd3cbb4fc75fe"
        },
        {
            "associated_pull_request": [],
            "date": "2018-06-22 09:20:12",
            "diff": "varnishcache_varnish-cache/issue_2623/commit_0e99f855e51f41e2da95a47e01fcc93d88ab01a4.diff",
            "diff_additions": 12,
            "diff_deletions": 4,
            "diff_file_size": 30067,
            "diff_url": "https://github.com/varnishcache/varnish-cache/commit/0e99f855e51f41e2da95a47e01fcc93d88ab01a4.diff",
            "exists": true,
            "files": [
                {
                    "file_additions": 12,
                    "file_deletions": 4,
                    "file_exists": true,
                    "file_name": "bin/varnishd/http2/cache_http2_proto.c",
                    "file_size": 30067
                }
            ],
            "interesting": {
                "reopen": true,
                "status": false
            },
            "is_parent": false,
            "sha": "0e99f855e51f41e2da95a47e01fcc93d88ab01a4"
        },
        {
            "associated_pull_request": [],
            "date": "2018-06-27 11:27:34",
            "diff": "varnishcache_varnish-cache/issue_2623/commit_51e6ded883b7655091bd6a8ffb8869fa7d40b071.diff",
            "diff_additions": 5,
            "diff_deletions": 3,
            "diff_file_size": 52470,
            "diff_url": "https://github.com/varnishcache/varnish-cache/commit/51e6ded883b7655091bd6a8ffb8869fa7d40b071.diff",
            "exists": true,
            "files": [
                {
                    "file_additions": 1,
                    "file_deletions": 1,
                    "file_exists": true,
                    "file_name": "bin/varnishd/http2/cache_http2_proto.c",
                    "file_size": 30067
                },
                {
                    "file_additions": 1,
                    "file_deletions": 1,
                    "file_exists": true,
                    "file_name": "bin/varnishd/http2/cache_http2_send.c",
                    "file_size": 10735
                },
                {
                    "file_additions": 3,
                    "file_deletions": 1,
                    "file_exists": true,
                    "file_name": "bin/varnishd/http2/cache_http2_session.c",
                    "file_size": 11668
                }
            ],
            "interesting": {
                "reopen": false,
                "status": false
            },
            "is_parent": false,
            "sha": "51e6ded883b7655091bd6a8ffb8869fa7d40b071"
        },
        {
            "associated_pull_request": [],
            "date": "2018-06-27 11:27:34",
            "diff": "varnishcache_varnish-cache/issue_2623/commit_624b41185f314c0bef5437cde5b1ede731448bf5.diff",
            "diff_additions": 5,
            "diff_deletions": 3,
            "diff_file_size": 52470,
            "diff_url": "https://github.com/varnishcache/varnish-cache/commit/624b41185f314c0bef5437cde5b1ede731448bf5.diff",
            "exists": true,
            "files": [
                {
                    "file_additions": 1,
                    "file_deletions": 1,
                    "file_exists": true,
                    "file_name": "bin/varnishd/http2/cache_http2_proto.c",
                    "file_size": 30067
                },
                {
                    "file_additions": 1,
                    "file_deletions": 1,
                    "file_exists": true,
                    "file_name": "bin/varnishd/http2/cache_http2_send.c",
                    "file_size": 10735
                },
                {
                    "file_additions": 3,
                    "file_deletions": 1,
                    "file_exists": true,
                    "file_name": "bin/varnishd/http2/cache_http2_session.c",
                    "file_size": 11668
                }
            ],
            "interesting": {
                "reopen": false,
                "status": false
            },
            "is_parent": false,
            "sha": "624b41185f314c0bef5437cde5b1ede731448bf5"
        },
        {
            "associated_pull_request": [],
            "date": "2018-06-27 11:27:34",
            "diff": "varnishcache_varnish-cache/issue_2623/commit_3ab828a06045fefe7f8026c8e82ba944364beb16.diff",
            "diff_additions": 5,
            "diff_deletions": 3,
            "diff_file_size": 52470,
            "diff_url": "https://github.com/varnishcache/varnish-cache/commit/3ab828a06045fefe7f8026c8e82ba944364beb16.diff",
            "exists": true,
            "files": [
                {
                    "file_additions": 1,
                    "file_deletions": 1,
                    "file_exists": true,
                    "file_name": "bin/varnishd/http2/cache_http2_proto.c",
                    "file_size": 30067
                },
                {
                    "file_additions": 1,
                    "file_deletions": 1,
                    "file_exists": true,
                    "file_name": "bin/varnishd/http2/cache_http2_send.c",
                    "file_size": 10735
                },
                {
                    "file_additions": 3,
                    "file_deletions": 1,
                    "file_exists": true,
                    "file_name": "bin/varnishd/http2/cache_http2_session.c",
                    "file_size": 11668
                }
            ],
            "interesting": {
                "reopen": false,
                "status": false
            },
            "is_parent": false,
            "sha": "3ab828a06045fefe7f8026c8e82ba944364beb16"
        },
        {
            "associated_pull_request": [],
            "date": "2018-06-22 09:20:12",
            "diff": "varnishcache_varnish-cache/issue_2623/commit_5fddc69365fb089e629199ab2bf854233e57c659.diff",
            "diff_additions": 12,
            "diff_deletions": 4,
            "diff_file_size": 30067,
            "diff_url": "https://github.com/varnishcache/varnish-cache/commit/5fddc69365fb089e629199ab2bf854233e57c659.diff",
            "exists": true,
            "files": [
                {
                    "file_additions": 12,
                    "file_deletions": 4,
                    "file_exists": true,
                    "file_name": "bin/varnishd/http2/cache_http2_proto.c",
                    "file_size": 30067
                }
            ],
            "interesting": {
                "reopen": false,
                "status": false
            },
            "is_parent": false,
            "sha": "5fddc69365fb089e629199ab2bf854233e57c659"
        },
        {
            "associated_pull_request": [],
            "date": "2018-06-27 11:27:34",
            "diff": "varnishcache_varnish-cache/issue_2623/commit_a6533c7427a328041221484dd357c94cb77f8d0e.diff",
            "diff_additions": 5,
            "diff_deletions": 3,
            "diff_file_size": 52470,
            "diff_url": "https://github.com/varnishcache/varnish-cache/commit/a6533c7427a328041221484dd357c94cb77f8d0e.diff",
            "exists": true,
            "files": [
                {
                    "file_additions": 1,
                    "file_deletions": 1,
                    "file_exists": true,
                    "file_name": "bin/varnishd/http2/cache_http2_proto.c",
                    "file_size": 30067
                },
                {
                    "file_additions": 1,
                    "file_deletions": 1,
                    "file_exists": true,
                    "file_name": "bin/varnishd/http2/cache_http2_send.c",
                    "file_size": 10735
                },
                {
                    "file_additions": 3,
                    "file_deletions": 1,
                    "file_exists": true,
                    "file_name": "bin/varnishd/http2/cache_http2_session.c",
                    "file_size": 11668
                }
            ],
            "interesting": {
                "reopen": false,
                "status": false
            },
            "is_parent": false,
            "sha": "a6533c7427a328041221484dd357c94cb77f8d0e"
        }
    ],
    "first_commit": "2018-06-18 10:07:08",
    "last_commit": "2019-03-14 15:43:54",
    "number": 2623,
    "pull_request": "None",
    "score": {
        "accidental_reopen_likely": false,
        "all_labels": [
            "c=H/2"
        ],
        "contains_keywords": [
            "work",
            "fix",
            "test",
            "remov",
            "issu",
            "chang",
            "fail",
            "leak",
            "problem"
        ],
        "fix_size": 25,
        "has_labels": [],
        "intersecting": {
            "computed_score": 1.0,
            "final_commit_size": 9,
            "intersection_size": 9,
            "previous_commits_size": 25
        },
        "is_makefile_based": true,
        "no_new_files": [],
        "no_other_files": false,
        "num_prohibited_files": 168795,
        "prohibited_files": [
            "kill.h",
            "meminfo.h",
            "kill.h",
            "meminfo.h",
            "kill.h",
            "meminfo.h",
            "testsuite_cli_test.go",
            "testsuite_cli_test.go",
            "common.mk",
            "i3bar/include/draw_util.h"
        ],
        "reopen": true,
        "reopen_events": [
            [
                "2018-06-19 13:49:59",
                "closed"
            ],
            [
                "2018-06-19 13:49:59",
                "commit"
            ],
            [
                "2018-06-20 08:18:13",
                "reopened"
            ],
            [
                "2018-06-22 09:43:22",
                "closed"
            ],
            [
                "2018-06-22 09:43:22",
                "commit"
            ],
            [
                "2018-06-22 09:53:26",
                "commit"
            ],
            [
                "2018-06-26 08:57:43",
                "reopened"
            ],
            [
                "2018-06-27 11:40:56",
                "closed"
            ],
            [
                "2018-06-27 11:40:56",
                "commit"
            ],
            [
                "2018-06-27 12:07:50",
                "commit"
            ],
            [
                "2018-06-27 12:12:59",
                "commit"
            ],
            [
                "2018-08-16 08:51:19",
                "commit"
            ],
            [
                "2018-08-16 08:51:19",
                "commit"
            ],
            [
                "2019-03-14 16:11:02",
                "commit"
            ]
        ],
        "status": false,
        "strategy": true,
        "total_changes": 90
    }
}