{
    "category": [
        "hardware/OS",
        "build/refactor/preprocessing"
    ],
    "commits": [
        {
            "associated_pull_request": [
                "https://github.com/openzfs/zfs/pull/10896"
            ],
            "date": "2020-09-09 17:15:52",
            "diff": "openzfs_zfs/issue_10913/commit_8e7fe49b25d63e855a8d230d2775f99d722818ff.diff",
            "diff_additions": 18,
            "diff_deletions": 18,
            "diff_file_size": 113012,
            "diff_url": "https://github.com/openzfs/zfs/commit/8e7fe49b25d63e855a8d230d2775f99d722818ff.diff",
            "exists": true,
            "files": [
                {
                    "file_additions": 9,
                    "file_deletions": 9,
                    "file_exists": true,
                    "file_name": "module/os/freebsd/zfs/zfs_vfsops.c",
                    "file_size": 60022
                },
                {
                    "file_additions": 8,
                    "file_deletions": 8,
                    "file_exists": false,
                    "file_name": "module/os/freebsd/zfs/zfs_vnops.c",
                    "file_size": 0
                },
                {
                    "file_additions": 1,
                    "file_deletions": 1,
                    "file_exists": true,
                    "file_name": "module/os/freebsd/zfs/zfs_znode.c",
                    "file_size": 52990
                }
            ],
            "interesting": {
                "reopen": false,
                "status": true
            },
            "is_parent": true,
            "sha": "8e7fe49b25d63e855a8d230d2775f99d722818ff"
        },
        {
            "associated_pull_request": [],
            "date": "2020-09-10 18:16:38",
            "diff": "openzfs_zfs/issue_10913/commit_cf7bd4a2c9e83a103732659929bb691435cf8847.diff",
            "diff_additions": 14,
            "diff_deletions": 10,
            "diff_file_size": 339050,
            "diff_url": "https://github.com/openzfs/zfs/commit/cf7bd4a2c9e83a103732659929bb691435cf8847.diff",
            "exists": true,
            "files": [
                {
                    "file_additions": 14,
                    "file_deletions": 10,
                    "file_exists": true,
                    "file_name": "module/zfs/arc.c",
                    "file_size": 339050
                }
            ],
            "interesting": {
                "reopen": false,
                "status": true
            },
            "is_parent": false,
            "sha": "cf7bd4a2c9e83a103732659929bb691435cf8847"
        },
        {
            "associated_pull_request": [],
            "date": "2020-09-11 23:47:56",
            "diff": "openzfs_zfs/issue_10913/commit_e3a95d9b413eaacd342100f0e514f2881d777d3f.diff",
            "diff_additions": 37,
            "diff_deletions": 8,
            "diff_file_size": 339050,
            "diff_url": "https://github.com/openzfs/zfs/commit/e3a95d9b413eaacd342100f0e514f2881d777d3f.diff",
            "exists": true,
            "files": [
                {
                    "file_additions": 37,
                    "file_deletions": 8,
                    "file_exists": true,
                    "file_name": "module/zfs/arc.c",
                    "file_size": 339050
                }
            ],
            "interesting": {
                "reopen": false,
                "status": true
            },
            "is_parent": false,
            "sha": "e3a95d9b413eaacd342100f0e514f2881d777d3f"
        },
        {
            "associated_pull_request": [],
            "date": "2020-09-11 23:47:56",
            "diff": "openzfs_zfs/issue_10913/commit_eab663b8844798770a93c2b8dd8acce7c8af9274.diff",
            "diff_additions": 37,
            "diff_deletions": 8,
            "diff_file_size": 339050,
            "diff_url": "https://github.com/openzfs/zfs/commit/eab663b8844798770a93c2b8dd8acce7c8af9274.diff",
            "exists": true,
            "files": [
                {
                    "file_additions": 37,
                    "file_deletions": 8,
                    "file_exists": true,
                    "file_name": "module/zfs/arc.c",
                    "file_size": 339050
                }
            ],
            "interesting": {
                "reopen": false,
                "status": true
            },
            "is_parent": false,
            "sha": "eab663b8844798770a93c2b8dd8acce7c8af9274"
        },
        {
            "associated_pull_request": [],
            "date": "2020-09-11 23:47:56",
            "diff": "openzfs_zfs/issue_10913/commit_434ceb2ed88b5888186f1a175d1d5525a90c0669.diff",
            "diff_additions": 37,
            "diff_deletions": 8,
            "diff_file_size": 339050,
            "diff_url": "https://github.com/openzfs/zfs/commit/434ceb2ed88b5888186f1a175d1d5525a90c0669.diff",
            "exists": true,
            "files": [
                {
                    "file_additions": 37,
                    "file_deletions": 8,
                    "file_exists": true,
                    "file_name": "module/zfs/arc.c",
                    "file_size": 339050
                }
            ],
            "interesting": {
                "reopen": false,
                "status": false
            },
            "is_parent": false,
            "sha": "434ceb2ed88b5888186f1a175d1d5525a90c0669"
        }
    ],
    "first_commit": "2020-09-09 17:15:52",
    "last_commit": "2020-09-12 01:00:36",
    "number": 10913,
    "pull_request": "None",
    "score": {
        "accidental_reopen_likely": false,
        "all_labels": [
            "Status: Triage Needed",
            "Type: Defect"
        ],
        "contains_keywords": [
            "reason",
            "error",
            "fix"
        ],
        "fix_size": 51,
        "has_labels": [],
        "intersecting": {
            "computed_score": 1.0,
            "final_commit_size": 45,
            "intersection_size": 45,
            "previous_commits_size": 51
        },
        "is_makefile_based": true,
        "no_new_files": [],
        "no_other_files": false,
        "num_prohibited_files": 43686,
        "prohibited_files": [
            "hal/inc/pinmap_hal.h",
            "Debug/marvin.bin",
            "Debug/marvin.elf",
            "Debug/marvin.hex",
            "Debug/marvin.bin",
            "Debug/marvin.elf",
            "Debug/marvin.hex",
            "inc/spark_utilities.h",
            "Debug/marvin.bin",
            "Debug/marvin.elf"
        ],
        "reopen": false,
        "reopen_events": [
            [
                "2020-09-10 18:19:00",
                "commit"
            ],
            [
                "2020-09-10 18:19:49",
                "commit"
            ],
            [
                "2020-09-11 23:51:59",
                "commit"
            ],
            [
                "2020-09-12 00:19:27",
                "commit"
            ],
            [
                "2020-09-12 01:01:31",
                "commit"
            ],
            [
                "2020-10-20 18:40:29",
                "closed"
            ]
        ],
        "status": true,
        "strategy": true,
        "total_changes": 195
    }
}