{
    "covered_issues": [
        179,
        177,
        176,
        175,
        172,
        171,
        170,
        169,
        168,
        140,
        139,
        138,
        131,
        127,
        123,
        122,
        119,
        115,
        114,
        113,
        110,
        108,
        100,
        98,
        95,
        93,
        59,
        54,
        46,
        45,
        44,
        40,
        32,
        25,
        24,
        23,
        18,
        17,
        16,
        14,
        13,
        10,
        7,
        3
    ],
    "finished": true
}