{
    "covered_issues": [
        135,
        130,
        127,
        126,
        124,
        122,
        120,
        118,
        115,
        101,
        100,
        98,
        91,
        85,
        75,
        72,
        71,
        60,
        55,
        54,
        53,
        48,
        46,
        45,
        44,
        42,
        41,
        38,
        37,
        36,
        34
    ],
    "finished": true
}