{
    "category": [
        "GUI",
        "feature request"
    ],
    "commits": [
        {
            "associated_pull_request": [
                "https://github.com/openwall/john/pull/1186"
            ],
            "date": "2015-04-06 19:04:19",
            "diff": "openwall_john/issue_1037/commit_0343d5e748ec23a921c10f9dc6c9f04cc8e52ef2.diff",
            "diff_additions": 56,
            "diff_deletions": 13,
            "diff_file_size": 34346,
            "diff_url": "https://github.com/openwall/john/commit/0343d5e748ec23a921c10f9dc6c9f04cc8e52ef2.diff",
            "exists": true,
            "files": [
                {
                    "file_additions": 20,
                    "file_deletions": 1,
                    "file_exists": true,
                    "file_name": "src/opencl_rawsha256_fmt_plug.c",
                    "file_size": 23741
                },
                {
                    "file_additions": 36,
                    "file_deletions": 12,
                    "file_exists": true,
                    "file_name": "src/opencl_rawsha512_fmt_plug.c",
                    "file_size": 10605
                }
            ],
            "interesting": {
                "reopen": false,
                "status": false
            },
            "is_parent": false,
            "sha": "0343d5e748ec23a921c10f9dc6c9f04cc8e52ef2"
        },
        {
            "associated_pull_request": [],
            "date": "2015-07-10 22:57:01",
            "diff": "openwall_john/issue_1037/commit_1cdeebbb0ab702fd443134cceb0fedd603a4a686.diff",
            "diff_additions": 1,
            "diff_deletions": 1,
            "diff_file_size": 27689,
            "diff_url": "https://github.com/openwall/john/commit/1cdeebbb0ab702fd443134cceb0fedd603a4a686.diff",
            "exists": true,
            "files": [
                {
                    "file_additions": 1,
                    "file_deletions": 1,
                    "file_exists": true,
                    "file_name": "src/opencl_mscash_fmt_plug.c",
                    "file_size": 27689
                }
            ],
            "interesting": {
                "reopen": false,
                "status": true
            },
            "is_parent": false,
            "sha": "1cdeebbb0ab702fd443134cceb0fedd603a4a686"
        },
        {
            "associated_pull_request": [],
            "date": "2015-09-22 20:49:38",
            "diff": "openwall_john/issue_1037/commit_9cecf81ed5b3a00ac7b86c81633fd7fead1fb3e7.diff",
            "diff_additions": 58,
            "diff_deletions": 26,
            "diff_file_size": 21970,
            "diff_url": "https://github.com/openwall/john/commit/9cecf81ed5b3a00ac7b86c81633fd7fead1fb3e7.diff",
            "exists": true,
            "files": [
                {
                    "file_additions": 58,
                    "file_deletions": 26,
                    "file_exists": true,
                    "file_name": "src/opencl_nt_fmt_plug.c",
                    "file_size": 21970
                }
            ],
            "interesting": {
                "reopen": false,
                "status": false
            },
            "is_parent": false,
            "sha": "9cecf81ed5b3a00ac7b86c81633fd7fead1fb3e7"
        },
        {
            "associated_pull_request": [],
            "date": "2015-09-22 21:47:01",
            "diff": "openwall_john/issue_1037/commit_b2227bb7fe297a343991b90152fb37122e7c5b90.diff",
            "diff_additions": 28,
            "diff_deletions": 8,
            "diff_file_size": 70640,
            "diff_url": "https://github.com/openwall/john/commit/b2227bb7fe297a343991b90152fb37122e7c5b90.diff",
            "exists": true,
            "files": [
                {
                    "file_additions": 28,
                    "file_deletions": 8,
                    "file_exists": true,
                    "file_name": "src/mask.c",
                    "file_size": 70640
                }
            ],
            "interesting": {
                "reopen": false,
                "status": false
            },
            "is_parent": false,
            "sha": "b2227bb7fe297a343991b90152fb37122e7c5b90"
        },
        {
            "associated_pull_request": [],
            "date": "2015-09-22 23:21:44",
            "diff": "openwall_john/issue_1037/commit_d58cdf8d5514a069c2718dbe1b9c8242c650b02a.diff",
            "diff_additions": 21,
            "diff_deletions": 12,
            "diff_file_size": 27689,
            "diff_url": "https://github.com/openwall/john/commit/d58cdf8d5514a069c2718dbe1b9c8242c650b02a.diff",
            "exists": true,
            "files": [
                {
                    "file_additions": 21,
                    "file_deletions": 12,
                    "file_exists": true,
                    "file_name": "src/opencl_mscash_fmt_plug.c",
                    "file_size": 27689
                }
            ],
            "interesting": {
                "reopen": false,
                "status": false
            },
            "is_parent": false,
            "sha": "d58cdf8d5514a069c2718dbe1b9c8242c650b02a"
        },
        {
            "associated_pull_request": [],
            "date": "2015-09-23 00:04:24",
            "diff": "openwall_john/issue_1037/commit_05750cbe0a3be329b3ad543b936a594e538140af.diff",
            "diff_additions": 13,
            "diff_deletions": 15,
            "diff_file_size": 272382,
            "diff_url": "https://github.com/openwall/john/commit/05750cbe0a3be329b3ad543b936a594e538140af.diff",
            "exists": true,
            "files": [
                {
                    "file_additions": 1,
                    "file_deletions": 2,
                    "file_exists": true,
                    "file_name": "src/opencl_DES_bs_plug.c",
                    "file_size": 41987
                },
                {
                    "file_additions": 1,
                    "file_deletions": 2,
                    "file_exists": true,
                    "file_name": "src/opencl_lm_b_plug.c",
                    "file_size": 43691
                },
                {
                    "file_additions": 1,
                    "file_deletions": 1,
                    "file_exists": true,
                    "file_name": "src/opencl_mscash_fmt_plug.c",
                    "file_size": 27689
                },
                {
                    "file_additions": 1,
                    "file_deletions": 1,
                    "file_exists": false,
                    "file_name": "src/opencl_nsldap_fmt_plug.c",
                    "file_size": 0
                },
                {
                    "file_additions": 1,
                    "file_deletions": 1,
                    "file_exists": true,
                    "file_name": "src/opencl_nt_fmt_plug.c",
                    "file_size": 21970
                },
                {
                    "file_additions": 1,
                    "file_deletions": 1,
                    "file_exists": true,
                    "file_name": "src/opencl_rawmd4_fmt_plug.c",
                    "file_size": 20381
                },
                {
                    "file_additions": 1,
                    "file_deletions": 1,
                    "file_exists": true,
                    "file_name": "src/opencl_rawmd5_fmt_plug.c",
                    "file_size": 20893
                },
                {
                    "file_additions": 1,
                    "file_deletions": 1,
                    "file_exists": true,
                    "file_name": "src/opencl_rawsha1_fmt_plug.c",
                    "file_size": 36462
                },
                {
                    "file_additions": 2,
                    "file_deletions": 2,
                    "file_exists": true,
                    "file_name": "src/opencl_rawsha256_fmt_plug.c",
                    "file_size": 23741
                },
                {
                    "file_additions": 2,
                    "file_deletions": 2,
                    "file_exists": false,
                    "file_name": "src/opencl_rawsha512_ng_fmt_plug.c",
                    "file_size": 0
                },
                {
                    "file_additions": 1,
                    "file_deletions": 1,
                    "file_exists": true,
                    "file_name": "src/opencl_salted_sha_fmt_plug.c",
                    "file_size": 35568
                }
            ],
            "interesting": {
                "reopen": false,
                "status": false
            },
            "is_parent": false,
            "sha": "05750cbe0a3be329b3ad543b936a594e538140af"
        },
        {
            "associated_pull_request": [],
            "date": "2015-09-23 20:11:58",
            "diff": "openwall_john/issue_1037/commit_e8d831bc0196a0c06518b65b2e2c622b7cc9848f.diff",
            "diff_additions": 66,
            "diff_deletions": 215,
            "diff_file_size": 27689,
            "diff_url": "https://github.com/openwall/john/commit/e8d831bc0196a0c06518b65b2e2c622b7cc9848f.diff",
            "exists": true,
            "files": [
                {
                    "file_additions": 66,
                    "file_deletions": 215,
                    "file_exists": true,
                    "file_name": "src/opencl_mscash_fmt_plug.c",
                    "file_size": 27689
                }
            ],
            "interesting": {
                "reopen": false,
                "status": false
            },
            "is_parent": false,
            "sha": "e8d831bc0196a0c06518b65b2e2c622b7cc9848f"
        },
        {
            "associated_pull_request": [],
            "date": "2015-09-23 20:27:07",
            "diff": "openwall_john/issue_1037/commit_64e895ce25adea35453493ccbae9a0254f9b120f.diff",
            "diff_additions": 215,
            "diff_deletions": 66,
            "diff_file_size": 27689,
            "diff_url": "https://github.com/openwall/john/commit/64e895ce25adea35453493ccbae9a0254f9b120f.diff",
            "exists": true,
            "files": [
                {
                    "file_additions": 215,
                    "file_deletions": 66,
                    "file_exists": true,
                    "file_name": "src/opencl_mscash_fmt_plug.c",
                    "file_size": 27689
                }
            ],
            "interesting": {
                "reopen": false,
                "status": false
            },
            "is_parent": false,
            "sha": "64e895ce25adea35453493ccbae9a0254f9b120f"
        },
        {
            "associated_pull_request": [],
            "date": "2015-09-23 23:06:13",
            "diff": "openwall_john/issue_1037/commit_0f45bb78de4e037c3edc78aab9c35b460aafabe8.diff",
            "diff_additions": 77,
            "diff_deletions": 224,
            "diff_file_size": 27689,
            "diff_url": "https://github.com/openwall/john/commit/0f45bb78de4e037c3edc78aab9c35b460aafabe8.diff",
            "exists": true,
            "files": [
                {
                    "file_additions": 77,
                    "file_deletions": 224,
                    "file_exists": true,
                    "file_name": "src/opencl_mscash_fmt_plug.c",
                    "file_size": 27689
                }
            ],
            "interesting": {
                "reopen": false,
                "status": false
            },
            "is_parent": false,
            "sha": "0f45bb78de4e037c3edc78aab9c35b460aafabe8"
        }
    ],
    "first_commit": "2015-04-06 20:07:57",
    "last_commit": "2015-09-23 23:06:13",
    "number": 1037,
    "pull_request": "None",
    "score": {
        "accidental_reopen_likely": false,
        "all_labels": [
            "enhancement"
        ],
        "contains_keywords": [
            "fail",
            "warn",
            "chang",
            "reason",
            "error",
            "workaround",
            "bug",
            "problem",
            "test",
            "fix",
            "patch",
            "remov",
            "attempt",
            "issu",
            "work",
            "perform",
            "CI",
            "fault",
            "debug"
        ],
        "fix_size": 493,
        "has_labels": [],
        "intersecting": {
            "computed_score": 0.9185185185185185,
            "final_commit_size": 270,
            "intersection_size": 248,
            "previous_commits_size": 471
        },
        "is_makefile_based": false,
        "no_new_files": [],
        "no_other_files": false,
        "num_prohibited_files": 200545,
        "prohibited_files": [
            "hal/inc/pinmap_hal.h",
            "Debug/marvin.bin",
            "Debug/marvin.elf",
            "Debug/marvin.hex",
            "Debug/marvin.bin",
            "Debug/marvin.elf",
            "Debug/marvin.hex",
            "inc/spark_utilities.h",
            "Debug/marvin.bin",
            "Debug/marvin.elf"
        ],
        "reopen": false,
        "reopen_events": [
            [
                "2015-04-06 19:05:30",
                "commit"
            ],
            [
                "2015-04-06 19:18:35",
                "commit"
            ],
            [
                "2015-04-06 19:22:25",
                "commit"
            ],
            [
                "2015-04-06 20:00:57",
                "commit"
            ],
            [
                "2015-04-06 20:08:15",
                "commit"
            ],
            [
                "2015-07-12 22:45:15",
                "commit"
            ],
            [
                "2015-09-22 20:54:32",
                "commit"
            ],
            [
                "2015-09-22 21:47:28",
                "commit"
            ],
            [
                "2015-09-22 23:22:42",
                "commit"
            ],
            [
                "2015-09-23 00:04:32",
                "commit"
            ],
            [
                "2015-09-23 20:12:27",
                "commit"
            ],
            [
                "2015-09-23 20:27:21",
                "commit"
            ],
            [
                "2015-09-23 23:06:22",
                "commit"
            ],
            [
                "2015-10-01 20:45:56",
                "closed"
            ]
        ],
        "status": true,
        "strategy": true,
        "total_changes": 1115
    }
}