{
    "commits": [
        {
            "associated_pull_request": [
                "https://github.com/MapServer/MapServer/pull/5651"
            ],
            "date": "2018-08-31 14:03:36+00:00",
            "diff": "mapserver_mapserver/issue_5658/commit_9a5494219a093de1086375c1b9613d7b2a087656.diff",
            "diff_additions": 8,
            "diff_deletions": 4,
            "diff_file_size": 0,
            "diff_url": "https://github.com/MapServer/MapServer/commit/9a5494219a093de1086375c1b9613d7b2a087656.diff",
            "exists": true,
            "files": [
                {
                    "file_additions": 1,
                    "file_deletions": 1,
                    "file_exists": false,
                    "file_name": "mapwcs.c",
                    "file_size": 0
                },
                {
                    "file_additions": 7,
                    "file_deletions": 3,
                    "file_exists": false,
                    "file_name": "mapwcs20.c",
                    "file_size": 0
                }
            ],
            "interesting": {
                "reopen": false,
                "status": false
            },
            "is_parent": true,
            "sha": "9a5494219a093de1086375c1b9613d7b2a087656"
        },
        {
            "associated_pull_request": [],
            "date": "2018-09-07 10:22:39+00:00",
            "diff": "mapserver_mapserver/issue_5658/commit_faf4d729c275672725a865148b21bfae7713b9bf.diff",
            "diff_additions": 32,
            "diff_deletions": 6,
            "diff_file_size": 0,
            "diff_url": "https://github.com/MapServer/MapServer/commit/faf4d729c275672725a865148b21bfae7713b9bf.diff",
            "exists": true,
            "files": [
                {
                    "file_additions": 32,
                    "file_deletions": 6,
                    "file_exists": false,
                    "file_name": "mapogcfiltercommon.c",
                    "file_size": 0
                }
            ],
            "interesting": {
                "reopen": false,
                "status": false
            },
            "is_parent": false,
            "sha": "faf4d729c275672725a865148b21bfae7713b9bf"
        },
        {
            "associated_pull_request": [],
            "date": "2019-01-30 15:01:49+00:00",
            "diff": "mapserver_mapserver/issue_5658/commit_5083a02376366384019eb8ed94237d5a532420d0.diff",
            "diff_additions": 16,
            "diff_deletions": 16,
            "diff_file_size": 0,
            "diff_url": "https://github.com/MapServer/MapServer/commit/5083a02376366384019eb8ed94237d5a532420d0.diff",
            "exists": true,
            "files": [
                {
                    "file_additions": 16,
                    "file_deletions": 16,
                    "file_exists": false,
                    "file_name": "mapwms.c",
                    "file_size": 0
                }
            ],
            "interesting": {
                "reopen": false,
                "status": false
            },
            "is_parent": false,
            "sha": "5083a02376366384019eb8ed94237d5a532420d0"
        },
        {
            "associated_pull_request": [],
            "date": "2019-01-30 15:02:28+00:00",
            "diff": "mapserver_mapserver/issue_5658/commit_6307eba7595f61c8a8ce8b559a30f4de9f0111eb.diff",
            "diff_additions": 48,
            "diff_deletions": 23,
            "diff_file_size": 0,
            "diff_url": "https://github.com/MapServer/MapServer/commit/6307eba7595f61c8a8ce8b559a30f4de9f0111eb.diff",
            "exists": true,
            "files": [
                {
                    "file_additions": 48,
                    "file_deletions": 23,
                    "file_exists": false,
                    "file_name": "mapogcfiltercommon.c",
                    "file_size": 0
                }
            ],
            "interesting": {
                "reopen": false,
                "status": false
            },
            "is_parent": false,
            "sha": "6307eba7595f61c8a8ce8b559a30f4de9f0111eb"
        },
        {
            "associated_pull_request": [],
            "date": "2019-01-30 15:01:49+00:00",
            "diff": "mapserver_mapserver/issue_5658/commit_f8ed7b23b64ebb436f81b31ee500737dd04cb28d.diff",
            "diff_additions": 16,
            "diff_deletions": 16,
            "diff_file_size": 0,
            "diff_url": "https://github.com/MapServer/MapServer/commit/f8ed7b23b64ebb436f81b31ee500737dd04cb28d.diff",
            "exists": true,
            "files": [
                {
                    "file_additions": 16,
                    "file_deletions": 16,
                    "file_exists": false,
                    "file_name": "mapwms.c",
                    "file_size": 0
                }
            ],
            "interesting": {
                "reopen": false,
                "status": false
            },
            "is_parent": false,
            "sha": "f8ed7b23b64ebb436f81b31ee500737dd04cb28d"
        },
        {
            "associated_pull_request": [],
            "date": "2019-01-30 15:02:28+00:00",
            "diff": "mapserver_mapserver/issue_5658/commit_5e2c6a0c5f6fd6a4a0305b1da47a8f9dbe2686b6.diff",
            "diff_additions": 48,
            "diff_deletions": 23,
            "diff_file_size": 0,
            "diff_url": "https://github.com/MapServer/MapServer/commit/5e2c6a0c5f6fd6a4a0305b1da47a8f9dbe2686b6.diff",
            "exists": true,
            "files": [
                {
                    "file_additions": 48,
                    "file_deletions": 23,
                    "file_exists": false,
                    "file_name": "mapogcfiltercommon.c",
                    "file_size": 0
                }
            ],
            "interesting": {
                "reopen": false,
                "status": false
            },
            "is_parent": false,
            "sha": "5e2c6a0c5f6fd6a4a0305b1da47a8f9dbe2686b6"
        },
        {
            "associated_pull_request": [],
            "date": "2019-01-30 15:02:28+00:00",
            "diff": "mapserver_mapserver/issue_5658/commit_49bcbbe157ed9b057badef386ce09b6e063bac63.diff",
            "diff_additions": 48,
            "diff_deletions": 23,
            "diff_file_size": 0,
            "diff_url": "https://github.com/MapServer/MapServer/commit/49bcbbe157ed9b057badef386ce09b6e063bac63.diff",
            "exists": true,
            "files": [
                {
                    "file_additions": 48,
                    "file_deletions": 23,
                    "file_exists": false,
                    "file_name": "mapogcfiltercommon.c",
                    "file_size": 0
                }
            ],
            "interesting": {
                "reopen": false,
                "status": false
            },
            "is_parent": false,
            "sha": "49bcbbe157ed9b057badef386ce09b6e063bac63"
        },
        {
            "associated_pull_request": [
                "https://github.com/MapServer/MapServer/pull/5739"
            ],
            "date": "2019-01-30 15:02:28+00:00",
            "diff": "mapserver_mapserver/issue_5658/commit_9e654b36c296d14e45f854d8ecea684c8b75e441.diff",
            "diff_additions": 48,
            "diff_deletions": 23,
            "diff_file_size": 0,
            "diff_url": "https://github.com/MapServer/MapServer/commit/9e654b36c296d14e45f854d8ecea684c8b75e441.diff",
            "exists": true,
            "files": [
                {
                    "file_additions": 48,
                    "file_deletions": 23,
                    "file_exists": false,
                    "file_name": "mapogcfiltercommon.c",
                    "file_size": 0
                }
            ],
            "interesting": {
                "reopen": false,
                "status": false
            },
            "is_parent": false,
            "sha": "9e654b36c296d14e45f854d8ecea684c8b75e441"
        },
        {
            "associated_pull_request": [
                "https://github.com/MapServer/MapServer/pull/5740"
            ],
            "date": "2019-01-30 15:01:49+00:00",
            "diff": "mapserver_mapserver/issue_5658/commit_3ab33227c6ca35856121d36ec82bb2c55a5f8d3c.diff",
            "diff_additions": 16,
            "diff_deletions": 16,
            "diff_file_size": 0,
            "diff_url": "https://github.com/MapServer/MapServer/commit/3ab33227c6ca35856121d36ec82bb2c55a5f8d3c.diff",
            "exists": true,
            "files": [
                {
                    "file_additions": 16,
                    "file_deletions": 16,
                    "file_exists": false,
                    "file_name": "mapwms.c",
                    "file_size": 0
                }
            ],
            "interesting": {
                "reopen": false,
                "status": false
            },
            "is_parent": false,
            "sha": "3ab33227c6ca35856121d36ec82bb2c55a5f8d3c"
        },
        {
            "associated_pull_request": [
                "https://github.com/MapServer/MapServer/pull/5739"
            ],
            "date": "2019-01-30 15:02:28+00:00",
            "diff": "mapserver_mapserver/issue_5658/commit_9e654b36c296d14e45f854d8ecea684c8b75e441.diff",
            "diff_additions": 48,
            "diff_deletions": 23,
            "diff_file_size": 0,
            "diff_url": "https://github.com/MapServer/MapServer/commit/9e654b36c296d14e45f854d8ecea684c8b75e441.diff",
            "exists": true,
            "files": [
                {
                    "file_additions": 48,
                    "file_deletions": 23,
                    "file_exists": false,
                    "file_name": "mapogcfiltercommon.c",
                    "file_size": 0
                }
            ],
            "interesting": {
                "reopen": false,
                "status": false
            },
            "is_parent": false,
            "sha": "9e654b36c296d14e45f854d8ecea684c8b75e441"
        },
        {
            "associated_pull_request": [
                "https://github.com/MapServer/MapServer/pull/5739"
            ],
            "date": "2019-01-30 15:33:11+00:00",
            "diff": "mapserver_mapserver/issue_5658/commit_b5476b4fed3fb7078f65bffac1120dd90c3a0a27.diff",
            "diff_additions": 48,
            "diff_deletions": 23,
            "diff_file_size": 0,
            "diff_url": "https://github.com/MapServer/MapServer/commit/b5476b4fed3fb7078f65bffac1120dd90c3a0a27.diff",
            "exists": true,
            "files": [
                {
                    "file_additions": 48,
                    "file_deletions": 23,
                    "file_exists": false,
                    "file_name": "mapogcfiltercommon.c",
                    "file_size": 0
                }
            ],
            "interesting": {
                "reopen": false,
                "status": false
            },
            "is_parent": false,
            "sha": "b5476b4fed3fb7078f65bffac1120dd90c3a0a27"
        },
        {
            "associated_pull_request": [
                "https://github.com/MapServer/MapServer/pull/5740"
            ],
            "date": "2019-03-22 19:54:10+00:00",
            "diff": "mapserver_mapserver/issue_5658/commit_8ad230107e8d54be6d9449616a631783c9ed5957.diff",
            "diff_additions": 16,
            "diff_deletions": 16,
            "diff_file_size": 0,
            "diff_url": "https://github.com/MapServer/MapServer/commit/8ad230107e8d54be6d9449616a631783c9ed5957.diff",
            "exists": true,
            "files": [
                {
                    "file_additions": 16,
                    "file_deletions": 16,
                    "file_exists": false,
                    "file_name": "mapwms.c",
                    "file_size": 0
                }
            ],
            "interesting": {
                "reopen": false,
                "status": false
            },
            "is_parent": false,
            "sha": "8ad230107e8d54be6d9449616a631783c9ed5957"
        }
    ],
    "first_commit": "2018-08-31 14:03:36+00:00",
    "last_commit": "2019-03-22 19:54:10+00:00",
    "number": 5658,
    "pull_request": "None",
    "score": {
        "accidental_reopen_likely": false,
        "all_labels": [],
        "contains_keywords": [
            "work",
            "fix",
            "issu",
            "fault",
            "problem"
        ],
        "fix_size": 98,
        "has_labels": [],
        "intersecting": {
            "computed_score": 1.0,
            "final_commit_size": 33,
            "intersection_size": 33,
            "previous_commits_size": 98
        },
        "is_makefile_based": true,
        "no_new_files": [],
        "no_other_files": false,
        "num_prohibited_files": 871471,
        "prohibited_files": [
            "server/src/main/java/com/genymobile/scrcpy/Device.java",
            "server/src/main/java/com/genymobile/scrcpy/wrappers/SurfaceControl.java",
            "server/src/main/java/com/genymobile/scrcpy/Device.java",
            "server/src/main/java/com/genymobile/scrcpy/wrappers/SurfaceControl.java",
            "app/meson.build",
            "app/scrcpy.1",
            "app/src/common.h",
            "app/src/scrcpy.h",
            "app/src/server.h",
            "server/src/main/java/com/genymobile/scrcpy/Workarounds.java"
        ],
        "reopen": true,
        "reopen_events": [
            [
                "2018-09-07 10:23:02+00:00",
                "commit"
            ],
            [
                "2018-09-07 11:40:40+00:00",
                "commit"
            ],
            [
                "2018-09-07 12:56:16+00:00",
                "closed"
            ],
            [
                "2018-09-07 12:56:16+00:00",
                "commit"
            ],
            [
                "2018-09-07 12:56:16+00:00",
                "commit"
            ],
            [
                "2019-01-30 14:58:18+00:00",
                "reopened"
            ],
            [
                "2019-01-30 15:02:41+00:00",
                "commit"
            ],
            [
                "2019-01-30 15:02:41+00:00",
                "commit"
            ],
            [
                "2019-01-30 15:04:40+00:00",
                "commit"
            ],
            [
                "2019-01-30 15:04:40+00:00",
                "commit"
            ],
            [
                "2019-01-30 15:05:23+00:00",
                "commit"
            ],
            [
                "2019-01-30 15:09:37+00:00",
                "commit"
            ],
            [
                "2019-01-30 15:10:13+00:00",
                "commit"
            ],
            [
                "2019-01-30 15:33:13+00:00",
                "closed"
            ],
            [
                "2019-01-30 15:33:13+00:00",
                "commit"
            ],
            [
                "2019-01-30 15:33:13+00:00",
                "commit"
            ],
            [
                "2019-03-22 19:54:12+00:00",
                "commit"
            ]
        ],
        "status": false,
        "strategy": true,
        "total_changes": 604
    }
}