{
    "commits": [
        {
            "diff": "spring-projects_spring-boot/issue_14780/commit_a296a805c57a25425a97e080f8e1b23230d77418.diff",
            "diff_additions": 2,
            "diff_deletions": 2,
            "diff_file_size": 14570,
            "files": [
                {
                    "file_additions": 2,
                    "file_deletions": 2,
                    "file_exists": true,
                    "file_name": "spring-boot-project/spring-boot-autoconfigure/src/test/java/org/springframework/boot/autoconfigure/diagnostics/analyzer/NoSuchBeanDefinitionFailureAnalyzerTests.java",
                    "file_size": 14570
                }
            ],
            "interesting": {
                "reopened": false,
                "status": false
            },
            "sha": "a296a805c57a25425a97e080f8e1b23230d77418"
        },
        {
            "diff": "spring-projects_spring-boot/issue_14780/commit_2a2908e74e7cd8b4d2c2bcb89847f92a2f90a0bc.diff",
            "diff_additions": 55,
            "diff_deletions": 19,
            "diff_file_size": 9485,
            "files": [
                {
                    "file_additions": 23,
                    "file_deletions": 15,
                    "file_exists": true,
                    "file_name": "spring-boot-project/spring-boot-actuator-autoconfigure/src/main/java/org/springframework/boot/actuate/autoconfigure/metrics/MeterRegistryPostProcessor.java",
                    "file_size": 3046
                },
                {
                    "file_additions": 11,
                    "file_deletions": 3,
                    "file_exists": true,
                    "file_name": "spring-boot-project/spring-boot-actuator-autoconfigure/src/main/java/org/springframework/boot/actuate/autoconfigure/metrics/MetricsAutoConfiguration.java",
                    "file_size": 2672
                },
                {
                    "file_additions": 21,
                    "file_deletions": 1,
                    "file_exists": true,
                    "file_name": "spring-boot-project/spring-boot-actuator-autoconfigure/src/test/java/org/springframework/boot/actuate/autoconfigure/metrics/MetricsAutoConfigurationTests.java",
                    "file_size": 3767
                }
            ],
            "interesting": {
                "reopened": false,
                "status": true
            },
            "sha": "2a2908e74e7cd8b4d2c2bcb89847f92a2f90a0bc"
        },
        {
            "diff": "spring-projects_spring-boot/issue_14780/commit_5e3b5ae14fed1cef6bc00a6bf62c8feffc2e1ffd.diff",
            "diff_additions": 16,
            "diff_deletions": 15,
            "diff_file_size": 5718,
            "files": [
                {
                    "file_additions": 13,
                    "file_deletions": 10,
                    "file_exists": true,
                    "file_name": "spring-boot-project/spring-boot-actuator-autoconfigure/src/main/java/org/springframework/boot/actuate/autoconfigure/metrics/MeterRegistryPostProcessor.java",
                    "file_size": 3046
                },
                {
                    "file_additions": 3,
                    "file_deletions": 5,
                    "file_exists": true,
                    "file_name": "spring-boot-project/spring-boot-actuator-autoconfigure/src/main/java/org/springframework/boot/actuate/autoconfigure/metrics/MetricsAutoConfiguration.java",
                    "file_size": 2672
                }
            ],
            "interesting": {
                "reopened": false,
                "status": false
            },
            "sha": "5e3b5ae14fed1cef6bc00a6bf62c8feffc2e1ffd"
        }
    ],
    "first_commit": "2018-10-11 10:51:34",
    "last_commit": "2018-10-11 16:25:54",
    "number": 14780,
    "score": 288.0366972477064
}