{
    "category": [
        "network/protocol",
        "multithreading"
    ],
    "commits": [
        {
            "associated_pull_request": [
                "https://github.com/DynamoRIO/dynamorio/pull/2498"
            ],
            "date": "2018-01-09 23:08:42",
            "diff": "dynamorio_dynamorio/issue_2800/commit_809af522fed6f9f3b9d086dbc7d0417d8e25839e.diff",
            "diff_additions": 324,
            "diff_deletions": 92,
            "diff_file_size": 235174,
            "diff_url": "https://github.com/DynamoRIO/dynamorio/commit/809af522fed6f9f3b9d086dbc7d0417d8e25839e.diff",
            "exists": true,
            "files": [
                {
                    "file_additions": 151,
                    "file_deletions": 22,
                    "file_exists": true,
                    "file_name": "core/arch/aarch64/clean_call_opt.c",
                    "file_size": 19940
                },
                {
                    "file_additions": 92,
                    "file_deletions": 27,
                    "file_exists": true,
                    "file_name": "core/arch/aarchxx/mangle.c",
                    "file_size": 159647
                },
                {
                    "file_additions": 4,
                    "file_deletions": 0,
                    "file_exists": true,
                    "file_name": "core/arch/clean_call_opt_shared.c",
                    "file_size": 31158
                },
                {
                    "file_additions": 23,
                    "file_deletions": 14,
                    "file_exists": true,
                    "file_name": "suite/tests/client-interface/inline.c",
                    "file_size": 3477
                },
                {
                    "file_additions": 54,
                    "file_deletions": 29,
                    "file_exists": true,
                    "file_name": "suite/tests/client-interface/inline.dll.c",
                    "file_size": 20952
                }
            ],
            "interesting": {
                "reopen": false,
                "status": false
            },
            "is_parent": true,
            "sha": "809af522fed6f9f3b9d086dbc7d0417d8e25839e"
        },
        {
            "associated_pull_request": [
                "https://github.com/DynamoRIO/dynamorio/pull/2801"
            ],
            "date": "2018-01-09 22:08:14",
            "diff": "dynamorio_dynamorio/issue_2800/commit_ca80d6ace028fb6d41917f85ff048dc3f6adca6a.diff",
            "diff_additions": 12,
            "diff_deletions": 2,
            "diff_file_size": 107296,
            "diff_url": "https://github.com/DynamoRIO/dynamorio/commit/ca80d6ace028fb6d41917f85ff048dc3f6adca6a.diff",
            "exists": true,
            "files": [
                {
                    "file_additions": 6,
                    "file_deletions": 1,
                    "file_exists": true,
                    "file_name": "ext/drreg/drreg.c",
                    "file_size": 87917
                },
                {
                    "file_additions": 6,
                    "file_deletions": 1,
                    "file_exists": true,
                    "file_name": "suite/tests/client-interface/drreg-test.c",
                    "file_size": 19379
                }
            ],
            "interesting": {
                "reopen": false,
                "status": true
            },
            "is_parent": false,
            "sha": "ca80d6ace028fb6d41917f85ff048dc3f6adca6a"
        },
        {
            "associated_pull_request": [
                "https://github.com/DynamoRIO/dynamorio/pull/2801"
            ],
            "date": "2018-01-10 03:55:34",
            "diff": "dynamorio_dynamorio/issue_2800/commit_b07a5764774f95fefeccd362aec791dc72d2df88.diff",
            "diff_additions": 12,
            "diff_deletions": 2,
            "diff_file_size": 107296,
            "diff_url": "https://github.com/DynamoRIO/dynamorio/commit/b07a5764774f95fefeccd362aec791dc72d2df88.diff",
            "exists": true,
            "files": [
                {
                    "file_additions": 6,
                    "file_deletions": 1,
                    "file_exists": true,
                    "file_name": "ext/drreg/drreg.c",
                    "file_size": 87917
                },
                {
                    "file_additions": 6,
                    "file_deletions": 1,
                    "file_exists": true,
                    "file_name": "suite/tests/client-interface/drreg-test.c",
                    "file_size": 19379
                }
            ],
            "interesting": {
                "reopen": false,
                "status": false
            },
            "is_parent": false,
            "sha": "b07a5764774f95fefeccd362aec791dc72d2df88"
        }
    ],
    "first_commit": "2018-01-09 23:08:42",
    "last_commit": "2018-01-10 03:55:34",
    "number": 2800,
    "pull_request": "None",
    "score": {
        "accidental_reopen_likely": false,
        "all_labels": [
            "Bug-AppCrash",
            "Component-Extension"
        ],
        "contains_keywords": [
            "error",
            "bug",
            "test",
            "fix",
            "issu",
            "work"
        ],
        "fix_size": 14,
        "has_labels": [],
        "intersecting": {
            "computed_score": 1.0,
            "final_commit_size": 14,
            "intersection_size": 14,
            "previous_commits_size": 14
        },
        "is_makefile_based": true,
        "no_new_files": [],
        "no_other_files": false,
        "num_prohibited_files": 13986,
        "prohibited_files": [
            "hal/inc/pinmap_hal.h",
            "Debug/marvin.bin",
            "Debug/marvin.elf",
            "Debug/marvin.hex",
            "Debug/marvin.bin",
            "Debug/marvin.elf",
            "Debug/marvin.hex",
            "inc/spark_utilities.h",
            "Debug/marvin.bin",
            "Debug/marvin.elf"
        ],
        "reopen": false,
        "reopen_events": [
            [
                "2018-01-09 23:37:38",
                "commit"
            ],
            [
                "2018-01-10 03:55:34",
                "closed"
            ],
            [
                "2018-01-10 03:55:36",
                "commit"
            ]
        ],
        "status": true,
        "strategy": true,
        "total_changes": 444
    }
}