{
    "covered_issues": [
        74,
        73,
        67,
        66,
        65,
        64,
        63,
        61,
        58,
        56,
        54,
        53,
        52,
        49,
        48,
        47,
        42,
        40,
        39,
        37,
        34,
        33,
        27,
        23,
        21,
        19,
        17,
        15,
        13,
        5,
        4,
        3,
        1
    ],
    "finished": true
}