{
    "commits": [
        {
            "associated_pull_request": [],
            "date": "2018-10-07 04:34:42+00:00",
            "diff": "",
            "diff_additions": 0,
            "diff_deletions": 0,
            "diff_file_size": 0,
            "diff_url": "https://github.com/warmcat/libwebsockets/commit/f982f49bb8d2a39fd90f235b265821298465d255.diff",
            "exists": true,
            "files": [],
            "interesting": {
                "reopen": false,
                "status": false
            },
            "is_parent": true,
            "sha": "f982f49bb8d2a39fd90f235b265821298465d255"
        },
        {
            "associated_pull_request": [],
            "date": "2018-10-08 07:31:01+00:00",
            "diff": "warmcat_libwebsockets/issue_1423/commit_27d8d9d8469ee3b5377bff79ce4ae1322b63fd6a.diff",
            "diff_additions": 1,
            "diff_deletions": 1,
            "diff_file_size": 28263,
            "diff_url": "https://github.com/warmcat/libwebsockets/commit/27d8d9d8469ee3b5377bff79ce4ae1322b63fd6a.diff",
            "exists": true,
            "files": [
                {
                    "file_additions": 1,
                    "file_deletions": 1,
                    "file_exists": true,
                    "file_name": "lib/roles/ws/server-ws.c",
                    "file_size": 28263
                }
            ],
            "interesting": {
                "reopen": false,
                "status": false
            },
            "is_parent": false,
            "sha": "27d8d9d8469ee3b5377bff79ce4ae1322b63fd6a"
        },
        {
            "associated_pull_request": [],
            "date": "2018-10-08 11:45:50+00:00",
            "diff": "warmcat_libwebsockets/issue_1423/commit_1f16ef18c41c63a870261892a2cedb6c7e1e8f6b.diff",
            "diff_additions": 1,
            "diff_deletions": 1,
            "diff_file_size": 28263,
            "diff_url": "https://github.com/warmcat/libwebsockets/commit/1f16ef18c41c63a870261892a2cedb6c7e1e8f6b.diff",
            "exists": true,
            "files": [
                {
                    "file_additions": 1,
                    "file_deletions": 1,
                    "file_exists": true,
                    "file_name": "lib/roles/ws/server-ws.c",
                    "file_size": 28263
                }
            ],
            "interesting": {
                "reopen": false,
                "status": false
            },
            "is_parent": false,
            "sha": "1f16ef18c41c63a870261892a2cedb6c7e1e8f6b"
        },
        {
            "associated_pull_request": [],
            "date": "2018-10-08 11:48:48+00:00",
            "diff": "warmcat_libwebsockets/issue_1423/commit_c2aea8090011b4ad226f2db826cf3d0934e19835.diff",
            "diff_additions": 1,
            "diff_deletions": 1,
            "diff_file_size": 0,
            "diff_url": "https://github.com/warmcat/libwebsockets/commit/c2aea8090011b4ad226f2db826cf3d0934e19835.diff",
            "exists": true,
            "files": [
                {
                    "file_additions": 1,
                    "file_deletions": 1,
                    "file_exists": false,
                    "file_name": "lib/server/server.c",
                    "file_size": 0
                }
            ],
            "interesting": {
                "reopen": true,
                "status": false
            },
            "is_parent": false,
            "sha": "c2aea8090011b4ad226f2db826cf3d0934e19835"
        },
        {
            "associated_pull_request": [],
            "date": "2018-11-13 01:33:13+00:00",
            "diff": "warmcat_libwebsockets/issue_1423/commit_f6ae0edf8de29f2d6adbe69c4ce44623cdf0dd88.diff",
            "diff_additions": 92,
            "diff_deletions": 8,
            "diff_file_size": 144850,
            "diff_url": "https://github.com/warmcat/libwebsockets/commit/f6ae0edf8de29f2d6adbe69c4ce44623cdf0dd88.diff",
            "exists": true,
            "files": [
                {
                    "file_additions": 11,
                    "file_deletions": 0,
                    "file_exists": true,
                    "file_name": "lib/roles/http/server/lejp-conf.c",
                    "file_size": 28073
                },
                {
                    "file_additions": 74,
                    "file_deletions": 0,
                    "file_exists": true,
                    "file_name": "lib/roles/http/server/server.c",
                    "file_size": 88514
                },
                {
                    "file_additions": 0,
                    "file_deletions": 8,
                    "file_exists": true,
                    "file_name": "lib/roles/ws/server-ws.c",
                    "file_size": 28263
                },
                {
                    "file_additions": 3,
                    "file_deletions": 0,
                    "file_exists": false,
                    "file_name": "minimal-examples/http-server/minimal-http-server-tls/minimal-http-server-tls.c",
                    "file_size": 0
                },
                {
                    "file_additions": 4,
                    "file_deletions": 0,
                    "file_exists": false,
                    "file_name": "minimal-examples/ws-server/minimal-ws-server/minimal-ws-server.c",
                    "file_size": 0
                }
            ],
            "interesting": {
                "reopen": false,
                "status": false
            },
            "is_parent": false,
            "sha": "f6ae0edf8de29f2d6adbe69c4ce44623cdf0dd88"
        }
    ],
    "first_commit": "2018-10-07 10:35:41+00:00",
    "last_commit": "2018-11-13 01:55:06+00:00",
    "number": 1423,
    "pull_request": "None",
    "score": {
        "accidental_reopen_likely": false,
        "all_labels": [],
        "contains_keywords": [
            "confirm",
            "work",
            "fail",
            "chang",
            "fix",
            "issu",
            "CI",
            "patch",
            "reason",
            "test",
            "fault",
            "bug",
            "problem"
        ],
        "fix_size": 109,
        "has_labels": [],
        "intersecting": {
            "computed_score": 0.009523809523809525,
            "final_commit_size": 105,
            "intersection_size": 1,
            "previous_commits_size": 5
        },
        "is_makefile_based": true,
        "no_new_files": [
            "lib/roles/http/server/lejp-conf.c",
            "lib/roles/http/server/server.c",
            "minimal-examples/http-server/minimal-http-server-tls/minimal-http-server-tls.c",
            "minimal-examples/ws-server/minimal-ws-server/minimal-ws-server.c"
        ],
        "no_other_files": false,
        "num_prohibited_files": 195817,
        "prohibited_files": [
            "server/src/main/java/com/genymobile/scrcpy/Device.java",
            "server/src/main/java/com/genymobile/scrcpy/wrappers/SurfaceControl.java",
            "server/src/main/java/com/genymobile/scrcpy/Device.java",
            "server/src/main/java/com/genymobile/scrcpy/wrappers/SurfaceControl.java",
            "app/meson.build",
            "app/scrcpy.1",
            "app/src/common.h",
            "app/src/scrcpy.h",
            "app/src/server.h",
            "server/src/main/java/com/genymobile/scrcpy/Workarounds.java"
        ],
        "reopen": true,
        "reopen_events": [
            [
                "2018-10-08 08:17:57+00:00",
                "closed"
            ],
            [
                "2018-10-08 08:17:57+00:00",
                "commit"
            ],
            [
                "2018-10-08 10:31:51+00:00",
                "commit"
            ],
            [
                "2018-10-08 11:46:05+00:00",
                "commit"
            ],
            [
                "2018-10-08 11:51:51+00:00",
                "commit"
            ],
            [
                "2018-10-08 12:22:09+00:00",
                "reopened"
            ],
            [
                "2018-10-11 02:45:41+00:00",
                "closed"
            ],
            [
                "2018-10-13 00:16:46+00:00",
                "commit"
            ],
            [
                "2018-11-13 02:17:55+00:00",
                "commit"
            ]
        ],
        "status": false,
        "strategy": true,
        "total_changes": 106
    }
}