{
    "commits": [
        {
            "associated_pull_request": [
                "https://github.com/open62541/open62541/pull/5513"
            ],
            "date": "2022-12-18 13:33:22+00:00",
            "diff": "open62541_open62541/issue_5388/commit_e72d11497a92c5ac00484eaf395f3ba4a865ef26.diff",
            "diff_additions": 79,
            "diff_deletions": 41,
            "diff_file_size": 95223,
            "diff_url": "https://github.com/open62541/open62541/commit/e72d11497a92c5ac00484eaf395f3ba4a865ef26.diff",
            "exists": true,
            "files": [
                {
                    "file_additions": 10,
                    "file_deletions": 4,
                    "file_exists": true,
                    "file_name": "src/ua_types_encoding_binary.c",
                    "file_size": 68039
                },
                {
                    "file_additions": 69,
                    "file_deletions": 37,
                    "file_exists": true,
                    "file_name": "tests/check_types_custom.c",
                    "file_size": 27184
                }
            ],
            "interesting": {
                "reopen": false,
                "status": false
            },
            "is_parent": true,
            "sha": "e72d11497a92c5ac00484eaf395f3ba4a865ef26"
        },
        {
            "associated_pull_request": [],
            "date": "2022-12-23 11:24:27+00:00",
            "diff": "open62541_open62541/issue_5388/commit_f50a696fb2a27bece5b2eb4658d7c17aaf03f181.diff",
            "diff_additions": 19,
            "diff_deletions": 10,
            "diff_file_size": 0,
            "diff_url": "https://github.com/open62541/open62541/commit/f50a696fb2a27bece5b2eb4658d7c17aaf03f181.diff",
            "exists": true,
            "files": [
                {
                    "file_additions": 10,
                    "file_deletions": 3,
                    "file_exists": false,
                    "file_name": "arch/network_tcp.c",
                    "file_size": 0
                },
                {
                    "file_additions": 9,
                    "file_deletions": 7,
                    "file_exists": false,
                    "file_name": "deps/aa_tree.c",
                    "file_size": 0
                }
            ],
            "interesting": {
                "reopen": false,
                "status": false
            },
            "is_parent": false,
            "sha": "f50a696fb2a27bece5b2eb4658d7c17aaf03f181"
        },
        {
            "associated_pull_request": [],
            "date": "2022-12-23 11:24:27+00:00",
            "diff": "open62541_open62541/issue_5388/commit_82a8469b5e8f598a1b7c6d1a34595ebf4e14b0cf.diff",
            "diff_additions": 16,
            "diff_deletions": 7,
            "diff_file_size": 0,
            "diff_url": "https://github.com/open62541/open62541/commit/82a8469b5e8f598a1b7c6d1a34595ebf4e14b0cf.diff",
            "exists": true,
            "files": [
                {
                    "file_additions": 10,
                    "file_deletions": 3,
                    "file_exists": false,
                    "file_name": "arch/network_tcp.c",
                    "file_size": 0
                },
                {
                    "file_additions": 6,
                    "file_deletions": 4,
                    "file_exists": false,
                    "file_name": "deps/aa_tree.c",
                    "file_size": 0
                }
            ],
            "interesting": {
                "reopen": false,
                "status": true
            },
            "is_parent": false,
            "sha": "82a8469b5e8f598a1b7c6d1a34595ebf4e14b0cf"
        },
        {
            "associated_pull_request": [],
            "date": "2022-12-23 11:24:27+00:00",
            "diff": "open62541_open62541/issue_5388/commit_bc9f119eb44bff8c049e9b6741afa9b9e9eed970.diff",
            "diff_additions": 19,
            "diff_deletions": 10,
            "diff_file_size": 0,
            "diff_url": "https://github.com/open62541/open62541/commit/bc9f119eb44bff8c049e9b6741afa9b9e9eed970.diff",
            "exists": true,
            "files": [
                {
                    "file_additions": 10,
                    "file_deletions": 3,
                    "file_exists": false,
                    "file_name": "arch/network_tcp.c",
                    "file_size": 0
                },
                {
                    "file_additions": 9,
                    "file_deletions": 7,
                    "file_exists": false,
                    "file_name": "deps/aa_tree.c",
                    "file_size": 0
                }
            ],
            "interesting": {
                "reopen": false,
                "status": false
            },
            "is_parent": false,
            "sha": "bc9f119eb44bff8c049e9b6741afa9b9e9eed970"
        },
        {
            "associated_pull_request": [
                "https://github.com/open62541/open62541/pull/5536"
            ],
            "date": "2022-12-23 11:24:27+00:00",
            "diff": "open62541_open62541/issue_5388/commit_ed96f9de4f2b2e3d433ffb5b201c2ebcdd18611d.diff",
            "diff_additions": 14,
            "diff_deletions": 5,
            "diff_file_size": 0,
            "diff_url": "https://github.com/open62541/open62541/commit/ed96f9de4f2b2e3d433ffb5b201c2ebcdd18611d.diff",
            "exists": true,
            "files": [
                {
                    "file_additions": 10,
                    "file_deletions": 3,
                    "file_exists": false,
                    "file_name": "arch/network_tcp.c",
                    "file_size": 0
                },
                {
                    "file_additions": 4,
                    "file_deletions": 2,
                    "file_exists": false,
                    "file_name": "deps/aa_tree.c",
                    "file_size": 0
                }
            ],
            "interesting": {
                "reopen": false,
                "status": false
            },
            "is_parent": false,
            "sha": "ed96f9de4f2b2e3d433ffb5b201c2ebcdd18611d"
        },
        {
            "associated_pull_request": [
                "https://github.com/open62541/open62541/pull/5536"
            ],
            "date": "2023-05-02 21:05:53+00:00",
            "diff": "open62541_open62541/issue_5388/commit_0663874dae2cd66941efbc8d3c96bcdc0edb41d2.diff",
            "diff_additions": 14,
            "diff_deletions": 5,
            "diff_file_size": 0,
            "diff_url": "https://github.com/open62541/open62541/commit/0663874dae2cd66941efbc8d3c96bcdc0edb41d2.diff",
            "exists": true,
            "files": [
                {
                    "file_additions": 10,
                    "file_deletions": 3,
                    "file_exists": false,
                    "file_name": "arch/network_tcp.c",
                    "file_size": 0
                },
                {
                    "file_additions": 4,
                    "file_deletions": 2,
                    "file_exists": false,
                    "file_name": "deps/aa_tree.c",
                    "file_size": 0
                }
            ],
            "interesting": {
                "reopen": false,
                "status": false
            },
            "is_parent": false,
            "sha": "0663874dae2cd66941efbc8d3c96bcdc0edb41d2"
        },
        {
            "associated_pull_request": [
                "https://github.com/open62541/open62541/pull/5536"
            ],
            "date": "2023-05-02 21:05:53+00:00",
            "diff": "open62541_open62541/issue_5388/commit_0663874dae2cd66941efbc8d3c96bcdc0edb41d2.diff",
            "diff_additions": 14,
            "diff_deletions": 5,
            "diff_file_size": 0,
            "diff_url": "https://github.com/open62541/open62541/commit/0663874dae2cd66941efbc8d3c96bcdc0edb41d2.diff",
            "exists": true,
            "files": [
                {
                    "file_additions": 10,
                    "file_deletions": 3,
                    "file_exists": false,
                    "file_name": "arch/network_tcp.c",
                    "file_size": 0
                },
                {
                    "file_additions": 4,
                    "file_deletions": 2,
                    "file_exists": false,
                    "file_name": "deps/aa_tree.c",
                    "file_size": 0
                }
            ],
            "interesting": {
                "reopen": false,
                "status": false
            },
            "is_parent": false,
            "sha": "0663874dae2cd66941efbc8d3c96bcdc0edb41d2"
        }
    ],
    "first_commit": "2022-12-18 13:33:22+00:00",
    "last_commit": "2023-05-02 21:05:53+00:00",
    "number": 5388,
    "pull_request": "None",
    "score": {
        "accidental_reopen_likely": false,
        "all_labels": [],
        "contains_keywords": [
            "fix",
            "issu",
            "test",
            "problem"
        ],
        "fix_size": 26,
        "has_labels": [],
        "intersecting": {
            "computed_score": 1.0,
            "final_commit_size": 16,
            "intersection_size": 16,
            "previous_commits_size": 26
        },
        "is_makefile_based": true,
        "no_new_files": [],
        "no_other_files": false,
        "num_prohibited_files": 296380,
        "prohibited_files": [
            "server/src/main/java/com/genymobile/scrcpy/Device.java",
            "server/src/main/java/com/genymobile/scrcpy/wrappers/SurfaceControl.java",
            "server/src/main/java/com/genymobile/scrcpy/Device.java",
            "server/src/main/java/com/genymobile/scrcpy/wrappers/SurfaceControl.java",
            "app/meson.build",
            "app/scrcpy.1",
            "app/src/common.h",
            "app/src/scrcpy.h",
            "app/src/server.h",
            "server/src/main/java/com/genymobile/scrcpy/Workarounds.java"
        ],
        "reopen": false,
        "reopen_events": [
            [
                "2022-12-23 12:25:35+00:00",
                "commit"
            ],
            [
                "2023-01-26 09:42:16+00:00",
                "commit"
            ],
            [
                "2023-01-26 09:45:25+00:00",
                "commit"
            ],
            [
                "2023-01-26 10:16:42+00:00",
                "commit"
            ],
            [
                "2023-05-02 21:05:57+00:00",
                "commit"
            ],
            [
                "2023-05-10 05:46:08+00:00",
                "closed"
            ],
            [
                "2023-05-10 05:46:08+00:00",
                "commit"
            ]
        ],
        "status": true,
        "strategy": true,
        "total_changes": 258
    }
}