{
    "commits": [
        {
            "associated_pull_request": [
                "https://github.com/facebook/zstd/pull/3533"
            ],
            "date": "2023-03-07 22:41:33+00:00",
            "diff": "facebook_zstd/issue_3528/commit_c4fd893e72685f7500ac3163bde6aa1026287dd6.diff",
            "diff_additions": 53,
            "diff_deletions": 45,
            "diff_file_size": 343058,
            "diff_url": "https://github.com/facebook/zstd/commit/c4fd893e72685f7500ac3163bde6aa1026287dd6.diff",
            "exists": true,
            "files": [
                {
                    "file_additions": 51,
                    "file_deletions": 43,
                    "file_exists": true,
                    "file_name": "lib/compress/zstd_compress.c",
                    "file_size": 314452
                },
                {
                    "file_additions": 2,
                    "file_deletions": 2,
                    "file_exists": true,
                    "file_name": "lib/compress/zstd_ldm.c",
                    "file_size": 28606
                }
            ],
            "interesting": {
                "reopen": false,
                "status": false
            },
            "is_parent": true,
            "sha": "c4fd893e72685f7500ac3163bde6aa1026287dd6"
        },
        {
            "associated_pull_request": [],
            "date": "2023-03-07 23:24:23+00:00",
            "diff": "facebook_zstd/issue_3528/commit_e12ca6c46bc90de0d522441d7e9eadba40b3d327.diff",
            "diff_additions": 10,
            "diff_deletions": 7,
            "diff_file_size": 417614,
            "diff_url": "https://github.com/facebook/zstd/commit/e12ca6c46bc90de0d522441d7e9eadba40b3d327.diff",
            "exists": true,
            "files": [
                {
                    "file_additions": 1,
                    "file_deletions": 0,
                    "file_exists": true,
                    "file_name": "lib/compress/zstd_compress.c",
                    "file_size": 314452
                },
                {
                    "file_additions": 9,
                    "file_deletions": 7,
                    "file_exists": true,
                    "file_name": "lib/compress/zstd_lazy.c",
                    "file_size": 103162
                }
            ],
            "interesting": {
                "reopen": false,
                "status": false
            },
            "is_parent": false,
            "sha": "e12ca6c46bc90de0d522441d7e9eadba40b3d327"
        },
        {
            "associated_pull_request": [],
            "date": "2023-03-07 23:24:23+00:00",
            "diff": "facebook_zstd/issue_3528/commit_0273206976210917bb6af343d02b4454db9b1cf2.diff",
            "diff_additions": 13,
            "diff_deletions": 9,
            "diff_file_size": 417614,
            "diff_url": "https://github.com/facebook/zstd/commit/0273206976210917bb6af343d02b4454db9b1cf2.diff",
            "exists": true,
            "files": [
                {
                    "file_additions": 4,
                    "file_deletions": 2,
                    "file_exists": true,
                    "file_name": "lib/compress/zstd_compress.c",
                    "file_size": 314452
                },
                {
                    "file_additions": 9,
                    "file_deletions": 7,
                    "file_exists": true,
                    "file_name": "lib/compress/zstd_lazy.c",
                    "file_size": 103162
                }
            ],
            "interesting": {
                "reopen": false,
                "status": true
            },
            "is_parent": false,
            "sha": "0273206976210917bb6af343d02b4454db9b1cf2"
        },
        {
            "associated_pull_request": [],
            "date": "2023-03-07 23:24:23+00:00",
            "diff": "facebook_zstd/issue_3528/commit_e18c951bf208b9634f3e50f55a8a879a3b6d0189.diff",
            "diff_additions": 19,
            "diff_deletions": 9,
            "diff_file_size": 417614,
            "diff_url": "https://github.com/facebook/zstd/commit/e18c951bf208b9634f3e50f55a8a879a3b6d0189.diff",
            "exists": true,
            "files": [
                {
                    "file_additions": 10,
                    "file_deletions": 2,
                    "file_exists": true,
                    "file_name": "lib/compress/zstd_compress.c",
                    "file_size": 314452
                },
                {
                    "file_additions": 9,
                    "file_deletions": 7,
                    "file_exists": true,
                    "file_name": "lib/compress/zstd_lazy.c",
                    "file_size": 103162
                }
            ],
            "interesting": {
                "reopen": false,
                "status": false
            },
            "is_parent": false,
            "sha": "e18c951bf208b9634f3e50f55a8a879a3b6d0189"
        },
        {
            "associated_pull_request": [
                "https://github.com/facebook/zstd/pull/3533"
            ],
            "date": "2023-03-07 23:24:23+00:00",
            "diff": "facebook_zstd/issue_3528/commit_420418531ca80145ecbaa75bab1ee09be87d499f.diff",
            "diff_additions": 19,
            "diff_deletions": 9,
            "diff_file_size": 417614,
            "diff_url": "https://github.com/facebook/zstd/commit/420418531ca80145ecbaa75bab1ee09be87d499f.diff",
            "exists": true,
            "files": [
                {
                    "file_additions": 10,
                    "file_deletions": 2,
                    "file_exists": true,
                    "file_name": "lib/compress/zstd_compress.c",
                    "file_size": 314452
                },
                {
                    "file_additions": 9,
                    "file_deletions": 7,
                    "file_exists": true,
                    "file_name": "lib/compress/zstd_lazy.c",
                    "file_size": 103162
                }
            ],
            "interesting": {
                "reopen": false,
                "status": false
            },
            "is_parent": false,
            "sha": "420418531ca80145ecbaa75bab1ee09be87d499f"
        },
        {
            "associated_pull_request": [
                "https://github.com/facebook/zstd/pull/3529"
            ],
            "date": "2023-03-13 20:20:49+00:00",
            "diff": "facebook_zstd/issue_3528/commit_9420bce8a491e21821c4b372f837bf4bd47e5870.diff",
            "diff_additions": 48,
            "diff_deletions": 46,
            "diff_file_size": 382643,
            "diff_url": "https://github.com/facebook/zstd/commit/9420bce8a491e21821c4b372f837bf4bd47e5870.diff",
            "exists": true,
            "files": [
                {
                    "file_additions": 46,
                    "file_deletions": 46,
                    "file_exists": true,
                    "file_name": "lib/compress/zstd_compress.c",
                    "file_size": 314452
                },
                {
                    "file_additions": 2,
                    "file_deletions": 0,
                    "file_exists": true,
                    "file_name": "lib/compress/zstd_opt.c",
                    "file_size": 68191
                }
            ],
            "interesting": {
                "reopen": false,
                "status": false
            },
            "is_parent": false,
            "sha": "9420bce8a491e21821c4b372f837bf4bd47e5870"
        },
        {
            "associated_pull_request": [
                "https://github.com/facebook/zstd/pull/3533"
            ],
            "date": "2023-03-13 22:34:13+00:00",
            "diff": "facebook_zstd/issue_3528/commit_91f4c23e634a1d260f290f00b6d870a56cd59ab6.diff",
            "diff_additions": 40,
            "diff_deletions": 36,
            "diff_file_size": 417614,
            "diff_url": "https://github.com/facebook/zstd/commit/91f4c23e634a1d260f290f00b6d870a56cd59ab6.diff",
            "exists": true,
            "files": [
                {
                    "file_additions": 28,
                    "file_deletions": 4,
                    "file_exists": true,
                    "file_name": "lib/compress/zstd_compress.c",
                    "file_size": 314452
                },
                {
                    "file_additions": 12,
                    "file_deletions": 32,
                    "file_exists": true,
                    "file_name": "lib/compress/zstd_lazy.c",
                    "file_size": 103162
                }
            ],
            "interesting": {
                "reopen": false,
                "status": false
            },
            "is_parent": false,
            "sha": "91f4c23e634a1d260f290f00b6d870a56cd59ab6"
        }
    ],
    "first_commit": "2023-03-07 22:41:33+00:00",
    "last_commit": "2023-03-13 22:34:13+00:00",
    "number": 3528,
    "pull_request": "None",
    "score": {
        "accidental_reopen_likely": false,
        "all_labels": [],
        "contains_keywords": [
            "work",
            "chang"
        ],
        "fix_size": 179,
        "has_labels": [],
        "intersecting": {
            "computed_score": 0.22077922077922077,
            "final_commit_size": 77,
            "intersection_size": 17,
            "previous_commits_size": 119
        },
        "is_makefile_based": true,
        "no_new_files": [],
        "no_other_files": false,
        "num_prohibited_files": 28850,
        "prohibited_files": [
            "server/src/main/java/com/genymobile/scrcpy/Device.java",
            "server/src/main/java/com/genymobile/scrcpy/wrappers/SurfaceControl.java",
            "server/src/main/java/com/genymobile/scrcpy/Device.java",
            "server/src/main/java/com/genymobile/scrcpy/wrappers/SurfaceControl.java",
            "app/meson.build",
            "app/scrcpy.1",
            "app/src/common.h",
            "app/src/scrcpy.h",
            "app/src/server.h",
            "server/src/main/java/com/genymobile/scrcpy/Workarounds.java"
        ],
        "reopen": false,
        "reopen_events": [
            [
                "2023-03-07 23:35:50+00:00",
                "commit"
            ],
            [
                "2023-03-07 23:40:03+00:00",
                "commit"
            ],
            [
                "2023-03-08 00:30:30+00:00",
                "commit"
            ],
            [
                "2023-03-09 21:52:40+00:00",
                "commit"
            ],
            [
                "2023-03-13 20:20:51+00:00",
                "closed"
            ],
            [
                "2023-03-13 20:20:55+00:00",
                "commit"
            ],
            [
                "2023-03-13 22:34:17+00:00",
                "commit"
            ]
        ],
        "status": true,
        "strategy": true,
        "total_changes": 363
    }
}