{
    "commits": [
        {
            "diff": "spring-projects_spring-boot/issue_716/commit_fbe97748900f2c899fabeb881fd15d7b318c3326.diff",
            "diff_additions": 81,
            "diff_deletions": 12,
            "diff_file_size": 0,
            "files": [
                {
                    "file_additions": 27,
                    "file_deletions": 7,
                    "file_exists": false,
                    "file_name": "spring-boot-autoconfigure/src/main/java/org/springframework/boot/autoconfigure/cache/JCacheCacheConfiguration.java",
                    "file_size": 0
                },
                {
                    "file_additions": 51,
                    "file_deletions": 4,
                    "file_exists": false,
                    "file_name": "spring-boot-autoconfigure/src/test/java/org/springframework/boot/autoconfigure/cache/CacheAutoConfigurationTests.java",
                    "file_size": 0
                },
                {
                    "file_additions": 3,
                    "file_deletions": 1,
                    "file_exists": false,
                    "file_name": "spring-boot-autoconfigure/src/test/java/org/springframework/boot/autoconfigure/cache/support/MockCachingProvider.java",
                    "file_size": 0
                }
            ],
            "interesting": {
                "reopened": false,
                "status": false
            },
            "sha": "fbe97748900f2c899fabeb881fd15d7b318c3326"
        },
        {
            "diff": "spring-projects_spring-boot/issue_716/commit_c9c1e8b5173d3dd69475f7a1711606ffaf7f88a8.diff",
            "diff_additions": 1,
            "diff_deletions": 1,
            "diff_file_size": 0,
            "files": [
                {
                    "file_additions": 1,
                    "file_deletions": 1,
                    "file_exists": false,
                    "file_name": "spring-boot-cli/src/it/java/org/springframework/boot/cli/CommandLineIT.java",
                    "file_size": 0
                }
            ],
            "interesting": {
                "reopened": false,
                "status": true
            },
            "sha": "c9c1e8b5173d3dd69475f7a1711606ffaf7f88a8"
        },
        {
            "diff": "spring-projects_spring-boot/issue_716/commit_8143d1f36d7eebc02a0785ad1340ae1be8e98f8e.diff",
            "diff_additions": 6,
            "diff_deletions": 0,
            "diff_file_size": 0,
            "files": [
                {
                    "file_additions": 3,
                    "file_deletions": 0,
                    "file_exists": false,
                    "file_name": "spring-boot-tools/spring-boot-loader/src/main/java/org/springframework/boot/loader/LaunchedURLClassLoader.java",
                    "file_size": 0
                },
                {
                    "file_additions": 3,
                    "file_deletions": 0,
                    "file_exists": false,
                    "file_name": "spring-boot/src/main/java/org/springframework/boot/jta/bitronix/PoolingDataSourceBean.java",
                    "file_size": 0
                }
            ],
            "interesting": {
                "reopened": false,
                "status": false
            },
            "sha": "8143d1f36d7eebc02a0785ad1340ae1be8e98f8e"
        }
    ],
    "first_commit": "2015-04-03 13:24:58",
    "last_commit": "2015-04-07 02:47:22",
    "number": 716,
    "score": 256.03960396039605
}