{
    "commits": [
        {
            "associated_pull_request": [],
            "date": "2021-03-27 23:21:44+00:00",
            "diff": "",
            "diff_additions": 0,
            "diff_deletions": 0,
            "diff_file_size": 0,
            "diff_url": "https://github.com/atar-axis/xpadneo/commit/2780c7776c6c709dc530a57e8442258941651a34.diff",
            "exists": true,
            "files": [],
            "interesting": {
                "reopen": false,
                "status": false
            },
            "is_parent": true,
            "sha": "2780c7776c6c709dc530a57e8442258941651a34"
        },
        {
            "associated_pull_request": [],
            "date": "2021-03-27 23:37:13+00:00",
            "diff": "atar-axis_xpadneo/issue_273/commit_1defc7c7e935fe78aae09cdc368c21901fe556bc.diff",
            "diff_additions": 88,
            "diff_deletions": 35,
            "diff_file_size": 41306,
            "diff_url": "https://github.com/atar-axis/xpadneo/commit/1defc7c7e935fe78aae09cdc368c21901fe556bc.diff",
            "exists": true,
            "files": [
                {
                    "file_additions": 88,
                    "file_deletions": 35,
                    "file_exists": true,
                    "file_name": "hid-xpadneo/src/hid-xpadneo.c",
                    "file_size": 41306
                }
            ],
            "interesting": {
                "reopen": false,
                "status": false
            },
            "is_parent": false,
            "sha": "1defc7c7e935fe78aae09cdc368c21901fe556bc"
        },
        {
            "associated_pull_request": [],
            "date": "2021-03-27 23:37:13+00:00",
            "diff": "atar-axis_xpadneo/issue_273/commit_f3d9e54c6addb1f28403ef3d81b2717334faf1d9.diff",
            "diff_additions": 88,
            "diff_deletions": 36,
            "diff_file_size": 41306,
            "diff_url": "https://github.com/atar-axis/xpadneo/commit/f3d9e54c6addb1f28403ef3d81b2717334faf1d9.diff",
            "exists": true,
            "files": [
                {
                    "file_additions": 88,
                    "file_deletions": 36,
                    "file_exists": true,
                    "file_name": "hid-xpadneo/src/hid-xpadneo.c",
                    "file_size": 41306
                }
            ],
            "interesting": {
                "reopen": true,
                "status": false
            },
            "is_parent": false,
            "sha": "f3d9e54c6addb1f28403ef3d81b2717334faf1d9"
        },
        {
            "associated_pull_request": [],
            "date": "2021-03-27 23:37:13+00:00",
            "diff": "atar-axis_xpadneo/issue_273/commit_e72be8550e1a2f9f2117b5d11c93084353151bd0.diff",
            "diff_additions": 87,
            "diff_deletions": 32,
            "diff_file_size": 41306,
            "diff_url": "https://github.com/atar-axis/xpadneo/commit/e72be8550e1a2f9f2117b5d11c93084353151bd0.diff",
            "exists": true,
            "files": [
                {
                    "file_additions": 87,
                    "file_deletions": 32,
                    "file_exists": true,
                    "file_name": "hid-xpadneo/src/hid-xpadneo.c",
                    "file_size": 41306
                }
            ],
            "interesting": {
                "reopen": false,
                "status": false
            },
            "is_parent": false,
            "sha": "e72be8550e1a2f9f2117b5d11c93084353151bd0"
        },
        {
            "associated_pull_request": [],
            "date": "2021-03-27 23:37:13+00:00",
            "diff": "atar-axis_xpadneo/issue_273/commit_12ef0b41766684dc6d4c5fd081ead9b132679953.diff",
            "diff_additions": 87,
            "diff_deletions": 32,
            "diff_file_size": 41306,
            "diff_url": "https://github.com/atar-axis/xpadneo/commit/12ef0b41766684dc6d4c5fd081ead9b132679953.diff",
            "exists": true,
            "files": [
                {
                    "file_additions": 87,
                    "file_deletions": 32,
                    "file_exists": true,
                    "file_name": "hid-xpadneo/src/hid-xpadneo.c",
                    "file_size": 41306
                }
            ],
            "interesting": {
                "reopen": false,
                "status": false
            },
            "is_parent": false,
            "sha": "12ef0b41766684dc6d4c5fd081ead9b132679953"
        },
        {
            "associated_pull_request": [],
            "date": "2021-03-27 23:37:13+00:00",
            "diff": "atar-axis_xpadneo/issue_273/commit_11398b62eb1df3218e70f3c28e8759a079b710ec.diff",
            "diff_additions": 87,
            "diff_deletions": 32,
            "diff_file_size": 41306,
            "diff_url": "https://github.com/atar-axis/xpadneo/commit/11398b62eb1df3218e70f3c28e8759a079b710ec.diff",
            "exists": true,
            "files": [
                {
                    "file_additions": 87,
                    "file_deletions": 32,
                    "file_exists": true,
                    "file_name": "hid-xpadneo/src/hid-xpadneo.c",
                    "file_size": 41306
                }
            ],
            "interesting": {
                "reopen": false,
                "status": false
            },
            "is_parent": false,
            "sha": "11398b62eb1df3218e70f3c28e8759a079b710ec"
        },
        {
            "associated_pull_request": [],
            "date": "2021-03-27 23:37:13+00:00",
            "diff": "atar-axis_xpadneo/issue_273/commit_15c53d201d439f9f67bf64201de416a2a75fec54.diff",
            "diff_additions": 87,
            "diff_deletions": 32,
            "diff_file_size": 41306,
            "diff_url": "https://github.com/atar-axis/xpadneo/commit/15c53d201d439f9f67bf64201de416a2a75fec54.diff",
            "exists": true,
            "files": [
                {
                    "file_additions": 87,
                    "file_deletions": 32,
                    "file_exists": true,
                    "file_name": "hid-xpadneo/src/hid-xpadneo.c",
                    "file_size": 41306
                }
            ],
            "interesting": {
                "reopen": false,
                "status": false
            },
            "is_parent": false,
            "sha": "15c53d201d439f9f67bf64201de416a2a75fec54"
        },
        {
            "associated_pull_request": [],
            "date": "2021-03-27 23:37:13+00:00",
            "diff": "atar-axis_xpadneo/issue_273/commit_45df9fc748a42e678470b644947a32417dcdf1cb.diff",
            "diff_additions": 87,
            "diff_deletions": 32,
            "diff_file_size": 41306,
            "diff_url": "https://github.com/atar-axis/xpadneo/commit/45df9fc748a42e678470b644947a32417dcdf1cb.diff",
            "exists": true,
            "files": [
                {
                    "file_additions": 87,
                    "file_deletions": 32,
                    "file_exists": true,
                    "file_name": "hid-xpadneo/src/hid-xpadneo.c",
                    "file_size": 41306
                }
            ],
            "interesting": {
                "reopen": false,
                "status": false
            },
            "is_parent": false,
            "sha": "45df9fc748a42e678470b644947a32417dcdf1cb"
        },
        {
            "associated_pull_request": [],
            "date": "2021-03-27 23:37:13+00:00",
            "diff": "atar-axis_xpadneo/issue_273/commit_f2fda05a46f2fd2511454a64a3e3493f52c3b8f2.diff",
            "diff_additions": 87,
            "diff_deletions": 32,
            "diff_file_size": 41306,
            "diff_url": "https://github.com/atar-axis/xpadneo/commit/f2fda05a46f2fd2511454a64a3e3493f52c3b8f2.diff",
            "exists": true,
            "files": [
                {
                    "file_additions": 87,
                    "file_deletions": 32,
                    "file_exists": true,
                    "file_name": "hid-xpadneo/src/hid-xpadneo.c",
                    "file_size": 41306
                }
            ],
            "interesting": {
                "reopen": false,
                "status": false
            },
            "is_parent": false,
            "sha": "f2fda05a46f2fd2511454a64a3e3493f52c3b8f2"
        },
        {
            "associated_pull_request": [],
            "date": "2021-03-27 23:37:13+00:00",
            "diff": "atar-axis_xpadneo/issue_273/commit_2dc927cd8969e3a307c924191045e770dd6ddba1.diff",
            "diff_additions": 88,
            "diff_deletions": 32,
            "diff_file_size": 41306,
            "diff_url": "https://github.com/atar-axis/xpadneo/commit/2dc927cd8969e3a307c924191045e770dd6ddba1.diff",
            "exists": true,
            "files": [
                {
                    "file_additions": 88,
                    "file_deletions": 32,
                    "file_exists": true,
                    "file_name": "hid-xpadneo/src/hid-xpadneo.c",
                    "file_size": 41306
                }
            ],
            "interesting": {
                "reopen": false,
                "status": false
            },
            "is_parent": false,
            "sha": "2dc927cd8969e3a307c924191045e770dd6ddba1"
        },
        {
            "associated_pull_request": [],
            "date": "2021-03-27 23:37:13+00:00",
            "diff": "atar-axis_xpadneo/issue_273/commit_902f3a18dc098f09e58dd421bd0f4d644be5bdd1.diff",
            "diff_additions": 88,
            "diff_deletions": 33,
            "diff_file_size": 41306,
            "diff_url": "https://github.com/atar-axis/xpadneo/commit/902f3a18dc098f09e58dd421bd0f4d644be5bdd1.diff",
            "exists": true,
            "files": [
                {
                    "file_additions": 88,
                    "file_deletions": 33,
                    "file_exists": true,
                    "file_name": "hid-xpadneo/src/hid-xpadneo.c",
                    "file_size": 41306
                }
            ],
            "interesting": {
                "reopen": false,
                "status": false
            },
            "is_parent": false,
            "sha": "902f3a18dc098f09e58dd421bd0f4d644be5bdd1"
        },
        {
            "associated_pull_request": [],
            "date": "2021-03-27 23:37:13+00:00",
            "diff": "atar-axis_xpadneo/issue_273/commit_0990923215211968b87fedc9824d9a534640573a.diff",
            "diff_additions": 89,
            "diff_deletions": 33,
            "diff_file_size": 41306,
            "diff_url": "https://github.com/atar-axis/xpadneo/commit/0990923215211968b87fedc9824d9a534640573a.diff",
            "exists": true,
            "files": [
                {
                    "file_additions": 89,
                    "file_deletions": 33,
                    "file_exists": true,
                    "file_name": "hid-xpadneo/src/hid-xpadneo.c",
                    "file_size": 41306
                }
            ],
            "interesting": {
                "reopen": false,
                "status": false
            },
            "is_parent": false,
            "sha": "0990923215211968b87fedc9824d9a534640573a"
        },
        {
            "associated_pull_request": [],
            "date": "2021-03-27 23:37:13+00:00",
            "diff": "atar-axis_xpadneo/issue_273/commit_a087b163a051aae7303510ef2d0f8642f76f99c8.diff",
            "diff_additions": 89,
            "diff_deletions": 33,
            "diff_file_size": 41306,
            "diff_url": "https://github.com/atar-axis/xpadneo/commit/a087b163a051aae7303510ef2d0f8642f76f99c8.diff",
            "exists": true,
            "files": [
                {
                    "file_additions": 89,
                    "file_deletions": 33,
                    "file_exists": true,
                    "file_name": "hid-xpadneo/src/hid-xpadneo.c",
                    "file_size": 41306
                }
            ],
            "interesting": {
                "reopen": false,
                "status": false
            },
            "is_parent": false,
            "sha": "a087b163a051aae7303510ef2d0f8642f76f99c8"
        },
        {
            "associated_pull_request": [],
            "date": "2021-03-27 23:37:13+00:00",
            "diff": "atar-axis_xpadneo/issue_273/commit_52f4625ef8737a612a7dce938f3930bfa6c828bf.diff",
            "diff_additions": 66,
            "diff_deletions": 21,
            "diff_file_size": 41306,
            "diff_url": "https://github.com/atar-axis/xpadneo/commit/52f4625ef8737a612a7dce938f3930bfa6c828bf.diff",
            "exists": true,
            "files": [
                {
                    "file_additions": 66,
                    "file_deletions": 21,
                    "file_exists": true,
                    "file_name": "hid-xpadneo/src/hid-xpadneo.c",
                    "file_size": 41306
                }
            ],
            "interesting": {
                "reopen": false,
                "status": false
            },
            "is_parent": false,
            "sha": "52f4625ef8737a612a7dce938f3930bfa6c828bf"
        },
        {
            "associated_pull_request": [],
            "date": "2021-03-27 23:37:13+00:00",
            "diff": "atar-axis_xpadneo/issue_273/commit_ed5cf29981005a480dac4fb9b49c1330390facf0.diff",
            "diff_additions": 66,
            "diff_deletions": 21,
            "diff_file_size": 41306,
            "diff_url": "https://github.com/atar-axis/xpadneo/commit/ed5cf29981005a480dac4fb9b49c1330390facf0.diff",
            "exists": true,
            "files": [
                {
                    "file_additions": 66,
                    "file_deletions": 21,
                    "file_exists": true,
                    "file_name": "hid-xpadneo/src/hid-xpadneo.c",
                    "file_size": 41306
                }
            ],
            "interesting": {
                "reopen": false,
                "status": false
            },
            "is_parent": false,
            "sha": "ed5cf29981005a480dac4fb9b49c1330390facf0"
        },
        {
            "associated_pull_request": [],
            "date": "2021-03-27 23:37:13+00:00",
            "diff": "atar-axis_xpadneo/issue_273/commit_257f24bbac5c8257793d7f46c3371cb43738398c.diff",
            "diff_additions": 64,
            "diff_deletions": 19,
            "diff_file_size": 41306,
            "diff_url": "https://github.com/atar-axis/xpadneo/commit/257f24bbac5c8257793d7f46c3371cb43738398c.diff",
            "exists": true,
            "files": [
                {
                    "file_additions": 64,
                    "file_deletions": 19,
                    "file_exists": true,
                    "file_name": "hid-xpadneo/src/hid-xpadneo.c",
                    "file_size": 41306
                }
            ],
            "interesting": {
                "reopen": false,
                "status": false
            },
            "is_parent": false,
            "sha": "257f24bbac5c8257793d7f46c3371cb43738398c"
        }
    ],
    "first_commit": "2021-03-27 23:21:44+00:00",
    "last_commit": "2022-09-17 20:27:21+00:00",
    "number": 273,
    "pull_request": "None",
    "score": {
        "accidental_reopen_likely": true,
        "all_labels": [
            "0 | type: bug",
            "1 | state: waiting for reporter feedback"
        ],
        "contains_keywords": [
            "work",
            "chang",
            "fix",
            "issu",
            "CI",
            "patch",
            "reason",
            "test",
            "fault",
            "problem",
            "report"
        ],
        "fix_size": 385,
        "has_labels": [],
        "intersecting": {
            "computed_score": 1.0,
            "final_commit_size": 84,
            "intersection_size": 84,
            "previous_commits_size": 385
        },
        "is_makefile_based": false,
        "no_new_files": [],
        "no_other_files": true,
        "num_prohibited_files": 766944,
        "prohibited_files": [
            "server/src/main/java/com/genymobile/scrcpy/Device.java",
            "server/src/main/java/com/genymobile/scrcpy/wrappers/SurfaceControl.java",
            "server/src/main/java/com/genymobile/scrcpy/Device.java",
            "server/src/main/java/com/genymobile/scrcpy/wrappers/SurfaceControl.java",
            "app/meson.build",
            "app/scrcpy.1",
            "app/src/common.h",
            "app/src/scrcpy.h",
            "app/src/server.h",
            "server/src/main/java/com/genymobile/scrcpy/Workarounds.java"
        ],
        "reopen": true,
        "reopen_events": [
            [
                "2021-03-27 23:37:30+00:00",
                "commit"
            ],
            [
                "2021-03-28 09:57:35+00:00",
                "commit"
            ],
            [
                "2021-03-28 20:45:23+00:00",
                "commit"
            ],
            [
                "2021-04-01 12:53:34+00:00",
                "closed"
            ],
            [
                "2021-04-01 13:17:27+00:00",
                "reopened"
            ],
            [
                "2021-04-01 13:20:57+00:00",
                "closed"
            ],
            [
                "2021-04-03 11:54:13+00:00",
                "commit"
            ],
            [
                "2021-06-23 02:30:46+00:00",
                "commit"
            ],
            [
                "2021-06-23 02:52:33+00:00",
                "commit"
            ],
            [
                "2021-06-25 21:28:54+00:00",
                "commit"
            ],
            [
                "2021-07-06 21:17:34+00:00",
                "commit"
            ],
            [
                "2021-08-28 21:38:15+00:00",
                "commit"
            ],
            [
                "2022-03-06 20:25:07+00:00",
                "commit"
            ],
            [
                "2022-03-06 20:30:43+00:00",
                "commit"
            ],
            [
                "2022-04-30 11:39:47+00:00",
                "commit"
            ],
            [
                "2022-05-26 04:49:06+00:00",
                "commit"
            ],
            [
                "2022-05-30 02:38:06+00:00",
                "commit"
            ],
            [
                "2022-05-30 22:30:03+00:00",
                "commit"
            ],
            [
                "2022-09-17 20:28:53+00:00",
                "commit"
            ]
        ],
        "status": false,
        "strategy": true,
        "total_changes": 1703
    }
}