{
    "covered_issues": [
        261,
        259,
        258,
        257,
        254,
        253,
        252,
        247,
        246,
        243,
        242,
        241,
        240,
        239,
        231,
        230,
        229,
        228,
        227,
        224,
        222,
        221,
        220,
        218,
        213,
        212,
        210,
        209,
        208,
        206,
        205,
        199,
        196,
        195,
        193,
        192,
        191,
        190,
        189,
        187,
        186,
        185,
        182,
        180,
        177,
        176,
        175,
        174,
        172,
        171,
        170,
        168,
        166,
        165,
        160,
        159,
        155,
        154,
        152,
        151,
        136,
        134,
        133,
        132,
        130,
        128,
        127,
        123,
        121,
        120,
        119,
        118,
        117,
        116,
        115,
        113,
        112,
        111,
        110,
        109,
        105,
        103,
        101,
        97,
        93,
        92,
        91,
        90,
        88,
        87,
        85,
        82,
        80,
        79,
        75,
        74,
        70,
        69,
        68,
        67,
        65,
        64,
        62,
        59,
        58,
        57,
        56,
        55,
        46,
        41,
        40,
        38,
        37,
        36,
        35,
        33,
        31,
        28,
        24,
        23,
        22,
        18,
        17,
        16,
        14,
        13,
        12,
        8,
        7,
        5
    ],
    "finished": true
}