{
    "category": [
        "network/protocols",
        "build/refactor/preprocessing",
        "feature request"
    ],
    "commits": [
        {
            "associated_pull_request": [
                "https://github.com/appneta/tcpreplay/pull/448"
            ],
            "date": "2018-01-22 16:28:50",
            "diff": "appneta_tcpreplay/issue_406/commit_e8d05fb34c180c1429edaf809befcd4e474d292b.diff",
            "diff_additions": 31,
            "diff_deletions": 5,
            "diff_file_size": 118278,
            "diff_url": "https://github.com/appneta/tcpreplay/commit/e8d05fb34c180c1429edaf809befcd4e474d292b.diff",
            "exists": true,
            "files": [
                {
                    "file_additions": 22,
                    "file_deletions": 0,
                    "file_exists": true,
                    "file_name": "src/common/utils.c",
                    "file_size": 12085
                },
                {
                    "file_additions": 1,
                    "file_deletions": 0,
                    "file_exists": true,
                    "file_name": "src/tcpbridge.c",
                    "file_size": 7542
                },
                {
                    "file_additions": 2,
                    "file_deletions": 4,
                    "file_exists": true,
                    "file_name": "src/tcpcapinfo.c",
                    "file_size": 12593
                },
                {
                    "file_additions": 1,
                    "file_deletions": 0,
                    "file_exists": true,
                    "file_name": "src/tcpliveplay.c",
                    "file_size": 47467
                },
                {
                    "file_additions": 2,
                    "file_deletions": 1,
                    "file_exists": true,
                    "file_name": "src/tcpprep.c",
                    "file_size": 20901
                },
                {
                    "file_additions": 1,
                    "file_deletions": 0,
                    "file_exists": true,
                    "file_name": "src/tcpreplay.c",
                    "file_size": 7037
                },
                {
                    "file_additions": 2,
                    "file_deletions": 0,
                    "file_exists": true,
                    "file_name": "src/tcprewrite.c",
                    "file_size": 10653
                }
            ],
            "interesting": {
                "reopen": false,
                "status": false
            },
            "is_parent": true,
            "sha": "e8d05fb34c180c1429edaf809befcd4e474d292b"
        },
        {
            "associated_pull_request": [
                "https://github.com/appneta/tcpreplay/pull/452"
            ],
            "date": "2018-01-22 17:19:43",
            "diff": "appneta_tcpreplay/issue_406/commit_3d87e2d5dafd0cfbed76b54ef2073a1eed6df46e.diff",
            "diff_additions": 26,
            "diff_deletions": 1,
            "diff_file_size": 55263,
            "diff_url": "https://github.com/appneta/tcpreplay/commit/3d87e2d5dafd0cfbed76b54ef2073a1eed6df46e.diff",
            "exists": true,
            "files": [
                {
                    "file_additions": 16,
                    "file_deletions": 1,
                    "file_exists": true,
                    "file_name": "src/tcpedit/edit_packet.c",
                    "file_size": 34945
                },
                {
                    "file_additions": 10,
                    "file_deletions": 0,
                    "file_exists": true,
                    "file_name": "src/tcpedit/tcpedit.c",
                    "file_size": 20318
                }
            ],
            "interesting": {
                "reopen": true,
                "status": false
            },
            "is_parent": false,
            "sha": "3d87e2d5dafd0cfbed76b54ef2073a1eed6df46e"
        },
        {
            "associated_pull_request": [],
            "date": "2018-10-19 18:19:48",
            "diff": "appneta_tcpreplay/issue_406/commit_a2cd56ad4548d27ae09c71a2ff8c27ddb902b710.diff",
            "diff_additions": 473,
            "diff_deletions": 260,
            "diff_file_size": 675894,
            "diff_url": "https://github.com/appneta/tcpreplay/commit/a2cd56ad4548d27ae09c71a2ff8c27ddb902b710.diff",
            "exists": true,
            "files": [
                {
                    "file_additions": 17,
                    "file_deletions": 6,
                    "file_exists": true,
                    "file_name": "libopts/nested.c",
                    "file_size": 24981
                },
                {
                    "file_additions": 0,
                    "file_deletions": 1,
                    "file_exists": true,
                    "file_name": "src/common/cache.c",
                    "file_size": 11271
                },
                {
                    "file_additions": 1,
                    "file_deletions": 1,
                    "file_exists": true,
                    "file_name": "src/common/cidr.c",
                    "file_size": 16736
                },
                {
                    "file_additions": 9,
                    "file_deletions": 15,
                    "file_exists": true,
                    "file_name": "src/common/get.c",
                    "file_size": 22858
                },
                {
                    "file_additions": 6,
                    "file_deletions": 9,
                    "file_exists": true,
                    "file_name": "src/common/interface.c",
                    "file_size": 8843
                },
                {
                    "file_additions": 10,
                    "file_deletions": 17,
                    "file_exists": true,
                    "file_name": "src/common/list.c",
                    "file_size": 4675
                },
                {
                    "file_additions": 0,
                    "file_deletions": 1,
                    "file_exists": true,
                    "file_name": "src/common/sendpacket.c",
                    "file_size": 39575
                },
                {
                    "file_additions": 0,
                    "file_deletions": 5,
                    "file_exists": true,
                    "file_name": "src/common/services.c",
                    "file_size": 3349
                },
                {
                    "file_additions": 141,
                    "file_deletions": 91,
                    "file_exists": true,
                    "file_name": "src/common/tcpdump.c",
                    "file_size": 12436
                },
                {
                    "file_additions": 73,
                    "file_deletions": 1,
                    "file_exists": true,
                    "file_name": "src/common/utils.c",
                    "file_size": 12085
                },
                {
                    "file_additions": 1,
                    "file_deletions": 1,
                    "file_exists": true,
                    "file_name": "src/fragroute/bget.c",
                    "file_size": 54959
                },
                {
                    "file_additions": 0,
                    "file_deletions": 1,
                    "file_exists": true,
                    "file_name": "src/fragroute/fragroute.c",
                    "file_size": 3412
                },
                {
                    "file_additions": 2,
                    "file_deletions": 2,
                    "file_exists": true,
                    "file_name": "src/fragroute/mod_ip6_opt.c",
                    "file_size": 4838
                },
                {
                    "file_additions": 2,
                    "file_deletions": 2,
                    "file_exists": true,
                    "file_name": "src/fragroute/mod_ip6_qos.c",
                    "file_size": 1779
                },
                {
                    "file_additions": 1,
                    "file_deletions": 9,
                    "file_exists": true,
                    "file_name": "src/replay.c",
                    "file_size": 12036
                },
                {
                    "file_additions": 3,
                    "file_deletions": 3,
                    "file_exists": true,
                    "file_name": "src/send_packets.c",
                    "file_size": 41977
                },
                {
                    "file_additions": 1,
                    "file_deletions": 0,
                    "file_exists": true,
                    "file_name": "src/tcpbridge.c",
                    "file_size": 7542
                },
                {
                    "file_additions": 2,
                    "file_deletions": 4,
                    "file_exists": true,
                    "file_name": "src/tcpcapinfo.c",
                    "file_size": 12593
                },
                {
                    "file_additions": 21,
                    "file_deletions": 8,
                    "file_exists": true,
                    "file_name": "src/tcpedit/edit_packet.c",
                    "file_size": 34945
                },
                {
                    "file_additions": 36,
                    "file_deletions": 4,
                    "file_exists": true,
                    "file_name": "src/tcpedit/plugins/dlt_en10mb/en10mb.c",
                    "file_size": 27192
                },
                {
                    "file_additions": 30,
                    "file_deletions": 8,
                    "file_exists": true,
                    "file_name": "src/tcpedit/plugins/dlt_hdlc/hdlc.c",
                    "file_size": 11486
                },
                {
                    "file_additions": 7,
                    "file_deletions": 5,
                    "file_exists": true,
                    "file_name": "src/tcpedit/plugins/dlt_ieee80211/ieee80211.c",
                    "file_size": 12842
                },
                {
                    "file_additions": 2,
                    "file_deletions": 4,
                    "file_exists": true,
                    "file_name": "src/tcpedit/plugins/dlt_ieee80211/ieee80211_hdr.c",
                    "file_size": 5803
                },
                {
                    "file_additions": 4,
                    "file_deletions": 2,
                    "file_exists": true,
                    "file_name": "src/tcpedit/plugins/dlt_jnpr_ether/jnpr_ether.c",
                    "file_size": 13786
                },
                {
                    "file_additions": 7,
                    "file_deletions": 6,
                    "file_exists": true,
                    "file_name": "src/tcpedit/plugins/dlt_linuxsll/linuxsll.c",
                    "file_size": 9419
                },
                {
                    "file_additions": 2,
                    "file_deletions": 0,
                    "file_exists": true,
                    "file_name": "src/tcpedit/plugins/dlt_null/null.c",
                    "file_size": 9272
                },
                {
                    "file_additions": 1,
                    "file_deletions": 1,
                    "file_exists": true,
                    "file_name": "src/tcpedit/plugins/dlt_plugins.c",
                    "file_size": 13047
                },
                {
                    "file_additions": 2,
                    "file_deletions": 0,
                    "file_exists": true,
                    "file_name": "src/tcpedit/plugins/dlt_pppserial/pppserial.c",
                    "file_size": 11058
                },
                {
                    "file_additions": 19,
                    "file_deletions": 8,
                    "file_exists": true,
                    "file_name": "src/tcpedit/plugins/dlt_radiotap/radiotap.c",
                    "file_size": 11682
                },
                {
                    "file_additions": 7,
                    "file_deletions": 5,
                    "file_exists": true,
                    "file_name": "src/tcpedit/plugins/dlt_raw/raw.c",
                    "file_size": 8418
                },
                {
                    "file_additions": 25,
                    "file_deletions": 6,
                    "file_exists": true,
                    "file_name": "src/tcpedit/plugins/dlt_user/user.c",
                    "file_size": 11414
                },
                {
                    "file_additions": 1,
                    "file_deletions": 0,
                    "file_exists": true,
                    "file_name": "src/tcpedit/plugins/dlt_utils.c",
                    "file_size": 7623
                },
                {
                    "file_additions": 4,
                    "file_deletions": 10,
                    "file_exists": true,
                    "file_name": "src/tcpedit/portmap.c",
                    "file_size": 11755
                },
                {
                    "file_additions": 10,
                    "file_deletions": 0,
                    "file_exists": true,
                    "file_name": "src/tcpedit/tcpedit.c",
                    "file_size": 20318
                },
                {
                    "file_additions": 11,
                    "file_deletions": 12,
                    "file_exists": true,
                    "file_name": "src/tcpliveplay.c",
                    "file_size": 47467
                },
                {
                    "file_additions": 5,
                    "file_deletions": 5,
                    "file_exists": true,
                    "file_name": "src/tcpprep.c",
                    "file_size": 20901
                },
                {
                    "file_additions": 1,
                    "file_deletions": 1,
                    "file_exists": true,
                    "file_name": "src/tcpprep_api.c",
                    "file_size": 10417
                },
                {
                    "file_additions": 3,
                    "file_deletions": 1,
                    "file_exists": true,
                    "file_name": "src/tcpreplay.c",
                    "file_size": 7037
                },
                {
                    "file_additions": 1,
                    "file_deletions": 1,
                    "file_exists": true,
                    "file_name": "src/tcpreplay_api.c",
                    "file_size": 35703
                },
                {
                    "file_additions": 3,
                    "file_deletions": 1,
                    "file_exists": true,
                    "file_name": "src/tcprewrite.c",
                    "file_size": 10653
                },
                {
                    "file_additions": 2,
                    "file_deletions": 3,
                    "file_exists": true,
                    "file_name": "src/tree.c",
                    "file_size": 27711
                }
            ],
            "interesting": {
                "reopen": false,
                "status": false
            },
            "is_parent": false,
            "sha": "a2cd56ad4548d27ae09c71a2ff8c27ddb902b710"
        },
        {
            "associated_pull_request": [
                "https://github.com/appneta/tcpreplay/pull/501"
            ],
            "date": "2018-10-20 23:54:10",
            "diff": "appneta_tcpreplay/issue_406/commit_da80010ca05486d061235c12ca5993f1b6754300.diff",
            "diff_additions": 2,
            "diff_deletions": 2,
            "diff_file_size": 34945,
            "diff_url": "https://github.com/appneta/tcpreplay/commit/da80010ca05486d061235c12ca5993f1b6754300.diff",
            "exists": true,
            "files": [
                {
                    "file_additions": 2,
                    "file_deletions": 2,
                    "file_exists": true,
                    "file_name": "src/tcpedit/edit_packet.c",
                    "file_size": 34945
                }
            ],
            "interesting": {
                "reopen": false,
                "status": false
            },
            "is_parent": false,
            "sha": "da80010ca05486d061235c12ca5993f1b6754300"
        },
        {
            "associated_pull_request": [
                "https://github.com/appneta/tcpreplay/pull/501"
            ],
            "date": "2018-10-21 00:46:28",
            "diff": "appneta_tcpreplay/issue_406/commit_55ccd7aff02d04cef4e91333faa46f43b7c0a135.diff",
            "diff_additions": 2,
            "diff_deletions": 2,
            "diff_file_size": 34945,
            "diff_url": "https://github.com/appneta/tcpreplay/commit/55ccd7aff02d04cef4e91333faa46f43b7c0a135.diff",
            "exists": true,
            "files": [
                {
                    "file_additions": 2,
                    "file_deletions": 2,
                    "file_exists": true,
                    "file_name": "src/tcpedit/edit_packet.c",
                    "file_size": 34945
                }
            ],
            "interesting": {
                "reopen": false,
                "status": false
            },
            "is_parent": false,
            "sha": "55ccd7aff02d04cef4e91333faa46f43b7c0a135"
        },
        {
            "associated_pull_request": [],
            "date": "2018-10-22 23:38:08",
            "diff": "appneta_tcpreplay/issue_406/commit_5a150500289993da2e56cbf140d444b848139bc1.diff",
            "diff_additions": 361,
            "diff_deletions": 267,
            "diff_file_size": 608685,
            "diff_url": "https://github.com/appneta/tcpreplay/commit/5a150500289993da2e56cbf140d444b848139bc1.diff",
            "exists": true,
            "files": [
                {
                    "file_additions": 2,
                    "file_deletions": 1,
                    "file_exists": true,
                    "file_name": "src/bridge.c",
                    "file_size": 12860
                },
                {
                    "file_additions": 1,
                    "file_deletions": 1,
                    "file_exists": true,
                    "file_name": "src/common/cidr.c",
                    "file_size": 16736
                },
                {
                    "file_additions": 4,
                    "file_deletions": 4,
                    "file_exists": true,
                    "file_name": "src/common/flows.c",
                    "file_size": 10439
                },
                {
                    "file_additions": 1,
                    "file_deletions": 1,
                    "file_exists": true,
                    "file_name": "src/common/get.c",
                    "file_size": 22858
                },
                {
                    "file_additions": 6,
                    "file_deletions": 9,
                    "file_exists": true,
                    "file_name": "src/common/interface.c",
                    "file_size": 8843
                },
                {
                    "file_additions": 1,
                    "file_deletions": 3,
                    "file_exists": true,
                    "file_name": "src/common/list.c",
                    "file_size": 4675
                },
                {
                    "file_additions": 0,
                    "file_deletions": 1,
                    "file_exists": true,
                    "file_name": "src/common/sendpacket.c",
                    "file_size": 39575
                },
                {
                    "file_additions": 0,
                    "file_deletions": 5,
                    "file_exists": true,
                    "file_name": "src/common/services.c",
                    "file_size": 3349
                },
                {
                    "file_additions": 53,
                    "file_deletions": 1,
                    "file_exists": true,
                    "file_name": "src/common/utils.c",
                    "file_size": 12085
                },
                {
                    "file_additions": 1,
                    "file_deletions": 1,
                    "file_exists": true,
                    "file_name": "src/fragroute/bget.c",
                    "file_size": 54959
                },
                {
                    "file_additions": 0,
                    "file_deletions": 1,
                    "file_exists": true,
                    "file_name": "src/fragroute/fragroute.c",
                    "file_size": 3412
                },
                {
                    "file_additions": 2,
                    "file_deletions": 2,
                    "file_exists": true,
                    "file_name": "src/fragroute/mod_ip6_opt.c",
                    "file_size": 4838
                },
                {
                    "file_additions": 2,
                    "file_deletions": 2,
                    "file_exists": true,
                    "file_name": "src/fragroute/mod_ip6_qos.c",
                    "file_size": 1779
                },
                {
                    "file_additions": 50,
                    "file_deletions": 54,
                    "file_exists": true,
                    "file_name": "src/send_packets.c",
                    "file_size": 41977
                },
                {
                    "file_additions": 4,
                    "file_deletions": 2,
                    "file_exists": true,
                    "file_name": "src/tcpbridge.c",
                    "file_size": 7542
                },
                {
                    "file_additions": 74,
                    "file_deletions": 38,
                    "file_exists": true,
                    "file_name": "src/tcpedit/edit_packet.c",
                    "file_size": 34945
                },
                {
                    "file_additions": 3,
                    "file_deletions": 3,
                    "file_exists": true,
                    "file_name": "src/tcpedit/fuzzing.c",
                    "file_size": 8122
                },
                {
                    "file_additions": 26,
                    "file_deletions": 16,
                    "file_exists": true,
                    "file_name": "src/tcpedit/plugins/dlt_en10mb/en10mb.c",
                    "file_size": 27192
                },
                {
                    "file_additions": 3,
                    "file_deletions": 7,
                    "file_exists": true,
                    "file_name": "src/tcpedit/plugins/dlt_hdlc/hdlc.c",
                    "file_size": 11486
                },
                {
                    "file_additions": 4,
                    "file_deletions": 7,
                    "file_exists": true,
                    "file_name": "src/tcpedit/plugins/dlt_ieee80211/ieee80211.c",
                    "file_size": 12842
                },
                {
                    "file_additions": 2,
                    "file_deletions": 4,
                    "file_exists": true,
                    "file_name": "src/tcpedit/plugins/dlt_ieee80211/ieee80211_hdr.c",
                    "file_size": 5803
                },
                {
                    "file_additions": 9,
                    "file_deletions": 7,
                    "file_exists": true,
                    "file_name": "src/tcpedit/plugins/dlt_jnpr_ether/jnpr_ether.c",
                    "file_size": 13786
                },
                {
                    "file_additions": 3,
                    "file_deletions": 5,
                    "file_exists": true,
                    "file_name": "src/tcpedit/plugins/dlt_linuxsll/linuxsll.c",
                    "file_size": 9419
                },
                {
                    "file_additions": 26,
                    "file_deletions": 3,
                    "file_exists": true,
                    "file_name": "src/tcpedit/plugins/dlt_plugins.c",
                    "file_size": 13047
                },
                {
                    "file_additions": 3,
                    "file_deletions": 5,
                    "file_exists": true,
                    "file_name": "src/tcpedit/plugins/dlt_pppserial/pppserial.c",
                    "file_size": 11058
                },
                {
                    "file_additions": 10,
                    "file_deletions": 3,
                    "file_exists": true,
                    "file_name": "src/tcpedit/plugins/dlt_radiotap/radiotap.c",
                    "file_size": 11682
                },
                {
                    "file_additions": 2,
                    "file_deletions": 3,
                    "file_exists": true,
                    "file_name": "src/tcpedit/plugins/dlt_user/user.c",
                    "file_size": 11414
                },
                {
                    "file_additions": 6,
                    "file_deletions": 4,
                    "file_exists": true,
                    "file_name": "src/tcpedit/portmap.c",
                    "file_size": 11755
                },
                {
                    "file_additions": 45,
                    "file_deletions": 46,
                    "file_exists": true,
                    "file_name": "src/tcpedit/tcpedit.c",
                    "file_size": 20318
                },
                {
                    "file_additions": 10,
                    "file_deletions": 11,
                    "file_exists": true,
                    "file_name": "src/tcpliveplay.c",
                    "file_size": 47467
                },
                {
                    "file_additions": 1,
                    "file_deletions": 1,
                    "file_exists": true,
                    "file_name": "src/tcpprep.c",
                    "file_size": 20901
                },
                {
                    "file_additions": 1,
                    "file_deletions": 1,
                    "file_exists": true,
                    "file_name": "src/tcpprep_api.c",
                    "file_size": 10417
                },
                {
                    "file_additions": 2,
                    "file_deletions": 1,
                    "file_exists": true,
                    "file_name": "src/tcpreplay.c",
                    "file_size": 7037
                },
                {
                    "file_additions": 1,
                    "file_deletions": 10,
                    "file_exists": true,
                    "file_name": "src/tcpreplay_api.c",
                    "file_size": 35703
                },
                {
                    "file_additions": 1,
                    "file_deletions": 1,
                    "file_exists": true,
                    "file_name": "src/tcprewrite.c",
                    "file_size": 10653
                },
                {
                    "file_additions": 2,
                    "file_deletions": 3,
                    "file_exists": true,
                    "file_name": "src/tree.c",
                    "file_size": 27711
                }
            ],
            "interesting": {
                "reopen": false,
                "status": false
            },
            "is_parent": false,
            "sha": "5a150500289993da2e56cbf140d444b848139bc1"
        },
        {
            "associated_pull_request": [
                "https://github.com/appneta/tcpreplay/pull/449"
            ],
            "date": "2018-10-23 17:35:15",
            "diff": "appneta_tcpreplay/issue_406/commit_e143d00903d87e0830a1ceb4b72c70420e9afa1a.diff",
            "diff_additions": 806,
            "diff_deletions": 509,
            "diff_file_size": 707315,
            "diff_url": "https://github.com/appneta/tcpreplay/commit/e143d00903d87e0830a1ceb4b72c70420e9afa1a.diff",
            "exists": true,
            "files": [
                {
                    "file_additions": 17,
                    "file_deletions": 6,
                    "file_exists": true,
                    "file_name": "libopts/nested.c",
                    "file_size": 24981
                },
                {
                    "file_additions": 2,
                    "file_deletions": 1,
                    "file_exists": true,
                    "file_name": "src/bridge.c",
                    "file_size": 12860
                },
                {
                    "file_additions": 1,
                    "file_deletions": 1,
                    "file_exists": true,
                    "file_name": "src/common/cache.c",
                    "file_size": 11271
                },
                {
                    "file_additions": 3,
                    "file_deletions": 3,
                    "file_exists": true,
                    "file_name": "src/common/cidr.c",
                    "file_size": 16736
                },
                {
                    "file_additions": 5,
                    "file_deletions": 5,
                    "file_exists": true,
                    "file_name": "src/common/flows.c",
                    "file_size": 10439
                },
                {
                    "file_additions": 25,
                    "file_deletions": 29,
                    "file_exists": true,
                    "file_name": "src/common/get.c",
                    "file_size": 22858
                },
                {
                    "file_additions": 6,
                    "file_deletions": 9,
                    "file_exists": true,
                    "file_name": "src/common/interface.c",
                    "file_size": 8843
                },
                {
                    "file_additions": 10,
                    "file_deletions": 17,
                    "file_exists": true,
                    "file_name": "src/common/list.c",
                    "file_size": 4675
                },
                {
                    "file_additions": 4,
                    "file_deletions": 5,
                    "file_exists": true,
                    "file_name": "src/common/sendpacket.c",
                    "file_size": 39575
                },
                {
                    "file_additions": 0,
                    "file_deletions": 5,
                    "file_exists": true,
                    "file_name": "src/common/services.c",
                    "file_size": 3349
                },
                {
                    "file_additions": 141,
                    "file_deletions": 91,
                    "file_exists": true,
                    "file_name": "src/common/tcpdump.c",
                    "file_size": 12436
                },
                {
                    "file_additions": 73,
                    "file_deletions": 1,
                    "file_exists": true,
                    "file_name": "src/common/utils.c",
                    "file_size": 12085
                },
                {
                    "file_additions": 1,
                    "file_deletions": 1,
                    "file_exists": true,
                    "file_name": "src/fragroute/bget.c",
                    "file_size": 54959
                },
                {
                    "file_additions": 0,
                    "file_deletions": 1,
                    "file_exists": true,
                    "file_name": "src/fragroute/fragroute.c",
                    "file_size": 3412
                },
                {
                    "file_additions": 2,
                    "file_deletions": 2,
                    "file_exists": true,
                    "file_name": "src/fragroute/mod_ip6_opt.c",
                    "file_size": 4838
                },
                {
                    "file_additions": 2,
                    "file_deletions": 2,
                    "file_exists": true,
                    "file_name": "src/fragroute/mod_ip6_qos.c",
                    "file_size": 1779
                },
                {
                    "file_additions": 1,
                    "file_deletions": 9,
                    "file_exists": true,
                    "file_name": "src/replay.c",
                    "file_size": 12036
                },
                {
                    "file_additions": 47,
                    "file_deletions": 42,
                    "file_exists": true,
                    "file_name": "src/send_packets.c",
                    "file_size": 41977
                },
                {
                    "file_additions": 5,
                    "file_deletions": 2,
                    "file_exists": true,
                    "file_name": "src/tcpbridge.c",
                    "file_size": 7542
                },
                {
                    "file_additions": 3,
                    "file_deletions": 5,
                    "file_exists": true,
                    "file_name": "src/tcpcapinfo.c",
                    "file_size": 12593
                },
                {
                    "file_additions": 91,
                    "file_deletions": 40,
                    "file_exists": true,
                    "file_name": "src/tcpedit/edit_packet.c",
                    "file_size": 34945
                },
                {
                    "file_additions": 5,
                    "file_deletions": 5,
                    "file_exists": true,
                    "file_name": "src/tcpedit/fuzzing.c",
                    "file_size": 8122
                },
                {
                    "file_additions": 49,
                    "file_deletions": 19,
                    "file_exists": true,
                    "file_name": "src/tcpedit/plugins/dlt_en10mb/en10mb.c",
                    "file_size": 27192
                },
                {
                    "file_additions": 33,
                    "file_deletions": 15,
                    "file_exists": true,
                    "file_name": "src/tcpedit/plugins/dlt_hdlc/hdlc.c",
                    "file_size": 11486
                },
                {
                    "file_additions": 13,
                    "file_deletions": 13,
                    "file_exists": true,
                    "file_name": "src/tcpedit/plugins/dlt_ieee80211/ieee80211.c",
                    "file_size": 12842
                },
                {
                    "file_additions": 2,
                    "file_deletions": 4,
                    "file_exists": true,
                    "file_name": "src/tcpedit/plugins/dlt_ieee80211/ieee80211_hdr.c",
                    "file_size": 5803
                },
                {
                    "file_additions": 13,
                    "file_deletions": 9,
                    "file_exists": true,
                    "file_name": "src/tcpedit/plugins/dlt_jnpr_ether/jnpr_ether.c",
                    "file_size": 13786
                },
                {
                    "file_additions": 12,
                    "file_deletions": 12,
                    "file_exists": true,
                    "file_name": "src/tcpedit/plugins/dlt_linuxsll/linuxsll.c",
                    "file_size": 9419
                },
                {
                    "file_additions": 6,
                    "file_deletions": 2,
                    "file_exists": true,
                    "file_name": "src/tcpedit/plugins/dlt_null/null.c",
                    "file_size": 9272
                },
                {
                    "file_additions": 27,
                    "file_deletions": 4,
                    "file_exists": true,
                    "file_name": "src/tcpedit/plugins/dlt_plugins.c",
                    "file_size": 13047
                },
                {
                    "file_additions": 7,
                    "file_deletions": 6,
                    "file_exists": true,
                    "file_name": "src/tcpedit/plugins/dlt_pppserial/pppserial.c",
                    "file_size": 11058
                },
                {
                    "file_additions": 34,
                    "file_deletions": 13,
                    "file_exists": true,
                    "file_name": "src/tcpedit/plugins/dlt_radiotap/radiotap.c",
                    "file_size": 11682
                },
                {
                    "file_additions": 15,
                    "file_deletions": 10,
                    "file_exists": true,
                    "file_name": "src/tcpedit/plugins/dlt_raw/raw.c",
                    "file_size": 8418
                },
                {
                    "file_additions": 31,
                    "file_deletions": 12,
                    "file_exists": true,
                    "file_name": "src/tcpedit/plugins/dlt_user/user.c",
                    "file_size": 11414
                },
                {
                    "file_additions": 1,
                    "file_deletions": 0,
                    "file_exists": true,
                    "file_name": "src/tcpedit/plugins/dlt_utils.c",
                    "file_size": 7623
                },
                {
                    "file_additions": 6,
                    "file_deletions": 4,
                    "file_exists": true,
                    "file_name": "src/tcpedit/portmap.c",
                    "file_size": 11755
                },
                {
                    "file_additions": 62,
                    "file_deletions": 51,
                    "file_exists": true,
                    "file_name": "src/tcpedit/tcpedit.c",
                    "file_size": 20318
                },
                {
                    "file_additions": 16,
                    "file_deletions": 20,
                    "file_exists": true,
                    "file_name": "src/tcpliveplay.c",
                    "file_size": 47467
                },
                {
                    "file_additions": 7,
                    "file_deletions": 7,
                    "file_exists": true,
                    "file_name": "src/tcpprep.c",
                    "file_size": 20901
                },
                {
                    "file_additions": 1,
                    "file_deletions": 1,
                    "file_exists": true,
                    "file_name": "src/tcpprep_api.c",
                    "file_size": 10417
                },
                {
                    "file_additions": 9,
                    "file_deletions": 1,
                    "file_exists": true,
                    "file_name": "src/tcpreplay.c",
                    "file_size": 7037
                },
                {
                    "file_additions": 10,
                    "file_deletions": 17,
                    "file_exists": true,
                    "file_name": "src/tcpreplay_api.c",
                    "file_size": 35703
                },
                {
                    "file_additions": 3,
                    "file_deletions": 1,
                    "file_exists": true,
                    "file_name": "src/tcprewrite.c",
                    "file_size": 10653
                },
                {
                    "file_additions": 5,
                    "file_deletions": 6,
                    "file_exists": true,
                    "file_name": "src/tree.c",
                    "file_size": 27711
                }
            ],
            "interesting": {
                "reopen": false,
                "status": false
            },
            "is_parent": false,
            "sha": "e143d00903d87e0830a1ceb4b72c70420e9afa1a"
        }
    ],
    "first_commit": "2018-01-22 16:28:50",
    "last_commit": "2018-10-23 17:35:15",
    "number": 406,
    "pull_request": "None",
    "score": {
        "accidental_reopen_likely": false,
        "all_labels": [
            "enhancement"
        ],
        "contains_keywords": [
            "remov",
            "issu",
            "warn",
            "chang",
            "work",
            "error",
            "fix",
            "test",
            "bug"
        ],
        "fix_size": 1345,
        "has_labels": [],
        "intersecting": {
            "computed_score": 0.795850622406639,
            "final_commit_size": 1205,
            "intersection_size": 959,
            "previous_commits_size": 1099
        },
        "is_makefile_based": true,
        "no_new_files": [],
        "no_other_files": false,
        "num_prohibited_files": 99172,
        "prohibited_files": [
            "tools/building.py",
            "tools/building.py",
            "tools/building.py",
            "emcc.py",
            "src/library_emmalloc.js",
            "src/shell.js",
            "tests/test_core.py",
            "src/shell.js",
            "tests/test_core.py",
            "src/library.js"
        ],
        "reopen": true,
        "reopen_events": [
            [
                "2018-01-22 17:05:06",
                "commit"
            ],
            [
                "2018-01-22 17:19:46",
                "commit"
            ],
            [
                "2018-01-22 17:21:29",
                "closed"
            ],
            [
                "2018-02-21 15:06:48",
                "reopened"
            ],
            [
                "2018-10-19 18:20:02",
                "commit"
            ],
            [
                "2018-10-20 23:55:01",
                "commit"
            ],
            [
                "2018-10-21 00:46:30",
                "commit"
            ],
            [
                "2018-10-21 00:47:23",
                "closed"
            ],
            [
                "2018-10-23 05:36:59",
                "commit"
            ],
            [
                "2018-10-23 17:36:02",
                "commit"
            ]
        ],
        "status": false,
        "strategy": true,
        "total_changes": 2747
    }
}