{
    "commits": [
        {
            "associated_pull_request": [],
            "date": "2023-01-09 12:26:30+00:00",
            "diff": "gpac_gpac/issue_2371/commit_a62df36f6ceb2ea013f5f524ee297218d20541a3.diff",
            "diff_additions": 8,
            "diff_deletions": 4,
            "diff_file_size": 216033,
            "diff_url": "https://github.com/gpac/gpac/commit/a62df36f6ceb2ea013f5f524ee297218d20541a3.diff",
            "exists": true,
            "files": [
                {
                    "file_additions": 2,
                    "file_deletions": 1,
                    "file_exists": true,
                    "file_name": "src/compositor/compositor.c",
                    "file_size": 166858
                },
                {
                    "file_additions": 6,
                    "file_deletions": 3,
                    "file_exists": true,
                    "file_name": "src/compositor/compositor_2d.c",
                    "file_size": 49175
                }
            ],
            "interesting": {
                "reopen": false,
                "status": false
            },
            "is_parent": true,
            "sha": "a62df36f6ceb2ea013f5f524ee297218d20541a3"
        },
        {
            "associated_pull_request": [],
            "date": "2023-01-09 12:28:28+00:00",
            "diff": "gpac_gpac/issue_2371/commit_41d952fa79dddeb6acf53e29df46a98af6f5e7bc.diff",
            "diff_additions": 68,
            "diff_deletions": 17,
            "diff_file_size": 1277986,
            "diff_url": "https://github.com/gpac/gpac/commit/41d952fa79dddeb6acf53e29df46a98af6f5e7bc.diff",
            "exists": true,
            "files": [
                {
                    "file_additions": 2,
                    "file_deletions": 2,
                    "file_exists": true,
                    "file_name": "applications/mp4box/mp4box.c",
                    "file_size": 270028
                },
                {
                    "file_additions": 2,
                    "file_deletions": 1,
                    "file_exists": true,
                    "file_name": "src/filter_core/filter_props.c",
                    "file_size": 90869
                },
                {
                    "file_additions": 5,
                    "file_deletions": 1,
                    "file_exists": true,
                    "file_name": "src/filters/ff_dmx.c",
                    "file_size": 74820
                },
                {
                    "file_additions": 1,
                    "file_deletions": 0,
                    "file_exists": true,
                    "file_name": "src/filters/inspect.c",
                    "file_size": 172294
                },
                {
                    "file_additions": 45,
                    "file_deletions": 3,
                    "file_exists": true,
                    "file_name": "src/filters/mux_isom.c",
                    "file_size": 293794
                },
                {
                    "file_additions": 11,
                    "file_deletions": 8,
                    "file_exists": true,
                    "file_name": "src/isomedia/isom_write.c",
                    "file_size": 293922
                },
                {
                    "file_additions": 2,
                    "file_deletions": 2,
                    "file_exists": true,
                    "file_name": "src/utils/os_divers.c",
                    "file_size": 82259
                }
            ],
            "interesting": {
                "reopen": true,
                "status": false
            },
            "is_parent": false,
            "sha": "41d952fa79dddeb6acf53e29df46a98af6f5e7bc"
        },
        {
            "associated_pull_request": [],
            "date": "2023-04-28 08:00:20+00:00",
            "diff": "gpac_gpac/issue_2371/commit_63431c664fff80572d31a6d8b7dcf61859f84c58.diff",
            "diff_additions": 33,
            "diff_deletions": 3,
            "diff_file_size": 1039410,
            "diff_url": "https://github.com/gpac/gpac/commit/63431c664fff80572d31a6d8b7dcf61859f84c58.diff",
            "exists": true,
            "files": [
                {
                    "file_additions": 23,
                    "file_deletions": 0,
                    "file_exists": true,
                    "file_name": "applications/mp4box/fileimport.c",
                    "file_size": 132824
                },
                {
                    "file_additions": 5,
                    "file_deletions": 2,
                    "file_exists": true,
                    "file_name": "applications/mp4box/mp4box.c",
                    "file_size": 270028
                },
                {
                    "file_additions": 1,
                    "file_deletions": 1,
                    "file_exists": true,
                    "file_name": "src/isomedia/box_code_base.c",
                    "file_size": 342636
                },
                {
                    "file_additions": 4,
                    "file_deletions": 0,
                    "file_exists": true,
                    "file_name": "src/isomedia/isom_write.c",
                    "file_size": 293922
                }
            ],
            "interesting": {
                "reopen": false,
                "status": true
            },
            "is_parent": false,
            "sha": "63431c664fff80572d31a6d8b7dcf61859f84c58"
        },
        {
            "associated_pull_request": [],
            "date": "2023-05-09 09:14:55+00:00",
            "diff": "gpac_gpac/issue_2371/commit_028a35d6ca9fe97387091a20c69cdd5413387a4a.diff",
            "diff_additions": 4,
            "diff_deletions": 4,
            "diff_file_size": 222197,
            "diff_url": "https://github.com/gpac/gpac/commit/028a35d6ca9fe97387091a20c69cdd5413387a4a.diff",
            "exists": true,
            "files": [
                {
                    "file_additions": 1,
                    "file_deletions": 1,
                    "file_exists": true,
                    "file_name": "applications/mp4box/fileimport.c",
                    "file_size": 132824
                },
                {
                    "file_additions": 1,
                    "file_deletions": 1,
                    "file_exists": true,
                    "file_name": "src/filters/ff_dmx.c",
                    "file_size": 74820
                },
                {
                    "file_additions": 2,
                    "file_deletions": 2,
                    "file_exists": true,
                    "file_name": "src/utils/url.c",
                    "file_size": 14553
                }
            ],
            "interesting": {
                "reopen": false,
                "status": false
            },
            "is_parent": false,
            "sha": "028a35d6ca9fe97387091a20c69cdd5413387a4a"
        }
    ],
    "first_commit": "2023-01-09 12:26:49+00:00",
    "last_commit": "2023-05-09 09:16:30+00:00",
    "number": 2371,
    "pull_request": "None",
    "score": {
        "accidental_reopen_likely": false,
        "all_labels": [],
        "contains_keywords": [
            "work",
            "fail",
            "chang",
            "fix",
            "issu",
            "test",
            "fault",
            "warn",
            "bug",
            "error",
            "crash",
            "report"
        ],
        "fix_size": 120,
        "has_labels": [],
        "intersecting": {
            "computed_score": 0.42857142857142855,
            "final_commit_size": 7,
            "intersection_size": 3,
            "previous_commits_size": 116
        },
        "is_makefile_based": true,
        "no_new_files": [
            "src/utils/url.c"
        ],
        "no_other_files": false,
        "num_prohibited_files": 166922,
        "prohibited_files": [
            "server/src/main/java/com/genymobile/scrcpy/Device.java",
            "server/src/main/java/com/genymobile/scrcpy/wrappers/SurfaceControl.java",
            "server/src/main/java/com/genymobile/scrcpy/Device.java",
            "server/src/main/java/com/genymobile/scrcpy/wrappers/SurfaceControl.java",
            "app/meson.build",
            "app/scrcpy.1",
            "app/src/common.h",
            "app/src/scrcpy.h",
            "app/src/server.h",
            "server/src/main/java/com/genymobile/scrcpy/Workarounds.java"
        ],
        "reopen": true,
        "reopen_events": [
            [
                "2023-01-09 12:28:58+00:00",
                "commit"
            ],
            [
                "2023-01-09 12:30:10+00:00",
                "closed"
            ],
            [
                "2023-04-11 11:58:22+00:00",
                "reopened"
            ],
            [
                "2023-04-28 08:00:26+00:00",
                "commit"
            ],
            [
                "2023-04-28 08:02:03+00:00",
                "closed"
            ],
            [
                "2023-05-09 09:17:08+00:00",
                "commit"
            ]
        ],
        "status": true,
        "strategy": true,
        "total_changes": 141
    }
}