{
    "covered_issues": [
        15451,
        15445,
        15444,
        15442,
        15441,
        15434,
        15428,
        15419,
        15418,
        15411,
        15410,
        15409,
        15395,
        15393,
        15390,
        15387,
        15386,
        15380,
        15379,
        15377,
        15361,
        15348,
        15342,
        15338,
        15335,
        15331,
        15321,
        15319,
        15314,
        15310,
        15307,
        15304,
        15300,
        15294,
        15292,
        15290,
        15285,
        15266,
        15265,
        15260,
        15257,
        15254,
        15253,
        15252,
        15250,
        15245,
        15241,
        15237,
        15235,
        15226,
        15224,
        15216,
        15211,
        15203,
        15202,
        15198,
        15191,
        15188,
        15186,
        15179,
        15173,
        15172,
        15170,
        15168,
        15160,
        15157,
        15156,
        15146,
        15144,
        15131,
        15129,
        15125,
        15122,
        15118,
        15113,
        15112,
        15108,
        15093,
        15089,
        15070,
        15069,
        15064,
        15055,
        15053,
        15047,
        15044,
        15037,
        15036,
        15035,
        15033,
        15023,
        15014,
        14999,
        14996,
        14992,
        14987,
        14977,
        14971,
        14969,
        14968,
        14967,
        14955,
        14954,
        14946,
        14942,
        14936,
        14934,
        14933,
        14930,
        14918,
        14916,
        14908,
        14907,
        14893,
        14891,
        14885,
        14883,
        14879,
        14878,
        14877,
        14871,
        14869,
        14867,
        14866,
        14857,
        14856,
        14855,
        14852,
        14845,
        14840,
        14839,
        14836,
        14811,
        14810,
        14799,
        14796,
        14795,
        14794,
        14793,
        14792,
        14791,
        14790,
        14789,
        14781,
        14779,
        14777,
        14775,
        14774,
        14764,
        14763,
        14762,
        14759,
        14758,
        14742,
        14735,
        14732,
        14727,
        14726,
        14725,
        14717,
        14715,
        14714,
        14712,
        14711,
        14700,
        14696,
        14695,
        14694,
        14690,
        14685,
        14680,
        14676,
        14666,
        14660,
        14658,
        14650,
        14649,
        14648,
        14633,
        14630,
        14622,
        14621,
        14616,
        14615,
        14611,
        14601,
        14598,
        14596,
        14591,
        14590,
        14580,
        14579,
        14577,
        14570,
        14568,
        14564,
        14563,
        14559,
        14558,
        14535,
        14533,
        14531,
        14528,
        14523,
        14508,
        14503,
        14501,
        14500,
        14493,
        14494,
        14489,
        14476,
        14475,
        14468,
        14459,
        14454,
        14452,
        14440,
        14433,
        14432,
        14425,
        14406,
        14404,
        14399,
        14398,
        14389,
        14371,
        14370,
        14365,
        14360,
        14335,
        14330,
        14320,
        14317,
        14292,
        14283,
        14273,
        14240,
        14236,
        14231,
        14226,
        14224,
        14222,
        14219,
        14217,
        14208,
        14206,
        14194,
        14182,
        14171,
        14163,
        14158,
        14157,
        14153,
        14152,
        14139,
        14136,
        14128,
        14124,
        14123,
        14121,
        14119,
        14116,
        14114,
        14110,
        14106,
        14105,
        14102,
        14097,
        14096,
        14082,
        14081,
        14077,
        14070,
        14069,
        14059,
        14058,
        14053,
        14052,
        14051,
        14043,
        14039,
        14037,
        14026,
        14025,
        14022,
        14015,
        14013,
        14004,
        13999,
        13997,
        13994,
        13990,
        13989,
        13984,
        13983,
        13982,
        13981,
        13980,
        13974,
        13971,
        13967,
        13956,
        13955,
        13943,
        13940,
        13938,
        13933,
        13926,
        13923,
        13916,
        13903,
        13892,
        13888,
        13884,
        13876,
        13875,
        13873,
        13858,
        13857,
        13854,
        13852,
        13851,
        13850,
        13844,
        13840,
        13838,
        13837,
        13836,
        13831,
        13823,
        13815,
        13812,
        13807,
        13801,
        13795,
        13793,
        13792,
        13790,
        13789,
        13783,
        13781,
        13772,
        13769,
        13765,
        13764,
        13761,
        13756,
        13751,
        13750,
        13748,
        13746,
        13730,
        13726,
        13722,
        13720,
        13712,
        13711,
        13710,
        13708,
        13705,
        13700,
        13687,
        13682,
        13678,
        13676,
        13675,
        13667,
        13665,
        13664,
        13657,
        13650,
        13648,
        13647,
        13644,
        13642,
        13641,
        13638,
        13635,
        13629,
        13628,
        13627,
        13625,
        13624,
        13616,
        13604,
        13603,
        13599,
        13598,
        13596,
        13591,
        13581,
        13577,
        13556,
        13554,
        13543,
        13541,
        13539,
        13535,
        13532,
        13529,
        13528,
        13519,
        13515,
        13511,
        13510,
        13508,
        13506,
        13505,
        13504,
        13503,
        13500,
        13499,
        13498,
        13491,
        13490,
        13485,
        13483,
        13482,
        13480,
        13474,
        13465,
        13458,
        13442,
        13440,
        13438,
        13437,
        13429,
        13428,
        13424,
        13423,
        13422,
        13411,
        13407,
        13402,
        13398,
        13396,
        13395,
        13394,
        13393,
        13389,
        13388,
        13383,
        13376,
        13372,
        13368,
        13360,
        13359,
        13354,
        13352,
        13350,
        13343,
        13339,
        13329,
        13328,
        13327,
        13324,
        13322,
        13319,
        13310,
        13308,
        13299,
        13297,
        13295,
        13292,
        13271,
        13265,
        13259,
        13233,
        13226,
        13220,
        13218,
        13215,
        13214,
        13211,
        13208,
        13203,
        13201,
        13200,
        13197,
        13195,
        13190,
        13189,
        13187,
        13186,
        13185,
        13181,
        13179,
        13178,
        13176,
        13170,
        13167,
        13166,
        13163,
        13162,
        13157,
        13155,
        13154,
        13153,
        13146,
        13145,
        13141,
        13140,
        13139,
        13138,
        13137,
        13136,
        13129,
        13127,
        13123,
        13121,
        13116,
        13113,
        13112,
        13111,
        13110,
        13109,
        13108,
        13107,
        13106,
        13105,
        13104,
        13102,
        13101,
        13099,
        13097,
        13094,
        13092,
        13087,
        13078,
        13076,
        13075,
        13074,
        13068,
        13067,
        13065,
        13062,
        13061,
        13059,
        13058,
        13057,
        13056,
        13050,
        13049,
        13032,
        13029,
        13028,
        13027,
        13025,
        13024,
        13023,
        13021,
        13018,
        13017,
        13012,
        13010,
        13005,
        13004,
        13000,
        12999,
        12994,
        12993,
        12990,
        12989,
        12980,
        12976,
        12975,
        12974,
        12957,
        12953,
        12952,
        12948,
        12940,
        12936,
        12932,
        12930,
        12929,
        12928,
        12927,
        12926,
        12925,
        12922,
        12921,
        12920,
        12912,
        12911,
        12910,
        12907,
        12891,
        12881,
        12879,
        12877,
        12870,
        12861,
        12858,
        12857,
        12851,
        12848,
        12837,
        12832,
        12829,
        12822,
        12821,
        12820,
        12812,
        12809,
        12807,
        12806,
        12803,
        12800,
        12798,
        12796,
        12795,
        12794,
        12793,
        12789,
        12788,
        12784,
        12782,
        12781,
        12773,
        12770,
        12764,
        12760,
        12750,
        12749,
        12740,
        12732,
        12720,
        12718,
        12713,
        12710,
        12709,
        12700,
        12695,
        12688,
        12687,
        12678,
        12675,
        12669,
        12647,
        12635,
        12627,
        12625,
        12622,
        12621,
        12620,
        12618,
        12616,
        12608,
        12605,
        12602,
        12593,
        12592,
        12587,
        12586,
        12585,
        12584,
        12582,
        12577,
        12575,
        12574,
        12573,
        12568,
        12566,
        12565,
        12564,
        12563,
        12561,
        12556,
        12555,
        12552,
        12546,
        12544,
        12542,
        12541,
        12539,
        12538,
        12535,
        12532,
        12523,
        12504,
        12503,
        12497,
        12494,
        12493,
        12486,
        12474,
        12469,
        12465,
        12461,
        12459,
        12455,
        12452,
        12448,
        12439,
        12435,
        12434,
        12423,
        12416,
        12414,
        12413,
        12412,
        12390,
        12381,
        12376,
        12375,
        12374,
        12373,
        12371,
        12367,
        12361,
        12360,
        12352,
        12351,
        12348,
        12347,
        12346,
        12343,
        12337,
        12328,
        12325,
        12314,
        12313,
        12311,
        12309,
        12301,
        12298,
        12294,
        12290,
        12289,
        12285,
        12284,
        12279,
        12277,
        12276,
        12268,
        12252,
        12250,
        12247,
        12246,
        12244,
        12232,
        12229,
        12222,
        12221,
        12219,
        12212,
        12205,
        12203,
        12192,
        12191,
        12190,
        12184,
        12174,
        12172,
        12171,
        12159,
        12158,
        12149,
        12137,
        12130,
        12129,
        12127,
        12116,
        12115,
        12107,
        12105,
        12104,
        12103,
        12102,
        12096,
        12094,
        12091,
        12090,
        12087,
        12084,
        12077,
        12076,
        12075,
        12074,
        12072,
        12066,
        12062,
        12054,
        12053,
        12049,
        12046,
        12042,
        12031,
        12028,
        12021,
        12016,
        12009,
        12005,
        12004,
        12003,
        12002,
        12001,
        12000,
        11994,
        11993,
        11989,
        11982,
        11981,
        11977,
        11965,
        11960,
        11955,
        11954,
        11953,
        11951,
        11940,
        11934,
        11931,
        11929,
        11924,
        11922,
        11912,
        11909,
        11907,
        11906,
        11898,
        11893,
        11883,
        11879,
        11876,
        11864,
        11863,
        11862,
        11860,
        11855,
        11853,
        11852,
        11845,
        11838,
        11837,
        11835,
        11826,
        11809,
        11807,
        11806,
        11805,
        11804,
        11803,
        11802,
        11801,
        11799,
        11798,
        11795,
        11794,
        11793,
        11792,
        11788,
        11787,
        11781,
        11778,
        11774,
        11769,
        11768,
        11766,
        11762,
        11761,
        11760,
        11758,
        11757,
        11753,
        11751,
        11750,
        11746,
        11745,
        11744,
        11741,
        11740,
        11737,
        11733,
        11732,
        11731,
        11730,
        11723,
        11722,
        11716,
        11704,
        11680,
        11674,
        11666,
        11665,
        11664,
        11663,
        11659,
        11658,
        11656,
        11652,
        11643,
        11637,
        11633,
        11617,
        11613,
        11611,
        11610,
        11608,
        11606,
        11600,
        11593,
        11592,
        11591,
        11584,
        11579,
        11576,
        11575,
        11574,
        11570,
        11565,
        11557,
        11555,
        11554,
        11553,
        11552,
        11545,
        11544,
        11543,
        11537,
        11533,
        11532,
        11530,
        11528,
        11519,
        11515,
        11513,
        11511,
        11509,
        11508,
        11506,
        11505,
        11503,
        11502,
        11501,
        11500,
        11497,
        11496,
        11492,
        11485,
        11482,
        11461,
        11451,
        11442,
        11436,
        11432,
        11428,
        11426,
        11422,
        11416,
        11413,
        11411,
        11406,
        11405,
        11401,
        11398,
        11397,
        11389,
        11387,
        11386,
        11378,
        11374,
        11373,
        11371,
        11365,
        11364,
        11363,
        11362,
        11361,
        11350,
        11346,
        11333,
        11329,
        11313,
        11312,
        11311,
        11310,
        11305,
        11300,
        11295,
        11287,
        11286,
        11285,
        11277,
        11263,
        11258,
        11257,
        11256,
        11253,
        11252,
        11251,
        11238,
        11234,
        11233,
        11232,
        11230,
        11229,
        11228,
        11227,
        11219,
        11218,
        11217,
        11214,
        11210,
        11209,
        11207,
        11205,
        11202,
        11197,
        11192,
        11187,
        11184,
        11182,
        11177,
        11175,
        11174,
        11170,
        11158,
        11153,
        11144,
        11143,
        11140,
        11129,
        11128,
        11125,
        11124,
        11121,
        11120,
        11115,
        11113,
        11111,
        11109,
        11108,
        11107,
        11106,
        11102,
        11100,
        11098,
        11097,
        11092,
        11091,
        11089,
        11088,
        11087,
        11085,
        11083,
        11081,
        11075,
        11068,
        11065,
        11061,
        11057,
        11055,
        11054,
        11048,
        11047,
        11045,
        11044,
        11040,
        11031,
        11025,
        11016,
        11001,
        11000,
        10999,
        10998,
        10996,
        10995,
        10993,
        10992,
        10988,
        10987,
        10986,
        10985,
        10983,
        10969,
        10962,
        10960,
        10958,
        10957,
        10956,
        10951,
        10949,
        10946,
        10945,
        10943,
        10941,
        10936,
        10935,
        10930,
        10929,
        10927,
        10926,
        10923,
        10922,
        10918,
        10917,
        10915,
        10914,
        10912,
        10909,
        10906,
        10903,
        10901,
        10898,
        10897,
        10892,
        10891,
        10890,
        10887,
        10886,
        10883,
        10882,
        10880,
        10878,
        10876,
        10871,
        10865,
        10863,
        10862,
        10860,
        10854,
        10853,
        10852,
        10851,
        10850,
        10849,
        10848,
        10844,
        10832,
        10831,
        10827,
        10822,
        10819,
        10817,
        10815,
        10814,
        10810,
        10806,
        10803,
        10799,
        10789,
        10788,
        10787,
        10785,
        10783,
        10780,
        10778,
        10773,
        10771,
        10768,
        10766,
        10765,
        10760,
        10754,
        10748,
        10745,
        10743,
        10738,
        10737,
        10736,
        10735,
        10734,
        10732,
        10731,
        10730,
        10729,
        10728,
        10727,
        10726,
        10725,
        10724,
        10723,
        10721,
        10720,
        10719,
        10718,
        10717,
        10715,
        10714,
        10713,
        10691,
        10690,
        10687,
        10685,
        10682,
        10679,
        10678,
        10673,
        10671,
        10670,
        10668,
        10667,
        10664,
        10662,
        10658,
        10655,
        10650,
        10649,
        10648,
        10643,
        10641,
        10630,
        10628,
        10626,
        10613,
        10612,
        10611,
        10608,
        10607,
        10604,
        10603,
        10599,
        10592,
        10590,
        10589,
        10586,
        10585,
        10584,
        10583,
        10577,
        10576,
        10574,
        10571,
        10565,
        10564,
        10563,
        10562,
        10561,
        10560,
        10559,
        10558,
        10552,
        10551,
        10549,
        10548,
        10547,
        10545,
        10535,
        10531,
        10528,
        10519,
        10518,
        10515,
        10510,
        10508,
        10504,
        10499,
        10498,
        10497,
        10495,
        10491,
        10487,
        10486,
        10481,
        10470,
        10464,
        10458,
        10455,
        10452,
        10450,
        10446,
        10445,
        10444,
        10440,
        10433,
        10432,
        10430,
        10428,
        10425,
        10423,
        10422,
        10403,
        10400,
        10399,
        10396,
        10392,
        10389,
        10388,
        10379,
        10372,
        10371,
        10370,
        10365,
        10360,
        10359,
        10357,
        10356,
        10352,
        10351,
        10345,
        10344,
        10342,
        10339,
        10337,
        10336,
        10331,
        10327,
        10325,
        10321,
        10319,
        10316,
        10315,
        10313,
        10312,
        10310,
        10307,
        10306,
        10305,
        10300,
        10298,
        10297,
        10284,
        10278,
        10277,
        10273,
        10266,
        10264,
        10263,
        10262,
        10261,
        10259,
        10256,
        10255,
        10253,
        10252,
        10251,
        10250,
        10249,
        10247,
        10245,
        10242,
        10241,
        10239,
        10238,
        10237,
        10236,
        10228,
        10227,
        10226,
        10223,
        10220,
        10216,
        10211,
        10208,
        10207,
        10205,
        10203,
        10198,
        10197,
        10195,
        10192,
        10191,
        10183,
        10176,
        10175,
        10174,
        10169,
        10168,
        10167,
        10165,
        10163,
        10153,
        10139,
        10136,
        10135,
        10134,
        10132,
        10127,
        10126,
        10125,
        10123,
        10119,
        10117,
        10112,
        10111,
        10109,
        10107,
        10103,
        10095,
        10090,
        10085,
        10083,
        10080,
        10079,
        10076,
        10075,
        10071,
        10069,
        10063,
        10062,
        10061,
        10060,
        10059,
        10058,
        10057,
        10054,
        10052,
        10051,
        10050,
        10049,
        10040,
        10039,
        10035,
        10032,
        10028,
        10024,
        10022,
        10016,
        10015,
        10013,
        10009,
        10007,
        10006,
        9987,
        9983,
        9975,
        9974,
        9970,
        9969,
        9968,
        9962,
        9961,
        9958,
        9951,
        9950,
        9949,
        9945,
        9942,
        9938,
        9934,
        9933,
        9922,
        9912,
        9903,
        9901,
        9897,
        9890,
        9887,
        9882,
        9881,
        9880,
        9877,
        9869,
        9868,
        9865,
        9857,
        9854,
        9853,
        9850,
        9848,
        9846,
        9830,
        9827,
        9826,
        9819,
        9816,
        9809,
        9803,
        9789,
        9788,
        9773,
        9771,
        9770,
        9761,
        9760,
        9757,
        9750,
        9749,
        9747,
        9744,
        9739,
        9737,
        9735,
        9734,
        9733,
        9732,
        9731,
        9729,
        9726,
        9725,
        9723,
        9720,
        9717,
        9716,
        9712,
        9711,
        9704,
        9703,
        9699,
        9695,
        9689,
        9688,
        9687,
        9683,
        9676,
        9675,
        9674,
        9672,
        9671,
        9665,
        9648,
        9643,
        9640,
        9632,
        9629,
        9627,
        9626,
        9623,
        9622,
        9621,
        9620,
        9618,
        9611,
        9610,
        9608,
        9597,
        9592,
        9590,
        9578,
        9577,
        9574,
        9567,
        9565,
        9563,
        9558,
        9542,
        9540,
        9538,
        9525,
        9523,
        9519,
        9518,
        9516,
        9513,
        9512,
        9511,
        9505,
        9504,
        9495,
        9494,
        9490,
        9489,
        9479,
        9470,
        9468,
        9467,
        9465,
        9464,
        9461,
        9460,
        9459,
        9458,
        9454,
        9451,
        9450,
        9447,
        9436,
        9435,
        9426,
        9425,
        9423,
        9420,
        9419,
        9413,
        9412,
        9402,
        9400,
        9396,
        9395,
        9390,
        9383,
        9382,
        9381,
        9379,
        9375,
        9367,
        9364,
        9353,
        9345,
        9343,
        9338,
        9322,
        9314,
        9304,
        9303,
        9299,
        9298,
        9294,
        9292,
        9285,
        9282,
        9281,
        9276,
        9275,
        9272,
        9270,
        9266,
        9265,
        9263,
        9259,
        9255,
        9254,
        9242,
        9240,
        9235,
        9230,
        9228,
        9216,
        9213,
        9207,
        9206,
        9201,
        9196,
        9194,
        9193,
        9190,
        9189,
        9181,
        9178,
        9177,
        9176,
        9172,
        9170,
        9169,
        9160,
        9153,
        9149,
        9147,
        9145,
        9142,
        9141,
        9140,
        9139,
        9138,
        9137,
        9133,
        9132,
        9125,
        9124,
        9123,
        9119,
        9118,
        9117,
        9116,
        9115,
        9112,
        9106,
        9103,
        9099,
        9098,
        9095,
        9094,
        9093,
        9088,
        9083,
        9082,
        9078,
        9077,
        9076,
        9075,
        9071,
        9069,
        9065,
        9062,
        9048,
        9046,
        9041,
        9039,
        9038,
        9032,
        9031,
        9027,
        9026,
        9024,
        9022,
        9017,
        9016,
        9015,
        9014,
        9012,
        9011,
        9007,
        9006,
        9004,
        9002,
        9000,
        8999,
        8997,
        8992,
        8991,
        8984,
        8983,
        8977,
        8969,
        8967,
        8963,
        8962,
        8954,
        8950,
        8948,
        8945,
        8943,
        8942,
        8941,
        8940,
        8939,
        8938,
        8937,
        8931,
        8930,
        8929,
        8928,
        8927,
        8921,
        8917,
        8913,
        8912,
        8909,
        8906,
        8903,
        8894,
        8893,
        8892,
        8886,
        8881,
        8880,
        8870,
        8865,
        8864,
        8858,
        8857,
        8842,
        8834,
        8833,
        8829,
        8818,
        8816,
        8811,
        8809,
        8808,
        8807,
        8806,
        8805,
        8799,
        8793,
        8792,
        8786,
        8785,
        8783,
        8781,
        8774,
        8765,
        8758,
        8752,
        8741,
        8732,
        8726,
        8724,
        8721,
        8720,
        8716,
        8715,
        8714,
        8710,
        8706,
        8705,
        8695,
        8691,
        8678,
        8674,
        8666,
        8664,
        8656,
        8650,
        8638,
        8636,
        8635,
        8632,
        8628,
        8626,
        8620,
        8619,
        8618,
        8610,
        8609,
        8608,
        8597,
        8582,
        8575,
        8574,
        8571,
        8570,
        8568,
        8567,
        8558,
        8557,
        8555,
        8548,
        8544,
        8543,
        8533,
        8527,
        8523,
        8520,
        8518,
        8517,
        8513,
        8507,
        8501,
        8500,
        8498,
        8496,
        8494,
        8492,
        8490,
        8481,
        8477,
        8473,
        8472,
        8471,
        8470,
        8468,
        8467,
        8466,
        8450,
        8447,
        8438,
        8433,
        8431,
        8428,
        8426,
        8415,
        8411,
        8399,
        8398,
        8396,
        8378,
        8376,
        8373,
        8372,
        8368,
        8362,
        8361,
        8360,
        8355,
        8353,
        8351,
        8344,
        8343,
        8333,
        8326,
        8322,
        8321,
        8320,
        8314,
        8312,
        8308,
        8306,
        8300,
        8297,
        8296,
        8294,
        8293,
        8290,
        8289,
        8287,
        8285,
        8282,
        8278,
        8277,
        8267,
        8265,
        8264,
        8260,
        8254,
        8240,
        8232,
        8228,
        8227,
        8220,
        8217,
        8215,
        8214,
        8211,
        8209,
        8207,
        8206,
        8205,
        8204,
        8203,
        8202,
        8201,
        8200,
        8199,
        8198,
        8197,
        8196,
        8195,
        8194,
        8191,
        8188,
        8185,
        8184,
        8178,
        8174,
        8173,
        8172,
        8170,
        8158,
        8155,
        8152,
        8151,
        8150,
        8146,
        8144,
        8143,
        8141,
        8139,
        8135,
        8133,
        8126,
        8124,
        8120,
        8117,
        8116,
        8115,
        8113,
        8111,
        8110,
        8107,
        8105,
        8102,
        8101,
        8098,
        8093,
        8091,
        8089,
        8088,
        8087,
        8084,
        8081,
        8080,
        8078,
        8077,
        8071,
        8070,
        8068,
        8065,
        8064,
        8059,
        8058,
        8056,
        8055,
        8051,
        8047,
        8045,
        8044,
        8043,
        8042,
        8041,
        8038,
        8028,
        8027,
        8021,
        8011,
        8007,
        8004,
        8000,
        7997,
        7994,
        7986,
        7983,
        7973,
        7972,
        7963,
        7961,
        7956,
        7954,
        7949,
        7947,
        7946,
        7942,
        7936,
        7933,
        7931,
        7930,
        7929,
        7928,
        7927,
        7912,
        7908,
        7900,
        7897,
        7889,
        7888,
        7887,
        7886,
        7885,
        7884,
        7867,
        7866,
        7865,
        7863,
        7862,
        7859,
        7858,
        7853,
        7852,
        7847,
        7845,
        7842,
        7841,
        7838,
        7837,
        7836,
        7835,
        7833,
        7829,
        7827,
        7820,
        7811,
        7809,
        7808,
        7804,
        7801,
        7800,
        7796,
        7784,
        7776,
        7766,
        7765,
        7764,
        7763,
        7759,
        7756,
        7748,
        7743,
        7736,
        7733,
        7732,
        7724,
        7723,
        7718,
        7712,
        7711,
        7710,
        7709,
        7707,
        7702,
        7701,
        7699,
        7697,
        7695,
        7690,
        7684,
        7682,
        7680,
        7679,
        7674,
        7672,
        7665,
        7659,
        7657,
        7656,
        7654,
        7651,
        7649,
        7647,
        7634,
        7633,
        7626,
        7625,
        7618,
        7617,
        7616,
        7615,
        7614,
        7613,
        7612,
        7611,
        7610,
        7607,
        7597,
        7594,
        7593,
        7589,
        7588,
        7577,
        7576,
        7575,
        7574,
        7573,
        7572,
        7571,
        7570,
        7568,
        7563,
        7560,
        7557,
        7555,
        7550,
        7547,
        7546,
        7543,
        7542,
        7541,
        7538,
        7537,
        7535,
        7527,
        7526,
        7522,
        7521,
        7514,
        7513,
        7511,
        7509,
        7506,
        7499,
        7497,
        7496,
        7493,
        7492,
        7490,
        7488,
        7484,
        7483,
        7482,
        7478,
        7476,
        7473,
        7470,
        7469,
        7467,
        7464,
        7463,
        7462,
        7460,
        7458,
        7457,
        7456,
        7455,
        7454,
        7451,
        7450,
        7447,
        7444,
        7442,
        7441,
        7440,
        7439,
        7438,
        7435,
        7433,
        7432,
        7431,
        7428,
        7425,
        7424,
        7422,
        7418,
        7416,
        7415,
        7409,
        7408,
        7407,
        7400,
        7398,
        7397,
        7395,
        7394,
        7393,
        7392,
        7391,
        7388,
        7387,
        7382,
        7381,
        7380,
        7379,
        7373,
        7372,
        7363,
        7362,
        7360,
        7358,
        7357,
        7350,
        7347,
        7346,
        7345,
        7343,
        7339,
        7337,
        7334,
        7328,
        7321,
        7319,
        7317,
        7316,
        7315,
        7314,
        7312,
        7310,
        7308,
        7307,
        7306,
        7301,
        7300,
        7297,
        7293,
        7292,
        7285,
        7282,
        7281,
        7279,
        7278,
        7270,
        7265,
        7260,
        7257,
        7256,
        7255,
        7254,
        7253,
        7252,
        7251,
        7250,
        7248,
        7246,
        7240,
        7236,
        7235,
        7232,
        7230,
        7227,
        7223,
        7222,
        7219,
        7213,
        7204,
        7203,
        7200,
        7198,
        7193,
        7190,
        7189,
        7188,
        7187,
        7186,
        7184,
        7181,
        7180,
        7168,
        7165,
        7156,
        7155,
        7154,
        7153,
        7149,
        7142,
        7140,
        7138,
        7137,
        7134,
        7130,
        7129,
        7126,
        7125,
        7118,
        7115,
        7114,
        7112,
        7104,
        7101,
        7096,
        7093,
        7091,
        7085,
        7083,
        7077,
        7071,
        7069,
        7068,
        7065,
        7064,
        7048,
        7047,
        7046,
        7045,
        7043,
        7041,
        7038,
        7037,
        7026,
        7025,
        7017,
        7013,
        7010,
        7006,
        6998,
        6990,
        6988,
        6986,
        6982,
        6979,
        6977,
        6975,
        6966,
        6955,
        6954,
        6943,
        6942,
        6934,
        6930,
        6924,
        6921,
        6920,
        6916,
        6909,
        6902,
        6900,
        6899,
        6898,
        6897,
        6895,
        6894,
        6893,
        6891,
        6888,
        6877,
        6873,
        6872,
        6868,
        6861,
        6858,
        6854,
        6853,
        6850,
        6843,
        6840,
        6835,
        6827,
        6824,
        6820,
        6816,
        6813,
        6812,
        6811,
        6807,
        6806,
        6804,
        6802,
        6801,
        6790,
        6789,
        6783,
        6775,
        6770,
        6767,
        6766,
        6764,
        6763,
        6760,
        6759,
        6755,
        6754,
        6753,
        6738,
        6737,
        6732,
        6722,
        6716,
        6714,
        6706,
        6699,
        6695,
        6694,
        6689,
        6685,
        6684,
        6674,
        6670,
        6664,
        6662,
        6661,
        6659,
        6650,
        6649,
        6643,
        6641,
        6640,
        6639,
        6633,
        6631,
        6624,
        6623,
        6617,
        6616,
        6597,
        6594,
        6593,
        6591,
        6589,
        6585,
        6583,
        6581,
        6578,
        6574,
        6571,
        6563,
        6562,
        6560,
        6556,
        6554,
        6551,
        6549,
        6548,
        6546,
        6545,
        6543,
        6542,
        6539,
        6532,
        6529,
        6526,
        6525,
        6521,
        6520,
        6514,
        6513,
        6506,
        6504,
        6499,
        6495,
        6489,
        6478,
        6476,
        6470,
        6460,
        6454,
        6451,
        6449,
        6444,
        6438,
        6436,
        6426,
        6421,
        6420,
        6417,
        6410,
        6409,
        6407,
        6405,
        6400,
        6398,
        6397,
        6396,
        6395,
        6391,
        6390,
        6389,
        6386,
        6385,
        6384,
        6383,
        6382,
        6381,
        6380,
        6374,
        6366,
        6362,
        6358,
        6355,
        6347,
        6342,
        6339,
        6335,
        6334,
        6331,
        6325,
        6324,
        6320,
        6319,
        6318,
        6317,
        6312,
        6307,
        6306,
        6305,
        6298,
        6284,
        6272,
        6265,
        6262,
        6261,
        6259,
        6258,
        6256,
        6255,
        6253,
        6252,
        6248,
        6247,
        6244,
        6242,
        6233,
        6224,
        6222,
        6213,
        6208,
        6207,
        6206,
        6205,
        6204,
        6203,
        6199,
        6196,
        6194,
        6187,
        6184,
        6181,
        6180,
        6174,
        6165,
        6159,
        6158,
        6150,
        6144,
        6138,
        6137,
        6133,
        6132,
        6131,
        6130,
        6129,
        6122,
        6111,
        6107,
        6105,
        6103,
        6101,
        6100,
        6098,
        6094,
        6091,
        6090,
        6089,
        6085,
        6081,
        6080,
        6079,
        6077,
        6075,
        6073,
        6072,
        6065,
        6062,
        6060,
        6054,
        6044,
        6039,
        6038,
        6037,
        6034,
        6024,
        6020,
        6019,
        6011,
        6010,
        6008,
        6005,
        6003,
        6002,
        5999,
        5995,
        5992,
        5991,
        5989,
        5985,
        5981,
        5976,
        5974,
        5969,
        5968,
        5961,
        5959,
        5958,
        5955,
        5943,
        5940,
        5939,
        5935,
        5931,
        5930,
        5924,
        5922,
        5921,
        5919,
        5916,
        5908,
        5893,
        5891,
        5888,
        5887,
        5886,
        5885,
        5883,
        5881,
        5879,
        5875,
        5872,
        5871,
        5869,
        5868,
        5863,
        5861,
        5860,
        5859,
        5853,
        5850,
        5849,
        5843,
        5840,
        5839,
        5838,
        5835,
        5830,
        5827,
        5823,
        5820,
        5817,
        5815,
        5814,
        5810,
        5805,
        5804,
        5803,
        5801,
        5799,
        5798,
        5796,
        5793,
        5790,
        5786,
        5785,
        5783,
        5780,
        5779,
        5778,
        5777,
        5774,
        5772,
        5771,
        5769,
        5765,
        5764,
        5763,
        5762,
        5759,
        5741,
        5735,
        5730,
        5728,
        5725,
        5724,
        5718,
        5717,
        5716,
        5713,
        5712,
        5711,
        5709,
        5706,
        5705,
        5702,
        5700,
        5699,
        5694,
        5692,
        5690,
        5686,
        5683,
        5680,
        5679,
        5676,
        5672,
        5671,
        5668,
        5664,
        5659,
        5658,
        5653,
        5652,
        5650,
        5647,
        5645,
        5643,
        5642,
        5641,
        5640,
        5639,
        5638,
        5636,
        5632,
        5626,
        5622,
        5619,
        5615,
        5612,
        5603,
        5600,
        5588,
        5582,
        5575,
        5573,
        5564,
        5556,
        5555,
        5554,
        5551,
        5546,
        5545,
        5544,
        5543,
        5542,
        5537,
        5529,
        5524,
        5522,
        5519,
        5517,
        5515,
        5514,
        5507,
        5506,
        5504,
        5502,
        5501,
        5496,
        5495,
        5493,
        5492,
        5491,
        5484,
        5480,
        5479,
        5478,
        5477,
        5468,
        5467,
        5465,
        5462,
        5461,
        5451,
        5450,
        5448,
        5444,
        5443,
        5442,
        5441,
        5440,
        5439,
        5431,
        5423,
        5421,
        5416,
        5414,
        5404,
        5389,
        5388,
        5387,
        5386,
        5384,
        5383,
        5382,
        5380,
        5378,
        5374,
        5368,
        5367,
        5364,
        5362,
        5361,
        5357,
        5351,
        5350,
        5349,
        5348,
        5343,
        5341,
        5336,
        5333,
        5331,
        5318,
        5310,
        5309,
        5308,
        5307,
        5304,
        5301,
        5298,
        5297,
        5294,
        5290,
        5284,
        5282,
        5281,
        5280,
        5279,
        5276,
        5267,
        5266,
        5265,
        5259,
        5258,
        5256,
        5254,
        5251,
        5248,
        5244,
        5241,
        5239,
        5225,
        5222,
        5221,
        5219,
        5218,
        5215,
        5214,
        5211,
        5209,
        5206,
        5198,
        5195,
        5190,
        5186,
        5185,
        5181,
        5170,
        5168,
        5167,
        5159,
        5156,
        5155,
        5153,
        5150,
        5146,
        5145,
        5142,
        5139,
        5136,
        5135,
        5134,
        5133,
        5131,
        5129,
        5128,
        5127,
        5126,
        5124,
        5121,
        5120,
        5119,
        5118,
        5117,
        5115,
        5114,
        5112,
        5110,
        5109,
        5102,
        5101,
        5092,
        5082,
        5079,
        5076,
        5075,
        5072,
        5070,
        5068,
        5067,
        5065,
        5064,
        5059,
        5056,
        5054,
        5051,
        5048,
        5041,
        5040,
        5039,
        5036,
        5035,
        5034,
        5024,
        5023,
        5020,
        5017,
        5015,
        5014,
        5011,
        5010,
        5009,
        5007,
        5005,
        5004,
        5002,
        4998,
        4988,
        4986,
        4985,
        4981,
        4978,
        4976,
        4972,
        4970,
        4969,
        4967,
        4966,
        4957,
        4953,
        4952,
        4946,
        4942,
        4930,
        4928,
        4927,
        4919,
        4917,
        4915,
        4914,
        4913,
        4910,
        4906,
        4904,
        4903,
        4901,
        4899,
        4897,
        4894,
        4893,
        4891,
        4888,
        4885,
        4884,
        4880,
        4879,
        4877,
        4876,
        4874,
        4872,
        4871,
        4870,
        4867,
        4866,
        4865,
        4862,
        4856,
        4847,
        4845,
        4841,
        4834,
        4830,
        4827,
        4826,
        4823,
        4821,
        4818,
        4816,
        4815,
        4810,
        4806,
        4802,
        4799,
        4798,
        4791,
        4789,
        4788,
        4787,
        4785,
        4784,
        4773,
        4771,
        4770,
        4769,
        4763,
        4761,
        4759,
        4758,
        4757,
        4753,
        4748,
        4743,
        4739,
        4737,
        4735,
        4730,
        4724,
        4723,
        4722,
        4716,
        4713,
        4712,
        4709,
        4705,
        4704,
        4703,
        4702,
        4700,
        4698,
        4692,
        4688,
        4686,
        4683,
        4681,
        4680,
        4675,
        4673,
        4670,
        4669,
        4663,
        4661,
        4658,
        4655,
        4654,
        4653,
        4651,
        4649,
        4643,
        4637,
        4630,
        4627,
        4626,
        4624,
        4622,
        4621,
        4619,
        4618,
        4617,
        4614,
        4613,
        4612,
        4611,
        4609,
        4606,
        4605,
        4602,
        4600,
        4591,
        4589,
        4588,
        4587,
        4586,
        4585,
        4584,
        4583,
        4582,
        4581,
        4576,
        4575,
        4574,
        4573,
        4570,
        4569,
        4564,
        4553,
        4551,
        4550,
        4549,
        4537,
        4535,
        4534,
        4533,
        4532,
        4528,
        4527,
        4526,
        4515,
        4512,
        4507,
        4505,
        4492,
        4488,
        4486,
        4462,
        4461,
        4460,
        4459,
        4458,
        4457,
        4456,
        4443,
        4442,
        4440,
        4433,
        4432,
        4429,
        4428,
        4419,
        4416,
        4409,
        4408,
        4407,
        4404,
        4399,
        4396,
        4394,
        4391,
        4386,
        4384,
        4380,
        4376,
        4374,
        4372,
        4370,
        4363,
        4362,
        4361,
        4360,
        4357,
        4355,
        4354,
        4350,
        4349,
        4348,
        4347,
        4344,
        4343,
        4341,
        4339,
        4330,
        4327,
        4326,
        4318,
        4304,
        4301,
        4300,
        4297,
        4288,
        4287,
        4285,
        4283,
        4271,
        4269,
        4268,
        4262,
        4261,
        4257,
        4250,
        4247,
        4246,
        4244,
        4237,
        4228,
        4227,
        4222,
        4221,
        4220,
        4218,
        4217,
        4214,
        4213,
        4204,
        4196,
        4195,
        4194,
        4193,
        4191,
        4189,
        4188,
        4182,
        4181,
        4151,
        4146,
        4144,
        4140,
        4139,
        4138,
        4131,
        4130,
        4127,
        4124,
        4120,
        4117,
        4116,
        4114,
        4108,
        4105,
        4099,
        4096,
        4095,
        4091,
        4090,
        4086,
        4084,
        4083,
        4082,
        4080,
        4076,
        4075,
        4068,
        4067,
        4057,
        4055,
        4053,
        4052,
        4044,
        4040,
        4038,
        4035,
        4034,
        4033,
        4032,
        4029,
        4026,
        4024,
        4023,
        4019,
        4018,
        4010,
        4009,
        4007,
        4006,
        4005,
        4004,
        4002,
        4001,
        3999,
        3989,
        3986,
        3985,
        3984,
        3983,
        3981,
        3978,
        3977,
        3974,
        3973,
        3971,
        3970,
        3967,
        3966,
        3964,
        3963,
        3959,
        3958,
        3952,
        3945,
        3941,
        3940,
        3938,
        3935,
        3932,
        3929,
        3928,
        3926,
        3925,
        3923,
        3919,
        3916,
        3910,
        3909,
        3908,
        3907,
        3905,
        3904,
        3903,
        3901,
        3896,
        3891,
        3890,
        3889,
        3887,
        3885,
        3884,
        3883,
        3878,
        3876,
        3874,
        3873,
        3865,
        3863,
        3859,
        3858,
        3857,
        3856,
        3855,
        3854,
        3853,
        3851,
        3849,
        3847,
        3845,
        3838,
        3835,
        3834,
        3826,
        3825,
        3824,
        3823,
        3821,
        3819,
        3816,
        3815,
        3813,
        3811,
        3809,
        3808,
        3807,
        3805,
        3804,
        3793,
        3792,
        3790,
        3788,
        3787,
        3785,
        3778,
        3777,
        3776,
        3774,
        3771,
        3770,
        3768,
        3763,
        3756,
        3751,
        3746,
        3744,
        3735,
        3731,
        3729,
        3728,
        3725,
        3715,
        3714,
        3713,
        3711,
        3710,
        3709,
        3707,
        3699,
        3698,
        3697,
        3696,
        3694,
        3690,
        3688,
        3687,
        3683,
        3682,
        3681,
        3680,
        3673,
        3672,
        3668,
        3662,
        3659,
        3656,
        3650,
        3647,
        3646,
        3645,
        3643,
        3641,
        3639,
        3638,
        3637,
        3636,
        3634,
        3633,
        3625,
        3623,
        3622,
        3620,
        3610,
        3609,
        3606,
        3598,
        3596,
        3593,
        3591,
        3589,
        3582,
        3581,
        3579,
        3576,
        3572,
        3570,
        3557,
        3554,
        3553,
        3549,
        3545,
        3543,
        3542,
        3541,
        3535,
        3533,
        3530,
        3529,
        3527,
        3525,
        3524,
        3523,
        3522,
        3520,
        3516,
        3515,
        3512,
        3511,
        3509,
        3508,
        3507,
        3505,
        3501,
        3499,
        3498,
        3496,
        3495,
        3487,
        3485,
        3474,
        3471,
        3466,
        3465,
        3464,
        3463,
        3452,
        3448,
        3447,
        3446,
        3445,
        3444,
        3441,
        3440,
        3435,
        3431,
        3426,
        3425,
        3421,
        3420,
        3419,
        3418,
        3417,
        3412,
        3407,
        3406,
        3404,
        3401,
        3400,
        3398,
        3396,
        3395,
        3392,
        3387,
        3386,
        3384,
        3383,
        3375,
        3372,
        3371,
        3370,
        3367,
        3364,
        3363,
        3359,
        3358,
        3357,
        3354,
        3353,
        3351,
        3346,
        3344,
        3343,
        3342,
        3338,
        3337,
        3335,
        3334,
        3333,
        3332,
        3327,
        3326,
        3325,
        3315,
        3314,
        3313,
        3311,
        3310,
        3299,
        3296,
        3292,
        3286,
        3285,
        3281,
        3277,
        3276,
        3275,
        3273,
        3272,
        3269,
        3266,
        3264,
        3263,
        3261,
        3260,
        3259,
        3255,
        3249,
        3246,
        3236,
        3235,
        3234,
        3228,
        3226,
        3225,
        3224,
        3223,
        3218,
        3216,
        3215,
        3212,
        3210,
        3209,
        3203,
        3201,
        3199,
        3197,
        3196,
        3192,
        3190,
        3183,
        3174,
        3168,
        3167,
        3164,
        3163,
        3156,
        3155,
        3154,
        3153,
        3152,
        3149,
        3148,
        3146,
        3145,
        3138,
        3137,
        3132,
        3131,
        3130,
        3129,
        3126,
        3125,
        3123,
        3119,
        3118,
        3117,
        3115,
        3107,
        3105,
        3103,
        3102,
        3101,
        3100,
        3098,
        3095,
        3091,
        3082,
        3081,
        3077,
        3073,
        3071,
        3059,
        3058,
        3057,
        3051,
        3049,
        3045,
        3044,
        3043,
        3039,
        3038,
        3037,
        3036,
        3034,
        3031,
        3029,
        3027,
        3026,
        3025,
        3020,
        3018,
        3012,
        3007,
        3006,
        3002,
        3001,
        3000,
        2998,
        2997,
        2995,
        2993,
        2989,
        2987,
        2983,
        2980,
        2978,
        2971,
        2968,
        2965,
        2962,
        2961,
        2960,
        2959,
        2957,
        2956,
        2955,
        2950,
        2945,
        2944,
        2942,
        2941,
        2940,
        2939,
        2937,
        2936,
        2933,
        2931,
        2927,
        2925,
        2922,
        2919,
        2914,
        2913,
        2912,
        2910,
        2909,
        2908,
        2907,
        2904,
        2903,
        2902,
        2894,
        2892,
        2890,
        2886,
        2885,
        2884,
        2883,
        2882,
        2867,
        2864,
        2862,
        2858,
        2848,
        2847,
        2846,
        2844,
        2840,
        2839,
        2838,
        2837,
        2836,
        2835,
        2831,
        2829,
        2825,
        2823,
        2820,
        2807,
        2806,
        2803,
        2796,
        2791,
        2789,
        2786,
        2784,
        2783,
        2777,
        2776,
        2769,
        2766,
        2758,
        2755,
        2750,
        2742,
        2740,
        2738,
        2737,
        2736,
        2732,
        2730,
        2725,
        2724,
        2718,
        2717,
        2713,
        2711,
        2706,
        2693,
        2690,
        2689,
        2683,
        2679,
        2677,
        2676,
        2673,
        2670,
        2668,
        2667,
        2660,
        2658,
        2655,
        2653,
        2649,
        2647,
        2644,
        2641,
        2639,
        2638,
        2637,
        2636,
        2635,
        2631,
        2628,
        2626,
        2621,
        2618,
        2608,
        2606,
        2605,
        2602,
        2600,
        2599,
        2598,
        2595,
        2592,
        2591,
        2581,
        2574,
        2573,
        2569,
        2567,
        2565,
        2560,
        2554,
        2553,
        2537,
        2533,
        2525,
        2524,
        2523,
        2519,
        2515,
        2512,
        2511,
        2508,
        2507,
        2506,
        2505,
        2500,
        2493,
        2491,
        2490,
        2489,
        2488,
        2486,
        2485,
        2484,
        2483,
        2480,
        2477,
        2475,
        2474,
        2470,
        2469,
        2467,
        2460,
        2459,
        2454,
        2452,
        2449,
        2448,
        2446,
        2445,
        2444,
        2439,
        2438,
        2437,
        2435,
        2426,
        2425,
        2424,
        2421,
        2420,
        2412,
        2411,
        2408,
        2407,
        2406,
        2403,
        2399,
        2397,
        2396,
        2390,
        2389,
        2388,
        2385,
        2383,
        2374,
        2371,
        2370,
        2369,
        2360,
        2353,
        2350,
        2344,
        2336,
        2335,
        2334,
        2327,
        2326,
        2325,
        2324,
        2323,
        2320,
        2315,
        2313,
        2312,
        2311,
        2310,
        2309,
        2308,
        2307,
        2306,
        2299,
        2298,
        2296,
        2294,
        2293,
        2292,
        2291,
        2290,
        2289,
        2288,
        2287,
        2286,
        2283,
        2276,
        2275,
        2272,
        2271,
        2270,
        2268,
        2267,
        2265,
        2264,
        2263,
        2262,
        2255,
        2254,
        2252,
        2251,
        2242,
        2240,
        2237,
        2236,
        2223,
        2217,
        2212,
        2209,
        2206,
        2201,
        2198,
        2195,
        2184,
        2183,
        2182,
        2181,
        2171,
        2170,
        2169,
        2163,
        2155,
        2154,
        2153,
        2152,
        2147,
        2143,
        2135,
        2134,
        2132,
        2126,
        2125,
        2124,
        2119,
        2118,
        2115,
        2111,
        2110,
        2108,
        2104,
        2091,
        2089,
        2085,
        2083,
        2081,
        2074,
        2073,
        2072,
        2069,
        2068,
        2061,
        2059,
        2048,
        2040,
        2035,
        2027,
        2024,
        2017,
        2012,
        2011,
        2007,
        2004,
        2001,
        1997,
        1996,
        1994,
        1993,
        1992,
        1991,
        1990,
        1989,
        1987,
        1982,
        1979,
        1978,
        1969,
        1965,
        1953,
        1947,
        1939,
        1919,
        1882,
        1870,
        1866,
        1864,
        1862,
        1861,
        1857,
        1851,
        1849,
        1845,
        1842,
        1841,
        1837,
        1834,
        1831,
        1823,
        1820,
        1819,
        1814,
        1809,
        1798,
        1794,
        1786,
        1779,
        1777,
        1770,
        1767,
        1761,
        1757,
        1756,
        1754,
        1746,
        1741,
        1740,
        1737,
        1736,
        1733,
        1727,
        1726,
        1723,
        1721,
        1719,
        1717,
        1708,
        1705,
        1703,
        1701,
        1699,
        1695,
        1692,
        1689,
        1686,
        1685,
        1683,
        1682,
        1677,
        1672,
        1671,
        1670,
        1667,
        1666,
        1665,
        1664,
        1663,
        1657,
        1655,
        1651,
        1644,
        1634,
        1632,
        1631,
        1619,
        1618,
        1617,
        1614,
        1610,
        1605,
        1601,
        1599,
        1592,
        1586,
        1583,
        1574,
        1572,
        1562,
        1561,
        1549,
        1546,
        1538,
        1536,
        1533,
        1525,
        1524,
        1518,
        1514,
        1511,
        1510,
        1509,
        1498,
        1494,
        1486,
        1480,
        1478,
        1475,
        1466,
        1465,
        1464,
        1455,
        1454,
        1447,
        1440,
        1437,
        1435,
        1426,
        1419,
        1418,
        1413,
        1409,
        1408,
        1405,
        1403,
        1401,
        1393,
        1386,
        1383,
        1382,
        1378,
        1371,
        1370,
        1363,
        1350,
        1348,
        1336,
        1335,
        1334,
        1333,
        1329,
        1328,
        1308,
        1307,
        1295,
        1284,
        1279,
        1275,
        1262,
        1258,
        1255,
        1246,
        1244,
        1242,
        1237,
        1232,
        1231,
        1223,
        1217,
        1215,
        1208,
        1197,
        1190,
        1186,
        1177,
        1158,
        1156,
        1153,
        1152,
        1136,
        1134,
        1124,
        1123,
        1113,
        1109,
        1104,
        1098,
        1096,
        1083,
        1077,
        1071,
        1069,
        1068,
        1064,
        1063,
        1056,
        1055,
        1053,
        1050,
        1049,
        1046,
        1045,
        1043,
        1041,
        1039,
        1036,
        1035,
        1029,
        1025,
        1018,
        1013,
        1011,
        1007,
        1000,
        996,
        993,
        992,
        984,
        981,
        970,
        968,
        960,
        955,
        950,
        942,
        940,
        939,
        935,
        934,
        927,
        920,
        916,
        913,
        911,
        910,
        903,
        902,
        901,
        899,
        898,
        896,
        890,
        889,
        888,
        886,
        882,
        871,
        867,
        863,
        859,
        856,
        845,
        843,
        841,
        840,
        838,
        832,
        830,
        816,
        807,
        795,
        792,
        789,
        786,
        775,
        773,
        765,
        761,
        758,
        754,
        752,
        749,
        740,
        735,
        731,
        729,
        727,
        722,
        710,
        707,
        704,
        702,
        698,
        696,
        693,
        691,
        690,
        687,
        685,
        681,
        675,
        674,
        671,
        670,
        667,
        666,
        664,
        661,
        656,
        653,
        651,
        648,
        646,
        642,
        638,
        636,
        634,
        622,
        619,
        616,
        612,
        601,
        599,
        591,
        590,
        585,
        584,
        573,
        572,
        569,
        564,
        539,
        536,
        528,
        524,
        518,
        514,
        506,
        503,
        501,
        486,
        482,
        479,
        474,
        473,
        470,
        462,
        440,
        438,
        427,
        389,
        386,
        370,
        362,
        345,
        343,
        327,
        290,
        285,
        282,
        278,
        276,
        243,
        228,
        225,
        217,
        200,
        193,
        187,
        148,
        143,
        110,
        100,
        87,
        85,
        84,
        80,
        74,
        68,
        65,
        59,
        56,
        53,
        52,
        47,
        29,
        25,
        19,
        16,
        15,
        14,
        13
    ],
    "finished": true
}