{
    "commits": [
        {
            "diff": "elastic_elasticsearch/issue_49296/commit_4b934de1abe4b0b9a149409235a0222594df04ad.diff",
            "diff_additions": 45,
            "diff_deletions": 7,
            "diff_file_size": 30393,
            "files": [
                {
                    "file_additions": 16,
                    "file_deletions": 1,
                    "file_exists": true,
                    "file_name": "server/src/main/java/org/elasticsearch/common/geo/GeometryIO.java",
                    "file_size": 11368
                },
                {
                    "file_additions": 1,
                    "file_deletions": 1,
                    "file_exists": true,
                    "file_name": "server/src/main/java/org/elasticsearch/common/geo/builders/CircleBuilder.java",
                    "file_size": 5788
                },
                {
                    "file_additions": 3,
                    "file_deletions": 1,
                    "file_exists": true,
                    "file_name": "server/src/main/java/org/elasticsearch/index/query/LegacyGeoShapeQueryProcessor.java",
                    "file_size": 9027
                },
                {
                    "file_additions": 0,
                    "file_deletions": 4,
                    "file_exists": true,
                    "file_name": "server/src/test/java/org/elasticsearch/common/geo/GeometryIOTests.java",
                    "file_size": 4210
                },
                {
                    "file_additions": 25,
                    "file_deletions": 0,
                    "file_exists": false,
                    "file_name": "server/src/test/java/org/elasticsearch/search/geo/LegacyGeoShapeIntegrationIT.java",
                    "file_size": 0
                }
            ],
            "interesting": {
                "reopened": false,
                "status": true
            },
            "sha": "4b934de1abe4b0b9a149409235a0222594df04ad"
        },
        {
            "diff": "elastic_elasticsearch/issue_49296/commit_0130139fd71b6d294781c63871a1a1e8ad4a09c6.diff",
            "diff_additions": 45,
            "diff_deletions": 7,
            "diff_file_size": 30393,
            "files": [
                {
                    "file_additions": 16,
                    "file_deletions": 1,
                    "file_exists": true,
                    "file_name": "server/src/main/java/org/elasticsearch/common/geo/GeometryIO.java",
                    "file_size": 11368
                },
                {
                    "file_additions": 1,
                    "file_deletions": 1,
                    "file_exists": true,
                    "file_name": "server/src/main/java/org/elasticsearch/common/geo/builders/CircleBuilder.java",
                    "file_size": 5788
                },
                {
                    "file_additions": 3,
                    "file_deletions": 1,
                    "file_exists": true,
                    "file_name": "server/src/main/java/org/elasticsearch/index/query/LegacyGeoShapeQueryProcessor.java",
                    "file_size": 9027
                },
                {
                    "file_additions": 0,
                    "file_deletions": 4,
                    "file_exists": true,
                    "file_name": "server/src/test/java/org/elasticsearch/common/geo/GeometryIOTests.java",
                    "file_size": 4210
                },
                {
                    "file_additions": 25,
                    "file_deletions": 0,
                    "file_exists": false,
                    "file_name": "server/src/test/java/org/elasticsearch/search/geo/LegacyGeoShapeIntegrationIT.java",
                    "file_size": 0
                }
            ],
            "interesting": {
                "reopened": false,
                "status": false
            },
            "sha": "0130139fd71b6d294781c63871a1a1e8ad4a09c6"
        },
        {
            "diff": "elastic_elasticsearch/issue_49296/commit_4cb0032c00520bfbbbfcc953c5a9a94572afa7bc.diff",
            "diff_additions": 45,
            "diff_deletions": 7,
            "diff_file_size": 30393,
            "files": [
                {
                    "file_additions": 16,
                    "file_deletions": 1,
                    "file_exists": true,
                    "file_name": "server/src/main/java/org/elasticsearch/common/geo/GeometryIO.java",
                    "file_size": 11368
                },
                {
                    "file_additions": 1,
                    "file_deletions": 1,
                    "file_exists": true,
                    "file_name": "server/src/main/java/org/elasticsearch/common/geo/builders/CircleBuilder.java",
                    "file_size": 5788
                },
                {
                    "file_additions": 3,
                    "file_deletions": 1,
                    "file_exists": true,
                    "file_name": "server/src/main/java/org/elasticsearch/index/query/LegacyGeoShapeQueryProcessor.java",
                    "file_size": 9027
                },
                {
                    "file_additions": 0,
                    "file_deletions": 4,
                    "file_exists": true,
                    "file_name": "server/src/test/java/org/elasticsearch/common/geo/GeometryIOTests.java",
                    "file_size": 4210
                },
                {
                    "file_additions": 25,
                    "file_deletions": 0,
                    "file_exists": false,
                    "file_name": "server/src/test/java/org/elasticsearch/search/geo/LegacyGeoShapeIntegrationIT.java",
                    "file_size": 0
                }
            ],
            "interesting": {
                "reopened": false,
                "status": false
            },
            "sha": "4cb0032c00520bfbbbfcc953c5a9a94572afa7bc"
        }
    ],
    "first_commit": "2019-11-20 18:54:09",
    "last_commit": "2019-11-22 13:50:37",
    "number": 49296,
    "score": 336.02564102564105
}