{
    "covered_issues": [
        55,
        52,
        51,
        47,
        42,
        41,
        40,
        39,
        35,
        34,
        33,
        31,
        29,
        28,
        27,
        23,
        22,
        18,
        13,
        9,
        5,
        2,
        1
    ],
    "finished": true
}