{
    "category": [
        "hardware/OS",
        "feature request"
    ],
    "commits": [
        {
            "associated_pull_request": [],
            "date": "2017-02-09 08:02:53",
            "diff": "rsyslog_rsyslog/issue_1279/commit_6580f9e9e8e9cb60d0cea85b1cdf82a3fa502e01.diff",
            "diff_additions": 20,
            "diff_deletions": 0,
            "diff_file_size": 151646,
            "diff_url": "https://github.com/rsyslog/rsyslog/commit/6580f9e9e8e9cb60d0cea85b1cdf82a3fa502e01.diff",
            "exists": true,
            "files": [
                {
                    "file_additions": 20,
                    "file_deletions": 0,
                    "file_exists": true,
                    "file_name": "grammar/rainerscript.c",
                    "file_size": 151646
                }
            ],
            "interesting": {
                "reopen": false,
                "status": false
            },
            "is_parent": true,
            "sha": "6580f9e9e8e9cb60d0cea85b1cdf82a3fa502e01"
        },
        {
            "associated_pull_request": [],
            "date": "2017-02-09 13:14:05",
            "diff": "rsyslog_rsyslog/issue_1279/commit_f43a7185cd0f5a43304b22345e0f61b900ed1bd7.diff",
            "diff_additions": 72,
            "diff_deletions": 6,
            "diff_file_size": 151646,
            "diff_url": "https://github.com/rsyslog/rsyslog/commit/f43a7185cd0f5a43304b22345e0f61b900ed1bd7.diff",
            "exists": true,
            "files": [
                {
                    "file_additions": 72,
                    "file_deletions": 6,
                    "file_exists": true,
                    "file_name": "grammar/rainerscript.c",
                    "file_size": 151646
                }
            ],
            "interesting": {
                "reopen": false,
                "status": true
            },
            "is_parent": false,
            "sha": "f43a7185cd0f5a43304b22345e0f61b900ed1bd7"
        },
        {
            "associated_pull_request": [],
            "date": "2017-02-09 08:02:53",
            "diff": "rsyslog_rsyslog/issue_1279/commit_49b5ef4ac26a59eb6789f464b0b7881f15642761.diff",
            "diff_additions": 86,
            "diff_deletions": 1,
            "diff_file_size": 151646,
            "diff_url": "https://github.com/rsyslog/rsyslog/commit/49b5ef4ac26a59eb6789f464b0b7881f15642761.diff",
            "exists": true,
            "files": [
                {
                    "file_additions": 86,
                    "file_deletions": 1,
                    "file_exists": true,
                    "file_name": "grammar/rainerscript.c",
                    "file_size": 151646
                }
            ],
            "interesting": {
                "reopen": false,
                "status": false
            },
            "is_parent": false,
            "sha": "49b5ef4ac26a59eb6789f464b0b7881f15642761"
        },
        {
            "associated_pull_request": [],
            "date": "2017-02-09 08:02:53",
            "diff": "rsyslog_rsyslog/issue_1279/commit_07f158cb508d38b38c2fb2bdfac7fdd9ed5d4361.diff",
            "diff_additions": 86,
            "diff_deletions": 1,
            "diff_file_size": 151646,
            "diff_url": "https://github.com/rsyslog/rsyslog/commit/07f158cb508d38b38c2fb2bdfac7fdd9ed5d4361.diff",
            "exists": true,
            "files": [
                {
                    "file_additions": 86,
                    "file_deletions": 1,
                    "file_exists": true,
                    "file_name": "grammar/rainerscript.c",
                    "file_size": 151646
                }
            ],
            "interesting": {
                "reopen": false,
                "status": true
            },
            "is_parent": false,
            "sha": "07f158cb508d38b38c2fb2bdfac7fdd9ed5d4361"
        },
        {
            "associated_pull_request": [],
            "date": "2017-02-09 08:02:53",
            "diff": "rsyslog_rsyslog/issue_1279/commit_85a5ed6214845ca086f93cdce36247d77def55bc.diff",
            "diff_additions": 86,
            "diff_deletions": 1,
            "diff_file_size": 151646,
            "diff_url": "https://github.com/rsyslog/rsyslog/commit/85a5ed6214845ca086f93cdce36247d77def55bc.diff",
            "exists": true,
            "files": [
                {
                    "file_additions": 86,
                    "file_deletions": 1,
                    "file_exists": true,
                    "file_name": "grammar/rainerscript.c",
                    "file_size": 151646
                }
            ],
            "interesting": {
                "reopen": false,
                "status": false
            },
            "is_parent": false,
            "sha": "85a5ed6214845ca086f93cdce36247d77def55bc"
        },
        {
            "associated_pull_request": [],
            "date": "2017-02-09 08:02:53",
            "diff": "rsyslog_rsyslog/issue_1279/commit_9f55c864c62093fe3b49c2c558fc85598c80b822.diff",
            "diff_additions": 87,
            "diff_deletions": 1,
            "diff_file_size": 151646,
            "diff_url": "https://github.com/rsyslog/rsyslog/commit/9f55c864c62093fe3b49c2c558fc85598c80b822.diff",
            "exists": true,
            "files": [
                {
                    "file_additions": 87,
                    "file_deletions": 1,
                    "file_exists": true,
                    "file_name": "grammar/rainerscript.c",
                    "file_size": 151646
                }
            ],
            "interesting": {
                "reopen": false,
                "status": true
            },
            "is_parent": false,
            "sha": "9f55c864c62093fe3b49c2c558fc85598c80b822"
        },
        {
            "associated_pull_request": [
                "https://github.com/rsyslog/rsyslog/pull/1405"
            ],
            "date": "2017-02-09 08:02:53",
            "diff": "rsyslog_rsyslog/issue_1279/commit_00c2b4a4ae73b17dd14f03414e488f39e3dae502.diff",
            "diff_additions": 87,
            "diff_deletions": 1,
            "diff_file_size": 151646,
            "diff_url": "https://github.com/rsyslog/rsyslog/commit/00c2b4a4ae73b17dd14f03414e488f39e3dae502.diff",
            "exists": true,
            "files": [
                {
                    "file_additions": 87,
                    "file_deletions": 1,
                    "file_exists": true,
                    "file_name": "grammar/rainerscript.c",
                    "file_size": 151646
                }
            ],
            "interesting": {
                "reopen": false,
                "status": false
            },
            "is_parent": false,
            "sha": "00c2b4a4ae73b17dd14f03414e488f39e3dae502"
        }
    ],
    "first_commit": "2017-02-09 08:37:18",
    "last_commit": "2017-02-10 14:13:07",
    "number": 1279,
    "pull_request": "None",
    "score": {
        "accidental_reopen_likely": false,
        "all_labels": [
            "enhancement",
            "small"
        ],
        "contains_keywords": [
            "bug",
            "test",
            "issu"
        ],
        "fix_size": 90,
        "has_labels": [],
        "intersecting": {
            "computed_score": 1.0,
            "final_commit_size": 88,
            "intersection_size": 88,
            "previous_commits_size": 90
        },
        "is_makefile_based": true,
        "no_new_files": [],
        "no_other_files": false,
        "num_prohibited_files": 16626,
        "prohibited_files": [
            "hal/inc/pinmap_hal.h",
            "Debug/marvin.bin",
            "Debug/marvin.elf",
            "Debug/marvin.hex",
            "Debug/marvin.bin",
            "Debug/marvin.elf",
            "Debug/marvin.hex",
            "inc/spark_utilities.h",
            "Debug/marvin.bin",
            "Debug/marvin.elf"
        ],
        "reopen": false,
        "reopen_events": [
            [
                "2017-02-09 16:47:06",
                "commit"
            ],
            [
                "2017-02-09 16:51:51",
                "commit"
            ],
            [
                "2017-02-10 07:45:35",
                "commit"
            ],
            [
                "2017-02-10 07:55:04",
                "commit"
            ],
            [
                "2017-02-10 14:07:43",
                "commit"
            ],
            [
                "2017-02-10 14:13:20",
                "commit"
            ],
            [
                "2017-02-10 16:32:14",
                "closed"
            ]
        ],
        "status": true,
        "strategy": true,
        "total_changes": 535
    }
}