{
    "all_issues": 1273,
    "interesting_issues": 1,
    "last_update": "2023-11-09 11:05:12.510874",
    "license": {
        "download": "undefined",
        "name": "unknown"
    },
    "ratio": 0.0007855459544383347,
    "size": 21949,
    "stars": 551,
    "url": "https://github.com/geany/geany-plugins"
}