{
    "category": [
        "network/protocol",
        "multithreading"
    ],
    "commits": [
        {
            "associated_pull_request": [],
            "date": "2019-11-12 06:19:21",
            "diff": "",
            "diff_additions": 0,
            "diff_deletions": 0,
            "diff_file_size": 0,
            "diff_url": "https://github.com/zephyrproject-rtos/zephyr/commit/cfd26736a738d7610df35ed512097e97ef89e8ce.diff",
            "exists": true,
            "files": [],
            "interesting": {
                "reopen": false,
                "status": true
            },
            "is_parent": true,
            "sha": "cfd26736a738d7610df35ed512097e97ef89e8ce"
        },
        {
            "associated_pull_request": [],
            "date": "2019-11-22 04:28:48",
            "diff": "zephyrproject-rtos_zephyr/issue_20835/commit_8918dd50bf4a402e5473bd85ff67ecdef2790333.diff",
            "diff_additions": 4,
            "diff_deletions": 0,
            "diff_file_size": 34153,
            "diff_url": "https://github.com/zephyrproject-rtos/zephyr/commit/8918dd50bf4a402e5473bd85ff67ecdef2790333.diff",
            "exists": true,
            "files": [
                {
                    "file_additions": 4,
                    "file_deletions": 0,
                    "file_exists": true,
                    "file_name": "drivers/flash/spi_nor.c",
                    "file_size": 34153
                }
            ],
            "interesting": {
                "reopen": false,
                "status": true
            },
            "is_parent": false,
            "sha": "8918dd50bf4a402e5473bd85ff67ecdef2790333"
        },
        {
            "associated_pull_request": [],
            "date": "2019-11-22 04:28:48",
            "diff": "zephyrproject-rtos_zephyr/issue_20835/commit_1086ecfc903436ceaf7799752cd1c8a11bd62448.diff",
            "diff_additions": 4,
            "diff_deletions": 0,
            "diff_file_size": 34153,
            "diff_url": "https://github.com/zephyrproject-rtos/zephyr/commit/1086ecfc903436ceaf7799752cd1c8a11bd62448.diff",
            "exists": true,
            "files": [
                {
                    "file_additions": 4,
                    "file_deletions": 0,
                    "file_exists": true,
                    "file_name": "drivers/flash/spi_nor.c",
                    "file_size": 34153
                }
            ],
            "interesting": {
                "reopen": true,
                "status": false
            },
            "is_parent": false,
            "sha": "1086ecfc903436ceaf7799752cd1c8a11bd62448"
        }
    ],
    "first_commit": "2019-11-19 17:04:20",
    "last_commit": "2019-11-22 14:16:53",
    "number": 20835,
    "pull_request": "None",
    "score": {
        "accidental_reopen_likely": false,
        "all_labels": [
            "Coverity",
            "bug",
            "has-pr",
            "priority: low"
        ],
        "contains_keywords": [
            "fail",
            "warn",
            "chang",
            "reason",
            "error",
            "bug",
            "test",
            "remov",
            "issu",
            "perform",
            "CI"
        ],
        "fix_size": 5,
        "has_labels": [
            "bug"
        ],
        "intersecting": {
            "computed_score": 1.0,
            "final_commit_size": 5,
            "intersection_size": 5,
            "previous_commits_size": 5
        },
        "is_makefile_based": true,
        "no_new_files": [],
        "no_other_files": true,
        "num_prohibited_files": 35013,
        "prohibited_files": [
            "hal/inc/pinmap_hal.h",
            "Debug/marvin.bin",
            "Debug/marvin.elf",
            "Debug/marvin.hex",
            "Debug/marvin.bin",
            "Debug/marvin.elf",
            "Debug/marvin.hex",
            "inc/spark_utilities.h",
            "Debug/marvin.bin",
            "Debug/marvin.elf"
        ],
        "reopen": false,
        "reopen_events": [
            [
                "2019-11-22 04:21:09",
                "commit"
            ],
            [
                "2019-11-22 04:28:00",
                "closed"
            ],
            [
                "2019-11-22 04:32:26",
                "commit"
            ],
            [
                "2019-11-22 14:17:16",
                "commit"
            ],
            [
                "2019-11-22 16:43:11",
                "reopened"
            ],
            [
                "2020-03-19 21:13:54",
                "closed"
            ]
        ],
        "status": true,
        "strategy": true,
        "total_changes": 8
    }
}