{
    "commits": [
        {
            "associated_pull_request": [
                "https://github.com/FRRouting/frr/pull/13446"
            ],
            "date": "2023-05-08 10:44:56+00:00",
            "diff": "frrouting_frr/issue_13447/commit_32a2f283d1fa4e7d5acb3acab96a4bd2e36f189b.diff",
            "diff_additions": 11,
            "diff_deletions": 5,
            "diff_file_size": 48651,
            "diff_url": "https://github.com/FRRouting/frr/commit/32a2f283d1fa4e7d5acb3acab96a4bd2e36f189b.diff",
            "exists": true,
            "files": [
                {
                    "file_additions": 11,
                    "file_deletions": 5,
                    "file_exists": true,
                    "file_name": "bgpd/bgp_ecommunity.c",
                    "file_size": 48651
                }
            ],
            "interesting": {
                "reopen": false,
                "status": false
            },
            "is_parent": true,
            "sha": "32a2f283d1fa4e7d5acb3acab96a4bd2e36f189b"
        },
        {
            "associated_pull_request": [],
            "date": "2023-05-08 14:07:54+00:00",
            "diff": "frrouting_frr/issue_13447/commit_75c8ad22329db2338431eda98497c5790446a357.diff",
            "diff_additions": 1,
            "diff_deletions": 1,
            "diff_file_size": 99209,
            "diff_url": "https://github.com/FRRouting/frr/commit/75c8ad22329db2338431eda98497c5790446a357.diff",
            "exists": true,
            "files": [
                {
                    "file_additions": 1,
                    "file_deletions": 1,
                    "file_exists": true,
                    "file_name": "ripd/ripd.c",
                    "file_size": 99209
                }
            ],
            "interesting": {
                "reopen": false,
                "status": true
            },
            "is_parent": false,
            "sha": "75c8ad22329db2338431eda98497c5790446a357"
        },
        {
            "associated_pull_request": [
                "https://github.com/FRRouting/frr/pull/13468"
            ],
            "date": "2023-05-08 14:07:54+00:00",
            "diff": "frrouting_frr/issue_13447/commit_76f444a5d3184d60fa20a95672c3cb7799926696.diff",
            "diff_additions": 2,
            "diff_deletions": 1,
            "diff_file_size": 99209,
            "diff_url": "https://github.com/FRRouting/frr/commit/76f444a5d3184d60fa20a95672c3cb7799926696.diff",
            "exists": true,
            "files": [
                {
                    "file_additions": 2,
                    "file_deletions": 1,
                    "file_exists": true,
                    "file_name": "ripd/ripd.c",
                    "file_size": 99209
                }
            ],
            "interesting": {
                "reopen": false,
                "status": false
            },
            "is_parent": false,
            "sha": "76f444a5d3184d60fa20a95672c3cb7799926696"
        }
    ],
    "first_commit": "2023-05-08 10:44:56+00:00",
    "last_commit": "2023-05-08 15:30:50+00:00",
    "number": 13447,
    "pull_request": "None",
    "score": {
        "accidental_reopen_likely": false,
        "all_labels": [
            "triage"
        ],
        "contains_keywords": [
            "fix",
            "crash"
        ],
        "fix_size": 4,
        "has_labels": [],
        "intersecting": {
            "computed_score": 0.5,
            "final_commit_size": 4,
            "intersection_size": 2,
            "previous_commits_size": 2
        },
        "is_makefile_based": true,
        "no_new_files": [],
        "no_other_files": true,
        "num_prohibited_files": 107106,
        "prohibited_files": [
            "server/src/main/java/com/genymobile/scrcpy/Device.java",
            "server/src/main/java/com/genymobile/scrcpy/wrappers/SurfaceControl.java",
            "server/src/main/java/com/genymobile/scrcpy/Device.java",
            "server/src/main/java/com/genymobile/scrcpy/wrappers/SurfaceControl.java",
            "app/meson.build",
            "app/scrcpy.1",
            "app/src/common.h",
            "app/src/scrcpy.h",
            "app/src/server.h",
            "server/src/main/java/com/genymobile/scrcpy/Workarounds.java"
        ],
        "reopen": false,
        "reopen_events": [
            [
                "2023-05-08 14:09:57+00:00",
                "commit"
            ],
            [
                "2023-05-08 15:31:02+00:00",
                "commit"
            ],
            [
                "2023-05-08 19:15:16+00:00",
                "closed"
            ]
        ],
        "status": true,
        "strategy": true,
        "total_changes": 21
    }
}