{
    "covered_issues": [
        1759,
        1741,
        1734,
        1711,
        1704,
        1700,
        1691,
        1628,
        1623,
        1621,
        1616,
        1614,
        1607,
        1602,
        1579,
        1565,
        1554,
        1537,
        1529,
        1500,
        1489,
        1466,
        1463,
        1459,
        1453,
        1435,
        1434,
        1432,
        1425,
        1421,
        1409,
        1404,
        1395,
        1382,
        1345,
        1333,
        1323,
        1322,
        1310,
        1309,
        1279,
        1249,
        1247,
        1246,
        1242,
        1237,
        1234,
        1225,
        1223,
        1215,
        1208,
        1200,
        1194,
        1189,
        1179,
        1178,
        1177,
        1175,
        1170,
        1163,
        1156,
        1155,
        1144,
        1140,
        1115,
        1112,
        1104,
        1093,
        1087,
        1071,
        1068,
        1060,
        1056,
        1051,
        1048,
        1032,
        1030,
        1029,
        1028,
        1027,
        1021,
        1020,
        1017,
        1009,
        1005,
        1000,
        996,
        995,
        992,
        987,
        981,
        975,
        974,
        971,
        968,
        966,
        965,
        960,
        958,
        955,
        951,
        943,
        940,
        939,
        938,
        937,
        931,
        924,
        919,
        917,
        908,
        906,
        902,
        894,
        892,
        890,
        887,
        878,
        877,
        874,
        871,
        867,
        865,
        862,
        853,
        849,
        847,
        846,
        839,
        838,
        837,
        835,
        828,
        825,
        821,
        811,
        804,
        800,
        795,
        794,
        791,
        783,
        779,
        778,
        777,
        775,
        774,
        769,
        768,
        764,
        763,
        762,
        757,
        749,
        745,
        724,
        721,
        718,
        708,
        707,
        697,
        693,
        686,
        683,
        678,
        666,
        664,
        653,
        651,
        636,
        629,
        622,
        621,
        612,
        611,
        610,
        608,
        594,
        587,
        584,
        575,
        566,
        562,
        561,
        560,
        554,
        552,
        549,
        547,
        545,
        543,
        538,
        533,
        529,
        527,
        525,
        513,
        482,
        481,
        478,
        473,
        472,
        470,
        463,
        458,
        456,
        452,
        451,
        449,
        448,
        444,
        437,
        436,
        433,
        430,
        428,
        426,
        425,
        424,
        423,
        418,
        417,
        412,
        410,
        404,
        403,
        398,
        389,
        384,
        378,
        373,
        371,
        355,
        352,
        343,
        338,
        335,
        334,
        325,
        324,
        323,
        315,
        311,
        295,
        292,
        283,
        281,
        278,
        277,
        264,
        261,
        260,
        254,
        252,
        234,
        230,
        223,
        222,
        221,
        220,
        218,
        211,
        196,
        194,
        193,
        187,
        186,
        183,
        182,
        176,
        170,
        167,
        166,
        165,
        161,
        160,
        157,
        154,
        151,
        150,
        149,
        148,
        147,
        146,
        145,
        142,
        141,
        140,
        138,
        137,
        136,
        135,
        133,
        130,
        129,
        128,
        127,
        123,
        120,
        118,
        117,
        116,
        115,
        114,
        111,
        107,
        104,
        103,
        102,
        100,
        98,
        88,
        87,
        81,
        72,
        71,
        66,
        65,
        62,
        59,
        57,
        56,
        55,
        54,
        53,
        48,
        40,
        37,
        35,
        33,
        31,
        11,
        7,
        2
    ],
    "finished": true
}