{
    "commits": [
        {
            "associated_pull_request": [],
            "date": "2022-05-30 01:03:06+00:00",
            "diff": "pure-data_pure-data/issue_1678/commit_7420cf93abc98de64620ce73953eac4d96065072.diff",
            "diff_additions": 5,
            "diff_deletions": 2,
            "diff_file_size": 44433,
            "diff_url": "https://github.com/pure-data/pure-data/commit/7420cf93abc98de64620ce73953eac4d96065072.diff",
            "exists": true,
            "files": [
                {
                    "file_additions": 5,
                    "file_deletions": 2,
                    "file_exists": true,
                    "file_name": "src/x_connective.c",
                    "file_size": 44433
                }
            ],
            "interesting": {
                "reopen": false,
                "status": false
            },
            "is_parent": true,
            "sha": "7420cf93abc98de64620ce73953eac4d96065072"
        },
        {
            "associated_pull_request": [],
            "date": "2022-05-30 01:09:54+00:00",
            "diff": "pure-data_pure-data/issue_1678/commit_c42157b1c3ff54f9848485671c7ec80d02243ed0.diff",
            "diff_additions": 5,
            "diff_deletions": 4,
            "diff_file_size": 44433,
            "diff_url": "https://github.com/pure-data/pure-data/commit/c42157b1c3ff54f9848485671c7ec80d02243ed0.diff",
            "exists": true,
            "files": [
                {
                    "file_additions": 5,
                    "file_deletions": 4,
                    "file_exists": true,
                    "file_name": "src/x_connective.c",
                    "file_size": 44433
                }
            ],
            "interesting": {
                "reopen": false,
                "status": false
            },
            "is_parent": false,
            "sha": "c42157b1c3ff54f9848485671c7ec80d02243ed0"
        },
        {
            "associated_pull_request": [
                "https://github.com/pure-data/pure-data/pull/1680"
            ],
            "date": "2022-05-30 19:45:56+00:00",
            "diff": "pure-data_pure-data/issue_1678/commit_8628882b4cf5b6b1ff7d0e8e0cced537d76746c0.diff",
            "diff_additions": 4,
            "diff_deletions": 1,
            "diff_file_size": 44433,
            "diff_url": "https://github.com/pure-data/pure-data/commit/8628882b4cf5b6b1ff7d0e8e0cced537d76746c0.diff",
            "exists": true,
            "files": [
                {
                    "file_additions": 4,
                    "file_deletions": 1,
                    "file_exists": true,
                    "file_name": "src/x_connective.c",
                    "file_size": 44433
                }
            ],
            "interesting": {
                "reopen": false,
                "status": false
            },
            "is_parent": false,
            "sha": "8628882b4cf5b6b1ff7d0e8e0cced537d76746c0"
        },
        {
            "associated_pull_request": [
                "https://github.com/pure-data/pure-data/pull/1680"
            ],
            "date": "2022-05-30 23:30:28+00:00",
            "diff": "pure-data_pure-data/issue_1678/commit_03e30d35a7a623fb3326cef420b52f81161d0c3a.diff",
            "diff_additions": 2,
            "diff_deletions": 3,
            "diff_file_size": 44433,
            "diff_url": "https://github.com/pure-data/pure-data/commit/03e30d35a7a623fb3326cef420b52f81161d0c3a.diff",
            "exists": true,
            "files": [
                {
                    "file_additions": 2,
                    "file_deletions": 3,
                    "file_exists": true,
                    "file_name": "src/x_connective.c",
                    "file_size": 44433
                }
            ],
            "interesting": {
                "reopen": true,
                "status": false
            },
            "is_parent": false,
            "sha": "03e30d35a7a623fb3326cef420b52f81161d0c3a"
        },
        {
            "associated_pull_request": [
                "https://github.com/pure-data/pure-data/pull/1680"
            ],
            "date": "2022-05-30 23:30:28+00:00",
            "diff": "pure-data_pure-data/issue_1678/commit_03e30d35a7a623fb3326cef420b52f81161d0c3a.diff",
            "diff_additions": 2,
            "diff_deletions": 3,
            "diff_file_size": 44433,
            "diff_url": "https://github.com/pure-data/pure-data/commit/03e30d35a7a623fb3326cef420b52f81161d0c3a.diff",
            "exists": true,
            "files": [
                {
                    "file_additions": 2,
                    "file_deletions": 3,
                    "file_exists": true,
                    "file_name": "src/x_connective.c",
                    "file_size": 44433
                }
            ],
            "interesting": {
                "reopen": false,
                "status": false
            },
            "is_parent": false,
            "sha": "03e30d35a7a623fb3326cef420b52f81161d0c3a"
        }
    ],
    "first_commit": "2022-05-30 01:03:06+00:00",
    "last_commit": "2022-05-30 23:30:28+00:00",
    "number": 1678,
    "pull_request": "None",
    "score": {
        "accidental_reopen_likely": false,
        "all_labels": [
            "bug/fix",
            "pending"
        ],
        "contains_keywords": [
            "fix",
            "issu"
        ],
        "fix_size": 12,
        "has_labels": [],
        "intersecting": {
            "computed_score": 1.0,
            "final_commit_size": 4,
            "intersection_size": 4,
            "previous_commits_size": 12
        },
        "is_makefile_based": true,
        "no_new_files": [],
        "no_other_files": true,
        "num_prohibited_files": 253620,
        "prohibited_files": [
            "server/src/main/java/com/genymobile/scrcpy/Device.java",
            "server/src/main/java/com/genymobile/scrcpy/wrappers/SurfaceControl.java",
            "server/src/main/java/com/genymobile/scrcpy/Device.java",
            "server/src/main/java/com/genymobile/scrcpy/wrappers/SurfaceControl.java",
            "app/meson.build",
            "app/scrcpy.1",
            "app/src/common.h",
            "app/src/scrcpy.h",
            "app/src/server.h",
            "server/src/main/java/com/genymobile/scrcpy/Workarounds.java"
        ],
        "reopen": true,
        "reopen_events": [
            [
                "2022-05-30 01:09:57+00:00",
                "commit"
            ],
            [
                "2022-05-30 19:45:59+00:00",
                "commit"
            ],
            [
                "2022-05-30 23:30:29+00:00",
                "commit"
            ],
            [
                "2022-05-30 23:31:29+00:00",
                "closed"
            ],
            [
                "2022-05-30 23:32:15+00:00",
                "reopened"
            ],
            [
                "2022-09-01 17:15:52+00:00",
                "closed"
            ],
            [
                "2022-09-01 17:15:52+00:00",
                "commit"
            ]
        ],
        "status": false,
        "strategy": true,
        "total_changes": 31
    }
}