{
    "covered_issues": [
        262,
        254,
        240,
        229,
        223,
        209,
        180,
        175,
        174,
        169,
        162,
        161,
        157,
        146,
        144,
        143,
        142,
        134,
        132,
        131,
        129,
        128,
        127,
        125,
        120,
        119,
        118,
        116,
        114,
        111,
        110,
        98,
        97,
        94,
        92,
        90,
        88,
        82,
        79,
        78,
        77,
        76,
        73,
        71,
        70,
        69,
        68,
        62,
        61,
        58,
        56,
        55,
        54,
        51,
        47,
        46,
        45,
        42,
        40,
        39,
        38,
        37,
        35,
        31,
        29,
        27,
        24,
        15,
        11,
        8,
        1
    ],
    "finished": true
}