{
    "category": [
        "GUI",
        "control flow"
    ],
    "commits": [
        {
            "associated_pull_request": [],
            "date": "2018-05-18 10:00:09",
            "diff": "gpac_gpac/issue_1053/commit_6344c636c87ffe3d41b9c7228a36a23dfeae323d.diff",
            "diff_additions": 5,
            "diff_deletions": 14,
            "diff_file_size": 353716,
            "diff_url": "https://github.com/gpac/gpac/commit/6344c636c87ffe3d41b9c7228a36a23dfeae323d.diff",
            "exists": true,
            "files": [
                {
                    "file_additions": 5,
                    "file_deletions": 14,
                    "file_exists": true,
                    "file_name": "src/media_tools/dash_client.c",
                    "file_size": 353716
                }
            ],
            "interesting": {
                "reopen": false,
                "status": true
            },
            "is_parent": true,
            "sha": "6344c636c87ffe3d41b9c7228a36a23dfeae323d"
        },
        {
            "associated_pull_request": [],
            "date": "2018-05-18 12:51:59",
            "diff": "gpac_gpac/issue_1053/commit_168d27afa4c6408a743174579c12d4b738eb1b79.diff",
            "diff_additions": 156,
            "diff_deletions": 104,
            "diff_file_size": 168016,
            "diff_url": "https://github.com/gpac/gpac/commit/168d27afa4c6408a743174579c12d4b738eb1b79.diff",
            "exists": true,
            "files": [
                {
                    "file_additions": 35,
                    "file_deletions": 25,
                    "file_exists": true,
                    "file_name": "src/isomedia/drm_sample.c",
                    "file_size": 67077
                },
                {
                    "file_additions": 7,
                    "file_deletions": 3,
                    "file_exists": true,
                    "file_name": "src/isomedia/track.c",
                    "file_size": 60525
                },
                {
                    "file_additions": 110,
                    "file_deletions": 72,
                    "file_exists": false,
                    "file_name": "src/media_tools/ismacryp.c",
                    "file_size": 0
                },
                {
                    "file_additions": 4,
                    "file_deletions": 4,
                    "file_exists": true,
                    "file_name": "src/utils/bitstream.c",
                    "file_size": 40414
                }
            ],
            "interesting": {
                "reopen": false,
                "status": true
            },
            "is_parent": false,
            "sha": "168d27afa4c6408a743174579c12d4b738eb1b79"
        },
        {
            "associated_pull_request": [],
            "date": "2018-05-23 15:47:47",
            "diff": "gpac_gpac/issue_1053/commit_d0a23a8f92b4d3659df8a1ad57818ad953644156.diff",
            "diff_additions": 40,
            "diff_deletions": 10,
            "diff_file_size": 315501,
            "diff_url": "https://github.com/gpac/gpac/commit/d0a23a8f92b4d3659df8a1ad57818ad953644156.diff",
            "exists": true,
            "files": [
                {
                    "file_additions": 6,
                    "file_deletions": 5,
                    "file_exists": true,
                    "file_name": "src/media_tools/av_parsers.c",
                    "file_size": 315501
                },
                {
                    "file_additions": 34,
                    "file_deletions": 5,
                    "file_exists": false,
                    "file_name": "src/media_tools/ismacryp.c",
                    "file_size": 0
                }
            ],
            "interesting": {
                "reopen": true,
                "status": true
            },
            "is_parent": false,
            "sha": "d0a23a8f92b4d3659df8a1ad57818ad953644156"
        },
        {
            "associated_pull_request": [],
            "date": "2018-05-24 08:01:52",
            "diff": "gpac_gpac/issue_1053/commit_b052cb21e56f96b66d948bef87d6f3e4c2ccd2ff.diff",
            "diff_additions": 38,
            "diff_deletions": 40,
            "diff_file_size": 315501,
            "diff_url": "https://github.com/gpac/gpac/commit/b052cb21e56f96b66d948bef87d6f3e4c2ccd2ff.diff",
            "exists": true,
            "files": [
                {
                    "file_additions": 33,
                    "file_deletions": 29,
                    "file_exists": true,
                    "file_name": "src/media_tools/av_parsers.c",
                    "file_size": 315501
                },
                {
                    "file_additions": 5,
                    "file_deletions": 11,
                    "file_exists": false,
                    "file_name": "src/media_tools/ismacryp.c",
                    "file_size": 0
                }
            ],
            "interesting": {
                "reopen": true,
                "status": true
            },
            "is_parent": false,
            "sha": "b052cb21e56f96b66d948bef87d6f3e4c2ccd2ff"
        },
        {
            "associated_pull_request": [],
            "date": "2018-05-29 12:12:47",
            "diff": "gpac_gpac/issue_1053/commit_ff59dfa022cbcde71e0b666c08f915ac1733b119.diff",
            "diff_additions": 208,
            "diff_deletions": 146,
            "diff_file_size": 284195,
            "diff_url": "https://github.com/gpac/gpac/commit/ff59dfa022cbcde71e0b666c08f915ac1733b119.diff",
            "exists": true,
            "files": [
                {
                    "file_additions": 6,
                    "file_deletions": 4,
                    "file_exists": true,
                    "file_name": "src/crypto/g_crypt_openssl.c",
                    "file_size": 6335
                },
                {
                    "file_additions": 18,
                    "file_deletions": 32,
                    "file_exists": true,
                    "file_name": "src/isomedia/drm_sample.c",
                    "file_size": 67077
                },
                {
                    "file_additions": 2,
                    "file_deletions": 5,
                    "file_exists": true,
                    "file_name": "src/isomedia/isom_read.c",
                    "file_size": 175477
                },
                {
                    "file_additions": 1,
                    "file_deletions": 1,
                    "file_exists": true,
                    "file_name": "src/media_tools/dash_segmenter.c",
                    "file_size": 35306
                },
                {
                    "file_additions": 181,
                    "file_deletions": 104,
                    "file_exists": false,
                    "file_name": "src/media_tools/ismacryp.c",
                    "file_size": 0
                }
            ],
            "interesting": {
                "reopen": false,
                "status": true
            },
            "is_parent": false,
            "sha": "ff59dfa022cbcde71e0b666c08f915ac1733b119"
        },
        {
            "associated_pull_request": [],
            "date": "2018-05-30 15:58:43",
            "diff": "gpac_gpac/issue_1053/commit_a6c9dcc2a2ef6b91dd2c0d754c2a670ae2aa8763.diff",
            "diff_additions": 78,
            "diff_deletions": 39,
            "diff_file_size": 0,
            "diff_url": "https://github.com/gpac/gpac/commit/a6c9dcc2a2ef6b91dd2c0d754c2a670ae2aa8763.diff",
            "exists": true,
            "files": [
                {
                    "file_additions": 78,
                    "file_deletions": 39,
                    "file_exists": false,
                    "file_name": "src/media_tools/ismacryp.c",
                    "file_size": 0
                }
            ],
            "interesting": {
                "reopen": false,
                "status": true
            },
            "is_parent": false,
            "sha": "a6c9dcc2a2ef6b91dd2c0d754c2a670ae2aa8763"
        },
        {
            "associated_pull_request": [],
            "date": "2018-05-24 08:01:52",
            "diff": "gpac_gpac/issue_1053/commit_c121002410bc1cf571cc37b1c8f679e08361b5f8.diff",
            "diff_additions": 38,
            "diff_deletions": 40,
            "diff_file_size": 315501,
            "diff_url": "https://github.com/gpac/gpac/commit/c121002410bc1cf571cc37b1c8f679e08361b5f8.diff",
            "exists": true,
            "files": [
                {
                    "file_additions": 33,
                    "file_deletions": 29,
                    "file_exists": true,
                    "file_name": "src/media_tools/av_parsers.c",
                    "file_size": 315501
                },
                {
                    "file_additions": 5,
                    "file_deletions": 11,
                    "file_exists": false,
                    "file_name": "src/media_tools/ismacryp.c",
                    "file_size": 0
                }
            ],
            "interesting": {
                "reopen": false,
                "status": false
            },
            "is_parent": false,
            "sha": "c121002410bc1cf571cc37b1c8f679e08361b5f8"
        }
    ],
    "first_commit": "2018-05-18 10:00:09",
    "last_commit": "2018-05-24 08:01:52",
    "number": 1053,
    "pull_request": "None",
    "score": {
        "accidental_reopen_likely": false,
        "all_labels": [],
        "contains_keywords": [
            "fail",
            "warn",
            "chang",
            "reason",
            "confirm",
            "error",
            "bug",
            "problem",
            "crash",
            "test",
            "fix",
            "patch",
            "issu",
            "work",
            "fault"
        ],
        "fix_size": 685,
        "has_labels": [],
        "intersecting": {
            "computed_score": 1.0,
            "final_commit_size": 69,
            "intersection_size": 69,
            "previous_commits_size": 685
        },
        "is_makefile_based": true,
        "no_new_files": [],
        "no_other_files": false,
        "num_prohibited_files": 125544,
        "prohibited_files": [
            "hal/inc/pinmap_hal.h",
            "Debug/marvin.bin",
            "Debug/marvin.elf",
            "Debug/marvin.hex",
            "Debug/marvin.bin",
            "Debug/marvin.elf",
            "Debug/marvin.hex",
            "inc/spark_utilities.h",
            "Debug/marvin.bin",
            "Debug/marvin.elf"
        ],
        "reopen": true,
        "reopen_events": [
            [
                "2018-05-18 12:52:13",
                "commit"
            ],
            [
                "2018-05-18 12:52:30",
                "closed"
            ],
            [
                "2018-05-23 15:47:56",
                "commit"
            ],
            [
                "2018-05-23 15:48:12",
                "reopened"
            ],
            [
                "2018-05-24 13:35:08",
                "closed"
            ],
            [
                "2018-05-25 07:01:28",
                "commit"
            ],
            [
                "2018-05-28 07:15:21",
                "reopened"
            ],
            [
                "2018-05-29 12:13:04",
                "commit"
            ],
            [
                "2018-05-30 15:58:56",
                "commit"
            ],
            [
                "2018-05-31 11:24:58",
                "closed"
            ],
            [
                "2018-12-12 13:05:29",
                "commit"
            ]
        ],
        "status": false,
        "strategy": true,
        "total_changes": 956
    }
}