{
    "covered_issues": [
        118,
        107,
        105,
        104,
        100,
        98,
        97,
        94,
        91,
        90,
        89,
        87,
        85,
        83,
        78,
        77,
        73,
        67,
        61,
        53,
        51,
        48,
        47,
        46,
        45,
        44,
        43,
        42,
        40,
        39,
        38,
        37,
        35,
        33,
        28,
        27,
        26,
        25,
        24,
        18,
        17,
        15,
        14,
        11,
        9,
        8,
        6
    ],
    "finished": true
}