{
    "category": [
        "multithreading",
        "feature request"
    ],
    "commits": [
        {
            "associated_pull_request": [
                "https://github.com/lz4/lz4/pull/910"
            ],
            "date": "2020-08-27 18:00:28",
            "diff": "lz4_lz4/issue_847/commit_440c8461d71a79ee927ce93077b58ad22d894d28.diff",
            "diff_additions": 92,
            "diff_deletions": 29,
            "diff_file_size": 205075,
            "diff_url": "https://github.com/lz4/lz4/commit/440c8461d71a79ee927ce93077b58ad22d894d28.diff",
            "exists": true,
            "files": [
                {
                    "file_additions": 23,
                    "file_deletions": 16,
                    "file_exists": true,
                    "file_name": "lib/lz4.c",
                    "file_size": 105107
                },
                {
                    "file_additions": 49,
                    "file_deletions": 0,
                    "file_exists": true,
                    "file_name": "tests/decompress-partial.c",
                    "file_size": 2114
                },
                {
                    "file_additions": 20,
                    "file_deletions": 13,
                    "file_exists": true,
                    "file_name": "tests/fuzzer.c",
                    "file_size": 97854
                }
            ],
            "interesting": {
                "reopen": false,
                "status": true
            },
            "is_parent": true,
            "sha": "440c8461d71a79ee927ce93077b58ad22d894d28"
        },
        {
            "associated_pull_request": [
                "https://github.com/lz4/lz4/pull/913"
            ],
            "date": "2020-09-15 20:45:06",
            "diff": "lz4_lz4/issue_847/commit_4f33a5935b36783abb930252e4da487625817ee2.diff",
            "diff_additions": 8,
            "diff_deletions": 0,
            "diff_file_size": 97854,
            "diff_url": "https://github.com/lz4/lz4/commit/4f33a5935b36783abb930252e4da487625817ee2.diff",
            "exists": true,
            "files": [
                {
                    "file_additions": 8,
                    "file_deletions": 0,
                    "file_exists": true,
                    "file_name": "tests/fuzzer.c",
                    "file_size": 97854
                }
            ],
            "interesting": {
                "reopen": false,
                "status": true
            },
            "is_parent": false,
            "sha": "4f33a5935b36783abb930252e4da487625817ee2"
        },
        {
            "associated_pull_request": [
                "https://github.com/lz4/lz4/pull/913"
            ],
            "date": "2020-09-15 21:54:53",
            "diff": "lz4_lz4/issue_847/commit_da1272979f4b79a7066631335a68512350a071fb.diff",
            "diff_additions": 5,
            "diff_deletions": 2,
            "diff_file_size": 97854,
            "diff_url": "https://github.com/lz4/lz4/commit/da1272979f4b79a7066631335a68512350a071fb.diff",
            "exists": true,
            "files": [
                {
                    "file_additions": 5,
                    "file_deletions": 2,
                    "file_exists": true,
                    "file_name": "tests/fuzzer.c",
                    "file_size": 97854
                }
            ],
            "interesting": {
                "reopen": false,
                "status": false
            },
            "is_parent": false,
            "sha": "da1272979f4b79a7066631335a68512350a071fb"
        },
        {
            "associated_pull_request": [
                "https://github.com/lz4/lz4/pull/913"
            ],
            "date": "2020-09-17 06:24:41",
            "diff": "lz4_lz4/issue_847/commit_1328c38a1507e9d6984685451909a6976a49ece9.diff",
            "diff_additions": 11,
            "diff_deletions": 0,
            "diff_file_size": 97854,
            "diff_url": "https://github.com/lz4/lz4/commit/1328c38a1507e9d6984685451909a6976a49ece9.diff",
            "exists": true,
            "files": [
                {
                    "file_additions": 11,
                    "file_deletions": 0,
                    "file_exists": true,
                    "file_name": "tests/fuzzer.c",
                    "file_size": 97854
                }
            ],
            "interesting": {
                "reopen": false,
                "status": false
            },
            "is_parent": false,
            "sha": "1328c38a1507e9d6984685451909a6976a49ece9"
        },
        {
            "associated_pull_request": [],
            "date": "2020-09-17 06:41:49",
            "diff": "lz4_lz4/issue_847/commit_266fcf40008b6faf9aaad4f48539cdafb5911d98.diff",
            "diff_additions": 0,
            "diff_deletions": 11,
            "diff_file_size": 97854,
            "diff_url": "https://github.com/lz4/lz4/commit/266fcf40008b6faf9aaad4f48539cdafb5911d98.diff",
            "exists": true,
            "files": [
                {
                    "file_additions": 0,
                    "file_deletions": 11,
                    "file_exists": true,
                    "file_name": "tests/fuzzer.c",
                    "file_size": 97854
                }
            ],
            "interesting": {
                "reopen": false,
                "status": false
            },
            "is_parent": false,
            "sha": "266fcf40008b6faf9aaad4f48539cdafb5911d98"
        },
        {
            "associated_pull_request": [
                "https://github.com/lz4/lz4/pull/918"
            ],
            "date": "2020-09-18 03:23:06",
            "diff": "lz4_lz4/issue_847/commit_d568a6d15cdd06d3f131adaa32299d7535772723.diff",
            "diff_additions": 58,
            "diff_deletions": 8,
            "diff_file_size": 243458,
            "diff_url": "https://github.com/lz4/lz4/commit/d568a6d15cdd06d3f131adaa32299d7535772723.diff",
            "exists": true,
            "files": [
                {
                    "file_additions": 50,
                    "file_deletions": 5,
                    "file_exists": true,
                    "file_name": "lib/lz4.c",
                    "file_size": 105107
                },
                {
                    "file_additions": 4,
                    "file_deletions": 1,
                    "file_exists": true,
                    "file_name": "lib/lz4frame.c",
                    "file_size": 79848
                },
                {
                    "file_additions": 4,
                    "file_deletions": 2,
                    "file_exists": true,
                    "file_name": "tests/frametest.c",
                    "file_size": 58503
                }
            ],
            "interesting": {
                "reopen": false,
                "status": false
            },
            "is_parent": false,
            "sha": "d568a6d15cdd06d3f131adaa32299d7535772723"
        }
    ],
    "first_commit": "2020-08-27 18:00:28",
    "last_commit": "2020-09-18 03:23:06",
    "number": 847,
    "pull_request": "None",
    "score": {
        "accidental_reopen_likely": false,
        "all_labels": [],
        "contains_keywords": [
            "fix",
            "test",
            "issu",
            "error"
        ],
        "fix_size": 76,
        "has_labels": [],
        "intersecting": {
            "computed_score": 0.0,
            "final_commit_size": 64,
            "intersection_size": 0,
            "previous_commits_size": 12
        },
        "is_makefile_based": true,
        "no_new_files": [
            "lib/lz4.c",
            "lib/lz4frame.c",
            "tests/frametest.c"
        ],
        "no_other_files": false,
        "num_prohibited_files": 140751,
        "prohibited_files": [
            "kill.h",
            "meminfo.h",
            "kill.h",
            "meminfo.h",
            "kill.h",
            "meminfo.h",
            "testsuite_cli_test.go",
            "testsuite_cli_test.go",
            "common.mk",
            "i3bar/include/draw_util.h"
        ],
        "reopen": false,
        "reopen_events": [
            [
                "2020-09-15 20:45:49",
                "commit"
            ],
            [
                "2020-09-15 21:55:36",
                "commit"
            ],
            [
                "2020-09-17 06:24:41",
                "closed"
            ],
            [
                "2020-09-17 06:24:44",
                "commit"
            ],
            [
                "2020-09-17 06:41:51",
                "commit"
            ],
            [
                "2020-09-18 03:23:09",
                "commit"
            ]
        ],
        "status": true,
        "strategy": true,
        "total_changes": 224
    }
}