{
    "covered_issues": [
        669,
        664,
        658,
        657,
        651,
        648,
        645,
        644,
        643,
        641,
        635,
        632,
        630,
        629,
        628,
        627,
        624,
        621,
        618,
        616,
        608,
        607,
        600,
        598,
        597,
        593,
        592,
        590,
        583,
        581,
        579,
        578,
        577,
        576,
        574,
        571,
        570,
        569,
        567,
        560,
        559,
        553,
        552,
        551,
        548,
        547,
        544,
        540,
        533,
        525,
        522,
        518,
        516,
        515,
        509,
        506,
        505,
        504,
        503,
        502,
        501,
        500,
        498,
        497,
        496,
        495,
        493,
        492,
        491,
        490,
        488,
        485,
        483,
        482,
        481,
        478,
        476,
        475,
        473,
        472,
        470,
        469,
        466,
        463,
        461,
        455,
        453,
        448,
        447,
        444,
        442,
        439,
        438,
        437,
        436,
        434,
        433,
        429,
        428,
        427,
        425,
        424,
        423,
        418,
        417,
        415,
        413,
        411,
        410,
        407,
        405,
        404,
        403,
        402,
        394,
        387,
        386,
        382,
        381,
        379,
        378,
        374,
        373,
        372,
        371,
        370,
        368,
        366,
        365,
        364,
        363,
        360,
        359,
        356,
        354,
        353,
        352,
        348,
        344,
        341,
        340,
        339,
        338,
        333,
        331,
        330,
        326,
        323,
        322,
        318,
        317,
        316,
        315,
        312,
        311,
        308,
        307,
        302,
        299,
        298,
        296,
        295,
        294,
        292,
        289,
        288,
        287,
        286,
        283,
        281,
        280,
        279,
        276,
        275,
        274,
        273,
        272,
        269,
        268,
        262,
        255,
        252,
        251,
        248,
        246,
        241,
        240,
        239,
        238,
        235,
        231,
        230,
        229,
        228,
        223,
        222,
        219,
        210,
        201,
        200,
        196,
        188,
        187,
        179,
        178,
        176,
        168,
        147,
        144,
        140,
        134,
        125,
        122,
        110,
        93,
        86,
        84,
        78,
        76,
        74,
        72,
        60,
        54,
        52,
        44,
        43,
        42,
        41,
        40,
        37,
        36,
        35,
        32,
        28,
        27,
        26,
        22,
        11,
        9,
        6,
        5,
        4
    ],
    "finished": true
}