{
    "category": [
        "memory",
        "control flow"
    ],
    "commits": [
        {
            "associated_pull_request": [],
            "date": "2016-04-22 16:52:13",
            "diff": "radareorg_radare2/issue_4686/commit_6289fdea830efee099a4454ad528d71d2807235e.diff",
            "diff_additions": 5,
            "diff_deletions": 6,
            "diff_file_size": 315895,
            "diff_url": "https://github.com/radareorg/radare2/commit/6289fdea830efee099a4454ad528d71d2807235e.diff",
            "exists": true,
            "files": [
                {
                    "file_additions": 5,
                    "file_deletions": 6,
                    "file_exists": true,
                    "file_name": "libr/core/cmd_anal.c",
                    "file_size": 315895
                }
            ],
            "interesting": {
                "reopen": false,
                "status": false
            },
            "is_parent": true,
            "sha": "6289fdea830efee099a4454ad528d71d2807235e"
        },
        {
            "associated_pull_request": [],
            "date": "2016-04-22 21:47:22",
            "diff": "radareorg_radare2/issue_4686/commit_a3b1135cef80eeeeb3b73d0e1bb946d50f22dee7.diff",
            "diff_additions": 4,
            "diff_deletions": 0,
            "diff_file_size": 124114,
            "diff_url": "https://github.com/radareorg/radare2/commit/a3b1135cef80eeeeb3b73d0e1bb946d50f22dee7.diff",
            "exists": true,
            "files": [
                {
                    "file_additions": 4,
                    "file_deletions": 0,
                    "file_exists": true,
                    "file_name": "libr/bin/format/elf/elf.c",
                    "file_size": 124114
                }
            ],
            "interesting": {
                "reopen": false,
                "status": true
            },
            "is_parent": false,
            "sha": "a3b1135cef80eeeeb3b73d0e1bb946d50f22dee7"
        },
        {
            "associated_pull_request": [],
            "date": "2016-04-22 21:47:22",
            "diff": "radareorg_radare2/issue_4686/commit_d1a409268d45642fa78a7143ff41a75507e52693.diff",
            "diff_additions": 4,
            "diff_deletions": 0,
            "diff_file_size": 124114,
            "diff_url": "https://github.com/radareorg/radare2/commit/d1a409268d45642fa78a7143ff41a75507e52693.diff",
            "exists": true,
            "files": [
                {
                    "file_additions": 4,
                    "file_deletions": 0,
                    "file_exists": true,
                    "file_name": "libr/bin/format/elf/elf.c",
                    "file_size": 124114
                }
            ],
            "interesting": {
                "reopen": false,
                "status": false
            },
            "is_parent": false,
            "sha": "d1a409268d45642fa78a7143ff41a75507e52693"
        }
    ],
    "first_commit": "2016-04-22 21:40:02",
    "last_commit": "2016-04-22 22:06:09",
    "number": 4686,
    "pull_request": "None",
    "score": {
        "accidental_reopen_likely": false,
        "all_labels": [],
        "contains_keywords": [
            "reason",
            "bug",
            "crash",
            "test",
            "issu",
            "fault",
            "debug"
        ],
        "fix_size": 5,
        "has_labels": [],
        "intersecting": {
            "computed_score": 1.0,
            "final_commit_size": 5,
            "intersection_size": 5,
            "previous_commits_size": 5
        },
        "is_makefile_based": true,
        "no_new_files": [],
        "no_other_files": true,
        "num_prohibited_files": 45780,
        "prohibited_files": [
            "hal/inc/pinmap_hal.h",
            "Debug/marvin.bin",
            "Debug/marvin.elf",
            "Debug/marvin.hex",
            "Debug/marvin.bin",
            "Debug/marvin.elf",
            "Debug/marvin.hex",
            "inc/spark_utilities.h",
            "Debug/marvin.bin",
            "Debug/marvin.elf"
        ],
        "reopen": false,
        "reopen_events": [
            [
                "2016-04-22 21:47:29",
                "closed"
            ],
            [
                "2016-04-22 21:47:29",
                "commit"
            ],
            [
                "2016-04-22 22:06:21",
                "commit"
            ]
        ],
        "status": true,
        "strategy": true,
        "total_changes": 19
    }
}