{
    "category": [
        "feature request",
        "wrong API usage"
    ],
    "commits": [
        {
            "associated_pull_request": [],
            "date": "2021-02-07 17:25:48",
            "diff": "opensc_opensc/issue_2231/commit_bc083d833e6a5c643b7539eed1411b78b44e01ee.diff",
            "diff_additions": 28,
            "diff_deletions": 17,
            "diff_file_size": 59656,
            "diff_url": "https://github.com/OpenSC/OpenSC/commit/bc083d833e6a5c643b7539eed1411b78b44e01ee.diff",
            "exists": true,
            "files": [
                {
                    "file_additions": 28,
                    "file_deletions": 17,
                    "file_exists": true,
                    "file_name": "src/libopensc/asn1.c",
                    "file_size": 59656
                }
            ],
            "interesting": {
                "reopen": false,
                "status": true
            },
            "is_parent": true,
            "sha": "bc083d833e6a5c643b7539eed1411b78b44e01ee"
        },
        {
            "associated_pull_request": [],
            "date": "2021-02-10 18:37:26",
            "diff": "opensc_opensc/issue_2231/commit_b8ae9848e018d410edea483213096ff96fa5503c.diff",
            "diff_additions": 6,
            "diff_deletions": 2,
            "diff_file_size": 112275,
            "diff_url": "https://github.com/OpenSC/OpenSC/commit/b8ae9848e018d410edea483213096ff96fa5503c.diff",
            "exists": true,
            "files": [
                {
                    "file_additions": 6,
                    "file_deletions": 2,
                    "file_exists": true,
                    "file_name": "src/libopensc/card-iasecc.c",
                    "file_size": 112275
                }
            ],
            "interesting": {
                "reopen": false,
                "status": true
            },
            "is_parent": false,
            "sha": "b8ae9848e018d410edea483213096ff96fa5503c"
        },
        {
            "associated_pull_request": [],
            "date": "2021-02-10 18:37:26",
            "diff": "opensc_opensc/issue_2231/commit_ce3a625c1381bd1fa11c38d62b9e70b4b3716a1c.diff",
            "diff_additions": 6,
            "diff_deletions": 2,
            "diff_file_size": 112275,
            "diff_url": "https://github.com/OpenSC/OpenSC/commit/ce3a625c1381bd1fa11c38d62b9e70b4b3716a1c.diff",
            "exists": true,
            "files": [
                {
                    "file_additions": 6,
                    "file_deletions": 2,
                    "file_exists": true,
                    "file_name": "src/libopensc/card-iasecc.c",
                    "file_size": 112275
                }
            ],
            "interesting": {
                "reopen": false,
                "status": false
            },
            "is_parent": false,
            "sha": "ce3a625c1381bd1fa11c38d62b9e70b4b3716a1c"
        },
        {
            "associated_pull_request": [],
            "date": "2021-02-10 18:37:26",
            "diff": "opensc_opensc/issue_2231/commit_db1e178b5f7888917713cb9d28b99f6960f273b4.diff",
            "diff_additions": 1,
            "diff_deletions": 0,
            "diff_file_size": 112275,
            "diff_url": "https://github.com/OpenSC/OpenSC/commit/db1e178b5f7888917713cb9d28b99f6960f273b4.diff",
            "exists": true,
            "files": [
                {
                    "file_additions": 1,
                    "file_deletions": 0,
                    "file_exists": true,
                    "file_name": "src/libopensc/card-iasecc.c",
                    "file_size": 112275
                }
            ],
            "interesting": {
                "reopen": false,
                "status": true
            },
            "is_parent": false,
            "sha": "db1e178b5f7888917713cb9d28b99f6960f273b4"
        },
        {
            "associated_pull_request": [],
            "date": "2021-02-10 18:37:26",
            "diff": "opensc_opensc/issue_2231/commit_51ce02c27d66797098139c8e9b56014aad05091b.diff",
            "diff_additions": 3,
            "diff_deletions": 2,
            "diff_file_size": 112275,
            "diff_url": "https://github.com/OpenSC/OpenSC/commit/51ce02c27d66797098139c8e9b56014aad05091b.diff",
            "exists": true,
            "files": [
                {
                    "file_additions": 3,
                    "file_deletions": 2,
                    "file_exists": true,
                    "file_name": "src/libopensc/card-iasecc.c",
                    "file_size": 112275
                }
            ],
            "interesting": {
                "reopen": false,
                "status": false
            },
            "is_parent": false,
            "sha": "51ce02c27d66797098139c8e9b56014aad05091b"
        },
        {
            "associated_pull_request": [],
            "date": "2021-02-10 18:37:26",
            "diff": "opensc_opensc/issue_2231/commit_b5ed104fd95222132dad621f0867e5fc362cafbe.diff",
            "diff_additions": 3,
            "diff_deletions": 2,
            "diff_file_size": 112275,
            "diff_url": "https://github.com/OpenSC/OpenSC/commit/b5ed104fd95222132dad621f0867e5fc362cafbe.diff",
            "exists": true,
            "files": [
                {
                    "file_additions": 3,
                    "file_deletions": 2,
                    "file_exists": true,
                    "file_name": "src/libopensc/card-iasecc.c",
                    "file_size": 112275
                }
            ],
            "interesting": {
                "reopen": false,
                "status": false
            },
            "is_parent": false,
            "sha": "b5ed104fd95222132dad621f0867e5fc362cafbe"
        },
        {
            "associated_pull_request": [
                "https://github.com/OpenSC/OpenSC/pull/2217"
            ],
            "date": "2021-02-10 18:37:26",
            "diff": "opensc_opensc/issue_2231/commit_d80cecd6b937a2147c28a6d7235c03c1d72188f4.diff",
            "diff_additions": 3,
            "diff_deletions": 2,
            "diff_file_size": 112275,
            "diff_url": "https://github.com/OpenSC/OpenSC/commit/d80cecd6b937a2147c28a6d7235c03c1d72188f4.diff",
            "exists": true,
            "files": [
                {
                    "file_additions": 3,
                    "file_deletions": 2,
                    "file_exists": true,
                    "file_name": "src/libopensc/card-iasecc.c",
                    "file_size": 112275
                }
            ],
            "interesting": {
                "reopen": false,
                "status": false
            },
            "is_parent": false,
            "sha": "d80cecd6b937a2147c28a6d7235c03c1d72188f4"
        },
        {
            "associated_pull_request": [
                "https://github.com/OpenSC/OpenSC/pull/2217"
            ],
            "date": "2021-02-10 18:37:26",
            "diff": "opensc_opensc/issue_2231/commit_fc0df4e5d578e5926a59dbf3a34ce737424464ba.diff",
            "diff_additions": 3,
            "diff_deletions": 2,
            "diff_file_size": 112275,
            "diff_url": "https://github.com/OpenSC/OpenSC/commit/fc0df4e5d578e5926a59dbf3a34ce737424464ba.diff",
            "exists": true,
            "files": [
                {
                    "file_additions": 3,
                    "file_deletions": 2,
                    "file_exists": true,
                    "file_name": "src/libopensc/card-iasecc.c",
                    "file_size": 112275
                }
            ],
            "interesting": {
                "reopen": false,
                "status": false
            },
            "is_parent": false,
            "sha": "fc0df4e5d578e5926a59dbf3a34ce737424464ba"
        }
    ],
    "first_commit": "2021-02-10 09:07:56",
    "last_commit": "2021-03-17 09:58:20",
    "number": 2231,
    "pull_request": "None",
    "score": {
        "accidental_reopen_likely": false,
        "all_labels": [],
        "contains_keywords": [
            "work",
            "fix",
            "reason",
            "patch",
            "remov",
            "issu",
            "error",
            "fail",
            "problem"
        ],
        "fix_size": 11,
        "has_labels": [],
        "intersecting": {
            "computed_score": 1.0,
            "final_commit_size": 5,
            "intersection_size": 5,
            "previous_commits_size": 11
        },
        "is_makefile_based": true,
        "no_new_files": [],
        "no_other_files": false,
        "num_prohibited_files": 86571,
        "prohibited_files": [
            "kill.h",
            "meminfo.h",
            "kill.h",
            "meminfo.h",
            "kill.h",
            "meminfo.h",
            "testsuite_cli_test.go",
            "testsuite_cli_test.go",
            "common.mk",
            "i3bar/include/draw_util.h"
        ],
        "reopen": false,
        "reopen_events": [
            [
                "2021-02-10 18:56:47",
                "commit"
            ],
            [
                "2021-02-13 15:57:08",
                "commit"
            ],
            [
                "2021-02-14 16:05:14",
                "commit"
            ],
            [
                "2021-03-04 22:22:31",
                "commit"
            ],
            [
                "2021-03-05 17:51:59",
                "commit"
            ],
            [
                "2021-03-09 19:18:00",
                "commit"
            ],
            [
                "2021-03-16 20:14:37",
                "commit"
            ],
            [
                "2021-03-17 09:58:22",
                "commit"
            ],
            [
                "2021-03-17 16:14:17",
                "closed"
            ]
        ],
        "status": true,
        "strategy": true,
        "total_changes": 82
    }
}