{
    "all_issues": 2106,
    "interesting_issues": 5,
    "last_update": "2023-11-02 09:54:29.149865",
    "license": {
        "download": "https://raw.githubusercontent.com/pure-data/pure-data/master/LICENSE.txt",
        "name": "Other"
    },
    "ratio": 0.0023741690408357074,
    "size": 54150,
    "stars": 1346,
    "url": "https://github.com/pure-data/pure-data"
}