{
    "commits": [
        {
            "associated_pull_request": [
                "https://github.com/surge-synthesizer/surge/pull/5255"
            ],
            "date": "2021-10-14 16:24:38+00:00",
            "diff": "",
            "diff_additions": 0,
            "diff_deletions": 0,
            "diff_file_size": 0,
            "diff_url": "https://github.com/surge-synthesizer/surge/commit/be62d63cde0bf54b7c6df0fde9234fd7018a574d.diff",
            "exists": true,
            "files": [],
            "interesting": {
                "reopen": false,
                "status": false
            },
            "is_parent": true,
            "sha": "be62d63cde0bf54b7c6df0fde9234fd7018a574d"
        },
        {
            "associated_pull_request": [
                "https://github.com/surge-synthesizer/surge/pull/5256"
            ],
            "date": "2021-10-15 11:55:00+00:00",
            "diff": "surge-synthesizer_surge/issue_5253/commit_3f2ae8fd8ee8b6f6e0fe1f00bbf27918b048e7ed.diff",
            "diff_additions": 56,
            "diff_deletions": 20,
            "diff_file_size": 227316,
            "diff_url": "https://github.com/surge-synthesizer/surge/commit/3f2ae8fd8ee8b6f6e0fe1f00bbf27918b048e7ed.diff",
            "exists": true,
            "files": [
                {
                    "file_additions": 23,
                    "file_deletions": 11,
                    "file_exists": true,
                    "file_name": "src/common/PatchDB.cpp",
                    "file_size": 45184
                },
                {
                    "file_additions": 1,
                    "file_deletions": 3,
                    "file_exists": true,
                    "file_name": "src/common/PatchDBQueryParser.cpp",
                    "file_size": 7430
                },
                {
                    "file_additions": 6,
                    "file_deletions": 2,
                    "file_exists": true,
                    "file_name": "src/common/SurgeStorage.cpp",
                    "file_size": 93545
                },
                {
                    "file_additions": 1,
                    "file_deletions": 0,
                    "file_exists": true,
                    "file_name": "src/common/SurgeSynthesizerIO.cpp",
                    "file_size": 20243
                },
                {
                    "file_additions": 11,
                    "file_deletions": 3,
                    "file_exists": true,
                    "file_name": "src/surge-xt/gui/widgets/PatchSelector.cpp",
                    "file_size": 48898
                },
                {
                    "file_additions": 14,
                    "file_deletions": 1,
                    "file_exists": true,
                    "file_name": "src/surge-xt/gui/widgets/TypeAheadTextEditor.cpp",
                    "file_size": 12016
                }
            ],
            "interesting": {
                "reopen": false,
                "status": false
            },
            "is_parent": false,
            "sha": "3f2ae8fd8ee8b6f6e0fe1f00bbf27918b048e7ed"
        },
        {
            "associated_pull_request": [],
            "date": "2021-11-19 18:06:09+00:00",
            "diff": "surge-synthesizer_surge/issue_5253/commit_b4e1e6c1da937693895c2bb26f40eb65285b9620.diff",
            "diff_additions": 40,
            "diff_deletions": 20,
            "diff_file_size": 138729,
            "diff_url": "https://github.com/surge-synthesizer/surge/commit/b4e1e6c1da937693895c2bb26f40eb65285b9620.diff",
            "exists": true,
            "files": [
                {
                    "file_additions": 34,
                    "file_deletions": 18,
                    "file_exists": true,
                    "file_name": "src/common/PatchDB.cpp",
                    "file_size": 45184
                },
                {
                    "file_additions": 6,
                    "file_deletions": 2,
                    "file_exists": true,
                    "file_name": "src/common/SurgeStorage.cpp",
                    "file_size": 93545
                }
            ],
            "interesting": {
                "reopen": false,
                "status": false
            },
            "is_parent": false,
            "sha": "b4e1e6c1da937693895c2bb26f40eb65285b9620"
        },
        {
            "associated_pull_request": [
                "https://github.com/surge-synthesizer/surge/pull/5431"
            ],
            "date": "2021-11-19 18:06:09+00:00",
            "diff": "surge-synthesizer_surge/issue_5253/commit_136d79dc9fbf3daafdd20dbdde59c29af902eb56.diff",
            "diff_additions": 41,
            "diff_deletions": 18,
            "diff_file_size": 146159,
            "diff_url": "https://github.com/surge-synthesizer/surge/commit/136d79dc9fbf3daafdd20dbdde59c29af902eb56.diff",
            "exists": true,
            "files": [
                {
                    "file_additions": 32,
                    "file_deletions": 15,
                    "file_exists": true,
                    "file_name": "src/common/PatchDB.cpp",
                    "file_size": 45184
                },
                {
                    "file_additions": 3,
                    "file_deletions": 1,
                    "file_exists": true,
                    "file_name": "src/common/PatchDBQueryParser.cpp",
                    "file_size": 7430
                },
                {
                    "file_additions": 6,
                    "file_deletions": 2,
                    "file_exists": true,
                    "file_name": "src/common/SurgeStorage.cpp",
                    "file_size": 93545
                }
            ],
            "interesting": {
                "reopen": false,
                "status": false
            },
            "is_parent": false,
            "sha": "136d79dc9fbf3daafdd20dbdde59c29af902eb56"
        },
        {
            "associated_pull_request": [
                "https://github.com/surge-synthesizer/surge/pull/5431"
            ],
            "date": "2021-11-19 18:50:28+00:00",
            "diff": "surge-synthesizer_surge/issue_5253/commit_a8fcc44db43c0e9a7009fb3acd1ef70e896f2ada.diff",
            "diff_additions": 41,
            "diff_deletions": 18,
            "diff_file_size": 146159,
            "diff_url": "https://github.com/surge-synthesizer/surge/commit/a8fcc44db43c0e9a7009fb3acd1ef70e896f2ada.diff",
            "exists": true,
            "files": [
                {
                    "file_additions": 32,
                    "file_deletions": 15,
                    "file_exists": true,
                    "file_name": "src/common/PatchDB.cpp",
                    "file_size": 45184
                },
                {
                    "file_additions": 3,
                    "file_deletions": 1,
                    "file_exists": true,
                    "file_name": "src/common/PatchDBQueryParser.cpp",
                    "file_size": 7430
                },
                {
                    "file_additions": 6,
                    "file_deletions": 2,
                    "file_exists": true,
                    "file_name": "src/common/SurgeStorage.cpp",
                    "file_size": 93545
                }
            ],
            "interesting": {
                "reopen": true,
                "status": false
            },
            "is_parent": false,
            "sha": "a8fcc44db43c0e9a7009fb3acd1ef70e896f2ada"
        },
        {
            "associated_pull_request": [
                "https://github.com/surge-synthesizer/surge/pull/5438"
            ],
            "date": "2021-11-21 13:59:03+00:00",
            "diff": "surge-synthesizer_surge/issue_5253/commit_1bd487618bcb72dd1c78de4ec0461db2ac86edf5.diff",
            "diff_additions": 4,
            "diff_deletions": 2,
            "diff_file_size": 60914,
            "diff_url": "https://github.com/surge-synthesizer/surge/commit/1bd487618bcb72dd1c78de4ec0461db2ac86edf5.diff",
            "exists": true,
            "files": [
                {
                    "file_additions": 1,
                    "file_deletions": 1,
                    "file_exists": true,
                    "file_name": "src/surge-xt/gui/widgets/PatchSelector.cpp",
                    "file_size": 48898
                },
                {
                    "file_additions": 3,
                    "file_deletions": 1,
                    "file_exists": true,
                    "file_name": "src/surge-xt/gui/widgets/TypeAheadTextEditor.cpp",
                    "file_size": 12016
                }
            ],
            "interesting": {
                "reopen": false,
                "status": false
            },
            "is_parent": false,
            "sha": "1bd487618bcb72dd1c78de4ec0461db2ac86edf5"
        },
        {
            "associated_pull_request": [
                "https://github.com/surge-synthesizer/surge/pull/5438"
            ],
            "date": "2021-11-21 14:42:55+00:00",
            "diff": "surge-synthesizer_surge/issue_5253/commit_1543188bc94bf8fa4d2878610b52a3b243101ae1.diff",
            "diff_additions": 4,
            "diff_deletions": 2,
            "diff_file_size": 60914,
            "diff_url": "https://github.com/surge-synthesizer/surge/commit/1543188bc94bf8fa4d2878610b52a3b243101ae1.diff",
            "exists": true,
            "files": [
                {
                    "file_additions": 1,
                    "file_deletions": 1,
                    "file_exists": true,
                    "file_name": "src/surge-xt/gui/widgets/PatchSelector.cpp",
                    "file_size": 48898
                },
                {
                    "file_additions": 3,
                    "file_deletions": 1,
                    "file_exists": true,
                    "file_name": "src/surge-xt/gui/widgets/TypeAheadTextEditor.cpp",
                    "file_size": 12016
                }
            ],
            "interesting": {
                "reopen": false,
                "status": false
            },
            "is_parent": false,
            "sha": "1543188bc94bf8fa4d2878610b52a3b243101ae1"
        },
        {
            "associated_pull_request": [
                "https://github.com/surge-synthesizer/surge/pull/5516"
            ],
            "date": "2021-11-27 01:58:39+00:00",
            "diff": "surge-synthesizer_surge/issue_5253/commit_82d87fb67ee81cf09546d5f2011cf5079c9ce94d.diff",
            "diff_additions": 28,
            "diff_deletions": 9,
            "diff_file_size": 354794,
            "diff_url": "https://github.com/surge-synthesizer/surge/commit/82d87fb67ee81cf09546d5f2011cf5079c9ce94d.diff",
            "exists": true,
            "files": [
                {
                    "file_additions": 9,
                    "file_deletions": 0,
                    "file_exists": true,
                    "file_name": "src/surge-xt/gui/SurgeGUIEditor.cpp",
                    "file_size": 292527
                },
                {
                    "file_additions": 19,
                    "file_deletions": 9,
                    "file_exists": true,
                    "file_name": "src/surge-xt/gui/overlays/ModulationEditor.cpp",
                    "file_size": 62267
                }
            ],
            "interesting": {
                "reopen": false,
                "status": false
            },
            "is_parent": false,
            "sha": "82d87fb67ee81cf09546d5f2011cf5079c9ce94d"
        },
        {
            "associated_pull_request": [
                "https://github.com/surge-synthesizer/surge/pull/5516"
            ],
            "date": "2021-11-27 02:22:26+00:00",
            "diff": "surge-synthesizer_surge/issue_5253/commit_f4223c179524a667808d88da24b42fc8fc235d25.diff",
            "diff_additions": 28,
            "diff_deletions": 9,
            "diff_file_size": 354794,
            "diff_url": "https://github.com/surge-synthesizer/surge/commit/f4223c179524a667808d88da24b42fc8fc235d25.diff",
            "exists": true,
            "files": [
                {
                    "file_additions": 9,
                    "file_deletions": 0,
                    "file_exists": true,
                    "file_name": "src/surge-xt/gui/SurgeGUIEditor.cpp",
                    "file_size": 292527
                },
                {
                    "file_additions": 19,
                    "file_deletions": 9,
                    "file_exists": true,
                    "file_name": "src/surge-xt/gui/overlays/ModulationEditor.cpp",
                    "file_size": 62267
                }
            ],
            "interesting": {
                "reopen": false,
                "status": false
            },
            "is_parent": false,
            "sha": "f4223c179524a667808d88da24b42fc8fc235d25"
        }
    ],
    "first_commit": "2021-10-14 16:24:38+00:00",
    "last_commit": "2021-11-27 02:22:26+00:00",
    "number": 5253,
    "pull_request": "None",
    "score": {
        "accidental_reopen_likely": false,
        "all_labels": [
            "Patch Browser",
            "WIP"
        ],
        "contains_keywords": [
            "work",
            "fail",
            "fix",
            "issu",
            "patch",
            "crash"
        ],
        "fix_size": 179,
        "has_labels": [],
        "intersecting": {
            "computed_score": 0.7714285714285715,
            "final_commit_size": 35,
            "intersection_size": 27,
            "previous_commits_size": 171
        },
        "is_makefile_based": true,
        "no_new_files": [],
        "no_other_files": false,
        "num_prohibited_files": 354319,
        "prohibited_files": [
            "server/src/main/java/com/genymobile/scrcpy/Device.java",
            "server/src/main/java/com/genymobile/scrcpy/wrappers/SurfaceControl.java",
            "server/src/main/java/com/genymobile/scrcpy/Device.java",
            "server/src/main/java/com/genymobile/scrcpy/wrappers/SurfaceControl.java",
            "app/meson.build",
            "app/scrcpy.1",
            "app/src/common.h",
            "app/src/scrcpy.h",
            "app/src/server.h",
            "server/src/main/java/com/genymobile/scrcpy/Workarounds.java"
        ],
        "reopen": true,
        "reopen_events": [
            [
                "2021-10-15 11:56:13+00:00",
                "commit"
            ],
            [
                "2021-10-15 12:27:38+00:00",
                "commit"
            ],
            [
                "2021-11-19 18:06:41+00:00",
                "commit"
            ],
            [
                "2021-11-19 18:13:34+00:00",
                "commit"
            ],
            [
                "2021-11-19 18:50:28+00:00",
                "closed"
            ],
            [
                "2021-11-19 18:50:30+00:00",
                "commit"
            ],
            [
                "2021-11-20 19:12:19+00:00",
                "reopened"
            ],
            [
                "2021-11-21 13:59:28+00:00",
                "commit"
            ],
            [
                "2021-11-21 14:42:56+00:00",
                "closed"
            ],
            [
                "2021-11-21 14:42:57+00:00",
                "commit"
            ],
            [
                "2021-11-27 01:59:16+00:00",
                "commit"
            ],
            [
                "2021-11-27 02:22:27+00:00",
                "commit"
            ]
        ],
        "status": false,
        "strategy": true,
        "total_changes": 340
    }
}