{
    "covered_issues": [
        96,
        86,
        83,
        69,
        53,
        52,
        45,
        44,
        42,
        39,
        38,
        37,
        36,
        33,
        29,
        23,
        21,
        12,
        9,
        6,
        5,
        2,
        1
    ],
    "finished": true
}