{
    "covered_issues": [
        233,
        227,
        224,
        223,
        222,
        221,
        219,
        218,
        215,
        210,
        209,
        206,
        204,
        200,
        197,
        189,
        188,
        187,
        186,
        184,
        179,
        176,
        175,
        172,
        169,
        166,
        163,
        162,
        159,
        153,
        148,
        147,
        144,
        142,
        140,
        138,
        137,
        134,
        127,
        126,
        118,
        116,
        115,
        114,
        111,
        105,
        102,
        101,
        100,
        95,
        94,
        93,
        90,
        85,
        82,
        79,
        78,
        75,
        73,
        71,
        68,
        67,
        66,
        64,
        63,
        62,
        61,
        56,
        54,
        51,
        46,
        45,
        44,
        42,
        41,
        39,
        38,
        36,
        35,
        29,
        28,
        25,
        24,
        23,
        22,
        21,
        19,
        18,
        16,
        15,
        14,
        13,
        12,
        11,
        10,
        9,
        8,
        5,
        4,
        3,
        2,
        1
    ],
    "finished": true
}