{
    "category": [
        "hardware/OS",
        "build/refactor/preprocessing"
    ],
    "commits": [
        {
            "associated_pull_request": [],
            "date": "2017-12-13 09:27:23",
            "diff": "",
            "diff_additions": 0,
            "diff_deletions": 0,
            "diff_file_size": 0,
            "diff_url": "https://github.com/rsyslog/rsyslog/commit/90ea3d5eb21f535d98a9d648ed7555b3ea5237f8.diff",
            "exists": true,
            "files": [],
            "interesting": {
                "reopen": false,
                "status": false
            },
            "is_parent": true,
            "sha": "90ea3d5eb21f535d98a9d648ed7555b3ea5237f8"
        },
        {
            "associated_pull_request": [],
            "date": "2017-12-13 11:36:20",
            "diff": "rsyslog_rsyslog/issue_2168/commit_35e3e8f12a1e0c8122b7221454a880bc68214bc5.diff",
            "diff_additions": 1,
            "diff_deletions": 0,
            "diff_file_size": 69381,
            "diff_url": "https://github.com/rsyslog/rsyslog/commit/35e3e8f12a1e0c8122b7221454a880bc68214bc5.diff",
            "exists": true,
            "files": [
                {
                    "file_additions": 1,
                    "file_deletions": 0,
                    "file_exists": true,
                    "file_name": "plugins/omkafka/omkafka.c",
                    "file_size": 69381
                }
            ],
            "interesting": {
                "reopen": false,
                "status": true
            },
            "is_parent": false,
            "sha": "35e3e8f12a1e0c8122b7221454a880bc68214bc5"
        },
        {
            "associated_pull_request": [],
            "date": "2017-12-13 11:36:20",
            "diff": "rsyslog_rsyslog/issue_2168/commit_5fb047a42a9445744d45a4d7802485f5c20c61d2.diff",
            "diff_additions": 16,
            "diff_deletions": 16,
            "diff_file_size": 69381,
            "diff_url": "https://github.com/rsyslog/rsyslog/commit/5fb047a42a9445744d45a4d7802485f5c20c61d2.diff",
            "exists": true,
            "files": [
                {
                    "file_additions": 16,
                    "file_deletions": 16,
                    "file_exists": true,
                    "file_name": "plugins/omkafka/omkafka.c",
                    "file_size": 69381
                }
            ],
            "interesting": {
                "reopen": false,
                "status": true
            },
            "is_parent": false,
            "sha": "5fb047a42a9445744d45a4d7802485f5c20c61d2"
        },
        {
            "associated_pull_request": [],
            "date": "2017-12-13 11:36:20",
            "diff": "rsyslog_rsyslog/issue_2168/commit_6fe2bd59b1738e38b5c488232dc4ae702cb67a30.diff",
            "diff_additions": 16,
            "diff_deletions": 16,
            "diff_file_size": 69381,
            "diff_url": "https://github.com/rsyslog/rsyslog/commit/6fe2bd59b1738e38b5c488232dc4ae702cb67a30.diff",
            "exists": true,
            "files": [
                {
                    "file_additions": 16,
                    "file_deletions": 16,
                    "file_exists": true,
                    "file_name": "plugins/omkafka/omkafka.c",
                    "file_size": 69381
                }
            ],
            "interesting": {
                "reopen": false,
                "status": false
            },
            "is_parent": false,
            "sha": "6fe2bd59b1738e38b5c488232dc4ae702cb67a30"
        },
        {
            "associated_pull_request": [],
            "date": "2017-12-13 11:36:20",
            "diff": "rsyslog_rsyslog/issue_2168/commit_42c46b53af7b30603f4f2f7bb02148b6270a0779.diff",
            "diff_additions": 16,
            "diff_deletions": 16,
            "diff_file_size": 69381,
            "diff_url": "https://github.com/rsyslog/rsyslog/commit/42c46b53af7b30603f4f2f7bb02148b6270a0779.diff",
            "exists": true,
            "files": [
                {
                    "file_additions": 16,
                    "file_deletions": 16,
                    "file_exists": true,
                    "file_name": "plugins/omkafka/omkafka.c",
                    "file_size": 69381
                }
            ],
            "interesting": {
                "reopen": false,
                "status": true
            },
            "is_parent": false,
            "sha": "42c46b53af7b30603f4f2f7bb02148b6270a0779"
        },
        {
            "associated_pull_request": [
                "https://github.com/rsyslog/rsyslog/pull/2210"
            ],
            "date": "2017-12-13 11:36:20",
            "diff": "rsyslog_rsyslog/issue_2168/commit_69be26d115d99655c5d1dfbf99bcc5d919de4206.diff",
            "diff_additions": 15,
            "diff_deletions": 16,
            "diff_file_size": 69381,
            "diff_url": "https://github.com/rsyslog/rsyslog/commit/69be26d115d99655c5d1dfbf99bcc5d919de4206.diff",
            "exists": true,
            "files": [
                {
                    "file_additions": 15,
                    "file_deletions": 16,
                    "file_exists": true,
                    "file_name": "plugins/omkafka/omkafka.c",
                    "file_size": 69381
                }
            ],
            "interesting": {
                "reopen": false,
                "status": false
            },
            "is_parent": false,
            "sha": "69be26d115d99655c5d1dfbf99bcc5d919de4206"
        }
    ],
    "first_commit": "2017-12-13 09:27:23",
    "last_commit": "2017-12-19 15:30:48",
    "number": 2168,
    "pull_request": "None",
    "score": {
        "accidental_reopen_likely": false,
        "all_labels": [
            "bug",
            "worked-on"
        ],
        "contains_keywords": [
            "fail",
            "bug",
            "problem",
            "test",
            "fix",
            "issu",
            "work",
            "CI"
        ],
        "fix_size": 47,
        "has_labels": [
            "bug"
        ],
        "intersecting": {
            "computed_score": 0.2962962962962963,
            "final_commit_size": 27,
            "intersection_size": 8,
            "previous_commits_size": 28
        },
        "is_makefile_based": true,
        "no_new_files": [],
        "no_other_files": true,
        "num_prohibited_files": 11830,
        "prohibited_files": [
            "hal/inc/pinmap_hal.h",
            "Debug/marvin.bin",
            "Debug/marvin.elf",
            "Debug/marvin.hex",
            "Debug/marvin.bin",
            "Debug/marvin.elf",
            "Debug/marvin.hex",
            "inc/spark_utilities.h",
            "Debug/marvin.bin",
            "Debug/marvin.elf"
        ],
        "reopen": false,
        "reopen_events": [
            [
                "2017-12-13 11:37:12",
                "commit"
            ],
            [
                "2017-12-13 11:56:30",
                "commit"
            ],
            [
                "2017-12-14 15:00:30",
                "commit"
            ],
            [
                "2017-12-15 07:38:01",
                "commit"
            ],
            [
                "2017-12-19 15:31:15",
                "commit"
            ],
            [
                "2017-12-19 16:57:23",
                "closed"
            ]
        ],
        "status": true,
        "strategy": true,
        "total_changes": 128
    }
}