{
    "commits": [
        {
            "associated_pull_request": [],
            "date": "2021-05-01 06:25:15+00:00",
            "diff": "",
            "diff_additions": 0,
            "diff_deletions": 0,
            "diff_file_size": 0,
            "diff_url": "https://github.com/haproxy/haproxy/commit/080347fe2a47c649ee5d420fc4e60385229cb642.diff",
            "exists": true,
            "files": [],
            "interesting": {
                "reopen": false,
                "status": false
            },
            "is_parent": true,
            "sha": "080347fe2a47c649ee5d420fc4e60385229cb642"
        },
        {
            "associated_pull_request": [],
            "date": "2021-05-03 08:11:13+00:00",
            "diff": "haproxy_haproxy/issue_1240/commit_c31b2008728babbc8738b88b593f2be40324369b.diff",
            "diff_additions": 7,
            "diff_deletions": 2,
            "diff_file_size": 391032,
            "diff_url": "https://github.com/haproxy/haproxy/commit/c31b2008728babbc8738b88b593f2be40324369b.diff",
            "exists": true,
            "files": [
                {
                    "file_additions": 7,
                    "file_deletions": 2,
                    "file_exists": true,
                    "file_name": "src/hlua.c",
                    "file_size": 391032
                }
            ],
            "interesting": {
                "reopen": true,
                "status": false
            },
            "is_parent": false,
            "sha": "c31b2008728babbc8738b88b593f2be40324369b"
        },
        {
            "associated_pull_request": [],
            "date": "2021-05-03 08:11:13+00:00",
            "diff": "haproxy_haproxy/issue_1240/commit_af3d8c10b75df33e341d355644a66bf125876fc6.diff",
            "diff_additions": 7,
            "diff_deletions": 2,
            "diff_file_size": 391032,
            "diff_url": "https://github.com/haproxy/haproxy/commit/af3d8c10b75df33e341d355644a66bf125876fc6.diff",
            "exists": true,
            "files": [
                {
                    "file_additions": 7,
                    "file_deletions": 2,
                    "file_exists": true,
                    "file_name": "src/hlua.c",
                    "file_size": 391032
                }
            ],
            "interesting": {
                "reopen": false,
                "status": false
            },
            "is_parent": false,
            "sha": "af3d8c10b75df33e341d355644a66bf125876fc6"
        },
        {
            "associated_pull_request": [],
            "date": "2021-05-03 08:11:13+00:00",
            "diff": "haproxy_haproxy/issue_1240/commit_efdb2620e8e895193a2095906e536e4fec99870f.diff",
            "diff_additions": 7,
            "diff_deletions": 2,
            "diff_file_size": 391032,
            "diff_url": "https://github.com/haproxy/haproxy/commit/efdb2620e8e895193a2095906e536e4fec99870f.diff",
            "exists": true,
            "files": [
                {
                    "file_additions": 7,
                    "file_deletions": 2,
                    "file_exists": true,
                    "file_name": "src/hlua.c",
                    "file_size": 391032
                }
            ],
            "interesting": {
                "reopen": false,
                "status": false
            },
            "is_parent": false,
            "sha": "efdb2620e8e895193a2095906e536e4fec99870f"
        },
        {
            "associated_pull_request": [],
            "date": "2021-05-03 08:11:13+00:00",
            "diff": "haproxy_haproxy/issue_1240/commit_e703c5899f0d55c2a4b65e288828a8c97b745433.diff",
            "diff_additions": 7,
            "diff_deletions": 2,
            "diff_file_size": 391032,
            "diff_url": "https://github.com/haproxy/haproxy/commit/e703c5899f0d55c2a4b65e288828a8c97b745433.diff",
            "exists": true,
            "files": [
                {
                    "file_additions": 7,
                    "file_deletions": 2,
                    "file_exists": true,
                    "file_name": "src/hlua.c",
                    "file_size": 391032
                }
            ],
            "interesting": {
                "reopen": false,
                "status": false
            },
            "is_parent": false,
            "sha": "e703c5899f0d55c2a4b65e288828a8c97b745433"
        },
        {
            "associated_pull_request": [],
            "date": "2021-05-03 08:11:13+00:00",
            "diff": "haproxy_haproxy/issue_1240/commit_7763f5fd6653eae1dd1830e5ac7d7e5bbeca5649.diff",
            "diff_additions": 7,
            "diff_deletions": 2,
            "diff_file_size": 391032,
            "diff_url": "https://github.com/haproxy/haproxy/commit/7763f5fd6653eae1dd1830e5ac7d7e5bbeca5649.diff",
            "exists": true,
            "files": [
                {
                    "file_additions": 7,
                    "file_deletions": 2,
                    "file_exists": true,
                    "file_name": "src/hlua.c",
                    "file_size": 391032
                }
            ],
            "interesting": {
                "reopen": false,
                "status": false
            },
            "is_parent": false,
            "sha": "7763f5fd6653eae1dd1830e5ac7d7e5bbeca5649"
        }
    ],
    "first_commit": "2021-05-01 06:25:15+00:00",
    "last_commit": "2022-08-25 09:59:49+00:00",
    "number": 1240,
    "pull_request": "None",
    "score": {
        "accidental_reopen_likely": false,
        "all_labels": [
            "type: bug",
            "subsystem: lua",
            "status: fixed"
        ],
        "contains_keywords": [
            "confirm",
            "work",
            "fail",
            "chang",
            "fix",
            "issu",
            "patch",
            "debug",
            "test",
            "fault",
            "bug",
            "error",
            "problem",
            "report"
        ],
        "fix_size": 35,
        "has_labels": [],
        "intersecting": {
            "computed_score": 0.25,
            "final_commit_size": 8,
            "intersection_size": 2,
            "previous_commits_size": 29
        },
        "is_makefile_based": true,
        "no_new_files": [],
        "no_other_files": true,
        "num_prohibited_files": 160400,
        "prohibited_files": [
            "server/src/main/java/com/genymobile/scrcpy/Device.java",
            "server/src/main/java/com/genymobile/scrcpy/wrappers/SurfaceControl.java",
            "server/src/main/java/com/genymobile/scrcpy/Device.java",
            "server/src/main/java/com/genymobile/scrcpy/wrappers/SurfaceControl.java",
            "app/meson.build",
            "app/scrcpy.1",
            "app/src/common.h",
            "app/src/scrcpy.h",
            "app/src/server.h",
            "server/src/main/java/com/genymobile/scrcpy/Workarounds.java"
        ],
        "reopen": true,
        "reopen_events": [
            [
                "2021-05-03 08:42:48+00:00",
                "commit"
            ],
            [
                "2021-05-03 09:02:48+00:00",
                "closed"
            ],
            [
                "2021-05-03 09:03:17+00:00",
                "reopened"
            ],
            [
                "2021-05-06 05:25:24+00:00",
                "commit"
            ],
            [
                "2021-05-06 05:25:25+00:00",
                "commit"
            ],
            [
                "2021-06-18 05:25:30+00:00",
                "commit"
            ],
            [
                "2022-08-25 10:00:34+00:00",
                "closed"
            ],
            [
                "2022-08-29 09:29:48+00:00",
                "commit"
            ]
        ],
        "status": false,
        "strategy": true,
        "total_changes": 45
    }
}