{
    "category": [
        "GUI"
    ],
    "commits": [
        {
            "associated_pull_request": [],
            "date": "2014-04-30 21:01:01",
            "diff": "",
            "diff_additions": 0,
            "diff_deletions": 0,
            "diff_file_size": 0,
            "diff_url": "https://github.com/universal-ctags/ctags/commit/ea123e90c05d72272633bad7d6394d451f774d99.diff",
            "exists": true,
            "files": [],
            "interesting": {
                "reopen": false,
                "status": false
            },
            "is_parent": true,
            "sha": "ea123e90c05d72272633bad7d6394d451f774d99"
        },
        {
            "associated_pull_request": [],
            "date": "2014-04-30 23:25:21",
            "diff": "universal-ctags_ctags/issue_2/commit_502355489b1ba748b1a235641bbd512ba6da315e.diff",
            "diff_additions": 8,
            "diff_deletions": 1,
            "diff_file_size": 0,
            "diff_url": "https://github.com/universal-ctags/ctags/commit/502355489b1ba748b1a235641bbd512ba6da315e.diff",
            "exists": true,
            "files": [
                {
                    "file_additions": 4,
                    "file_deletions": 0,
                    "file_exists": false,
                    "file_name": "Test/using.cpp",
                    "file_size": 0
                },
                {
                    "file_additions": 4,
                    "file_deletions": 1,
                    "file_exists": false,
                    "file_name": "c.c",
                    "file_size": 0
                }
            ],
            "interesting": {
                "reopen": false,
                "status": false
            },
            "is_parent": true,
            "sha": "502355489b1ba748b1a235641bbd512ba6da315e"
        },
        {
            "associated_pull_request": [],
            "date": "2014-05-01 15:02:54",
            "diff": "universal-ctags_ctags/issue_2/commit_c93e3bfa05b70d7fbc2539454c957eb2169e16b3.diff",
            "diff_additions": 8,
            "diff_deletions": 1,
            "diff_file_size": 0,
            "diff_url": "https://github.com/universal-ctags/ctags/commit/c93e3bfa05b70d7fbc2539454c957eb2169e16b3.diff",
            "exists": true,
            "files": [
                {
                    "file_additions": 4,
                    "file_deletions": 0,
                    "file_exists": false,
                    "file_name": "Test/using.cpp",
                    "file_size": 0
                },
                {
                    "file_additions": 4,
                    "file_deletions": 1,
                    "file_exists": false,
                    "file_name": "c.c",
                    "file_size": 0
                }
            ],
            "interesting": {
                "reopen": true,
                "status": false
            },
            "is_parent": false,
            "sha": "c93e3bfa05b70d7fbc2539454c957eb2169e16b3"
        },
        {
            "associated_pull_request": [
                "https://github.com/universal-ctags/ctags/pull/122"
            ],
            "date": "2014-11-13 02:28:16",
            "diff": "universal-ctags_ctags/issue_2/commit_b0e7bdfc87ec41d4f05d7264b6cd68aac16a6faa.diff",
            "diff_additions": 1077,
            "diff_deletions": 484,
            "diff_file_size": 6920,
            "diff_url": "https://github.com/universal-ctags/ctags/commit/b0e7bdfc87ec41d4f05d7264b6cd68aac16a6faa.diff",
            "exists": true,
            "files": [
                {
                    "file_additions": 50,
                    "file_deletions": 40,
                    "file_exists": false,
                    "file_name": "ada.c",
                    "file_size": 0
                },
                {
                    "file_additions": 224,
                    "file_deletions": 185,
                    "file_exists": false,
                    "file_name": "css.c",
                    "file_size": 0
                },
                {
                    "file_additions": 1,
                    "file_deletions": 1,
                    "file_exists": false,
                    "file_name": "entry.c",
                    "file_size": 0
                },
                {
                    "file_additions": 1,
                    "file_deletions": 1,
                    "file_exists": false,
                    "file_name": "falcon.c",
                    "file_size": 0
                },
                {
                    "file_additions": 34,
                    "file_deletions": 22,
                    "file_exists": false,
                    "file_name": "fortran.c",
                    "file_size": 0
                },
                {
                    "file_additions": 0,
                    "file_deletions": 1,
                    "file_exists": false,
                    "file_name": "go.c",
                    "file_size": 0
                },
                {
                    "file_additions": 30,
                    "file_deletions": 27,
                    "file_exists": false,
                    "file_name": "lregex.c",
                    "file_size": 0
                },
                {
                    "file_additions": 5,
                    "file_deletions": 2,
                    "file_exists": false,
                    "file_name": "main.c",
                    "file_size": 0
                },
                {
                    "file_additions": 319,
                    "file_deletions": 0,
                    "file_exists": true,
                    "file_name": "misc/badinput.c",
                    "file_size": 6920
                },
                {
                    "file_additions": 10,
                    "file_deletions": 4,
                    "file_exists": false,
                    "file_name": "options.c",
                    "file_size": 0
                },
                {
                    "file_additions": 38,
                    "file_deletions": 2,
                    "file_exists": false,
                    "file_name": "parse.c",
                    "file_size": 0
                },
                {
                    "file_additions": 95,
                    "file_deletions": 100,
                    "file_exists": false,
                    "file_name": "sql.c",
                    "file_size": 0
                },
                {
                    "file_additions": 30,
                    "file_deletions": 13,
                    "file_exists": false,
                    "file_name": "trashbox.c",
                    "file_size": 0
                },
                {
                    "file_additions": 209,
                    "file_deletions": 67,
                    "file_exists": false,
                    "file_name": "verilog.c",
                    "file_size": 0
                },
                {
                    "file_additions": 28,
                    "file_deletions": 16,
                    "file_exists": false,
                    "file_name": "vhdl.c",
                    "file_size": 0
                },
                {
                    "file_additions": 3,
                    "file_deletions": 3,
                    "file_exists": false,
                    "file_name": "windres.c",
                    "file_size": 0
                }
            ],
            "interesting": {
                "reopen": false,
                "status": false
            },
            "is_parent": false,
            "sha": "b0e7bdfc87ec41d4f05d7264b6cd68aac16a6faa"
        },
        {
            "associated_pull_request": [
                "https://github.com/universal-ctags/ctags/pull/824"
            ],
            "date": "2016-03-07 18:58:46",
            "diff": "universal-ctags_ctags/issue_2/commit_dc4f9c8728e6aba36aa3dd47292e53d74b0a7a5b.diff",
            "diff_additions": 1,
            "diff_deletions": 1,
            "diff_file_size": 3682,
            "diff_url": "https://github.com/universal-ctags/ctags/commit/dc4f9c8728e6aba36aa3dd47292e53d74b0a7a5b.diff",
            "exists": true,
            "files": [
                {
                    "file_additions": 1,
                    "file_deletions": 1,
                    "file_exists": true,
                    "file_name": "parsers/cxx/cxx_token.c",
                    "file_size": 3682
                }
            ],
            "interesting": {
                "reopen": false,
                "status": false
            },
            "is_parent": false,
            "sha": "dc4f9c8728e6aba36aa3dd47292e53d74b0a7a5b"
        },
        {
            "associated_pull_request": [
                "https://github.com/universal-ctags/ctags/pull/2444"
            ],
            "date": "2020-02-28 12:19:15",
            "diff": "universal-ctags_ctags/issue_2/commit_d66b2567b94ee1c9af2e1c38ec16f024bd62f4b4.diff",
            "diff_additions": 5,
            "diff_deletions": 8,
            "diff_file_size": 0,
            "diff_url": "https://github.com/universal-ctags/ctags/commit/d66b2567b94ee1c9af2e1c38ec16f024bd62f4b4.diff",
            "exists": true,
            "files": [
                {
                    "file_additions": 5,
                    "file_deletions": 8,
                    "file_exists": false,
                    "file_name": "packcc.c",
                    "file_size": 0
                }
            ],
            "interesting": {
                "reopen": false,
                "status": false
            },
            "is_parent": false,
            "sha": "d66b2567b94ee1c9af2e1c38ec16f024bd62f4b4"
        }
    ],
    "first_commit": "2014-04-30 21:01:18",
    "last_commit": "2020-02-28 12:19:15",
    "number": 2,
    "pull_request": "None",
    "score": {
        "accidental_reopen_likely": false,
        "all_labels": [
            "Parser bug/enhancement"
        ],
        "contains_keywords": [
            "error",
            "bug",
            "issu",
            "chang",
            "work",
            "test",
            "debug"
        ],
        "fix_size": 1025,
        "has_labels": [],
        "intersecting": {
            "computed_score": 0.0,
            "final_commit_size": 11,
            "intersection_size": 0,
            "previous_commits_size": 1014
        },
        "is_makefile_based": true,
        "no_new_files": [
            "packcc.c"
        ],
        "no_other_files": false,
        "num_prohibited_files": 1417,
        "prohibited_files": [
            "makefile",
            "src/default/spiffs_config.h",
            "src/spiffs.h",
            "src/spiffs_nucleus.h",
            "src/test/test_spiffs.h",
            "tests/language-pronunciation.test",
            "tests/translate.test",
            "hal/inc/pinmap_hal.h",
            "Debug/marvin.bin",
            "Debug/marvin.elf"
        ],
        "reopen": true,
        "reopen_events": [
            [
                "2014-05-05 22:21:57",
                "commit"
            ],
            [
                "2014-09-17 22:55:19",
                "closed"
            ],
            [
                "2014-09-18 10:47:09",
                "reopened"
            ],
            [
                "2014-11-12 01:25:23",
                "closed"
            ],
            [
                "2014-11-14 14:19:13",
                "commit"
            ],
            [
                "2016-03-13 06:49:39",
                "commit"
            ],
            [
                "2020-02-28 12:21:22",
                "commit"
            ]
        ],
        "status": false,
        "strategy": true,
        "total_changes": 1594
    }
}