{
    "covered_issues": [
        38,
        30,
        29,
        26,
        23,
        22,
        21,
        20,
        18,
        16,
        12,
        10,
        9,
        7,
        6,
        5,
        3
    ],
    "finished": true
}