{
    "covered_issues": [
        281,
        273,
        272,
        267,
        265,
        263,
        257,
        245,
        236,
        235,
        234,
        228,
        226,
        219,
        218,
        212,
        210,
        206,
        202,
        197,
        193,
        192,
        190,
        188,
        187,
        186,
        185,
        184,
        183,
        182,
        181,
        179,
        178,
        174,
        173,
        170,
        161,
        159,
        158,
        157,
        153,
        152,
        150,
        148,
        133,
        128,
        126,
        125,
        124,
        116,
        115,
        113,
        112,
        111,
        110,
        107,
        104,
        103,
        98,
        95,
        94,
        91,
        89,
        87,
        86,
        85,
        84,
        83,
        82,
        80,
        75,
        74,
        73,
        72,
        71,
        70,
        68,
        67,
        61,
        60,
        57,
        56,
        55,
        53,
        52,
        51,
        47,
        46,
        45,
        44,
        43,
        42,
        41,
        40,
        34,
        32,
        30,
        27,
        26,
        22,
        21,
        19,
        18,
        13,
        12,
        11,
        5
    ],
    "finished": true
}