{
    "commits": [
        {
            "associated_pull_request": [
                "https://github.com/swaywm/wlroots/pull/1298"
            ],
            "date": "2018-10-09 11:41:04+00:00",
            "diff": "swaywm_wlroots/issue_1297/commit_8488ed299745f05ad6445cb22006da20fe926891.diff",
            "diff_additions": 12,
            "diff_deletions": 5,
            "diff_file_size": 45776,
            "diff_url": "https://github.com/swaywm/wlroots/commit/8488ed299745f05ad6445cb22006da20fe926891.diff",
            "exists": true,
            "files": [
                {
                    "file_additions": 7,
                    "file_deletions": 0,
                    "file_exists": true,
                    "file_name": "backend/drm/drm.c",
                    "file_size": 45776
                },
                {
                    "file_additions": 5,
                    "file_deletions": 5,
                    "file_exists": false,
                    "file_name": "types/wlr_output.c",
                    "file_size": 0
                }
            ],
            "interesting": {
                "reopen": false,
                "status": false
            },
            "is_parent": true,
            "sha": "8488ed299745f05ad6445cb22006da20fe926891"
        },
        {
            "associated_pull_request": [
                "https://github.com/swaywm/wlroots/pull/1301"
            ],
            "date": "2018-10-09 12:46:24+00:00",
            "diff": "swaywm_wlroots/issue_1297/commit_b66041a9e583a87c25b1d63a4c8b432d03999cc0.diff",
            "diff_additions": 0,
            "diff_deletions": 1,
            "diff_file_size": 45776,
            "diff_url": "https://github.com/swaywm/wlroots/commit/b66041a9e583a87c25b1d63a4c8b432d03999cc0.diff",
            "exists": true,
            "files": [
                {
                    "file_additions": 0,
                    "file_deletions": 1,
                    "file_exists": true,
                    "file_name": "backend/drm/drm.c",
                    "file_size": 45776
                }
            ],
            "interesting": {
                "reopen": true,
                "status": false
            },
            "is_parent": false,
            "sha": "b66041a9e583a87c25b1d63a4c8b432d03999cc0"
        },
        {
            "associated_pull_request": [],
            "date": "2019-06-26 15:14:31+00:00",
            "diff": "swaywm_wlroots/issue_1297/commit_0c34a11f370c619421884cecadcf512868226756.diff",
            "diff_additions": 27,
            "diff_deletions": 16,
            "diff_file_size": 60664,
            "diff_url": "https://github.com/swaywm/wlroots/commit/0c34a11f370c619421884cecadcf512868226756.diff",
            "exists": true,
            "files": [
                {
                    "file_additions": 9,
                    "file_deletions": 9,
                    "file_exists": true,
                    "file_name": "backend/drm/atomic.c",
                    "file_size": 8446
                },
                {
                    "file_additions": 17,
                    "file_deletions": 6,
                    "file_exists": true,
                    "file_name": "backend/drm/drm.c",
                    "file_size": 45776
                },
                {
                    "file_additions": 1,
                    "file_deletions": 1,
                    "file_exists": true,
                    "file_name": "backend/drm/legacy.c",
                    "file_size": 6442
                }
            ],
            "interesting": {
                "reopen": false,
                "status": false
            },
            "is_parent": false,
            "sha": "0c34a11f370c619421884cecadcf512868226756"
        },
        {
            "associated_pull_request": [],
            "date": "2019-06-26 15:14:31+00:00",
            "diff": "swaywm_wlroots/issue_1297/commit_4abf72953cddc178733efbe2c9056305bce5e046.diff",
            "diff_additions": 29,
            "diff_deletions": 9,
            "diff_file_size": 60664,
            "diff_url": "https://github.com/swaywm/wlroots/commit/4abf72953cddc178733efbe2c9056305bce5e046.diff",
            "exists": true,
            "files": [
                {
                    "file_additions": 4,
                    "file_deletions": 2,
                    "file_exists": true,
                    "file_name": "backend/drm/atomic.c",
                    "file_size": 8446
                },
                {
                    "file_additions": 24,
                    "file_deletions": 6,
                    "file_exists": true,
                    "file_name": "backend/drm/drm.c",
                    "file_size": 45776
                },
                {
                    "file_additions": 1,
                    "file_deletions": 1,
                    "file_exists": true,
                    "file_name": "backend/drm/legacy.c",
                    "file_size": 6442
                }
            ],
            "interesting": {
                "reopen": false,
                "status": false
            },
            "is_parent": false,
            "sha": "4abf72953cddc178733efbe2c9056305bce5e046"
        },
        {
            "associated_pull_request": [],
            "date": "2019-06-26 15:14:31+00:00",
            "diff": "swaywm_wlroots/issue_1297/commit_fa1603524bffffaf64595ba087dd68c07ed8f246.diff",
            "diff_additions": 29,
            "diff_deletions": 9,
            "diff_file_size": 60664,
            "diff_url": "https://github.com/swaywm/wlroots/commit/fa1603524bffffaf64595ba087dd68c07ed8f246.diff",
            "exists": true,
            "files": [
                {
                    "file_additions": 4,
                    "file_deletions": 2,
                    "file_exists": true,
                    "file_name": "backend/drm/atomic.c",
                    "file_size": 8446
                },
                {
                    "file_additions": 24,
                    "file_deletions": 6,
                    "file_exists": true,
                    "file_name": "backend/drm/drm.c",
                    "file_size": 45776
                },
                {
                    "file_additions": 1,
                    "file_deletions": 1,
                    "file_exists": true,
                    "file_name": "backend/drm/legacy.c",
                    "file_size": 6442
                }
            ],
            "interesting": {
                "reopen": false,
                "status": false
            },
            "is_parent": false,
            "sha": "fa1603524bffffaf64595ba087dd68c07ed8f246"
        },
        {
            "associated_pull_request": [],
            "date": "2019-06-26 15:14:31+00:00",
            "diff": "swaywm_wlroots/issue_1297/commit_40bea4b71aa62ef67496be6333df78e131a23e21.diff",
            "diff_additions": 29,
            "diff_deletions": 9,
            "diff_file_size": 60664,
            "diff_url": "https://github.com/swaywm/wlroots/commit/40bea4b71aa62ef67496be6333df78e131a23e21.diff",
            "exists": true,
            "files": [
                {
                    "file_additions": 4,
                    "file_deletions": 2,
                    "file_exists": true,
                    "file_name": "backend/drm/atomic.c",
                    "file_size": 8446
                },
                {
                    "file_additions": 24,
                    "file_deletions": 6,
                    "file_exists": true,
                    "file_name": "backend/drm/drm.c",
                    "file_size": 45776
                },
                {
                    "file_additions": 1,
                    "file_deletions": 1,
                    "file_exists": true,
                    "file_name": "backend/drm/legacy.c",
                    "file_size": 6442
                }
            ],
            "interesting": {
                "reopen": false,
                "status": false
            },
            "is_parent": false,
            "sha": "40bea4b71aa62ef67496be6333df78e131a23e21"
        },
        {
            "associated_pull_request": [],
            "date": "2019-06-26 15:14:31+00:00",
            "diff": "swaywm_wlroots/issue_1297/commit_fbb7c45d0c7d000ae8dbdd26249d10a1609be8ec.diff",
            "diff_additions": 28,
            "diff_deletions": 9,
            "diff_file_size": 60664,
            "diff_url": "https://github.com/swaywm/wlroots/commit/fbb7c45d0c7d000ae8dbdd26249d10a1609be8ec.diff",
            "exists": true,
            "files": [
                {
                    "file_additions": 4,
                    "file_deletions": 2,
                    "file_exists": true,
                    "file_name": "backend/drm/atomic.c",
                    "file_size": 8446
                },
                {
                    "file_additions": 23,
                    "file_deletions": 6,
                    "file_exists": true,
                    "file_name": "backend/drm/drm.c",
                    "file_size": 45776
                },
                {
                    "file_additions": 1,
                    "file_deletions": 1,
                    "file_exists": true,
                    "file_name": "backend/drm/legacy.c",
                    "file_size": 6442
                }
            ],
            "interesting": {
                "reopen": false,
                "status": false
            },
            "is_parent": false,
            "sha": "fbb7c45d0c7d000ae8dbdd26249d10a1609be8ec"
        },
        {
            "associated_pull_request": [],
            "date": "2019-06-26 15:14:31+00:00",
            "diff": "swaywm_wlroots/issue_1297/commit_520c8d3476743ce2931c066950b8ad2f1f5edef3.diff",
            "diff_additions": 28,
            "diff_deletions": 9,
            "diff_file_size": 60664,
            "diff_url": "https://github.com/swaywm/wlroots/commit/520c8d3476743ce2931c066950b8ad2f1f5edef3.diff",
            "exists": true,
            "files": [
                {
                    "file_additions": 4,
                    "file_deletions": 2,
                    "file_exists": true,
                    "file_name": "backend/drm/atomic.c",
                    "file_size": 8446
                },
                {
                    "file_additions": 23,
                    "file_deletions": 6,
                    "file_exists": true,
                    "file_name": "backend/drm/drm.c",
                    "file_size": 45776
                },
                {
                    "file_additions": 1,
                    "file_deletions": 1,
                    "file_exists": true,
                    "file_name": "backend/drm/legacy.c",
                    "file_size": 6442
                }
            ],
            "interesting": {
                "reopen": false,
                "status": false
            },
            "is_parent": false,
            "sha": "520c8d3476743ce2931c066950b8ad2f1f5edef3"
        },
        {
            "associated_pull_request": [
                "https://github.com/swaywm/wlroots/pull/1738"
            ],
            "date": "2019-06-26 15:14:31+00:00",
            "diff": "swaywm_wlroots/issue_1297/commit_996c3deb87431f471b193f16074db16ab01d9b04.diff",
            "diff_additions": 27,
            "diff_deletions": 9,
            "diff_file_size": 60664,
            "diff_url": "https://github.com/swaywm/wlroots/commit/996c3deb87431f471b193f16074db16ab01d9b04.diff",
            "exists": true,
            "files": [
                {
                    "file_additions": 4,
                    "file_deletions": 2,
                    "file_exists": true,
                    "file_name": "backend/drm/atomic.c",
                    "file_size": 8446
                },
                {
                    "file_additions": 22,
                    "file_deletions": 6,
                    "file_exists": true,
                    "file_name": "backend/drm/drm.c",
                    "file_size": 45776
                },
                {
                    "file_additions": 1,
                    "file_deletions": 1,
                    "file_exists": true,
                    "file_name": "backend/drm/legacy.c",
                    "file_size": 6442
                }
            ],
            "interesting": {
                "reopen": false,
                "status": false
            },
            "is_parent": false,
            "sha": "996c3deb87431f471b193f16074db16ab01d9b04"
        },
        {
            "associated_pull_request": [
                "https://github.com/swaywm/wlroots/pull/1738"
            ],
            "date": "2019-06-26 15:14:31+00:00",
            "diff": "swaywm_wlroots/issue_1297/commit_d10072e76cffa962d1bc32f056524708981dfa4a.diff",
            "diff_additions": 27,
            "diff_deletions": 9,
            "diff_file_size": 60664,
            "diff_url": "https://github.com/swaywm/wlroots/commit/d10072e76cffa962d1bc32f056524708981dfa4a.diff",
            "exists": true,
            "files": [
                {
                    "file_additions": 4,
                    "file_deletions": 2,
                    "file_exists": true,
                    "file_name": "backend/drm/atomic.c",
                    "file_size": 8446
                },
                {
                    "file_additions": 22,
                    "file_deletions": 6,
                    "file_exists": true,
                    "file_name": "backend/drm/drm.c",
                    "file_size": 45776
                },
                {
                    "file_additions": 1,
                    "file_deletions": 1,
                    "file_exists": true,
                    "file_name": "backend/drm/legacy.c",
                    "file_size": 6442
                }
            ],
            "interesting": {
                "reopen": false,
                "status": false
            },
            "is_parent": false,
            "sha": "d10072e76cffa962d1bc32f056524708981dfa4a"
        }
    ],
    "first_commit": "2018-10-09 11:41:04+00:00",
    "last_commit": "2019-06-27 00:17:27+00:00",
    "number": 1297,
    "pull_request": "None",
    "score": {
        "accidental_reopen_likely": false,
        "all_labels": [
            "bug"
        ],
        "contains_keywords": [
            "fail",
            "fix",
            "issu",
            "patch",
            "remov",
            "bug"
        ],
        "fix_size": 53,
        "has_labels": [
            "bug"
        ],
        "intersecting": {
            "computed_score": 1.0,
            "final_commit_size": 38,
            "intersection_size": 38,
            "previous_commits_size": 53
        },
        "is_makefile_based": false,
        "no_new_files": [],
        "no_other_files": true,
        "num_prohibited_files": 471944,
        "prohibited_files": [
            "server/src/main/java/com/genymobile/scrcpy/Device.java",
            "server/src/main/java/com/genymobile/scrcpy/wrappers/SurfaceControl.java",
            "server/src/main/java/com/genymobile/scrcpy/Device.java",
            "server/src/main/java/com/genymobile/scrcpy/wrappers/SurfaceControl.java",
            "app/meson.build",
            "app/scrcpy.1",
            "app/src/common.h",
            "app/src/scrcpy.h",
            "app/src/server.h",
            "server/src/main/java/com/genymobile/scrcpy/Workarounds.java"
        ],
        "reopen": true,
        "reopen_events": [
            [
                "2018-10-09 11:40:17+00:00",
                "closed"
            ],
            [
                "2018-10-09 11:51:33+00:00",
                "reopened"
            ],
            [
                "2018-10-09 12:53:52+00:00",
                "commit"
            ],
            [
                "2018-10-09 12:54:57+00:00",
                "commit"
            ],
            [
                "2018-10-09 18:57:03+00:00",
                "closed"
            ],
            [
                "2019-06-25 07:32:17+00:00",
                "reopened"
            ],
            [
                "2019-06-26 15:41:32+00:00",
                "commit"
            ],
            [
                "2019-06-26 17:53:36+00:00",
                "commit"
            ],
            [
                "2019-06-26 18:00:59+00:00",
                "commit"
            ],
            [
                "2019-06-26 18:01:26+00:00",
                "commit"
            ],
            [
                "2019-06-26 18:05:41+00:00",
                "commit"
            ],
            [
                "2019-06-26 19:12:32+00:00",
                "commit"
            ],
            [
                "2019-06-26 19:18:46+00:00",
                "commit"
            ],
            [
                "2019-06-27 00:17:28+00:00",
                "closed"
            ],
            [
                "2019-06-27 00:17:33+00:00",
                "commit"
            ]
        ],
        "status": false,
        "strategy": true,
        "total_changes": 321
    }
}