{
    "covered_issues": [
        597,
        591,
        590,
        573,
        567,
        564,
        562,
        558,
        549,
        540,
        539,
        537,
        527,
        525,
        524,
        519,
        513,
        511,
        508,
        507,
        501,
        498,
        497,
        495,
        494,
        492,
        487,
        486,
        477,
        474,
        472,
        471,
        460,
        457,
        456,
        455,
        452,
        450,
        447,
        442,
        441,
        440,
        436,
        435,
        434,
        433,
        432,
        431,
        430,
        427,
        426,
        425,
        424,
        419,
        415,
        411,
        408,
        407,
        406,
        405,
        403,
        400,
        398,
        395,
        394,
        393,
        391,
        390,
        388,
        383,
        382,
        379,
        378,
        377,
        376,
        375,
        367,
        362,
        360,
        355,
        354,
        353,
        352,
        351,
        349,
        344,
        341,
        338,
        336,
        330,
        325,
        319,
        313,
        312,
        306,
        303,
        302,
        300,
        299,
        298,
        296,
        295,
        292,
        291,
        290,
        289,
        288,
        287,
        286,
        285,
        283,
        282,
        279,
        278,
        277,
        276,
        273,
        272,
        270,
        265,
        263,
        262,
        261,
        258,
        255,
        254,
        252,
        250,
        247,
        246,
        234,
        233,
        232,
        231,
        230,
        227,
        226,
        225,
        221,
        220,
        217,
        213,
        212,
        209,
        207,
        205,
        203,
        202,
        201,
        195,
        193,
        192,
        191,
        190,
        188,
        187,
        185,
        184,
        183,
        182,
        181,
        179,
        175,
        171,
        170,
        168,
        167,
        166,
        162,
        154,
        153,
        150,
        147,
        143,
        142,
        141,
        140,
        139,
        138,
        137,
        130,
        129,
        128,
        125,
        124,
        120,
        116,
        115,
        113,
        112,
        111,
        110,
        105,
        102,
        101,
        99,
        98,
        95,
        90,
        86,
        85,
        78,
        76,
        74,
        72,
        69,
        68,
        66,
        65,
        64,
        62,
        61,
        60,
        59,
        57,
        56,
        55,
        54,
        52,
        50,
        49,
        42,
        41,
        39,
        38,
        37,
        35,
        34,
        33,
        30,
        29,
        28,
        24,
        21,
        17,
        14,
        11,
        1
    ],
    "finished": true
}