{
    "all_issues": 937,
    "interesting_issues": 5,
    "last_update": "2021-05-16 11:01:11.246725",
    "license": {
        "download": "https://raw.githubusercontent.com/zlib-ng/zlib-ng/develop/LICENSE.md",
        "name": "zlib License"
    },
    "ratio": 0.005336179295624333,
    "size": 6337,
    "stars": 857,
    "url": "https://github.com/zlib-ng/zlib-ng"
}