{
    "covered_issues": [
        806,
        803,
        802,
        798,
        797,
        796,
        792,
        786,
        781,
        775,
        774,
        772,
        771,
        763,
        762,
        761,
        759,
        752,
        750,
        749,
        746,
        745,
        742,
        741,
        738,
        735,
        734,
        733,
        732,
        731,
        730,
        729,
        728,
        721,
        702,
        696,
        695,
        694,
        693,
        692,
        691,
        690,
        688,
        687,
        686,
        684,
        680,
        679,
        677,
        676,
        675,
        669,
        666,
        661,
        655,
        654,
        653,
        646,
        643,
        641,
        640,
        632,
        631,
        630,
        618,
        616,
        615,
        614,
        612,
        607,
        606,
        601,
        600,
        599,
        592,
        590,
        588,
        586,
        584,
        581,
        577,
        576,
        575,
        572,
        571,
        570,
        569,
        568,
        567,
        565,
        564,
        563,
        562,
        559,
        558,
        557,
        555,
        554,
        553,
        549,
        548,
        544,
        543,
        542,
        534,
        533,
        530,
        529,
        528,
        526,
        523,
        520,
        517,
        515,
        512,
        511,
        509,
        508,
        505,
        502,
        500,
        498,
        496,
        494,
        493,
        491,
        490,
        488,
        487,
        486,
        484,
        483,
        482,
        481,
        480,
        478,
        477,
        475,
        474,
        473,
        470,
        468,
        466,
        465,
        464,
        463,
        462,
        460,
        459,
        458,
        457,
        454,
        453,
        450,
        448,
        447,
        446,
        444,
        441,
        438,
        436,
        434,
        432,
        431,
        430,
        429,
        426,
        425,
        423,
        422,
        420,
        417,
        416,
        415,
        414,
        413,
        412,
        411,
        410,
        409,
        408,
        407,
        406,
        405,
        404,
        403,
        401,
        400,
        399,
        398,
        397,
        396,
        395,
        394,
        393,
        392,
        391,
        390,
        389,
        388,
        387,
        386,
        385,
        384,
        382,
        380,
        378,
        377,
        375,
        374,
        373,
        372,
        370,
        369,
        368,
        367,
        366,
        365,
        364,
        363,
        362,
        361,
        360,
        359,
        355,
        354,
        353,
        352,
        351,
        349,
        348,
        347,
        345,
        343,
        342,
        341,
        339,
        337,
        336,
        335,
        334,
        333,
        332,
        331,
        330,
        329,
        327,
        325,
        324,
        323,
        322,
        320,
        319,
        318,
        317,
        314,
        312,
        311,
        310,
        309,
        307,
        305,
        304,
        299,
        295,
        292,
        291,
        290,
        289,
        288,
        286,
        285,
        284,
        283,
        282,
        281,
        280,
        279,
        278,
        272,
        271,
        269,
        268,
        266,
        265,
        261,
        260,
        259,
        258,
        257,
        256,
        255,
        254,
        253,
        252,
        251,
        250,
        249,
        248,
        246,
        245,
        244,
        243,
        242,
        241,
        240,
        238,
        237,
        236,
        235,
        234,
        233,
        232,
        231,
        230,
        229,
        228,
        227,
        226,
        225,
        224,
        223,
        221,
        220,
        219,
        218,
        217,
        216,
        215,
        214,
        213,
        212,
        211,
        210,
        209,
        205,
        204,
        203,
        202,
        201,
        200,
        199,
        198,
        197,
        196,
        195,
        194,
        191,
        190,
        189,
        185,
        183,
        179,
        178,
        176,
        175,
        174,
        166,
        165,
        160,
        158,
        156,
        154,
        151,
        149,
        147,
        146,
        145,
        144,
        143,
        137,
        134,
        131,
        130,
        129,
        128,
        127,
        126,
        125,
        123,
        121,
        116,
        108,
        107,
        105,
        101,
        100,
        99,
        98,
        97,
        95,
        94,
        93,
        92,
        89,
        88,
        87,
        83,
        82,
        80,
        79,
        78,
        77,
        76,
        69,
        68,
        66,
        65,
        60,
        59,
        58,
        56,
        55,
        53,
        50,
        49,
        48,
        47,
        46,
        45,
        43,
        42,
        41,
        40,
        39,
        38,
        37,
        34,
        33,
        31,
        28,
        26,
        25,
        24,
        22,
        21,
        20,
        19,
        18,
        17,
        15,
        11,
        10,
        9,
        8,
        7,
        6,
        5
    ],
    "finished": true
}