{
    "commits": [
        {
            "associated_pull_request": [],
            "date": "2019-09-14 06:23:30+00:00",
            "diff": "libredwg_libredwg/issue_143/commit_5b4d9ea27f2b876e24ab9565f884a1ffbda5b173.diff",
            "diff_additions": 7,
            "diff_deletions": 3,
            "diff_file_size": 332733,
            "diff_url": "https://github.com/LibreDWG/libredwg/commit/5b4d9ea27f2b876e24ab9565f884a1ffbda5b173.diff",
            "exists": true,
            "files": [
                {
                    "file_additions": 1,
                    "file_deletions": 1,
                    "file_exists": true,
                    "file_name": "src/dwg.c",
                    "file_size": 108424
                },
                {
                    "file_additions": 2,
                    "file_deletions": 0,
                    "file_exists": true,
                    "file_name": "src/free.c",
                    "file_size": 58606
                },
                {
                    "file_additions": 4,
                    "file_deletions": 2,
                    "file_exists": true,
                    "file_name": "src/out_dxf.c",
                    "file_size": 165703
                }
            ],
            "interesting": {
                "reopen": false,
                "status": false
            },
            "is_parent": true,
            "sha": "5b4d9ea27f2b876e24ab9565f884a1ffbda5b173"
        },
        {
            "associated_pull_request": [],
            "date": "2019-09-14 08:05:17+00:00",
            "diff": "libredwg_libredwg/issue_143/commit_753571a4629aeb2bc021f5a8974c8d78bf8e9883.diff",
            "diff_additions": 16,
            "diff_deletions": 8,
            "diff_file_size": 348305,
            "diff_url": "https://github.com/LibreDWG/libredwg/commit/753571a4629aeb2bc021f5a8974c8d78bf8e9883.diff",
            "exists": true,
            "files": [
                {
                    "file_additions": 6,
                    "file_deletions": 2,
                    "file_exists": true,
                    "file_name": "src/bits.c",
                    "file_size": 112522
                },
                {
                    "file_additions": 10,
                    "file_deletions": 6,
                    "file_exists": true,
                    "file_name": "src/decode.c",
                    "file_size": 235783
                }
            ],
            "interesting": {
                "reopen": false,
                "status": false
            },
            "is_parent": false,
            "sha": "753571a4629aeb2bc021f5a8974c8d78bf8e9883"
        },
        {
            "associated_pull_request": [],
            "date": "2019-09-14 08:05:17+00:00",
            "diff": "libredwg_libredwg/issue_143/commit_96d246b76be9694c656e457392a09639582e69dd.diff",
            "diff_additions": 28,
            "diff_deletions": 10,
            "diff_file_size": 348305,
            "diff_url": "https://github.com/LibreDWG/libredwg/commit/96d246b76be9694c656e457392a09639582e69dd.diff",
            "exists": true,
            "files": [
                {
                    "file_additions": 12,
                    "file_deletions": 4,
                    "file_exists": true,
                    "file_name": "src/bits.c",
                    "file_size": 112522
                },
                {
                    "file_additions": 16,
                    "file_deletions": 6,
                    "file_exists": true,
                    "file_name": "src/decode.c",
                    "file_size": 235783
                }
            ],
            "interesting": {
                "reopen": false,
                "status": false
            },
            "is_parent": false,
            "sha": "96d246b76be9694c656e457392a09639582e69dd"
        },
        {
            "associated_pull_request": [],
            "date": "2019-09-14 09:50:33+00:00",
            "diff": "libredwg_libredwg/issue_143/commit_a93ea27bfa16e639a6ae87599f76c7e2a6ec23f7.diff",
            "diff_additions": 44,
            "diff_deletions": 25,
            "diff_file_size": 235783,
            "diff_url": "https://github.com/LibreDWG/libredwg/commit/a93ea27bfa16e639a6ae87599f76c7e2a6ec23f7.diff",
            "exists": true,
            "files": [
                {
                    "file_additions": 44,
                    "file_deletions": 25,
                    "file_exists": true,
                    "file_name": "src/decode.c",
                    "file_size": 235783
                }
            ],
            "interesting": {
                "reopen": false,
                "status": false
            },
            "is_parent": false,
            "sha": "a93ea27bfa16e639a6ae87599f76c7e2a6ec23f7"
        },
        {
            "associated_pull_request": [],
            "date": "2019-09-14 12:17:18+00:00",
            "diff": "libredwg_libredwg/issue_143/commit_977bb8bae5efe327473fda9bd65bd5667298adae.diff",
            "diff_additions": 42,
            "diff_deletions": 36,
            "diff_file_size": 348305,
            "diff_url": "https://github.com/LibreDWG/libredwg/commit/977bb8bae5efe327473fda9bd65bd5667298adae.diff",
            "exists": true,
            "files": [
                {
                    "file_additions": 14,
                    "file_deletions": 15,
                    "file_exists": true,
                    "file_name": "src/bits.c",
                    "file_size": 112522
                },
                {
                    "file_additions": 28,
                    "file_deletions": 21,
                    "file_exists": true,
                    "file_name": "src/decode.c",
                    "file_size": 235783
                }
            ],
            "interesting": {
                "reopen": false,
                "status": false
            },
            "is_parent": false,
            "sha": "977bb8bae5efe327473fda9bd65bd5667298adae"
        },
        {
            "associated_pull_request": [],
            "date": "2019-09-14 12:17:18+00:00",
            "diff": "libredwg_libredwg/issue_143/commit_4cd207948fbad1142421ccc14b34f28d0b6d84a0.diff",
            "diff_additions": 42,
            "diff_deletions": 36,
            "diff_file_size": 348305,
            "diff_url": "https://github.com/LibreDWG/libredwg/commit/4cd207948fbad1142421ccc14b34f28d0b6d84a0.diff",
            "exists": true,
            "files": [
                {
                    "file_additions": 14,
                    "file_deletions": 15,
                    "file_exists": true,
                    "file_name": "src/bits.c",
                    "file_size": 112522
                },
                {
                    "file_additions": 28,
                    "file_deletions": 21,
                    "file_exists": true,
                    "file_name": "src/decode.c",
                    "file_size": 235783
                }
            ],
            "interesting": {
                "reopen": false,
                "status": false
            },
            "is_parent": false,
            "sha": "4cd207948fbad1142421ccc14b34f28d0b6d84a0"
        },
        {
            "associated_pull_request": [],
            "date": "2019-09-14 12:17:18+00:00",
            "diff": "libredwg_libredwg/issue_143/commit_a091a259ed2b34ce955f9c3a055dbf4ff6f0abc2.diff",
            "diff_additions": 46,
            "diff_deletions": 38,
            "diff_file_size": 456729,
            "diff_url": "https://github.com/LibreDWG/libredwg/commit/a091a259ed2b34ce955f9c3a055dbf4ff6f0abc2.diff",
            "exists": true,
            "files": [
                {
                    "file_additions": 14,
                    "file_deletions": 15,
                    "file_exists": true,
                    "file_name": "src/bits.c",
                    "file_size": 112522
                },
                {
                    "file_additions": 28,
                    "file_deletions": 21,
                    "file_exists": true,
                    "file_name": "src/decode.c",
                    "file_size": 235783
                },
                {
                    "file_additions": 4,
                    "file_deletions": 2,
                    "file_exists": true,
                    "file_name": "src/dwg.c",
                    "file_size": 108424
                }
            ],
            "interesting": {
                "reopen": false,
                "status": false
            },
            "is_parent": false,
            "sha": "a091a259ed2b34ce955f9c3a055dbf4ff6f0abc2"
        },
        {
            "associated_pull_request": [],
            "date": "2019-09-23 17:00:11+00:00",
            "diff": "libredwg_libredwg/issue_143/commit_87ef5e7d7f0135422e7ff46f012c9a42f4c90ccc.diff",
            "diff_additions": 3,
            "diff_deletions": 2,
            "diff_file_size": 165703,
            "diff_url": "https://github.com/LibreDWG/libredwg/commit/87ef5e7d7f0135422e7ff46f012c9a42f4c90ccc.diff",
            "exists": true,
            "files": [
                {
                    "file_additions": 3,
                    "file_deletions": 2,
                    "file_exists": true,
                    "file_name": "src/out_dxf.c",
                    "file_size": 165703
                }
            ],
            "interesting": {
                "reopen": true,
                "status": false
            },
            "is_parent": false,
            "sha": "87ef5e7d7f0135422e7ff46f012c9a42f4c90ccc"
        },
        {
            "associated_pull_request": [],
            "date": "2019-10-02 13:25:01+00:00",
            "diff": "libredwg_libredwg/issue_143/commit_605fc42f0087651c31840f35fe8a1031365a23eb.diff",
            "diff_additions": 13,
            "diff_deletions": 20,
            "diff_file_size": 401486,
            "diff_url": "https://github.com/LibreDWG/libredwg/commit/605fc42f0087651c31840f35fe8a1031365a23eb.diff",
            "exists": true,
            "files": [
                {
                    "file_additions": 9,
                    "file_deletions": 3,
                    "file_exists": true,
                    "file_name": "src/decode.c",
                    "file_size": 235783
                },
                {
                    "file_additions": 4,
                    "file_deletions": 17,
                    "file_exists": true,
                    "file_name": "src/out_dxf.c",
                    "file_size": 165703
                }
            ],
            "interesting": {
                "reopen": false,
                "status": false
            },
            "is_parent": false,
            "sha": "605fc42f0087651c31840f35fe8a1031365a23eb"
        },
        {
            "associated_pull_request": [],
            "date": "2019-10-02 13:25:01+00:00",
            "diff": "libredwg_libredwg/issue_143/commit_def0d86f7559b5924f3237fbb699d0d41d437dae.diff",
            "diff_additions": 13,
            "diff_deletions": 20,
            "diff_file_size": 401486,
            "diff_url": "https://github.com/LibreDWG/libredwg/commit/def0d86f7559b5924f3237fbb699d0d41d437dae.diff",
            "exists": true,
            "files": [
                {
                    "file_additions": 9,
                    "file_deletions": 3,
                    "file_exists": true,
                    "file_name": "src/decode.c",
                    "file_size": 235783
                },
                {
                    "file_additions": 4,
                    "file_deletions": 17,
                    "file_exists": true,
                    "file_name": "src/out_dxf.c",
                    "file_size": 165703
                }
            ],
            "interesting": {
                "reopen": false,
                "status": false
            },
            "is_parent": false,
            "sha": "def0d86f7559b5924f3237fbb699d0d41d437dae"
        },
        {
            "associated_pull_request": [],
            "date": "2019-10-05 08:21:51+00:00",
            "diff": "libredwg_libredwg/issue_143/commit_e5b96927d858d8eba7d18a619e0798a3aba4211a.diff",
            "diff_additions": 25,
            "diff_deletions": 18,
            "diff_file_size": 348305,
            "diff_url": "https://github.com/LibreDWG/libredwg/commit/e5b96927d858d8eba7d18a619e0798a3aba4211a.diff",
            "exists": true,
            "files": [
                {
                    "file_additions": 23,
                    "file_deletions": 16,
                    "file_exists": true,
                    "file_name": "src/bits.c",
                    "file_size": 112522
                },
                {
                    "file_additions": 2,
                    "file_deletions": 2,
                    "file_exists": true,
                    "file_name": "src/decode.c",
                    "file_size": 235783
                }
            ],
            "interesting": {
                "reopen": false,
                "status": false
            },
            "is_parent": false,
            "sha": "e5b96927d858d8eba7d18a619e0798a3aba4211a"
        },
        {
            "associated_pull_request": [],
            "date": "2019-10-05 08:21:51+00:00",
            "diff": "libredwg_libredwg/issue_143/commit_63c70e57ef59aef8612d413507adf026f1e59a58.diff",
            "diff_additions": 25,
            "diff_deletions": 18,
            "diff_file_size": 348305,
            "diff_url": "https://github.com/LibreDWG/libredwg/commit/63c70e57ef59aef8612d413507adf026f1e59a58.diff",
            "exists": true,
            "files": [
                {
                    "file_additions": 23,
                    "file_deletions": 16,
                    "file_exists": true,
                    "file_name": "src/bits.c",
                    "file_size": 112522
                },
                {
                    "file_additions": 2,
                    "file_deletions": 2,
                    "file_exists": true,
                    "file_name": "src/decode.c",
                    "file_size": 235783
                }
            ],
            "interesting": {
                "reopen": false,
                "status": false
            },
            "is_parent": false,
            "sha": "63c70e57ef59aef8612d413507adf026f1e59a58"
        },
        {
            "associated_pull_request": [],
            "date": "2019-10-05 16:34:11+00:00",
            "diff": "libredwg_libredwg/issue_143/commit_3051810b6ebb5d7327755cad70fd1fd1e614abbb.diff",
            "diff_additions": 3,
            "diff_deletions": 2,
            "diff_file_size": 108424,
            "diff_url": "https://github.com/LibreDWG/libredwg/commit/3051810b6ebb5d7327755cad70fd1fd1e614abbb.diff",
            "exists": true,
            "files": [
                {
                    "file_additions": 3,
                    "file_deletions": 2,
                    "file_exists": true,
                    "file_name": "src/dwg.c",
                    "file_size": 108424
                }
            ],
            "interesting": {
                "reopen": false,
                "status": false
            },
            "is_parent": false,
            "sha": "3051810b6ebb5d7327755cad70fd1fd1e614abbb"
        }
    ],
    "first_commit": "2019-09-14 06:32:03+00:00",
    "last_commit": "2019-10-05 16:36:38+00:00",
    "number": 143,
    "pull_request": "None",
    "score": {
        "accidental_reopen_likely": false,
        "all_labels": [
            "bug",
            "blocking"
        ],
        "contains_keywords": [
            "fix",
            "CI",
            "test",
            "fault",
            "bug",
            "error",
            "problem"
        ],
        "fix_size": 211,
        "has_labels": [
            "bug"
        ],
        "intersecting": {
            "computed_score": 0.2,
            "final_commit_size": 5,
            "intersection_size": 1,
            "previous_commits_size": 207
        },
        "is_makefile_based": true,
        "no_new_files": [],
        "no_other_files": false,
        "num_prohibited_files": 802270,
        "prohibited_files": [
            "server/src/main/java/com/genymobile/scrcpy/Device.java",
            "server/src/main/java/com/genymobile/scrcpy/wrappers/SurfaceControl.java",
            "server/src/main/java/com/genymobile/scrcpy/Device.java",
            "server/src/main/java/com/genymobile/scrcpy/wrappers/SurfaceControl.java",
            "app/meson.build",
            "app/scrcpy.1",
            "app/src/common.h",
            "app/src/scrcpy.h",
            "app/src/server.h",
            "server/src/main/java/com/genymobile/scrcpy/Workarounds.java"
        ],
        "reopen": true,
        "reopen_events": [
            [
                "2019-09-14 09:13:20+00:00",
                "commit"
            ],
            [
                "2019-09-14 12:30:34+00:00",
                "commit"
            ],
            [
                "2019-09-14 12:30:34+00:00",
                "commit"
            ],
            [
                "2019-09-14 12:30:34+00:00",
                "commit"
            ],
            [
                "2019-09-14 12:55:48+00:00",
                "commit"
            ],
            [
                "2019-09-14 15:13:32+00:00",
                "commit"
            ],
            [
                "2019-09-23 17:00:39+00:00",
                "commit"
            ],
            [
                "2019-09-23 17:00:56+00:00",
                "closed"
            ],
            [
                "2019-09-23 17:16:24+00:00",
                "reopened"
            ],
            [
                "2019-09-23 17:24:27+00:00",
                "commit"
            ],
            [
                "2019-09-23 20:36:12+00:00",
                "closed"
            ],
            [
                "2019-09-24 09:21:45+00:00",
                "reopened"
            ],
            [
                "2019-10-02 13:52:25+00:00",
                "commit"
            ],
            [
                "2019-10-02 14:04:00+00:00",
                "commit"
            ],
            [
                "2019-10-05 08:44:49+00:00",
                "commit"
            ],
            [
                "2019-10-05 08:55:59+00:00",
                "commit"
            ],
            [
                "2019-10-05 10:02:27+00:00",
                "commit"
            ],
            [
                "2019-10-05 16:38:31+00:00",
                "commit"
            ],
            [
                "2019-10-05 19:25:58+00:00",
                "closed"
            ]
        ],
        "status": false,
        "strategy": true,
        "total_changes": 543
    }
}