{
    "commits": [
        {
            "associated_pull_request": [
                "https://github.com/radareorg/radare2/pull/21817"
            ],
            "date": "2023-05-31 22:52:06+00:00",
            "diff": "radareorg_radare2/issue_21813/commit_945b56ece66d76203fc0cb52b250261715f70af3.diff",
            "diff_additions": 8,
            "diff_deletions": 3,
            "diff_file_size": 1954,
            "diff_url": "https://github.com/radareorg/radare2/commit/945b56ece66d76203fc0cb52b250261715f70af3.diff",
            "exists": true,
            "files": [
                {
                    "file_additions": 8,
                    "file_deletions": 3,
                    "file_exists": true,
                    "file_name": "libr/arch/p/i8080/i8080.c",
                    "file_size": 1954
                }
            ],
            "interesting": {
                "reopen": false,
                "status": false
            },
            "is_parent": true,
            "sha": "945b56ece66d76203fc0cb52b250261715f70af3"
        },
        {
            "associated_pull_request": [
                "https://github.com/radareorg/radare2/pull/21815"
            ],
            "date": "2023-06-01 10:26:26+00:00",
            "diff": "radareorg_radare2/issue_21813/commit_cc37f0c60684ee9747a01398f3e92dadba859f28.diff",
            "diff_additions": 13,
            "diff_deletions": 13,
            "diff_file_size": 18080,
            "diff_url": "https://github.com/radareorg/radare2/commit/cc37f0c60684ee9747a01398f3e92dadba859f28.diff",
            "exists": true,
            "files": [
                {
                    "file_additions": 13,
                    "file_deletions": 13,
                    "file_exists": true,
                    "file_name": "libr/debug/p/debug_gdb.c",
                    "file_size": 18080
                }
            ],
            "interesting": {
                "reopen": true,
                "status": false
            },
            "is_parent": false,
            "sha": "cc37f0c60684ee9747a01398f3e92dadba859f28"
        },
        {
            "associated_pull_request": [],
            "date": "2023-06-07 18:02:08+00:00",
            "diff": "radareorg_radare2/issue_21813/commit_c08d1c2a4a3b2f06aabd886efe9a422718829b76.diff",
            "diff_additions": 33,
            "diff_deletions": 7,
            "diff_file_size": 18080,
            "diff_url": "https://github.com/radareorg/radare2/commit/c08d1c2a4a3b2f06aabd886efe9a422718829b76.diff",
            "exists": true,
            "files": [
                {
                    "file_additions": 33,
                    "file_deletions": 7,
                    "file_exists": true,
                    "file_name": "libr/debug/p/debug_gdb.c",
                    "file_size": 18080
                }
            ],
            "interesting": {
                "reopen": false,
                "status": false
            },
            "is_parent": false,
            "sha": "c08d1c2a4a3b2f06aabd886efe9a422718829b76"
        }
    ],
    "first_commit": "2023-06-01 00:10:08+00:00",
    "last_commit": "2023-06-07 18:02:08+00:00",
    "number": 21813,
    "pull_request": "None",
    "score": {
        "accidental_reopen_likely": false,
        "all_labels": [],
        "contains_keywords": [
            "work",
            "fail",
            "fix",
            "debug",
            "test",
            "bug",
            "error",
            "report"
        ],
        "fix_size": 51,
        "has_labels": [],
        "intersecting": {
            "computed_score": 0.14285714285714285,
            "final_commit_size": 35,
            "intersection_size": 5,
            "previous_commits_size": 21
        },
        "is_makefile_based": true,
        "no_new_files": [],
        "no_other_files": false,
        "num_prohibited_files": 14919,
        "prohibited_files": [
            "server/src/main/java/com/genymobile/scrcpy/Device.java",
            "server/src/main/java/com/genymobile/scrcpy/wrappers/SurfaceControl.java",
            "server/src/main/java/com/genymobile/scrcpy/Device.java",
            "server/src/main/java/com/genymobile/scrcpy/wrappers/SurfaceControl.java",
            "app/meson.build",
            "app/scrcpy.1",
            "app/src/common.h",
            "app/src/scrcpy.h",
            "app/src/server.h",
            "server/src/main/java/com/genymobile/scrcpy/Workarounds.java"
        ],
        "reopen": true,
        "reopen_events": [
            [
                "2023-06-01 10:26:29+00:00",
                "closed"
            ],
            [
                "2023-06-01 10:26:29+00:00",
                "commit"
            ],
            [
                "2023-06-01 13:20:10+00:00",
                "reopened"
            ],
            [
                "2023-06-07 18:17:45+00:00",
                "commit"
            ],
            [
                "2023-06-08 09:37:47+00:00",
                "closed"
            ]
        ],
        "status": false,
        "strategy": true,
        "total_changes": 77
    }
}