{
    "category": [
        "network/protocols",
        "build/refactor/preprocessing"
    ],
    "commits": [
        {
            "associated_pull_request": [
                "https://github.com/nanomsg/nng/pull/1299"
            ],
            "date": "2020-10-05 13:30:40",
            "diff": "",
            "diff_additions": 0,
            "diff_deletions": 0,
            "diff_file_size": 0,
            "diff_url": "https://github.com/nanomsg/nng/commit/206de0ad6f338c7e375885443836fbb44853550b.diff",
            "exists": true,
            "files": [],
            "interesting": {
                "reopen": false,
                "status": true
            },
            "is_parent": true,
            "sha": "206de0ad6f338c7e375885443836fbb44853550b"
        },
        {
            "associated_pull_request": [],
            "date": "2020-10-25 19:55:34",
            "diff": "nanomsg_nng/issue_1304/commit_7d252de8654200fb23f302a47cbc5eeeb434a641.diff",
            "diff_additions": 35,
            "diff_deletions": 8,
            "diff_file_size": 0,
            "diff_url": "https://github.com/nanomsg/nng/commit/7d252de8654200fb23f302a47cbc5eeeb434a641.diff",
            "exists": true,
            "files": [
                {
                    "file_additions": 6,
                    "file_deletions": 6,
                    "file_exists": false,
                    "file_name": "src/protocol/reqrep0/rep.c",
                    "file_size": 0
                },
                {
                    "file_additions": 29,
                    "file_deletions": 2,
                    "file_exists": false,
                    "file_name": "src/protocol/reqrep0/rep_test.c",
                    "file_size": 0
                }
            ],
            "interesting": {
                "reopen": false,
                "status": true
            },
            "is_parent": false,
            "sha": "7d252de8654200fb23f302a47cbc5eeeb434a641"
        },
        {
            "associated_pull_request": [
                "https://github.com/nanomsg/nng/pull/1305"
            ],
            "date": "2020-10-25 19:55:34",
            "diff": "nanomsg_nng/issue_1304/commit_f61e6ee3be9c7b39447140c70de0577858fda7bc.diff",
            "diff_additions": 103,
            "diff_deletions": 10,
            "diff_file_size": 0,
            "diff_url": "https://github.com/nanomsg/nng/commit/f61e6ee3be9c7b39447140c70de0577858fda7bc.diff",
            "exists": true,
            "files": [
                {
                    "file_additions": 6,
                    "file_deletions": 6,
                    "file_exists": false,
                    "file_name": "src/protocol/reqrep0/rep.c",
                    "file_size": 0
                },
                {
                    "file_additions": 97,
                    "file_deletions": 4,
                    "file_exists": false,
                    "file_name": "src/protocol/reqrep0/rep_test.c",
                    "file_size": 0
                }
            ],
            "interesting": {
                "reopen": false,
                "status": false
            },
            "is_parent": false,
            "sha": "f61e6ee3be9c7b39447140c70de0577858fda7bc"
        },
        {
            "associated_pull_request": [
                "https://github.com/nanomsg/nng/pull/1305"
            ],
            "date": "2020-10-26 05:23:28",
            "diff": "nanomsg_nng/issue_1304/commit_4e7205cedb5f631d0fbbe72dbf89b5b9205a6260.diff",
            "diff_additions": 103,
            "diff_deletions": 10,
            "diff_file_size": 0,
            "diff_url": "https://github.com/nanomsg/nng/commit/4e7205cedb5f631d0fbbe72dbf89b5b9205a6260.diff",
            "exists": true,
            "files": [
                {
                    "file_additions": 6,
                    "file_deletions": 6,
                    "file_exists": false,
                    "file_name": "src/protocol/reqrep0/rep.c",
                    "file_size": 0
                },
                {
                    "file_additions": 97,
                    "file_deletions": 4,
                    "file_exists": false,
                    "file_name": "src/protocol/reqrep0/rep_test.c",
                    "file_size": 0
                }
            ],
            "interesting": {
                "reopen": false,
                "status": false
            },
            "is_parent": false,
            "sha": "4e7205cedb5f631d0fbbe72dbf89b5b9205a6260"
        }
    ],
    "first_commit": "2020-10-05 13:30:40",
    "last_commit": "2020-10-26 05:23:28",
    "number": 1304,
    "pull_request": "None",
    "score": {
        "accidental_reopen_likely": false,
        "all_labels": [
            "bug"
        ],
        "contains_keywords": [
            "fail",
            "problem",
            "test",
            "fix"
        ],
        "fix_size": 111,
        "has_labels": [
            "bug"
        ],
        "intersecting": {
            "computed_score": 1.0,
            "final_commit_size": 111,
            "intersection_size": 111,
            "previous_commits_size": 111
        },
        "is_makefile_based": true,
        "no_new_files": [],
        "no_other_files": true,
        "num_prohibited_files": 48606,
        "prohibited_files": [
            "hal/inc/pinmap_hal.h",
            "Debug/marvin.bin",
            "Debug/marvin.elf",
            "Debug/marvin.hex",
            "Debug/marvin.bin",
            "Debug/marvin.elf",
            "Debug/marvin.hex",
            "inc/spark_utilities.h",
            "Debug/marvin.bin",
            "Debug/marvin.elf"
        ],
        "reopen": false,
        "reopen_events": [
            [
                "2020-10-25 19:56:04",
                "commit"
            ],
            [
                "2020-10-26 05:23:16",
                "commit"
            ],
            [
                "2020-10-26 05:23:30",
                "closed"
            ],
            [
                "2020-10-26 05:23:30",
                "commit"
            ]
        ],
        "status": true,
        "strategy": true,
        "total_changes": 269
    }
}