{
    "covered_issues": [
        99,
        89,
        83,
        79,
        78,
        77,
        68,
        67,
        66,
        59,
        54,
        52,
        49,
        48,
        47,
        43,
        40,
        37,
        32,
        31,
        24,
        22,
        20,
        19,
        18,
        17,
        16,
        15,
        14,
        13,
        12,
        10,
        9,
        8,
        7,
        6,
        4,
        3,
        2,
        1
    ],
    "finished": true
}