{
    "commits": [
        {
            "associated_pull_request": [],
            "date": "2017-06-05 21:42:26+00:00",
            "diff": "",
            "diff_additions": 0,
            "diff_deletions": 0,
            "diff_file_size": 0,
            "diff_url": "https://github.com/AppImage/AppImageKit/commit/8e36a3cc19c6279578c71069d3d3500812db45ff.diff",
            "exists": true,
            "files": [],
            "interesting": {
                "reopen": false,
                "status": false
            },
            "is_parent": true,
            "sha": "8e36a3cc19c6279578c71069d3d3500812db45ff"
        },
        {
            "associated_pull_request": [],
            "date": "2017-06-06 16:54:21+00:00",
            "diff": "appimage_appimagekit/issue_372/commit_c6ad421827711359799f7763876d525b2e75c0d4.diff",
            "diff_additions": 7,
            "diff_deletions": 7,
            "diff_file_size": 0,
            "diff_url": "https://github.com/AppImage/AppImageKit/commit/c6ad421827711359799f7763876d525b2e75c0d4.diff",
            "exists": true,
            "files": [
                {
                    "file_additions": 7,
                    "file_deletions": 7,
                    "file_exists": false,
                    "file_name": "binreloc.c",
                    "file_size": 0
                }
            ],
            "interesting": {
                "reopen": false,
                "status": false
            },
            "is_parent": false,
            "sha": "c6ad421827711359799f7763876d525b2e75c0d4"
        },
        {
            "associated_pull_request": [
                "https://github.com/AppImage/AppImageKit/pull/424"
            ],
            "date": "2017-07-05 22:45:47+00:00",
            "diff": "appimage_appimagekit/issue_372/commit_22db97ec75ec68301575f4fd82956ded6b881b41.diff",
            "diff_additions": 4,
            "diff_deletions": 4,
            "diff_file_size": 0,
            "diff_url": "https://github.com/AppImage/AppImageKit/commit/22db97ec75ec68301575f4fd82956ded6b881b41.diff",
            "exists": true,
            "files": [
                {
                    "file_additions": 4,
                    "file_deletions": 4,
                    "file_exists": false,
                    "file_name": "binreloc.c",
                    "file_size": 0
                }
            ],
            "interesting": {
                "reopen": false,
                "status": false
            },
            "is_parent": false,
            "sha": "22db97ec75ec68301575f4fd82956ded6b881b41"
        }
    ],
    "first_commit": "2017-06-05 21:42:26+00:00",
    "last_commit": "2017-07-05 22:45:47+00:00",
    "number": 372,
    "pull_request": "None",
    "score": {
        "accidental_reopen_likely": false,
        "all_labels": [],
        "contains_keywords": [
            "work",
            "chang",
            "fix",
            "issu",
            "perform",
            "reason",
            "warn",
            "bug",
            "error",
            "problem",
            "report"
        ],
        "fix_size": 8,
        "has_labels": [],
        "intersecting": {
            "computed_score": 1.0,
            "final_commit_size": 5,
            "intersection_size": 5,
            "previous_commits_size": 8
        },
        "is_makefile_based": true,
        "no_new_files": [],
        "no_other_files": false,
        "num_prohibited_files": 27657,
        "prohibited_files": [
            "server/src/main/java/com/genymobile/scrcpy/Device.java",
            "server/src/main/java/com/genymobile/scrcpy/wrappers/SurfaceControl.java",
            "server/src/main/java/com/genymobile/scrcpy/Device.java",
            "server/src/main/java/com/genymobile/scrcpy/wrappers/SurfaceControl.java",
            "app/meson.build",
            "app/scrcpy.1",
            "app/src/common.h",
            "app/src/scrcpy.h",
            "app/src/server.h",
            "server/src/main/java/com/genymobile/scrcpy/Workarounds.java"
        ],
        "reopen": true,
        "reopen_events": [
            [
                "2017-06-05 21:46:34+00:00",
                "commit"
            ],
            [
                "2017-06-05 21:48:00+00:00",
                "closed"
            ],
            [
                "2017-06-05 21:48:00+00:00",
                "commit"
            ],
            [
                "2017-06-06 09:41:17+00:00",
                "reopened"
            ],
            [
                "2017-06-06 16:52:34+00:00",
                "commit"
            ],
            [
                "2017-06-06 16:54:22+00:00",
                "commit"
            ],
            [
                "2017-07-05 22:46:47+00:00",
                "commit"
            ],
            [
                "2017-07-06 08:07:49+00:00",
                "closed"
            ]
        ],
        "status": false,
        "strategy": true,
        "total_changes": 22
    }
}