{
    "category": [
        "memory",
        "hardware/OS"
    ],
    "commits": [
        {
            "associated_pull_request": [],
            "date": "2017-12-26 02:19:30",
            "diff": "",
            "diff_additions": 0,
            "diff_deletions": 0,
            "diff_file_size": 0,
            "diff_url": "https://github.com/ponylang/ponyc/commit/5bd1422eb979d7855a8afec9eaf64e8be74159b2.diff",
            "exists": true,
            "files": [],
            "interesting": {
                "reopen": false,
                "status": false
            },
            "is_parent": true,
            "sha": "5bd1422eb979d7855a8afec9eaf64e8be74159b2"
        },
        {
            "associated_pull_request": [],
            "date": "2018-01-06 18:32:04",
            "diff": "ponylang_ponyc/issue_2451/commit_0c2ec8ce7194472e74b8b61008a8ab2f23ae9c1e.diff",
            "diff_additions": 63,
            "diff_deletions": 32,
            "diff_file_size": 53843,
            "diff_url": "https://github.com/ponylang/ponyc/commit/0c2ec8ce7194472e74b8b61008a8ab2f23ae9c1e.diff",
            "exists": true,
            "files": [
                {
                    "file_additions": 5,
                    "file_deletions": 6,
                    "file_exists": true,
                    "file_name": "src/libponyrt/platform/threads.c",
                    "file_size": 6430
                },
                {
                    "file_additions": 58,
                    "file_deletions": 26,
                    "file_exists": true,
                    "file_name": "src/libponyrt/sched/scheduler.c",
                    "file_size": 47413
                }
            ],
            "interesting": {
                "reopen": false,
                "status": true
            },
            "is_parent": false,
            "sha": "0c2ec8ce7194472e74b8b61008a8ab2f23ae9c1e"
        },
        {
            "associated_pull_request": [],
            "date": "2018-01-06 18:32:04",
            "diff": "ponylang_ponyc/issue_2451/commit_b99f9545536d684ebcd36a502b94764120c17ee3.diff",
            "diff_additions": 63,
            "diff_deletions": 32,
            "diff_file_size": 53843,
            "diff_url": "https://github.com/ponylang/ponyc/commit/b99f9545536d684ebcd36a502b94764120c17ee3.diff",
            "exists": true,
            "files": [
                {
                    "file_additions": 5,
                    "file_deletions": 6,
                    "file_exists": true,
                    "file_name": "src/libponyrt/platform/threads.c",
                    "file_size": 6430
                },
                {
                    "file_additions": 58,
                    "file_deletions": 26,
                    "file_exists": true,
                    "file_name": "src/libponyrt/sched/scheduler.c",
                    "file_size": 47413
                }
            ],
            "interesting": {
                "reopen": false,
                "status": false
            },
            "is_parent": false,
            "sha": "b99f9545536d684ebcd36a502b94764120c17ee3"
        },
        {
            "associated_pull_request": [],
            "date": "2018-01-10 04:18:00",
            "diff": "ponylang_ponyc/issue_2451/commit_47e8d149d36aa076f2f9f72b1699a13cc51e2154.diff",
            "diff_additions": 3,
            "diff_deletions": 3,
            "diff_file_size": 50103,
            "diff_url": "https://github.com/ponylang/ponyc/commit/47e8d149d36aa076f2f9f72b1699a13cc51e2154.diff",
            "exists": true,
            "files": [
                {
                    "file_additions": 2,
                    "file_deletions": 2,
                    "file_exists": true,
                    "file_name": "src/libponyrt/sched/scheduler.c",
                    "file_size": 47413
                },
                {
                    "file_additions": 1,
                    "file_deletions": 1,
                    "file_exists": true,
                    "file_name": "src/ponyc/main.c",
                    "file_size": 2690
                }
            ],
            "interesting": {
                "reopen": false,
                "status": true
            },
            "is_parent": false,
            "sha": "47e8d149d36aa076f2f9f72b1699a13cc51e2154"
        },
        {
            "associated_pull_request": [
                "https://github.com/ponylang/ponyc/pull/2472"
            ],
            "date": "2018-01-06 18:32:04",
            "diff": "ponylang_ponyc/issue_2451/commit_89f32b2f747416828ee559001ce0aa4f3aaa9073.diff",
            "diff_additions": 63,
            "diff_deletions": 32,
            "diff_file_size": 53843,
            "diff_url": "https://github.com/ponylang/ponyc/commit/89f32b2f747416828ee559001ce0aa4f3aaa9073.diff",
            "exists": true,
            "files": [
                {
                    "file_additions": 5,
                    "file_deletions": 6,
                    "file_exists": true,
                    "file_name": "src/libponyrt/platform/threads.c",
                    "file_size": 6430
                },
                {
                    "file_additions": 58,
                    "file_deletions": 26,
                    "file_exists": true,
                    "file_name": "src/libponyrt/sched/scheduler.c",
                    "file_size": 47413
                }
            ],
            "interesting": {
                "reopen": false,
                "status": false
            },
            "is_parent": false,
            "sha": "89f32b2f747416828ee559001ce0aa4f3aaa9073"
        },
        {
            "associated_pull_request": [
                "https://github.com/ponylang/ponyc/pull/2472"
            ],
            "date": "2018-01-10 04:25:42",
            "diff": "ponylang_ponyc/issue_2451/commit_c6f9387234e4071e7b0ee80c60a49cb2be9a683f.diff",
            "diff_additions": 3,
            "diff_deletions": 3,
            "diff_file_size": 60582,
            "diff_url": "https://github.com/ponylang/ponyc/commit/c6f9387234e4071e7b0ee80c60a49cb2be9a683f.diff",
            "exists": true,
            "files": [
                {
                    "file_additions": 1,
                    "file_deletions": 1,
                    "file_exists": true,
                    "file_name": "src/libponyc/options/options.c",
                    "file_size": 13169
                },
                {
                    "file_additions": 2,
                    "file_deletions": 2,
                    "file_exists": true,
                    "file_name": "src/libponyrt/sched/scheduler.c",
                    "file_size": 47413
                }
            ],
            "interesting": {
                "reopen": false,
                "status": false
            },
            "is_parent": false,
            "sha": "c6f9387234e4071e7b0ee80c60a49cb2be9a683f"
        },
        {
            "associated_pull_request": [
                "https://github.com/ponylang/ponyc/pull/2472"
            ],
            "date": "2018-01-06 18:32:04",
            "diff": "ponylang_ponyc/issue_2451/commit_4f92262950a666703659f20e227cbd7fe9b84d7e.diff",
            "diff_additions": 63,
            "diff_deletions": 32,
            "diff_file_size": 53843,
            "diff_url": "https://github.com/ponylang/ponyc/commit/4f92262950a666703659f20e227cbd7fe9b84d7e.diff",
            "exists": true,
            "files": [
                {
                    "file_additions": 5,
                    "file_deletions": 6,
                    "file_exists": true,
                    "file_name": "src/libponyrt/platform/threads.c",
                    "file_size": 6430
                },
                {
                    "file_additions": 58,
                    "file_deletions": 26,
                    "file_exists": true,
                    "file_name": "src/libponyrt/sched/scheduler.c",
                    "file_size": 47413
                }
            ],
            "interesting": {
                "reopen": false,
                "status": false
            },
            "is_parent": false,
            "sha": "4f92262950a666703659f20e227cbd7fe9b84d7e"
        },
        {
            "associated_pull_request": [
                "https://github.com/ponylang/ponyc/pull/2472"
            ],
            "date": "2018-01-10 04:25:42",
            "diff": "ponylang_ponyc/issue_2451/commit_26d43da876ec15bdce2cb4469e81e9da82efd0dc.diff",
            "diff_additions": 3,
            "diff_deletions": 3,
            "diff_file_size": 60582,
            "diff_url": "https://github.com/ponylang/ponyc/commit/26d43da876ec15bdce2cb4469e81e9da82efd0dc.diff",
            "exists": true,
            "files": [
                {
                    "file_additions": 1,
                    "file_deletions": 1,
                    "file_exists": true,
                    "file_name": "src/libponyc/options/options.c",
                    "file_size": 13169
                },
                {
                    "file_additions": 2,
                    "file_deletions": 2,
                    "file_exists": true,
                    "file_name": "src/libponyrt/sched/scheduler.c",
                    "file_size": 47413
                }
            ],
            "interesting": {
                "reopen": false,
                "status": true
            },
            "is_parent": false,
            "sha": "26d43da876ec15bdce2cb4469e81e9da82efd0dc"
        },
        {
            "associated_pull_request": [],
            "date": "2018-01-10 22:05:32",
            "diff": "ponylang_ponyc/issue_2451/commit_9d2150ec5fbcc7ce7d54e32c2c4db2b5d7f334d9.diff",
            "diff_additions": 136,
            "diff_deletions": 103,
            "diff_file_size": 63724,
            "diff_url": "https://github.com/ponylang/ponyc/commit/9d2150ec5fbcc7ce7d54e32c2c4db2b5d7f334d9.diff",
            "exists": true,
            "files": [
                {
                    "file_additions": 1,
                    "file_deletions": 1,
                    "file_exists": true,
                    "file_name": "src/libponyc/options/options.c",
                    "file_size": 13169
                },
                {
                    "file_additions": 4,
                    "file_deletions": 0,
                    "file_exists": true,
                    "file_name": "src/libponyrt/asio/event.c",
                    "file_size": 3142
                },
                {
                    "file_additions": 131,
                    "file_deletions": 102,
                    "file_exists": true,
                    "file_name": "src/libponyrt/sched/scheduler.c",
                    "file_size": 47413
                }
            ],
            "interesting": {
                "reopen": false,
                "status": false
            },
            "is_parent": false,
            "sha": "9d2150ec5fbcc7ce7d54e32c2c4db2b5d7f334d9"
        },
        {
            "associated_pull_request": [],
            "date": "2018-01-10 22:05:32",
            "diff": "ponylang_ponyc/issue_2451/commit_67089f4cf18b176a7d44102f97c4caba51eb94b2.diff",
            "diff_additions": 136,
            "diff_deletions": 103,
            "diff_file_size": 63724,
            "diff_url": "https://github.com/ponylang/ponyc/commit/67089f4cf18b176a7d44102f97c4caba51eb94b2.diff",
            "exists": true,
            "files": [
                {
                    "file_additions": 1,
                    "file_deletions": 1,
                    "file_exists": true,
                    "file_name": "src/libponyc/options/options.c",
                    "file_size": 13169
                },
                {
                    "file_additions": 4,
                    "file_deletions": 0,
                    "file_exists": true,
                    "file_name": "src/libponyrt/asio/event.c",
                    "file_size": 3142
                },
                {
                    "file_additions": 131,
                    "file_deletions": 102,
                    "file_exists": true,
                    "file_name": "src/libponyrt/sched/scheduler.c",
                    "file_size": 47413
                }
            ],
            "interesting": {
                "reopen": false,
                "status": false
            },
            "is_parent": false,
            "sha": "67089f4cf18b176a7d44102f97c4caba51eb94b2"
        },
        {
            "associated_pull_request": [
                "https://github.com/ponylang/ponyc/pull/2483"
            ],
            "date": "2018-01-10 22:05:32",
            "diff": "ponylang_ponyc/issue_2451/commit_ec6503f0c69b3cc158abd7cf70cca51dd2dafa03.diff",
            "diff_additions": 355,
            "diff_deletions": 144,
            "diff_file_size": 70154,
            "diff_url": "https://github.com/ponylang/ponyc/commit/ec6503f0c69b3cc158abd7cf70cca51dd2dafa03.diff",
            "exists": true,
            "files": [
                {
                    "file_additions": 1,
                    "file_deletions": 1,
                    "file_exists": true,
                    "file_name": "src/libponyc/options/options.c",
                    "file_size": 13169
                },
                {
                    "file_additions": 4,
                    "file_deletions": 0,
                    "file_exists": true,
                    "file_name": "src/libponyrt/asio/event.c",
                    "file_size": 3142
                },
                {
                    "file_additions": 5,
                    "file_deletions": 21,
                    "file_exists": true,
                    "file_name": "src/libponyrt/platform/threads.c",
                    "file_size": 6430
                },
                {
                    "file_additions": 345,
                    "file_deletions": 122,
                    "file_exists": true,
                    "file_name": "src/libponyrt/sched/scheduler.c",
                    "file_size": 47413
                }
            ],
            "interesting": {
                "reopen": false,
                "status": true
            },
            "is_parent": false,
            "sha": "ec6503f0c69b3cc158abd7cf70cca51dd2dafa03"
        },
        {
            "associated_pull_request": [
                "https://github.com/ponylang/ponyc/pull/2483"
            ],
            "date": "2018-01-10 22:05:32",
            "diff": "ponylang_ponyc/issue_2451/commit_fc80968ba54dedc2d486c74a7c39114081465497.diff",
            "diff_additions": 355,
            "diff_deletions": 144,
            "diff_file_size": 70154,
            "diff_url": "https://github.com/ponylang/ponyc/commit/fc80968ba54dedc2d486c74a7c39114081465497.diff",
            "exists": true,
            "files": [
                {
                    "file_additions": 1,
                    "file_deletions": 1,
                    "file_exists": true,
                    "file_name": "src/libponyc/options/options.c",
                    "file_size": 13169
                },
                {
                    "file_additions": 4,
                    "file_deletions": 0,
                    "file_exists": true,
                    "file_name": "src/libponyrt/asio/event.c",
                    "file_size": 3142
                },
                {
                    "file_additions": 5,
                    "file_deletions": 21,
                    "file_exists": true,
                    "file_name": "src/libponyrt/platform/threads.c",
                    "file_size": 6430
                },
                {
                    "file_additions": 345,
                    "file_deletions": 122,
                    "file_exists": true,
                    "file_name": "src/libponyrt/sched/scheduler.c",
                    "file_size": 47413
                }
            ],
            "interesting": {
                "reopen": false,
                "status": true
            },
            "is_parent": false,
            "sha": "fc80968ba54dedc2d486c74a7c39114081465497"
        }
    ],
    "first_commit": "2017-12-26 02:19:30",
    "last_commit": "2018-01-20 04:11:00",
    "number": 2451,
    "pull_request": "None",
    "score": {
        "accidental_reopen_likely": false,
        "all_labels": [
            "triggers release"
        ],
        "contains_keywords": [
            "work",
            "attempt",
            "report",
            "fix",
            "CI",
            "reason",
            "patch",
            "fault",
            "bug",
            "test",
            "remov",
            "issu",
            "error",
            "debug",
            "chang",
            "confirm",
            "fail",
            "problem"
        ],
        "fix_size": 537,
        "has_labels": [],
        "intersecting": {
            "computed_score": 1.0,
            "final_commit_size": 434,
            "intersection_size": 434,
            "previous_commits_size": 537
        },
        "is_makefile_based": true,
        "no_new_files": [],
        "no_other_files": false,
        "num_prohibited_files": 163057,
        "prohibited_files": [
            "kill.h",
            "meminfo.h",
            "kill.h",
            "meminfo.h",
            "kill.h",
            "meminfo.h",
            "testsuite_cli_test.go",
            "testsuite_cli_test.go",
            "common.mk",
            "i3bar/include/draw_util.h"
        ],
        "reopen": true,
        "reopen_events": [
            [
                "2017-12-28 18:02:21",
                "commit"
            ],
            [
                "2017-12-28 19:15:35",
                "closed"
            ],
            [
                "2017-12-28 19:17:23",
                "reopened"
            ],
            [
                "2017-12-29 22:31:39",
                "commit"
            ],
            [
                "2017-12-30 15:49:29",
                "commit"
            ],
            [
                "2017-12-30 16:19:52",
                "commit"
            ],
            [
                "2018-01-03 21:13:13",
                "commit"
            ],
            [
                "2018-01-06 18:40:23",
                "commit"
            ],
            [
                "2018-01-07 00:55:50",
                "commit"
            ],
            [
                "2018-01-10 04:20:14",
                "commit"
            ],
            [
                "2018-01-10 04:26:28",
                "commit"
            ],
            [
                "2018-01-10 04:26:28",
                "commit"
            ],
            [
                "2018-01-10 20:35:36",
                "commit"
            ],
            [
                "2018-01-10 20:35:36",
                "commit"
            ],
            [
                "2018-01-10 23:30:45",
                "commit"
            ],
            [
                "2018-01-14 22:30:01",
                "commit"
            ],
            [
                "2018-01-19 20:00:25",
                "commit"
            ],
            [
                "2018-01-20 04:11:06",
                "commit"
            ],
            [
                "2018-01-24 06:12:44",
                "closed"
            ]
        ],
        "status": false,
        "strategy": true,
        "total_changes": 1874
    }
}