{
    "covered_issues": [
        432,
        421,
        420,
        417,
        415,
        414,
        409,
        406,
        404,
        395,
        390,
        386,
        385,
        347,
        346,
        336,
        333,
        326,
        319,
        317,
        314,
        313,
        308,
        307,
        306,
        305,
        304,
        298,
        288,
        287,
        286,
        282,
        280,
        276,
        274,
        267,
        261,
        256,
        254,
        252,
        249,
        245,
        238,
        226,
        221,
        220,
        219,
        215,
        209,
        208,
        207,
        205,
        203,
        202,
        201,
        189,
        188,
        187,
        186,
        185,
        181,
        180,
        178,
        177,
        176,
        175,
        174,
        173,
        171,
        170,
        165,
        163,
        161,
        158,
        155,
        154,
        153,
        150,
        145,
        144,
        143,
        139,
        138,
        136,
        133,
        131,
        125,
        120,
        113,
        111,
        109,
        108,
        107,
        105,
        100,
        95,
        94,
        92,
        90,
        88,
        86,
        82,
        81,
        75,
        72,
        70,
        68,
        66,
        63,
        61,
        59,
        58,
        57,
        56,
        51,
        50,
        49,
        48,
        45,
        43,
        42,
        41,
        40,
        35,
        34,
        33,
        30,
        25,
        24,
        23,
        22,
        21,
        20,
        19,
        18,
        17,
        15,
        14,
        13,
        11,
        10,
        9,
        8,
        7
    ],
    "finished": true
}