{
    "commits": [
        {
            "associated_pull_request": [
                "https://github.com/gluster/glusterfs/pull/1869"
            ],
            "date": "2020-12-08 10:51:35+00:00",
            "diff": "gluster_glusterfs/issue_1909/commit_ae8cfe5baaff5b3e4c55f49ec71811e32a885271.diff",
            "diff_additions": 17,
            "diff_deletions": 5,
            "diff_file_size": 344265,
            "diff_url": "https://github.com/gluster/glusterfs/commit/ae8cfe5baaff5b3e4c55f49ec71811e32a885271.diff",
            "exists": true,
            "files": [
                {
                    "file_additions": 13,
                    "file_deletions": 2,
                    "file_exists": true,
                    "file_name": "cli/src/cli-rpc-ops.c",
                    "file_size": 309629
                },
                {
                    "file_additions": 2,
                    "file_deletions": 2,
                    "file_exists": true,
                    "file_name": "xlators/mgmt/glusterd/src/glusterd-replace-brick.c",
                    "file_size": 22467
                },
                {
                    "file_additions": 2,
                    "file_deletions": 1,
                    "file_exists": true,
                    "file_name": "xlators/mgmt/glusterd/src/glusterd-reset-brick.c",
                    "file_size": 12169
                }
            ],
            "interesting": {
                "reopen": false,
                "status": false
            },
            "is_parent": true,
            "sha": "ae8cfe5baaff5b3e4c55f49ec71811e32a885271"
        },
        {
            "associated_pull_request": [
                "https://github.com/gluster/glusterfs/pull/1910"
            ],
            "date": "2020-12-11 12:49:37+00:00",
            "diff": "gluster_glusterfs/issue_1909/commit_de1b26d68e31b029a59e59a47b51a7e3e6fbfe22.diff",
            "diff_additions": 21,
            "diff_deletions": 16,
            "diff_file_size": 407929,
            "diff_url": "https://github.com/gluster/glusterfs/commit/de1b26d68e31b029a59e59a47b51a7e3e6fbfe22.diff",
            "exists": true,
            "files": [
                {
                    "file_additions": 1,
                    "file_deletions": 1,
                    "file_exists": true,
                    "file_name": "xlators/features/index/src/index.c",
                    "file_size": 74416
                },
                {
                    "file_additions": 14,
                    "file_deletions": 11,
                    "file_exists": true,
                    "file_name": "xlators/features/locks/src/posix.c",
                    "file_size": 148281
                },
                {
                    "file_additions": 6,
                    "file_deletions": 4,
                    "file_exists": true,
                    "file_name": "xlators/storage/posix/src/posix-inode-fd-ops.c",
                    "file_size": 185232
                }
            ],
            "interesting": {
                "reopen": true,
                "status": false
            },
            "is_parent": false,
            "sha": "de1b26d68e31b029a59e59a47b51a7e3e6fbfe22"
        },
        {
            "associated_pull_request": [
                "https://github.com/gluster/glusterfs/pull/2344"
            ],
            "date": "2021-04-22 13:26:28+00:00",
            "diff": "gluster_glusterfs/issue_1909/commit_5cbf5d94c719d1c7674a59c8009660197fc56af2.diff",
            "diff_additions": 21,
            "diff_deletions": 16,
            "diff_file_size": 407929,
            "diff_url": "https://github.com/gluster/glusterfs/commit/5cbf5d94c719d1c7674a59c8009660197fc56af2.diff",
            "exists": true,
            "files": [
                {
                    "file_additions": 1,
                    "file_deletions": 1,
                    "file_exists": true,
                    "file_name": "xlators/features/index/src/index.c",
                    "file_size": 74416
                },
                {
                    "file_additions": 14,
                    "file_deletions": 11,
                    "file_exists": true,
                    "file_name": "xlators/features/locks/src/posix.c",
                    "file_size": 148281
                },
                {
                    "file_additions": 6,
                    "file_deletions": 4,
                    "file_exists": true,
                    "file_name": "xlators/storage/posix/src/posix-inode-fd-ops.c",
                    "file_size": 185232
                }
            ],
            "interesting": {
                "reopen": false,
                "status": false
            },
            "is_parent": false,
            "sha": "5cbf5d94c719d1c7674a59c8009660197fc56af2"
        },
        {
            "associated_pull_request": [
                "https://github.com/gluster/glusterfs/pull/2345"
            ],
            "date": "2021-05-08 01:32:33+00:00",
            "diff": "gluster_glusterfs/issue_1909/commit_065a24e0a09ca44d18977a6668cfb3812c510d24.diff",
            "diff_additions": 21,
            "diff_deletions": 16,
            "diff_file_size": 407929,
            "diff_url": "https://github.com/gluster/glusterfs/commit/065a24e0a09ca44d18977a6668cfb3812c510d24.diff",
            "exists": true,
            "files": [
                {
                    "file_additions": 1,
                    "file_deletions": 1,
                    "file_exists": true,
                    "file_name": "xlators/features/index/src/index.c",
                    "file_size": 74416
                },
                {
                    "file_additions": 14,
                    "file_deletions": 11,
                    "file_exists": true,
                    "file_name": "xlators/features/locks/src/posix.c",
                    "file_size": 148281
                },
                {
                    "file_additions": 6,
                    "file_deletions": 4,
                    "file_exists": true,
                    "file_name": "xlators/storage/posix/src/posix-inode-fd-ops.c",
                    "file_size": 185232
                }
            ],
            "interesting": {
                "reopen": false,
                "status": false
            },
            "is_parent": false,
            "sha": "065a24e0a09ca44d18977a6668cfb3812c510d24"
        },
        {
            "associated_pull_request": [],
            "date": "2021-05-08 01:32:33+00:00",
            "diff": "gluster_glusterfs/issue_1909/commit_86ed50c616018487922d9542cc8a3e9c5635a4f8.diff",
            "diff_additions": 21,
            "diff_deletions": 16,
            "diff_file_size": 407929,
            "diff_url": "https://github.com/gluster/glusterfs/commit/86ed50c616018487922d9542cc8a3e9c5635a4f8.diff",
            "exists": true,
            "files": [
                {
                    "file_additions": 1,
                    "file_deletions": 1,
                    "file_exists": true,
                    "file_name": "xlators/features/index/src/index.c",
                    "file_size": 74416
                },
                {
                    "file_additions": 14,
                    "file_deletions": 11,
                    "file_exists": true,
                    "file_name": "xlators/features/locks/src/posix.c",
                    "file_size": 148281
                },
                {
                    "file_additions": 6,
                    "file_deletions": 4,
                    "file_exists": true,
                    "file_name": "xlators/storage/posix/src/posix-inode-fd-ops.c",
                    "file_size": 185232
                }
            ],
            "interesting": {
                "reopen": false,
                "status": false
            },
            "is_parent": false,
            "sha": "86ed50c616018487922d9542cc8a3e9c5635a4f8"
        }
    ],
    "first_commit": "2020-12-08 10:51:35+00:00",
    "last_commit": "2021-05-25 10:34:40+00:00",
    "number": 1909,
    "pull_request": "None",
    "score": {
        "accidental_reopen_likely": false,
        "all_labels": [
            "Type:Bug"
        ],
        "contains_keywords": [
            "chang",
            "patch"
        ],
        "fix_size": 36,
        "has_labels": [],
        "intersecting": {
            "computed_score": 1.0,
            "final_commit_size": 26,
            "intersection_size": 26,
            "previous_commits_size": 36
        },
        "is_makefile_based": true,
        "no_new_files": [],
        "no_other_files": false,
        "num_prohibited_files": 144985,
        "prohibited_files": [
            "server/src/main/java/com/genymobile/scrcpy/Device.java",
            "server/src/main/java/com/genymobile/scrcpy/wrappers/SurfaceControl.java",
            "server/src/main/java/com/genymobile/scrcpy/Device.java",
            "server/src/main/java/com/genymobile/scrcpy/wrappers/SurfaceControl.java",
            "app/meson.build",
            "app/scrcpy.1",
            "app/src/common.h",
            "app/src/scrcpy.h",
            "app/src/server.h",
            "server/src/main/java/com/genymobile/scrcpy/Workarounds.java"
        ],
        "reopen": true,
        "reopen_events": [
            [
                "2020-12-11 12:49:38+00:00",
                "closed"
            ],
            [
                "2020-12-11 12:49:42+00:00",
                "commit"
            ],
            [
                "2021-04-22 04:54:51+00:00",
                "reopened"
            ],
            [
                "2021-04-22 13:26:31+00:00",
                "commit"
            ],
            [
                "2021-05-08 01:32:36+00:00",
                "commit"
            ],
            [
                "2021-05-08 01:33:17+00:00",
                "closed"
            ],
            [
                "2021-05-25 11:13:25+00:00",
                "commit"
            ]
        ],
        "status": false,
        "strategy": true,
        "total_changes": 170
    }
}