{
    "covered_issues": [
        101,
        100,
        99,
        98,
        96,
        91,
        89,
        86,
        84,
        83,
        82,
        76,
        75,
        74,
        73,
        70,
        69,
        68,
        66,
        65,
        64,
        63,
        62,
        61,
        60,
        59,
        57,
        55,
        54,
        53,
        52,
        51,
        50,
        49,
        48,
        47,
        46,
        45,
        44,
        43,
        42,
        41,
        40,
        39,
        38,
        37,
        36,
        35,
        34,
        33,
        32,
        31,
        30,
        29,
        28,
        27,
        26,
        25,
        24,
        23,
        22,
        21,
        20,
        19,
        18,
        15,
        14,
        12,
        11,
        9,
        8,
        7,
        6,
        5,
        4,
        3,
        2,
        1
    ],
    "finished": true
}