{
    "commits": [
        {
            "associated_pull_request": [],
            "date": "2021-04-16 08:41:35+00:00",
            "diff": "opensips_opensips/issue_2344/commit_db5f7ed873178af8430361dda671819bca38db82.diff",
            "diff_additions": 0,
            "diff_deletions": 3,
            "diff_file_size": 18303,
            "diff_url": "https://github.com/OpenSIPS/opensips/commit/db5f7ed873178af8430361dda671819bca38db82.diff",
            "exists": true,
            "files": [
                {
                    "file_additions": 0,
                    "file_deletions": 2,
                    "file_exists": true,
                    "file_name": "core_stats.c",
                    "file_size": 9506
                },
                {
                    "file_additions": 0,
                    "file_deletions": 1,
                    "file_exists": true,
                    "file_name": "parser/parse_methods.c",
                    "file_size": 8797
                }
            ],
            "interesting": {
                "reopen": false,
                "status": false
            },
            "is_parent": true,
            "sha": "db5f7ed873178af8430361dda671819bca38db82"
        },
        {
            "associated_pull_request": [],
            "date": "2021-04-16 11:37:03+00:00",
            "diff": "opensips_opensips/issue_2344/commit_6a89cb8eb1f62578a71fa43353c564a7ea69c685.diff",
            "diff_additions": 72,
            "diff_deletions": 50,
            "diff_file_size": 249657,
            "diff_url": "https://github.com/OpenSIPS/opensips/commit/6a89cb8eb1f62578a71fa43353c564a7ea69c685.diff",
            "exists": true,
            "files": [
                {
                    "file_additions": 1,
                    "file_deletions": 1,
                    "file_exists": true,
                    "file_name": "forward.c",
                    "file_size": 16145
                },
                {
                    "file_additions": 4,
                    "file_deletions": 2,
                    "file_exists": true,
                    "file_name": "modules/proto_bin/proto_bin.c",
                    "file_size": 10657
                },
                {
                    "file_additions": 4,
                    "file_deletions": 2,
                    "file_exists": true,
                    "file_name": "modules/proto_bins/proto_bins.c",
                    "file_size": 19745
                },
                {
                    "file_additions": 8,
                    "file_deletions": 4,
                    "file_exists": true,
                    "file_name": "modules/proto_hep/proto_hep.c",
                    "file_size": 34686
                },
                {
                    "file_additions": 1,
                    "file_deletions": 1,
                    "file_exists": true,
                    "file_name": "modules/proto_sctp/sctp_server.c",
                    "file_size": 5679
                },
                {
                    "file_additions": 4,
                    "file_deletions": 2,
                    "file_exists": true,
                    "file_name": "modules/proto_smpp/proto_smpp.c",
                    "file_size": 13894
                },
                {
                    "file_additions": 4,
                    "file_deletions": 2,
                    "file_exists": true,
                    "file_name": "modules/proto_tls/proto_tls.c",
                    "file_size": 23716
                },
                {
                    "file_additions": 4,
                    "file_deletions": 3,
                    "file_exists": true,
                    "file_name": "modules/proto_ws/proto_ws.c",
                    "file_size": 13707
                },
                {
                    "file_additions": 4,
                    "file_deletions": 3,
                    "file_exists": true,
                    "file_name": "modules/proto_wss/proto_wss.c",
                    "file_size": 17696
                },
                {
                    "file_additions": 30,
                    "file_deletions": 25,
                    "file_exists": true,
                    "file_name": "net/net_tcp.c",
                    "file_size": 63581
                },
                {
                    "file_additions": 4,
                    "file_deletions": 3,
                    "file_exists": true,
                    "file_name": "net/proto_tcp/proto_tcp.c",
                    "file_size": 23839
                },
                {
                    "file_additions": 4,
                    "file_deletions": 2,
                    "file_exists": true,
                    "file_name": "net/proto_udp/proto_udp.c",
                    "file_size": 6312
                }
            ],
            "interesting": {
                "reopen": true,
                "status": false
            },
            "is_parent": false,
            "sha": "6a89cb8eb1f62578a71fa43353c564a7ea69c685"
        },
        {
            "associated_pull_request": [],
            "date": "2021-04-16 11:37:03+00:00",
            "diff": "opensips_opensips/issue_2344/commit_48010230ae03f409be7919708cd67c2e7cc589cd.diff",
            "diff_additions": 68,
            "diff_deletions": 48,
            "diff_file_size": 229912,
            "diff_url": "https://github.com/OpenSIPS/opensips/commit/48010230ae03f409be7919708cd67c2e7cc589cd.diff",
            "exists": true,
            "files": [
                {
                    "file_additions": 1,
                    "file_deletions": 1,
                    "file_exists": true,
                    "file_name": "forward.c",
                    "file_size": 16145
                },
                {
                    "file_additions": 4,
                    "file_deletions": 2,
                    "file_exists": true,
                    "file_name": "modules/proto_bin/proto_bin.c",
                    "file_size": 10657
                },
                {
                    "file_additions": 8,
                    "file_deletions": 4,
                    "file_exists": true,
                    "file_name": "modules/proto_hep/proto_hep.c",
                    "file_size": 34686
                },
                {
                    "file_additions": 1,
                    "file_deletions": 1,
                    "file_exists": true,
                    "file_name": "modules/proto_sctp/sctp_server.c",
                    "file_size": 5679
                },
                {
                    "file_additions": 4,
                    "file_deletions": 2,
                    "file_exists": true,
                    "file_name": "modules/proto_smpp/proto_smpp.c",
                    "file_size": 13894
                },
                {
                    "file_additions": 4,
                    "file_deletions": 2,
                    "file_exists": true,
                    "file_name": "modules/proto_tls/proto_tls.c",
                    "file_size": 23716
                },
                {
                    "file_additions": 4,
                    "file_deletions": 3,
                    "file_exists": true,
                    "file_name": "modules/proto_ws/proto_ws.c",
                    "file_size": 13707
                },
                {
                    "file_additions": 4,
                    "file_deletions": 3,
                    "file_exists": true,
                    "file_name": "modules/proto_wss/proto_wss.c",
                    "file_size": 17696
                },
                {
                    "file_additions": 30,
                    "file_deletions": 25,
                    "file_exists": true,
                    "file_name": "net/net_tcp.c",
                    "file_size": 63581
                },
                {
                    "file_additions": 4,
                    "file_deletions": 3,
                    "file_exists": true,
                    "file_name": "net/proto_tcp/proto_tcp.c",
                    "file_size": 23839
                },
                {
                    "file_additions": 4,
                    "file_deletions": 2,
                    "file_exists": true,
                    "file_name": "net/proto_udp/proto_udp.c",
                    "file_size": 6312
                }
            ],
            "interesting": {
                "reopen": false,
                "status": false
            },
            "is_parent": false,
            "sha": "48010230ae03f409be7919708cd67c2e7cc589cd"
        },
        {
            "associated_pull_request": [],
            "date": "2021-04-16 11:37:03+00:00",
            "diff": "opensips_opensips/issue_2344/commit_f22dfa0d6264970837ee95f41ec1411360f11587.diff",
            "diff_additions": 63,
            "diff_deletions": 45,
            "diff_file_size": 199873,
            "diff_url": "https://github.com/OpenSIPS/opensips/commit/f22dfa0d6264970837ee95f41ec1411360f11587.diff",
            "exists": true,
            "files": [
                {
                    "file_additions": 4,
                    "file_deletions": 2,
                    "file_exists": true,
                    "file_name": "modules/proto_bin/proto_bin.c",
                    "file_size": 10657
                },
                {
                    "file_additions": 8,
                    "file_deletions": 4,
                    "file_exists": true,
                    "file_name": "modules/proto_hep/proto_hep.c",
                    "file_size": 34686
                },
                {
                    "file_additions": 1,
                    "file_deletions": 1,
                    "file_exists": true,
                    "file_name": "modules/proto_sctp/sctp_server.c",
                    "file_size": 5679
                },
                {
                    "file_additions": 4,
                    "file_deletions": 2,
                    "file_exists": true,
                    "file_name": "modules/proto_tls/proto_tls.c",
                    "file_size": 23716
                },
                {
                    "file_additions": 4,
                    "file_deletions": 3,
                    "file_exists": true,
                    "file_name": "modules/proto_ws/proto_ws.c",
                    "file_size": 13707
                },
                {
                    "file_additions": 4,
                    "file_deletions": 3,
                    "file_exists": true,
                    "file_name": "modules/proto_wss/proto_wss.c",
                    "file_size": 17696
                },
                {
                    "file_additions": 30,
                    "file_deletions": 25,
                    "file_exists": true,
                    "file_name": "net/net_tcp.c",
                    "file_size": 63581
                },
                {
                    "file_additions": 4,
                    "file_deletions": 3,
                    "file_exists": true,
                    "file_name": "net/proto_tcp/proto_tcp.c",
                    "file_size": 23839
                },
                {
                    "file_additions": 4,
                    "file_deletions": 2,
                    "file_exists": true,
                    "file_name": "net/proto_udp/proto_udp.c",
                    "file_size": 6312
                }
            ],
            "interesting": {
                "reopen": false,
                "status": false
            },
            "is_parent": false,
            "sha": "f22dfa0d6264970837ee95f41ec1411360f11587"
        }
    ],
    "first_commit": "2021-04-16 08:41:35+00:00",
    "last_commit": "2021-06-15 16:02:07+00:00",
    "number": 2344,
    "pull_request": "None",
    "score": {
        "accidental_reopen_likely": false,
        "all_labels": [
            "bug",
            "fixed"
        ],
        "contains_keywords": [
            "fix",
            "issu",
            "patch",
            "test",
            "remov"
        ],
        "fix_size": 249,
        "has_labels": [
            "bug"
        ],
        "intersecting": {
            "computed_score": 0.336734693877551,
            "final_commit_size": 98,
            "intersection_size": 33,
            "previous_commits_size": 184
        },
        "is_makefile_based": true,
        "no_new_files": [],
        "no_other_files": false,
        "num_prohibited_files": 208016,
        "prohibited_files": [
            "server/src/main/java/com/genymobile/scrcpy/Device.java",
            "server/src/main/java/com/genymobile/scrcpy/wrappers/SurfaceControl.java",
            "server/src/main/java/com/genymobile/scrcpy/Device.java",
            "server/src/main/java/com/genymobile/scrcpy/wrappers/SurfaceControl.java",
            "app/meson.build",
            "app/scrcpy.1",
            "app/src/common.h",
            "app/src/scrcpy.h",
            "app/src/server.h",
            "server/src/main/java/com/genymobile/scrcpy/Workarounds.java"
        ],
        "reopen": true,
        "reopen_events": [
            [
                "2021-04-16 11:41:18+00:00",
                "closed"
            ],
            [
                "2021-04-16 11:41:18+00:00",
                "commit"
            ],
            [
                "2021-04-16 14:28:42+00:00",
                "reopened"
            ],
            [
                "2021-06-15 15:50:11+00:00",
                "commit"
            ],
            [
                "2021-06-15 16:02:39+00:00",
                "commit"
            ],
            [
                "2021-07-21 09:31:17+00:00",
                "closed"
            ]
        ],
        "status": false,
        "strategy": true,
        "total_changes": 349
    }
}