{
    "commits": [
        {
            "associated_pull_request": [
                "https://github.com/sheredom/json.h/pull/91"
            ],
            "date": "2022-10-11 11:30:16+00:00",
            "diff": "sheredom_json.h/issue_95/commit_bdcf2e1912aa4c0127f755f5f6271c539d6cbf9f.diff",
            "diff_additions": 10,
            "diff_deletions": 0,
            "diff_file_size": 57586,
            "diff_url": "https://github.com/sheredom/json.h/commit/bdcf2e1912aa4c0127f755f5f6271c539d6cbf9f.diff",
            "exists": true,
            "files": [
                {
                    "file_additions": 10,
                    "file_deletions": 0,
                    "file_exists": true,
                    "file_name": "test/main.cpp",
                    "file_size": 57586
                }
            ],
            "interesting": {
                "reopen": false,
                "status": false
            },
            "is_parent": true,
            "sha": "bdcf2e1912aa4c0127f755f5f6271c539d6cbf9f"
        },
        {
            "associated_pull_request": [],
            "date": "2022-11-14 15:17:23+00:00",
            "diff": "sheredom_json.h/issue_95/commit_b6a03f5eed0c186d20753fff48127a7cc12000ae.diff",
            "diff_additions": 417,
            "diff_deletions": 0,
            "diff_file_size": 57586,
            "diff_url": "https://github.com/sheredom/json.h/commit/b6a03f5eed0c186d20753fff48127a7cc12000ae.diff",
            "exists": true,
            "files": [
                {
                    "file_additions": 417,
                    "file_deletions": 0,
                    "file_exists": true,
                    "file_name": "test/main.cpp",
                    "file_size": 57586
                }
            ],
            "interesting": {
                "reopen": false,
                "status": true
            },
            "is_parent": false,
            "sha": "b6a03f5eed0c186d20753fff48127a7cc12000ae"
        },
        {
            "associated_pull_request": [
                "https://github.com/sheredom/json.h/pull/98"
            ],
            "date": "2022-11-14 15:17:23+00:00",
            "diff": "sheredom_json.h/issue_95/commit_0825301a07cbf51653882bf2b153cc81fdadf415.diff",
            "diff_additions": 417,
            "diff_deletions": 0,
            "diff_file_size": 57586,
            "diff_url": "https://github.com/sheredom/json.h/commit/0825301a07cbf51653882bf2b153cc81fdadf415.diff",
            "exists": true,
            "files": [
                {
                    "file_additions": 417,
                    "file_deletions": 0,
                    "file_exists": true,
                    "file_name": "test/main.cpp",
                    "file_size": 57586
                }
            ],
            "interesting": {
                "reopen": false,
                "status": false
            },
            "is_parent": false,
            "sha": "0825301a07cbf51653882bf2b153cc81fdadf415"
        },
        {
            "associated_pull_request": [
                "https://github.com/sheredom/json.h/pull/98"
            ],
            "date": "2022-11-14 15:17:23+00:00",
            "diff": "sheredom_json.h/issue_95/commit_692679a34c1957db47ebd6852a76c8cfca4a56e4.diff",
            "diff_additions": 417,
            "diff_deletions": 0,
            "diff_file_size": 57586,
            "diff_url": "https://github.com/sheredom/json.h/commit/692679a34c1957db47ebd6852a76c8cfca4a56e4.diff",
            "exists": true,
            "files": [
                {
                    "file_additions": 417,
                    "file_deletions": 0,
                    "file_exists": true,
                    "file_name": "test/main.cpp",
                    "file_size": 57586
                }
            ],
            "interesting": {
                "reopen": false,
                "status": false
            },
            "is_parent": false,
            "sha": "692679a34c1957db47ebd6852a76c8cfca4a56e4"
        }
    ],
    "first_commit": "2022-10-11 15:35:04+00:00",
    "last_commit": "2022-11-14 16:46:28+00:00",
    "number": 95,
    "pull_request": "None",
    "score": {
        "accidental_reopen_likely": false,
        "all_labels": [],
        "contains_keywords": [
            "issu",
            "problem"
        ],
        "fix_size": 418,
        "has_labels": [],
        "intersecting": {
            "computed_score": 1.0,
            "final_commit_size": 418,
            "intersection_size": 418,
            "previous_commits_size": 418
        },
        "is_makefile_based": false,
        "no_new_files": [],
        "no_other_files": false,
        "num_prohibited_files": 255218,
        "prohibited_files": [
            "server/src/main/java/com/genymobile/scrcpy/Device.java",
            "server/src/main/java/com/genymobile/scrcpy/wrappers/SurfaceControl.java",
            "server/src/main/java/com/genymobile/scrcpy/Device.java",
            "server/src/main/java/com/genymobile/scrcpy/wrappers/SurfaceControl.java",
            "app/meson.build",
            "app/scrcpy.1",
            "app/src/common.h",
            "app/src/scrcpy.h",
            "app/src/server.h",
            "server/src/main/java/com/genymobile/scrcpy/Workarounds.java"
        ],
        "reopen": false,
        "reopen_events": [
            [
                "2022-11-14 15:18:45+00:00",
                "commit"
            ],
            [
                "2022-11-14 15:26:53+00:00",
                "commit"
            ],
            [
                "2022-11-14 16:46:31+00:00",
                "closed"
            ],
            [
                "2022-11-14 16:46:31+00:00",
                "closed"
            ],
            [
                "2022-11-14 16:46:31+00:00",
                "commit"
            ]
        ],
        "status": true,
        "strategy": true,
        "total_changes": 1261
    }
}