{
    "commits": [
        {
            "diff": "spring-projects_spring-boot/issue_11745/commit_3565961d6807aae7792d7fe51337a1dbf9aca30b.diff",
            "diff_additions": 2414,
            "diff_deletions": 1142,
            "diff_file_size": 42674,
            "files": [
                {
                    "file_additions": 0,
                    "file_deletions": 41,
                    "file_exists": false,
                    "file_name": "spring-boot-project/spring-boot-actuator-autoconfigure/src/main/java/org/springframework/boot/actuate/autoconfigure/trace/TraceRepositoryAutoConfiguration.java",
                    "file_size": 0
                },
                {
                    "file_additions": 0,
                    "file_deletions": 75,
                    "file_exists": false,
                    "file_name": "spring-boot-project/spring-boot-actuator-autoconfigure/src/main/java/org/springframework/boot/actuate/autoconfigure/trace/TraceWebFilterAutoConfiguration.java",
                    "file_size": 0
                },
                {
                    "file_additions": 82,
                    "file_deletions": 0,
                    "file_exists": false,
                    "file_name": "spring-boot-project/spring-boot-actuator-autoconfigure/src/main/java/org/springframework/boot/actuate/autoconfigure/web/trace/TraceAutoConfiguration.java",
                    "file_size": 0
                },
                {
                    "file_additions": 11,
                    "file_deletions": 10,
                    "file_exists": false,
                    "file_name": "spring-boot-project/spring-boot-actuator-autoconfigure/src/main/java/org/springframework/boot/actuate/autoconfigure/web/trace/TraceEndpointAutoConfiguration.java",
                    "file_size": 0
                },
                {
                    "file_additions": 8,
                    "file_deletions": 7,
                    "file_exists": false,
                    "file_name": "spring-boot-project/spring-boot-actuator-autoconfigure/src/main/java/org/springframework/boot/actuate/autoconfigure/web/trace/TraceProperties.java",
                    "file_size": 0
                },
                {
                    "file_additions": 2,
                    "file_deletions": 2,
                    "file_exists": false,
                    "file_name": "spring-boot-project/spring-boot-actuator-autoconfigure/src/main/java/org/springframework/boot/actuate/autoconfigure/web/trace/package-info.java",
                    "file_size": 0
                },
                {
                    "file_additions": 130,
                    "file_deletions": 0,
                    "file_exists": true,
                    "file_name": "spring-boot-project/spring-boot-actuator-autoconfigure/src/test/java/org/springframework/boot/actuate/autoconfigure/endpoint/web/documentation/HttpTraceEndpointDocumentationTests.java",
                    "file_size": 5495
                },
                {
                    "file_additions": 1,
                    "file_deletions": 1,
                    "file_exists": true,
                    "file_name": "spring-boot-project/spring-boot-actuator-autoconfigure/src/test/java/org/springframework/boot/actuate/autoconfigure/integrationtest/EndpointAutoConfigurationClasses.java",
                    "file_size": 2806
                },
                {
                    "file_additions": 6,
                    "file_deletions": 4,
                    "file_exists": true,
                    "file_name": "spring-boot-project/spring-boot-actuator-autoconfigure/src/test/java/org/springframework/boot/actuate/autoconfigure/integrationtest/JmxEndpointIntegrationTests.java",
                    "file_size": 5840
                },
                {
                    "file_additions": 3,
                    "file_deletions": 1,
                    "file_exists": true,
                    "file_name": "spring-boot-project/spring-boot-actuator-autoconfigure/src/test/java/org/springframework/boot/actuate/autoconfigure/integrationtest/WebMvcEndpointExposureIntegrationTests.java",
                    "file_size": 10993
                },
                {
                    "file_additions": 0,
                    "file_deletions": 64,
                    "file_exists": false,
                    "file_name": "spring-boot-project/spring-boot-actuator-autoconfigure/src/test/java/org/springframework/boot/actuate/autoconfigure/trace/TraceRepositoryAutoConfigurationTests.java",
                    "file_size": 0
                },
                {
                    "file_additions": 0,
                    "file_deletions": 113,
                    "file_exists": false,
                    "file_name": "spring-boot-project/spring-boot-actuator-autoconfigure/src/test/java/org/springframework/boot/actuate/autoconfigure/trace/TraceWebFilterAutoConfigurationTests.java",
                    "file_size": 0
                },
                {
                    "file_additions": 218,
                    "file_deletions": 0,
                    "file_exists": false,
                    "file_name": "spring-boot-project/spring-boot-actuator-autoconfigure/src/test/java/org/springframework/boot/actuate/autoconfigure/web/trace/TraceAutoConfigurationTests.java",
                    "file_size": 0
                },
                {
                    "file_additions": 17,
                    "file_deletions": 10,
                    "file_exists": false,
                    "file_name": "spring-boot-project/spring-boot-actuator-autoconfigure/src/test/java/org/springframework/boot/actuate/autoconfigure/web/trace/TraceEndpointAutoConfigurationTests.java",
                    "file_size": 0
                },
                {
                    "file_additions": 0,
                    "file_deletions": 51,
                    "file_exists": false,
                    "file_name": "spring-boot-project/spring-boot-actuator/src/main/java/org/springframework/boot/actuate/trace/Trace.java",
                    "file_size": 0
                },
                {
                    "file_additions": 0,
                    "file_deletions": 283,
                    "file_exists": false,
                    "file_name": "spring-boot-project/spring-boot-actuator/src/main/java/org/springframework/boot/actuate/trace/WebRequestTraceFilter.java",
                    "file_size": 0
                },
                {
                    "file_additions": 183,
                    "file_deletions": 0,
                    "file_exists": false,
                    "file_name": "spring-boot-project/spring-boot-actuator/src/main/java/org/springframework/boot/actuate/web/trace/HttpExchangeTracer.java",
                    "file_size": 0
                },
                {
                    "file_additions": 192,
                    "file_deletions": 0,
                    "file_exists": false,
                    "file_name": "spring-boot-project/spring-boot-actuator/src/main/java/org/springframework/boot/actuate/web/trace/HttpTrace.java",
                    "file_size": 0
                },
                {
                    "file_additions": 11,
                    "file_deletions": 11,
                    "file_exists": false,
                    "file_name": "spring-boot-project/spring-boot-actuator/src/main/java/org/springframework/boot/actuate/web/trace/HttpTraceEndpoint.java",
                    "file_size": 0
                },
                {
                    "file_additions": 11,
                    "file_deletions": 10,
                    "file_exists": false,
                    "file_name": "spring-boot-project/spring-boot-actuator/src/main/java/org/springframework/boot/actuate/web/trace/HttpTraceRepository.java",
                    "file_size": 0
                },
                {
                    "file_additions": 7,
                    "file_deletions": 9,
                    "file_exists": false,
                    "file_name": "spring-boot-project/spring-boot-actuator/src/main/java/org/springframework/boot/actuate/web/trace/InMemoryHttpTraceRepository.java",
                    "file_size": 0
                },
                {
                    "file_additions": 9,
                    "file_deletions": 49,
                    "file_exists": false,
                    "file_name": "spring-boot-project/spring-boot-actuator/src/main/java/org/springframework/boot/actuate/web/trace/Include.java",
                    "file_size": 0
                },
                {
                    "file_additions": 56,
                    "file_deletions": 0,
                    "file_exists": false,
                    "file_name": "spring-boot-project/spring-boot-actuator/src/main/java/org/springframework/boot/actuate/web/trace/TraceableRequest.java",
                    "file_size": 0
                },
                {
                    "file_additions": 19,
                    "file_deletions": 17,
                    "file_exists": false,
                    "file_name": "spring-boot-project/spring-boot-actuator/src/main/java/org/springframework/boot/actuate/web/trace/TraceableResponse.java",
                    "file_size": 0
                },
                {
                    "file_additions": 4,
                    "file_deletions": 4,
                    "file_exists": false,
                    "file_name": "spring-boot-project/spring-boot-actuator/src/main/java/org/springframework/boot/actuate/web/trace/package-info.java",
                    "file_size": 0
                },
                {
                    "file_additions": 132,
                    "file_deletions": 0,
                    "file_exists": true,
                    "file_name": "spring-boot-project/spring-boot-actuator/src/main/java/org/springframework/boot/actuate/web/trace/reactive/HttpTraceWebFilter.java",
                    "file_size": 3600
                },
                {
                    "file_additions": 72,
                    "file_deletions": 0,
                    "file_exists": true,
                    "file_name": "spring-boot-project/spring-boot-actuator/src/main/java/org/springframework/boot/actuate/web/trace/reactive/ServerWebExchangeTraceableRequest.java",
                    "file_size": 2239
                },
                {
                    "file_additions": 50,
                    "file_deletions": 0,
                    "file_exists": true,
                    "file_name": "spring-boot-project/spring-boot-actuator/src/main/java/org/springframework/boot/actuate/web/trace/reactive/TraceableServerHttpResponse.java",
                    "file_size": 1604
                },
                {
                    "file_additions": 22,
                    "file_deletions": 0,
                    "file_exists": true,
                    "file_name": "spring-boot-project/spring-boot-actuator/src/main/java/org/springframework/boot/actuate/web/trace/reactive/package-info.java",
                    "file_size": 810
                },
                {
                    "file_additions": 119,
                    "file_deletions": 0,
                    "file_exists": true,
                    "file_name": "spring-boot-project/spring-boot-actuator/src/main/java/org/springframework/boot/actuate/web/trace/servlet/HttpTraceFilter.java",
                    "file_size": 4057
                },
                {
                    "file_additions": 87,
                    "file_deletions": 0,
                    "file_exists": true,
                    "file_name": "spring-boot-project/spring-boot-actuator/src/main/java/org/springframework/boot/actuate/web/trace/servlet/TraceableHttpServletRequest.java",
                    "file_size": 2736
                },
                {
                    "file_additions": 59,
                    "file_deletions": 0,
                    "file_exists": true,
                    "file_name": "spring-boot-project/spring-boot-actuator/src/main/java/org/springframework/boot/actuate/web/trace/servlet/TraceableHttpServletResponse.java",
                    "file_size": 1686
                },
                {
                    "file_additions": 22,
                    "file_deletions": 0,
                    "file_exists": true,
                    "file_name": "spring-boot-project/spring-boot-actuator/src/main/java/org/springframework/boot/actuate/web/trace/servlet/package-info.java",
                    "file_size": 808
                },
                {
                    "file_additions": 0,
                    "file_deletions": 60,
                    "file_exists": false,
                    "file_name": "spring-boot-project/spring-boot-actuator/src/test/java/org/springframework/boot/actuate/trace/InMemoryTraceRepositoryTests.java",
                    "file_size": 0
                },
                {
                    "file_additions": 0,
                    "file_deletions": 285,
                    "file_exists": false,
                    "file_name": "spring-boot-project/spring-boot-actuator/src/test/java/org/springframework/boot/actuate/trace/WebRequestTraceFilterTests.java",
                    "file_size": 0
                },
                {
                    "file_additions": 335,
                    "file_deletions": 0,
                    "file_exists": false,
                    "file_name": "spring-boot-project/spring-boot-actuator/src/test/java/org/springframework/boot/actuate/web/trace/HttpExchangeTracerTests.java",
                    "file_size": 0
                },
                {
                    "file_additions": 68,
                    "file_deletions": 0,
                    "file_exists": false,
                    "file_name": "spring-boot-project/spring-boot-actuator/src/test/java/org/springframework/boot/actuate/web/trace/InMemoryTraceRepositoryTests.java",
                    "file_size": 0
                },
                {
                    "file_additions": 51,
                    "file_deletions": 0,
                    "file_exists": false,
                    "file_name": "spring-boot-project/spring-boot-actuator/src/test/java/org/springframework/boot/actuate/web/trace/TraceEndpointTests.java",
                    "file_size": 0
                },
                {
                    "file_additions": 131,
                    "file_deletions": 0,
                    "file_exists": false,
                    "file_name": "spring-boot-project/spring-boot-actuator/src/test/java/org/springframework/boot/actuate/web/trace/reactive/HttpTraceWebFilterIntegrationTests.java",
                    "file_size": 0
                },
                {
                    "file_additions": 167,
                    "file_deletions": 0,
                    "file_exists": false,
                    "file_name": "spring-boot-project/spring-boot-actuator/src/test/java/org/springframework/boot/actuate/web/trace/reactive/HttpTraceWebFilterTests.java",
                    "file_size": 0
                },
                {
                    "file_additions": 129,
                    "file_deletions": 0,
                    "file_exists": false,
                    "file_name": "spring-boot-project/spring-boot-actuator/src/test/java/org/springframework/boot/actuate/web/trace/servlet/HttpTraceFilterTests.java",
                    "file_size": 0
                },
                {
                    "file_additions": 0,
                    "file_deletions": 35,
                    "file_exists": false,
                    "file_name": "spring-boot-samples/spring-boot-sample-actuator/src/test/java/sample/actuator/SampleActuatorApplicationTests.java",
                    "file_size": 0
                }
            ],
            "interesting": {
                "reopened": false,
                "status": false
            },
            "sha": "3565961d6807aae7792d7fe51337a1dbf9aca30b"
        },
        {
            "diff": "spring-projects_spring-boot/issue_11745/commit_85d4647bda19455287f9b4ad5750edcba7e7e2fb.diff",
            "diff_additions": 2,
            "diff_deletions": 2,
            "diff_file_size": 7296,
            "files": [
                {
                    "file_additions": 2,
                    "file_deletions": 2,
                    "file_exists": true,
                    "file_name": "spring-boot-project/spring-boot-cli/src/main/java/org/springframework/boot/cli/compiler/ExtendedGroovyClassLoader.java",
                    "file_size": 7296
                }
            ],
            "interesting": {
                "reopened": true,
                "status": false
            },
            "sha": "85d4647bda19455287f9b4ad5750edcba7e7e2fb"
        },
        {
            "diff": "spring-projects_spring-boot/issue_11745/commit_cffafe31ba0ea47c7e6d8ae57b5c105eeae0e2a9.diff",
            "diff_additions": 1,
            "diff_deletions": 1,
            "diff_file_size": 7296,
            "files": [
                {
                    "file_additions": 1,
                    "file_deletions": 1,
                    "file_exists": true,
                    "file_name": "spring-boot-project/spring-boot-cli/src/main/java/org/springframework/boot/cli/compiler/ExtendedGroovyClassLoader.java",
                    "file_size": 7296
                }
            ],
            "interesting": {
                "reopened": false,
                "status": false
            },
            "sha": "cffafe31ba0ea47c7e6d8ae57b5c105eeae0e2a9"
        }
    ],
    "first_commit": "2018-01-25 13:27:07",
    "last_commit": "2018-01-25 21:24:59",
    "number": 11745,
    "score": 208.0011229646266
}