{
    "commits": [
        {
            "associated_pull_request": [],
            "date": "2018-01-14 13:47:14+00:00",
            "diff": "",
            "diff_additions": 0,
            "diff_deletions": 0,
            "diff_file_size": 0,
            "diff_url": "https://github.com/stlink-org/stlink/commit/ba71988698f0cecc9ca254056f2107f467032d83.diff",
            "exists": true,
            "files": [],
            "interesting": {
                "reopen": false,
                "status": false
            },
            "is_parent": true,
            "sha": "ba71988698f0cecc9ca254056f2107f467032d83"
        },
        {
            "associated_pull_request": [],
            "date": "2018-01-14 13:49:40+00:00",
            "diff": "stlink-org_stlink/issue_220/commit_29ef2ffe2d20eb6b547654fa5a6126981f4d5428.diff",
            "diff_additions": 2,
            "diff_deletions": 0,
            "diff_file_size": 0,
            "diff_url": "https://github.com/stlink-org/stlink/commit/29ef2ffe2d20eb6b547654fa5a6126981f4d5428.diff",
            "exists": true,
            "files": [
                {
                    "file_additions": 2,
                    "file_deletions": 0,
                    "file_exists": false,
                    "file_name": "src/common.c",
                    "file_size": 0
                }
            ],
            "interesting": {
                "reopen": true,
                "status": false
            },
            "is_parent": false,
            "sha": "29ef2ffe2d20eb6b547654fa5a6126981f4d5428"
        },
        {
            "associated_pull_request": [
                "https://github.com/stlink-org/stlink/pull/1036"
            ],
            "date": "2020-06-17 12:11:28+00:00",
            "diff": "stlink-org_stlink/issue_220/commit_5fae7e4d322d27f229faf9dacd94f82e75ea97e9.diff",
            "diff_additions": 1,
            "diff_deletions": 0,
            "diff_file_size": 0,
            "diff_url": "https://github.com/stlink-org/stlink/commit/5fae7e4d322d27f229faf9dacd94f82e75ea97e9.diff",
            "exists": true,
            "files": [
                {
                    "file_additions": 1,
                    "file_deletions": 0,
                    "file_exists": false,
                    "file_name": "src/common.c",
                    "file_size": 0
                }
            ],
            "interesting": {
                "reopen": false,
                "status": false
            },
            "is_parent": false,
            "sha": "5fae7e4d322d27f229faf9dacd94f82e75ea97e9"
        }
    ],
    "first_commit": "2018-01-14 13:47:14+00:00",
    "last_commit": "2021-03-24 22:26:38+00:00",
    "number": 220,
    "pull_request": "None",
    "score": {
        "accidental_reopen_likely": false,
        "all_labels": [
            "general/documentation",
            "target/stm32f4",
            "error/reset",
            "component/st-flash",
            "programmer/STLINK/V2",
            "code/feedback",
            "status/no-bug"
        ],
        "contains_keywords": [
            "confirm",
            "work",
            "chang",
            "fix",
            "issu",
            "patch",
            "debug",
            "reason",
            "test",
            "attempt",
            "fault",
            "remov",
            "bug",
            "error",
            "problem",
            "report"
        ],
        "fix_size": 4,
        "has_labels": [],
        "intersecting": {
            "computed_score": 0.5,
            "final_commit_size": 2,
            "intersection_size": 1,
            "previous_commits_size": 3
        },
        "is_makefile_based": true,
        "no_new_files": [],
        "no_other_files": true,
        "num_prohibited_files": 65362,
        "prohibited_files": [
            "server/src/main/java/com/genymobile/scrcpy/Device.java",
            "server/src/main/java/com/genymobile/scrcpy/wrappers/SurfaceControl.java",
            "server/src/main/java/com/genymobile/scrcpy/Device.java",
            "server/src/main/java/com/genymobile/scrcpy/wrappers/SurfaceControl.java",
            "app/meson.build",
            "app/scrcpy.1",
            "app/src/common.h",
            "app/src/scrcpy.h",
            "app/src/server.h",
            "server/src/main/java/com/genymobile/scrcpy/Workarounds.java"
        ],
        "reopen": true,
        "reopen_events": [
            [
                "2016-08-20 09:09:04+00:00",
                "closed"
            ],
            [
                "2018-01-14 13:51:19+00:00",
                "commit"
            ],
            [
                "2020-02-27 15:32:43+00:00",
                "reopened"
            ],
            [
                "2020-06-17 12:13:01+00:00",
                "commit"
            ],
            [
                "2021-03-24 22:27:04+00:00",
                "closed"
            ],
            [
                "2021-03-24 22:27:04+00:00",
                "commit"
            ]
        ],
        "status": false,
        "strategy": true,
        "total_changes": 3
    }
}