{
    "commits": [
        {
            "associated_pull_request": [],
            "date": "2017-01-23 06:00:47+00:00",
            "diff": "",
            "diff_additions": 0,
            "diff_deletions": 0,
            "diff_file_size": 0,
            "diff_url": "https://github.com/krakjoe/pthreads/commit/d75eb23652fae042243a5dee64e07314e7e86377.diff",
            "exists": true,
            "files": [],
            "interesting": {
                "reopen": false,
                "status": false
            },
            "is_parent": true,
            "sha": "d75eb23652fae042243a5dee64e07314e7e86377"
        },
        {
            "associated_pull_request": [],
            "date": "2017-01-23 07:11:38+00:00",
            "diff": "krakjoe_pthreads/issue_658/commit_bd1ddc450e47635810bc2d8b9034150b9c255115.diff",
            "diff_additions": 70,
            "diff_deletions": 4,
            "diff_file_size": 81275,
            "diff_url": "https://github.com/krakjoe/pthreads/commit/bd1ddc450e47635810bc2d8b9034150b9c255115.diff",
            "exists": true,
            "files": [
                {
                    "file_additions": 20,
                    "file_deletions": 0,
                    "file_exists": true,
                    "file_name": "php_pthreads.c",
                    "file_size": 35621
                },
                {
                    "file_additions": 5,
                    "file_deletions": 1,
                    "file_exists": true,
                    "file_name": "src/object.c",
                    "file_size": 16064
                },
                {
                    "file_additions": 45,
                    "file_deletions": 3,
                    "file_exists": true,
                    "file_name": "src/prepare.c",
                    "file_size": 29590
                }
            ],
            "interesting": {
                "reopen": false,
                "status": false
            },
            "is_parent": false,
            "sha": "bd1ddc450e47635810bc2d8b9034150b9c255115"
        },
        {
            "associated_pull_request": [],
            "date": "2017-01-23 07:28:53+00:00",
            "diff": "krakjoe_pthreads/issue_658/commit_61a5e8fa36d243312ecd1f896b11e3f13b16094c.diff",
            "diff_additions": 4,
            "diff_deletions": 70,
            "diff_file_size": 81275,
            "diff_url": "https://github.com/krakjoe/pthreads/commit/61a5e8fa36d243312ecd1f896b11e3f13b16094c.diff",
            "exists": true,
            "files": [
                {
                    "file_additions": 0,
                    "file_deletions": 20,
                    "file_exists": true,
                    "file_name": "php_pthreads.c",
                    "file_size": 35621
                },
                {
                    "file_additions": 1,
                    "file_deletions": 5,
                    "file_exists": true,
                    "file_name": "src/object.c",
                    "file_size": 16064
                },
                {
                    "file_additions": 3,
                    "file_deletions": 45,
                    "file_exists": true,
                    "file_name": "src/prepare.c",
                    "file_size": 29590
                }
            ],
            "interesting": {
                "reopen": true,
                "status": false
            },
            "is_parent": false,
            "sha": "61a5e8fa36d243312ecd1f896b11e3f13b16094c"
        },
        {
            "associated_pull_request": [],
            "date": "2017-03-05 13:29:49+00:00",
            "diff": "krakjoe_pthreads/issue_658/commit_c28c4b96da891871aa4cb62da35b3a63d5074c78.diff",
            "diff_additions": 57,
            "diff_deletions": 42,
            "diff_file_size": 29590,
            "diff_url": "https://github.com/krakjoe/pthreads/commit/c28c4b96da891871aa4cb62da35b3a63d5074c78.diff",
            "exists": true,
            "files": [
                {
                    "file_additions": 57,
                    "file_deletions": 42,
                    "file_exists": true,
                    "file_name": "src/prepare.c",
                    "file_size": 29590
                }
            ],
            "interesting": {
                "reopen": false,
                "status": false
            },
            "is_parent": false,
            "sha": "c28c4b96da891871aa4cb62da35b3a63d5074c78"
        },
        {
            "associated_pull_request": [],
            "date": "2017-03-05 13:31:00+00:00",
            "diff": "krakjoe_pthreads/issue_658/commit_e52488cfb3c71d06d099987c4a3c9fe6ed1fad58.diff",
            "diff_additions": 57,
            "diff_deletions": 42,
            "diff_file_size": 29590,
            "diff_url": "https://github.com/krakjoe/pthreads/commit/e52488cfb3c71d06d099987c4a3c9fe6ed1fad58.diff",
            "exists": true,
            "files": [
                {
                    "file_additions": 57,
                    "file_deletions": 42,
                    "file_exists": true,
                    "file_name": "src/prepare.c",
                    "file_size": 29590
                }
            ],
            "interesting": {
                "reopen": false,
                "status": false
            },
            "is_parent": false,
            "sha": "e52488cfb3c71d06d099987c4a3c9fe6ed1fad58"
        },
        {
            "associated_pull_request": [],
            "date": "2017-03-05 13:31:00+00:00",
            "diff": "krakjoe_pthreads/issue_658/commit_717d1bd2a27eb65de704ae95179a15cb10eccc07.diff",
            "diff_additions": 56,
            "diff_deletions": 41,
            "diff_file_size": 29590,
            "diff_url": "https://github.com/krakjoe/pthreads/commit/717d1bd2a27eb65de704ae95179a15cb10eccc07.diff",
            "exists": true,
            "files": [
                {
                    "file_additions": 56,
                    "file_deletions": 41,
                    "file_exists": true,
                    "file_name": "src/prepare.c",
                    "file_size": 29590
                }
            ],
            "interesting": {
                "reopen": false,
                "status": false
            },
            "is_parent": false,
            "sha": "717d1bd2a27eb65de704ae95179a15cb10eccc07"
        },
        {
            "associated_pull_request": [],
            "date": "2017-03-08 21:28:39+00:00",
            "diff": "krakjoe_pthreads/issue_658/commit_d7579fd06ce968ac53e6faa9f4444821cd972b79.diff",
            "diff_additions": 47,
            "diff_deletions": 33,
            "diff_file_size": 29590,
            "diff_url": "https://github.com/krakjoe/pthreads/commit/d7579fd06ce968ac53e6faa9f4444821cd972b79.diff",
            "exists": true,
            "files": [
                {
                    "file_additions": 47,
                    "file_deletions": 33,
                    "file_exists": true,
                    "file_name": "src/prepare.c",
                    "file_size": 29590
                }
            ],
            "interesting": {
                "reopen": false,
                "status": false
            },
            "is_parent": false,
            "sha": "d7579fd06ce968ac53e6faa9f4444821cd972b79"
        },
        {
            "associated_pull_request": [],
            "date": "2017-06-11 00:35:31+00:00",
            "diff": "krakjoe_pthreads/issue_658/commit_6f4a83bade2c65d7622c28b0bef14108163b9a98.diff",
            "diff_additions": 69,
            "diff_deletions": 46,
            "diff_file_size": 89191,
            "diff_url": "https://github.com/krakjoe/pthreads/commit/6f4a83bade2c65d7622c28b0bef14108163b9a98.diff",
            "exists": true,
            "files": [
                {
                    "file_additions": 63,
                    "file_deletions": 43,
                    "file_exists": true,
                    "file_name": "src/prepare.c",
                    "file_size": 29590
                },
                {
                    "file_additions": 1,
                    "file_deletions": 1,
                    "file_exists": true,
                    "file_name": "src/socket.c",
                    "file_size": 28294
                },
                {
                    "file_additions": 5,
                    "file_deletions": 2,
                    "file_exists": true,
                    "file_name": "src/store.c",
                    "file_size": 31307
                }
            ],
            "interesting": {
                "reopen": false,
                "status": false
            },
            "is_parent": false,
            "sha": "6f4a83bade2c65d7622c28b0bef14108163b9a98"
        },
        {
            "associated_pull_request": [],
            "date": "2017-06-11 00:45:27+00:00",
            "diff": "krakjoe_pthreads/issue_658/commit_c559473bd2da137ea1ba5f4ccf9e98053e04ef82.diff",
            "diff_additions": 97,
            "diff_deletions": 60,
            "diff_file_size": 89191,
            "diff_url": "https://github.com/krakjoe/pthreads/commit/c559473bd2da137ea1ba5f4ccf9e98053e04ef82.diff",
            "exists": true,
            "files": [
                {
                    "file_additions": 91,
                    "file_deletions": 57,
                    "file_exists": true,
                    "file_name": "src/prepare.c",
                    "file_size": 29590
                },
                {
                    "file_additions": 1,
                    "file_deletions": 1,
                    "file_exists": true,
                    "file_name": "src/socket.c",
                    "file_size": 28294
                },
                {
                    "file_additions": 5,
                    "file_deletions": 2,
                    "file_exists": true,
                    "file_name": "src/store.c",
                    "file_size": 31307
                }
            ],
            "interesting": {
                "reopen": false,
                "status": false
            },
            "is_parent": false,
            "sha": "c559473bd2da137ea1ba5f4ccf9e98053e04ef82"
        },
        {
            "associated_pull_request": [
                "https://github.com/krakjoe/pthreads/pull/686"
            ],
            "date": "2017-06-11 00:45:27+00:00",
            "diff": "krakjoe_pthreads/issue_658/commit_e11dcd9abd77b12d99428e313964da8c3a263842.diff",
            "diff_additions": 49,
            "diff_deletions": 33,
            "diff_file_size": 29590,
            "diff_url": "https://github.com/krakjoe/pthreads/commit/e11dcd9abd77b12d99428e313964da8c3a263842.diff",
            "exists": true,
            "files": [
                {
                    "file_additions": 49,
                    "file_deletions": 33,
                    "file_exists": true,
                    "file_name": "src/prepare.c",
                    "file_size": 29590
                }
            ],
            "interesting": {
                "reopen": false,
                "status": false
            },
            "is_parent": false,
            "sha": "e11dcd9abd77b12d99428e313964da8c3a263842"
        }
    ],
    "first_commit": "2017-01-23 06:00:47+00:00",
    "last_commit": "2017-06-11 01:02:19+00:00",
    "number": 658,
    "pull_request": "None",
    "score": {
        "accidental_reopen_likely": false,
        "all_labels": [
            "bug"
        ],
        "contains_keywords": [
            "fail",
            "fix",
            "fault"
        ],
        "fix_size": 273,
        "has_labels": [
            "bug"
        ],
        "intersecting": {
            "computed_score": 0.9876543209876543,
            "final_commit_size": 81,
            "intersection_size": 80,
            "previous_commits_size": 272
        },
        "is_makefile_based": false,
        "no_new_files": [],
        "no_other_files": false,
        "num_prohibited_files": 298394,
        "prohibited_files": [
            "server/src/main/java/com/genymobile/scrcpy/Device.java",
            "server/src/main/java/com/genymobile/scrcpy/wrappers/SurfaceControl.java",
            "server/src/main/java/com/genymobile/scrcpy/Device.java",
            "server/src/main/java/com/genymobile/scrcpy/wrappers/SurfaceControl.java",
            "app/meson.build",
            "app/scrcpy.1",
            "app/src/common.h",
            "app/src/scrcpy.h",
            "app/src/server.h",
            "server/src/main/java/com/genymobile/scrcpy/Workarounds.java"
        ],
        "reopen": true,
        "reopen_events": [
            [
                "2017-01-23 07:12:03+00:00",
                "closed"
            ],
            [
                "2017-01-23 07:12:03+00:00",
                "commit"
            ],
            [
                "2017-01-23 07:29:07+00:00",
                "commit"
            ],
            [
                "2017-01-23 07:29:33+00:00",
                "reopened"
            ],
            [
                "2017-03-05 13:29:53+00:00",
                "commit"
            ],
            [
                "2017-03-05 13:31:02+00:00",
                "commit"
            ],
            [
                "2017-03-05 13:43:29+00:00",
                "commit"
            ],
            [
                "2017-03-08 21:29:03+00:00",
                "commit"
            ],
            [
                "2017-06-11 00:37:09+00:00",
                "commit"
            ],
            [
                "2017-06-11 00:46:41+00:00",
                "commit"
            ],
            [
                "2017-06-11 01:02:35+00:00",
                "commit"
            ],
            [
                "2017-08-15 20:51:03+00:00",
                "closed"
            ]
        ],
        "status": false,
        "strategy": true,
        "total_changes": 877
    }
}