{
    "commits": [
        {
            "associated_pull_request": [],
            "date": "2017-05-09 18:10:48+00:00",
            "diff": "util-linux_util-linux/issue_422/commit_c6b0cbdd95ff30788cdb6afee707e20f0dd640b8.diff",
            "diff_additions": 1,
            "diff_deletions": 1,
            "diff_file_size": 4365,
            "diff_url": "https://github.com/util-linux/util-linux/commit/c6b0cbdd95ff30788cdb6afee707e20f0dd640b8.diff",
            "exists": true,
            "files": [
                {
                    "file_additions": 1,
                    "file_deletions": 1,
                    "file_exists": true,
                    "file_name": "lib/mbsedit.c",
                    "file_size": 4365
                }
            ],
            "interesting": {
                "reopen": false,
                "status": false
            },
            "is_parent": true,
            "sha": "c6b0cbdd95ff30788cdb6afee707e20f0dd640b8"
        },
        {
            "associated_pull_request": [],
            "date": "2017-05-09 18:10:49+00:00",
            "diff": "util-linux_util-linux/issue_422/commit_b6b5272b03ea9d3fa15601801d4d0f76ea4440f1.diff",
            "diff_additions": 2,
            "diff_deletions": 0,
            "diff_file_size": 18818,
            "diff_url": "https://github.com/util-linux/util-linux/commit/b6b5272b03ea9d3fa15601801d4d0f76ea4440f1.diff",
            "exists": true,
            "files": [
                {
                    "file_additions": 2,
                    "file_deletions": 0,
                    "file_exists": true,
                    "file_name": "text-utils/col.c",
                    "file_size": 18818
                }
            ],
            "interesting": {
                "reopen": true,
                "status": false
            },
            "is_parent": false,
            "sha": "b6b5272b03ea9d3fa15601801d4d0f76ea4440f1"
        },
        {
            "associated_pull_request": [],
            "date": "2020-06-20 08:22:24+00:00",
            "diff": "util-linux_util-linux/issue_422/commit_d6abf579bb89dcd0c4160ad12e0cf3135830bedf.diff",
            "diff_additions": 1,
            "diff_deletions": 1,
            "diff_file_size": 18818,
            "diff_url": "https://github.com/util-linux/util-linux/commit/d6abf579bb89dcd0c4160ad12e0cf3135830bedf.diff",
            "exists": true,
            "files": [
                {
                    "file_additions": 1,
                    "file_deletions": 1,
                    "file_exists": true,
                    "file_name": "text-utils/col.c",
                    "file_size": 18818
                }
            ],
            "interesting": {
                "reopen": false,
                "status": false
            },
            "is_parent": false,
            "sha": "d6abf579bb89dcd0c4160ad12e0cf3135830bedf"
        },
        {
            "associated_pull_request": [
                "https://github.com/util-linux/util-linux/pull/1066"
            ],
            "date": "2020-06-20 08:22:24+00:00",
            "diff": "util-linux_util-linux/issue_422/commit_d8bfcb4cc5d65239e7c21b1067b82a0b24ae386b.diff",
            "diff_additions": 1,
            "diff_deletions": 1,
            "diff_file_size": 18818,
            "diff_url": "https://github.com/util-linux/util-linux/commit/d8bfcb4cc5d65239e7c21b1067b82a0b24ae386b.diff",
            "exists": true,
            "files": [
                {
                    "file_additions": 1,
                    "file_deletions": 1,
                    "file_exists": true,
                    "file_name": "text-utils/col.c",
                    "file_size": 18818
                }
            ],
            "interesting": {
                "reopen": false,
                "status": false
            },
            "is_parent": false,
            "sha": "d8bfcb4cc5d65239e7c21b1067b82a0b24ae386b"
        }
    ],
    "first_commit": "2017-05-10 08:53:28+00:00",
    "last_commit": "2020-06-20 21:17:30+00:00",
    "number": 422,
    "pull_request": "None",
    "score": {
        "accidental_reopen_likely": false,
        "all_labels": [],
        "contains_keywords": [
            "work",
            "fix",
            "issu",
            "test",
            "report"
        ],
        "fix_size": 4,
        "has_labels": [],
        "intersecting": {
            "computed_score": 1.0,
            "final_commit_size": 2,
            "intersection_size": 2,
            "previous_commits_size": 4
        },
        "is_makefile_based": true,
        "no_new_files": [],
        "no_other_files": false,
        "num_prohibited_files": 169334,
        "prohibited_files": [
            "server/src/main/java/com/genymobile/scrcpy/Device.java",
            "server/src/main/java/com/genymobile/scrcpy/wrappers/SurfaceControl.java",
            "server/src/main/java/com/genymobile/scrcpy/Device.java",
            "server/src/main/java/com/genymobile/scrcpy/wrappers/SurfaceControl.java",
            "app/meson.build",
            "app/scrcpy.1",
            "app/src/common.h",
            "app/src/scrcpy.h",
            "app/src/server.h",
            "server/src/main/java/com/genymobile/scrcpy/Workarounds.java"
        ],
        "reopen": true,
        "reopen_events": [
            [
                "2017-05-10 08:54:00+00:00",
                "closed"
            ],
            [
                "2017-05-10 09:27:04+00:00",
                "commit"
            ],
            [
                "2020-06-18 09:39:49+00:00",
                "reopened"
            ],
            [
                "2020-06-20 08:28:30+00:00",
                "commit"
            ],
            [
                "2020-06-20 21:17:59+00:00",
                "commit"
            ],
            [
                "2020-07-07 09:16:33+00:00",
                "closed"
            ]
        ],
        "status": false,
        "strategy": true,
        "total_changes": 8
    }
}