{
    "category": [
        "GUI",
        "control flow"
    ],
    "commits": [
        {
            "associated_pull_request": [],
            "date": "2018-02-04 10:53:45",
            "diff": "jmcnamara_libxlsxwriter/issue_30/commit_ce9922bf134df0ce80cf3c83ed258844bc2509de.diff",
            "diff_additions": 51,
            "diff_deletions": 17,
            "diff_file_size": 470263,
            "diff_url": "https://github.com/jmcnamara/libxlsxwriter/commit/ce9922bf134df0ce80cf3c83ed258844bc2509de.diff",
            "exists": true,
            "files": [
                {
                    "file_additions": 24,
                    "file_deletions": 7,
                    "file_exists": true,
                    "file_name": "src/chart.c",
                    "file_size": 173153
                },
                {
                    "file_additions": 27,
                    "file_deletions": 10,
                    "file_exists": true,
                    "file_name": "src/worksheet.c",
                    "file_size": 297110
                }
            ],
            "interesting": {
                "reopen": false,
                "status": false
            },
            "is_parent": true,
            "sha": "ce9922bf134df0ce80cf3c83ed258844bc2509de"
        },
        {
            "associated_pull_request": [],
            "date": "2018-02-04 20:59:33",
            "diff": "jmcnamara_libxlsxwriter/issue_30/commit_2f4bb80848f248a8189763437f35211fd1ab63be.diff",
            "diff_additions": 554,
            "diff_deletions": 0,
            "diff_file_size": 323885,
            "diff_url": "https://github.com/jmcnamara/libxlsxwriter/commit/2f4bb80848f248a8189763437f35211fd1ab63be.diff",
            "exists": true,
            "files": [
                {
                    "file_additions": 255,
                    "file_deletions": 0,
                    "file_exists": true,
                    "file_name": "examples/outline.c",
                    "file_size": 13457
                },
                {
                    "file_additions": 31,
                    "file_deletions": 0,
                    "file_exists": true,
                    "file_name": "src/worksheet.c",
                    "file_size": 297110
                },
                {
                    "file_additions": 67,
                    "file_deletions": 0,
                    "file_exists": true,
                    "file_name": "test/functional/src/test_outline01.c",
                    "file_size": 3263
                },
                {
                    "file_additions": 70,
                    "file_deletions": 0,
                    "file_exists": true,
                    "file_name": "test/functional/src/test_outline02.c",
                    "file_size": 3481
                },
                {
                    "file_additions": 77,
                    "file_deletions": 0,
                    "file_exists": true,
                    "file_name": "test/functional/src/test_outline03.c",
                    "file_size": 3731
                },
                {
                    "file_additions": 54,
                    "file_deletions": 0,
                    "file_exists": true,
                    "file_name": "test/functional/src/test_outline04.c",
                    "file_size": 2843
                }
            ],
            "interesting": {
                "reopen": false,
                "status": true
            },
            "is_parent": false,
            "sha": "2f4bb80848f248a8189763437f35211fd1ab63be"
        },
        {
            "associated_pull_request": [],
            "date": "2018-02-04 20:59:33",
            "diff": "jmcnamara_libxlsxwriter/issue_30/commit_aeb6e0e9b9bdbaed00f489c32630f65d9c56fc76.diff",
            "diff_additions": 548,
            "diff_deletions": 0,
            "diff_file_size": 323885,
            "diff_url": "https://github.com/jmcnamara/libxlsxwriter/commit/aeb6e0e9b9bdbaed00f489c32630f65d9c56fc76.diff",
            "exists": true,
            "files": [
                {
                    "file_additions": 255,
                    "file_deletions": 0,
                    "file_exists": true,
                    "file_name": "examples/outline.c",
                    "file_size": 13457
                },
                {
                    "file_additions": 25,
                    "file_deletions": 0,
                    "file_exists": true,
                    "file_name": "src/worksheet.c",
                    "file_size": 297110
                },
                {
                    "file_additions": 67,
                    "file_deletions": 0,
                    "file_exists": true,
                    "file_name": "test/functional/src/test_outline01.c",
                    "file_size": 3263
                },
                {
                    "file_additions": 70,
                    "file_deletions": 0,
                    "file_exists": true,
                    "file_name": "test/functional/src/test_outline02.c",
                    "file_size": 3481
                },
                {
                    "file_additions": 77,
                    "file_deletions": 0,
                    "file_exists": true,
                    "file_name": "test/functional/src/test_outline03.c",
                    "file_size": 3731
                },
                {
                    "file_additions": 54,
                    "file_deletions": 0,
                    "file_exists": true,
                    "file_name": "test/functional/src/test_outline04.c",
                    "file_size": 2843
                }
            ],
            "interesting": {
                "reopen": false,
                "status": false
            },
            "is_parent": false,
            "sha": "aeb6e0e9b9bdbaed00f489c32630f65d9c56fc76"
        },
        {
            "associated_pull_request": [],
            "date": "2018-02-05 23:33:32",
            "diff": "jmcnamara_libxlsxwriter/issue_30/commit_6d2befd587a6d9cac297ca5711c411923f35992d.diff",
            "diff_additions": 238,
            "diff_deletions": 46,
            "diff_file_size": 317401,
            "diff_url": "https://github.com/jmcnamara/libxlsxwriter/commit/6d2befd587a6d9cac297ca5711c411923f35992d.diff",
            "exists": true,
            "files": [
                {
                    "file_additions": 45,
                    "file_deletions": 45,
                    "file_exists": true,
                    "file_name": "examples/outline.c",
                    "file_size": 13457
                },
                {
                    "file_additions": 52,
                    "file_deletions": 1,
                    "file_exists": true,
                    "file_name": "src/worksheet.c",
                    "file_size": 297110
                },
                {
                    "file_additions": 71,
                    "file_deletions": 0,
                    "file_exists": true,
                    "file_name": "test/functional/src/test_outline05.c",
                    "file_size": 3482
                },
                {
                    "file_additions": 70,
                    "file_deletions": 0,
                    "file_exists": true,
                    "file_name": "test/functional/src/test_outline06.c",
                    "file_size": 3352
                }
            ],
            "interesting": {
                "reopen": false,
                "status": false
            },
            "is_parent": false,
            "sha": "6d2befd587a6d9cac297ca5711c411923f35992d"
        },
        {
            "associated_pull_request": [],
            "date": "2018-02-07 23:09:02",
            "diff": "jmcnamara_libxlsxwriter/issue_30/commit_205f4cacd3e06d10ce32e89b4e4fb18232d05d94.diff",
            "diff_additions": 272,
            "diff_deletions": 1,
            "diff_file_size": 26715,
            "diff_url": "https://github.com/jmcnamara/libxlsxwriter/commit/205f4cacd3e06d10ce32e89b4e4fb18232d05d94.diff",
            "exists": true,
            "files": [
                {
                    "file_additions": 1,
                    "file_deletions": 1,
                    "file_exists": true,
                    "file_name": "examples/outline.c",
                    "file_size": 13457
                },
                {
                    "file_additions": 271,
                    "file_deletions": 0,
                    "file_exists": true,
                    "file_name": "examples/outline_collapsed.c",
                    "file_size": 13258
                }
            ],
            "interesting": {
                "reopen": false,
                "status": false
            },
            "is_parent": false,
            "sha": "205f4cacd3e06d10ce32e89b4e4fb18232d05d94"
        },
        {
            "associated_pull_request": [],
            "date": "2018-02-11 00:13:26",
            "diff": "jmcnamara_libxlsxwriter/issue_30/commit_269f3dce6219790ef0f6a6ec9f51b01ea7ef2dcf.diff",
            "diff_additions": 4,
            "diff_deletions": 2,
            "diff_file_size": 1375,
            "diff_url": "https://github.com/jmcnamara/libxlsxwriter/commit/269f3dce6219790ef0f6a6ec9f51b01ea7ef2dcf.diff",
            "exists": true,
            "files": [
                {
                    "file_additions": 4,
                    "file_deletions": 2,
                    "file_exists": true,
                    "file_name": "examples/hide_row_col.c",
                    "file_size": 1375
                }
            ],
            "interesting": {
                "reopen": false,
                "status": false
            },
            "is_parent": false,
            "sha": "269f3dce6219790ef0f6a6ec9f51b01ea7ef2dcf"
        }
    ],
    "first_commit": "2018-02-04 10:53:45",
    "last_commit": "2018-02-11 00:13:26",
    "number": 30,
    "pull_request": "None",
    "score": {
        "accidental_reopen_likely": false,
        "all_labels": [
            "feature request",
            "ready to close"
        ],
        "contains_keywords": [
            "work",
            "fault",
            "problem"
        ],
        "fix_size": 141,
        "has_labels": [],
        "intersecting": {
            "computed_score": 0.0,
            "final_commit_size": 6,
            "intersection_size": 0,
            "previous_commits_size": 135
        },
        "is_makefile_based": true,
        "no_new_files": [
            "examples/hide_row_col.c"
        ],
        "no_other_files": false,
        "num_prohibited_files": 20484,
        "prohibited_files": [
            "kill.h",
            "meminfo.h",
            "kill.h",
            "meminfo.h",
            "kill.h",
            "meminfo.h",
            "testsuite_cli_test.go",
            "testsuite_cli_test.go",
            "common.mk",
            "i3bar/include/draw_util.h"
        ],
        "reopen": false,
        "reopen_events": [
            [
                "2018-02-04 21:00:08",
                "commit"
            ],
            [
                "2018-02-04 21:15:49",
                "commit"
            ],
            [
                "2018-02-05 23:34:21",
                "commit"
            ],
            [
                "2018-02-07 23:09:47",
                "commit"
            ],
            [
                "2018-02-11 00:14:04",
                "commit"
            ],
            [
                "2018-02-11 23:53:44",
                "closed"
            ]
        ],
        "status": true,
        "strategy": true,
        "total_changes": 1733
    }
}