{
    "category": [
        "network/protocol",
        "feature request"
    ],
    "commits": [
        {
            "associated_pull_request": [
                "https://github.com/zephyrproject-rtos/zephyr/pull/5508"
            ],
            "date": "2017-12-29 09:18:27",
            "diff": "zephyrproject-rtos_zephyr/issue_5477/commit_045d146d9f32a34811af132a9051e3fcd3b0d8a0.diff",
            "diff_additions": 1,
            "diff_deletions": 1,
            "diff_file_size": 0,
            "diff_url": "https://github.com/zephyrproject-rtos/zephyr/commit/045d146d9f32a34811af132a9051e3fcd3b0d8a0.diff",
            "exists": true,
            "files": [
                {
                    "file_additions": 1,
                    "file_deletions": 1,
                    "file_exists": false,
                    "file_name": "subsys/bluetooth/host/mesh/shell.c",
                    "file_size": 0
                }
            ],
            "interesting": {
                "reopen": false,
                "status": false
            },
            "is_parent": true,
            "sha": "045d146d9f32a34811af132a9051e3fcd3b0d8a0"
        },
        {
            "associated_pull_request": [],
            "date": "2017-12-30 14:20:08",
            "diff": "zephyrproject-rtos_zephyr/issue_5477/commit_a71da87c1a9dbf515bf522ae36e3be3bb781a85f.diff",
            "diff_additions": 63,
            "diff_deletions": 12,
            "diff_file_size": 19977,
            "diff_url": "https://github.com/zephyrproject-rtos/zephyr/commit/a71da87c1a9dbf515bf522ae36e3be3bb781a85f.diff",
            "exists": true,
            "files": [
                {
                    "file_additions": 58,
                    "file_deletions": 4,
                    "file_exists": true,
                    "file_name": "boards/posix/native_posix/hw_models_top.c",
                    "file_size": 4671
                },
                {
                    "file_additions": 4,
                    "file_deletions": 3,
                    "file_exists": true,
                    "file_name": "boards/posix/native_posix/main.c",
                    "file_size": 1933
                },
                {
                    "file_additions": 1,
                    "file_deletions": 5,
                    "file_exists": true,
                    "file_name": "boards/posix/native_posix/timer_model.c",
                    "file_size": 13373
                }
            ],
            "interesting": {
                "reopen": false,
                "status": false
            },
            "is_parent": false,
            "sha": "a71da87c1a9dbf515bf522ae36e3be3bb781a85f"
        },
        {
            "associated_pull_request": [],
            "date": "2017-12-30 14:20:08",
            "diff": "zephyrproject-rtos_zephyr/issue_5477/commit_ef7c305e8b36a08a3464e74c75beb8432e1fb2da.diff",
            "diff_additions": 67,
            "diff_deletions": 12,
            "diff_file_size": 19977,
            "diff_url": "https://github.com/zephyrproject-rtos/zephyr/commit/ef7c305e8b36a08a3464e74c75beb8432e1fb2da.diff",
            "exists": true,
            "files": [
                {
                    "file_additions": 62,
                    "file_deletions": 4,
                    "file_exists": true,
                    "file_name": "boards/posix/native_posix/hw_models_top.c",
                    "file_size": 4671
                },
                {
                    "file_additions": 4,
                    "file_deletions": 3,
                    "file_exists": true,
                    "file_name": "boards/posix/native_posix/main.c",
                    "file_size": 1933
                },
                {
                    "file_additions": 1,
                    "file_deletions": 5,
                    "file_exists": true,
                    "file_name": "boards/posix/native_posix/timer_model.c",
                    "file_size": 13373
                }
            ],
            "interesting": {
                "reopen": false,
                "status": false
            },
            "is_parent": false,
            "sha": "ef7c305e8b36a08a3464e74c75beb8432e1fb2da"
        },
        {
            "associated_pull_request": [],
            "date": "2017-12-30 14:20:08",
            "diff": "zephyrproject-rtos_zephyr/issue_5477/commit_84bf9b8542d380eca229014c99b51436e0af4520.diff",
            "diff_additions": 63,
            "diff_deletions": 12,
            "diff_file_size": 19977,
            "diff_url": "https://github.com/zephyrproject-rtos/zephyr/commit/84bf9b8542d380eca229014c99b51436e0af4520.diff",
            "exists": true,
            "files": [
                {
                    "file_additions": 58,
                    "file_deletions": 4,
                    "file_exists": true,
                    "file_name": "boards/posix/native_posix/hw_models_top.c",
                    "file_size": 4671
                },
                {
                    "file_additions": 4,
                    "file_deletions": 3,
                    "file_exists": true,
                    "file_name": "boards/posix/native_posix/main.c",
                    "file_size": 1933
                },
                {
                    "file_additions": 1,
                    "file_deletions": 5,
                    "file_exists": true,
                    "file_name": "boards/posix/native_posix/timer_model.c",
                    "file_size": 13373
                }
            ],
            "interesting": {
                "reopen": false,
                "status": true
            },
            "is_parent": false,
            "sha": "84bf9b8542d380eca229014c99b51436e0af4520"
        },
        {
            "associated_pull_request": [
                "https://github.com/zephyrproject-rtos/zephyr/pull/5519"
            ],
            "date": "2017-12-30 14:20:08",
            "diff": "zephyrproject-rtos_zephyr/issue_5477/commit_0ac40be131e55f8ee21023141e40bc4589975474.diff",
            "diff_additions": 63,
            "diff_deletions": 12,
            "diff_file_size": 19977,
            "diff_url": "https://github.com/zephyrproject-rtos/zephyr/commit/0ac40be131e55f8ee21023141e40bc4589975474.diff",
            "exists": true,
            "files": [
                {
                    "file_additions": 58,
                    "file_deletions": 4,
                    "file_exists": true,
                    "file_name": "boards/posix/native_posix/hw_models_top.c",
                    "file_size": 4671
                },
                {
                    "file_additions": 4,
                    "file_deletions": 3,
                    "file_exists": true,
                    "file_name": "boards/posix/native_posix/main.c",
                    "file_size": 1933
                },
                {
                    "file_additions": 1,
                    "file_deletions": 5,
                    "file_exists": true,
                    "file_name": "boards/posix/native_posix/timer_model.c",
                    "file_size": 13373
                }
            ],
            "interesting": {
                "reopen": false,
                "status": false
            },
            "is_parent": false,
            "sha": "0ac40be131e55f8ee21023141e40bc4589975474"
        },
        {
            "associated_pull_request": [],
            "date": "2017-12-30 14:20:08",
            "diff": "zephyrproject-rtos_zephyr/issue_5477/commit_70a53d29a6c0382ca2e6c3bf70de995f35e5158f.diff",
            "diff_additions": 63,
            "diff_deletions": 12,
            "diff_file_size": 19977,
            "diff_url": "https://github.com/zephyrproject-rtos/zephyr/commit/70a53d29a6c0382ca2e6c3bf70de995f35e5158f.diff",
            "exists": true,
            "files": [
                {
                    "file_additions": 58,
                    "file_deletions": 4,
                    "file_exists": true,
                    "file_name": "boards/posix/native_posix/hw_models_top.c",
                    "file_size": 4671
                },
                {
                    "file_additions": 4,
                    "file_deletions": 3,
                    "file_exists": true,
                    "file_name": "boards/posix/native_posix/main.c",
                    "file_size": 1933
                },
                {
                    "file_additions": 1,
                    "file_deletions": 5,
                    "file_exists": true,
                    "file_name": "boards/posix/native_posix/timer_model.c",
                    "file_size": 13373
                }
            ],
            "interesting": {
                "reopen": false,
                "status": false
            },
            "is_parent": false,
            "sha": "70a53d29a6c0382ca2e6c3bf70de995f35e5158f"
        },
        {
            "associated_pull_request": [
                "https://github.com/zephyrproject-rtos/zephyr/pull/5519"
            ],
            "date": "2017-12-30 14:20:08",
            "diff": "zephyrproject-rtos_zephyr/issue_5477/commit_e04764dbc716301604cb4e201eebe15cde6a4aee.diff",
            "diff_additions": 63,
            "diff_deletions": 12,
            "diff_file_size": 19977,
            "diff_url": "https://github.com/zephyrproject-rtos/zephyr/commit/e04764dbc716301604cb4e201eebe15cde6a4aee.diff",
            "exists": true,
            "files": [
                {
                    "file_additions": 58,
                    "file_deletions": 4,
                    "file_exists": true,
                    "file_name": "boards/posix/native_posix/hw_models_top.c",
                    "file_size": 4671
                },
                {
                    "file_additions": 4,
                    "file_deletions": 3,
                    "file_exists": true,
                    "file_name": "boards/posix/native_posix/main.c",
                    "file_size": 1933
                },
                {
                    "file_additions": 1,
                    "file_deletions": 5,
                    "file_exists": true,
                    "file_name": "boards/posix/native_posix/timer_model.c",
                    "file_size": 13373
                }
            ],
            "interesting": {
                "reopen": false,
                "status": false
            },
            "is_parent": false,
            "sha": "e04764dbc716301604cb4e201eebe15cde6a4aee"
        }
    ],
    "first_commit": "2017-12-30 07:28:00",
    "last_commit": "2018-01-02 20:26:34",
    "number": 5477,
    "pull_request": "None",
    "score": {
        "accidental_reopen_likely": false,
        "all_labels": [
            "Enhancement",
            "area: native port"
        ],
        "contains_keywords": [],
        "fix_size": 79,
        "has_labels": [],
        "intersecting": {
            "computed_score": 1.0,
            "final_commit_size": 71,
            "intersection_size": 71,
            "previous_commits_size": 79
        },
        "is_makefile_based": true,
        "no_new_files": [],
        "no_other_files": true,
        "num_prohibited_files": 80318,
        "prohibited_files": [
            "hal/inc/pinmap_hal.h",
            "Debug/marvin.bin",
            "Debug/marvin.elf",
            "Debug/marvin.hex",
            "Debug/marvin.bin",
            "Debug/marvin.elf",
            "Debug/marvin.hex",
            "inc/spark_utilities.h",
            "Debug/marvin.bin",
            "Debug/marvin.elf"
        ],
        "reopen": false,
        "reopen_events": [
            [
                "2017-12-30 14:27:25",
                "commit"
            ],
            [
                "2017-12-30 17:22:33",
                "commit"
            ],
            [
                "2017-12-30 18:07:43",
                "commit"
            ],
            [
                "2017-12-30 18:12:56",
                "commit"
            ],
            [
                "2018-01-01 18:03:17",
                "commit"
            ],
            [
                "2018-01-02 20:26:35",
                "closed"
            ],
            [
                "2018-01-02 20:26:57",
                "commit"
            ]
        ],
        "status": true,
        "strategy": true,
        "total_changes": 456
    }
}