{
    "category": [
        "GUI",
        "network/protocol"
    ],
    "commits": [
        {
            "associated_pull_request": [],
            "date": "2019-11-21 20:07:18",
            "diff": "darktable-org_darktable/issue_3501/commit_e6fd6e6c691fb758bada86716fccfc061b1556ea.diff",
            "diff_additions": 5,
            "diff_deletions": 0,
            "diff_file_size": 192746,
            "diff_url": "https://github.com/darktable-org/darktable/commit/e6fd6e6c691fb758bada86716fccfc061b1556ea.diff",
            "exists": true,
            "files": [
                {
                    "file_additions": 5,
                    "file_deletions": 0,
                    "file_exists": true,
                    "file_name": "src/common/database.c",
                    "file_size": 192746
                }
            ],
            "interesting": {
                "reopen": false,
                "status": false
            },
            "is_parent": true,
            "sha": "e6fd6e6c691fb758bada86716fccfc061b1556ea"
        },
        {
            "associated_pull_request": [],
            "date": "2019-11-21 20:11:51",
            "diff": "darktable-org_darktable/issue_3501/commit_bfecbb5ca10079d454b35f868bac99257ff2944f.diff",
            "diff_additions": 2,
            "diff_deletions": 2,
            "diff_file_size": 84881,
            "diff_url": "https://github.com/darktable-org/darktable/commit/bfecbb5ca10079d454b35f868bac99257ff2944f.diff",
            "exists": true,
            "files": [
                {
                    "file_additions": 2,
                    "file_deletions": 2,
                    "file_exists": true,
                    "file_name": "src/common/colorspaces.c",
                    "file_size": 84881
                }
            ],
            "interesting": {
                "reopen": true,
                "status": false
            },
            "is_parent": false,
            "sha": "bfecbb5ca10079d454b35f868bac99257ff2944f"
        },
        {
            "associated_pull_request": [],
            "date": "2019-11-23 10:46:34",
            "diff": "darktable-org_darktable/issue_3501/commit_0ecd0312f555ca526791f4f9558fd00194415a34.diff",
            "diff_additions": 63,
            "diff_deletions": 100,
            "diff_file_size": 84881,
            "diff_url": "https://github.com/darktable-org/darktable/commit/0ecd0312f555ca526791f4f9558fd00194415a34.diff",
            "exists": true,
            "files": [
                {
                    "file_additions": 63,
                    "file_deletions": 100,
                    "file_exists": true,
                    "file_name": "src/common/colorspaces.c",
                    "file_size": 84881
                }
            ],
            "interesting": {
                "reopen": false,
                "status": false
            },
            "is_parent": false,
            "sha": "0ecd0312f555ca526791f4f9558fd00194415a34"
        }
    ],
    "first_commit": "2019-11-21 20:07:21",
    "last_commit": "2019-11-23 10:49:41",
    "number": 3501,
    "pull_request": "None",
    "score": {
        "accidental_reopen_likely": false,
        "all_labels": [
            "bugfix"
        ],
        "contains_keywords": [
            "report",
            "chang",
            "reason",
            "confirm",
            "bug",
            "test",
            "fix",
            "remov",
            "issu",
            "work",
            "CI",
            "fault"
        ],
        "fix_size": 143,
        "has_labels": [],
        "intersecting": {
            "computed_score": 0.02097902097902098,
            "final_commit_size": 143,
            "intersection_size": 3,
            "previous_commits_size": 3
        },
        "is_makefile_based": true,
        "no_new_files": [],
        "no_other_files": true,
        "num_prohibited_files": 77952,
        "prohibited_files": [
            "hal/inc/pinmap_hal.h",
            "Debug/marvin.bin",
            "Debug/marvin.elf",
            "Debug/marvin.hex",
            "Debug/marvin.bin",
            "Debug/marvin.elf",
            "Debug/marvin.hex",
            "inc/spark_utilities.h",
            "Debug/marvin.bin",
            "Debug/marvin.elf"
        ],
        "reopen": true,
        "reopen_events": [
            [
                "2019-11-21 20:14:28",
                "closed"
            ],
            [
                "2019-11-21 20:14:28",
                "commit"
            ],
            [
                "2019-11-22 08:00:32",
                "reopened"
            ],
            [
                "2019-11-23 10:54:07",
                "commit"
            ],
            [
                "2019-11-27 09:31:39",
                "closed"
            ]
        ],
        "status": false,
        "strategy": true,
        "total_changes": 172
    }
}