{
    "all_issues": 2037,
    "interesting_issues": 1,
    "last_update": "2023-11-05 11:24:41.862318",
    "license": {
        "download": "undefined",
        "name": "unknown"
    },
    "ratio": 0.0004909180166912126,
    "size": 44741,
    "stars": 894,
    "url": "https://github.com/alliedmodders/sourcemod"
}