{
    "category": [
        "build/refactor/preprocessing",
        "feature request"
    ],
    "commits": [
        {
            "associated_pull_request": [],
            "date": "2019-10-17 22:41:10",
            "diff": "",
            "diff_additions": 0,
            "diff_deletions": 0,
            "diff_file_size": 0,
            "diff_url": "https://github.com/OpenSC/OpenSC/commit/01678e871e4bb30dd4bde7bf8b2a63c5cddb6a11.diff",
            "exists": true,
            "files": [],
            "interesting": {
                "reopen": false,
                "status": false
            },
            "is_parent": true,
            "sha": "01678e871e4bb30dd4bde7bf8b2a63c5cddb6a11"
        },
        {
            "associated_pull_request": [
                "https://github.com/OpenSC/OpenSC/pull/1832"
            ],
            "date": "2019-10-21 10:13:10",
            "diff": "opensc_opensc/issue_1219/commit_f09bb2a3037d904f7441c66588b97ab647b0b39f.diff",
            "diff_additions": 1,
            "diff_deletions": 1,
            "diff_file_size": 82047,
            "diff_url": "https://github.com/OpenSC/OpenSC/commit/f09bb2a3037d904f7441c66588b97ab647b0b39f.diff",
            "exists": true,
            "files": [
                {
                    "file_additions": 1,
                    "file_deletions": 1,
                    "file_exists": true,
                    "file_name": "src/tools/pkcs15-init.c",
                    "file_size": 82047
                }
            ],
            "interesting": {
                "reopen": false,
                "status": true
            },
            "is_parent": false,
            "sha": "f09bb2a3037d904f7441c66588b97ab647b0b39f"
        },
        {
            "associated_pull_request": [
                "https://github.com/OpenSC/OpenSC/pull/1832"
            ],
            "date": "2019-10-21 10:28:40",
            "diff": "opensc_opensc/issue_1219/commit_1a9720ee7af81461c4543feb475f5264245fa43a.diff",
            "diff_additions": 2,
            "diff_deletions": 2,
            "diff_file_size": 50511,
            "diff_url": "https://github.com/OpenSC/OpenSC/commit/1a9720ee7af81461c4543feb475f5264245fa43a.diff",
            "exists": true,
            "files": [
                {
                    "file_additions": 2,
                    "file_deletions": 2,
                    "file_exists": true,
                    "file_name": "src/libopensc/card-myeid.c",
                    "file_size": 50511
                }
            ],
            "interesting": {
                "reopen": false,
                "status": false
            },
            "is_parent": false,
            "sha": "1a9720ee7af81461c4543feb475f5264245fa43a"
        },
        {
            "associated_pull_request": [
                "https://github.com/OpenSC/OpenSC/pull/1832"
            ],
            "date": "2019-10-21 10:28:40",
            "diff": "opensc_opensc/issue_1219/commit_6d98f8c8d8d3c6b56e3a600d46a56bfcc938bc68.diff",
            "diff_additions": 2,
            "diff_deletions": 2,
            "diff_file_size": 50511,
            "diff_url": "https://github.com/OpenSC/OpenSC/commit/6d98f8c8d8d3c6b56e3a600d46a56bfcc938bc68.diff",
            "exists": true,
            "files": [
                {
                    "file_additions": 2,
                    "file_deletions": 2,
                    "file_exists": true,
                    "file_name": "src/libopensc/card-myeid.c",
                    "file_size": 50511
                }
            ],
            "interesting": {
                "reopen": false,
                "status": false
            },
            "is_parent": false,
            "sha": "6d98f8c8d8d3c6b56e3a600d46a56bfcc938bc68"
        }
    ],
    "first_commit": "2019-10-18 12:31:09",
    "last_commit": "2019-11-23 20:38:14",
    "number": 1219,
    "pull_request": "None",
    "score": {
        "accidental_reopen_likely": false,
        "all_labels": [
            "Support"
        ],
        "contains_keywords": [
            "work",
            "fix",
            "CI",
            "fault",
            "bug",
            "test",
            "remov",
            "issu",
            "error",
            "debug",
            "chang",
            "problem"
        ],
        "fix_size": 5,
        "has_labels": [],
        "intersecting": {
            "computed_score": 1.0,
            "final_commit_size": 3,
            "intersection_size": 3,
            "previous_commits_size": 5
        },
        "is_makefile_based": true,
        "no_new_files": [],
        "no_other_files": true,
        "num_prohibited_files": 38548,
        "prohibited_files": [
            "kill.h",
            "meminfo.h",
            "kill.h",
            "meminfo.h",
            "kill.h",
            "meminfo.h",
            "testsuite_cli_test.go",
            "testsuite_cli_test.go",
            "common.mk",
            "i3bar/include/draw_util.h"
        ],
        "reopen": false,
        "reopen_events": [
            [
                "2019-10-21 10:13:54",
                "commit"
            ],
            [
                "2019-10-21 10:31:05",
                "commit"
            ],
            [
                "2019-11-23 20:38:17",
                "commit"
            ],
            [
                "2019-11-23 20:38:17",
                "commit"
            ],
            [
                "2019-11-24 04:13:14",
                "closed"
            ]
        ],
        "status": true,
        "strategy": true,
        "total_changes": 10
    }
}