{
    "covered_issues": [
        300,
        298,
        291,
        288,
        284,
        280,
        276,
        271,
        269,
        267,
        263,
        262,
        261,
        255,
        250,
        246,
        242,
        226,
        224,
        223,
        215,
        210,
        209,
        204,
        202,
        196,
        191,
        185,
        184,
        179,
        174,
        173,
        169,
        167,
        160,
        159,
        144,
        142,
        141,
        138,
        137,
        132,
        131,
        130,
        129,
        128,
        127,
        126,
        125,
        124,
        123,
        122,
        118,
        114,
        113,
        111,
        106,
        98,
        96,
        94,
        93,
        92,
        91,
        90,
        89,
        88,
        87,
        86,
        83,
        82,
        81,
        75,
        73,
        70,
        69,
        67,
        66,
        63,
        52,
        47,
        44,
        38,
        37,
        32,
        31,
        12,
        8,
        7,
        4,
        3,
        2,
        1
    ],
    "finished": true
}