{
    "category": [
        "build/refactor/preprocessing",
        "control flow"
    ],
    "commits": [
        {
            "associated_pull_request": [
                "https://github.com/surge-synthesizer/surge/pull/2385"
            ],
            "date": "2020-07-29 17:30:20",
            "diff": "surge-synthesizer_surge/issue_2386/commit_c8271d11c25493c2addc82c963bd5e837d3b290c.diff",
            "diff_additions": 1,
            "diff_deletions": 1,
            "diff_file_size": 2861,
            "diff_url": "https://github.com/surge-synthesizer/surge/commit/c8271d11c25493c2addc82c963bd5e837d3b290c.diff",
            "exists": true,
            "files": [
                {
                    "file_additions": 1,
                    "file_deletions": 1,
                    "file_exists": true,
                    "file_name": "src/common/dsp/Oscillator.cpp",
                    "file_size": 2861
                }
            ],
            "interesting": {
                "reopen": false,
                "status": false
            },
            "is_parent": true,
            "sha": "c8271d11c25493c2addc82c963bd5e837d3b290c"
        },
        {
            "associated_pull_request": [],
            "date": "2020-07-29 19:36:15",
            "diff": "surge-synthesizer_surge/issue_2386/commit_eeb719496cace6e9fb524baa8a7ec6637a9458a7.diff",
            "diff_additions": 2,
            "diff_deletions": 1,
            "diff_file_size": 0,
            "diff_url": "https://github.com/surge-synthesizer/surge/commit/eeb719496cace6e9fb524baa8a7ec6637a9458a7.diff",
            "exists": true,
            "files": [
                {
                    "file_additions": 2,
                    "file_deletions": 1,
                    "file_exists": false,
                    "file_name": "src/lv2/SurgeLv2Export.cpp",
                    "file_size": 0
                }
            ],
            "interesting": {
                "reopen": false,
                "status": true
            },
            "is_parent": false,
            "sha": "eeb719496cace6e9fb524baa8a7ec6637a9458a7"
        },
        {
            "associated_pull_request": [
                "https://github.com/surge-synthesizer/surge/pull/2390"
            ],
            "date": "2020-07-29 20:55:37",
            "diff": "surge-synthesizer_surge/issue_2386/commit_bb1e7a82ac61aa1d4b2b1c515fced3163ca47937.diff",
            "diff_additions": 31,
            "diff_deletions": 31,
            "diff_file_size": 124989,
            "diff_url": "https://github.com/surge-synthesizer/surge/commit/bb1e7a82ac61aa1d4b2b1c515fced3163ca47937.diff",
            "exists": true,
            "files": [
                {
                    "file_additions": 6,
                    "file_deletions": 6,
                    "file_exists": false,
                    "file_name": "src/common/dsp/DspUtilities.cpp",
                    "file_size": 0
                },
                {
                    "file_additions": 2,
                    "file_deletions": 2,
                    "file_exists": false,
                    "file_name": "src/common/dsp/LfoModulationSource.cpp",
                    "file_size": 0
                },
                {
                    "file_additions": 1,
                    "file_deletions": 1,
                    "file_exists": false,
                    "file_name": "src/common/dsp/SampleAndHoldOscillator.cpp",
                    "file_size": 0
                },
                {
                    "file_additions": 1,
                    "file_deletions": 1,
                    "file_exists": false,
                    "file_name": "src/common/dsp/WavetableOscillator.cpp",
                    "file_size": 0
                },
                {
                    "file_additions": 1,
                    "file_deletions": 1,
                    "file_exists": false,
                    "file_name": "src/common/dsp/effect/FlangerEffect.cpp",
                    "file_size": 0
                },
                {
                    "file_additions": 1,
                    "file_deletions": 1,
                    "file_exists": true,
                    "file_name": "src/headless/UnitTestsDSP.cpp",
                    "file_size": 33655
                },
                {
                    "file_additions": 16,
                    "file_deletions": 16,
                    "file_exists": true,
                    "file_name": "src/headless/UnitTestsMOD.cpp",
                    "file_size": 47521
                },
                {
                    "file_additions": 3,
                    "file_deletions": 3,
                    "file_exists": true,
                    "file_name": "src/headless/UnitTestsTUN.cpp",
                    "file_size": 43813
                }
            ],
            "interesting": {
                "reopen": false,
                "status": false
            },
            "is_parent": false,
            "sha": "bb1e7a82ac61aa1d4b2b1c515fced3163ca47937"
        },
        {
            "associated_pull_request": [
                "https://github.com/surge-synthesizer/surge/pull/2390"
            ],
            "date": "2020-07-29 21:10:42",
            "diff": "surge-synthesizer_surge/issue_2386/commit_b9525a7c62a57686ea592fa5f8038d460edb255e.diff",
            "diff_additions": 31,
            "diff_deletions": 31,
            "diff_file_size": 124989,
            "diff_url": "https://github.com/surge-synthesizer/surge/commit/b9525a7c62a57686ea592fa5f8038d460edb255e.diff",
            "exists": true,
            "files": [
                {
                    "file_additions": 6,
                    "file_deletions": 6,
                    "file_exists": false,
                    "file_name": "src/common/dsp/DspUtilities.cpp",
                    "file_size": 0
                },
                {
                    "file_additions": 2,
                    "file_deletions": 2,
                    "file_exists": false,
                    "file_name": "src/common/dsp/LfoModulationSource.cpp",
                    "file_size": 0
                },
                {
                    "file_additions": 1,
                    "file_deletions": 1,
                    "file_exists": false,
                    "file_name": "src/common/dsp/SampleAndHoldOscillator.cpp",
                    "file_size": 0
                },
                {
                    "file_additions": 1,
                    "file_deletions": 1,
                    "file_exists": false,
                    "file_name": "src/common/dsp/WavetableOscillator.cpp",
                    "file_size": 0
                },
                {
                    "file_additions": 1,
                    "file_deletions": 1,
                    "file_exists": false,
                    "file_name": "src/common/dsp/effect/FlangerEffect.cpp",
                    "file_size": 0
                },
                {
                    "file_additions": 1,
                    "file_deletions": 1,
                    "file_exists": true,
                    "file_name": "src/headless/UnitTestsDSP.cpp",
                    "file_size": 33655
                },
                {
                    "file_additions": 16,
                    "file_deletions": 16,
                    "file_exists": true,
                    "file_name": "src/headless/UnitTestsMOD.cpp",
                    "file_size": 47521
                },
                {
                    "file_additions": 3,
                    "file_deletions": 3,
                    "file_exists": true,
                    "file_name": "src/headless/UnitTestsTUN.cpp",
                    "file_size": 43813
                }
            ],
            "interesting": {
                "reopen": false,
                "status": false
            },
            "is_parent": false,
            "sha": "b9525a7c62a57686ea592fa5f8038d460edb255e"
        }
    ],
    "first_commit": "2020-07-29 17:30:20",
    "last_commit": "2020-07-30 22:00:53",
    "number": 2386,
    "pull_request": "None",
    "score": {
        "accidental_reopen_likely": false,
        "all_labels": [
            "Bug Report"
        ],
        "contains_keywords": [
            "remov",
            "issu",
            "warn",
            "problem",
            "chang",
            "work",
            "debug",
            "error",
            "fix",
            "reason",
            "report",
            "test",
            "bug",
            "fail"
        ],
        "fix_size": 42,
        "has_labels": [],
        "intersecting": {
            "computed_score": 1.0,
            "final_commit_size": 39,
            "intersection_size": 39,
            "previous_commits_size": 42
        },
        "is_makefile_based": true,
        "no_new_files": [],
        "no_other_files": false,
        "num_prohibited_files": 55563,
        "prohibited_files": [
            "tools/building.py",
            "tools/building.py",
            "tools/building.py",
            "emcc.py",
            "src/library_emmalloc.js",
            "src/shell.js",
            "tests/test_core.py",
            "src/shell.js",
            "tests/test_core.py",
            "src/library.js"
        ],
        "reopen": true,
        "reopen_events": [
            [
                "2020-07-29 19:54:14",
                "commit"
            ],
            [
                "2020-07-29 20:04:14",
                "commit"
            ],
            [
                "2020-07-29 20:17:25",
                "closed"
            ],
            [
                "2020-07-29 20:17:25",
                "commit"
            ],
            [
                "2020-07-29 20:30:41",
                "reopened"
            ],
            [
                "2020-07-29 20:56:32",
                "commit"
            ],
            [
                "2020-07-29 21:10:44",
                "commit"
            ],
            [
                "2020-07-30 21:44:36",
                "commit"
            ],
            [
                "2020-07-30 22:00:55",
                "commit"
            ],
            [
                "2020-07-30 23:39:45",
                "closed"
            ]
        ],
        "status": true,
        "strategy": true,
        "total_changes": 129
    }
}