{
    "commits": [
        {
            "associated_pull_request": [],
            "date": "2019-01-23 12:46:06+00:00",
            "diff": "cyring_corefreq/issue_93/commit_26ec385e16043bf2cd370e806131a254ceccb72a.diff",
            "diff_additions": 10,
            "diff_deletions": 11,
            "diff_file_size": 610063,
            "diff_url": "https://github.com/cyring/CoreFreq/commit/26ec385e16043bf2cd370e806131a254ceccb72a.diff",
            "exists": true,
            "files": [
                {
                    "file_additions": 10,
                    "file_deletions": 11,
                    "file_exists": true,
                    "file_name": "corefreq-cli.c",
                    "file_size": 610063
                }
            ],
            "interesting": {
                "reopen": false,
                "status": false
            },
            "is_parent": true,
            "sha": "26ec385e16043bf2cd370e806131a254ceccb72a"
        },
        {
            "associated_pull_request": [],
            "date": "2019-01-24 07:32:30+00:00",
            "diff": "cyring_corefreq/issue_93/commit_18b39f50c31958a8e47795c87a039f9dc9170d89.diff",
            "diff_additions": 16,
            "diff_deletions": 3,
            "diff_file_size": 894431,
            "diff_url": "https://github.com/cyring/CoreFreq/commit/18b39f50c31958a8e47795c87a039f9dc9170d89.diff",
            "exists": true,
            "files": [
                {
                    "file_additions": 14,
                    "file_deletions": 1,
                    "file_exists": true,
                    "file_name": "corefreqd.c",
                    "file_size": 260379
                },
                {
                    "file_additions": 2,
                    "file_deletions": 2,
                    "file_exists": true,
                    "file_name": "corefreqk.c",
                    "file_size": 634052
                }
            ],
            "interesting": {
                "reopen": false,
                "status": false
            },
            "is_parent": false,
            "sha": "18b39f50c31958a8e47795c87a039f9dc9170d89"
        },
        {
            "associated_pull_request": [],
            "date": "2019-01-27 10:35:24+00:00",
            "diff": "cyring_corefreq/issue_93/commit_8403a3ffba49aa9874a14217a51b95de9705d06c.diff",
            "diff_additions": 20,
            "diff_deletions": 13,
            "diff_file_size": 894431,
            "diff_url": "https://github.com/cyring/CoreFreq/commit/8403a3ffba49aa9874a14217a51b95de9705d06c.diff",
            "exists": true,
            "files": [
                {
                    "file_additions": 4,
                    "file_deletions": 5,
                    "file_exists": true,
                    "file_name": "corefreqd.c",
                    "file_size": 260379
                },
                {
                    "file_additions": 16,
                    "file_deletions": 8,
                    "file_exists": true,
                    "file_name": "corefreqk.c",
                    "file_size": 634052
                }
            ],
            "interesting": {
                "reopen": true,
                "status": false
            },
            "is_parent": false,
            "sha": "8403a3ffba49aa9874a14217a51b95de9705d06c"
        },
        {
            "associated_pull_request": [],
            "date": "2019-01-30 19:00:43+00:00",
            "diff": "cyring_corefreq/issue_93/commit_5dff23923c9b55ab6e6201005ab5889c723a4060.diff",
            "diff_additions": 3,
            "diff_deletions": 3,
            "diff_file_size": 894431,
            "diff_url": "https://github.com/cyring/CoreFreq/commit/5dff23923c9b55ab6e6201005ab5889c723a4060.diff",
            "exists": true,
            "files": [
                {
                    "file_additions": 1,
                    "file_deletions": 1,
                    "file_exists": true,
                    "file_name": "corefreqd.c",
                    "file_size": 260379
                },
                {
                    "file_additions": 2,
                    "file_deletions": 2,
                    "file_exists": true,
                    "file_name": "corefreqk.c",
                    "file_size": 634052
                }
            ],
            "interesting": {
                "reopen": false,
                "status": false
            },
            "is_parent": false,
            "sha": "5dff23923c9b55ab6e6201005ab5889c723a4060"
        },
        {
            "associated_pull_request": [],
            "date": "2019-06-09 12:46:08+00:00",
            "diff": "cyring_corefreq/issue_93/commit_1ff2c449c0042ee29563de27ddc70af7d7baec4f.diff",
            "diff_additions": 5,
            "diff_deletions": 39,
            "diff_file_size": 894431,
            "diff_url": "https://github.com/cyring/CoreFreq/commit/1ff2c449c0042ee29563de27ddc70af7d7baec4f.diff",
            "exists": true,
            "files": [
                {
                    "file_additions": 2,
                    "file_deletions": 24,
                    "file_exists": true,
                    "file_name": "corefreqd.c",
                    "file_size": 260379
                },
                {
                    "file_additions": 3,
                    "file_deletions": 15,
                    "file_exists": true,
                    "file_name": "corefreqk.c",
                    "file_size": 634052
                }
            ],
            "interesting": {
                "reopen": false,
                "status": false
            },
            "is_parent": false,
            "sha": "1ff2c449c0042ee29563de27ddc70af7d7baec4f"
        }
    ],
    "first_commit": "2019-01-23 12:46:06+00:00",
    "last_commit": "2019-06-09 12:46:08+00:00",
    "number": 93,
    "pull_request": "None",
    "score": {
        "accidental_reopen_likely": false,
        "all_labels": [
            "enhancement",
            "bugfix"
        ],
        "contains_keywords": [
            "fix",
            "issu",
            "test",
            "fault",
            "warn"
        ],
        "fix_size": 84,
        "has_labels": [],
        "intersecting": {
            "computed_score": 0.047619047619047616,
            "final_commit_size": 42,
            "intersection_size": 2,
            "previous_commits_size": 44
        },
        "is_makefile_based": true,
        "no_new_files": [],
        "no_other_files": false,
        "num_prohibited_files": 235212,
        "prohibited_files": [
            "server/src/main/java/com/genymobile/scrcpy/Device.java",
            "server/src/main/java/com/genymobile/scrcpy/wrappers/SurfaceControl.java",
            "server/src/main/java/com/genymobile/scrcpy/Device.java",
            "server/src/main/java/com/genymobile/scrcpy/wrappers/SurfaceControl.java",
            "app/meson.build",
            "app/scrcpy.1",
            "app/src/common.h",
            "app/src/scrcpy.h",
            "app/src/server.h",
            "server/src/main/java/com/genymobile/scrcpy/Workarounds.java"
        ],
        "reopen": true,
        "reopen_events": [
            [
                "2019-01-24 07:34:02+00:00",
                "commit"
            ],
            [
                "2019-01-26 08:02:57+00:00",
                "closed"
            ],
            [
                "2019-01-27 10:42:59+00:00",
                "commit"
            ],
            [
                "2019-01-27 11:01:42+00:00",
                "reopened"
            ],
            [
                "2019-01-30 19:01:49+00:00",
                "commit"
            ],
            [
                "2019-01-31 10:12:56+00:00",
                "closed"
            ],
            [
                "2019-06-09 15:16:45+00:00",
                "commit"
            ]
        ],
        "status": false,
        "strategy": true,
        "total_changes": 123
    }
}