{
    "category": [
        "build/refactor/preprocessing",
        "feature request"
    ],
    "commits": [
        {
            "associated_pull_request": [],
            "date": "2020-12-24 11:59:07",
            "diff": "openssl_openssl/issue_13708/commit_d07f53a3e0e660865a9f307a6d97c5e6a3992cb6.diff",
            "diff_additions": 4,
            "diff_deletions": 4,
            "diff_file_size": 93350,
            "diff_url": "https://github.com/openssl/openssl/commit/d07f53a3e0e660865a9f307a6d97c5e6a3992cb6.diff",
            "exists": true,
            "files": [
                {
                    "file_additions": 1,
                    "file_deletions": 1,
                    "file_exists": true,
                    "file_name": "apps/lib/apps.c",
                    "file_size": 93350
                },
                {
                    "file_additions": 2,
                    "file_deletions": 2,
                    "file_exists": false,
                    "file_name": "crypto/x509/v3_akey.c",
                    "file_size": 0
                },
                {
                    "file_additions": 1,
                    "file_deletions": 1,
                    "file_exists": false,
                    "file_name": "crypto/x509/v3_skey.c",
                    "file_size": 0
                }
            ],
            "interesting": {
                "reopen": false,
                "status": false
            },
            "is_parent": true,
            "sha": "d07f53a3e0e660865a9f307a6d97c5e6a3992cb6"
        },
        {
            "associated_pull_request": [],
            "date": "2020-12-24 11:43:39",
            "diff": "openssl_openssl/issue_13708/commit_7bd538c7cb9850e9c29d0b4043b5211e015839d4.diff",
            "diff_additions": 24,
            "diff_deletions": 3,
            "diff_file_size": 53892,
            "diff_url": "https://github.com/openssl/openssl/commit/7bd538c7cb9850e9c29d0b4043b5211e015839d4.diff",
            "exists": true,
            "files": [
                {
                    "file_additions": 24,
                    "file_deletions": 3,
                    "file_exists": true,
                    "file_name": "apps/req.c",
                    "file_size": 53892
                }
            ],
            "interesting": {
                "reopen": false,
                "status": false
            },
            "is_parent": false,
            "sha": "7bd538c7cb9850e9c29d0b4043b5211e015839d4"
        },
        {
            "associated_pull_request": [],
            "date": "2021-01-06 13:44:03",
            "diff": "openssl_openssl/issue_13708/commit_885ed8fc0e253bb2b65d240d20663d67724754f6.diff",
            "diff_additions": 52,
            "diff_deletions": 10,
            "diff_file_size": 42222,
            "diff_url": "https://github.com/openssl/openssl/commit/885ed8fc0e253bb2b65d240d20663d67724754f6.diff",
            "exists": true,
            "files": [
                {
                    "file_additions": 52,
                    "file_deletions": 10,
                    "file_exists": true,
                    "file_name": "apps/x509.c",
                    "file_size": 42222
                }
            ],
            "interesting": {
                "reopen": false,
                "status": false
            },
            "is_parent": false,
            "sha": "885ed8fc0e253bb2b65d240d20663d67724754f6"
        },
        {
            "associated_pull_request": [],
            "date": "2021-01-06 13:44:03",
            "diff": "openssl_openssl/issue_13708/commit_df0e26cfcc21758227004426ecdf3b2d2139098a.diff",
            "diff_additions": 52,
            "diff_deletions": 10,
            "diff_file_size": 42222,
            "diff_url": "https://github.com/openssl/openssl/commit/df0e26cfcc21758227004426ecdf3b2d2139098a.diff",
            "exists": true,
            "files": [
                {
                    "file_additions": 52,
                    "file_deletions": 10,
                    "file_exists": true,
                    "file_name": "apps/x509.c",
                    "file_size": 42222
                }
            ],
            "interesting": {
                "reopen": false,
                "status": false
            },
            "is_parent": false,
            "sha": "df0e26cfcc21758227004426ecdf3b2d2139098a"
        },
        {
            "associated_pull_request": [],
            "date": "2021-01-06 13:44:03",
            "diff": "openssl_openssl/issue_13708/commit_423f290b2c9d488e15798d862cd4b0156f3edc0f.diff",
            "diff_additions": 52,
            "diff_deletions": 10,
            "diff_file_size": 42222,
            "diff_url": "https://github.com/openssl/openssl/commit/423f290b2c9d488e15798d862cd4b0156f3edc0f.diff",
            "exists": true,
            "files": [
                {
                    "file_additions": 52,
                    "file_deletions": 10,
                    "file_exists": true,
                    "file_name": "apps/x509.c",
                    "file_size": 42222
                }
            ],
            "interesting": {
                "reopen": false,
                "status": false
            },
            "is_parent": false,
            "sha": "423f290b2c9d488e15798d862cd4b0156f3edc0f"
        },
        {
            "associated_pull_request": [],
            "date": "2021-01-06 13:44:03",
            "diff": "openssl_openssl/issue_13708/commit_01a21a4cb1d1c7274541b686d1725006828280de.diff",
            "diff_additions": 52,
            "diff_deletions": 10,
            "diff_file_size": 42222,
            "diff_url": "https://github.com/openssl/openssl/commit/01a21a4cb1d1c7274541b686d1725006828280de.diff",
            "exists": true,
            "files": [
                {
                    "file_additions": 52,
                    "file_deletions": 10,
                    "file_exists": true,
                    "file_name": "apps/x509.c",
                    "file_size": 42222
                }
            ],
            "interesting": {
                "reopen": false,
                "status": false
            },
            "is_parent": false,
            "sha": "01a21a4cb1d1c7274541b686d1725006828280de"
        },
        {
            "associated_pull_request": [],
            "date": "2021-01-06 13:44:03",
            "diff": "openssl_openssl/issue_13708/commit_714aed7cdab7c2c1ce6cf047ab8ba5775bc7b593.diff",
            "diff_additions": 52,
            "diff_deletions": 10,
            "diff_file_size": 42222,
            "diff_url": "https://github.com/openssl/openssl/commit/714aed7cdab7c2c1ce6cf047ab8ba5775bc7b593.diff",
            "exists": true,
            "files": [
                {
                    "file_additions": 52,
                    "file_deletions": 10,
                    "file_exists": true,
                    "file_name": "apps/x509.c",
                    "file_size": 42222
                }
            ],
            "interesting": {
                "reopen": false,
                "status": false
            },
            "is_parent": false,
            "sha": "714aed7cdab7c2c1ce6cf047ab8ba5775bc7b593"
        },
        {
            "associated_pull_request": [],
            "date": "2021-01-06 13:44:03",
            "diff": "openssl_openssl/issue_13708/commit_6fee767c274729e237dd86464d07b6f6d4906c23.diff",
            "diff_additions": 52,
            "diff_deletions": 10,
            "diff_file_size": 42222,
            "diff_url": "https://github.com/openssl/openssl/commit/6fee767c274729e237dd86464d07b6f6d4906c23.diff",
            "exists": true,
            "files": [
                {
                    "file_additions": 52,
                    "file_deletions": 10,
                    "file_exists": true,
                    "file_name": "apps/x509.c",
                    "file_size": 42222
                }
            ],
            "interesting": {
                "reopen": false,
                "status": false
            },
            "is_parent": false,
            "sha": "6fee767c274729e237dd86464d07b6f6d4906c23"
        },
        {
            "associated_pull_request": [],
            "date": "2021-01-06 13:44:03",
            "diff": "openssl_openssl/issue_13708/commit_b9fbacaa7bdce2083186211b3cdf8511ad4cb91d.diff",
            "diff_additions": 52,
            "diff_deletions": 10,
            "diff_file_size": 42222,
            "diff_url": "https://github.com/openssl/openssl/commit/b9fbacaa7bdce2083186211b3cdf8511ad4cb91d.diff",
            "exists": true,
            "files": [
                {
                    "file_additions": 52,
                    "file_deletions": 10,
                    "file_exists": true,
                    "file_name": "apps/x509.c",
                    "file_size": 42222
                }
            ],
            "interesting": {
                "reopen": false,
                "status": false
            },
            "is_parent": false,
            "sha": "b9fbacaa7bdce2083186211b3cdf8511ad4cb91d"
        },
        {
            "associated_pull_request": [],
            "date": "2021-01-22 07:20:16",
            "diff": "openssl_openssl/issue_13708/commit_5c585867ff9e59bd97e10de04600d7a0ca672773.diff",
            "diff_additions": 2356,
            "diff_deletions": 1107,
            "diff_file_size": 3921401,
            "diff_url": "https://github.com/openssl/openssl/commit/5c585867ff9e59bd97e10de04600d7a0ca672773.diff",
            "exists": true,
            "files": [
                {
                    "file_additions": 3,
                    "file_deletions": 6,
                    "file_exists": true,
                    "file_name": "apps/ca.c",
                    "file_size": 88253
                },
                {
                    "file_additions": 2,
                    "file_deletions": 4,
                    "file_exists": true,
                    "file_name": "apps/cmp.c",
                    "file_size": 102767
                },
                {
                    "file_additions": 14,
                    "file_deletions": 3,
                    "file_exists": true,
                    "file_name": "apps/crl.c",
                    "file_size": 12538
                },
                {
                    "file_additions": 1,
                    "file_deletions": 2,
                    "file_exists": true,
                    "file_name": "apps/dgst.c",
                    "file_size": 20015
                },
                {
                    "file_additions": 8,
                    "file_deletions": 8,
                    "file_exists": true,
                    "file_name": "apps/enc.c",
                    "file_size": 22147
                },
                {
                    "file_additions": 67,
                    "file_deletions": 26,
                    "file_exists": true,
                    "file_name": "apps/lib/apps.c",
                    "file_size": 93350
                },
                {
                    "file_additions": 13,
                    "file_deletions": 3,
                    "file_exists": true,
                    "file_name": "apps/lib/opt.c",
                    "file_size": 29157
                },
                {
                    "file_additions": 4,
                    "file_deletions": 19,
                    "file_exists": true,
                    "file_name": "apps/lib/s_cb.c",
                    "file_size": 48502
                },
                {
                    "file_additions": 18,
                    "file_deletions": 19,
                    "file_exists": true,
                    "file_name": "apps/openssl.c",
                    "file_size": 13121
                },
                {
                    "file_additions": 6,
                    "file_deletions": 6,
                    "file_exists": true,
                    "file_name": "apps/passwd.c",
                    "file_size": 26924
                },
                {
                    "file_additions": 62,
                    "file_deletions": 37,
                    "file_exists": true,
                    "file_name": "apps/pkey.c",
                    "file_size": 10263
                },
                {
                    "file_additions": 16,
                    "file_deletions": 3,
                    "file_exists": true,
                    "file_name": "apps/rehash.c",
                    "file_size": 16366
                },
                {
                    "file_additions": 259,
                    "file_deletions": 214,
                    "file_exists": true,
                    "file_name": "apps/req.c",
                    "file_size": 53892
                },
                {
                    "file_additions": 1,
                    "file_deletions": 2,
                    "file_exists": true,
                    "file_name": "apps/s_client.c",
                    "file_size": 115656
                },
                {
                    "file_additions": 1,
                    "file_deletions": 4,
                    "file_exists": true,
                    "file_name": "apps/srp.c",
                    "file_size": 21023
                },
                {
                    "file_additions": 11,
                    "file_deletions": 5,
                    "file_exists": true,
                    "file_name": "apps/x509.c",
                    "file_size": 42222
                },
                {
                    "file_additions": 17,
                    "file_deletions": 0,
                    "file_exists": true,
                    "file_name": "crypto/armcap.c",
                    "file_size": 6931
                },
                {
                    "file_additions": 5,
                    "file_deletions": 1,
                    "file_exists": true,
                    "file_name": "crypto/async/arch/async_win.c",
                    "file_size": 1384
                },
                {
                    "file_additions": 0,
                    "file_deletions": 1,
                    "file_exists": true,
                    "file_name": "crypto/bio/bio_err.c",
                    "file_size": 4022
                },
                {
                    "file_additions": 56,
                    "file_deletions": 51,
                    "file_exists": true,
                    "file_name": "crypto/bio/bio_lib.c",
                    "file_size": 22200
                },
                {
                    "file_additions": 2,
                    "file_deletions": 2,
                    "file_exists": true,
                    "file_name": "crypto/bio/bss_mem.c",
                    "file_size": 9344
                },
                {
                    "file_additions": 4,
                    "file_deletions": 2,
                    "file_exists": true,
                    "file_name": "crypto/bn/bn_prime.c",
                    "file_size": 17703
                },
                {
                    "file_additions": 4,
                    "file_deletions": 1,
                    "file_exists": true,
                    "file_name": "crypto/bn/bn_sqrt.c",
                    "file_size": 9563
                },
                {
                    "file_additions": 1,
                    "file_deletions": 1,
                    "file_exists": true,
                    "file_name": "crypto/bn/bn_x931p.c",
                    "file_size": 5938
                },
                {
                    "file_additions": 4,
                    "file_deletions": 3,
                    "file_exists": true,
                    "file_name": "crypto/cms/cms_enc.c",
                    "file_size": 7776
                },
                {
                    "file_additions": 13,
                    "file_deletions": 7,
                    "file_exists": true,
                    "file_name": "crypto/cms/cms_env.c",
                    "file_size": 36704
                },
                {
                    "file_additions": 3,
                    "file_deletions": 2,
                    "file_exists": true,
                    "file_name": "crypto/cms/cms_ess.c",
                    "file_size": 11700
                },
                {
                    "file_additions": 2,
                    "file_deletions": 2,
                    "file_exists": true,
                    "file_name": "crypto/cms/cms_io.c",
                    "file_size": 3396
                },
                {
                    "file_additions": 12,
                    "file_deletions": 7,
                    "file_exists": true,
                    "file_name": "crypto/cms/cms_kari.c",
                    "file_size": 16411
                },
                {
                    "file_additions": 9,
                    "file_deletions": 10,
                    "file_exists": true,
                    "file_name": "crypto/cms/cms_lib.c",
                    "file_size": 19993
                },
                {
                    "file_additions": 4,
                    "file_deletions": 3,
                    "file_exists": true,
                    "file_name": "crypto/cms/cms_pwri.c",
                    "file_size": 11879
                },
                {
                    "file_additions": 17,
                    "file_deletions": 11,
                    "file_exists": true,
                    "file_name": "crypto/cms/cms_sd.c",
                    "file_size": 32361
                },
                {
                    "file_additions": 4,
                    "file_deletions": 2,
                    "file_exists": true,
                    "file_name": "crypto/cms/cms_smime.c",
                    "file_size": 27447
                },
                {
                    "file_additions": 3,
                    "file_deletions": 1,
                    "file_exists": true,
                    "file_name": "crypto/conf/conf_api.c",
                    "file_size": 5373
                },
                {
                    "file_additions": 17,
                    "file_deletions": 2,
                    "file_exists": true,
                    "file_name": "crypto/conf/conf_def.c",
                    "file_size": 28298
                },
                {
                    "file_additions": 5,
                    "file_deletions": 6,
                    "file_exists": true,
                    "file_name": "crypto/conf/conf_mod.c",
                    "file_size": 15558
                },
                {
                    "file_additions": 19,
                    "file_deletions": 2,
                    "file_exists": true,
                    "file_name": "crypto/context.c",
                    "file_size": 13120
                },
                {
                    "file_additions": 10,
                    "file_deletions": 0,
                    "file_exists": true,
                    "file_name": "crypto/core_fetch.c",
                    "file_size": 4911
                },
                {
                    "file_additions": 2,
                    "file_deletions": 2,
                    "file_exists": true,
                    "file_name": "crypto/des/fcrypt.c",
                    "file_size": 4207
                },
                {
                    "file_additions": 0,
                    "file_deletions": 9,
                    "file_exists": true,
                    "file_name": "crypto/dh/dh_backend.c",
                    "file_size": 6196
                },
                {
                    "file_additions": 31,
                    "file_deletions": 3,
                    "file_exists": true,
                    "file_name": "crypto/dh/dh_key.c",
                    "file_size": 12325
                },
                {
                    "file_additions": 0,
                    "file_deletions": 7,
                    "file_exists": true,
                    "file_name": "crypto/dsa/dsa_backend.c",
                    "file_size": 5022
                },
                {
                    "file_additions": 0,
                    "file_deletions": 7,
                    "file_exists": true,
                    "file_name": "crypto/dsa/dsa_lib.c",
                    "file_size": 7729
                },
                {
                    "file_additions": 0,
                    "file_deletions": 4,
                    "file_exists": true,
                    "file_name": "crypto/ec/ec_backend.c",
                    "file_size": 24222
                },
                {
                    "file_additions": 4,
                    "file_deletions": 1,
                    "file_exists": true,
                    "file_name": "crypto/ec/ec_mult.c",
                    "file_size": 31575
                },
                {
                    "file_additions": 45,
                    "file_deletions": 3,
                    "file_exists": true,
                    "file_name": "crypto/encode_decode/decoder_meth.c",
                    "file_size": 18505
                },
                {
                    "file_additions": 45,
                    "file_deletions": 3,
                    "file_exists": true,
                    "file_name": "crypto/encode_decode/encoder_meth.c",
                    "file_size": 18804
                },
                {
                    "file_additions": 9,
                    "file_deletions": 0,
                    "file_exists": true,
                    "file_name": "crypto/err/err.c",
                    "file_size": 25394
                },
                {
                    "file_additions": 1,
                    "file_deletions": 2,
                    "file_exists": true,
                    "file_name": "crypto/evp/evp_err.c",
                    "file_size": 10288
                },
                {
                    "file_additions": 6,
                    "file_deletions": 20,
                    "file_exists": true,
                    "file_name": "crypto/evp/evp_fetch.c",
                    "file_size": 18554
                },
                {
                    "file_additions": 7,
                    "file_deletions": 7,
                    "file_exists": true,
                    "file_name": "crypto/evp/evp_lib.c",
                    "file_size": 31747
                },
                {
                    "file_additions": 0,
                    "file_deletions": 6,
                    "file_exists": true,
                    "file_name": "crypto/evp/evp_rand.c",
                    "file_size": 20253
                },
                {
                    "file_additions": 4,
                    "file_deletions": 2,
                    "file_exists": true,
                    "file_name": "crypto/initthread.c",
                    "file_size": 12624
                },
                {
                    "file_additions": 11,
                    "file_deletions": 10,
                    "file_exists": true,
                    "file_name": "crypto/ocsp/ocsp_http.c",
                    "file_size": 2217
                },
                {
                    "file_additions": 8,
                    "file_deletions": 8,
                    "file_exists": true,
                    "file_name": "crypto/ocsp/v3_ocsp.c",
                    "file_size": 7026
                },
                {
                    "file_additions": 8,
                    "file_deletions": 5,
                    "file_exists": true,
                    "file_name": "crypto/pem/pem_info.c",
                    "file_size": 10156
                },
                {
                    "file_additions": 1,
                    "file_deletions": 1,
                    "file_exists": true,
                    "file_name": "crypto/pkcs7/pk7_asn1.c",
                    "file_size": 8649
                },
                {
                    "file_additions": 29,
                    "file_deletions": 15,
                    "file_exists": true,
                    "file_name": "crypto/pkcs7/pk7_doit.c",
                    "file_size": 37065
                },
                {
                    "file_additions": 4,
                    "file_deletions": 2,
                    "file_exists": true,
                    "file_name": "crypto/pkcs7/pk7_lib.c",
                    "file_size": 20034
                },
                {
                    "file_additions": 1,
                    "file_deletions": 1,
                    "file_exists": true,
                    "file_name": "crypto/pkcs7/pk7_mime.c",
                    "file_size": 1949
                },
                {
                    "file_additions": 2,
                    "file_deletions": 1,
                    "file_exists": true,
                    "file_name": "crypto/pkcs7/pk7_smime.c",
                    "file_size": 16786
                },
                {
                    "file_additions": 18,
                    "file_deletions": 0,
                    "file_exists": true,
                    "file_name": "crypto/ppccap.c",
                    "file_size": 14323
                },
                {
                    "file_additions": 47,
                    "file_deletions": 26,
                    "file_exists": true,
                    "file_name": "crypto/provider_core.c",
                    "file_size": 53338
                },
                {
                    "file_additions": 11,
                    "file_deletions": 0,
                    "file_exists": true,
                    "file_name": "crypto/rand/rand_lib.c",
                    "file_size": 23119
                },
                {
                    "file_additions": 1,
                    "file_deletions": 1,
                    "file_exists": true,
                    "file_name": "crypto/rsa/rsa_oaep.c",
                    "file_size": 12778
                },
                {
                    "file_additions": 2,
                    "file_deletions": 0,
                    "file_exists": true,
                    "file_name": "crypto/sm2/sm2_err.c",
                    "file_size": 1836
                },
                {
                    "file_additions": 49,
                    "file_deletions": 0,
                    "file_exists": true,
                    "file_name": "crypto/sm2/sm2_key.c",
                    "file_size": 1484
                },
                {
                    "file_additions": 46,
                    "file_deletions": 3,
                    "file_exists": true,
                    "file_name": "crypto/store/store_meth.c",
                    "file_size": 15012
                },
                {
                    "file_additions": 3,
                    "file_deletions": 2,
                    "file_exists": true,
                    "file_name": "crypto/x509/by_dir.c",
                    "file_size": 12516
                },
                {
                    "file_additions": 36,
                    "file_deletions": 17,
                    "file_exists": true,
                    "file_name": "crypto/x509/v3_akid.c",
                    "file_size": 6356
                },
                {
                    "file_additions": 51,
                    "file_deletions": 21,
                    "file_exists": true,
                    "file_name": "crypto/x509/v3_conf.c",
                    "file_size": 16638
                },
                {
                    "file_additions": 8,
                    "file_deletions": 8,
                    "file_exists": true,
                    "file_name": "crypto/x509/v3_purp.c",
                    "file_size": 34497
                },
                {
                    "file_additions": 3,
                    "file_deletions": 3,
                    "file_exists": true,
                    "file_name": "crypto/x509/v3_san.c",
                    "file_size": 20598
                },
                {
                    "file_additions": 28,
                    "file_deletions": 34,
                    "file_exists": true,
                    "file_name": "crypto/x509/v3_skid.c",
                    "file_size": 3277
                },
                {
                    "file_additions": 0,
                    "file_deletions": 1,
                    "file_exists": true,
                    "file_name": "crypto/x509/v3_utf8.c",
                    "file_size": 2260
                },
                {
                    "file_additions": 32,
                    "file_deletions": 19,
                    "file_exists": true,
                    "file_name": "crypto/x509/x509_cmp.c",
                    "file_size": 16327
                },
                {
                    "file_additions": 1,
                    "file_deletions": 1,
                    "file_exists": true,
                    "file_name": "crypto/x509/x509_lu.c",
                    "file_size": 25592
                },
                {
                    "file_additions": 12,
                    "file_deletions": 11,
                    "file_exists": true,
                    "file_name": "crypto/x509/x509_vfy.c",
                    "file_size": 114858
                },
                {
                    "file_additions": 4,
                    "file_deletions": 4,
                    "file_exists": true,
                    "file_name": "crypto/x509/x_all.c",
                    "file_size": 18338
                },
                {
                    "file_additions": 2,
                    "file_deletions": 2,
                    "file_exists": true,
                    "file_name": "crypto/x509/x_crl.c",
                    "file_size": 16127
                },
                {
                    "file_additions": 7,
                    "file_deletions": 9,
                    "file_exists": true,
                    "file_name": "crypto/x509/x_pubkey.c",
                    "file_size": 26032
                },
                {
                    "file_additions": 5,
                    "file_deletions": 1,
                    "file_exists": true,
                    "file_name": "crypto/x509/x_x509.c",
                    "file_size": 9290
                },
                {
                    "file_additions": 76,
                    "file_deletions": 14,
                    "file_exists": true,
                    "file_name": "engines/e_devcrypto.c",
                    "file_size": 43718
                },
                {
                    "file_additions": 2,
                    "file_deletions": 1,
                    "file_exists": true,
                    "file_name": "engines/e_loader_attic.c",
                    "file_size": 56598
                },
                {
                    "file_additions": 4,
                    "file_deletions": 3,
                    "file_exists": true,
                    "file_name": "providers/implementations/ciphers/cipher_aes_cbc_hmac_sha.c",
                    "file_size": 17153
                },
                {
                    "file_additions": 2,
                    "file_deletions": 2,
                    "file_exists": true,
                    "file_name": "providers/implementations/ciphers/cipher_aes_ocb.c",
                    "file_size": 19963
                },
                {
                    "file_additions": 1,
                    "file_deletions": 0,
                    "file_exists": true,
                    "file_name": "providers/implementations/ciphers/cipher_chacha20_hw.c",
                    "file_size": 3428
                },
                {
                    "file_additions": 6,
                    "file_deletions": 0,
                    "file_exists": true,
                    "file_name": "providers/implementations/ciphers/cipher_chacha20_poly1305_hw.c",
                    "file_size": 14560
                },
                {
                    "file_additions": 8,
                    "file_deletions": 0,
                    "file_exists": true,
                    "file_name": "providers/implementations/ciphers/cipher_rc4_hmac_md5.c",
                    "file_size": 8820
                },
                {
                    "file_additions": 4,
                    "file_deletions": 4,
                    "file_exists": true,
                    "file_name": "providers/implementations/ciphers/ciphercommon.c",
                    "file_size": 21513
                },
                {
                    "file_additions": 1,
                    "file_deletions": 1,
                    "file_exists": true,
                    "file_name": "providers/implementations/ciphers/ciphercommon_ccm.c",
                    "file_size": 12992
                },
                {
                    "file_additions": 1,
                    "file_deletions": 1,
                    "file_exists": true,
                    "file_name": "providers/implementations/ciphers/ciphercommon_gcm.c",
                    "file_size": 17108
                },
                {
                    "file_additions": 59,
                    "file_deletions": 8,
                    "file_exists": true,
                    "file_name": "providers/implementations/keymgmt/ec_kmgmt.c",
                    "file_size": 48785
                },
                {
                    "file_additions": 21,
                    "file_deletions": 29,
                    "file_exists": false,
                    "file_name": "providers/implementations/keymgmt/oqs_kmgmt.c",
                    "file_size": 0
                },
                {
                    "file_additions": 1,
                    "file_deletions": 0,
                    "file_exists": false,
                    "file_name": "providers/implementations/signature/mac_legacy.c",
                    "file_size": 0
                },
                {
                    "file_additions": 6,
                    "file_deletions": 1,
                    "file_exists": true,
                    "file_name": "providers/implementations/storemgmt/file_store.c",
                    "file_size": 24036
                },
                {
                    "file_additions": 5,
                    "file_deletions": 4,
                    "file_exists": true,
                    "file_name": "ssl/d1_lib.c",
                    "file_size": 30058
                },
                {
                    "file_additions": 3,
                    "file_deletions": 3,
                    "file_exists": true,
                    "file_name": "ssl/ktls.c",
                    "file_size": 8358
                },
                {
                    "file_additions": 3,
                    "file_deletions": 0,
                    "file_exists": true,
                    "file_name": "ssl/record/rec_layer_d1.c",
                    "file_size": 34229
                },
                {
                    "file_additions": 2,
                    "file_deletions": 1,
                    "file_exists": true,
                    "file_name": "ssl/s3_enc.c",
                    "file_size": 18078
                },
                {
                    "file_additions": 18,
                    "file_deletions": 0,
                    "file_exists": true,
                    "file_name": "ssl/s3_lib.c",
                    "file_size": 130071
                },
                {
                    "file_additions": 2,
                    "file_deletions": 1,
                    "file_exists": true,
                    "file_name": "ssl/ssl_cert.c",
                    "file_size": 30333
                },
                {
                    "file_additions": 9,
                    "file_deletions": 9,
                    "file_exists": true,
                    "file_name": "ssl/ssl_ciph.c",
                    "file_size": 70852
                },
                {
                    "file_additions": 0,
                    "file_deletions": 4,
                    "file_exists": true,
                    "file_name": "ssl/ssl_err.c",
                    "file_size": 29974
                },
                {
                    "file_additions": 3,
                    "file_deletions": 3,
                    "file_exists": true,
                    "file_name": "ssl/ssl_lib.c",
                    "file_size": 168752
                },
                {
                    "file_additions": 2,
                    "file_deletions": 1,
                    "file_exists": true,
                    "file_name": "ssl/statem/extensions.c",
                    "file_size": 60444
                },
                {
                    "file_additions": 13,
                    "file_deletions": 8,
                    "file_exists": true,
                    "file_name": "ssl/statem/statem.c",
                    "file_size": 30609
                },
                {
                    "file_additions": 2,
                    "file_deletions": 1,
                    "file_exists": true,
                    "file_name": "ssl/statem/statem_clnt.c",
                    "file_size": 121677
                },
                {
                    "file_additions": 2,
                    "file_deletions": 1,
                    "file_exists": true,
                    "file_name": "ssl/statem/statem_srvr.c",
                    "file_size": 135153
                },
                {
                    "file_additions": 2,
                    "file_deletions": 1,
                    "file_exists": true,
                    "file_name": "ssl/t1_enc.c",
                    "file_size": 28832
                },
                {
                    "file_additions": 1,
                    "file_deletions": 1,
                    "file_exists": true,
                    "file_name": "ssl/t1_lib.c",
                    "file_size": 111294
                },
                {
                    "file_additions": 4,
                    "file_deletions": 3,
                    "file_exists": true,
                    "file_name": "ssl/tls13_enc.c",
                    "file_size": 36046
                },
                {
                    "file_additions": 1,
                    "file_deletions": 1,
                    "file_exists": true,
                    "file_name": "test/aesgcmtest.c",
                    "file_size": 5019
                },
                {
                    "file_additions": 5,
                    "file_deletions": 5,
                    "file_exists": true,
                    "file_name": "test/cmp_client_test.c",
                    "file_size": 13735
                },
                {
                    "file_additions": 5,
                    "file_deletions": 5,
                    "file_exists": true,
                    "file_name": "test/cmp_msg_test.c",
                    "file_size": 18534
                },
                {
                    "file_additions": 7,
                    "file_deletions": 7,
                    "file_exists": true,
                    "file_name": "test/cmp_protect_test.c",
                    "file_size": 21681
                },
                {
                    "file_additions": 8,
                    "file_deletions": 8,
                    "file_exists": true,
                    "file_name": "test/cmp_vfy_test.c",
                    "file_size": 23213
                },
                {
                    "file_additions": 211,
                    "file_deletions": 1,
                    "file_exists": true,
                    "file_name": "test/cmsapitest.c",
                    "file_size": 14463
                },
                {
                    "file_additions": 0,
                    "file_deletions": 1,
                    "file_exists": true,
                    "file_name": "test/drbgtest.c",
                    "file_size": 27782
                },
                {
                    "file_additions": 160,
                    "file_deletions": 6,
                    "file_exists": true,
                    "file_name": "test/evp_extra_test.c",
                    "file_size": 106464
                },
                {
                    "file_additions": 26,
                    "file_deletions": 10,
                    "file_exists": true,
                    "file_name": "test/evp_libctx_test.c",
                    "file_size": 28408
                },
                {
                    "file_additions": 1,
                    "file_deletions": 1,
                    "file_exists": true,
                    "file_name": "test/evp_test.c",
                    "file_size": 110232
                },
                {
                    "file_additions": 0,
                    "file_deletions": 42,
                    "file_exists": true,
                    "file_name": "test/helpers/cmp_testlib.c",
                    "file_size": 2114
                },
                {
                    "file_additions": 6,
                    "file_deletions": 10,
                    "file_exists": true,
                    "file_name": "test/helpers/pkcs12.c",
                    "file_size": 19352
                },
                {
                    "file_additions": 1,
                    "file_deletions": 15,
                    "file_exists": true,
                    "file_name": "test/http_test.c",
                    "file_size": 12328
                },
                {
                    "file_additions": 37,
                    "file_deletions": 35,
                    "file_exists": false,
                    "file_name": "test/oqs_test.c",
                    "file_size": 0
                },
                {
                    "file_additions": 24,
                    "file_deletions": 1,
                    "file_exists": true,
                    "file_name": "test/sslapitest.c",
                    "file_size": 317922
                },
                {
                    "file_additions": 97,
                    "file_deletions": 0,
                    "file_exists": true,
                    "file_name": "test/testutil/load.c",
                    "file_size": 2399
                },
                {
                    "file_additions": 182,
                    "file_deletions": 1,
                    "file_exists": true,
                    "file_name": "test/threadstest.c",
                    "file_size": 16906
                },
                {
                    "file_additions": 4,
                    "file_deletions": 0,
                    "file_exists": true,
                    "file_name": "test/tls13secretstest.c",
                    "file_size": 11790
                },
                {
                    "file_additions": 26,
                    "file_deletions": 87,
                    "file_exists": true,
                    "file_name": "test/verify_extra_test.c",
                    "file_size": 6153
                },
                {
                    "file_additions": 11,
                    "file_deletions": 6,
                    "file_exists": true,
                    "file_name": "test/x509aux.c",
                    "file_size": 5341
                }
            ],
            "interesting": {
                "reopen": false,
                "status": false
            },
            "is_parent": false,
            "sha": "5c585867ff9e59bd97e10de04600d7a0ca672773"
        }
    ],
    "first_commit": "2020-12-24 12:06:31",
    "last_commit": "2021-01-22 07:20:16",
    "number": 13708,
    "pull_request": "None",
    "score": {
        "accidental_reopen_likely": false,
        "all_labels": [
            "resolved: fixed",
            "triaged: feature"
        ],
        "contains_keywords": [
            "fail",
            "report",
            "warn",
            "chang",
            "reason",
            "error",
            "bug",
            "crash",
            "test",
            "fix",
            "patch",
            "attempt",
            "issu",
            "work",
            "perform",
            "CI",
            "fault",
            "leak"
        ],
        "fix_size": 3134,
        "has_labels": [],
        "intersecting": {
            "computed_score": 0.00821557673348669,
            "final_commit_size": 3043,
            "intersection_size": 25,
            "previous_commits_size": 116
        },
        "is_makefile_based": false,
        "no_new_files": [
            "apps/ca.c",
            "apps/cmp.c",
            "apps/crl.c",
            "apps/dgst.c",
            "apps/enc.c",
            "apps/lib/apps.c",
            "apps/lib/opt.c",
            "apps/lib/s_cb.c",
            "apps/openssl.c",
            "apps/passwd.c",
            "apps/pkey.c",
            "apps/rehash.c",
            "apps/s_client.c",
            "apps/srp.c",
            "crypto/armcap.c",
            "crypto/async/arch/async_win.c",
            "crypto/bio/bio_err.c",
            "crypto/bio/bio_lib.c",
            "crypto/bio/bss_mem.c",
            "crypto/bn/bn_prime.c",
            "crypto/bn/bn_sqrt.c",
            "crypto/bn/bn_x931p.c",
            "crypto/cms/cms_enc.c",
            "crypto/cms/cms_env.c",
            "crypto/cms/cms_ess.c",
            "crypto/cms/cms_io.c",
            "crypto/cms/cms_kari.c",
            "crypto/cms/cms_lib.c",
            "crypto/cms/cms_pwri.c",
            "crypto/cms/cms_sd.c",
            "crypto/cms/cms_smime.c",
            "crypto/conf/conf_api.c",
            "crypto/conf/conf_def.c",
            "crypto/conf/conf_mod.c",
            "crypto/context.c",
            "crypto/core_fetch.c",
            "crypto/des/fcrypt.c",
            "crypto/dh/dh_backend.c",
            "crypto/dh/dh_key.c",
            "crypto/dsa/dsa_backend.c",
            "crypto/dsa/dsa_lib.c",
            "crypto/ec/ec_backend.c",
            "crypto/ec/ec_mult.c",
            "crypto/encode_decode/decoder_meth.c",
            "crypto/encode_decode/encoder_meth.c",
            "crypto/err/err.c",
            "crypto/evp/evp_err.c",
            "crypto/evp/evp_fetch.c",
            "crypto/evp/evp_lib.c",
            "crypto/evp/evp_rand.c",
            "crypto/initthread.c",
            "crypto/ocsp/ocsp_http.c",
            "crypto/ocsp/v3_ocsp.c",
            "crypto/pem/pem_info.c",
            "crypto/pkcs7/pk7_asn1.c",
            "crypto/pkcs7/pk7_doit.c",
            "crypto/pkcs7/pk7_lib.c",
            "crypto/pkcs7/pk7_mime.c",
            "crypto/pkcs7/pk7_smime.c",
            "crypto/ppccap.c",
            "crypto/provider_core.c",
            "crypto/rand/rand_lib.c",
            "crypto/rsa/rsa_oaep.c",
            "crypto/sm2/sm2_err.c",
            "crypto/store/store_meth.c",
            "crypto/x509/by_dir.c",
            "crypto/x509/v3_akey.c",
            "crypto/x509/v3_alt.c",
            "crypto/x509/v3_conf.c",
            "crypto/x509/v3_purp.c",
            "crypto/x509/v3_skey.c",
            "crypto/x509/v3_utf8.c",
            "crypto/x509/x509_cmp.c",
            "crypto/x509/x509_lu.c",
            "crypto/x509/x509_vfy.c",
            "crypto/x509/x_all.c",
            "crypto/x509/x_crl.c",
            "crypto/x509/x_pubkey.c",
            "crypto/x509/x_x509.c",
            "engines/e_devcrypto.c",
            "engines/e_loader_attic.c",
            "providers/implementations/ciphers/cipher_aes_cbc_hmac_sha.c",
            "providers/implementations/ciphers/cipher_aes_ocb.c",
            "providers/implementations/ciphers/cipher_chacha20_hw.c",
            "providers/implementations/ciphers/cipher_chacha20_poly1305_hw.c",
            "providers/implementations/ciphers/cipher_rc4_hmac_md5.c",
            "providers/implementations/ciphers/ciphercommon.c",
            "providers/implementations/ciphers/ciphercommon_ccm.c",
            "providers/implementations/ciphers/ciphercommon_gcm.c",
            "providers/implementations/keymgmt/ec_kmgmt.c",
            "providers/implementations/keymgmt/oqs_kmgmt.c",
            "providers/implementations/signature/mac_legacy.c",
            "providers/implementations/storemgmt/file_store.c",
            "ssl/d1_lib.c",
            "ssl/ktls.c",
            "ssl/record/rec_layer_d1.c",
            "ssl/s3_enc.c",
            "ssl/s3_lib.c",
            "ssl/ssl_cert.c",
            "ssl/ssl_ciph.c",
            "ssl/ssl_err.c",
            "ssl/ssl_lib.c",
            "ssl/statem/extensions.c",
            "ssl/statem/statem.c",
            "ssl/statem/statem_clnt.c",
            "ssl/statem/statem_srvr.c",
            "ssl/t1_enc.c",
            "ssl/t1_lib.c",
            "ssl/tls13_enc.c",
            "test/aesgcmtest.c",
            "test/cmp_client_test.c",
            "test/cmp_msg_test.c",
            "test/cmp_protect_test.c",
            "test/cmp_vfy_test.c",
            "test/cmsapitest.c",
            "test/drbgtest.c",
            "test/evp_extra_test.c",
            "test/evp_libctx_test.c",
            "test/evp_test.c",
            "test/helpers/cmp_testlib.c",
            "test/helpers/pkcs12.c",
            "test/http_test.c",
            "test/oqs_test.c",
            "test/sslapitest.c",
            "test/threadstest.c",
            "test/tls13secretstest.c",
            "test/verify_extra_test.c",
            "test/x509aux.c"
        ],
        "no_other_files": false,
        "num_prohibited_files": 412623,
        "prohibited_files": [
            "hal/inc/pinmap_hal.h",
            "Debug/marvin.bin",
            "Debug/marvin.elf",
            "Debug/marvin.hex",
            "Debug/marvin.bin",
            "Debug/marvin.elf",
            "Debug/marvin.hex",
            "inc/spark_utilities.h",
            "Debug/marvin.bin",
            "Debug/marvin.elf"
        ],
        "reopen": true,
        "reopen_events": [
            [
                "2020-12-24 12:06:55",
                "commit"
            ],
            [
                "2020-12-25 11:33:21",
                "commit"
            ],
            [
                "2021-01-06 14:02:45",
                "commit"
            ],
            [
                "2021-01-07 09:44:08",
                "commit"
            ],
            [
                "2021-01-07 11:44:15",
                "commit"
            ],
            [
                "2021-01-07 19:58:44",
                "commit"
            ],
            [
                "2021-01-08 20:11:21",
                "commit"
            ],
            [
                "2021-01-09 21:54:19",
                "commit"
            ],
            [
                "2021-01-11 07:04:54",
                "commit"
            ],
            [
                "2021-01-11 09:56:48",
                "commit"
            ],
            [
                "2021-01-11 10:31:40",
                "commit"
            ],
            [
                "2021-01-13 11:00:11",
                "closed"
            ],
            [
                "2021-01-13 11:00:11",
                "commit"
            ],
            [
                "2021-01-13 12:59:58",
                "reopened"
            ],
            [
                "2021-01-16 12:13:20",
                "commit"
            ],
            [
                "2021-01-18 14:05:19",
                "commit"
            ],
            [
                "2021-01-20 15:01:28",
                "closed"
            ],
            [
                "2021-01-20 15:01:28",
                "commit"
            ],
            [
                "2021-01-22 07:20:31",
                "commit"
            ]
        ],
        "status": false,
        "strategy": true,
        "total_changes": 3932
    }
}