{
    "commits": [
        {
            "associated_pull_request": [],
            "date": "2015-12-02 06:13:07+00:00",
            "diff": "",
            "diff_additions": 0,
            "diff_deletions": 0,
            "diff_file_size": 0,
            "diff_url": "https://github.com/krakjoe/pthreads/commit/636174af42acfee9e3ad12f68b1bf83c400fa39b.diff",
            "exists": true,
            "files": [],
            "interesting": {
                "reopen": false,
                "status": false
            },
            "is_parent": true,
            "sha": "636174af42acfee9e3ad12f68b1bf83c400fa39b"
        },
        {
            "associated_pull_request": [],
            "date": "2015-12-02 08:21:32+00:00",
            "diff": "krakjoe_pthreads/issue_523/commit_703e8968a30b11fa87161f69058b13bdfc3eebbb.diff",
            "diff_additions": 18,
            "diff_deletions": 4,
            "diff_file_size": 35621,
            "diff_url": "https://github.com/krakjoe/pthreads/commit/703e8968a30b11fa87161f69058b13bdfc3eebbb.diff",
            "exists": true,
            "files": [
                {
                    "file_additions": 18,
                    "file_deletions": 4,
                    "file_exists": true,
                    "file_name": "php_pthreads.c",
                    "file_size": 35621
                }
            ],
            "interesting": {
                "reopen": false,
                "status": false
            },
            "is_parent": false,
            "sha": "703e8968a30b11fa87161f69058b13bdfc3eebbb"
        },
        {
            "associated_pull_request": [],
            "date": "2015-12-02 08:27:12+00:00",
            "diff": "krakjoe_pthreads/issue_523/commit_7a86467968143eb3bf04eec1b9f1987f586cd0c3.diff",
            "diff_additions": 6,
            "diff_deletions": 2,
            "diff_file_size": 35621,
            "diff_url": "https://github.com/krakjoe/pthreads/commit/7a86467968143eb3bf04eec1b9f1987f586cd0c3.diff",
            "exists": true,
            "files": [
                {
                    "file_additions": 6,
                    "file_deletions": 2,
                    "file_exists": true,
                    "file_name": "php_pthreads.c",
                    "file_size": 35621
                }
            ],
            "interesting": {
                "reopen": true,
                "status": false
            },
            "is_parent": false,
            "sha": "7a86467968143eb3bf04eec1b9f1987f586cd0c3"
        },
        {
            "associated_pull_request": [],
            "date": "2015-12-02 09:03:40+00:00",
            "diff": "krakjoe_pthreads/issue_523/commit_c4fe122188c6ecb4b71060fb191d4b1258691af0.diff",
            "diff_additions": 5,
            "diff_deletions": 5,
            "diff_file_size": 35621,
            "diff_url": "https://github.com/krakjoe/pthreads/commit/c4fe122188c6ecb4b71060fb191d4b1258691af0.diff",
            "exists": true,
            "files": [
                {
                    "file_additions": 5,
                    "file_deletions": 5,
                    "file_exists": true,
                    "file_name": "php_pthreads.c",
                    "file_size": 35621
                }
            ],
            "interesting": {
                "reopen": false,
                "status": false
            },
            "is_parent": false,
            "sha": "c4fe122188c6ecb4b71060fb191d4b1258691af0"
        }
    ],
    "first_commit": "2015-12-02 06:13:07+00:00",
    "last_commit": "2015-12-02 09:03:40+00:00",
    "number": 523,
    "pull_request": "None",
    "score": {
        "accidental_reopen_likely": false,
        "all_labels": [
            "bug"
        ],
        "contains_keywords": [
            "confirm",
            "work",
            "fail",
            "fix",
            "test",
            "fault",
            "error"
        ],
        "fix_size": 22,
        "has_labels": [
            "bug"
        ],
        "intersecting": {
            "computed_score": 0.8333333333333334,
            "final_commit_size": 6,
            "intersection_size": 5,
            "previous_commits_size": 21
        },
        "is_makefile_based": false,
        "no_new_files": [],
        "no_other_files": true,
        "num_prohibited_files": 99519,
        "prohibited_files": [
            "server/src/main/java/com/genymobile/scrcpy/Device.java",
            "server/src/main/java/com/genymobile/scrcpy/wrappers/SurfaceControl.java",
            "server/src/main/java/com/genymobile/scrcpy/Device.java",
            "server/src/main/java/com/genymobile/scrcpy/wrappers/SurfaceControl.java",
            "app/meson.build",
            "app/scrcpy.1",
            "app/src/common.h",
            "app/src/scrcpy.h",
            "app/src/server.h",
            "server/src/main/java/com/genymobile/scrcpy/Workarounds.java"
        ],
        "reopen": true,
        "reopen_events": [
            [
                "2015-12-02 08:21:38+00:00",
                "closed"
            ],
            [
                "2015-12-02 08:21:38+00:00",
                "commit"
            ],
            [
                "2015-12-02 08:27:16+00:00",
                "commit"
            ],
            [
                "2015-12-02 09:01:56+00:00",
                "reopened"
            ],
            [
                "2015-12-02 09:03:46+00:00",
                "commit"
            ],
            [
                "2015-12-02 09:16:50+00:00",
                "closed"
            ]
        ],
        "status": false,
        "strategy": true,
        "total_changes": 40
    }
}