{
    "all_issues": 308,
    "interesting_issues": 1,
    "last_update": "2021-05-16 12:48:13.869442",
    "license": {
        "download": "undefined",
        "name": "unknown"
    },
    "ratio": 0.003246753246753247,
    "size": 13045,
    "stars": 2917,
    "url": "https://github.com/moby/hyperkit"
}