{
    "commits": [
        {
            "associated_pull_request": [],
            "date": "2023-02-08 22:34:06+00:00",
            "diff": "frrouting_frr/issue_11241/commit_2cc76c768b4344c507e74c4311eeae474ff6ab28.diff",
            "diff_additions": 171,
            "diff_deletions": 155,
            "diff_file_size": 372701,
            "diff_url": "https://github.com/FRRouting/frr/commit/2cc76c768b4344c507e74c4311eeae474ff6ab28.diff",
            "exists": true,
            "files": [
                {
                    "file_additions": 171,
                    "file_deletions": 155,
                    "file_exists": true,
                    "file_name": "ospfd/ospf_vty.c",
                    "file_size": 372701
                }
            ],
            "interesting": {
                "reopen": false,
                "status": false
            },
            "is_parent": true,
            "sha": "2cc76c768b4344c507e74c4311eeae474ff6ab28"
        },
        {
            "associated_pull_request": [],
            "date": "2023-02-24 15:01:22+00:00",
            "diff": "frrouting_frr/issue_11241/commit_16771ceee5eec4be0d8d3131503ef5b01c589b7c.diff",
            "diff_additions": 5,
            "diff_deletions": 9,
            "diff_file_size": 86845,
            "diff_url": "https://github.com/FRRouting/frr/commit/16771ceee5eec4be0d8d3131503ef5b01c589b7c.diff",
            "exists": true,
            "files": [
                {
                    "file_additions": 5,
                    "file_deletions": 9,
                    "file_exists": true,
                    "file_name": "pimd/pim6_mld.c",
                    "file_size": 86845
                }
            ],
            "interesting": {
                "reopen": false,
                "status": false
            },
            "is_parent": false,
            "sha": "16771ceee5eec4be0d8d3131503ef5b01c589b7c"
        },
        {
            "associated_pull_request": [],
            "date": "2023-02-24 15:13:30+00:00",
            "diff": "frrouting_frr/issue_11241/commit_68a734bd927df2fbe80d810b0c59a9532b0242f9.diff",
            "diff_additions": 30,
            "diff_deletions": 12,
            "diff_file_size": 86845,
            "diff_url": "https://github.com/FRRouting/frr/commit/68a734bd927df2fbe80d810b0c59a9532b0242f9.diff",
            "exists": true,
            "files": [
                {
                    "file_additions": 30,
                    "file_deletions": 12,
                    "file_exists": true,
                    "file_name": "pimd/pim6_mld.c",
                    "file_size": 86845
                }
            ],
            "interesting": {
                "reopen": false,
                "status": true
            },
            "is_parent": false,
            "sha": "68a734bd927df2fbe80d810b0c59a9532b0242f9"
        },
        {
            "associated_pull_request": [],
            "date": "2023-02-24 15:13:30+00:00",
            "diff": "frrouting_frr/issue_11241/commit_7aea9353620f3dc043653ce98e4621b6050a5a2c.diff",
            "diff_additions": 30,
            "diff_deletions": 12,
            "diff_file_size": 86845,
            "diff_url": "https://github.com/FRRouting/frr/commit/7aea9353620f3dc043653ce98e4621b6050a5a2c.diff",
            "exists": true,
            "files": [
                {
                    "file_additions": 30,
                    "file_deletions": 12,
                    "file_exists": true,
                    "file_name": "pimd/pim6_mld.c",
                    "file_size": 86845
                }
            ],
            "interesting": {
                "reopen": false,
                "status": true
            },
            "is_parent": false,
            "sha": "7aea9353620f3dc043653ce98e4621b6050a5a2c"
        },
        {
            "associated_pull_request": [],
            "date": "2023-02-24 15:13:30+00:00",
            "diff": "frrouting_frr/issue_11241/commit_d7cf20f3fcc941681c59ce0ba535816a0cc03614.diff",
            "diff_additions": 30,
            "diff_deletions": 12,
            "diff_file_size": 86845,
            "diff_url": "https://github.com/FRRouting/frr/commit/d7cf20f3fcc941681c59ce0ba535816a0cc03614.diff",
            "exists": true,
            "files": [
                {
                    "file_additions": 30,
                    "file_deletions": 12,
                    "file_exists": true,
                    "file_name": "pimd/pim6_mld.c",
                    "file_size": 86845
                }
            ],
            "interesting": {
                "reopen": false,
                "status": true
            },
            "is_parent": false,
            "sha": "d7cf20f3fcc941681c59ce0ba535816a0cc03614"
        },
        {
            "associated_pull_request": [],
            "date": "2023-02-24 15:13:30+00:00",
            "diff": "frrouting_frr/issue_11241/commit_a9f1f838c439d6dcd239a0bef166761179263c6e.diff",
            "diff_additions": 29,
            "diff_deletions": 12,
            "diff_file_size": 86845,
            "diff_url": "https://github.com/FRRouting/frr/commit/a9f1f838c439d6dcd239a0bef166761179263c6e.diff",
            "exists": true,
            "files": [
                {
                    "file_additions": 29,
                    "file_deletions": 12,
                    "file_exists": true,
                    "file_name": "pimd/pim6_mld.c",
                    "file_size": 86845
                }
            ],
            "interesting": {
                "reopen": false,
                "status": true
            },
            "is_parent": false,
            "sha": "a9f1f838c439d6dcd239a0bef166761179263c6e"
        },
        {
            "associated_pull_request": [],
            "date": "2023-02-24 15:13:30+00:00",
            "diff": "frrouting_frr/issue_11241/commit_33efdd532cae21b49650e3b3e3fc39e92827ebd4.diff",
            "diff_additions": 29,
            "diff_deletions": 12,
            "diff_file_size": 86845,
            "diff_url": "https://github.com/FRRouting/frr/commit/33efdd532cae21b49650e3b3e3fc39e92827ebd4.diff",
            "exists": true,
            "files": [
                {
                    "file_additions": 29,
                    "file_deletions": 12,
                    "file_exists": true,
                    "file_name": "pimd/pim6_mld.c",
                    "file_size": 86845
                }
            ],
            "interesting": {
                "reopen": false,
                "status": true
            },
            "is_parent": false,
            "sha": "33efdd532cae21b49650e3b3e3fc39e92827ebd4"
        },
        {
            "associated_pull_request": [
                "https://github.com/FRRouting/frr/pull/12899"
            ],
            "date": "2023-02-24 15:13:30+00:00",
            "diff": "frrouting_frr/issue_11241/commit_cbb1e51311ca710540d752c9d6c7689f8fc65dc4.diff",
            "diff_additions": 30,
            "diff_deletions": 13,
            "diff_file_size": 86845,
            "diff_url": "https://github.com/FRRouting/frr/commit/cbb1e51311ca710540d752c9d6c7689f8fc65dc4.diff",
            "exists": true,
            "files": [
                {
                    "file_additions": 30,
                    "file_deletions": 13,
                    "file_exists": true,
                    "file_name": "pimd/pim6_mld.c",
                    "file_size": 86845
                }
            ],
            "interesting": {
                "reopen": false,
                "status": false
            },
            "is_parent": false,
            "sha": "cbb1e51311ca710540d752c9d6c7689f8fc65dc4"
        },
        {
            "associated_pull_request": [
                "https://github.com/FRRouting/frr/pull/12910"
            ],
            "date": "2023-02-24 15:01:22+00:00",
            "diff": "frrouting_frr/issue_11241/commit_aa3f3511de5b09c088bd503f4a0ef970757ed907.diff",
            "diff_additions": 5,
            "diff_deletions": 9,
            "diff_file_size": 86845,
            "diff_url": "https://github.com/FRRouting/frr/commit/aa3f3511de5b09c088bd503f4a0ef970757ed907.diff",
            "exists": true,
            "files": [
                {
                    "file_additions": 5,
                    "file_deletions": 9,
                    "file_exists": true,
                    "file_name": "pimd/pim6_mld.c",
                    "file_size": 86845
                }
            ],
            "interesting": {
                "reopen": false,
                "status": false
            },
            "is_parent": false,
            "sha": "aa3f3511de5b09c088bd503f4a0ef970757ed907"
        },
        {
            "associated_pull_request": [
                "https://github.com/FRRouting/frr/pull/12910"
            ],
            "date": "2023-02-24 15:13:30+00:00",
            "diff": "frrouting_frr/issue_11241/commit_a3350c948739e1fe6f45e8bca1c2bc9fbe6d8085.diff",
            "diff_additions": 30,
            "diff_deletions": 13,
            "diff_file_size": 86845,
            "diff_url": "https://github.com/FRRouting/frr/commit/a3350c948739e1fe6f45e8bca1c2bc9fbe6d8085.diff",
            "exists": true,
            "files": [
                {
                    "file_additions": 30,
                    "file_deletions": 13,
                    "file_exists": true,
                    "file_name": "pimd/pim6_mld.c",
                    "file_size": 86845
                }
            ],
            "interesting": {
                "reopen": false,
                "status": false
            },
            "is_parent": false,
            "sha": "a3350c948739e1fe6f45e8bca1c2bc9fbe6d8085"
        }
    ],
    "first_commit": "2023-02-24 15:18:33+00:00",
    "last_commit": "2023-02-27 19:03:11+00:00",
    "number": 11241,
    "pull_request": "None",
    "score": {
        "accidental_reopen_likely": false,
        "all_labels": [
            "pimv6"
        ],
        "contains_keywords": [
            "fix",
            "issu",
            "fault",
            "remov"
        ],
        "fix_size": 77,
        "has_labels": [],
        "intersecting": {
            "computed_score": 0.5277777777777778,
            "final_commit_size": 36,
            "intersection_size": 19,
            "previous_commits_size": 60
        },
        "is_makefile_based": true,
        "no_new_files": [],
        "no_other_files": false,
        "num_prohibited_files": 428928,
        "prohibited_files": [
            "server/src/main/java/com/genymobile/scrcpy/Device.java",
            "server/src/main/java/com/genymobile/scrcpy/wrappers/SurfaceControl.java",
            "server/src/main/java/com/genymobile/scrcpy/Device.java",
            "server/src/main/java/com/genymobile/scrcpy/wrappers/SurfaceControl.java",
            "app/meson.build",
            "app/scrcpy.1",
            "app/src/common.h",
            "app/src/scrcpy.h",
            "app/src/server.h",
            "server/src/main/java/com/genymobile/scrcpy/Workarounds.java"
        ],
        "reopen": false,
        "reopen_events": [
            [
                "2022-11-29 02:10:19+00:00",
                "closed"
            ],
            [
                "2023-02-24 12:51:56+00:00",
                "reopened"
            ],
            [
                "2023-02-24 15:18:53+00:00",
                "commit"
            ],
            [
                "2023-02-24 15:18:53+00:00",
                "commit"
            ],
            [
                "2023-02-24 15:21:27+00:00",
                "commit"
            ],
            [
                "2023-02-24 15:21:27+00:00",
                "commit"
            ],
            [
                "2023-02-25 02:54:06+00:00",
                "commit"
            ],
            [
                "2023-02-25 02:54:06+00:00",
                "commit"
            ],
            [
                "2023-02-25 02:54:15+00:00",
                "commit"
            ],
            [
                "2023-02-25 02:56:29+00:00",
                "commit"
            ],
            [
                "2023-02-25 07:58:55+00:00",
                "commit"
            ],
            [
                "2023-02-27 19:01:45+00:00",
                "closed"
            ],
            [
                "2023-02-27 19:03:14+00:00",
                "commit"
            ],
            [
                "2023-02-27 19:03:14+00:00",
                "commit"
            ]
        ],
        "status": true,
        "strategy": true,
        "total_changes": 648
    }
}