{
    "commits": [
        {
            "diff": "elastic_elasticsearch/issue_40348/commit_07671ec8f258723e745025627b5cb5bc0c77d286.diff",
            "diff_additions": 107,
            "diff_deletions": 57,
            "diff_file_size": 69763,
            "files": [
                {
                    "file_additions": 3,
                    "file_deletions": 4,
                    "file_exists": true,
                    "file_name": "x-pack/plugin/sql/jdbc/src/main/java/org/elasticsearch/xpack/sql/jdbc/JdbcDatabaseMetaData.java",
                    "file_size": 38686
                },
                {
                    "file_additions": 2,
                    "file_deletions": 3,
                    "file_exists": true,
                    "file_name": "x-pack/plugin/sql/src/main/java/org/elasticsearch/xpack/sql/parser/CommandBuilder.java",
                    "file_size": 8383
                },
                {
                    "file_additions": 15,
                    "file_deletions": 9,
                    "file_exists": true,
                    "file_name": "x-pack/plugin/sql/src/main/java/org/elasticsearch/xpack/sql/plan/logical/command/sys/SysTables.java",
                    "file_size": 7246
                },
                {
                    "file_additions": 87,
                    "file_deletions": 41,
                    "file_exists": true,
                    "file_name": "x-pack/plugin/sql/src/test/java/org/elasticsearch/xpack/sql/plan/logical/command/sys/SysTablesTests.java",
                    "file_size": 15448
                }
            ],
            "interesting": {
                "reopened": false,
                "status": true
            },
            "sha": "07671ec8f258723e745025627b5cb5bc0c77d286"
        },
        {
            "diff": "elastic_elasticsearch/issue_40348/commit_ddfa5437bacd429da570feab22b26c5d69d948ec.diff",
            "diff_additions": 107,
            "diff_deletions": 57,
            "diff_file_size": 69763,
            "files": [
                {
                    "file_additions": 3,
                    "file_deletions": 4,
                    "file_exists": true,
                    "file_name": "x-pack/plugin/sql/jdbc/src/main/java/org/elasticsearch/xpack/sql/jdbc/JdbcDatabaseMetaData.java",
                    "file_size": 38686
                },
                {
                    "file_additions": 2,
                    "file_deletions": 3,
                    "file_exists": true,
                    "file_name": "x-pack/plugin/sql/src/main/java/org/elasticsearch/xpack/sql/parser/CommandBuilder.java",
                    "file_size": 8383
                },
                {
                    "file_additions": 15,
                    "file_deletions": 9,
                    "file_exists": true,
                    "file_name": "x-pack/plugin/sql/src/main/java/org/elasticsearch/xpack/sql/plan/logical/command/sys/SysTables.java",
                    "file_size": 7246
                },
                {
                    "file_additions": 87,
                    "file_deletions": 41,
                    "file_exists": true,
                    "file_name": "x-pack/plugin/sql/src/test/java/org/elasticsearch/xpack/sql/plan/logical/command/sys/SysTablesTests.java",
                    "file_size": 15448
                }
            ],
            "interesting": {
                "reopened": false,
                "status": false
            },
            "sha": "ddfa5437bacd429da570feab22b26c5d69d948ec"
        },
        {
            "diff": "elastic_elasticsearch/issue_40348/commit_5485efa2af3d8b18ccc8db0f4d0b7bc64f68e390.diff",
            "diff_additions": 102,
            "diff_deletions": 60,
            "diff_file_size": 69763,
            "files": [
                {
                    "file_additions": 3,
                    "file_deletions": 4,
                    "file_exists": true,
                    "file_name": "x-pack/plugin/sql/jdbc/src/main/java/org/elasticsearch/xpack/sql/jdbc/JdbcDatabaseMetaData.java",
                    "file_size": 38686
                },
                {
                    "file_additions": 2,
                    "file_deletions": 3,
                    "file_exists": true,
                    "file_name": "x-pack/plugin/sql/src/main/java/org/elasticsearch/xpack/sql/parser/CommandBuilder.java",
                    "file_size": 8383
                },
                {
                    "file_additions": 15,
                    "file_deletions": 10,
                    "file_exists": true,
                    "file_name": "x-pack/plugin/sql/src/main/java/org/elasticsearch/xpack/sql/plan/logical/command/sys/SysTables.java",
                    "file_size": 7246
                },
                {
                    "file_additions": 82,
                    "file_deletions": 43,
                    "file_exists": true,
                    "file_name": "x-pack/plugin/sql/src/test/java/org/elasticsearch/xpack/sql/plan/logical/command/sys/SysTablesTests.java",
                    "file_size": 15448
                }
            ],
            "interesting": {
                "reopened": false,
                "status": false
            },
            "sha": "5485efa2af3d8b18ccc8db0f4d0b7bc64f68e390"
        }
    ],
    "first_commit": "2019-03-27 13:19:14",
    "last_commit": "2019-03-28 08:08:31",
    "number": 40348,
    "score": 288.0081632653061
}