{
    "commits": [
        {
            "diff": "square_okhttp/issue_568/commit_0fbe50cbc00e125568f659e39591fa03a7ea95ec.diff",
            "diff_additions": 24,
            "diff_deletions": 0,
            "diff_file_size": 0,
            "files": [
                {
                    "file_additions": 24,
                    "file_deletions": 0,
                    "file_exists": false,
                    "file_name": "okhttp/src/test/java/com/squareup/okhttp/internal/http/URLConnectionTest.java",
                    "file_size": 0
                }
            ],
            "interesting": {
                "reopened": false,
                "status": false
            },
            "sha": "0fbe50cbc00e125568f659e39591fa03a7ea95ec"
        },
        {
            "diff": "square_okhttp/issue_568/commit_c9ddba72920e5b5e0d78e501cf0cf4d43fc45c78.diff",
            "diff_additions": 43,
            "diff_deletions": 1,
            "diff_file_size": 0,
            "files": [
                {
                    "file_additions": 10,
                    "file_deletions": 0,
                    "file_exists": false,
                    "file_name": "okhttp/src/main/java/com/squareup/okhttp/internal/http/HttpURLConnectionImpl.java",
                    "file_size": 0
                },
                {
                    "file_additions": 2,
                    "file_deletions": 1,
                    "file_exists": false,
                    "file_name": "okhttp/src/main/java/com/squareup/okhttp/internal/http/HttpsURLConnectionImpl.java",
                    "file_size": 0
                },
                {
                    "file_additions": 31,
                    "file_deletions": 0,
                    "file_exists": false,
                    "file_name": "okhttp/src/test/java/com/squareup/okhttp/internal/http/URLConnectionTest.java",
                    "file_size": 0
                }
            ],
            "interesting": {
                "reopened": false,
                "status": true
            },
            "sha": "c9ddba72920e5b5e0d78e501cf0cf4d43fc45c78"
        },
        {
            "diff": "square_okhttp/issue_568/commit_7c99d00088a168ad060311d278479c29a3032113.diff",
            "diff_additions": 48,
            "diff_deletions": 1,
            "diff_file_size": 0,
            "files": [
                {
                    "file_additions": 10,
                    "file_deletions": 0,
                    "file_exists": false,
                    "file_name": "okhttp/src/main/java/com/squareup/okhttp/internal/http/HttpURLConnectionImpl.java",
                    "file_size": 0
                },
                {
                    "file_additions": 7,
                    "file_deletions": 1,
                    "file_exists": false,
                    "file_name": "okhttp/src/main/java/com/squareup/okhttp/internal/http/HttpsURLConnectionImpl.java",
                    "file_size": 0
                },
                {
                    "file_additions": 31,
                    "file_deletions": 0,
                    "file_exists": false,
                    "file_name": "okhttp/src/test/java/com/squareup/okhttp/internal/http/URLConnectionTest.java",
                    "file_size": 0
                }
            ],
            "interesting": {
                "reopened": false,
                "status": false
            },
            "sha": "7c99d00088a168ad060311d278479c29a3032113"
        }
    ],
    "first_commit": "2014-02-24 04:50:15",
    "last_commit": "2014-02-25 04:10:26",
    "number": 568,
    "score": 360.03418803418805
}