{
    "covered_issues": [
        4559,
        4557,
        4552,
        4548,
        4545,
        4535,
        4534,
        4531,
        4521,
        4518,
        4511,
        4510,
        4507,
        4506,
        4503,
        4502,
        4492,
        4485,
        4483,
        4480,
        4477,
        4469,
        4467,
        4455,
        4453,
        4449,
        4439,
        4438,
        4435,
        4425,
        4419,
        4415,
        4411,
        4410,
        4407,
        4405,
        4402,
        4395,
        4385,
        4384,
        4382,
        4373,
        4368,
        4367,
        4364,
        4361,
        4355,
        4353,
        4351,
        4348,
        4346,
        4340,
        4329,
        4321,
        4315,
        4305,
        4301,
        4291,
        4285,
        4280,
        4278,
        4276,
        4268,
        4263,
        4251,
        4249,
        4248,
        4245,
        4241,
        4235,
        4233,
        4232,
        4227,
        4218,
        4215,
        4211,
        4206,
        4205,
        4204,
        4203,
        4202,
        4199,
        4198,
        4197,
        4195,
        4194,
        4192,
        4191,
        4189,
        4184,
        4180,
        4175,
        4174,
        4173,
        4170,
        4169,
        4160,
        4159,
        4158,
        4151,
        4137,
        4136,
        4132,
        4131,
        4126,
        4125,
        4124,
        4123,
        4121,
        4120,
        4116,
        4115,
        4113,
        4111,
        4106,
        4095,
        4094,
        4089,
        4088,
        4086,
        4084,
        4079,
        4078,
        4075,
        4066,
        4063,
        4062,
        4060,
        4051,
        4044,
        4043,
        4042,
        4040,
        4039,
        4036,
        4035,
        4031,
        4030,
        4024,
        4022,
        4021,
        4017,
        4014,
        4012,
        4009,
        4004,
        3999,
        3998,
        3993,
        3991,
        3990,
        3989,
        3987,
        3986,
        3978,
        3975,
        3962,
        3954,
        3946,
        3943,
        3942,
        3939,
        3935,
        3932,
        3928,
        3926,
        3925,
        3923,
        3919,
        3918,
        3916,
        3914,
        3911,
        3909,
        3908,
        3906,
        3903,
        3901,
        3899,
        3894,
        3880,
        3875,
        3874,
        3873,
        3872,
        3870,
        3856,
        3854,
        3849,
        3848,
        3844,
        3843,
        3841,
        3840,
        3837,
        3836,
        3832,
        3826,
        3821,
        3820,
        3817,
        3815,
        3814,
        3813,
        3807,
        3806,
        3805,
        3804,
        3800,
        3799,
        3793,
        3789,
        3782,
        3779,
        3778,
        3777,
        3775,
        3773,
        3762,
        3758,
        3752,
        3750,
        3740,
        3739,
        3737,
        3728,
        3725,
        3724,
        3717,
        3715,
        3708,
        3703,
        3695,
        3694,
        3686,
        3680,
        3676,
        3674,
        3668,
        3663,
        3655,
        3652,
        3650,
        3644,
        3638,
        3631,
        3629,
        3627,
        3626,
        3625,
        3620,
        3613,
        3608,
        3603,
        3602,
        3596,
        3594,
        3593,
        3581,
        3569,
        3563,
        3561,
        3560,
        3557,
        3556,
        3554,
        3553,
        3552,
        3550,
        3549,
        3548,
        3547,
        3543,
        3542,
        3539,
        3533,
        3527,
        3525,
        3521,
        3516,
        3504,
        3503,
        3500,
        3497,
        3494,
        3492,
        3490,
        3484,
        3480,
        3463,
        3462,
        3460,
        3456,
        3452,
        3445,
        3444,
        3440,
        3439,
        3438,
        3437,
        3431,
        3423,
        3422,
        3419,
        3418,
        3408,
        3406,
        3391,
        3388,
        3387,
        3385,
        3374,
        3373,
        3372,
        3367,
        3365,
        3361,
        3360,
        3350,
        3348,
        3340,
        3333,
        3330,
        3328,
        3326,
        3325,
        3323,
        3318,
        3316,
        3314,
        3313,
        3312,
        3309,
        3307,
        3306,
        3304,
        3297,
        3293,
        3290,
        3288,
        3285,
        3283,
        3280,
        3279,
        3277,
        3275,
        3273,
        3265,
        3263,
        3261,
        3258,
        3257,
        3255,
        3247,
        3240,
        3237,
        3233,
        3231,
        3224,
        3223,
        3222,
        3220,
        3218,
        3209,
        3206,
        3194,
        3193,
        3190,
        3189,
        3187,
        3182,
        3179,
        3178,
        3175,
        3174,
        3173,
        3171,
        3170,
        3169,
        3168,
        3167,
        3166,
        3163,
        3160,
        3159,
        3157,
        3153,
        3148,
        3146,
        3144,
        3140,
        3138,
        3137,
        3135,
        3134,
        3133,
        3132,
        3130,
        3123,
        3120,
        3118,
        3117,
        3113,
        3112,
        3111,
        3110,
        3108,
        3107,
        3102,
        3099,
        3097,
        3096,
        3093,
        3092,
        3091,
        3090,
        3089,
        3085,
        3078,
        3069,
        3068,
        3065,
        3062,
        3057,
        3056,
        3053,
        3052,
        3051,
        3046,
        3041,
        3040,
        3039,
        3033,
        3032,
        3030,
        3029,
        3028,
        3027,
        3023,
        3019,
        3017,
        3013,
        3012,
        3011,
        3004,
        2998,
        2995,
        2991,
        2983,
        2975,
        2973,
        2971,
        2970,
        2967,
        2962,
        2960,
        2957,
        2955,
        2947,
        2945,
        2942,
        2941,
        2938,
        2928,
        2925,
        2923,
        2922,
        2921,
        2916,
        2915,
        2910,
        2909,
        2908,
        2906,
        2895,
        2894,
        2893,
        2887,
        2883,
        2882,
        2881,
        2878,
        2876,
        2875,
        2873,
        2871,
        2870,
        2863,
        2862,
        2861,
        2858,
        2855,
        2853,
        2848,
        2847,
        2840,
        2825,
        2812,
        2802,
        2800,
        2799,
        2797,
        2795,
        2794,
        2793,
        2784,
        2779,
        2778,
        2770,
        2768,
        2767,
        2761,
        2757,
        2754,
        2752,
        2749,
        2746,
        2738,
        2735,
        2708,
        2701,
        2698,
        2697,
        2692,
        2688,
        2687,
        2686,
        2683,
        2680,
        2677,
        2667,
        2665,
        2659,
        2658,
        2652,
        2650,
        2645,
        2642,
        2640,
        2638,
        2632,
        2628,
        2627,
        2625,
        2624,
        2621,
        2620,
        2617,
        2609,
        2607,
        2603,
        2602,
        2601,
        2600,
        2599,
        2593,
        2592,
        2584,
        2583,
        2579,
        2573,
        2570,
        2563,
        2560,
        2556,
        2552,
        2550,
        2549,
        2548,
        2545,
        2544,
        2542,
        2541,
        2540,
        2536,
        2525,
        2524,
        2522,
        2521,
        2518,
        2517,
        2515,
        2514,
        2509,
        2507,
        2505,
        2503,
        2502,
        2501,
        2498,
        2496,
        2493,
        2490,
        2485,
        2484,
        2483,
        2480,
        2473,
        2471,
        2469,
        2464,
        2462,
        2459,
        2456,
        2454,
        2453,
        2451,
        2449,
        2441,
        2440,
        2439,
        2438,
        2437,
        2433,
        2426,
        2423,
        2422,
        2420,
        2419,
        2418,
        2411,
        2410,
        2407,
        2406,
        2405,
        2400,
        2395,
        2392,
        2386,
        2384,
        2383,
        2382,
        2379,
        2378,
        2372,
        2367,
        2366,
        2365,
        2363,
        2361,
        2356,
        2355,
        2354,
        2353,
        2345,
        2344,
        2343,
        2331,
        2321,
        2318,
        2317,
        2312,
        2309,
        2307,
        2306,
        2301,
        2298,
        2293,
        2292,
        2291,
        2284,
        2282,
        2281,
        2280,
        2279,
        2278,
        2277,
        2274,
        2271,
        2270,
        2265,
        2251,
        2249,
        2240,
        2239,
        2237,
        2236,
        2230,
        2229,
        2227,
        2225,
        2221,
        2210,
        2197,
        2193,
        2189,
        2177,
        2173,
        2172,
        2170,
        2165,
        2163,
        2162,
        2161,
        2151,
        2150,
        2145,
        2142,
        2139,
        2136,
        2132,
        2130,
        2128,
        2121,
        2120,
        2116,
        2114,
        2113,
        2111,
        2110,
        2102,
        2101,
        2100,
        2098,
        2097,
        2094,
        2089,
        2083,
        2082,
        2081,
        2078,
        2075,
        2073,
        2071,
        2069,
        2067,
        2065,
        2064,
        2060,
        2059,
        2054,
        2052,
        2047,
        2046,
        2045,
        2042,
        2040,
        2039,
        2037,
        2036,
        2033,
        2027,
        2026,
        2024,
        2023,
        2021,
        2020,
        2017,
        2012,
        2011,
        2010,
        2009,
        2008,
        2006,
        2004,
        2003,
        1999,
        1997,
        1996,
        1994,
        1991,
        1990,
        1989,
        1987,
        1986,
        1980,
        1979,
        1976,
        1975,
        1974,
        1972,
        1971,
        1969,
        1968,
        1966,
        1964,
        1963,
        1962,
        1961,
        1957,
        1953,
        1952,
        1951,
        1947,
        1945,
        1941,
        1940,
        1933,
        1925,
        1913,
        1907,
        1904,
        1901,
        1897,
        1892,
        1886,
        1883,
        1881,
        1878,
        1875,
        1873,
        1871,
        1870,
        1869,
        1866,
        1864,
        1862,
        1860,
        1859,
        1858,
        1857,
        1856,
        1855,
        1854,
        1852,
        1851,
        1846,
        1844,
        1842,
        1841,
        1840,
        1839,
        1835,
        1828,
        1823,
        1809,
        1806,
        1805,
        1802,
        1801,
        1800,
        1798,
        1796,
        1792,
        1789,
        1788,
        1781,
        1769,
        1762,
        1761,
        1758,
        1754,
        1753,
        1752,
        1743,
        1741,
        1739,
        1737,
        1734,
        1721,
        1719,
        1718,
        1716,
        1714,
        1713,
        1712,
        1711,
        1709,
        1705,
        1704,
        1703,
        1701,
        1692,
        1691,
        1689,
        1687,
        1683,
        1682,
        1681,
        1677,
        1675,
        1673,
        1672,
        1667,
        1663,
        1659,
        1655,
        1654,
        1650,
        1647,
        1643,
        1640,
        1632,
        1624,
        1623,
        1618,
        1615,
        1614,
        1596,
        1588,
        1582,
        1580,
        1576,
        1574,
        1561,
        1557,
        1556,
        1555,
        1554,
        1553,
        1552,
        1547,
        1543,
        1541,
        1540,
        1537,
        1535,
        1534,
        1531,
        1530,
        1526,
        1521,
        1517,
        1516,
        1515,
        1506,
        1505,
        1503,
        1502,
        1500,
        1499,
        1497,
        1495,
        1492,
        1489,
        1488,
        1487,
        1486,
        1485,
        1484,
        1483,
        1480,
        1478,
        1477,
        1476,
        1475,
        1474,
        1473,
        1472,
        1470,
        1469,
        1468,
        1467,
        1463,
        1462,
        1461,
        1460,
        1459,
        1458,
        1456,
        1454,
        1453,
        1452,
        1451,
        1448,
        1446,
        1444,
        1442,
        1441,
        1440,
        1439,
        1430,
        1429,
        1426,
        1425,
        1421,
        1420,
        1418,
        1417,
        1416,
        1414,
        1413,
        1411,
        1409,
        1408,
        1407,
        1404,
        1398,
        1397,
        1396,
        1395,
        1394,
        1391,
        1390,
        1389,
        1388,
        1384,
        1383,
        1380,
        1379,
        1378,
        1377,
        1375,
        1372,
        1367,
        1366,
        1364,
        1363,
        1362,
        1359,
        1358,
        1355,
        1354,
        1350,
        1341,
        1339,
        1338,
        1335,
        1326,
        1325,
        1324,
        1323,
        1322,
        1321,
        1320,
        1310,
        1309,
        1307,
        1305,
        1303,
        1302,
        1301,
        1298,
        1296,
        1293,
        1289,
        1286,
        1282,
        1281,
        1280,
        1278,
        1277,
        1276,
        1274,
        1273,
        1269,
        1268,
        1267,
        1262,
        1259,
        1258,
        1256,
        1255,
        1253,
        1243,
        1242,
        1241,
        1240,
        1238,
        1237,
        1236,
        1231,
        1230,
        1229,
        1228,
        1227,
        1226,
        1224,
        1221,
        1220,
        1219,
        1216,
        1214,
        1213,
        1210,
        1209,
        1208,
        1207,
        1206,
        1204,
        1200,
        1196,
        1194,
        1191,
        1178,
        1163,
        1162,
        1156,
        1153,
        1152,
        1147,
        1133,
        1132,
        1127,
        1119,
        1107,
        1106,
        1102,
        1099,
        1098,
        1091,
        1088,
        1078,
        1064,
        1053,
        1051,
        1048,
        1046,
        1044,
        1043,
        1042,
        1040,
        1039,
        1036,
        1035,
        1034,
        1033,
        1031,
        1030,
        1026,
        1025,
        1024,
        1022,
        1021,
        1017,
        1015,
        1014,
        1013,
        1011,
        1009,
        1008,
        1006,
        1000,
        999,
        997,
        996,
        992,
        991,
        990,
        989,
        988,
        987,
        986,
        985,
        984,
        982,
        976,
        973,
        972,
        971,
        969,
        968,
        962,
        958,
        952,
        950,
        946,
        945,
        942,
        941,
        940,
        938,
        934,
        933,
        932,
        931,
        930,
        928,
        927,
        926,
        922,
        921,
        918,
        917,
        916,
        911,
        910,
        909,
        908,
        906,
        905,
        904,
        903,
        901,
        898,
        897,
        896,
        895,
        892,
        890,
        884,
        879,
        876,
        875,
        874,
        871,
        870,
        869,
        867,
        866,
        865,
        864,
        860,
        857,
        855,
        853,
        852,
        851,
        848,
        846,
        841,
        836,
        832,
        827,
        823,
        822,
        818,
        813,
        812,
        811,
        808,
        807,
        803,
        801,
        800,
        799,
        797,
        794,
        787,
        785,
        784,
        782,
        781,
        779,
        778,
        771,
        770,
        767,
        766,
        763,
        761,
        760,
        759,
        758,
        757,
        755,
        753,
        750,
        742,
        739,
        737,
        736,
        735,
        734,
        733,
        726,
        725,
        724,
        723,
        722,
        721,
        720,
        718,
        717,
        716,
        715,
        714,
        710,
        709,
        708,
        707,
        706,
        700,
        699,
        698,
        696,
        695,
        692,
        689,
        686,
        683,
        682,
        681,
        678,
        677,
        676,
        670,
        669,
        667,
        666,
        665,
        663,
        662,
        661,
        658,
        656,
        655,
        650,
        648,
        647,
        645,
        644,
        643,
        640,
        639,
        638,
        637,
        634,
        632,
        630,
        628,
        627,
        626,
        624,
        622,
        621,
        620,
        619,
        614,
        611,
        609,
        606,
        605,
        604,
        602,
        598,
        593,
        592,
        591,
        589,
        587,
        586,
        584,
        583,
        582,
        581,
        578,
        576,
        574,
        573,
        571,
        570,
        569,
        566,
        564,
        563,
        562,
        561,
        560,
        559,
        558,
        554,
        550,
        549,
        548,
        546,
        545,
        544,
        542,
        537,
        536,
        535,
        534,
        531,
        530,
        529,
        528,
        527,
        526,
        525,
        524,
        523,
        522,
        521,
        518,
        517,
        515,
        513,
        511,
        509,
        506,
        505,
        503,
        502,
        501,
        499,
        498,
        497,
        495,
        494,
        493,
        492,
        491,
        490,
        489,
        488,
        487,
        486,
        482,
        480,
        478,
        476,
        475,
        474,
        473,
        472,
        471,
        469,
        468,
        467,
        465,
        464,
        463,
        462,
        461,
        459,
        455,
        454,
        453,
        452,
        451,
        450,
        448,
        447,
        445,
        441,
        439,
        437,
        436,
        433,
        432,
        431,
        430,
        428,
        427,
        426,
        425,
        423,
        422,
        420,
        419,
        418,
        417,
        416,
        415,
        414,
        412,
        411,
        410,
        409,
        407,
        406,
        405,
        404,
        403,
        401,
        400,
        399,
        398,
        397,
        396,
        394,
        393,
        392,
        391,
        389,
        387,
        386,
        383,
        382,
        381,
        380,
        378,
        377,
        376,
        375,
        373,
        370,
        369,
        368,
        367,
        366,
        365,
        363,
        362,
        360,
        359,
        357,
        356,
        355,
        354,
        353,
        352,
        350,
        349,
        347,
        346,
        345,
        344,
        343,
        342,
        341,
        340,
        339,
        338,
        337,
        336,
        335,
        334,
        333,
        332,
        331,
        330,
        323,
        319,
        313,
        312,
        311,
        307,
        302,
        295,
        293,
        292,
        288,
        287,
        286,
        285,
        284,
        283,
        282,
        281,
        279,
        276,
        274,
        273,
        268,
        267,
        266,
        263,
        262,
        261,
        258,
        257,
        252,
        250,
        249,
        248,
        246,
        245,
        244,
        243,
        241,
        240,
        238,
        237,
        236,
        235,
        231,
        229,
        226,
        224,
        222,
        221,
        220,
        219,
        217,
        216,
        214,
        213,
        212,
        210,
        208,
        207,
        206,
        205,
        202,
        200,
        199,
        198,
        197,
        194,
        193,
        191,
        190,
        188,
        185,
        184,
        180,
        179,
        178,
        177,
        176,
        174,
        173,
        170,
        166,
        165,
        161,
        160,
        159,
        158,
        157,
        155,
        154,
        153,
        152,
        150,
        149,
        148,
        146,
        145,
        143,
        140,
        139,
        137,
        136,
        135,
        133,
        132,
        131,
        130,
        129,
        128,
        127,
        126,
        125,
        124,
        123,
        122,
        121,
        120,
        119,
        118,
        117,
        116,
        114,
        113,
        112,
        111,
        110,
        109,
        108,
        105,
        104,
        103,
        102,
        101,
        98,
        97,
        96,
        95,
        94,
        93,
        92,
        91,
        90,
        89,
        88,
        87,
        84,
        83,
        82,
        81,
        80,
        79,
        78,
        77,
        76,
        75,
        73,
        72,
        71,
        67,
        66,
        65,
        63,
        61,
        60,
        59,
        57,
        56,
        55,
        53,
        50,
        48,
        46,
        43,
        42,
        41,
        39,
        37,
        36,
        35,
        34,
        33,
        32,
        31,
        28,
        25,
        23,
        21,
        19,
        18,
        17,
        16,
        14,
        13,
        12,
        11,
        9,
        8,
        6,
        5,
        4,
        3
    ],
    "finished": true
}