{
    "covered_issues": [
        137,
        128,
        127,
        124,
        123,
        114,
        113,
        111,
        110,
        107,
        105,
        101,
        100,
        98,
        94,
        93,
        92,
        89,
        87,
        84,
        83,
        79,
        78,
        76,
        75,
        72,
        70,
        69,
        68,
        66,
        65,
        59,
        58,
        56,
        55,
        54,
        53,
        52,
        51,
        49,
        46,
        45,
        42,
        41,
        40,
        39,
        36,
        34,
        32,
        31,
        29,
        28,
        27,
        24,
        23,
        22,
        20,
        19,
        17,
        16,
        15,
        13,
        12,
        11,
        9,
        8,
        7,
        6,
        5
    ],
    "finished": true
}