{
    "all_issues": 148,
    "interesting_issues": 1,
    "last_update": "2023-11-09 12:48:21.806435",
    "license": {
        "download": "https://raw.githubusercontent.com/TrampolineRTOS/trampoline/master/LICENSE-GPLv2.txt",
        "name": "GNU General Public License v2.0"
    },
    "ratio": 0.006756756756756757,
    "size": 151584,
    "stars": 545,
    "url": "https://github.com/TrampolineRTOS/trampoline"
}