{
    "covered_issues": [
        34,
        32,
        25,
        24,
        23,
        20,
        18,
        17,
        14,
        12,
        11,
        10,
        6,
        3,
        2
    ],
    "finished": true
}