{
    "commits": [
        {
            "associated_pull_request": [
                "https://github.com/dankamongmen/notcurses/pull/2215"
            ],
            "date": "2021-09-28 12:13:09+00:00",
            "diff": "",
            "diff_additions": 0,
            "diff_deletions": 0,
            "diff_file_size": 0,
            "diff_url": "https://github.com/dankamongmen/notcurses/commit/dd9da7766b5845c2a12f8e3ca46c878f33c5c9e0.diff",
            "exists": true,
            "files": [],
            "interesting": {
                "reopen": false,
                "status": false
            },
            "is_parent": true,
            "sha": "dd9da7766b5845c2a12f8e3ca46c878f33c5c9e0"
        },
        {
            "associated_pull_request": [
                "https://github.com/dankamongmen/notcurses/pull/2218"
            ],
            "date": "2021-09-29 04:01:01+00:00",
            "diff": "dankamongmen_notcurses/issue_2216/commit_c5080d884ac8897b212acf8e37e0af681ebc46c9.diff",
            "diff_additions": 69,
            "diff_deletions": 28,
            "diff_file_size": 97399,
            "diff_url": "https://github.com/dankamongmen/notcurses/commit/c5080d884ac8897b212acf8e37e0af681ebc46c9.diff",
            "exists": true,
            "files": [
                {
                    "file_additions": 2,
                    "file_deletions": 2,
                    "file_exists": true,
                    "file_name": "src/demo/input.c",
                    "file_size": 5001
                },
                {
                    "file_additions": 67,
                    "file_deletions": 26,
                    "file_exists": true,
                    "file_name": "src/lib/in.c",
                    "file_size": 92398
                }
            ],
            "interesting": {
                "reopen": false,
                "status": false
            },
            "is_parent": false,
            "sha": "c5080d884ac8897b212acf8e37e0af681ebc46c9"
        },
        {
            "associated_pull_request": [
                "https://github.com/dankamongmen/notcurses/pull/2218"
            ],
            "date": "2021-09-29 04:08:44+00:00",
            "diff": "dankamongmen_notcurses/issue_2216/commit_937bfff0975e2720069205d2a56dea99d4cc2a55.diff",
            "diff_additions": 15,
            "diff_deletions": 2,
            "diff_file_size": 92398,
            "diff_url": "https://github.com/dankamongmen/notcurses/commit/937bfff0975e2720069205d2a56dea99d4cc2a55.diff",
            "exists": true,
            "files": [
                {
                    "file_additions": 15,
                    "file_deletions": 2,
                    "file_exists": true,
                    "file_name": "src/lib/in.c",
                    "file_size": 92398
                }
            ],
            "interesting": {
                "reopen": false,
                "status": false
            },
            "is_parent": false,
            "sha": "937bfff0975e2720069205d2a56dea99d4cc2a55"
        },
        {
            "associated_pull_request": [
                "https://github.com/dankamongmen/notcurses/pull/2218"
            ],
            "date": "2021-09-29 04:19:30+00:00",
            "diff": "dankamongmen_notcurses/issue_2216/commit_633c8eac5235b7362712d1fb389fe54e787f2e11.diff",
            "diff_additions": 6,
            "diff_deletions": 0,
            "diff_file_size": 92398,
            "diff_url": "https://github.com/dankamongmen/notcurses/commit/633c8eac5235b7362712d1fb389fe54e787f2e11.diff",
            "exists": true,
            "files": [
                {
                    "file_additions": 6,
                    "file_deletions": 0,
                    "file_exists": true,
                    "file_name": "src/lib/in.c",
                    "file_size": 92398
                }
            ],
            "interesting": {
                "reopen": false,
                "status": false
            },
            "is_parent": false,
            "sha": "633c8eac5235b7362712d1fb389fe54e787f2e11"
        },
        {
            "associated_pull_request": [
                "https://github.com/dankamongmen/notcurses/pull/2218"
            ],
            "date": "2021-09-29 04:08:44+00:00",
            "diff": "dankamongmen_notcurses/issue_2216/commit_81e360e50005033c133116e2de282a37205516d0.diff",
            "diff_additions": 15,
            "diff_deletions": 2,
            "diff_file_size": 92398,
            "diff_url": "https://github.com/dankamongmen/notcurses/commit/81e360e50005033c133116e2de282a37205516d0.diff",
            "exists": true,
            "files": [
                {
                    "file_additions": 15,
                    "file_deletions": 2,
                    "file_exists": true,
                    "file_name": "src/lib/in.c",
                    "file_size": 92398
                }
            ],
            "interesting": {
                "reopen": false,
                "status": false
            },
            "is_parent": false,
            "sha": "81e360e50005033c133116e2de282a37205516d0"
        },
        {
            "associated_pull_request": [
                "https://github.com/dankamongmen/notcurses/pull/2218"
            ],
            "date": "2021-09-29 04:19:30+00:00",
            "diff": "dankamongmen_notcurses/issue_2216/commit_f6b06c3bfd2c71a027f9873684ca16a0461647cd.diff",
            "diff_additions": 6,
            "diff_deletions": 0,
            "diff_file_size": 92398,
            "diff_url": "https://github.com/dankamongmen/notcurses/commit/f6b06c3bfd2c71a027f9873684ca16a0461647cd.diff",
            "exists": true,
            "files": [
                {
                    "file_additions": 6,
                    "file_deletions": 0,
                    "file_exists": true,
                    "file_name": "src/lib/in.c",
                    "file_size": 92398
                }
            ],
            "interesting": {
                "reopen": true,
                "status": false
            },
            "is_parent": false,
            "sha": "f6b06c3bfd2c71a027f9873684ca16a0461647cd"
        },
        {
            "associated_pull_request": [],
            "date": "2021-11-26 12:34:43+00:00",
            "diff": "dankamongmen_notcurses/issue_2216/commit_2d6428cb152f700411c757e7fc7afc981403fd13.diff",
            "diff_additions": 15,
            "diff_deletions": 7,
            "diff_file_size": 0,
            "diff_url": "https://github.com/dankamongmen/notcurses/commit/2d6428cb152f700411c757e7fc7afc981403fd13.diff",
            "exists": true,
            "files": [
                {
                    "file_additions": 15,
                    "file_deletions": 7,
                    "file_exists": false,
                    "file_name": "src/poc/cli.c",
                    "file_size": 0
                }
            ],
            "interesting": {
                "reopen": false,
                "status": false
            },
            "is_parent": false,
            "sha": "2d6428cb152f700411c757e7fc7afc981403fd13"
        },
        {
            "associated_pull_request": [],
            "date": "2021-11-26 12:48:49+00:00",
            "diff": "dankamongmen_notcurses/issue_2216/commit_55152a0e0c1f542751b577313d79fe38866768d2.diff",
            "diff_additions": 1,
            "diff_deletions": 1,
            "diff_file_size": 92398,
            "diff_url": "https://github.com/dankamongmen/notcurses/commit/55152a0e0c1f542751b577313d79fe38866768d2.diff",
            "exists": true,
            "files": [
                {
                    "file_additions": 1,
                    "file_deletions": 1,
                    "file_exists": true,
                    "file_name": "src/lib/in.c",
                    "file_size": 92398
                }
            ],
            "interesting": {
                "reopen": true,
                "status": false
            },
            "is_parent": false,
            "sha": "55152a0e0c1f542751b577313d79fe38866768d2"
        },
        {
            "associated_pull_request": [],
            "date": "2022-01-08 18:32:09+00:00",
            "diff": "dankamongmen_notcurses/issue_2216/commit_949925e1f794c0d7026f362cf8fd87c5354a68a9.diff",
            "diff_additions": 4,
            "diff_deletions": 17,
            "diff_file_size": 92398,
            "diff_url": "https://github.com/dankamongmen/notcurses/commit/949925e1f794c0d7026f362cf8fd87c5354a68a9.diff",
            "exists": true,
            "files": [
                {
                    "file_additions": 4,
                    "file_deletions": 17,
                    "file_exists": true,
                    "file_name": "src/lib/in.c",
                    "file_size": 92398
                }
            ],
            "interesting": {
                "reopen": true,
                "status": false
            },
            "is_parent": false,
            "sha": "949925e1f794c0d7026f362cf8fd87c5354a68a9"
        }
    ],
    "first_commit": "2021-09-28 13:39:43+00:00",
    "last_commit": "2022-01-08 18:32:09+00:00",
    "number": 2216,
    "pull_request": "None",
    "score": {
        "accidental_reopen_likely": false,
        "all_labels": [
            "bug",
            "input"
        ],
        "contains_keywords": [
            "work",
            "chang",
            "fix",
            "issu",
            "debug",
            "test",
            "bug",
            "error",
            "problem",
            "report"
        ],
        "fix_size": 128,
        "has_labels": [
            "bug"
        ],
        "intersecting": {
            "computed_score": 0.05263157894736842,
            "final_commit_size": 19,
            "intersection_size": 1,
            "previous_commits_size": 110
        },
        "is_makefile_based": true,
        "no_new_files": [],
        "no_other_files": true,
        "num_prohibited_files": 316359,
        "prohibited_files": [
            "server/src/main/java/com/genymobile/scrcpy/Device.java",
            "server/src/main/java/com/genymobile/scrcpy/wrappers/SurfaceControl.java",
            "server/src/main/java/com/genymobile/scrcpy/Device.java",
            "server/src/main/java/com/genymobile/scrcpy/wrappers/SurfaceControl.java",
            "app/meson.build",
            "app/scrcpy.1",
            "app/src/common.h",
            "app/src/scrcpy.h",
            "app/src/server.h",
            "server/src/main/java/com/genymobile/scrcpy/Workarounds.java"
        ],
        "reopen": true,
        "reopen_events": [
            [
                "2021-09-29 04:01:06+00:00",
                "commit"
            ],
            [
                "2021-09-29 04:08:47+00:00",
                "commit"
            ],
            [
                "2021-09-29 04:19:37+00:00",
                "commit"
            ],
            [
                "2021-09-29 22:38:04+00:00",
                "closed"
            ],
            [
                "2021-09-29 22:38:05+00:00",
                "commit"
            ],
            [
                "2021-09-29 22:38:06+00:00",
                "commit"
            ],
            [
                "2021-09-29 22:38:06+00:00",
                "commit"
            ],
            [
                "2021-11-19 21:13:16+00:00",
                "reopened"
            ],
            [
                "2021-11-26 12:34:48+00:00",
                "commit"
            ],
            [
                "2021-11-26 12:48:54+00:00",
                "commit"
            ],
            [
                "2021-11-26 12:48:56+00:00",
                "closed"
            ],
            [
                "2021-12-02 14:13:03+00:00",
                "reopened"
            ],
            [
                "2022-01-08 18:32:13+00:00",
                "commit"
            ],
            [
                "2022-01-08 18:33:54+00:00",
                "closed"
            ],
            [
                "2022-01-08 18:35:25+00:00",
                "reopened"
            ],
            [
                "2022-01-08 18:40:53+00:00",
                "closed"
            ]
        ],
        "status": false,
        "strategy": true,
        "total_changes": 188
    }
}