{
    "covered_issues": [
        372,
        346,
        344,
        338,
        327,
        309,
        306,
        305,
        301,
        297,
        287,
        286,
        284,
        283,
        281,
        279,
        275,
        273,
        261,
        258,
        254,
        253,
        225,
        208,
        207,
        201,
        190,
        189,
        182,
        181,
        180,
        179,
        177,
        176,
        165,
        163,
        159,
        144,
        124,
        122,
        119,
        117,
        111,
        105,
        103,
        101,
        100,
        94,
        93,
        91,
        85,
        79,
        78,
        75,
        74,
        73,
        72,
        71,
        69,
        67,
        65,
        63,
        62,
        59,
        58,
        55,
        54,
        53,
        51,
        50,
        49,
        48,
        47,
        42,
        38,
        37,
        36,
        34,
        29,
        26,
        25,
        24,
        23,
        22,
        21,
        20,
        17,
        16,
        15,
        12,
        11,
        10,
        9,
        8,
        7,
        6,
        5,
        4,
        3,
        2,
        1
    ],
    "finished": true
}