{
    "covered_issues": [
        82,
        81,
        80,
        79,
        78,
        77,
        76,
        73,
        72,
        71,
        70,
        68,
        67,
        65,
        64,
        62,
        61,
        59,
        58,
        57,
        56,
        54,
        53,
        52,
        51,
        50,
        48,
        47,
        45,
        42,
        41,
        40,
        39,
        36,
        35,
        34,
        32,
        30,
        28,
        26,
        22,
        20,
        16,
        14,
        12,
        7,
        6,
        3
    ],
    "finished": true
}