{
    "commits": [
        {
            "associated_pull_request": [],
            "date": "2014-11-24 13:59:40+00:00",
            "diff": "meetecho_janus-gateway/issue_88/commit_291d85c8e26596737af71001810aba4f18bd140c.diff",
            "diff_additions": 3,
            "diff_deletions": 2,
            "diff_file_size": 0,
            "diff_url": "https://github.com/meetecho/janus-gateway/commit/291d85c8e26596737af71001810aba4f18bd140c.diff",
            "exists": true,
            "files": [
                {
                    "file_additions": 3,
                    "file_deletions": 2,
                    "file_exists": false,
                    "file_name": "ice.c",
                    "file_size": 0
                }
            ],
            "interesting": {
                "reopen": false,
                "status": false
            },
            "is_parent": true,
            "sha": "291d85c8e26596737af71001810aba4f18bd140c"
        },
        {
            "associated_pull_request": [],
            "date": "2014-11-25 14:56:44+00:00",
            "diff": "meetecho_janus-gateway/issue_88/commit_d60a9646acd72b240bbc14deb6ca82722b5a9cde.diff",
            "diff_additions": 79,
            "diff_deletions": 76,
            "diff_file_size": 0,
            "diff_url": "https://github.com/meetecho/janus-gateway/commit/d60a9646acd72b240bbc14deb6ca82722b5a9cde.diff",
            "exists": true,
            "files": [
                {
                    "file_additions": 50,
                    "file_deletions": 76,
                    "file_exists": false,
                    "file_name": "plugins/janus_videoroom.c",
                    "file_size": 0
                },
                {
                    "file_additions": 27,
                    "file_deletions": 0,
                    "file_exists": false,
                    "file_name": "rtcp.c",
                    "file_size": 0
                },
                {
                    "file_additions": 2,
                    "file_deletions": 0,
                    "file_exists": false,
                    "file_name": "sdp.c",
                    "file_size": 0
                }
            ],
            "interesting": {
                "reopen": true,
                "status": false
            },
            "is_parent": false,
            "sha": "d60a9646acd72b240bbc14deb6ca82722b5a9cde"
        },
        {
            "associated_pull_request": [],
            "date": "2014-11-26 10:03:09+00:00",
            "diff": "meetecho_janus-gateway/issue_88/commit_fbbf4fbb2ab5f6c8e9e1bdeddf507978e0a547ae.diff",
            "diff_additions": 13,
            "diff_deletions": 3,
            "diff_file_size": 0,
            "diff_url": "https://github.com/meetecho/janus-gateway/commit/fbbf4fbb2ab5f6c8e9e1bdeddf507978e0a547ae.diff",
            "exists": true,
            "files": [
                {
                    "file_additions": 13,
                    "file_deletions": 3,
                    "file_exists": false,
                    "file_name": "plugins/janus_videoroom.c",
                    "file_size": 0
                }
            ],
            "interesting": {
                "reopen": false,
                "status": false
            },
            "is_parent": false,
            "sha": "fbbf4fbb2ab5f6c8e9e1bdeddf507978e0a547ae"
        }
    ],
    "first_commit": "2014-11-24 13:59:40+00:00",
    "last_commit": "2014-11-26 10:03:09+00:00",
    "number": 88,
    "pull_request": "None",
    "score": {
        "accidental_reopen_likely": false,
        "all_labels": [],
        "contains_keywords": [
            "confirm",
            "work",
            "fail",
            "chang",
            "fix",
            "issu",
            "debug",
            "reason",
            "test",
            "fault",
            "bug",
            "error",
            "crash",
            "report"
        ],
        "fix_size": 154,
        "has_labels": [],
        "intersecting": {
            "computed_score": 0.875,
            "final_commit_size": 16,
            "intersection_size": 14,
            "previous_commits_size": 152
        },
        "is_makefile_based": true,
        "no_new_files": [],
        "no_other_files": false,
        "num_prohibited_files": 50765,
        "prohibited_files": [
            "server/src/main/java/com/genymobile/scrcpy/Device.java",
            "server/src/main/java/com/genymobile/scrcpy/wrappers/SurfaceControl.java",
            "server/src/main/java/com/genymobile/scrcpy/Device.java",
            "server/src/main/java/com/genymobile/scrcpy/wrappers/SurfaceControl.java",
            "app/meson.build",
            "app/scrcpy.1",
            "app/src/common.h",
            "app/src/scrcpy.h",
            "app/src/server.h",
            "server/src/main/java/com/genymobile/scrcpy/Workarounds.java"
        ],
        "reopen": true,
        "reopen_events": [
            [
                "2014-11-25 14:56:49+00:00",
                "commit"
            ],
            [
                "2014-11-25 14:57:09+00:00",
                "closed"
            ],
            [
                "2014-11-26 09:29:39+00:00",
                "reopened"
            ],
            [
                "2014-11-26 10:03:14+00:00",
                "commit"
            ],
            [
                "2014-11-26 19:16:54+00:00",
                "closed"
            ]
        ],
        "status": false,
        "strategy": true,
        "total_changes": 176
    }
}