{
    "covered_issues": [
        244,
        243,
        242,
        241,
        238,
        236,
        235,
        232,
        231,
        229,
        226,
        225,
        222,
        221,
        220,
        219,
        218,
        217,
        214,
        213,
        211,
        210,
        209,
        208,
        206,
        202,
        201,
        199,
        198,
        196,
        195,
        194,
        191,
        190,
        187,
        186,
        185,
        183,
        182,
        180,
        179,
        178,
        176,
        175,
        174,
        173,
        171,
        168,
        167,
        165,
        164,
        162,
        159,
        158,
        152,
        151,
        147,
        139,
        138,
        134,
        131,
        128,
        126,
        124,
        123,
        122,
        121,
        120,
        117,
        116,
        115,
        111,
        107,
        106,
        105,
        102,
        100,
        99,
        98,
        96,
        95,
        94,
        93,
        92,
        91,
        90,
        89,
        88,
        84,
        83,
        82,
        80,
        74,
        73,
        71,
        70,
        69,
        68,
        67,
        66,
        65,
        64,
        63,
        62,
        61,
        60,
        59,
        57,
        54,
        51,
        49,
        43,
        42,
        41,
        40,
        39,
        37,
        36,
        35,
        33,
        29,
        26,
        23,
        21,
        20,
        19,
        18,
        17,
        16,
        15,
        14,
        13,
        12,
        10,
        9,
        8,
        6,
        3,
        2
    ],
    "finished": true
}