{
    "category": [
        "build/refactor/preprocessing",
        "multithreading",
        "feature request"
    ],
    "commits": [
        {
            "associated_pull_request": [],
            "date": "2020-05-15 11:45:54",
            "diff": "nodemcu_nodemcu-firmware/issue_3020/commit_50fcd72a5822b628708e4bd1c8f6ba04815289f3.diff",
            "diff_additions": 1,
            "diff_deletions": 1,
            "diff_file_size": 51052,
            "diff_url": "https://github.com/nodemcu/nodemcu-firmware/commit/50fcd72a5822b628708e4bd1c8f6ba04815289f3.diff",
            "exists": true,
            "files": [
                {
                    "file_additions": 1,
                    "file_deletions": 1,
                    "file_exists": true,
                    "file_name": "app/modules/wifi.c",
                    "file_size": 51052
                }
            ],
            "interesting": {
                "reopen": false,
                "status": false
            },
            "is_parent": true,
            "sha": "50fcd72a5822b628708e4bd1c8f6ba04815289f3"
        },
        {
            "associated_pull_request": [],
            "date": "2020-05-16 08:19:07",
            "diff": "nodemcu_nodemcu-firmware/issue_3020/commit_93b7ca2c72bb7f95b9c164582157249e34535fc1.diff",
            "diff_additions": 6,
            "diff_deletions": 5,
            "diff_file_size": 34778,
            "diff_url": "https://github.com/nodemcu/nodemcu-firmware/commit/93b7ca2c72bb7f95b9c164582157249e34535fc1.diff",
            "exists": true,
            "files": [
                {
                    "file_additions": 0,
                    "file_deletions": 3,
                    "file_exists": true,
                    "file_name": "app/modules/ads1115.c",
                    "file_size": 23487
                },
                {
                    "file_additions": 6,
                    "file_deletions": 2,
                    "file_exists": true,
                    "file_name": "app/modules/tmr.c",
                    "file_size": 11291
                }
            ],
            "interesting": {
                "reopen": false,
                "status": false
            },
            "is_parent": false,
            "sha": "93b7ca2c72bb7f95b9c164582157249e34535fc1"
        },
        {
            "associated_pull_request": [],
            "date": "2020-05-16 08:19:07",
            "diff": "nodemcu_nodemcu-firmware/issue_3020/commit_e55f083cd2d8e49277a5e3c138be937624aa02d3.diff",
            "diff_additions": 6,
            "diff_deletions": 5,
            "diff_file_size": 34778,
            "diff_url": "https://github.com/nodemcu/nodemcu-firmware/commit/e55f083cd2d8e49277a5e3c138be937624aa02d3.diff",
            "exists": true,
            "files": [
                {
                    "file_additions": 0,
                    "file_deletions": 3,
                    "file_exists": true,
                    "file_name": "app/modules/ads1115.c",
                    "file_size": 23487
                },
                {
                    "file_additions": 6,
                    "file_deletions": 2,
                    "file_exists": true,
                    "file_name": "app/modules/tmr.c",
                    "file_size": 11291
                }
            ],
            "interesting": {
                "reopen": false,
                "status": false
            },
            "is_parent": false,
            "sha": "e55f083cd2d8e49277a5e3c138be937624aa02d3"
        },
        {
            "associated_pull_request": [],
            "date": "2020-05-16 08:19:07",
            "diff": "nodemcu_nodemcu-firmware/issue_3020/commit_7735da5a068d3082458fa7768e361e1006ee977e.diff",
            "diff_additions": 6,
            "diff_deletions": 5,
            "diff_file_size": 34778,
            "diff_url": "https://github.com/nodemcu/nodemcu-firmware/commit/7735da5a068d3082458fa7768e361e1006ee977e.diff",
            "exists": true,
            "files": [
                {
                    "file_additions": 0,
                    "file_deletions": 3,
                    "file_exists": true,
                    "file_name": "app/modules/ads1115.c",
                    "file_size": 23487
                },
                {
                    "file_additions": 6,
                    "file_deletions": 2,
                    "file_exists": true,
                    "file_name": "app/modules/tmr.c",
                    "file_size": 11291
                }
            ],
            "interesting": {
                "reopen": false,
                "status": false
            },
            "is_parent": false,
            "sha": "7735da5a068d3082458fa7768e361e1006ee977e"
        },
        {
            "associated_pull_request": [],
            "date": "2020-05-16 08:19:07",
            "diff": "nodemcu_nodemcu-firmware/issue_3020/commit_47c3d39602cc9690575d5d119f83668e48fb4995.diff",
            "diff_additions": 13,
            "diff_deletions": 6,
            "diff_file_size": 11291,
            "diff_url": "https://github.com/nodemcu/nodemcu-firmware/commit/47c3d39602cc9690575d5d119f83668e48fb4995.diff",
            "exists": true,
            "files": [
                {
                    "file_additions": 13,
                    "file_deletions": 6,
                    "file_exists": true,
                    "file_name": "app/modules/tmr.c",
                    "file_size": 11291
                }
            ],
            "interesting": {
                "reopen": false,
                "status": true
            },
            "is_parent": false,
            "sha": "47c3d39602cc9690575d5d119f83668e48fb4995"
        },
        {
            "associated_pull_request": [],
            "date": "2020-05-16 08:19:07",
            "diff": "nodemcu_nodemcu-firmware/issue_3020/commit_4f8da36efbda8e2750b6d758989f8766dbba53a7.diff",
            "diff_additions": 13,
            "diff_deletions": 6,
            "diff_file_size": 11291,
            "diff_url": "https://github.com/nodemcu/nodemcu-firmware/commit/4f8da36efbda8e2750b6d758989f8766dbba53a7.diff",
            "exists": true,
            "files": [
                {
                    "file_additions": 13,
                    "file_deletions": 6,
                    "file_exists": true,
                    "file_name": "app/modules/tmr.c",
                    "file_size": 11291
                }
            ],
            "interesting": {
                "reopen": false,
                "status": true
            },
            "is_parent": false,
            "sha": "4f8da36efbda8e2750b6d758989f8766dbba53a7"
        },
        {
            "associated_pull_request": [],
            "date": "2020-05-16 08:19:07",
            "diff": "nodemcu_nodemcu-firmware/issue_3020/commit_5c85a905111251f1e12f6d24a851c67505404056.diff",
            "diff_additions": 12,
            "diff_deletions": 5,
            "diff_file_size": 11291,
            "diff_url": "https://github.com/nodemcu/nodemcu-firmware/commit/5c85a905111251f1e12f6d24a851c67505404056.diff",
            "exists": true,
            "files": [
                {
                    "file_additions": 12,
                    "file_deletions": 5,
                    "file_exists": true,
                    "file_name": "app/modules/tmr.c",
                    "file_size": 11291
                }
            ],
            "interesting": {
                "reopen": false,
                "status": true
            },
            "is_parent": false,
            "sha": "5c85a905111251f1e12f6d24a851c67505404056"
        },
        {
            "associated_pull_request": [],
            "date": "2020-05-16 08:19:07",
            "diff": "nodemcu_nodemcu-firmware/issue_3020/commit_3281eaa202663d3caf2d85b7082fdc4ed5684f88.diff",
            "diff_additions": 12,
            "diff_deletions": 5,
            "diff_file_size": 11291,
            "diff_url": "https://github.com/nodemcu/nodemcu-firmware/commit/3281eaa202663d3caf2d85b7082fdc4ed5684f88.diff",
            "exists": true,
            "files": [
                {
                    "file_additions": 12,
                    "file_deletions": 5,
                    "file_exists": true,
                    "file_name": "app/modules/tmr.c",
                    "file_size": 11291
                }
            ],
            "interesting": {
                "reopen": false,
                "status": false
            },
            "is_parent": false,
            "sha": "3281eaa202663d3caf2d85b7082fdc4ed5684f88"
        },
        {
            "associated_pull_request": [
                "https://github.com/nodemcu/nodemcu-firmware/pull/3111"
            ],
            "date": "2020-05-16 08:19:07",
            "diff": "nodemcu_nodemcu-firmware/issue_3020/commit_959707c67160e9701b4edb10ea65633017de886d.diff",
            "diff_additions": 12,
            "diff_deletions": 5,
            "diff_file_size": 11291,
            "diff_url": "https://github.com/nodemcu/nodemcu-firmware/commit/959707c67160e9701b4edb10ea65633017de886d.diff",
            "exists": true,
            "files": [
                {
                    "file_additions": 12,
                    "file_deletions": 5,
                    "file_exists": true,
                    "file_name": "app/modules/tmr.c",
                    "file_size": 11291
                }
            ],
            "interesting": {
                "reopen": false,
                "status": false
            },
            "is_parent": false,
            "sha": "959707c67160e9701b4edb10ea65633017de886d"
        }
    ],
    "first_commit": "2020-05-15 11:45:54",
    "last_commit": "2020-06-17 22:48:00",
    "number": 3020,
    "pull_request": "None",
    "score": {
        "accidental_reopen_likely": false,
        "all_labels": [
            "documentation",
            "enhancement"
        ],
        "contains_keywords": [
            "fail",
            "chang",
            "error",
            "test",
            "fix",
            "remov",
            "issu",
            "work",
            "fault"
        ],
        "fix_size": 30,
        "has_labels": [],
        "intersecting": {
            "computed_score": 0.9333333333333333,
            "final_commit_size": 15,
            "intersection_size": 14,
            "previous_commits_size": 29
        },
        "is_makefile_based": true,
        "no_new_files": [],
        "no_other_files": true,
        "num_prohibited_files": 197190,
        "prohibited_files": [
            "hal/inc/pinmap_hal.h",
            "Debug/marvin.bin",
            "Debug/marvin.elf",
            "Debug/marvin.hex",
            "Debug/marvin.bin",
            "Debug/marvin.elf",
            "Debug/marvin.hex",
            "inc/spark_utilities.h",
            "Debug/marvin.bin",
            "Debug/marvin.elf"
        ],
        "reopen": false,
        "reopen_events": [
            [
                "2020-05-16 08:21:24",
                "commit"
            ],
            [
                "2020-05-16 08:23:51",
                "commit"
            ],
            [
                "2020-05-16 08:28:15",
                "commit"
            ],
            [
                "2020-06-17 21:55:43",
                "commit"
            ],
            [
                "2020-06-17 22:39:24",
                "commit"
            ],
            [
                "2020-06-17 22:42:18",
                "commit"
            ],
            [
                "2020-06-17 22:45:41",
                "commit"
            ],
            [
                "2020-06-17 22:48:13",
                "commit"
            ],
            [
                "2020-08-29 19:44:02",
                "closed"
            ]
        ],
        "status": true,
        "strategy": true,
        "total_changes": 124
    }
}