{
    "covered_issues": [
        466,
        462,
        459,
        457,
        449,
        445,
        439,
        434,
        433,
        432,
        431,
        427,
        426,
        422,
        413,
        410,
        408,
        405,
        401,
        400,
        398,
        391,
        384,
        382,
        381,
        376,
        372,
        369,
        366,
        364,
        361,
        357,
        356,
        354,
        352,
        351,
        349,
        348,
        346,
        343,
        340,
        339,
        337,
        336,
        335,
        333,
        332,
        331,
        329,
        327,
        326,
        325,
        323,
        322,
        321,
        320,
        319,
        315,
        313,
        311,
        309,
        304,
        302,
        299,
        297,
        293,
        285,
        282,
        279,
        277,
        275,
        274,
        273,
        272,
        270,
        268,
        267,
        266,
        263,
        258,
        256,
        246,
        245,
        244,
        240,
        238,
        229,
        225,
        224,
        223,
        221,
        218,
        217,
        214,
        212,
        211,
        210,
        209,
        207,
        204,
        202,
        200,
        198,
        196,
        195,
        193,
        192,
        191,
        190,
        188,
        187,
        185,
        181,
        179,
        173,
        172,
        170,
        169,
        166,
        164,
        160,
        159,
        158,
        157,
        156,
        155,
        154,
        153,
        152,
        151,
        150,
        148,
        145,
        143,
        141,
        134,
        129,
        127,
        125,
        122,
        121,
        120,
        116,
        115,
        111,
        110,
        109,
        108,
        107,
        106,
        101,
        99,
        94,
        92,
        89,
        88,
        81,
        80,
        78,
        75,
        74,
        72,
        64,
        53,
        49,
        46,
        44,
        38,
        33
    ],
    "finished": true
}