{
    "category": [
        "hardware/OS",
        "feature request"
    ],
    "commits": [
        {
            "associated_pull_request": [],
            "date": "2017-04-30 16:46:02",
            "diff": "transmission_transmission/issue_250/commit_efaa9d0ddc7f990cc997a1b8b00bd6bc980f2978.diff",
            "diff_additions": 27,
            "diff_deletions": 27,
            "diff_file_size": 108229,
            "diff_url": "https://github.com/transmission/transmission/commit/efaa9d0ddc7f990cc997a1b8b00bd6bc980f2978.diff",
            "exists": true,
            "files": [
                {
                    "file_additions": 3,
                    "file_deletions": 3,
                    "file_exists": true,
                    "file_name": "libtransmission/clients.c",
                    "file_size": 26792
                },
                {
                    "file_additions": 9,
                    "file_deletions": 9,
                    "file_exists": true,
                    "file_name": "libtransmission/net.c",
                    "file_size": 20928
                },
                {
                    "file_additions": 9,
                    "file_deletions": 9,
                    "file_exists": true,
                    "file_name": "libtransmission/tr-lpd.c",
                    "file_size": 21415
                },
                {
                    "file_additions": 3,
                    "file_deletions": 3,
                    "file_exists": true,
                    "file_name": "libtransmission/tr-udp.c",
                    "file_size": 10697
                },
                {
                    "file_additions": 2,
                    "file_deletions": 2,
                    "file_exists": true,
                    "file_name": "libtransmission/trevent.c",
                    "file_size": 8078
                },
                {
                    "file_additions": 1,
                    "file_deletions": 1,
                    "file_exists": true,
                    "file_name": "libtransmission/web.c",
                    "file_size": 20319
                }
            ],
            "interesting": {
                "reopen": false,
                "status": false
            },
            "is_parent": true,
            "sha": "efaa9d0ddc7f990cc997a1b8b00bd6bc980f2978"
        },
        {
            "associated_pull_request": [],
            "date": "2017-04-30 18:18:02",
            "diff": "transmission_transmission/issue_250/commit_ac4fa04277f3fda6db832c3db399eb0f94ca6581.diff",
            "diff_additions": 10,
            "diff_deletions": 2,
            "diff_file_size": 15171,
            "diff_url": "https://github.com/transmission/transmission/commit/ac4fa04277f3fda6db832c3db399eb0f94ca6581.diff",
            "exists": true,
            "files": [
                {
                    "file_additions": 10,
                    "file_deletions": 2,
                    "file_exists": true,
                    "file_name": "libtransmission/announcer-http.c",
                    "file_size": 15171
                }
            ],
            "interesting": {
                "reopen": true,
                "status": false
            },
            "is_parent": false,
            "sha": "ac4fa04277f3fda6db832c3db399eb0f94ca6581"
        },
        {
            "associated_pull_request": [],
            "date": "2017-05-01 09:31:01",
            "diff": "transmission_transmission/issue_250/commit_6a74bd438c7ca2da168133468b80798caaba5b68.diff",
            "diff_additions": 3,
            "diff_deletions": 11,
            "diff_file_size": 71880,
            "diff_url": "https://github.com/transmission/transmission/commit/6a74bd438c7ca2da168133468b80798caaba5b68.diff",
            "exists": true,
            "files": [
                {
                    "file_additions": 2,
                    "file_deletions": 10,
                    "file_exists": true,
                    "file_name": "libtransmission/announcer-http.c",
                    "file_size": 15171
                },
                {
                    "file_additions": 1,
                    "file_deletions": 1,
                    "file_exists": true,
                    "file_name": "libtransmission/announcer.c",
                    "file_size": 56709
                }
            ],
            "interesting": {
                "reopen": false,
                "status": false
            },
            "is_parent": false,
            "sha": "6a74bd438c7ca2da168133468b80798caaba5b68"
        }
    ],
    "first_commit": "2017-04-30 16:47:18",
    "last_commit": "2017-05-01 09:33:55",
    "number": 250,
    "pull_request": "None",
    "score": {
        "accidental_reopen_likely": false,
        "all_labels": [
            "comp:core",
            "enhancement"
        ],
        "contains_keywords": [
            "confirm",
            "error",
            "test",
            "fix",
            "issu",
            "work"
        ],
        "fix_size": 15,
        "has_labels": [],
        "intersecting": {
            "computed_score": 0.8666666666666667,
            "final_commit_size": 15,
            "intersection_size": 13,
            "previous_commits_size": 13
        },
        "is_makefile_based": true,
        "no_new_files": [
            "libtransmission/announcer.c"
        ],
        "no_other_files": true,
        "num_prohibited_files": 32172,
        "prohibited_files": [
            "hal/inc/pinmap_hal.h",
            "Debug/marvin.bin",
            "Debug/marvin.elf",
            "Debug/marvin.hex",
            "Debug/marvin.bin",
            "Debug/marvin.elf",
            "Debug/marvin.hex",
            "inc/spark_utilities.h",
            "Debug/marvin.bin",
            "Debug/marvin.elf"
        ],
        "reopen": true,
        "reopen_events": [
            [
                "2017-04-30 18:22:04",
                "closed"
            ],
            [
                "2017-04-30 18:22:04",
                "commit"
            ],
            [
                "2017-05-01 09:21:04",
                "reopened"
            ],
            [
                "2017-05-01 09:34:33",
                "closed"
            ],
            [
                "2017-05-01 09:34:33",
                "commit"
            ],
            [
                "2020-07-13 14:16:43",
                "commit"
            ],
            [
                "2020-08-03 10:59:46",
                "commit"
            ]
        ],
        "status": false,
        "strategy": true,
        "total_changes": 80
    }
}