{
    "covered_issues": [
        775,
        771,
        768,
        767,
        760,
        756,
        754,
        753,
        744,
        735,
        538,
        513,
        406,
        314,
        193,
        153,
        150,
        149,
        147,
        143,
        140,
        138,
        136,
        134,
        132,
        131,
        130,
        129,
        124,
        121,
        119,
        117,
        116,
        115,
        112,
        107,
        103,
        101,
        99,
        98,
        96,
        94,
        93,
        92,
        91,
        88,
        86,
        84,
        80,
        79,
        77,
        75,
        73,
        72,
        71,
        69,
        67,
        65,
        62,
        58,
        56,
        55,
        54,
        49,
        48,
        47,
        46,
        43,
        42,
        41,
        39,
        35,
        34,
        30,
        29,
        25,
        24,
        23,
        22,
        21,
        20,
        19,
        18,
        17,
        14,
        10,
        9,
        8,
        7,
        6,
        5,
        4,
        3,
        2,
        1
    ],
    "finished": true
}