{
    "covered_issues": [
        146,
        145,
        143,
        141,
        140,
        138,
        135,
        132,
        128,
        127,
        126,
        124,
        123,
        122,
        119,
        118,
        115,
        114,
        111,
        109,
        108,
        107,
        104,
        103,
        102,
        98,
        97,
        96,
        94,
        93,
        92,
        91,
        90,
        88,
        87,
        86,
        85,
        84,
        83,
        82,
        81,
        80,
        79,
        76,
        75,
        73,
        71,
        65,
        64,
        63,
        61,
        60,
        57,
        56,
        55,
        54,
        53,
        52,
        51,
        50,
        49,
        47,
        45,
        44,
        42,
        39,
        38,
        37,
        36,
        35,
        34,
        33,
        28,
        27,
        26,
        25,
        24,
        22,
        21,
        20,
        18,
        15,
        14,
        13,
        12,
        11,
        10,
        9,
        8,
        7,
        6,
        2
    ],
    "finished": true
}