{
    "category": [
        "memory",
        "build/refactor/preprocessing"
    ],
    "commits": [
        {
            "associated_pull_request": [],
            "date": "2017-07-14 17:38:13",
            "diff": "jerryscript-project_jerryscript/issue_1917/commit_982db6236cdd1406b2b1138958bc5ee3fe18b669.diff",
            "diff_additions": 189,
            "diff_deletions": 17,
            "diff_file_size": 49051,
            "diff_url": "https://github.com/jerryscript-project/jerryscript/commit/982db6236cdd1406b2b1138958bc5ee3fe18b669.diff",
            "exists": true,
            "files": [
                {
                    "file_additions": 133,
                    "file_deletions": 0,
                    "file_exists": true,
                    "file_name": "jerry-core/ecma/base/ecma-helpers-conversion.c",
                    "file_size": 24782
                },
                {
                    "file_additions": 56,
                    "file_deletions": 17,
                    "file_exists": true,
                    "file_name": "jerry-core/ecma/builtin-objects/ecma-builtin-number-prototype.c",
                    "file_size": 24269
                }
            ],
            "interesting": {
                "reopen": false,
                "status": false
            },
            "is_parent": true,
            "sha": "982db6236cdd1406b2b1138958bc5ee3fe18b669"
        },
        {
            "associated_pull_request": [],
            "date": "2017-07-18 13:14:15",
            "diff": "jerryscript-project_jerryscript/issue_1917/commit_895a7001d32b3caf76a50ea5346388d9acd390b9.diff",
            "diff_additions": 2,
            "diff_deletions": 2,
            "diff_file_size": 28193,
            "diff_url": "https://github.com/jerryscript-project/jerryscript/commit/895a7001d32b3caf76a50ea5346388d9acd390b9.diff",
            "exists": true,
            "files": [
                {
                    "file_additions": 2,
                    "file_deletions": 2,
                    "file_exists": true,
                    "file_name": "jerry-core/jmem/jmem-heap.c",
                    "file_size": 28193
                }
            ],
            "interesting": {
                "reopen": false,
                "status": false
            },
            "is_parent": false,
            "sha": "895a7001d32b3caf76a50ea5346388d9acd390b9"
        },
        {
            "associated_pull_request": [],
            "date": "2017-07-18 13:38:33",
            "diff": "jerryscript-project_jerryscript/issue_1917/commit_309b6cead97f17b35343043549b5487a6677424e.diff",
            "diff_additions": 2,
            "diff_deletions": 2,
            "diff_file_size": 28193,
            "diff_url": "https://github.com/jerryscript-project/jerryscript/commit/309b6cead97f17b35343043549b5487a6677424e.diff",
            "exists": true,
            "files": [
                {
                    "file_additions": 2,
                    "file_deletions": 2,
                    "file_exists": true,
                    "file_name": "jerry-core/jmem/jmem-heap.c",
                    "file_size": 28193
                }
            ],
            "interesting": {
                "reopen": false,
                "status": true
            },
            "is_parent": false,
            "sha": "309b6cead97f17b35343043549b5487a6677424e"
        },
        {
            "associated_pull_request": [],
            "date": "2017-07-18 13:38:33",
            "diff": "jerryscript-project_jerryscript/issue_1917/commit_2494a79d8cc47d436dac60de69bde5e2c1cdca86.diff",
            "diff_additions": 2,
            "diff_deletions": 2,
            "diff_file_size": 28193,
            "diff_url": "https://github.com/jerryscript-project/jerryscript/commit/2494a79d8cc47d436dac60de69bde5e2c1cdca86.diff",
            "exists": true,
            "files": [
                {
                    "file_additions": 2,
                    "file_deletions": 2,
                    "file_exists": true,
                    "file_name": "jerry-core/jmem/jmem-heap.c",
                    "file_size": 28193
                }
            ],
            "interesting": {
                "reopen": false,
                "status": false
            },
            "is_parent": false,
            "sha": "2494a79d8cc47d436dac60de69bde5e2c1cdca86"
        },
        {
            "associated_pull_request": [],
            "date": "2017-07-18 13:38:33",
            "diff": "jerryscript-project_jerryscript/issue_1917/commit_f19389de729a7b9e872a2c59bd9f586343991764.diff",
            "diff_additions": 10,
            "diff_deletions": 7,
            "diff_file_size": 49889,
            "diff_url": "https://github.com/jerryscript-project/jerryscript/commit/f19389de729a7b9e872a2c59bd9f586343991764.diff",
            "exists": true,
            "files": [
                {
                    "file_additions": 10,
                    "file_deletions": 7,
                    "file_exists": true,
                    "file_name": "jerry-core/ecma/builtin-objects/ecma-builtin-string-prototype.c",
                    "file_size": 49889
                }
            ],
            "interesting": {
                "reopen": false,
                "status": true
            },
            "is_parent": false,
            "sha": "f19389de729a7b9e872a2c59bd9f586343991764"
        },
        {
            "associated_pull_request": [],
            "date": "2017-07-18 13:38:33",
            "diff": "jerryscript-project_jerryscript/issue_1917/commit_f0a9a90c3246df6e5ebe2139a2c6c0a107ae2221.diff",
            "diff_additions": 9,
            "diff_deletions": 6,
            "diff_file_size": 49889,
            "diff_url": "https://github.com/jerryscript-project/jerryscript/commit/f0a9a90c3246df6e5ebe2139a2c6c0a107ae2221.diff",
            "exists": true,
            "files": [
                {
                    "file_additions": 9,
                    "file_deletions": 6,
                    "file_exists": true,
                    "file_name": "jerry-core/ecma/builtin-objects/ecma-builtin-string-prototype.c",
                    "file_size": 49889
                }
            ],
            "interesting": {
                "reopen": false,
                "status": true
            },
            "is_parent": false,
            "sha": "f0a9a90c3246df6e5ebe2139a2c6c0a107ae2221"
        },
        {
            "associated_pull_request": [
                "https://github.com/jerryscript-project/jerryscript/pull/1926"
            ],
            "date": "2017-07-18 13:38:33",
            "diff": "jerryscript-project_jerryscript/issue_1917/commit_4cb51cdb500d25774bbf2e8467f907de3352b67f.diff",
            "diff_additions": 9,
            "diff_deletions": 6,
            "diff_file_size": 49889,
            "diff_url": "https://github.com/jerryscript-project/jerryscript/commit/4cb51cdb500d25774bbf2e8467f907de3352b67f.diff",
            "exists": true,
            "files": [
                {
                    "file_additions": 9,
                    "file_deletions": 6,
                    "file_exists": true,
                    "file_name": "jerry-core/ecma/builtin-objects/ecma-builtin-string-prototype.c",
                    "file_size": 49889
                }
            ],
            "interesting": {
                "reopen": false,
                "status": false
            },
            "is_parent": false,
            "sha": "4cb51cdb500d25774bbf2e8467f907de3352b67f"
        },
        {
            "associated_pull_request": [
                "https://github.com/jerryscript-project/jerryscript/pull/1926"
            ],
            "date": "2017-07-20 08:26:51",
            "diff": "jerryscript-project_jerryscript/issue_1917/commit_d75710cf27ecbe9ead2e6a7768e17bc7ffd3f765.diff",
            "diff_additions": 9,
            "diff_deletions": 6,
            "diff_file_size": 49889,
            "diff_url": "https://github.com/jerryscript-project/jerryscript/commit/d75710cf27ecbe9ead2e6a7768e17bc7ffd3f765.diff",
            "exists": true,
            "files": [
                {
                    "file_additions": 9,
                    "file_deletions": 6,
                    "file_exists": true,
                    "file_name": "jerry-core/ecma/builtin-objects/ecma-builtin-string-prototype.c",
                    "file_size": 49889
                }
            ],
            "interesting": {
                "reopen": false,
                "status": false
            },
            "is_parent": false,
            "sha": "d75710cf27ecbe9ead2e6a7768e17bc7ffd3f765"
        }
    ],
    "first_commit": "2017-07-18 13:26:13",
    "last_commit": "2017-07-20 08:26:51",
    "number": 1917,
    "pull_request": "None",
    "score": {
        "accidental_reopen_likely": false,
        "all_labels": [],
        "contains_keywords": [],
        "fix_size": 17,
        "has_labels": [],
        "intersecting": {
            "computed_score": 1.0,
            "final_commit_size": 12,
            "intersection_size": 12,
            "previous_commits_size": 17
        },
        "is_makefile_based": true,
        "no_new_files": [],
        "no_other_files": false,
        "num_prohibited_files": 145780,
        "prohibited_files": [
            "kill.h",
            "meminfo.h",
            "kill.h",
            "meminfo.h",
            "kill.h",
            "meminfo.h",
            "testsuite_cli_test.go",
            "testsuite_cli_test.go",
            "common.mk",
            "i3bar/include/draw_util.h"
        ],
        "reopen": false,
        "reopen_events": [
            [
                "2017-07-18 13:29:24",
                "commit"
            ],
            [
                "2017-07-18 13:40:35",
                "commit"
            ],
            [
                "2017-07-18 14:02:39",
                "commit"
            ],
            [
                "2017-07-19 10:01:44",
                "commit"
            ],
            [
                "2017-07-19 11:19:35",
                "commit"
            ],
            [
                "2017-07-19 11:36:06",
                "commit"
            ],
            [
                "2017-07-20 08:26:51",
                "closed"
            ],
            [
                "2017-07-20 08:26:54",
                "commit"
            ]
        ],
        "status": true,
        "strategy": true,
        "total_changes": 280
    }
}