{
    "covered_issues": [
        22,
        21,
        20,
        19,
        16,
        14,
        9,
        8,
        6,
        5,
        4,
        3,
        2,
        1
    ],
    "finished": true
}