{
    "category": [
        "memory"
    ],
    "commits": [
        {
            "associated_pull_request": [],
            "date": "2015-09-11 00:50:47",
            "diff": "",
            "diff_additions": 0,
            "diff_deletions": 0,
            "diff_file_size": 0,
            "diff_url": "https://github.com/ElementsProject/lightning/commit/71c56e03608dd2162fcc66c80a58bad7aa71a4a0.diff",
            "exists": true,
            "files": [],
            "interesting": {
                "reopen": false,
                "status": false
            },
            "is_parent": true,
            "sha": "71c56e03608dd2162fcc66c80a58bad7aa71a4a0"
        },
        {
            "associated_pull_request": [],
            "date": "2017-09-08 07:42:57",
            "diff": "elementsproject_lightning/issue_4/commit_a9556fca15e5730ebb066f1498b27d2815ef1aa9.diff",
            "diff_additions": 162,
            "diff_deletions": 139,
            "diff_file_size": 0,
            "diff_url": "https://github.com/ElementsProject/lightning/commit/a9556fca15e5730ebb066f1498b27d2815ef1aa9.diff",
            "exists": true,
            "files": [
                {
                    "file_additions": 162,
                    "file_deletions": 139,
                    "file_exists": false,
                    "file_name": "channeld/channel.c",
                    "file_size": 0
                }
            ],
            "interesting": {
                "reopen": false,
                "status": false
            },
            "is_parent": false,
            "sha": "a9556fca15e5730ebb066f1498b27d2815ef1aa9"
        },
        {
            "associated_pull_request": [],
            "date": "2017-09-08 10:26:17",
            "diff": "elementsproject_lightning/issue_4/commit_4914558d18017a74a2ad757f9f7c97ba6fa68b91.diff",
            "diff_additions": 163,
            "diff_deletions": 140,
            "diff_file_size": 0,
            "diff_url": "https://github.com/ElementsProject/lightning/commit/4914558d18017a74a2ad757f9f7c97ba6fa68b91.diff",
            "exists": true,
            "files": [
                {
                    "file_additions": 163,
                    "file_deletions": 140,
                    "file_exists": false,
                    "file_name": "channeld/channel.c",
                    "file_size": 0
                }
            ],
            "interesting": {
                "reopen": false,
                "status": false
            },
            "is_parent": false,
            "sha": "4914558d18017a74a2ad757f9f7c97ba6fa68b91"
        },
        {
            "associated_pull_request": [
                "https://github.com/ElementsProject/lightning/pull/269"
            ],
            "date": "2017-09-08 11:08:15",
            "diff": "elementsproject_lightning/issue_4/commit_373134b094c8ffbe449a70733d1d8186ebeab19b.diff",
            "diff_additions": 163,
            "diff_deletions": 140,
            "diff_file_size": 0,
            "diff_url": "https://github.com/ElementsProject/lightning/commit/373134b094c8ffbe449a70733d1d8186ebeab19b.diff",
            "exists": true,
            "files": [
                {
                    "file_additions": 163,
                    "file_deletions": 140,
                    "file_exists": false,
                    "file_name": "channeld/channel.c",
                    "file_size": 0
                }
            ],
            "interesting": {
                "reopen": false,
                "status": false
            },
            "is_parent": false,
            "sha": "373134b094c8ffbe449a70733d1d8186ebeab19b"
        },
        {
            "associated_pull_request": [
                "https://github.com/ElementsProject/lightning/pull/269"
            ],
            "date": "2017-09-08 11:08:15",
            "diff": "elementsproject_lightning/issue_4/commit_cc34f572ca60cb030c7705d6f5e5497b89fe5c25.diff",
            "diff_additions": 163,
            "diff_deletions": 140,
            "diff_file_size": 0,
            "diff_url": "https://github.com/ElementsProject/lightning/commit/cc34f572ca60cb030c7705d6f5e5497b89fe5c25.diff",
            "exists": true,
            "files": [
                {
                    "file_additions": 163,
                    "file_deletions": 140,
                    "file_exists": false,
                    "file_name": "channeld/channel.c",
                    "file_size": 0
                }
            ],
            "interesting": {
                "reopen": false,
                "status": false
            },
            "is_parent": false,
            "sha": "cc34f572ca60cb030c7705d6f5e5497b89fe5c25"
        },
        {
            "associated_pull_request": [
                "https://github.com/ElementsProject/lightning/pull/1861"
            ],
            "date": "2018-08-22 00:09:57",
            "diff": "elementsproject_lightning/issue_4/commit_9f175deecdff6b047463e8fd9674009bef448172.diff",
            "diff_additions": 18,
            "diff_deletions": 5,
            "diff_file_size": 79380,
            "diff_url": "https://github.com/ElementsProject/lightning/commit/9f175deecdff6b047463e8fd9674009bef448172.diff",
            "exists": true,
            "files": [
                {
                    "file_additions": 12,
                    "file_deletions": 5,
                    "file_exists": false,
                    "file_name": "channeld/channel.c",
                    "file_size": 0
                },
                {
                    "file_additions": 6,
                    "file_deletions": 0,
                    "file_exists": true,
                    "file_name": "lightningd/peer_htlcs.c",
                    "file_size": 79380
                }
            ],
            "interesting": {
                "reopen": false,
                "status": false
            },
            "is_parent": false,
            "sha": "9f175deecdff6b047463e8fd9674009bef448172"
        },
        {
            "associated_pull_request": [],
            "date": "2017-11-10 04:25:48",
            "diff": "elementsproject_lightning/issue_4/commit_d08567639c585945c40b138e932dea48f7d418f2.diff",
            "diff_additions": 45,
            "diff_deletions": 20,
            "diff_file_size": 0,
            "diff_url": "https://github.com/ElementsProject/lightning/commit/d08567639c585945c40b138e932dea48f7d418f2.diff",
            "exists": true,
            "files": [
                {
                    "file_additions": 45,
                    "file_deletions": 20,
                    "file_exists": false,
                    "file_name": "privatebet/bet.c",
                    "file_size": 0
                }
            ],
            "interesting": {
                "reopen": false,
                "status": false
            },
            "is_parent": false,
            "sha": "d08567639c585945c40b138e932dea48f7d418f2"
        },
        {
            "associated_pull_request": [
                "https://github.com/ElementsProject/lightning/pull/2268"
            ],
            "date": "2019-01-15 09:37:57",
            "diff": "elementsproject_lightning/issue_4/commit_0ba547ee101efe7c5b14a7fbcf41b5088efc2504.diff",
            "diff_additions": 44,
            "diff_deletions": 16,
            "diff_file_size": 61723,
            "diff_url": "https://github.com/ElementsProject/lightning/commit/0ba547ee101efe7c5b14a7fbcf41b5088efc2504.diff",
            "exists": true,
            "files": [
                {
                    "file_additions": 44,
                    "file_deletions": 16,
                    "file_exists": true,
                    "file_name": "gossipd/gossipd.c",
                    "file_size": 61723
                }
            ],
            "interesting": {
                "reopen": false,
                "status": true
            },
            "is_parent": false,
            "sha": "0ba547ee101efe7c5b14a7fbcf41b5088efc2504"
        },
        {
            "associated_pull_request": [],
            "date": "2019-01-15 09:37:57",
            "diff": "elementsproject_lightning/issue_4/commit_36bfe3a4e06d08ca874343eea584be88dc68b97a.diff",
            "diff_additions": 44,
            "diff_deletions": 16,
            "diff_file_size": 61723,
            "diff_url": "https://github.com/ElementsProject/lightning/commit/36bfe3a4e06d08ca874343eea584be88dc68b97a.diff",
            "exists": true,
            "files": [
                {
                    "file_additions": 44,
                    "file_deletions": 16,
                    "file_exists": true,
                    "file_name": "gossipd/gossipd.c",
                    "file_size": 61723
                }
            ],
            "interesting": {
                "reopen": false,
                "status": false
            },
            "is_parent": false,
            "sha": "36bfe3a4e06d08ca874343eea584be88dc68b97a"
        },
        {
            "associated_pull_request": [],
            "date": "2019-01-15 09:37:57",
            "diff": "elementsproject_lightning/issue_4/commit_846c60cd0872de7ece362d9a76aabb46315158f1.diff",
            "diff_additions": 44,
            "diff_deletions": 16,
            "diff_file_size": 61723,
            "diff_url": "https://github.com/ElementsProject/lightning/commit/846c60cd0872de7ece362d9a76aabb46315158f1.diff",
            "exists": true,
            "files": [
                {
                    "file_additions": 44,
                    "file_deletions": 16,
                    "file_exists": true,
                    "file_name": "gossipd/gossipd.c",
                    "file_size": 61723
                }
            ],
            "interesting": {
                "reopen": false,
                "status": false
            },
            "is_parent": false,
            "sha": "846c60cd0872de7ece362d9a76aabb46315158f1"
        },
        {
            "associated_pull_request": [
                "https://github.com/ElementsProject/lightning/pull/2729"
            ],
            "date": "2019-06-14 03:49:23",
            "diff": "elementsproject_lightning/issue_4/commit_ddc44a110999eda710c36207adf963073887aa66.diff",
            "diff_additions": 20,
            "diff_deletions": 12,
            "diff_file_size": 345797,
            "diff_url": "https://github.com/ElementsProject/lightning/commit/ddc44a110999eda710c36207adf963073887aa66.diff",
            "exists": true,
            "files": [
                {
                    "file_additions": 1,
                    "file_deletions": 1,
                    "file_exists": true,
                    "file_name": "lightningd/bitcoind.c",
                    "file_size": 22650
                },
                {
                    "file_additions": 1,
                    "file_deletions": 1,
                    "file_exists": true,
                    "file_name": "lightningd/connect_control.c",
                    "file_size": 11589
                },
                {
                    "file_additions": 1,
                    "file_deletions": 1,
                    "file_exists": true,
                    "file_name": "lightningd/io_loop_with_timers.c",
                    "file_size": 1126
                },
                {
                    "file_additions": 2,
                    "file_deletions": 2,
                    "file_exists": true,
                    "file_name": "lightningd/jsonrpc.c",
                    "file_size": 40031
                },
                {
                    "file_additions": 11,
                    "file_deletions": 3,
                    "file_exists": true,
                    "file_name": "lightningd/lightningd.c",
                    "file_size": 44270
                },
                {
                    "file_additions": 1,
                    "file_deletions": 1,
                    "file_exists": true,
                    "file_name": "lightningd/memdump.c",
                    "file_size": 8745
                },
                {
                    "file_additions": 1,
                    "file_deletions": 1,
                    "file_exists": true,
                    "file_name": "lightningd/pay.c",
                    "file_size": 52656
                },
                {
                    "file_additions": 1,
                    "file_deletions": 1,
                    "file_exists": true,
                    "file_name": "lightningd/peer_control.c",
                    "file_size": 85350
                },
                {
                    "file_additions": 1,
                    "file_deletions": 1,
                    "file_exists": true,
                    "file_name": "lightningd/peer_htlcs.c",
                    "file_size": 79380
                }
            ],
            "interesting": {
                "reopen": false,
                "status": false
            },
            "is_parent": false,
            "sha": "ddc44a110999eda710c36207adf963073887aa66"
        },
        {
            "associated_pull_request": [
                "https://github.com/ElementsProject/lightning/pull/2729"
            ],
            "date": "2019-06-14 03:50:07",
            "diff": "elementsproject_lightning/issue_4/commit_8b7d14c163e97723591bc68dc824d54f447f8752.diff",
            "diff_additions": 6,
            "diff_deletions": 0,
            "diff_file_size": 40031,
            "diff_url": "https://github.com/ElementsProject/lightning/commit/8b7d14c163e97723591bc68dc824d54f447f8752.diff",
            "exists": true,
            "files": [
                {
                    "file_additions": 6,
                    "file_deletions": 0,
                    "file_exists": true,
                    "file_name": "lightningd/jsonrpc.c",
                    "file_size": 40031
                }
            ],
            "interesting": {
                "reopen": false,
                "status": false
            },
            "is_parent": false,
            "sha": "8b7d14c163e97723591bc68dc824d54f447f8752"
        },
        {
            "associated_pull_request": [
                "https://github.com/ElementsProject/lightning/pull/2729"
            ],
            "date": "2019-06-14 03:53:25",
            "diff": "elementsproject_lightning/issue_4/commit_f7257cadd75a1dd3d3e90aa99d09364aeadba088.diff",
            "diff_additions": 5,
            "diff_deletions": 0,
            "diff_file_size": 34912,
            "diff_url": "https://github.com/ElementsProject/lightning/commit/f7257cadd75a1dd3d3e90aa99d09364aeadba088.diff",
            "exists": true,
            "files": [
                {
                    "file_additions": 5,
                    "file_deletions": 0,
                    "file_exists": true,
                    "file_name": "lightningd/chaintopology.c",
                    "file_size": 34912
                }
            ],
            "interesting": {
                "reopen": false,
                "status": false
            },
            "is_parent": false,
            "sha": "f7257cadd75a1dd3d3e90aa99d09364aeadba088"
        },
        {
            "associated_pull_request": [
                "https://github.com/ElementsProject/lightning/pull/2729"
            ],
            "date": "2019-06-14 03:53:25",
            "diff": "elementsproject_lightning/issue_4/commit_2cf6ae748af695a8bbfbbd241882fd9f41cec86c.diff",
            "diff_additions": 12,
            "diff_deletions": 0,
            "diff_file_size": 4002,
            "diff_url": "https://github.com/ElementsProject/lightning/commit/2cf6ae748af695a8bbfbbd241882fd9f41cec86c.diff",
            "exists": true,
            "files": [
                {
                    "file_additions": 12,
                    "file_deletions": 0,
                    "file_exists": true,
                    "file_name": "wallet/txfilter.c",
                    "file_size": 4002
                }
            ],
            "interesting": {
                "reopen": false,
                "status": false
            },
            "is_parent": false,
            "sha": "2cf6ae748af695a8bbfbbd241882fd9f41cec86c"
        },
        {
            "associated_pull_request": [
                "https://github.com/ElementsProject/lightning/pull/2729"
            ],
            "date": "2019-06-14 03:53:25",
            "diff": "elementsproject_lightning/issue_4/commit_ad7c7920e29c59e51046c9722b72271a53e23b31.diff",
            "diff_additions": 4,
            "diff_deletions": 0,
            "diff_file_size": 44270,
            "diff_url": "https://github.com/ElementsProject/lightning/commit/ad7c7920e29c59e51046c9722b72271a53e23b31.diff",
            "exists": true,
            "files": [
                {
                    "file_additions": 4,
                    "file_deletions": 0,
                    "file_exists": true,
                    "file_name": "lightningd/lightningd.c",
                    "file_size": 44270
                }
            ],
            "interesting": {
                "reopen": false,
                "status": false
            },
            "is_parent": false,
            "sha": "ad7c7920e29c59e51046c9722b72271a53e23b31"
        },
        {
            "associated_pull_request": [],
            "date": "2019-06-14 03:49:23",
            "diff": "elementsproject_lightning/issue_4/commit_d5bd1682f5cde03e9ad5c16cf526ac937cbdee27.diff",
            "diff_additions": 20,
            "diff_deletions": 12,
            "diff_file_size": 345797,
            "diff_url": "https://github.com/ElementsProject/lightning/commit/d5bd1682f5cde03e9ad5c16cf526ac937cbdee27.diff",
            "exists": true,
            "files": [
                {
                    "file_additions": 1,
                    "file_deletions": 1,
                    "file_exists": true,
                    "file_name": "lightningd/bitcoind.c",
                    "file_size": 22650
                },
                {
                    "file_additions": 1,
                    "file_deletions": 1,
                    "file_exists": true,
                    "file_name": "lightningd/connect_control.c",
                    "file_size": 11589
                },
                {
                    "file_additions": 1,
                    "file_deletions": 1,
                    "file_exists": true,
                    "file_name": "lightningd/io_loop_with_timers.c",
                    "file_size": 1126
                },
                {
                    "file_additions": 2,
                    "file_deletions": 2,
                    "file_exists": true,
                    "file_name": "lightningd/jsonrpc.c",
                    "file_size": 40031
                },
                {
                    "file_additions": 11,
                    "file_deletions": 3,
                    "file_exists": true,
                    "file_name": "lightningd/lightningd.c",
                    "file_size": 44270
                },
                {
                    "file_additions": 1,
                    "file_deletions": 1,
                    "file_exists": true,
                    "file_name": "lightningd/memdump.c",
                    "file_size": 8745
                },
                {
                    "file_additions": 1,
                    "file_deletions": 1,
                    "file_exists": true,
                    "file_name": "lightningd/pay.c",
                    "file_size": 52656
                },
                {
                    "file_additions": 1,
                    "file_deletions": 1,
                    "file_exists": true,
                    "file_name": "lightningd/peer_control.c",
                    "file_size": 85350
                },
                {
                    "file_additions": 1,
                    "file_deletions": 1,
                    "file_exists": true,
                    "file_name": "lightningd/peer_htlcs.c",
                    "file_size": 79380
                }
            ],
            "interesting": {
                "reopen": false,
                "status": false
            },
            "is_parent": false,
            "sha": "d5bd1682f5cde03e9ad5c16cf526ac937cbdee27"
        },
        {
            "associated_pull_request": [],
            "date": "2019-06-14 03:50:07",
            "diff": "elementsproject_lightning/issue_4/commit_ef541afd8a64252c0c8c2acba9d3c4eeb02b1b7e.diff",
            "diff_additions": 6,
            "diff_deletions": 0,
            "diff_file_size": 40031,
            "diff_url": "https://github.com/ElementsProject/lightning/commit/ef541afd8a64252c0c8c2acba9d3c4eeb02b1b7e.diff",
            "exists": true,
            "files": [
                {
                    "file_additions": 6,
                    "file_deletions": 0,
                    "file_exists": true,
                    "file_name": "lightningd/jsonrpc.c",
                    "file_size": 40031
                }
            ],
            "interesting": {
                "reopen": false,
                "status": false
            },
            "is_parent": false,
            "sha": "ef541afd8a64252c0c8c2acba9d3c4eeb02b1b7e"
        },
        {
            "associated_pull_request": [],
            "date": "2019-06-14 03:53:25",
            "diff": "elementsproject_lightning/issue_4/commit_7c760dafe2846c20f30ba59a2668c528480419e0.diff",
            "diff_additions": 5,
            "diff_deletions": 0,
            "diff_file_size": 34912,
            "diff_url": "https://github.com/ElementsProject/lightning/commit/7c760dafe2846c20f30ba59a2668c528480419e0.diff",
            "exists": true,
            "files": [
                {
                    "file_additions": 5,
                    "file_deletions": 0,
                    "file_exists": true,
                    "file_name": "lightningd/chaintopology.c",
                    "file_size": 34912
                }
            ],
            "interesting": {
                "reopen": false,
                "status": false
            },
            "is_parent": false,
            "sha": "7c760dafe2846c20f30ba59a2668c528480419e0"
        },
        {
            "associated_pull_request": [],
            "date": "2019-06-14 03:53:25",
            "diff": "elementsproject_lightning/issue_4/commit_aba7c7cc755e03ab77ef5e4f975f42897885fc63.diff",
            "diff_additions": 12,
            "diff_deletions": 0,
            "diff_file_size": 4002,
            "diff_url": "https://github.com/ElementsProject/lightning/commit/aba7c7cc755e03ab77ef5e4f975f42897885fc63.diff",
            "exists": true,
            "files": [
                {
                    "file_additions": 12,
                    "file_deletions": 0,
                    "file_exists": true,
                    "file_name": "wallet/txfilter.c",
                    "file_size": 4002
                }
            ],
            "interesting": {
                "reopen": false,
                "status": false
            },
            "is_parent": false,
            "sha": "aba7c7cc755e03ab77ef5e4f975f42897885fc63"
        },
        {
            "associated_pull_request": [],
            "date": "2019-06-14 03:53:25",
            "diff": "elementsproject_lightning/issue_4/commit_267d6275210af2df0eade8a0d43e451f8378cfd4.diff",
            "diff_additions": 4,
            "diff_deletions": 0,
            "diff_file_size": 44270,
            "diff_url": "https://github.com/ElementsProject/lightning/commit/267d6275210af2df0eade8a0d43e451f8378cfd4.diff",
            "exists": true,
            "files": [
                {
                    "file_additions": 4,
                    "file_deletions": 0,
                    "file_exists": true,
                    "file_name": "lightningd/lightningd.c",
                    "file_size": 44270
                }
            ],
            "interesting": {
                "reopen": false,
                "status": false
            },
            "is_parent": false,
            "sha": "267d6275210af2df0eade8a0d43e451f8378cfd4"
        },
        {
            "associated_pull_request": [
                "https://github.com/ElementsProject/lightning/pull/2268"
            ],
            "date": "2019-01-15 09:37:57",
            "diff": "elementsproject_lightning/issue_4/commit_e81f61b319b84ab248d8ca5c65cbc2176714f737.diff",
            "diff_additions": 44,
            "diff_deletions": 16,
            "diff_file_size": 61723,
            "diff_url": "https://github.com/ElementsProject/lightning/commit/e81f61b319b84ab248d8ca5c65cbc2176714f737.diff",
            "exists": true,
            "files": [
                {
                    "file_additions": 44,
                    "file_deletions": 16,
                    "file_exists": true,
                    "file_name": "gossipd/gossipd.c",
                    "file_size": 61723
                }
            ],
            "interesting": {
                "reopen": false,
                "status": false
            },
            "is_parent": false,
            "sha": "e81f61b319b84ab248d8ca5c65cbc2176714f737"
        },
        {
            "associated_pull_request": [],
            "date": "2019-01-15 09:37:57",
            "diff": "elementsproject_lightning/issue_4/commit_2ffaa46aeeeabbebe5c2999180f629766a4e915a.diff",
            "diff_additions": 44,
            "diff_deletions": 16,
            "diff_file_size": 61723,
            "diff_url": "https://github.com/ElementsProject/lightning/commit/2ffaa46aeeeabbebe5c2999180f629766a4e915a.diff",
            "exists": true,
            "files": [
                {
                    "file_additions": 44,
                    "file_deletions": 16,
                    "file_exists": true,
                    "file_name": "gossipd/gossipd.c",
                    "file_size": 61723
                }
            ],
            "interesting": {
                "reopen": false,
                "status": false
            },
            "is_parent": false,
            "sha": "2ffaa46aeeeabbebe5c2999180f629766a4e915a"
        }
    ],
    "first_commit": "2015-09-11 00:50:47",
    "last_commit": "2019-01-15 09:37:57",
    "number": 4,
    "pull_request": "None",
    "score": {
        "accidental_reopen_likely": false,
        "all_labels": [],
        "contains_keywords": [
            "report",
            "fix",
            "fault",
            "issu",
            "fail",
            "leak",
            "problem"
        ],
        "fix_size": 462,
        "has_labels": [],
        "intersecting": {
            "computed_score": 0.9827586206896551,
            "final_commit_size": 58,
            "intersection_size": 57,
            "previous_commits_size": 461
        },
        "is_makefile_based": true,
        "no_new_files": [],
        "no_other_files": false,
        "num_prohibited_files": 203402,
        "prohibited_files": [
            "kill.h",
            "meminfo.h",
            "kill.h",
            "meminfo.h",
            "kill.h",
            "meminfo.h",
            "testsuite_cli_test.go",
            "testsuite_cli_test.go",
            "common.mk",
            "i3bar/include/draw_util.h"
        ],
        "reopen": false,
        "reopen_events": [
            [
                "2015-09-14 18:56:45",
                "closed"
            ],
            [
                "2015-09-14 18:56:45",
                "commit"
            ],
            [
                "2017-01-06 03:11:32",
                "commit"
            ],
            [
                "2017-09-08 07:43:43",
                "commit"
            ],
            [
                "2017-09-08 10:24:32",
                "commit"
            ],
            [
                "2017-09-08 10:26:56",
                "commit"
            ],
            [
                "2017-09-08 11:08:32",
                "commit"
            ],
            [
                "2017-09-09 01:01:33",
                "commit"
            ],
            [
                "2018-08-22 16:54:57",
                "commit"
            ],
            [
                "2018-11-23 07:44:32",
                "commit"
            ],
            [
                "2019-01-15 19:34:52",
                "commit"
            ],
            [
                "2019-01-17 09:45:25",
                "commit"
            ],
            [
                "2019-02-15 07:10:11",
                "commit"
            ],
            [
                "2019-06-30 00:01:05",
                "commit"
            ],
            [
                "2019-06-30 00:01:05",
                "commit"
            ],
            [
                "2019-06-30 00:01:05",
                "commit"
            ],
            [
                "2019-06-30 00:01:06",
                "commit"
            ],
            [
                "2019-06-30 00:01:07",
                "commit"
            ],
            [
                "2019-06-30 07:11:53",
                "commit"
            ],
            [
                "2019-06-30 07:11:54",
                "commit"
            ],
            [
                "2019-06-30 07:11:54",
                "commit"
            ],
            [
                "2019-06-30 07:11:55",
                "commit"
            ],
            [
                "2019-06-30 07:11:56",
                "commit"
            ],
            [
                "2019-07-04 15:28:47",
                "commit"
            ],
            [
                "2019-07-04 15:29:38",
                "commit"
            ]
        ],
        "status": true,
        "strategy": true,
        "total_changes": 1716
    }
}