{
    "commits": [
        {
            "associated_pull_request": [],
            "date": "2022-09-19 14:17:53+00:00",
            "diff": "php_php-src/issue_9583/commit_e488f7b0eb5aa0dbc396a17821386d914899e988.diff",
            "diff_additions": 2,
            "diff_deletions": 1,
            "diff_file_size": 145424,
            "diff_url": "https://github.com/php/php-src/commit/e488f7b0eb5aa0dbc396a17821386d914899e988.diff",
            "exists": true,
            "files": [
                {
                    "file_additions": 2,
                    "file_deletions": 1,
                    "file_exists": true,
                    "file_name": "ext/opcache/ZendAccelerator.c",
                    "file_size": 145424
                }
            ],
            "interesting": {
                "reopen": false,
                "status": false
            },
            "is_parent": true,
            "sha": "e488f7b0eb5aa0dbc396a17821386d914899e988"
        },
        {
            "associated_pull_request": [],
            "date": "2022-09-24 11:05:50+00:00",
            "diff": "php_php-src/issue_9583/commit_8b115254c0b0d8aee80b99cb08992dc97cc3f8bc.diff",
            "diff_additions": 2,
            "diff_deletions": 1,
            "diff_file_size": 96722,
            "diff_url": "https://github.com/php/php-src/commit/8b115254c0b0d8aee80b99cb08992dc97cc3f8bc.diff",
            "exists": true,
            "files": [
                {
                    "file_additions": 2,
                    "file_deletions": 1,
                    "file_exists": true,
                    "file_name": "ext/session/session.c",
                    "file_size": 96722
                }
            ],
            "interesting": {
                "reopen": false,
                "status": true
            },
            "is_parent": false,
            "sha": "8b115254c0b0d8aee80b99cb08992dc97cc3f8bc"
        },
        {
            "associated_pull_request": [],
            "date": "2022-09-27 14:53:16+00:00",
            "diff": "php_php-src/issue_9583/commit_72cb47338e5a6bcf784ecae613a5138af7706617.diff",
            "diff_additions": 2,
            "diff_deletions": 1,
            "diff_file_size": 96722,
            "diff_url": "https://github.com/php/php-src/commit/72cb47338e5a6bcf784ecae613a5138af7706617.diff",
            "exists": true,
            "files": [
                {
                    "file_additions": 2,
                    "file_deletions": 1,
                    "file_exists": true,
                    "file_name": "ext/session/session.c",
                    "file_size": 96722
                }
            ],
            "interesting": {
                "reopen": false,
                "status": true
            },
            "is_parent": false,
            "sha": "72cb47338e5a6bcf784ecae613a5138af7706617"
        },
        {
            "associated_pull_request": [],
            "date": "2022-09-27 14:58:30+00:00",
            "diff": "php_php-src/issue_9583/commit_3579ddaaceb1fac3dbe8508660ebeaf7601bfb4b.diff",
            "diff_additions": 2,
            "diff_deletions": 1,
            "diff_file_size": 96722,
            "diff_url": "https://github.com/php/php-src/commit/3579ddaaceb1fac3dbe8508660ebeaf7601bfb4b.diff",
            "exists": true,
            "files": [
                {
                    "file_additions": 2,
                    "file_deletions": 1,
                    "file_exists": true,
                    "file_name": "ext/session/session.c",
                    "file_size": 96722
                }
            ],
            "interesting": {
                "reopen": false,
                "status": true
            },
            "is_parent": false,
            "sha": "3579ddaaceb1fac3dbe8508660ebeaf7601bfb4b"
        },
        {
            "associated_pull_request": [],
            "date": "2022-09-27 14:58:55+00:00",
            "diff": "php_php-src/issue_9583/commit_4b4a439c62444e8be198559406cc6b5e1601c828.diff",
            "diff_additions": 2,
            "diff_deletions": 1,
            "diff_file_size": 96722,
            "diff_url": "https://github.com/php/php-src/commit/4b4a439c62444e8be198559406cc6b5e1601c828.diff",
            "exists": true,
            "files": [
                {
                    "file_additions": 2,
                    "file_deletions": 1,
                    "file_exists": true,
                    "file_name": "ext/session/session.c",
                    "file_size": 96722
                }
            ],
            "interesting": {
                "reopen": false,
                "status": true
            },
            "is_parent": false,
            "sha": "4b4a439c62444e8be198559406cc6b5e1601c828"
        },
        {
            "associated_pull_request": [],
            "date": "2022-09-29 12:31:53+00:00",
            "diff": "php_php-src/issue_9583/commit_39e72195938b1a74d686e393726d758ec19407b7.diff",
            "diff_additions": 4,
            "diff_deletions": 3,
            "diff_file_size": 96722,
            "diff_url": "https://github.com/php/php-src/commit/39e72195938b1a74d686e393726d758ec19407b7.diff",
            "exists": true,
            "files": [
                {
                    "file_additions": 4,
                    "file_deletions": 3,
                    "file_exists": true,
                    "file_name": "ext/session/session.c",
                    "file_size": 96722
                }
            ],
            "interesting": {
                "reopen": true,
                "status": false
            },
            "is_parent": false,
            "sha": "39e72195938b1a74d686e393726d758ec19407b7"
        },
        {
            "associated_pull_request": [],
            "date": "2022-09-29 12:31:53+00:00",
            "diff": "php_php-src/issue_9583/commit_1f81a3b9a79970b867e473451cbe68c7f841a782.diff",
            "diff_additions": 4,
            "diff_deletions": 3,
            "diff_file_size": 96722,
            "diff_url": "https://github.com/php/php-src/commit/1f81a3b9a79970b867e473451cbe68c7f841a782.diff",
            "exists": true,
            "files": [
                {
                    "file_additions": 4,
                    "file_deletions": 3,
                    "file_exists": true,
                    "file_name": "ext/session/session.c",
                    "file_size": 96722
                }
            ],
            "interesting": {
                "reopen": false,
                "status": false
            },
            "is_parent": false,
            "sha": "1f81a3b9a79970b867e473451cbe68c7f841a782"
        },
        {
            "associated_pull_request": [],
            "date": "2022-09-29 12:31:53+00:00",
            "diff": "php_php-src/issue_9583/commit_499fbcd67912f8604e213e6ac02f6c0115ee6a7b.diff",
            "diff_additions": 20,
            "diff_deletions": 14,
            "diff_file_size": 96722,
            "diff_url": "https://github.com/php/php-src/commit/499fbcd67912f8604e213e6ac02f6c0115ee6a7b.diff",
            "exists": true,
            "files": [
                {
                    "file_additions": 20,
                    "file_deletions": 14,
                    "file_exists": true,
                    "file_name": "ext/session/session.c",
                    "file_size": 96722
                }
            ],
            "interesting": {
                "reopen": false,
                "status": false
            },
            "is_parent": false,
            "sha": "499fbcd67912f8604e213e6ac02f6c0115ee6a7b"
        },
        {
            "associated_pull_request": [],
            "date": "2022-10-06 13:29:53+00:00",
            "diff": "php_php-src/issue_9583/commit_09a57d385d9271fa88c37353dbab10833d3239d1.diff",
            "diff_additions": 20,
            "diff_deletions": 14,
            "diff_file_size": 96722,
            "diff_url": "https://github.com/php/php-src/commit/09a57d385d9271fa88c37353dbab10833d3239d1.diff",
            "exists": true,
            "files": [
                {
                    "file_additions": 20,
                    "file_deletions": 14,
                    "file_exists": true,
                    "file_name": "ext/session/session.c",
                    "file_size": 96722
                }
            ],
            "interesting": {
                "reopen": false,
                "status": false
            },
            "is_parent": false,
            "sha": "09a57d385d9271fa88c37353dbab10833d3239d1"
        },
        {
            "associated_pull_request": [],
            "date": "2022-10-06 13:31:29+00:00",
            "diff": "php_php-src/issue_9583/commit_7d5ce1c483de525ed8db4f7c34269cdd40db4d3c.diff",
            "diff_additions": 20,
            "diff_deletions": 14,
            "diff_file_size": 96722,
            "diff_url": "https://github.com/php/php-src/commit/7d5ce1c483de525ed8db4f7c34269cdd40db4d3c.diff",
            "exists": true,
            "files": [
                {
                    "file_additions": 20,
                    "file_deletions": 14,
                    "file_exists": true,
                    "file_name": "ext/session/session.c",
                    "file_size": 96722
                }
            ],
            "interesting": {
                "reopen": false,
                "status": false
            },
            "is_parent": false,
            "sha": "7d5ce1c483de525ed8db4f7c34269cdd40db4d3c"
        },
        {
            "associated_pull_request": [],
            "date": "2022-09-29 12:31:53+00:00",
            "diff": "php_php-src/issue_9583/commit_499fbcd67912f8604e213e6ac02f6c0115ee6a7b.diff",
            "diff_additions": 20,
            "diff_deletions": 14,
            "diff_file_size": 96722,
            "diff_url": "https://github.com/php/php-src/commit/499fbcd67912f8604e213e6ac02f6c0115ee6a7b.diff",
            "exists": true,
            "files": [
                {
                    "file_additions": 20,
                    "file_deletions": 14,
                    "file_exists": true,
                    "file_name": "ext/session/session.c",
                    "file_size": 96722
                }
            ],
            "interesting": {
                "reopen": false,
                "status": false
            },
            "is_parent": false,
            "sha": "499fbcd67912f8604e213e6ac02f6c0115ee6a7b"
        },
        {
            "associated_pull_request": [],
            "date": "2022-10-06 13:31:59+00:00",
            "diff": "php_php-src/issue_9583/commit_0c6e1e1c3bc9d2be158350212de6b5a7593f2fd6.diff",
            "diff_additions": 20,
            "diff_deletions": 14,
            "diff_file_size": 96722,
            "diff_url": "https://github.com/php/php-src/commit/0c6e1e1c3bc9d2be158350212de6b5a7593f2fd6.diff",
            "exists": true,
            "files": [
                {
                    "file_additions": 20,
                    "file_deletions": 14,
                    "file_exists": true,
                    "file_name": "ext/session/session.c",
                    "file_size": 96722
                }
            ],
            "interesting": {
                "reopen": false,
                "status": false
            },
            "is_parent": false,
            "sha": "0c6e1e1c3bc9d2be158350212de6b5a7593f2fd6"
        }
    ],
    "first_commit": "2022-09-19 14:17:53+00:00",
    "last_commit": "2022-10-06 13:31:59+00:00",
    "number": 9583,
    "pull_request": "None",
    "score": {
        "accidental_reopen_likely": false,
        "all_labels": [
            "Bug",
            "Extension: session",
            "Status: Verified"
        ],
        "contains_keywords": [
            "work",
            "fail",
            "chang",
            "fix",
            "issu",
            "test",
            "fault",
            "warn"
        ],
        "fix_size": 42,
        "has_labels": [],
        "intersecting": {
            "computed_score": 1.0,
            "final_commit_size": 25,
            "intersection_size": 25,
            "previous_commits_size": 42
        },
        "is_makefile_based": false,
        "no_new_files": [],
        "no_other_files": false,
        "num_prohibited_files": 32123,
        "prohibited_files": [
            "server/src/main/java/com/genymobile/scrcpy/Device.java",
            "server/src/main/java/com/genymobile/scrcpy/wrappers/SurfaceControl.java",
            "server/src/main/java/com/genymobile/scrcpy/Device.java",
            "server/src/main/java/com/genymobile/scrcpy/wrappers/SurfaceControl.java",
            "app/meson.build",
            "app/scrcpy.1",
            "app/src/common.h",
            "app/src/scrcpy.h",
            "app/src/server.h",
            "server/src/main/java/com/genymobile/scrcpy/Workarounds.java"
        ],
        "reopen": true,
        "reopen_events": [
            [
                "2022-09-24 11:10:20+00:00",
                "commit"
            ],
            [
                "2022-09-27 14:59:42+00:00",
                "commit"
            ],
            [
                "2022-09-27 14:59:42+00:00",
                "commit"
            ],
            [
                "2022-09-27 14:59:49+00:00",
                "closed"
            ],
            [
                "2022-09-27 14:59:49+00:00",
                "commit"
            ],
            [
                "2022-09-27 14:59:49+00:00",
                "commit"
            ],
            [
                "2022-09-27 14:59:49+00:00",
                "commit"
            ],
            [
                "2022-09-29 12:34:16+00:00",
                "commit"
            ],
            [
                "2022-09-29 12:34:28+00:00",
                "reopened"
            ],
            [
                "2022-09-30 11:22:59+00:00",
                "commit"
            ],
            [
                "2022-10-06 13:32:24+00:00",
                "commit"
            ],
            [
                "2022-10-06 13:32:24+00:00",
                "commit"
            ],
            [
                "2022-10-06 13:32:24+00:00",
                "commit"
            ],
            [
                "2022-10-06 13:32:36+00:00",
                "closed"
            ],
            [
                "2022-10-06 13:32:36+00:00",
                "commit"
            ],
            [
                "2022-10-06 13:32:36+00:00",
                "commit"
            ]
        ],
        "status": true,
        "strategy": true,
        "total_changes": 199
    }
}