{
    "covered_issues": [
        598,
        596,
        593,
        580,
        579,
        578,
        574,
        573,
        572,
        570,
        568,
        567,
        566,
        565,
        561,
        559,
        555,
        552,
        549,
        548,
        546,
        545,
        538,
        537,
        527,
        524,
        509,
        505,
        501,
        500,
        496,
        488,
        487,
        486,
        485,
        483,
        479,
        475,
        472,
        470,
        465,
        464,
        458,
        452,
        443,
        442,
        441,
        433,
        430,
        429,
        424,
        423,
        415,
        413,
        409,
        408,
        407,
        406,
        405,
        402,
        401,
        400,
        399,
        398,
        397,
        396,
        392,
        391,
        390,
        385,
        384,
        383,
        381,
        380,
        377,
        376,
        375,
        374,
        373,
        372,
        371,
        368,
        366,
        365,
        364,
        362,
        360,
        359,
        358,
        357,
        355,
        354,
        352,
        351,
        350,
        349,
        348,
        347,
        345,
        344,
        343,
        339,
        338,
        335,
        333,
        332,
        329,
        328,
        327,
        324,
        323,
        322,
        321,
        320,
        319,
        317,
        314,
        313,
        311,
        310,
        305,
        304,
        300,
        299,
        298,
        297,
        294,
        288,
        287,
        286,
        284,
        282,
        281,
        277,
        276,
        273,
        272,
        270,
        269,
        268,
        267,
        266,
        265,
        264,
        263,
        262,
        261,
        260,
        258,
        257,
        256,
        255,
        253,
        252,
        251,
        250,
        247,
        246,
        245,
        244,
        243,
        242,
        241,
        240,
        239,
        237,
        236,
        235,
        234,
        233,
        231,
        230,
        229,
        227,
        226,
        224,
        223,
        222,
        220,
        212,
        211,
        209,
        206,
        205,
        204,
        201,
        200,
        199,
        198,
        197,
        189,
        188,
        187,
        186,
        184,
        183,
        182,
        181,
        179,
        173,
        172,
        171,
        170,
        167,
        165,
        162,
        160,
        159,
        158,
        157,
        155,
        152,
        148,
        147,
        145,
        144,
        142,
        141,
        140,
        134,
        133,
        132,
        131,
        130,
        129,
        128,
        127,
        126,
        125,
        123,
        122,
        121,
        120,
        119,
        118,
        115,
        114,
        113,
        112,
        111,
        110,
        109,
        108,
        107,
        106,
        105,
        104,
        102,
        101,
        100,
        99,
        98,
        96,
        93,
        92,
        91,
        88,
        86,
        85,
        84,
        83,
        82,
        81,
        80,
        79,
        78,
        77,
        74,
        73,
        72,
        71,
        70,
        69,
        67,
        66,
        64,
        63,
        62,
        61,
        59,
        58,
        57,
        55,
        54,
        53,
        51,
        50,
        49,
        48,
        47,
        46,
        44,
        43,
        42,
        41,
        40,
        39,
        38,
        36,
        35,
        34,
        33,
        32,
        31,
        30,
        29,
        28,
        27,
        26,
        24,
        23,
        22,
        21,
        20,
        19,
        18,
        17,
        16,
        14,
        13,
        12,
        11,
        10,
        9,
        8,
        7,
        6,
        5,
        4,
        2,
        1,
        527,
        472,
        527,
        472,
        527,
        472,
        527,
        472,
        527,
        472
    ],
    "finished": true
}