{
    "covered_issues": [
        48,
        45,
        44,
        41,
        40,
        38,
        37,
        33,
        27,
        26,
        25,
        24,
        23,
        22,
        21,
        20,
        18,
        17,
        16,
        15,
        14,
        13,
        12,
        10,
        8,
        7,
        6,
        5,
        3,
        2,
        1
    ],
    "finished": true
}