{
    "category": [
        "memory",
        "control flow"
    ],
    "commits": [
        {
            "associated_pull_request": [],
            "date": "2018-05-04 12:44:19",
            "diff": "openssl_openssl/issue_4782/commit_0d94212a046e87fafea6e83e8ea2b2a58db49979.diff",
            "diff_additions": 2,
            "diff_deletions": 0,
            "diff_file_size": 9344,
            "diff_url": "https://github.com/openssl/openssl/commit/0d94212a046e87fafea6e83e8ea2b2a58db49979.diff",
            "exists": true,
            "files": [
                {
                    "file_additions": 2,
                    "file_deletions": 0,
                    "file_exists": true,
                    "file_name": "crypto/bio/bss_mem.c",
                    "file_size": 9344
                }
            ],
            "interesting": {
                "reopen": false,
                "status": true
            },
            "is_parent": false,
            "sha": "0d94212a046e87fafea6e83e8ea2b2a58db49979"
        },
        {
            "associated_pull_request": [
                "https://github.com/EktapopaT/openssl/pull/1"
            ],
            "date": "2018-05-04 12:44:19",
            "diff": "openssl_openssl/issue_4782/commit_8748dccbbab088d9b5484769343121051db78ed9.diff",
            "diff_additions": 2,
            "diff_deletions": 0,
            "diff_file_size": 9344,
            "diff_url": "https://github.com/openssl/openssl/commit/8748dccbbab088d9b5484769343121051db78ed9.diff",
            "exists": true,
            "files": [
                {
                    "file_additions": 2,
                    "file_deletions": 0,
                    "file_exists": true,
                    "file_name": "crypto/bio/bss_mem.c",
                    "file_size": 9344
                }
            ],
            "interesting": {
                "reopen": false,
                "status": true
            },
            "is_parent": false,
            "sha": "8748dccbbab088d9b5484769343121051db78ed9"
        },
        {
            "associated_pull_request": [],
            "date": "2018-05-04 12:44:19",
            "diff": "openssl_openssl/issue_4782/commit_8dd55d9ee107337460e6a35b4ece234b4475e12d.diff",
            "diff_additions": 2,
            "diff_deletions": 0,
            "diff_file_size": 9344,
            "diff_url": "https://github.com/openssl/openssl/commit/8dd55d9ee107337460e6a35b4ece234b4475e12d.diff",
            "exists": true,
            "files": [
                {
                    "file_additions": 2,
                    "file_deletions": 0,
                    "file_exists": true,
                    "file_name": "crypto/bio/bss_mem.c",
                    "file_size": 9344
                }
            ],
            "interesting": {
                "reopen": false,
                "status": false
            },
            "is_parent": false,
            "sha": "8dd55d9ee107337460e6a35b4ece234b4475e12d"
        }
    ],
    "first_commit": "2018-05-04 12:57:00",
    "last_commit": "2018-05-04 22:19:17",
    "number": 4782,
    "pull_request": "None",
    "score": {
        "accidental_reopen_likely": false,
        "all_labels": [],
        "contains_keywords": [
            "fail",
            "chang",
            "patch",
            "issu"
        ],
        "fix_size": 7,
        "has_labels": [],
        "intersecting": {
            "computed_score": 0.3333333333333333,
            "final_commit_size": 3,
            "intersection_size": 1,
            "previous_commits_size": 5
        },
        "is_makefile_based": false,
        "no_new_files": [],
        "no_other_files": true,
        "num_prohibited_files": 102736,
        "prohibited_files": [
            "hal/inc/pinmap_hal.h",
            "Debug/marvin.bin",
            "Debug/marvin.elf",
            "Debug/marvin.hex",
            "Debug/marvin.bin",
            "Debug/marvin.elf",
            "Debug/marvin.hex",
            "inc/spark_utilities.h",
            "Debug/marvin.bin",
            "Debug/marvin.elf"
        ],
        "reopen": false,
        "reopen_events": [
            [
                "2017-11-24 08:25:59",
                "commit"
            ],
            [
                "2018-01-29 13:43:52",
                "commit"
            ],
            [
                "2018-05-04 12:48:10",
                "commit"
            ],
            [
                "2018-05-04 12:57:20",
                "commit"
            ],
            [
                "2018-05-04 22:16:14",
                "closed"
            ],
            [
                "2018-05-04 22:16:14",
                "commit"
            ],
            [
                "2018-05-04 22:17:12",
                "commit"
            ],
            [
                "2018-05-04 22:19:38",
                "commit"
            ]
        ],
        "status": true,
        "strategy": true,
        "total_changes": 6
    }
}