{
    "commits": [
        {
            "diff": "spring-projects_spring-boot/issue_3660/commit_a10bfc153dc39bb07b0a29d92161159e2dae9139.diff",
            "diff_additions": 17,
            "diff_deletions": 2,
            "diff_file_size": 0,
            "files": [
                {
                    "file_additions": 17,
                    "file_deletions": 2,
                    "file_exists": false,
                    "file_name": "spring-boot/src/main/java/org/springframework/boot/logging/LoggingSystem.java",
                    "file_size": 0
                }
            ],
            "interesting": {
                "reopened": false,
                "status": false
            },
            "sha": "a10bfc153dc39bb07b0a29d92161159e2dae9139"
        },
        {
            "diff": "spring-projects_spring-boot/issue_3660/commit_1d31d23e29424ebd8501197c63fb168d1cc942a8.diff",
            "diff_additions": 48,
            "diff_deletions": 7,
            "diff_file_size": 0,
            "files": [
                {
                    "file_additions": 9,
                    "file_deletions": 0,
                    "file_exists": false,
                    "file_name": "spring-boot-autoconfigure/src/main/java/org/springframework/boot/autoconfigure/EnableAutoConfiguration.java",
                    "file_size": 0
                },
                {
                    "file_additions": 17,
                    "file_deletions": 5,
                    "file_exists": false,
                    "file_name": "spring-boot-autoconfigure/src/main/java/org/springframework/boot/autoconfigure/EnableAutoConfigurationImportSelector.java",
                    "file_size": 0
                },
                {
                    "file_additions": 13,
                    "file_deletions": 0,
                    "file_exists": false,
                    "file_name": "spring-boot-autoconfigure/src/test/java/org/springframework/boot/autoconfigure/EnableAutoConfigurationImportSelectorTests.java",
                    "file_size": 0
                },
                {
                    "file_additions": 9,
                    "file_deletions": 2,
                    "file_exists": false,
                    "file_name": "spring-boot-autoconfigure/src/test/java/org/springframework/boot/autoconfigure/context/ConfigurationPropertiesAutoConfigurationTests.java",
                    "file_size": 0
                }
            ],
            "interesting": {
                "reopened": true,
                "status": false
            },
            "sha": "1d31d23e29424ebd8501197c63fb168d1cc942a8"
        },
        {
            "diff": "spring-projects_spring-boot/issue_3660/commit_3ff878a94b43e5c671a007cb9beb247d54a30ec7.diff",
            "diff_additions": 7,
            "diff_deletions": 48,
            "diff_file_size": 0,
            "files": [
                {
                    "file_additions": 0,
                    "file_deletions": 9,
                    "file_exists": false,
                    "file_name": "spring-boot-autoconfigure/src/main/java/org/springframework/boot/autoconfigure/EnableAutoConfiguration.java",
                    "file_size": 0
                },
                {
                    "file_additions": 5,
                    "file_deletions": 17,
                    "file_exists": false,
                    "file_name": "spring-boot-autoconfigure/src/main/java/org/springframework/boot/autoconfigure/EnableAutoConfigurationImportSelector.java",
                    "file_size": 0
                },
                {
                    "file_additions": 0,
                    "file_deletions": 13,
                    "file_exists": false,
                    "file_name": "spring-boot-autoconfigure/src/test/java/org/springframework/boot/autoconfigure/EnableAutoConfigurationImportSelectorTests.java",
                    "file_size": 0
                },
                {
                    "file_additions": 2,
                    "file_deletions": 9,
                    "file_exists": false,
                    "file_name": "spring-boot-autoconfigure/src/test/java/org/springframework/boot/autoconfigure/context/ConfigurationPropertiesAutoConfigurationTests.java",
                    "file_size": 0
                }
            ],
            "interesting": {
                "reopened": false,
                "status": false
            },
            "sha": "3ff878a94b43e5c671a007cb9beb247d54a30ec7"
        },
        {
            "diff": "spring-projects_spring-boot/issue_3660/commit_9a537070142558e312c4fe6b1f35e4d777203b79.diff",
            "diff_additions": 391,
            "diff_deletions": 41,
            "diff_file_size": 0,
            "files": [
                {
                    "file_additions": 43,
                    "file_deletions": 0,
                    "file_exists": false,
                    "file_name": "spring-boot-autoconfigure/src/main/java/org/springframework/boot/autoconfigure/AutoConfigurationPackage.java",
                    "file_size": 0
                },
                {
                    "file_additions": 2,
                    "file_deletions": 2,
                    "file_exists": false,
                    "file_name": "spring-boot-autoconfigure/src/main/java/org/springframework/boot/autoconfigure/EnableAutoConfiguration.java",
                    "file_size": 0
                },
                {
                    "file_additions": 125,
                    "file_deletions": 37,
                    "file_exists": false,
                    "file_name": "spring-boot-autoconfigure/src/main/java/org/springframework/boot/autoconfigure/EnableAutoConfigurationImportSelector.java",
                    "file_size": 0
                },
                {
                    "file_additions": 51,
                    "file_deletions": 0,
                    "file_exists": false,
                    "file_name": "spring-boot-autoconfigure/src/main/java/org/springframework/boot/autoconfigure/test/ImportAutoConfiguration.java",
                    "file_size": 0
                },
                {
                    "file_additions": 52,
                    "file_deletions": 0,
                    "file_exists": false,
                    "file_name": "spring-boot-autoconfigure/src/main/java/org/springframework/boot/autoconfigure/test/ImportAutoConfigurationImportSelector.java",
                    "file_size": 0
                },
                {
                    "file_additions": 21,
                    "file_deletions": 0,
                    "file_exists": false,
                    "file_name": "spring-boot-autoconfigure/src/main/java/org/springframework/boot/autoconfigure/test/package-info.java",
                    "file_size": 0
                },
                {
                    "file_additions": 1,
                    "file_deletions": 0,
                    "file_exists": false,
                    "file_name": "spring-boot-autoconfigure/src/test/java/org/springframework/boot/autoconfigure/EnableAutoConfigurationImportSelectorTests.java",
                    "file_size": 0
                },
                {
                    "file_additions": 9,
                    "file_deletions": 2,
                    "file_exists": false,
                    "file_name": "spring-boot-autoconfigure/src/test/java/org/springframework/boot/autoconfigure/context/ConfigurationPropertiesAutoConfigurationTests.java",
                    "file_size": 0
                },
                {
                    "file_additions": 87,
                    "file_deletions": 0,
                    "file_exists": false,
                    "file_name": "spring-boot-autoconfigure/src/test/java/org/springframework/boot/autoconfigure/test/ImportAutoConfigurationImportSelectorTests.java",
                    "file_size": 0
                }
            ],
            "interesting": {
                "reopened": false,
                "status": false
            },
            "sha": "9a537070142558e312c4fe6b1f35e4d777203b79"
        }
    ],
    "first_commit": "2015-08-04 22:23:36",
    "last_commit": "2015-08-05 21:58:19",
    "number": 3660,
    "score": 160.00713012477718
}