{
    "category": [
        "GUI",
        "wrong API usage"
    ],
    "commits": [
        {
            "associated_pull_request": [
                "https://github.com/facebook/zstd/pull/1563"
            ],
            "date": "2019-03-29 22:19:21",
            "diff": "facebook_zstd/issue_1548/commit_425ce5547c7c49e459a646f1d4bb99341972c193.diff",
            "diff_additions": 166,
            "diff_deletions": 123,
            "diff_file_size": 22332,
            "diff_url": "https://github.com/facebook/zstd/commit/425ce5547c7c49e459a646f1d4bb99341972c193.diff",
            "exists": true,
            "files": [
                {
                    "file_additions": 166,
                    "file_deletions": 123,
                    "file_exists": true,
                    "file_name": "lib/compress/zstd_fast.c",
                    "file_size": 22332
                }
            ],
            "interesting": {
                "reopen": false,
                "status": false
            },
            "is_parent": true,
            "sha": "425ce5547c7c49e459a646f1d4bb99341972c193"
        },
        {
            "associated_pull_request": [
                "https://github.com/facebook/zstd/pull/1566"
            ],
            "date": "2019-04-01 23:41:06",
            "diff": "facebook_zstd/issue_1548/commit_fb13d757af0e8c0c900ade00d3d5b9079685bc07.diff",
            "diff_additions": 42,
            "diff_deletions": 26,
            "diff_file_size": 4446,
            "diff_url": "https://github.com/facebook/zstd/commit/fb13d757af0e8c0c900ade00d3d5b9079685bc07.diff",
            "exists": true,
            "files": [
                {
                    "file_additions": 42,
                    "file_deletions": 26,
                    "file_exists": true,
                    "file_name": "examples/multiple_streaming_compression.c",
                    "file_size": 4446
                }
            ],
            "interesting": {
                "reopen": false,
                "status": true
            },
            "is_parent": false,
            "sha": "fb13d757af0e8c0c900ade00d3d5b9079685bc07"
        },
        {
            "associated_pull_request": [],
            "date": "2019-04-02 00:25:26",
            "diff": "facebook_zstd/issue_1548/commit_3dd62d2ee3fa19566539706ee4206317fa8d8356.diff",
            "diff_additions": 22,
            "diff_deletions": 10,
            "diff_file_size": 3641,
            "diff_url": "https://github.com/facebook/zstd/commit/3dd62d2ee3fa19566539706ee4206317fa8d8356.diff",
            "exists": true,
            "files": [
                {
                    "file_additions": 22,
                    "file_deletions": 10,
                    "file_exists": true,
                    "file_name": "examples/streaming_decompression.c",
                    "file_size": 3641
                }
            ],
            "interesting": {
                "reopen": false,
                "status": false
            },
            "is_parent": false,
            "sha": "3dd62d2ee3fa19566539706ee4206317fa8d8356"
        },
        {
            "associated_pull_request": [],
            "date": "2019-04-02 01:05:49",
            "diff": "facebook_zstd/issue_1548/commit_02658b3dc4a51f273e9d78af6db4617dae70977e.diff",
            "diff_additions": 55,
            "diff_deletions": 72,
            "diff_file_size": 5828,
            "diff_url": "https://github.com/facebook/zstd/commit/02658b3dc4a51f273e9d78af6db4617dae70977e.diff",
            "exists": true,
            "files": [
                {
                    "file_additions": 55,
                    "file_deletions": 72,
                    "file_exists": true,
                    "file_name": "examples/streaming_memory_usage.c",
                    "file_size": 5828
                }
            ],
            "interesting": {
                "reopen": false,
                "status": true
            },
            "is_parent": false,
            "sha": "02658b3dc4a51f273e9d78af6db4617dae70977e"
        },
        {
            "associated_pull_request": [],
            "date": "2019-04-02 01:05:49",
            "diff": "facebook_zstd/issue_1548/commit_0933eacf0f8fd7f77af7b14735638c62d348af5c.diff",
            "diff_additions": 57,
            "diff_deletions": 72,
            "diff_file_size": 5828,
            "diff_url": "https://github.com/facebook/zstd/commit/0933eacf0f8fd7f77af7b14735638c62d348af5c.diff",
            "exists": true,
            "files": [
                {
                    "file_additions": 57,
                    "file_deletions": 72,
                    "file_exists": true,
                    "file_name": "examples/streaming_memory_usage.c",
                    "file_size": 5828
                }
            ],
            "interesting": {
                "reopen": false,
                "status": false
            },
            "is_parent": false,
            "sha": "0933eacf0f8fd7f77af7b14735638c62d348af5c"
        },
        {
            "associated_pull_request": [
                "https://github.com/facebook/zstd/pull/1567"
            ],
            "date": "2019-04-02 00:25:26",
            "diff": "facebook_zstd/issue_1548/commit_de58910b5a2fe16451d293f5b2e55a686d1a965d.diff",
            "diff_additions": 25,
            "diff_deletions": 11,
            "diff_file_size": 3641,
            "diff_url": "https://github.com/facebook/zstd/commit/de58910b5a2fe16451d293f5b2e55a686d1a965d.diff",
            "exists": true,
            "files": [
                {
                    "file_additions": 25,
                    "file_deletions": 11,
                    "file_exists": true,
                    "file_name": "examples/streaming_decompression.c",
                    "file_size": 3641
                }
            ],
            "interesting": {
                "reopen": false,
                "status": false
            },
            "is_parent": false,
            "sha": "de58910b5a2fe16451d293f5b2e55a686d1a965d"
        },
        {
            "associated_pull_request": [
                "https://github.com/facebook/zstd/pull/1568"
            ],
            "date": "2019-04-02 01:05:49",
            "diff": "facebook_zstd/issue_1548/commit_cdc8ae2e9bec9ad9b3f6bffc2b8d283180814853.diff",
            "diff_additions": 58,
            "diff_deletions": 72,
            "diff_file_size": 5828,
            "diff_url": "https://github.com/facebook/zstd/commit/cdc8ae2e9bec9ad9b3f6bffc2b8d283180814853.diff",
            "exists": true,
            "files": [
                {
                    "file_additions": 58,
                    "file_deletions": 72,
                    "file_exists": true,
                    "file_name": "examples/streaming_memory_usage.c",
                    "file_size": 5828
                }
            ],
            "interesting": {
                "reopen": false,
                "status": false
            },
            "is_parent": false,
            "sha": "cdc8ae2e9bec9ad9b3f6bffc2b8d283180814853"
        }
    ],
    "first_commit": "2019-03-29 22:19:21",
    "last_commit": "2019-04-03 02:20:57",
    "number": 1548,
    "pull_request": "None",
    "score": {
        "accidental_reopen_likely": false,
        "all_labels": [
            "good first issue"
        ],
        "contains_keywords": [
            "fail"
        ],
        "fix_size": 163,
        "has_labels": [],
        "intersecting": {
            "computed_score": 1.0,
            "final_commit_size": 81,
            "intersection_size": 81,
            "previous_commits_size": 163
        },
        "is_makefile_based": true,
        "no_new_files": [],
        "no_other_files": true,
        "num_prohibited_files": 65457,
        "prohibited_files": [
            "kill.h",
            "meminfo.h",
            "kill.h",
            "meminfo.h",
            "kill.h",
            "meminfo.h",
            "testsuite_cli_test.go",
            "testsuite_cli_test.go",
            "common.mk",
            "i3bar/include/draw_util.h"
        ],
        "reopen": false,
        "reopen_events": [
            [
                "2019-04-01 23:42:38",
                "commit"
            ],
            [
                "2019-04-02 00:27:13",
                "commit"
            ],
            [
                "2019-04-02 01:07:20",
                "commit"
            ],
            [
                "2019-04-02 17:58:11",
                "commit"
            ],
            [
                "2019-04-03 01:53:12",
                "commit"
            ],
            [
                "2019-04-03 02:21:31",
                "commit"
            ],
            [
                "2019-04-06 06:29:33",
                "closed"
            ]
        ],
        "status": true,
        "strategy": true,
        "total_changes": 811
    }
}