{
    "covered_issues": [
        82,
        75,
        73,
        38,
        37,
        36,
        31,
        27,
        26,
        23,
        21,
        19,
        17,
        16,
        14,
        13,
        10,
        9,
        7,
        6,
        5,
        4
    ],
    "finished": true
}