{
    "category": [
        "memory",
        "control flow"
    ],
    "commits": [
        {
            "associated_pull_request": [
                "https://github.com/surge-synthesizer/surge/pull/1655"
            ],
            "date": "2020-03-22 02:28:50",
            "diff": "surge-synthesizer_surge/issue_1654/commit_f75363640390b5493ea4ed2461cb8344fbbc3211.diff",
            "diff_additions": 13,
            "diff_deletions": 2,
            "diff_file_size": 0,
            "diff_url": "https://github.com/surge-synthesizer/surge/commit/f75363640390b5493ea4ed2461cb8344fbbc3211.diff",
            "exists": true,
            "files": [
                {
                    "file_additions": 13,
                    "file_deletions": 2,
                    "file_exists": false,
                    "file_name": "src/common/gui/SkinSupport.cpp",
                    "file_size": 0
                }
            ],
            "interesting": {
                "reopen": false,
                "status": false
            },
            "is_parent": true,
            "sha": "f75363640390b5493ea4ed2461cb8344fbbc3211"
        },
        {
            "associated_pull_request": [
                "https://github.com/surge-synthesizer/surge/pull/1656"
            ],
            "date": "2020-03-22 13:32:18",
            "diff": "surge-synthesizer_surge/issue_1654/commit_2e7b11424dd8e40caf932290e0fdb51d09abcd73.diff",
            "diff_additions": 8,
            "diff_deletions": 13,
            "diff_file_size": 81176,
            "diff_url": "https://github.com/surge-synthesizer/surge/commit/2e7b11424dd8e40caf932290e0fdb51d09abcd73.diff",
            "exists": true,
            "files": [
                {
                    "file_additions": 6,
                    "file_deletions": 12,
                    "file_exists": true,
                    "file_name": "src/headless/UnitTestsDSP.cpp",
                    "file_size": 33655
                },
                {
                    "file_additions": 2,
                    "file_deletions": 1,
                    "file_exists": true,
                    "file_name": "src/headless/UnitTestsMOD.cpp",
                    "file_size": 47521
                }
            ],
            "interesting": {
                "reopen": true,
                "status": false
            },
            "is_parent": false,
            "sha": "2e7b11424dd8e40caf932290e0fdb51d09abcd73"
        },
        {
            "associated_pull_request": [
                "https://github.com/surge-synthesizer/surge/pull/1712"
            ],
            "date": "2020-04-13 13:06:32",
            "diff": "surge-synthesizer_surge/issue_1654/commit_c50c3ee0ad8f8074c3352b5cba527de13955cb9d.diff",
            "diff_additions": 89,
            "diff_deletions": 68,
            "diff_file_size": 169867,
            "diff_url": "https://github.com/surge-synthesizer/surge/commit/c50c3ee0ad8f8074c3352b5cba527de13955cb9d.diff",
            "exists": true,
            "files": [
                {
                    "file_additions": 5,
                    "file_deletions": 5,
                    "file_exists": true,
                    "file_name": "src/common/Parameter.cpp",
                    "file_size": 122346
                },
                {
                    "file_additions": 83,
                    "file_deletions": 62,
                    "file_exists": false,
                    "file_name": "src/common/dsp/effect/FlangerEffect.cpp",
                    "file_size": 0
                },
                {
                    "file_additions": 1,
                    "file_deletions": 1,
                    "file_exists": true,
                    "file_name": "src/headless/UnitTestsMOD.cpp",
                    "file_size": 47521
                }
            ],
            "interesting": {
                "reopen": false,
                "status": false
            },
            "is_parent": false,
            "sha": "c50c3ee0ad8f8074c3352b5cba527de13955cb9d"
        },
        {
            "associated_pull_request": [
                "https://github.com/surge-synthesizer/surge/pull/1712"
            ],
            "date": "2020-04-13 13:22:33",
            "diff": "surge-synthesizer_surge/issue_1654/commit_acaba7e336f27a767be56d263956869f7874271d.diff",
            "diff_additions": 89,
            "diff_deletions": 68,
            "diff_file_size": 169867,
            "diff_url": "https://github.com/surge-synthesizer/surge/commit/acaba7e336f27a767be56d263956869f7874271d.diff",
            "exists": true,
            "files": [
                {
                    "file_additions": 5,
                    "file_deletions": 5,
                    "file_exists": true,
                    "file_name": "src/common/Parameter.cpp",
                    "file_size": 122346
                },
                {
                    "file_additions": 83,
                    "file_deletions": 62,
                    "file_exists": false,
                    "file_name": "src/common/dsp/effect/FlangerEffect.cpp",
                    "file_size": 0
                },
                {
                    "file_additions": 1,
                    "file_deletions": 1,
                    "file_exists": true,
                    "file_name": "src/headless/UnitTestsMOD.cpp",
                    "file_size": 47521
                }
            ],
            "interesting": {
                "reopen": false,
                "status": false
            },
            "is_parent": false,
            "sha": "acaba7e336f27a767be56d263956869f7874271d"
        }
    ],
    "first_commit": "2020-03-22 02:28:50",
    "last_commit": "2020-04-13 13:22:33",
    "number": 1654,
    "pull_request": "None",
    "score": {
        "accidental_reopen_likely": false,
        "all_labels": [
            "Infrastructure"
        ],
        "contains_keywords": [
            "issu",
            "problem",
            "crash",
            "work",
            "fix",
            "test",
            "fail"
        ],
        "fix_size": 138,
        "has_labels": [],
        "intersecting": {
            "computed_score": 1.0,
            "final_commit_size": 122,
            "intersection_size": 122,
            "previous_commits_size": 138
        },
        "is_makefile_based": true,
        "no_new_files": [],
        "no_other_files": false,
        "num_prohibited_files": 49546,
        "prohibited_files": [
            "tools/building.py",
            "tools/building.py",
            "tools/building.py",
            "emcc.py",
            "src/library_emmalloc.js",
            "src/shell.js",
            "tests/test_core.py",
            "src/shell.js",
            "tests/test_core.py",
            "src/library.js"
        ],
        "reopen": true,
        "reopen_events": [
            [
                "2020-03-22 13:23:02",
                "commit"
            ],
            [
                "2020-03-22 13:32:18",
                "closed"
            ],
            [
                "2020-03-22 13:32:20",
                "commit"
            ],
            [
                "2020-03-23 20:32:08",
                "reopened"
            ],
            [
                "2020-04-13 13:07:25",
                "commit"
            ],
            [
                "2020-04-13 13:22:36",
                "commit"
            ],
            [
                "2020-05-03 12:27:38",
                "closed"
            ]
        ],
        "status": false,
        "strategy": true,
        "total_changes": 350
    }
}