{
    "covered_issues": [
        48,
        46,
        43,
        40,
        39,
        36,
        33,
        32,
        30,
        29,
        28,
        27,
        25,
        24,
        23,
        22,
        21,
        19,
        17,
        16,
        14,
        13,
        12,
        11,
        10,
        9,
        8,
        7,
        6,
        5,
        4,
        3,
        2,
        1
    ],
    "finished": true
}