{
    "all_issues": 581,
    "interesting_issues": 5,
    "last_update": "2023-11-09 20:07:36.230264",
    "license": {
        "download": "https://raw.githubusercontent.com/vhelin/wla-dx/master/LICENSE",
        "name": "Other"
    },
    "ratio": 0.008605851979345954,
    "size": 5449,
    "stars": 511,
    "url": "https://github.com/vhelin/wla-dx"
}