{
    "category": [
        "GUI",
        "control flow"
    ],
    "commits": [
        {
            "associated_pull_request": [],
            "date": "2016-05-30 22:37:25",
            "diff": "",
            "diff_additions": 0,
            "diff_deletions": 0,
            "diff_file_size": 0,
            "diff_url": "https://github.com/neomutt/neomutt/commit/7742cc7e48b8fa967c75ecc9f5fc6609a4af1bc5.diff",
            "exists": true,
            "files": [],
            "interesting": {
                "reopen": false,
                "status": false
            },
            "is_parent": true,
            "sha": "7742cc7e48b8fa967c75ecc9f5fc6609a4af1bc5"
        },
        {
            "associated_pull_request": [],
            "date": "2016-06-05 02:29:06",
            "diff": "neomutt_neomutt/issue_41/commit_bf34384408521f63c2723f16ef0ba12611e2d774.diff",
            "diff_additions": 86,
            "diff_deletions": 87,
            "diff_file_size": 0,
            "diff_url": "https://github.com/neomutt/neomutt/commit/bf34384408521f63c2723f16ef0ba12611e2d774.diff",
            "exists": true,
            "files": [
                {
                    "file_additions": 85,
                    "file_deletions": 86,
                    "file_exists": false,
                    "file_name": "curs_main.c",
                    "file_size": 0
                },
                {
                    "file_additions": 1,
                    "file_deletions": 1,
                    "file_exists": false,
                    "file_name": "pager.c",
                    "file_size": 0
                }
            ],
            "interesting": {
                "reopen": false,
                "status": true
            },
            "is_parent": false,
            "sha": "bf34384408521f63c2723f16ef0ba12611e2d774"
        },
        {
            "associated_pull_request": [],
            "date": "2016-06-05 02:29:06",
            "diff": "neomutt_neomutt/issue_41/commit_ef65b84dd17589d97816a2bc15afe9b57e7ce415.diff",
            "diff_additions": 85,
            "diff_deletions": 86,
            "diff_file_size": 0,
            "diff_url": "https://github.com/neomutt/neomutt/commit/ef65b84dd17589d97816a2bc15afe9b57e7ce415.diff",
            "exists": true,
            "files": [
                {
                    "file_additions": 85,
                    "file_deletions": 86,
                    "file_exists": false,
                    "file_name": "curs_main.c",
                    "file_size": 0
                }
            ],
            "interesting": {
                "reopen": false,
                "status": false
            },
            "is_parent": false,
            "sha": "ef65b84dd17589d97816a2bc15afe9b57e7ce415"
        },
        {
            "associated_pull_request": [],
            "date": "2016-06-05 02:29:06",
            "diff": "neomutt_neomutt/issue_41/commit_53c0158e4abd18d0fa19516997e874a8a5a5932f.diff",
            "diff_additions": 85,
            "diff_deletions": 86,
            "diff_file_size": 0,
            "diff_url": "https://github.com/neomutt/neomutt/commit/53c0158e4abd18d0fa19516997e874a8a5a5932f.diff",
            "exists": true,
            "files": [
                {
                    "file_additions": 85,
                    "file_deletions": 86,
                    "file_exists": false,
                    "file_name": "curs_main.c",
                    "file_size": 0
                }
            ],
            "interesting": {
                "reopen": false,
                "status": false
            },
            "is_parent": false,
            "sha": "53c0158e4abd18d0fa19516997e874a8a5a5932f"
        },
        {
            "associated_pull_request": [],
            "date": "2016-06-05 02:29:06",
            "diff": "neomutt_neomutt/issue_41/commit_ef65b84dd17589d97816a2bc15afe9b57e7ce415.diff",
            "diff_additions": 85,
            "diff_deletions": 86,
            "diff_file_size": 0,
            "diff_url": "https://github.com/neomutt/neomutt/commit/ef65b84dd17589d97816a2bc15afe9b57e7ce415.diff",
            "exists": true,
            "files": [
                {
                    "file_additions": 85,
                    "file_deletions": 86,
                    "file_exists": false,
                    "file_name": "curs_main.c",
                    "file_size": 0
                }
            ],
            "interesting": {
                "reopen": false,
                "status": false
            },
            "is_parent": false,
            "sha": "ef65b84dd17589d97816a2bc15afe9b57e7ce415"
        }
    ],
    "first_commit": "2016-05-30 22:37:25",
    "last_commit": "2016-06-12 21:31:55",
    "number": 41,
    "pull_request": "None",
    "score": {
        "accidental_reopen_likely": false,
        "all_labels": [
            "type:bug"
        ],
        "contains_keywords": [
            "report",
            "chang",
            "bug",
            "problem",
            "test",
            "fix",
            "patch",
            "issu",
            "work"
        ],
        "fix_size": 121,
        "has_labels": [],
        "intersecting": {
            "computed_score": 1.0,
            "final_commit_size": 102,
            "intersection_size": 102,
            "previous_commits_size": 121
        },
        "is_makefile_based": true,
        "no_new_files": [],
        "no_other_files": false,
        "num_prohibited_files": 68546,
        "prohibited_files": [
            "hal/inc/pinmap_hal.h",
            "Debug/marvin.bin",
            "Debug/marvin.elf",
            "Debug/marvin.hex",
            "Debug/marvin.bin",
            "Debug/marvin.elf",
            "Debug/marvin.hex",
            "inc/spark_utilities.h",
            "Debug/marvin.bin",
            "Debug/marvin.elf"
        ],
        "reopen": false,
        "reopen_events": [
            [
                "2016-06-06 11:42:27",
                "commit"
            ],
            [
                "2016-06-13 17:16:00",
                "commit"
            ],
            [
                "2016-06-16 13:53:23",
                "commit"
            ],
            [
                "2016-06-16 14:50:58",
                "closed"
            ],
            [
                "2016-06-16 14:50:58",
                "commit"
            ]
        ],
        "status": true,
        "strategy": true,
        "total_changes": 686
    }
}