{
    "category": [
        "GUI"
    ],
    "commits": [
        {
            "associated_pull_request": [],
            "date": "2018-04-16 22:48:50",
            "diff": "d0k3_godmode9/issue_344/commit_2e07189a1be2cd28ba31ab3a9b420ab82f7974bd.diff",
            "diff_additions": 13,
            "diff_deletions": 3,
            "diff_file_size": 146074,
            "diff_url": "https://github.com/d0k3/GodMode9/commit/2e07189a1be2cd28ba31ab3a9b420ab82f7974bd.diff",
            "exists": true,
            "files": [
                {
                    "file_additions": 13,
                    "file_deletions": 3,
                    "file_exists": true,
                    "file_name": "arm9/source/utils/gameutil.c",
                    "file_size": 146074
                }
            ],
            "interesting": {
                "reopen": false,
                "status": false
            },
            "is_parent": true,
            "sha": "2e07189a1be2cd28ba31ab3a9b420ab82f7974bd"
        },
        {
            "associated_pull_request": [],
            "date": "2018-04-16 23:42:00",
            "diff": "d0k3_godmode9/issue_344/commit_2a6d5c79c03a3d0b5de28d72824a2e7092ab7bdf.diff",
            "diff_additions": 3,
            "diff_deletions": 2,
            "diff_file_size": 76807,
            "diff_url": "https://github.com/d0k3/GodMode9/commit/2a6d5c79c03a3d0b5de28d72824a2e7092ab7bdf.diff",
            "exists": true,
            "files": [
                {
                    "file_additions": 3,
                    "file_deletions": 2,
                    "file_exists": true,
                    "file_name": "arm9/source/utils/scripting.c",
                    "file_size": 76807
                }
            ],
            "interesting": {
                "reopen": true,
                "status": false
            },
            "is_parent": false,
            "sha": "2a6d5c79c03a3d0b5de28d72824a2e7092ab7bdf"
        },
        {
            "associated_pull_request": [],
            "date": "2018-04-17 21:44:53",
            "diff": "d0k3_godmode9/issue_344/commit_b0997fa687e56ee59bc5a241443f60f1df78244d.diff",
            "diff_additions": 13,
            "diff_deletions": 13,
            "diff_file_size": 120148,
            "diff_url": "https://github.com/d0k3/GodMode9/commit/b0997fa687e56ee59bc5a241443f60f1df78244d.diff",
            "exists": true,
            "files": [
                {
                    "file_additions": 7,
                    "file_deletions": 7,
                    "file_exists": true,
                    "file_name": "arm9/source/common/ui.c",
                    "file_size": 43341
                },
                {
                    "file_additions": 6,
                    "file_deletions": 6,
                    "file_exists": true,
                    "file_name": "arm9/source/utils/scripting.c",
                    "file_size": 76807
                }
            ],
            "interesting": {
                "reopen": false,
                "status": false
            },
            "is_parent": false,
            "sha": "b0997fa687e56ee59bc5a241443f60f1df78244d"
        }
    ],
    "first_commit": "2018-04-16 22:50:17",
    "last_commit": "2018-04-17 21:44:53",
    "number": 344,
    "pull_request": "None",
    "score": {
        "accidental_reopen_likely": false,
        "all_labels": [
            "bug"
        ],
        "contains_keywords": [
            "work",
            "fix",
            "bug",
            "test",
            "issu",
            "fail"
        ],
        "fix_size": 19,
        "has_labels": [
            "bug"
        ],
        "intersecting": {
            "computed_score": 0.06666666666666667,
            "final_commit_size": 15,
            "intersection_size": 1,
            "previous_commits_size": 5
        },
        "is_makefile_based": true,
        "no_new_files": [
            "arm9/source/common/ui.c"
        ],
        "no_other_files": false,
        "num_prohibited_files": 52578,
        "prohibited_files": [
            "kill.h",
            "meminfo.h",
            "kill.h",
            "meminfo.h",
            "kill.h",
            "meminfo.h",
            "testsuite_cli_test.go",
            "testsuite_cli_test.go",
            "common.mk",
            "i3bar/include/draw_util.h"
        ],
        "reopen": true,
        "reopen_events": [
            [
                "2018-04-16 23:42:08",
                "closed"
            ],
            [
                "2018-04-16 23:42:08",
                "commit"
            ],
            [
                "2018-04-17 09:36:03",
                "reopened"
            ],
            [
                "2018-04-17 21:44:59",
                "closed"
            ],
            [
                "2018-04-17 21:44:59",
                "commit"
            ]
        ],
        "status": false,
        "strategy": true,
        "total_changes": 47
    }
}