{
    "covered_issues": [
        1525,
        1523,
        1522,
        1519,
        1510,
        1505,
        1503,
        1501,
        1489,
        1486,
        1482,
        1471,
        1463,
        1458,
        1444,
        1441,
        1438,
        1437,
        1434,
        1429,
        1424,
        1419,
        1416,
        1409,
        1407,
        1406,
        1405,
        1403,
        1387,
        1376,
        1372,
        1361,
        1352,
        1351,
        1348,
        1345,
        1343,
        1341,
        1338,
        1335,
        1334,
        1332,
        1328,
        1325,
        1323,
        1321,
        1318,
        1317,
        1314,
        1307,
        1304,
        1298,
        1293,
        1292,
        1291,
        1289,
        1288,
        1287,
        1286,
        1284,
        1277,
        1274,
        1262,
        1260,
        1259,
        1258,
        1250,
        1237,
        1225,
        1224,
        1222,
        1214,
        1213,
        1212,
        1203,
        1202,
        1201,
        1200,
        1191,
        1190,
        1189,
        1187,
        1186,
        1182,
        1178,
        1171,
        1166,
        1163,
        1162,
        1159,
        1154,
        1153,
        1152,
        1151,
        1149,
        1146,
        1140,
        1139,
        1138,
        1134,
        1132,
        1131,
        1129,
        1128,
        1127,
        1126,
        1124,
        1123,
        1122,
        1120,
        1119,
        1117,
        1115,
        1112,
        1109,
        1108,
        1105,
        1104,
        1101,
        1100,
        1097,
        1096,
        1094,
        1093,
        1092,
        1091,
        1090,
        1089,
        1086,
        1085,
        1082,
        1080,
        1079,
        1077,
        1076,
        1072,
        1071,
        1070,
        1068,
        1065,
        1063,
        1062,
        1061,
        1060,
        1059,
        1057,
        1056,
        1051,
        1049,
        1047,
        1046,
        1041,
        1028,
        1026,
        1023,
        1021,
        1020,
        1019,
        1018,
        1017,
        1015,
        1014,
        1011,
        1010,
        1004,
        997,
        996,
        995,
        994,
        992,
        991,
        990,
        988,
        987,
        986,
        982,
        980,
        977,
        976,
        975,
        972,
        969,
        968,
        967,
        966,
        964,
        963,
        962,
        958,
        957,
        956,
        953,
        952,
        948,
        944,
        942,
        939,
        936,
        933,
        931,
        930,
        929,
        925,
        924,
        923,
        921,
        920,
        919,
        917,
        916,
        914,
        912,
        910,
        909,
        905,
        903,
        901,
        897,
        892,
        887,
        886,
        885,
        884,
        883,
        881,
        880,
        878,
        877,
        875,
        874,
        873,
        872,
        870,
        869,
        868,
        867,
        866,
        865,
        864,
        863,
        862,
        861,
        859,
        857,
        856,
        855,
        851,
        847,
        846,
        845,
        844,
        843,
        842,
        841,
        840,
        839,
        838,
        837,
        833,
        830,
        829,
        827,
        826,
        824,
        822,
        820,
        817,
        816,
        814,
        813,
        806,
        805,
        803,
        802,
        801,
        800,
        799,
        798,
        797,
        794,
        793,
        792,
        790,
        787,
        785,
        784,
        783,
        777,
        776,
        775,
        774,
        773,
        772,
        770,
        768,
        766,
        765,
        761,
        757,
        756,
        754,
        752,
        751,
        749,
        748,
        747,
        746,
        745,
        744,
        741,
        739,
        736,
        734,
        733,
        729,
        724,
        718,
        717,
        711,
        709,
        707,
        706,
        705,
        702,
        701,
        700,
        696,
        695,
        694,
        693,
        692,
        691,
        689,
        688,
        686,
        685,
        684,
        682,
        681,
        680,
        677,
        676,
        672,
        671,
        660,
        658,
        657,
        656,
        655,
        651,
        649,
        648,
        647,
        645,
        643,
        641,
        639,
        636,
        635,
        634,
        632,
        628,
        627,
        622,
        620,
        619,
        618,
        617,
        616,
        614,
        612,
        609,
        608,
        605,
        603,
        602,
        601,
        600,
        597,
        595,
        592,
        591,
        590,
        589,
        588,
        587,
        586,
        584,
        583,
        582,
        581,
        580,
        579,
        576,
        574,
        573,
        569,
        567,
        566,
        565,
        558,
        557,
        555,
        552,
        551,
        549,
        548,
        545,
        544,
        543,
        542,
        541,
        540,
        539,
        535,
        533,
        530,
        525,
        523,
        519,
        518,
        516,
        515,
        514,
        510,
        508,
        507,
        504,
        503,
        501,
        497,
        494,
        493,
        492,
        490,
        489,
        487,
        484,
        483,
        482,
        481,
        480,
        479,
        469,
        468,
        467,
        466,
        465,
        464,
        461,
        458,
        457,
        450,
        448,
        446,
        435,
        434,
        433,
        430,
        417,
        416,
        414,
        413,
        411,
        410,
        409,
        408,
        406,
        404,
        403,
        400,
        399,
        398,
        397,
        396,
        393,
        390,
        388,
        385,
        384,
        383,
        378,
        372,
        369,
        366,
        360,
        358,
        355,
        353,
        350,
        349,
        348,
        347,
        346,
        342,
        340,
        335,
        334,
        333,
        332,
        329,
        326,
        325,
        322,
        321,
        318,
        317,
        315,
        314,
        313,
        312,
        311,
        310,
        309,
        307,
        305,
        304,
        302,
        295,
        292,
        291,
        289,
        287,
        285,
        284,
        283,
        282,
        281,
        280,
        279,
        277,
        276,
        274,
        270,
        268,
        267,
        265,
        264,
        262,
        260,
        259,
        256,
        254,
        251,
        250,
        249,
        247,
        246,
        245,
        244,
        241,
        240,
        239,
        237,
        231,
        218,
        217,
        215,
        214,
        213,
        205,
        203,
        202,
        201,
        199,
        193,
        192,
        189,
        188,
        185,
        184,
        183,
        181,
        180,
        178,
        171,
        169,
        168,
        167,
        165,
        164,
        161,
        159,
        155,
        153,
        152,
        151,
        149,
        148,
        147,
        143,
        141,
        138,
        137,
        135,
        134,
        133,
        132,
        129,
        128,
        125,
        124,
        123,
        119,
        118,
        117,
        116,
        115,
        114,
        113,
        112,
        110,
        109,
        103,
        101,
        100,
        98,
        97,
        92,
        90,
        81,
        79,
        77,
        75,
        74,
        69,
        68,
        65,
        64,
        56,
        54,
        53,
        52,
        50,
        48,
        47,
        46,
        40,
        36,
        34,
        33,
        24,
        23,
        21,
        20,
        19,
        18,
        13,
        12,
        11,
        6,
        3,
        2
    ],
    "finished": true
}