{
    "category": [
        "hardware/OS",
        "control flow"
    ],
    "commits": [
        {
            "associated_pull_request": [
                "https://github.com/jonas/tig/pull/936"
            ],
            "date": "2019-06-23 02:37:45",
            "diff": "",
            "diff_additions": 0,
            "diff_deletions": 0,
            "diff_file_size": 0,
            "diff_url": "https://github.com/jonas/tig/commit/faf1b865e08a26437d2d42e5b0e45f8dea2239bf.diff",
            "exists": true,
            "files": [],
            "interesting": {
                "reopen": false,
                "status": false
            },
            "is_parent": true,
            "sha": "faf1b865e08a26437d2d42e5b0e45f8dea2239bf"
        },
        {
            "associated_pull_request": [],
            "date": "2019-07-04 16:36:51",
            "diff": "jonas_tig/issue_941/commit_a9d9ad4aa336c2bfc399aea5fe4e1131bafda8a4.diff",
            "diff_additions": 1,
            "diff_deletions": 6,
            "diff_file_size": 22830,
            "diff_url": "https://github.com/jonas/tig/commit/a9d9ad4aa336c2bfc399aea5fe4e1131bafda8a4.diff",
            "exists": true,
            "files": [
                {
                    "file_additions": 1,
                    "file_deletions": 6,
                    "file_exists": true,
                    "file_name": "src/diff.c",
                    "file_size": 22830
                }
            ],
            "interesting": {
                "reopen": false,
                "status": true
            },
            "is_parent": false,
            "sha": "a9d9ad4aa336c2bfc399aea5fe4e1131bafda8a4"
        },
        {
            "associated_pull_request": [],
            "date": "2019-07-04 16:36:51",
            "diff": "jonas_tig/issue_941/commit_8af16d67b39c2ca8b353865548f1bfe34abef90d.diff",
            "diff_additions": 3,
            "diff_deletions": 3,
            "diff_file_size": 22830,
            "diff_url": "https://github.com/jonas/tig/commit/8af16d67b39c2ca8b353865548f1bfe34abef90d.diff",
            "exists": true,
            "files": [
                {
                    "file_additions": 3,
                    "file_deletions": 3,
                    "file_exists": true,
                    "file_name": "src/diff.c",
                    "file_size": 22830
                }
            ],
            "interesting": {
                "reopen": false,
                "status": true
            },
            "is_parent": false,
            "sha": "8af16d67b39c2ca8b353865548f1bfe34abef90d"
        },
        {
            "associated_pull_request": [],
            "date": "2019-07-04 16:36:51",
            "diff": "jonas_tig/issue_941/commit_6fd6191d0add4ae32b51f37347de450c2529fabc.diff",
            "diff_additions": 3,
            "diff_deletions": 5,
            "diff_file_size": 22830,
            "diff_url": "https://github.com/jonas/tig/commit/6fd6191d0add4ae32b51f37347de450c2529fabc.diff",
            "exists": true,
            "files": [
                {
                    "file_additions": 3,
                    "file_deletions": 5,
                    "file_exists": true,
                    "file_name": "src/diff.c",
                    "file_size": 22830
                }
            ],
            "interesting": {
                "reopen": false,
                "status": false
            },
            "is_parent": false,
            "sha": "6fd6191d0add4ae32b51f37347de450c2529fabc"
        },
        {
            "associated_pull_request": [
                "https://github.com/jonas/tig/pull/942"
            ],
            "date": "2019-07-22 18:21:05",
            "diff": "jonas_tig/issue_941/commit_6d46bae93f194aa1621042fe55fa712a48d6f522.diff",
            "diff_additions": 4,
            "diff_deletions": 9,
            "diff_file_size": 22830,
            "diff_url": "https://github.com/jonas/tig/commit/6d46bae93f194aa1621042fe55fa712a48d6f522.diff",
            "exists": true,
            "files": [
                {
                    "file_additions": 4,
                    "file_deletions": 9,
                    "file_exists": true,
                    "file_name": "src/diff.c",
                    "file_size": 22830
                }
            ],
            "interesting": {
                "reopen": false,
                "status": false
            },
            "is_parent": false,
            "sha": "6d46bae93f194aa1621042fe55fa712a48d6f522"
        },
        {
            "associated_pull_request": [
                "https://github.com/jonas/tig/pull/942"
            ],
            "date": "2019-07-26 16:35:43",
            "diff": "jonas_tig/issue_941/commit_e5a9b5e2b1c3d916502ef3ef39c30070a5969eeb.diff",
            "diff_additions": 4,
            "diff_deletions": 9,
            "diff_file_size": 22830,
            "diff_url": "https://github.com/jonas/tig/commit/e5a9b5e2b1c3d916502ef3ef39c30070a5969eeb.diff",
            "exists": true,
            "files": [
                {
                    "file_additions": 4,
                    "file_deletions": 9,
                    "file_exists": true,
                    "file_name": "src/diff.c",
                    "file_size": 22830
                }
            ],
            "interesting": {
                "reopen": false,
                "status": false
            },
            "is_parent": false,
            "sha": "e5a9b5e2b1c3d916502ef3ef39c30070a5969eeb"
        }
    ],
    "first_commit": "2019-06-26 19:46:11",
    "last_commit": "2019-07-26 16:35:43",
    "number": 941,
    "pull_request": "None",
    "score": {
        "accidental_reopen_likely": false,
        "all_labels": [],
        "contains_keywords": [
            "work",
            "report",
            "patch",
            "bug",
            "error",
            "chang"
        ],
        "fix_size": 16,
        "has_labels": [],
        "intersecting": {
            "computed_score": 1.0,
            "final_commit_size": 13,
            "intersection_size": 13,
            "previous_commits_size": 16
        },
        "is_makefile_based": true,
        "no_new_files": [],
        "no_other_files": true,
        "num_prohibited_files": 74615,
        "prohibited_files": [
            "kill.h",
            "meminfo.h",
            "kill.h",
            "meminfo.h",
            "kill.h",
            "meminfo.h",
            "testsuite_cli_test.go",
            "testsuite_cli_test.go",
            "common.mk",
            "i3bar/include/draw_util.h"
        ],
        "reopen": false,
        "reopen_events": [
            [
                "2019-07-04 16:53:24",
                "commit"
            ],
            [
                "2019-07-16 08:31:37",
                "commit"
            ],
            [
                "2019-07-16 15:02:23",
                "commit"
            ],
            [
                "2019-07-22 18:21:17",
                "commit"
            ],
            [
                "2019-07-26 16:35:44",
                "closed"
            ],
            [
                "2019-07-26 16:35:49",
                "commit"
            ]
        ],
        "status": true,
        "strategy": true,
        "total_changes": 47
    }
}