{
    "category": [
        "hardware/OS",
        "build/refactor/preprocessing"
    ],
    "commits": [
        {
            "associated_pull_request": [],
            "date": "2015-07-01 08:13:34",
            "diff": "",
            "diff_additions": 0,
            "diff_deletions": 0,
            "diff_file_size": 0,
            "diff_url": "https://github.com/FreeRADIUS/freeradius-server/commit/ea6d0d245cd6cb5e0088956b0cc11af0d6e41fc9.diff",
            "exists": true,
            "files": [],
            "interesting": {
                "reopen": false,
                "status": false
            },
            "is_parent": true,
            "sha": "ea6d0d245cd6cb5e0088956b0cc11af0d6e41fc9"
        },
        {
            "associated_pull_request": [],
            "date": "2015-07-03 13:17:33",
            "diff": "freeradius_freeradius-server/issue_1113/commit_0135e2b217a6a6351f089170271cf69653caf78e.diff",
            "diff_additions": 6,
            "diff_deletions": 0,
            "diff_file_size": 0,
            "diff_url": "https://github.com/FreeRADIUS/freeradius-server/commit/0135e2b217a6a6351f089170271cf69653caf78e.diff",
            "exists": true,
            "files": [
                {
                    "file_additions": 6,
                    "file_deletions": 0,
                    "file_exists": false,
                    "file_name": "src/main/modules.c",
                    "file_size": 0
                }
            ],
            "interesting": {
                "reopen": false,
                "status": false
            },
            "is_parent": false,
            "sha": "0135e2b217a6a6351f089170271cf69653caf78e"
        },
        {
            "associated_pull_request": [],
            "date": "2015-07-03 13:17:33",
            "diff": "freeradius_freeradius-server/issue_1113/commit_eec0a55cf50c7251cb8c9afbb8fd4ba27968a4e0.diff",
            "diff_additions": 6,
            "diff_deletions": 0,
            "diff_file_size": 0,
            "diff_url": "https://github.com/FreeRADIUS/freeradius-server/commit/eec0a55cf50c7251cb8c9afbb8fd4ba27968a4e0.diff",
            "exists": true,
            "files": [
                {
                    "file_additions": 6,
                    "file_deletions": 0,
                    "file_exists": false,
                    "file_name": "src/main/modules.c",
                    "file_size": 0
                }
            ],
            "interesting": {
                "reopen": true,
                "status": false
            },
            "is_parent": false,
            "sha": "eec0a55cf50c7251cb8c9afbb8fd4ba27968a4e0"
        },
        {
            "associated_pull_request": [],
            "date": "2015-07-03 14:26:43",
            "diff": "freeradius_freeradius-server/issue_1113/commit_7f00ff1013e79760534868abc337f075ecec1229.diff",
            "diff_additions": 8,
            "diff_deletions": 0,
            "diff_file_size": 0,
            "diff_url": "https://github.com/FreeRADIUS/freeradius-server/commit/7f00ff1013e79760534868abc337f075ecec1229.diff",
            "exists": true,
            "files": [
                {
                    "file_additions": 8,
                    "file_deletions": 0,
                    "file_exists": false,
                    "file_name": "src/main/modules.c",
                    "file_size": 0
                }
            ],
            "interesting": {
                "reopen": false,
                "status": false
            },
            "is_parent": false,
            "sha": "7f00ff1013e79760534868abc337f075ecec1229"
        },
        {
            "associated_pull_request": [],
            "date": "2015-07-03 14:26:43",
            "diff": "freeradius_freeradius-server/issue_1113/commit_a56f61e136c7ed98817af86ff2c2946bf8ade2d3.diff",
            "diff_additions": 8,
            "diff_deletions": 0,
            "diff_file_size": 0,
            "diff_url": "https://github.com/FreeRADIUS/freeradius-server/commit/a56f61e136c7ed98817af86ff2c2946bf8ade2d3.diff",
            "exists": true,
            "files": [
                {
                    "file_additions": 8,
                    "file_deletions": 0,
                    "file_exists": false,
                    "file_name": "src/main/modules.c",
                    "file_size": 0
                }
            ],
            "interesting": {
                "reopen": false,
                "status": false
            },
            "is_parent": false,
            "sha": "a56f61e136c7ed98817af86ff2c2946bf8ade2d3"
        },
        {
            "associated_pull_request": [],
            "date": "2015-07-03 13:17:33",
            "diff": "freeradius_freeradius-server/issue_1113/commit_1f8a32cde26f5d30feb1a866066e9f73a6773bc6.diff",
            "diff_additions": 6,
            "diff_deletions": 0,
            "diff_file_size": 0,
            "diff_url": "https://github.com/FreeRADIUS/freeradius-server/commit/1f8a32cde26f5d30feb1a866066e9f73a6773bc6.diff",
            "exists": true,
            "files": [
                {
                    "file_additions": 6,
                    "file_deletions": 0,
                    "file_exists": false,
                    "file_name": "src/main/modules.c",
                    "file_size": 0
                }
            ],
            "interesting": {
                "reopen": false,
                "status": false
            },
            "is_parent": false,
            "sha": "1f8a32cde26f5d30feb1a866066e9f73a6773bc6"
        },
        {
            "associated_pull_request": [],
            "date": "2015-07-03 14:26:43",
            "diff": "freeradius_freeradius-server/issue_1113/commit_b8a3a8f98a6bbba4716256f98992a892add85a94.diff",
            "diff_additions": 8,
            "diff_deletions": 0,
            "diff_file_size": 0,
            "diff_url": "https://github.com/FreeRADIUS/freeradius-server/commit/b8a3a8f98a6bbba4716256f98992a892add85a94.diff",
            "exists": true,
            "files": [
                {
                    "file_additions": 8,
                    "file_deletions": 0,
                    "file_exists": false,
                    "file_name": "src/main/modules.c",
                    "file_size": 0
                }
            ],
            "interesting": {
                "reopen": false,
                "status": false
            },
            "is_parent": false,
            "sha": "b8a3a8f98a6bbba4716256f98992a892add85a94"
        },
        {
            "associated_pull_request": [],
            "date": "2015-07-03 14:26:43",
            "diff": "freeradius_freeradius-server/issue_1113/commit_f143dedb63aff4deb6764b17035fba1a09060f9e.diff",
            "diff_additions": 8,
            "diff_deletions": 0,
            "diff_file_size": 0,
            "diff_url": "https://github.com/FreeRADIUS/freeradius-server/commit/f143dedb63aff4deb6764b17035fba1a09060f9e.diff",
            "exists": true,
            "files": [
                {
                    "file_additions": 8,
                    "file_deletions": 0,
                    "file_exists": false,
                    "file_name": "src/main/modules.c",
                    "file_size": 0
                }
            ],
            "interesting": {
                "reopen": false,
                "status": false
            },
            "is_parent": false,
            "sha": "f143dedb63aff4deb6764b17035fba1a09060f9e"
        },
        {
            "associated_pull_request": [],
            "date": "2015-07-03 13:17:33",
            "diff": "freeradius_freeradius-server/issue_1113/commit_23ae966d52ab9b3e31300134a0be20bd4bc6c9d1.diff",
            "diff_additions": 6,
            "diff_deletions": 0,
            "diff_file_size": 0,
            "diff_url": "https://github.com/FreeRADIUS/freeradius-server/commit/23ae966d52ab9b3e31300134a0be20bd4bc6c9d1.diff",
            "exists": true,
            "files": [
                {
                    "file_additions": 6,
                    "file_deletions": 0,
                    "file_exists": false,
                    "file_name": "src/main/modules.c",
                    "file_size": 0
                }
            ],
            "interesting": {
                "reopen": false,
                "status": false
            },
            "is_parent": false,
            "sha": "23ae966d52ab9b3e31300134a0be20bd4bc6c9d1"
        },
        {
            "associated_pull_request": [],
            "date": "2015-07-03 14:26:43",
            "diff": "freeradius_freeradius-server/issue_1113/commit_5d7852f2d728279b466941aca20ae2ef07762380.diff",
            "diff_additions": 8,
            "diff_deletions": 0,
            "diff_file_size": 0,
            "diff_url": "https://github.com/FreeRADIUS/freeradius-server/commit/5d7852f2d728279b466941aca20ae2ef07762380.diff",
            "exists": true,
            "files": [
                {
                    "file_additions": 8,
                    "file_deletions": 0,
                    "file_exists": false,
                    "file_name": "src/main/modules.c",
                    "file_size": 0
                }
            ],
            "interesting": {
                "reopen": false,
                "status": false
            },
            "is_parent": false,
            "sha": "5d7852f2d728279b466941aca20ae2ef07762380"
        },
        {
            "associated_pull_request": [],
            "date": "2015-07-03 13:17:33",
            "diff": "freeradius_freeradius-server/issue_1113/commit_e41caaeaccc9333ff3bd96d5a9688025d1093962.diff",
            "diff_additions": 6,
            "diff_deletions": 0,
            "diff_file_size": 0,
            "diff_url": "https://github.com/FreeRADIUS/freeradius-server/commit/e41caaeaccc9333ff3bd96d5a9688025d1093962.diff",
            "exists": true,
            "files": [
                {
                    "file_additions": 6,
                    "file_deletions": 0,
                    "file_exists": false,
                    "file_name": "src/main/modules.c",
                    "file_size": 0
                }
            ],
            "interesting": {
                "reopen": false,
                "status": false
            },
            "is_parent": false,
            "sha": "e41caaeaccc9333ff3bd96d5a9688025d1093962"
        },
        {
            "associated_pull_request": [],
            "date": "2015-07-03 14:26:43",
            "diff": "freeradius_freeradius-server/issue_1113/commit_c1301506664c530e51ecf7a2b221759d2cba8236.diff",
            "diff_additions": 8,
            "diff_deletions": 0,
            "diff_file_size": 0,
            "diff_url": "https://github.com/FreeRADIUS/freeradius-server/commit/c1301506664c530e51ecf7a2b221759d2cba8236.diff",
            "exists": true,
            "files": [
                {
                    "file_additions": 8,
                    "file_deletions": 0,
                    "file_exists": false,
                    "file_name": "src/main/modules.c",
                    "file_size": 0
                }
            ],
            "interesting": {
                "reopen": false,
                "status": false
            },
            "is_parent": false,
            "sha": "c1301506664c530e51ecf7a2b221759d2cba8236"
        }
    ],
    "first_commit": "2015-07-01 18:34:33",
    "last_commit": "2015-07-15 21:33:22",
    "number": 1113,
    "pull_request": "None",
    "score": {
        "accidental_reopen_likely": false,
        "all_labels": [],
        "contains_keywords": [
            "work",
            "fix"
        ],
        "fix_size": 23,
        "has_labels": [],
        "intersecting": {
            "computed_score": 1.0,
            "final_commit_size": 9,
            "intersection_size": 9,
            "previous_commits_size": 23
        },
        "is_makefile_based": true,
        "no_new_files": [],
        "no_other_files": false,
        "num_prohibited_files": 34322,
        "prohibited_files": [
            "kill.h",
            "meminfo.h",
            "kill.h",
            "meminfo.h",
            "kill.h",
            "meminfo.h",
            "testsuite_cli_test.go",
            "testsuite_cli_test.go",
            "common.mk",
            "i3bar/include/draw_util.h"
        ],
        "reopen": true,
        "reopen_events": [
            [
                "2015-07-03 13:17:54",
                "commit"
            ],
            [
                "2015-07-03 13:18:02",
                "closed"
            ],
            [
                "2015-07-03 13:18:02",
                "commit"
            ],
            [
                "2015-07-03 13:28:46",
                "reopened"
            ],
            [
                "2015-07-03 14:27:24",
                "commit"
            ],
            [
                "2015-07-03 14:27:33",
                "closed"
            ],
            [
                "2015-07-03 14:27:33",
                "commit"
            ],
            [
                "2015-07-04 00:16:11",
                "commit"
            ],
            [
                "2015-07-05 15:34:01",
                "commit"
            ],
            [
                "2015-07-05 18:29:58",
                "commit"
            ],
            [
                "2015-07-07 01:22:07",
                "commit"
            ],
            [
                "2015-07-07 01:22:07",
                "commit"
            ],
            [
                "2015-07-07 01:33:23",
                "commit"
            ],
            [
                "2015-07-07 01:33:23",
                "commit"
            ],
            [
                "2015-07-15 21:32:17",
                "commit"
            ],
            [
                "2015-07-15 21:32:17",
                "commit"
            ],
            [
                "2015-07-15 21:33:37",
                "commit"
            ],
            [
                "2015-07-15 21:33:37",
                "commit"
            ]
        ],
        "status": false,
        "strategy": true,
        "total_changes": 78
    }
}