{
    "commits": [
        {
            "associated_pull_request": [],
            "date": "2013-07-23 12:04:04+00:00",
            "diff": "",
            "diff_additions": 0,
            "diff_deletions": 0,
            "diff_file_size": 0,
            "diff_url": "https://github.com/cxong/cdogs-sdl/commit/b20d7d7c7e69590fb35f2867721fb3520b3eb010.diff",
            "exists": true,
            "files": [],
            "interesting": {
                "reopen": false,
                "status": false
            },
            "is_parent": true,
            "sha": "b20d7d7c7e69590fb35f2867721fb3520b3eb010"
        },
        {
            "associated_pull_request": [],
            "date": "2013-07-25 13:43:05+00:00",
            "diff": "cxong_cdogs-sdl/issue_87/commit_e4f0d2c4586b839b13d94263fbc9d0b31cd658e6.diff",
            "diff_additions": 231,
            "diff_deletions": 28,
            "diff_file_size": 68497,
            "diff_url": "https://github.com/cxong/cdogs-sdl/commit/e4f0d2c4586b839b13d94263fbc9d0b31cd658e6.diff",
            "exists": true,
            "files": [
                {
                    "file_additions": 190,
                    "file_deletions": 23,
                    "file_exists": true,
                    "file_name": "src/cdogs/blit.c",
                    "file_size": 5799
                },
                {
                    "file_additions": 29,
                    "file_deletions": 0,
                    "file_exists": true,
                    "file_name": "src/cdogs/config.c",
                    "file_size": 21003
                },
                {
                    "file_additions": 5,
                    "file_deletions": 3,
                    "file_exists": true,
                    "file_name": "src/cdogs/config_json.c",
                    "file_size": 7155
                },
                {
                    "file_additions": 1,
                    "file_deletions": 2,
                    "file_exists": true,
                    "file_name": "src/cdogs/grafx.c",
                    "file_size": 11291
                },
                {
                    "file_additions": 6,
                    "file_deletions": 0,
                    "file_exists": true,
                    "file_name": "src/mainmenu.c",
                    "file_size": 23249
                }
            ],
            "interesting": {
                "reopen": false,
                "status": false
            },
            "is_parent": false,
            "sha": "e4f0d2c4586b839b13d94263fbc9d0b31cd658e6"
        },
        {
            "associated_pull_request": [],
            "date": "2013-08-13 12:26:38+00:00",
            "diff": "cxong_cdogs-sdl/issue_87/commit_ce41877982e68e917f1456eaf051d4750a20e342.diff",
            "diff_additions": 11892,
            "diff_deletions": 1,
            "diff_file_size": 61342,
            "diff_url": "https://github.com/cxong/cdogs-sdl/commit/ce41877982e68e917f1456eaf051d4750a20e342.diff",
            "exists": true,
            "files": [
                {
                    "file_additions": 19,
                    "file_deletions": 0,
                    "file_exists": true,
                    "file_name": "src/cdogs/blit.c",
                    "file_size": 5799
                },
                {
                    "file_additions": 6,
                    "file_deletions": 0,
                    "file_exists": true,
                    "file_name": "src/cdogs/config.c",
                    "file_size": 21003
                },
                {
                    "file_additions": 2,
                    "file_deletions": 0,
                    "file_exists": true,
                    "file_name": "src/cdogs/grafx.c",
                    "file_size": 11291
                },
                {
                    "file_additions": 2808,
                    "file_deletions": 0,
                    "file_exists": false,
                    "file_name": "src/cdogs/hqx/hq2x.c",
                    "file_size": 0
                },
                {
                    "file_additions": 3786,
                    "file_deletions": 0,
                    "file_exists": false,
                    "file_name": "src/cdogs/hqx/hq3x.c",
                    "file_size": 0
                },
                {
                    "file_additions": 5232,
                    "file_deletions": 0,
                    "file_exists": false,
                    "file_name": "src/cdogs/hqx/hq4x.c",
                    "file_size": 0
                },
                {
                    "file_additions": 38,
                    "file_deletions": 0,
                    "file_exists": false,
                    "file_name": "src/cdogs/hqx/init.c",
                    "file_size": 0
                },
                {
                    "file_additions": 1,
                    "file_deletions": 1,
                    "file_exists": true,
                    "file_name": "src/mainmenu.c",
                    "file_size": 23249
                }
            ],
            "interesting": {
                "reopen": false,
                "status": false
            },
            "is_parent": false,
            "sha": "ce41877982e68e917f1456eaf051d4750a20e342"
        }
    ],
    "first_commit": "2013-07-23 12:04:10+00:00",
    "last_commit": "2013-09-01 14:44:26+00:00",
    "number": 87,
    "pull_request": "None",
    "score": {
        "accidental_reopen_likely": false,
        "all_labels": [],
        "contains_keywords": [
            "fix"
        ],
        "fix_size": 264,
        "has_labels": [],
        "intersecting": {
            "computed_score": 0.3125,
            "final_commit_size": 32,
            "intersection_size": 10,
            "previous_commits_size": 242
        },
        "is_makefile_based": true,
        "no_new_files": [],
        "no_other_files": false,
        "num_prohibited_files": 120664,
        "prohibited_files": [
            "server/src/main/java/com/genymobile/scrcpy/Device.java",
            "server/src/main/java/com/genymobile/scrcpy/wrappers/SurfaceControl.java",
            "server/src/main/java/com/genymobile/scrcpy/Device.java",
            "server/src/main/java/com/genymobile/scrcpy/wrappers/SurfaceControl.java",
            "app/meson.build",
            "app/scrcpy.1",
            "app/src/common.h",
            "app/src/scrcpy.h",
            "app/src/server.h",
            "server/src/main/java/com/genymobile/scrcpy/Workarounds.java"
        ],
        "reopen": true,
        "reopen_events": [
            [
                "2013-07-25 13:43:27+00:00",
                "commit"
            ],
            [
                "2013-08-13 12:26:54+00:00",
                "closed"
            ],
            [
                "2013-08-13 12:26:54+00:00",
                "commit"
            ],
            [
                "2013-08-13 12:29:46+00:00",
                "commit"
            ],
            [
                "2013-08-21 23:43:16+00:00",
                "reopened"
            ],
            [
                "2013-09-01 10:56:15+00:00",
                "commit"
            ],
            [
                "2013-09-01 12:31:13+00:00",
                "commit"
            ],
            [
                "2013-09-01 14:44:42+00:00",
                "commit"
            ],
            [
                "2013-09-02 07:58:19+00:00",
                "closed"
            ]
        ],
        "status": false,
        "strategy": true,
        "total_changes": 12152
    }
}