{
    "covered_issues": [
        2706,
        2642,
        2466,
        2403,
        2330,
        2290,
        2247,
        2246,
        2245,
        2231,
        2215,
        2028,
        1762,
        1568,
        1466,
        1414,
        1404,
        1241,
        1187,
        1148,
        1114,
        1101,
        1080,
        1061,
        1060,
        1059,
        1038,
        1030,
        1006,
        1003,
        997,
        989,
        974,
        963,
        927,
        888,
        876,
        869,
        857,
        855,
        854,
        835,
        831,
        803,
        796,
        795,
        794,
        764,
        726,
        622,
        588,
        580,
        578,
        571,
        557,
        556,
        553,
        549,
        465,
        458,
        418,
        409,
        408,
        405,
        401,
        396,
        392,
        377,
        373,
        365,
        364,
        363,
        351,
        315,
        310,
        286,
        236,
        218,
        158,
        157,
        154,
        151,
        150,
        149,
        147,
        146,
        144,
        120,
        77,
        74,
        69,
        64,
        21
    ],
    "finished": true
}