{
    "commits": [
        {
            "associated_pull_request": [],
            "date": "2020-05-10 23:47:23+00:00",
            "diff": "dankamongmen_notcurses/issue_593/commit_9f16034d02f2698d6b0c731c83f637b33b17a91c.diff",
            "diff_additions": 14,
            "diff_deletions": 0,
            "diff_file_size": 242,
            "diff_url": "https://github.com/dankamongmen/notcurses/commit/9f16034d02f2698d6b0c731c83f637b33b17a91c.diff",
            "exists": true,
            "files": [
                {
                    "file_additions": 14,
                    "file_deletions": 0,
                    "file_exists": true,
                    "file_name": "src/lib/debug.c",
                    "file_size": 242
                }
            ],
            "interesting": {
                "reopen": false,
                "status": false
            },
            "is_parent": true,
            "sha": "9f16034d02f2698d6b0c731c83f637b33b17a91c"
        },
        {
            "associated_pull_request": [],
            "date": "2020-05-10 23:53:12+00:00",
            "diff": "dankamongmen_notcurses/issue_593/commit_64d4981d369592a77ac877ed561a7e708c93e248.diff",
            "diff_additions": 16,
            "diff_deletions": 0,
            "diff_file_size": 20421,
            "diff_url": "https://github.com/dankamongmen/notcurses/commit/64d4981d369592a77ac877ed561a7e708c93e248.diff",
            "exists": true,
            "files": [
                {
                    "file_additions": 16,
                    "file_deletions": 0,
                    "file_exists": true,
                    "file_name": "src/demo/demo.c",
                    "file_size": 20421
                }
            ],
            "interesting": {
                "reopen": true,
                "status": false
            },
            "is_parent": false,
            "sha": "64d4981d369592a77ac877ed561a7e708c93e248"
        },
        {
            "associated_pull_request": [],
            "date": "2020-05-14 03:59:12+00:00",
            "diff": "dankamongmen_notcurses/issue_593/commit_33997d1f061598f408256bbc40a1ca72aebfe346.diff",
            "diff_additions": 4,
            "diff_deletions": 6,
            "diff_file_size": 101278,
            "diff_url": "https://github.com/dankamongmen/notcurses/commit/33997d1f061598f408256bbc40a1ca72aebfe346.diff",
            "exists": true,
            "files": [
                {
                    "file_additions": 4,
                    "file_deletions": 6,
                    "file_exists": true,
                    "file_name": "src/lib/notcurses.c",
                    "file_size": 101278
                }
            ],
            "interesting": {
                "reopen": false,
                "status": false
            },
            "is_parent": false,
            "sha": "33997d1f061598f408256bbc40a1ca72aebfe346"
        }
    ],
    "first_commit": "2020-05-10 23:47:23+00:00",
    "last_commit": "2020-05-14 03:59:12+00:00",
    "number": 593,
    "pull_request": "None",
    "score": {
        "accidental_reopen_likely": false,
        "all_labels": [
            "bug",
            "demo"
        ],
        "contains_keywords": [
            "work",
            "fix",
            "debug",
            "bug"
        ],
        "fix_size": 27,
        "has_labels": [
            "bug"
        ],
        "intersecting": {
            "computed_score": 0.0,
            "final_commit_size": 10,
            "intersection_size": 0,
            "previous_commits_size": 17
        },
        "is_makefile_based": true,
        "no_new_files": [
            "src/lib/notcurses.c"
        ],
        "no_other_files": false,
        "num_prohibited_files": 106626,
        "prohibited_files": [
            "server/src/main/java/com/genymobile/scrcpy/Device.java",
            "server/src/main/java/com/genymobile/scrcpy/wrappers/SurfaceControl.java",
            "server/src/main/java/com/genymobile/scrcpy/Device.java",
            "server/src/main/java/com/genymobile/scrcpy/wrappers/SurfaceControl.java",
            "app/meson.build",
            "app/scrcpy.1",
            "app/src/common.h",
            "app/src/scrcpy.h",
            "app/src/server.h",
            "server/src/main/java/com/genymobile/scrcpy/Workarounds.java"
        ],
        "reopen": true,
        "reopen_events": [
            [
                "2020-05-10 23:53:17+00:00",
                "commit"
            ],
            [
                "2020-05-10 23:53:33+00:00",
                "closed"
            ],
            [
                "2020-05-14 01:32:57+00:00",
                "reopened"
            ],
            [
                "2020-05-14 03:59:16+00:00",
                "commit"
            ],
            [
                "2020-05-14 03:59:52+00:00",
                "closed"
            ]
        ],
        "status": false,
        "strategy": true,
        "total_changes": 40
    }
}