{
    "category": [
        "GUI",
        "control flow"
    ],
    "commits": [
        {
            "associated_pull_request": [],
            "date": "2019-12-11 16:04:39",
            "diff": "",
            "diff_additions": 0,
            "diff_deletions": 0,
            "diff_file_size": 0,
            "diff_url": "https://github.com/surge-synthesizer/surge/commit/44618fce6a1094d67124203d466c88eb19da84ef.diff",
            "exists": true,
            "files": [],
            "interesting": {
                "reopen": false,
                "status": false
            },
            "is_parent": true,
            "sha": "44618fce6a1094d67124203d466c88eb19da84ef"
        },
        {
            "associated_pull_request": [],
            "date": "2019-12-16 16:15:16",
            "diff": "surge-synthesizer_surge/issue_1413/commit_17fde642840ccb1f6237d336430ca30180ce667d.diff",
            "diff_additions": 27,
            "diff_deletions": 5,
            "diff_file_size": 112557,
            "diff_url": "https://github.com/surge-synthesizer/surge/commit/17fde642840ccb1f6237d336430ca30180ce667d.diff",
            "exists": true,
            "files": [
                {
                    "file_additions": 1,
                    "file_deletions": 1,
                    "file_exists": true,
                    "file_name": "src/common/SurgePatch.cpp",
                    "file_size": 112557
                },
                {
                    "file_additions": 26,
                    "file_deletions": 4,
                    "file_exists": false,
                    "file_name": "src/common/gui/SurgeGUIEditor.cpp",
                    "file_size": 0
                }
            ],
            "interesting": {
                "reopen": false,
                "status": false
            },
            "is_parent": false,
            "sha": "17fde642840ccb1f6237d336430ca30180ce667d"
        },
        {
            "associated_pull_request": [
                "https://github.com/surge-synthesizer/surge/pull/1423"
            ],
            "date": "2019-12-11 16:04:39",
            "diff": "surge-synthesizer_surge/issue_1413/commit_8ff80123e244fb8c961b38d447a906a00ef9bcde.diff",
            "diff_additions": 113,
            "diff_deletions": 16,
            "diff_file_size": 370317,
            "diff_url": "https://github.com/surge-synthesizer/surge/commit/8ff80123e244fb8c961b38d447a906a00ef9bcde.diff",
            "exists": true,
            "files": [
                {
                    "file_additions": 25,
                    "file_deletions": 1,
                    "file_exists": true,
                    "file_name": "src/common/Parameter.cpp",
                    "file_size": 122346
                },
                {
                    "file_additions": 5,
                    "file_deletions": 3,
                    "file_exists": true,
                    "file_name": "src/common/SurgePatch.cpp",
                    "file_size": 112557
                },
                {
                    "file_additions": 18,
                    "file_deletions": 2,
                    "file_exists": true,
                    "file_name": "src/common/SurgeSynthesizer.cpp",
                    "file_size": 135414
                },
                {
                    "file_additions": 4,
                    "file_deletions": 3,
                    "file_exists": false,
                    "file_name": "src/common/gui/CHSwitch2.cpp",
                    "file_size": 0
                },
                {
                    "file_additions": 61,
                    "file_deletions": 7,
                    "file_exists": false,
                    "file_name": "src/common/gui/SurgeGUIEditor.cpp",
                    "file_size": 0
                }
            ],
            "interesting": {
                "reopen": false,
                "status": false
            },
            "is_parent": false,
            "sha": "8ff80123e244fb8c961b38d447a906a00ef9bcde"
        },
        {
            "associated_pull_request": [
                "https://github.com/surge-synthesizer/surge/pull/1423"
            ],
            "date": "2019-12-16 19:35:02",
            "diff": "surge-synthesizer_surge/issue_1413/commit_aa7577607a2adf9bcfa7c93ddcd9fa4957384d36.diff",
            "diff_additions": 113,
            "diff_deletions": 16,
            "diff_file_size": 370317,
            "diff_url": "https://github.com/surge-synthesizer/surge/commit/aa7577607a2adf9bcfa7c93ddcd9fa4957384d36.diff",
            "exists": true,
            "files": [
                {
                    "file_additions": 25,
                    "file_deletions": 1,
                    "file_exists": true,
                    "file_name": "src/common/Parameter.cpp",
                    "file_size": 122346
                },
                {
                    "file_additions": 5,
                    "file_deletions": 3,
                    "file_exists": true,
                    "file_name": "src/common/SurgePatch.cpp",
                    "file_size": 112557
                },
                {
                    "file_additions": 18,
                    "file_deletions": 2,
                    "file_exists": true,
                    "file_name": "src/common/SurgeSynthesizer.cpp",
                    "file_size": 135414
                },
                {
                    "file_additions": 4,
                    "file_deletions": 3,
                    "file_exists": false,
                    "file_name": "src/common/gui/CHSwitch2.cpp",
                    "file_size": 0
                },
                {
                    "file_additions": 61,
                    "file_deletions": 7,
                    "file_exists": false,
                    "file_name": "src/common/gui/SurgeGUIEditor.cpp",
                    "file_size": 0
                }
            ],
            "interesting": {
                "reopen": false,
                "status": false
            },
            "is_parent": false,
            "sha": "aa7577607a2adf9bcfa7c93ddcd9fa4957384d36"
        },
        {
            "associated_pull_request": [],
            "date": "2019-12-17 13:48:38",
            "diff": "surge-synthesizer_surge/issue_1413/commit_173a79830aa6fd9a94303444392280556970408b.diff",
            "diff_additions": 18,
            "diff_deletions": 38,
            "diff_file_size": 234903,
            "diff_url": "https://github.com/surge-synthesizer/surge/commit/173a79830aa6fd9a94303444392280556970408b.diff",
            "exists": true,
            "files": [
                {
                    "file_additions": 0,
                    "file_deletions": 20,
                    "file_exists": true,
                    "file_name": "src/common/Parameter.cpp",
                    "file_size": 122346
                },
                {
                    "file_additions": 1,
                    "file_deletions": 2,
                    "file_exists": true,
                    "file_name": "src/common/SurgePatch.cpp",
                    "file_size": 112557
                },
                {
                    "file_additions": 17,
                    "file_deletions": 16,
                    "file_exists": false,
                    "file_name": "src/common/gui/SurgeGUIEditor.cpp",
                    "file_size": 0
                }
            ],
            "interesting": {
                "reopen": false,
                "status": true
            },
            "is_parent": false,
            "sha": "173a79830aa6fd9a94303444392280556970408b"
        },
        {
            "associated_pull_request": [
                "https://github.com/surge-synthesizer/surge/pull/1426"
            ],
            "date": "2019-12-17 13:48:38",
            "diff": "surge-synthesizer_surge/issue_1413/commit_77e761b35c089fb794ec09bfe76001e80c239213.diff",
            "diff_additions": 18,
            "diff_deletions": 38,
            "diff_file_size": 234903,
            "diff_url": "https://github.com/surge-synthesizer/surge/commit/77e761b35c089fb794ec09bfe76001e80c239213.diff",
            "exists": true,
            "files": [
                {
                    "file_additions": 0,
                    "file_deletions": 20,
                    "file_exists": true,
                    "file_name": "src/common/Parameter.cpp",
                    "file_size": 122346
                },
                {
                    "file_additions": 1,
                    "file_deletions": 2,
                    "file_exists": true,
                    "file_name": "src/common/SurgePatch.cpp",
                    "file_size": 112557
                },
                {
                    "file_additions": 17,
                    "file_deletions": 16,
                    "file_exists": false,
                    "file_name": "src/common/gui/SurgeGUIEditor.cpp",
                    "file_size": 0
                }
            ],
            "interesting": {
                "reopen": false,
                "status": false
            },
            "is_parent": false,
            "sha": "77e761b35c089fb794ec09bfe76001e80c239213"
        },
        {
            "associated_pull_request": [
                "https://github.com/surge-synthesizer/surge/pull/1426"
            ],
            "date": "2019-12-17 14:05:15",
            "diff": "surge-synthesizer_surge/issue_1413/commit_53362df7e99d6d8dea9f1a866a2f4008a895f273.diff",
            "diff_additions": 18,
            "diff_deletions": 38,
            "diff_file_size": 234903,
            "diff_url": "https://github.com/surge-synthesizer/surge/commit/53362df7e99d6d8dea9f1a866a2f4008a895f273.diff",
            "exists": true,
            "files": [
                {
                    "file_additions": 0,
                    "file_deletions": 20,
                    "file_exists": true,
                    "file_name": "src/common/Parameter.cpp",
                    "file_size": 122346
                },
                {
                    "file_additions": 1,
                    "file_deletions": 2,
                    "file_exists": true,
                    "file_name": "src/common/SurgePatch.cpp",
                    "file_size": 112557
                },
                {
                    "file_additions": 17,
                    "file_deletions": 16,
                    "file_exists": false,
                    "file_name": "src/common/gui/SurgeGUIEditor.cpp",
                    "file_size": 0
                }
            ],
            "interesting": {
                "reopen": false,
                "status": false
            },
            "is_parent": false,
            "sha": "53362df7e99d6d8dea9f1a866a2f4008a895f273"
        },
        {
            "associated_pull_request": [],
            "date": "2019-12-17 21:14:56",
            "diff": "surge-synthesizer_surge/issue_1413/commit_9440794640dcb51fb332d1d3f9a5a2909905119b.diff",
            "diff_additions": 30,
            "diff_deletions": 13,
            "diff_file_size": 135414,
            "diff_url": "https://github.com/surge-synthesizer/surge/commit/9440794640dcb51fb332d1d3f9a5a2909905119b.diff",
            "exists": true,
            "files": [
                {
                    "file_additions": 1,
                    "file_deletions": 4,
                    "file_exists": true,
                    "file_name": "src/common/SurgeSynthesizer.cpp",
                    "file_size": 135414
                },
                {
                    "file_additions": 6,
                    "file_deletions": 3,
                    "file_exists": false,
                    "file_name": "src/common/gui/CNumberField.cpp",
                    "file_size": 0
                },
                {
                    "file_additions": 23,
                    "file_deletions": 6,
                    "file_exists": false,
                    "file_name": "src/common/gui/SurgeGUIEditor.cpp",
                    "file_size": 0
                }
            ],
            "interesting": {
                "reopen": false,
                "status": false
            },
            "is_parent": false,
            "sha": "9440794640dcb51fb332d1d3f9a5a2909905119b"
        },
        {
            "associated_pull_request": [],
            "date": "2019-12-17 17:03:19",
            "diff": "surge-synthesizer_surge/issue_1413/commit_263118ce3626bfaa4cea9795d585e8ac32ca72a8.diff",
            "diff_additions": 41,
            "diff_deletions": 9,
            "diff_file_size": 257760,
            "diff_url": "https://github.com/surge-synthesizer/surge/commit/263118ce3626bfaa4cea9795d585e8ac32ca72a8.diff",
            "exists": true,
            "files": [
                {
                    "file_additions": 1,
                    "file_deletions": 0,
                    "file_exists": true,
                    "file_name": "src/common/Parameter.cpp",
                    "file_size": 122346
                },
                {
                    "file_additions": 1,
                    "file_deletions": 4,
                    "file_exists": true,
                    "file_name": "src/common/SurgeSynthesizer.cpp",
                    "file_size": 135414
                },
                {
                    "file_additions": 7,
                    "file_deletions": 1,
                    "file_exists": false,
                    "file_name": "src/common/gui/CNumberField.cpp",
                    "file_size": 0
                },
                {
                    "file_additions": 32,
                    "file_deletions": 4,
                    "file_exists": false,
                    "file_name": "src/common/gui/SurgeGUIEditor.cpp",
                    "file_size": 0
                }
            ],
            "interesting": {
                "reopen": false,
                "status": false
            },
            "is_parent": false,
            "sha": "263118ce3626bfaa4cea9795d585e8ac32ca72a8"
        },
        {
            "associated_pull_request": [
                "https://github.com/surge-synthesizer/surge/pull/1427"
            ],
            "date": "2019-12-17 17:03:19",
            "diff": "surge-synthesizer_surge/issue_1413/commit_bbcb6007c60bdafd808b97742a9052822643a79d.diff",
            "diff_additions": 41,
            "diff_deletions": 9,
            "diff_file_size": 257760,
            "diff_url": "https://github.com/surge-synthesizer/surge/commit/bbcb6007c60bdafd808b97742a9052822643a79d.diff",
            "exists": true,
            "files": [
                {
                    "file_additions": 1,
                    "file_deletions": 0,
                    "file_exists": true,
                    "file_name": "src/common/Parameter.cpp",
                    "file_size": 122346
                },
                {
                    "file_additions": 1,
                    "file_deletions": 4,
                    "file_exists": true,
                    "file_name": "src/common/SurgeSynthesizer.cpp",
                    "file_size": 135414
                },
                {
                    "file_additions": 7,
                    "file_deletions": 1,
                    "file_exists": false,
                    "file_name": "src/common/gui/CNumberField.cpp",
                    "file_size": 0
                },
                {
                    "file_additions": 32,
                    "file_deletions": 4,
                    "file_exists": false,
                    "file_name": "src/common/gui/SurgeGUIEditor.cpp",
                    "file_size": 0
                }
            ],
            "interesting": {
                "reopen": false,
                "status": false
            },
            "is_parent": false,
            "sha": "bbcb6007c60bdafd808b97742a9052822643a79d"
        },
        {
            "associated_pull_request": [
                "https://github.com/surge-synthesizer/surge/pull/1427"
            ],
            "date": "2019-12-17 22:18:12",
            "diff": "surge-synthesizer_surge/issue_1413/commit_dfcf78074d761d0cfb0c9d7cb110e21d252c86b8.diff",
            "diff_additions": 41,
            "diff_deletions": 9,
            "diff_file_size": 257760,
            "diff_url": "https://github.com/surge-synthesizer/surge/commit/dfcf78074d761d0cfb0c9d7cb110e21d252c86b8.diff",
            "exists": true,
            "files": [
                {
                    "file_additions": 1,
                    "file_deletions": 0,
                    "file_exists": true,
                    "file_name": "src/common/Parameter.cpp",
                    "file_size": 122346
                },
                {
                    "file_additions": 1,
                    "file_deletions": 4,
                    "file_exists": true,
                    "file_name": "src/common/SurgeSynthesizer.cpp",
                    "file_size": 135414
                },
                {
                    "file_additions": 7,
                    "file_deletions": 1,
                    "file_exists": false,
                    "file_name": "src/common/gui/CNumberField.cpp",
                    "file_size": 0
                },
                {
                    "file_additions": 32,
                    "file_deletions": 4,
                    "file_exists": false,
                    "file_name": "src/common/gui/SurgeGUIEditor.cpp",
                    "file_size": 0
                }
            ],
            "interesting": {
                "reopen": false,
                "status": false
            },
            "is_parent": false,
            "sha": "dfcf78074d761d0cfb0c9d7cb110e21d252c86b8"
        }
    ],
    "first_commit": "2019-12-16 16:18:43",
    "last_commit": "2019-12-17 22:18:12",
    "number": 1413,
    "pull_request": "None",
    "score": {
        "accidental_reopen_likely": false,
        "all_labels": [
            "MIDI",
            "MPE"
        ],
        "contains_keywords": [
            "remov",
            "issu",
            "problem",
            "crash",
            "chang",
            "work",
            "fix",
            "test"
        ],
        "fix_size": 187,
        "has_labels": [],
        "intersecting": {
            "computed_score": 1.0,
            "final_commit_size": 51,
            "intersection_size": 51,
            "previous_commits_size": 187
        },
        "is_makefile_based": true,
        "no_new_files": [],
        "no_other_files": false,
        "num_prohibited_files": 100194,
        "prohibited_files": [
            "tools/building.py",
            "tools/building.py",
            "tools/building.py",
            "emcc.py",
            "src/library_emmalloc.js",
            "src/shell.js",
            "tests/test_core.py",
            "src/shell.js",
            "tests/test_core.py",
            "src/library.js"
        ],
        "reopen": false,
        "reopen_events": [
            [
                "2019-12-16 17:02:57",
                "commit"
            ],
            [
                "2019-12-16 19:16:34",
                "commit"
            ],
            [
                "2019-12-16 19:35:05",
                "commit"
            ],
            [
                "2019-12-17 13:49:42",
                "commit"
            ],
            [
                "2019-12-17 13:58:52",
                "commit"
            ],
            [
                "2019-12-17 14:05:18",
                "commit"
            ],
            [
                "2019-12-17 21:15:50",
                "commit"
            ],
            [
                "2019-12-17 21:16:36",
                "commit"
            ],
            [
                "2019-12-17 21:17:40",
                "commit"
            ],
            [
                "2019-12-17 22:18:15",
                "commit"
            ],
            [
                "2020-01-05 20:08:13",
                "closed"
            ]
        ],
        "status": true,
        "strategy": true,
        "total_changes": 651
    }
}