{
    "category": [
        "hardware/OS",
        "control flow"
    ],
    "commits": [
        {
            "associated_pull_request": [],
            "date": "2012-11-18 15:47:46",
            "diff": "mruby_mruby/issue_561/commit_1b2257c8ff212d1069b00e11a6b91672c9636ecb.diff",
            "diff_additions": 0,
            "diff_deletions": 1,
            "diff_file_size": 19750,
            "diff_url": "https://github.com/mruby/mruby/commit/1b2257c8ff212d1069b00e11a6b91672c9636ecb.diff",
            "exists": true,
            "files": [
                {
                    "file_additions": 0,
                    "file_deletions": 1,
                    "file_exists": true,
                    "file_name": "src/kernel.c",
                    "file_size": 19750
                }
            ],
            "interesting": {
                "reopen": false,
                "status": false
            },
            "is_parent": true,
            "sha": "1b2257c8ff212d1069b00e11a6b91672c9636ecb"
        },
        {
            "associated_pull_request": [],
            "date": "2012-11-21 08:00:06",
            "diff": "mruby_mruby/issue_561/commit_76f0e755e92d845b4b4bac1d77aa5eeb42bbbec9.diff",
            "diff_additions": 17,
            "diff_deletions": 3,
            "diff_file_size": 83240,
            "diff_url": "https://github.com/mruby/mruby/commit/76f0e755e92d845b4b4bac1d77aa5eeb42bbbec9.diff",
            "exists": true,
            "files": [
                {
                    "file_additions": 17,
                    "file_deletions": 3,
                    "file_exists": true,
                    "file_name": "src/vm.c",
                    "file_size": 83240
                }
            ],
            "interesting": {
                "reopen": true,
                "status": false
            },
            "is_parent": false,
            "sha": "76f0e755e92d845b4b4bac1d77aa5eeb42bbbec9"
        },
        {
            "associated_pull_request": [
                "https://github.com/mruby/mruby/pull/570"
            ],
            "date": "2012-11-23 08:10:14",
            "diff": "mruby_mruby/issue_561/commit_7bae52fc5666ceb99e702c0f6a084e2fabcf6e1b.diff",
            "diff_additions": 1,
            "diff_deletions": 1,
            "diff_file_size": 0,
            "diff_url": "https://github.com/mruby/mruby/commit/7bae52fc5666ceb99e702c0f6a084e2fabcf6e1b.diff",
            "exists": true,
            "files": [
                {
                    "file_additions": 1,
                    "file_deletions": 1,
                    "file_exists": false,
                    "file_name": "src/codegen.c",
                    "file_size": 0
                }
            ],
            "interesting": {
                "reopen": false,
                "status": false
            },
            "is_parent": false,
            "sha": "7bae52fc5666ceb99e702c0f6a084e2fabcf6e1b"
        },
        {
            "associated_pull_request": [
                "https://github.com/mruby/mruby/pull/570"
            ],
            "date": "2012-11-23 08:10:14",
            "diff": "mruby_mruby/issue_561/commit_7bae52fc5666ceb99e702c0f6a084e2fabcf6e1b.diff",
            "diff_additions": 1,
            "diff_deletions": 1,
            "diff_file_size": 0,
            "diff_url": "https://github.com/mruby/mruby/commit/7bae52fc5666ceb99e702c0f6a084e2fabcf6e1b.diff",
            "exists": true,
            "files": [
                {
                    "file_additions": 1,
                    "file_deletions": 1,
                    "file_exists": false,
                    "file_name": "src/codegen.c",
                    "file_size": 0
                }
            ],
            "interesting": {
                "reopen": false,
                "status": false
            },
            "is_parent": false,
            "sha": "7bae52fc5666ceb99e702c0f6a084e2fabcf6e1b"
        },
        {
            "associated_pull_request": [],
            "date": "2012-11-23 10:50:34",
            "diff": "mruby_mruby/issue_561/commit_32bacb21a2d51e9466b54bc5e30a832e68077c78.diff",
            "diff_additions": 1,
            "diff_deletions": 1,
            "diff_file_size": 0,
            "diff_url": "https://github.com/mruby/mruby/commit/32bacb21a2d51e9466b54bc5e30a832e68077c78.diff",
            "exists": true,
            "files": [
                {
                    "file_additions": 1,
                    "file_deletions": 1,
                    "file_exists": false,
                    "file_name": "src/codegen.c",
                    "file_size": 0
                }
            ],
            "interesting": {
                "reopen": false,
                "status": false
            },
            "is_parent": false,
            "sha": "32bacb21a2d51e9466b54bc5e30a832e68077c78"
        }
    ],
    "first_commit": "2012-11-18 15:47:46",
    "last_commit": "2012-11-23 13:36:29",
    "number": 561,
    "pull_request": "None",
    "score": {
        "accidental_reopen_likely": false,
        "all_labels": [],
        "contains_keywords": [
            "work",
            "report",
            "fix",
            "test",
            "remov",
            "issu",
            "confirm",
            "fail"
        ],
        "fix_size": 21,
        "has_labels": [],
        "intersecting": {
            "computed_score": 1.0,
            "final_commit_size": 2,
            "intersection_size": 2,
            "previous_commits_size": 21
        },
        "is_makefile_based": true,
        "no_new_files": [],
        "no_other_files": false,
        "num_prohibited_files": 28586,
        "prohibited_files": [
            "kill.h",
            "meminfo.h",
            "kill.h",
            "meminfo.h",
            "kill.h",
            "meminfo.h",
            "testsuite_cli_test.go",
            "testsuite_cli_test.go",
            "common.mk",
            "i3bar/include/draw_util.h"
        ],
        "reopen": true,
        "reopen_events": [
            [
                "2012-11-21 08:04:23",
                "closed"
            ],
            [
                "2012-11-21 08:04:23",
                "commit"
            ],
            [
                "2012-11-22 15:58:42",
                "reopened"
            ],
            [
                "2012-11-23 08:31:47",
                "commit"
            ],
            [
                "2012-11-23 10:50:37",
                "closed"
            ],
            [
                "2012-11-23 10:50:37",
                "commit"
            ],
            [
                "2012-11-23 10:50:38",
                "commit"
            ],
            [
                "2013-12-13 12:09:34",
                "commit"
            ],
            [
                "2013-12-13 12:09:34",
                "commit"
            ]
        ],
        "status": false,
        "strategy": true,
        "total_changes": 27
    }
}