{
    "covered_issues": [
        296,
        295,
        293,
        292,
        289,
        287,
        283,
        274,
        273,
        272,
        266,
        265,
        262,
        258,
        253,
        247,
        246,
        244,
        238,
        237,
        235,
        232,
        230,
        229,
        224,
        223,
        222,
        219,
        218,
        197,
        193,
        191,
        185,
        181,
        177,
        174,
        173,
        172,
        171,
        170,
        169,
        168,
        167,
        166,
        164,
        163,
        160,
        155,
        154,
        152,
        149,
        147,
        139,
        136,
        135,
        134,
        129,
        127,
        125,
        117,
        116,
        111,
        110,
        108,
        107,
        105,
        104,
        102,
        101,
        99,
        96,
        95,
        93,
        92,
        91,
        90,
        89,
        88,
        87,
        86,
        85,
        84,
        83,
        82,
        81,
        80,
        79,
        78,
        77,
        76,
        75,
        74,
        73,
        72,
        71,
        70,
        69,
        68,
        67,
        66,
        65,
        64,
        63,
        62,
        61,
        60,
        59,
        58,
        57,
        56,
        55,
        54,
        53,
        52,
        51,
        50,
        49,
        48,
        47,
        46,
        45,
        44,
        43,
        42,
        41,
        40,
        39,
        38,
        37,
        36,
        35,
        34,
        33,
        32,
        31,
        30,
        29,
        28,
        27,
        25,
        24,
        23,
        22,
        21,
        20,
        19,
        18,
        15,
        14,
        13,
        12,
        11,
        10,
        9,
        8,
        7,
        6,
        5,
        4,
        3,
        2,
        1
    ],
    "finished": true
}