{
    "covered_issues": [
        5044,
        5036,
        5030,
        5029,
        5027,
        5018,
        5015,
        5013,
        5011,
        5009,
        5008,
        5007,
        5006,
        4995,
        4994,
        4990,
        4989,
        4974,
        4963,
        4941,
        4940,
        4939,
        4938,
        4937,
        4936,
        4934,
        4933,
        4932,
        4931,
        4930,
        4929,
        4928,
        4927,
        4926,
        4924,
        4923,
        4922,
        4921,
        4920,
        4919,
        4918,
        4917,
        4916,
        4911,
        4902,
        4901,
        4897,
        4896,
        4895,
        4894,
        4893,
        4892,
        4891,
        4890,
        4887,
        4884,
        4883,
        4882,
        4876,
        4875,
        4874,
        4872,
        4871,
        4869,
        4866,
        4865,
        4863,
        4848,
        4847,
        4844,
        4839,
        4833,
        4824,
        4798,
        4793,
        4781,
        4779,
        4777,
        4770,
        4769,
        4767,
        4755,
        4754,
        4749,
        4748,
        4747,
        4746,
        4745,
        4739,
        4729,
        4711,
        4703,
        4702,
        4701,
        4683,
        4682,
        4671,
        4648,
        4647,
        4638,
        4628,
        4624,
        4621,
        4619,
        4617,
        4590,
        4578,
        4571,
        4563,
        4554,
        4538,
        4532,
        4528,
        4512,
        4469,
        4468,
        4467,
        4466,
        4464,
        4463,
        4455,
        4446,
        4445,
        4442,
        4441,
        4440,
        4439,
        4435,
        4432,
        4413,
        4408,
        4406,
        4405,
        4404,
        4403,
        4402,
        4401,
        4400,
        4399,
        4398,
        4397,
        4396,
        4387,
        4385,
        4384,
        4375,
        4366,
        4353,
        4342,
        4341,
        4334,
        4326,
        4324,
        4322,
        4321,
        4303,
        4302,
        4301,
        4300,
        4295,
        4265,
        4263,
        4251,
        4244,
        4243,
        4242,
        4241,
        4240,
        4238,
        4237,
        4234,
        4220,
        4219,
        4218,
        4217,
        4216,
        4215,
        4214,
        4213,
        4212,
        4205,
        4204,
        4195,
        4193,
        4192,
        4190,
        4189,
        4188,
        4187,
        4183,
        4160,
        4159,
        4157,
        4150,
        4149,
        4148,
        4147,
        4146,
        4139,
        4138,
        4135,
        4132,
        4131,
        4130,
        4129,
        4107,
        4097,
        4096,
        4095,
        4094,
        4093,
        4092,
        4076,
        4059,
        4058,
        4057,
        4056,
        4055,
        4054,
        4053,
        4052,
        4051,
        4050,
        4049,
        4048,
        4047,
        4046,
        4045,
        4044,
        4043,
        4042,
        4029,
        4019,
        4018,
        4017,
        4016,
        4015,
        4014,
        4013,
        3994,
        3984,
        3977,
        3976,
        3975,
        3973,
        3951,
        3950,
        3945,
        3944,
        3936,
        3935,
        3934,
        3931,
        3927,
        3926,
        3914,
        3908,
        3903,
        3894,
        3893,
        3888,
        3886,
        3882,
        3881,
        3880,
        3878,
        3871,
        3870,
        3869,
        3868,
        3866,
        3862,
        3861,
        3860,
        3859,
        3858,
        3857,
        3856,
        3855,
        3849,
        3845,
        3844,
        3843,
        3842,
        3841,
        3837,
        3836,
        3835,
        3834,
        3833,
        3830,
        3825,
        3824,
        3823,
        3822,
        3821,
        3820,
        3819,
        3818,
        3817,
        3815,
        3814,
        3813,
        3812,
        3804,
        3788,
        3787,
        3786,
        3785,
        3784,
        3783,
        3779,
        3778,
        3763,
        3762,
        3761,
        3760,
        3758,
        3757,
        3753,
        3751,
        3750,
        3749,
        3748,
        3743,
        3741,
        3737,
        3735,
        3733,
        3727,
        3724,
        3715,
        3714,
        3713,
        3711,
        3710,
        3691,
        3674,
        3671,
        3669,
        3668,
        3665,
        3664,
        3661,
        3658,
        3656,
        3655,
        3650,
        3648,
        3647,
        3646,
        3641,
        3640,
        3637,
        3636,
        3634,
        3630,
        3628,
        3625,
        3622,
        3615,
        3611,
        3608,
        3606,
        3595,
        3592,
        3589,
        3588,
        3587,
        3580,
        3579,
        3578,
        3577,
        3568,
        3564,
        3561,
        3555,
        3554,
        3553,
        3548,
        3544,
        3536,
        3534,
        3532,
        3527,
        3526,
        3523,
        3519,
        3506,
        3500,
        3498,
        3485,
        3483,
        3479,
        3478,
        3477,
        3473,
        3467,
        3463,
        3459,
        3458,
        3455,
        3454,
        3446,
        3437,
        3434,
        3433,
        3432,
        3431,
        3422,
        3421,
        3420,
        3419,
        3411,
        3410,
        3409,
        3408,
        3398,
        3397,
        3396,
        3395,
        3394,
        3393,
        3392,
        3390,
        3389,
        3388,
        3383,
        3381,
        3380,
        3376,
        3364,
        3363,
        3361,
        3360,
        3359,
        3357,
        3356,
        3355,
        3352,
        3351,
        3350,
        3349,
        3348,
        3325,
        3313,
        3306,
        3303,
        3302,
        3300,
        3299,
        3298,
        3297,
        3288,
        3286,
        3277,
        3276,
        3275,
        3271,
        3267,
        3262,
        3255,
        3254,
        3253,
        3252,
        3250,
        3247,
        3243,
        3237,
        3229,
        3222,
        3218,
        3216,
        3214,
        3204,
        3174,
        3173,
        3172,
        3170,
        3169,
        3166,
        3162,
        3161,
        3152,
        3151,
        3145,
        3144,
        3143,
        3142,
        3140,
        3131,
        3130,
        3129,
        3123,
        3121,
        3119,
        3117,
        3114,
        3112,
        3109,
        3107,
        3106,
        3105,
        3104,
        3102,
        3101,
        3100,
        3097,
        3096,
        3095,
        3094,
        3089,
        3088,
        3084,
        3082,
        3079,
        3078,
        3075,
        3072,
        3071,
        3070,
        3068,
        3067,
        3063,
        3062,
        3060,
        3059,
        3058,
        3057,
        3055,
        3050,
        3049,
        3048,
        3046,
        3045,
        3044,
        3043,
        3040,
        3039,
        3034,
        3011,
        3001,
        2993,
        2990,
        2975,
        2963,
        2957,
        2951,
        2950,
        2949,
        2948,
        2947,
        2946,
        2945,
        2937,
        2936,
        2931,
        2930,
        2924,
        2914,
        2911,
        2910,
        2908,
        2906,
        2905,
        2902,
        2901,
        2900,
        2897,
        2896,
        2895,
        2894,
        2891,
        2889,
        2885,
        2884,
        2883,
        2880,
        2879,
        2877,
        2876,
        2869,
        2868,
        2867,
        2866,
        2858,
        2857,
        2854,
        2853,
        2852,
        2851,
        2850,
        2848,
        2847,
        2846,
        2842,
        2832,
        2826,
        2825,
        2824,
        2823,
        2822,
        2820,
        2819,
        2817,
        2815,
        2813,
        2812,
        2802,
        2799,
        2791,
        2783,
        2782,
        2779,
        2777,
        2775,
        2774,
        2770,
        2769,
        2768,
        2763,
        2762,
        2761,
        2757,
        2755,
        2745,
        2743,
        2735,
        2733,
        2732,
        2730,
        2729,
        2724,
        2721,
        2719,
        2713,
        2712,
        2711,
        2700,
        2699,
        2698,
        2693,
        2689,
        2677,
        2676,
        2675,
        2671,
        2667,
        2666,
        2660,
        2659,
        2658,
        2657,
        2656,
        2654,
        2653,
        2652,
        2651,
        2638,
        2624,
        2621,
        2614,
        2603,
        2602,
        2600,
        2593,
        2587,
        2582,
        2581,
        2569,
        2568,
        2562,
        2561,
        2552,
        2544,
        2541,
        2539,
        2537,
        2531,
        2528,
        2522,
        2520,
        2506,
        2494,
        2490,
        2489,
        2488,
        2487,
        2486,
        2478,
        2476,
        2468,
        2465,
        2453,
        2452,
        2451,
        2448,
        2435,
        2433,
        2418,
        2417,
        2413,
        2412,
        2402,
        2399,
        2393,
        2386,
        2384,
        2383,
        2368,
        2366,
        2365,
        2358,
        2356,
        2354,
        2344,
        2338,
        2318,
        2311,
        2310,
        2302,
        2301,
        2297,
        2288,
        2285,
        2284,
        2283,
        2272,
        2268,
        2263,
        2258,
        2254,
        2253,
        2251,
        2238,
        2237,
        2231,
        2230,
        2229,
        2224,
        2213,
        2211,
        2204,
        2203,
        2200,
        2198,
        2193,
        2192,
        2190,
        2189,
        2182,
        2181,
        2180,
        2178,
        2175,
        2173,
        2170,
        2156,
        2149,
        2148,
        2146,
        2145,
        2143,
        2140,
        2134,
        2132,
        2127,
        2124,
        2118,
        2111,
        2110,
        2109,
        2108,
        2107,
        2106,
        2105,
        2104,
        2098,
        2094,
        2093,
        2085,
        2080,
        2077,
        2073,
        2069,
        2065,
        2062,
        2060,
        2058,
        2053,
        2046,
        2041,
        2040,
        2039,
        2038,
        2031,
        2030,
        2029,
        2023,
        2008,
        1997,
        1996,
        1995,
        1993,
        1990,
        1986,
        1981,
        1977,
        1975,
        1974,
        1973,
        1972,
        1971,
        1970,
        1965,
        1963,
        1962,
        1961,
        1952,
        1950,
        1949,
        1948,
        1947,
        1946,
        1945,
        1944,
        1943,
        1936,
        1934,
        1929,
        1918,
        1917,
        1916,
        1913,
        1905,
        1903,
        1900,
        1890,
        1888,
        1887,
        1886,
        1884,
        1881,
        1873,
        1871,
        1870,
        1867,
        1864,
        1861,
        1859,
        1857,
        1855,
        1854,
        1852,
        1845,
        1836,
        1832,
        1831,
        1830,
        1829,
        1823,
        1821,
        1805,
        1799,
        1798,
        1795,
        1794,
        1791,
        1779,
        1776,
        1774,
        1765,
        1763,
        1759,
        1752,
        1751,
        1746,
        1741,
        1737,
        1735,
        1722,
        1717,
        1716,
        1713,
        1709,
        1706,
        1701,
        1694,
        1684,
        1681,
        1675,
        1673,
        1671,
        1670,
        1665,
        1661,
        1657,
        1649,
        1647,
        1641,
        1636,
        1635,
        1634,
        1633,
        1630,
        1624,
        1622,
        1621,
        1616,
        1615,
        1613,
        1605,
        1600,
        1598,
        1597,
        1595,
        1564,
        1562,
        1556,
        1555,
        1552,
        1551,
        1550,
        1549,
        1547,
        1546,
        1545,
        1538,
        1535,
        1533,
        1530,
        1526,
        1519,
        1514,
        1511,
        1496,
        1493,
        1475,
        1454,
        1451,
        1437,
        1434,
        1426,
        1424,
        1419,
        1415,
        1414,
        1392,
        1389,
        1388,
        1387,
        1386,
        1383,
        1375,
        1370,
        1367,
        1366,
        1356,
        1355,
        1354,
        1352,
        1351,
        1342,
        1325,
        1321,
        1319,
        1315,
        1309,
        1305,
        1300,
        1297,
        1296,
        1295,
        1292,
        1286,
        1284,
        1282,
        1280,
        1274,
        1270,
        1268,
        1264,
        1262,
        1248,
        1247,
        1224,
        1223,
        1221,
        1220,
        1218,
        1211,
        1202,
        1196,
        1193,
        1188,
        1184,
        1180,
        1174,
        1148,
        1141,
        1125,
        1110,
        1102,
        1096,
        1094,
        1092,
        1086,
        1083,
        1082,
        1081,
        1080,
        1079,
        1078,
        1077,
        1076,
        1075,
        1074,
        1073,
        1072,
        1071,
        1067,
        1065,
        1057,
        1054,
        1052,
        1051,
        1048,
        1041,
        1032,
        1031,
        1027,
        998,
        994,
        992,
        968,
        964,
        962,
        942,
        933,
        930,
        927,
        923,
        922,
        911,
        900,
        897,
        883,
        881,
        879,
        878,
        853,
        844,
        842,
        827,
        821,
        817,
        816,
        802,
        798,
        797,
        796,
        787,
        786,
        785,
        784,
        783,
        782,
        781,
        780,
        779,
        778,
        776,
        774,
        772,
        770,
        769,
        768,
        762,
        760,
        757,
        755,
        754,
        752,
        747,
        746,
        745,
        744,
        743,
        742,
        741,
        740,
        739,
        738,
        737,
        736,
        735,
        728,
        727,
        726,
        725,
        724,
        722,
        718,
        717,
        716,
        714,
        711,
        710,
        707,
        705,
        704,
        702,
        699,
        693,
        692,
        691,
        689,
        686,
        683,
        682,
        681,
        680,
        675,
        672,
        671,
        669,
        668,
        667,
        665,
        664,
        662,
        661,
        657,
        656,
        655,
        654,
        653,
        652,
        649,
        648,
        646,
        645,
        644,
        642,
        641,
        640,
        639,
        637,
        636,
        634,
        630,
        627,
        626,
        619,
        615,
        614,
        613,
        612,
        610,
        598,
        590,
        587,
        585,
        577,
        572,
        570,
        566,
        563,
        561,
        560,
        555,
        551,
        548,
        546,
        544,
        541,
        535,
        531,
        526,
        516,
        515,
        511,
        501,
        497,
        495,
        494,
        489,
        477,
        475,
        473,
        472,
        470,
        469,
        468,
        466,
        465,
        464,
        463,
        460,
        453,
        447,
        446,
        445,
        440,
        439,
        432,
        429,
        428,
        426,
        424,
        420,
        417,
        414,
        413,
        411,
        410,
        407,
        406,
        405,
        403,
        402,
        388,
        384,
        381,
        380,
        379,
        378,
        364,
        362,
        359,
        358,
        356,
        355,
        354,
        351,
        348,
        346,
        344,
        342,
        341,
        340,
        339,
        333,
        332,
        323,
        317,
        316,
        314,
        313,
        312,
        311,
        310,
        304,
        296,
        295,
        287,
        286,
        285,
        284,
        282,
        281,
        280,
        279,
        278,
        276,
        274,
        267,
        266,
        265,
        264,
        263,
        262,
        261,
        260,
        257,
        256,
        255,
        245,
        243,
        242,
        240,
        239,
        234,
        233,
        231,
        228,
        221,
        213,
        212,
        210,
        208,
        205,
        204,
        203,
        201,
        198,
        197,
        195,
        186,
        185,
        183,
        182,
        181,
        180,
        178,
        176,
        173,
        164,
        161,
        160,
        158,
        156,
        154,
        152,
        150,
        145,
        139,
        133,
        132,
        131,
        130,
        129,
        128,
        123,
        122,
        121,
        120,
        119,
        118,
        117,
        116,
        115,
        114,
        113,
        112,
        111,
        110,
        109,
        108,
        103,
        101,
        94,
        93,
        92,
        88,
        87,
        83,
        82,
        80,
        71,
        70,
        68,
        66,
        63,
        61,
        56,
        55,
        54,
        53,
        52,
        51,
        50,
        49,
        48,
        46,
        45,
        44,
        43,
        35,
        34,
        28,
        27,
        21,
        19,
        17,
        16,
        15,
        6,
        4,
        3,
        2,
        1
    ],
    "finished": true
}