{
    "category": [
        "memory"
    ],
    "commits": [
        {
            "associated_pull_request": [],
            "date": "2018-09-07 14:42:06",
            "diff": "radareorg_radare2/issue_11407/commit_ccf800879803baa82838766a9098d4ab31ee3bcb.diff",
            "diff_additions": 18,
            "diff_deletions": 3,
            "diff_file_size": 200867,
            "diff_url": "https://github.com/radareorg/radare2/commit/ccf800879803baa82838766a9098d4ab31ee3bcb.diff",
            "exists": true,
            "files": [
                {
                    "file_additions": 18,
                    "file_deletions": 3,
                    "file_exists": true,
                    "file_name": "libr/core/cmd_print.c",
                    "file_size": 200867
                }
            ],
            "interesting": {
                "reopen": false,
                "status": false
            },
            "is_parent": true,
            "sha": "ccf800879803baa82838766a9098d4ab31ee3bcb"
        },
        {
            "associated_pull_request": [
                "https://github.com/radareorg/radare2/pull/11443"
            ],
            "date": "2018-09-08 10:08:48",
            "diff": "radareorg_radare2/issue_11407/commit_d6aa6e94a33209da09a61a1fb622a4384a8490b9.diff",
            "diff_additions": 6,
            "diff_deletions": 2,
            "diff_file_size": 0,
            "diff_url": "https://github.com/radareorg/radare2/commit/d6aa6e94a33209da09a61a1fb622a4384a8490b9.diff",
            "exists": true,
            "files": [
                {
                    "file_additions": 6,
                    "file_deletions": 2,
                    "file_exists": false,
                    "file_name": "libr/search/rsa-find.c",
                    "file_size": 0
                }
            ],
            "interesting": {
                "reopen": false,
                "status": true
            },
            "is_parent": false,
            "sha": "d6aa6e94a33209da09a61a1fb622a4384a8490b9"
        },
        {
            "associated_pull_request": [
                "https://github.com/radareorg/radare2/pull/11488"
            ],
            "date": "2018-09-11 21:21:30",
            "diff": "radareorg_radare2/issue_11407/commit_15cac664ae8a9aaa7a9fca1e24cb40f474104972.diff",
            "diff_additions": 1,
            "diff_deletions": 1,
            "diff_file_size": 19053,
            "diff_url": "https://github.com/radareorg/radare2/commit/15cac664ae8a9aaa7a9fca1e24cb40f474104972.diff",
            "exists": true,
            "files": [
                {
                    "file_additions": 1,
                    "file_deletions": 1,
                    "file_exists": true,
                    "file_name": "libr/util/unum.c",
                    "file_size": 19053
                }
            ],
            "interesting": {
                "reopen": false,
                "status": false
            },
            "is_parent": false,
            "sha": "15cac664ae8a9aaa7a9fca1e24cb40f474104972"
        },
        {
            "associated_pull_request": [
                "https://github.com/radareorg/radare2/pull/11489"
            ],
            "date": "2018-09-11 22:23:52",
            "diff": "radareorg_radare2/issue_11407/commit_8ceaed9a414d1ffd0e94c3b2df0f799bc7c6b44b.diff",
            "diff_additions": 6,
            "diff_deletions": 4,
            "diff_file_size": 10370,
            "diff_url": "https://github.com/radareorg/radare2/commit/8ceaed9a414d1ffd0e94c3b2df0f799bc7c6b44b.diff",
            "exists": true,
            "files": [
                {
                    "file_additions": 6,
                    "file_deletions": 4,
                    "file_exists": true,
                    "file_name": "libr/util/hex.c",
                    "file_size": 10370
                }
            ],
            "interesting": {
                "reopen": false,
                "status": false
            },
            "is_parent": false,
            "sha": "8ceaed9a414d1ffd0e94c3b2df0f799bc7c6b44b"
        },
        {
            "associated_pull_request": [
                "https://github.com/radareorg/radare2/pull/11488"
            ],
            "date": "2018-09-12 01:40:51",
            "diff": "radareorg_radare2/issue_11407/commit_3874b7b964b446a8598bec17402716d8494410a5.diff",
            "diff_additions": 1,
            "diff_deletions": 1,
            "diff_file_size": 19053,
            "diff_url": "https://github.com/radareorg/radare2/commit/3874b7b964b446a8598bec17402716d8494410a5.diff",
            "exists": true,
            "files": [
                {
                    "file_additions": 1,
                    "file_deletions": 1,
                    "file_exists": true,
                    "file_name": "libr/util/unum.c",
                    "file_size": 19053
                }
            ],
            "interesting": {
                "reopen": false,
                "status": false
            },
            "is_parent": false,
            "sha": "3874b7b964b446a8598bec17402716d8494410a5"
        },
        {
            "associated_pull_request": [
                "https://github.com/radareorg/radare2/pull/11489"
            ],
            "date": "2018-09-12 02:29:27",
            "diff": "radareorg_radare2/issue_11407/commit_7f816f53dbd37a500d922a562c3aa285932ae3fa.diff",
            "diff_additions": 6,
            "diff_deletions": 4,
            "diff_file_size": 10370,
            "diff_url": "https://github.com/radareorg/radare2/commit/7f816f53dbd37a500d922a562c3aa285932ae3fa.diff",
            "exists": true,
            "files": [
                {
                    "file_additions": 6,
                    "file_deletions": 4,
                    "file_exists": true,
                    "file_name": "libr/util/hex.c",
                    "file_size": 10370
                }
            ],
            "interesting": {
                "reopen": false,
                "status": false
            },
            "is_parent": false,
            "sha": "7f816f53dbd37a500d922a562c3aa285932ae3fa"
        },
        {
            "associated_pull_request": [],
            "date": "2018-09-12 15:22:18",
            "diff": "radareorg_radare2/issue_11407/commit_57f37ab1862dddb57af7a213cc30940bcd5d489b.diff",
            "diff_additions": 1,
            "diff_deletions": 1,
            "diff_file_size": 10755,
            "diff_url": "https://github.com/radareorg/radare2/commit/57f37ab1862dddb57af7a213cc30940bcd5d489b.diff",
            "exists": true,
            "files": [
                {
                    "file_additions": 1,
                    "file_deletions": 1,
                    "file_exists": true,
                    "file_name": "libr/util/calc.c",
                    "file_size": 10755
                }
            ],
            "interesting": {
                "reopen": false,
                "status": true
            },
            "is_parent": false,
            "sha": "57f37ab1862dddb57af7a213cc30940bcd5d489b"
        },
        {
            "associated_pull_request": [],
            "date": "2018-09-12 15:22:18",
            "diff": "radareorg_radare2/issue_11407/commit_8d100dd01011144ff628ede752402b43297ebb68.diff",
            "diff_additions": 1,
            "diff_deletions": 1,
            "diff_file_size": 10755,
            "diff_url": "https://github.com/radareorg/radare2/commit/8d100dd01011144ff628ede752402b43297ebb68.diff",
            "exists": true,
            "files": [
                {
                    "file_additions": 1,
                    "file_deletions": 1,
                    "file_exists": true,
                    "file_name": "libr/util/calc.c",
                    "file_size": 10755
                }
            ],
            "interesting": {
                "reopen": false,
                "status": true
            },
            "is_parent": false,
            "sha": "8d100dd01011144ff628ede752402b43297ebb68"
        },
        {
            "associated_pull_request": [],
            "date": "2018-09-12 15:22:18",
            "diff": "radareorg_radare2/issue_11407/commit_928d102b4a3879bae0ee3aaa3e20509cf864c212.diff",
            "diff_additions": 1,
            "diff_deletions": 1,
            "diff_file_size": 10755,
            "diff_url": "https://github.com/radareorg/radare2/commit/928d102b4a3879bae0ee3aaa3e20509cf864c212.diff",
            "exists": true,
            "files": [
                {
                    "file_additions": 1,
                    "file_deletions": 1,
                    "file_exists": true,
                    "file_name": "libr/util/calc.c",
                    "file_size": 10755
                }
            ],
            "interesting": {
                "reopen": false,
                "status": true
            },
            "is_parent": false,
            "sha": "928d102b4a3879bae0ee3aaa3e20509cf864c212"
        },
        {
            "associated_pull_request": [],
            "date": "2018-09-12 15:22:18",
            "diff": "radareorg_radare2/issue_11407/commit_18eaffc8b8fcc9e4e79f6d9fca60ba756c197b78.diff",
            "diff_additions": 1,
            "diff_deletions": 1,
            "diff_file_size": 10755,
            "diff_url": "https://github.com/radareorg/radare2/commit/18eaffc8b8fcc9e4e79f6d9fca60ba756c197b78.diff",
            "exists": true,
            "files": [
                {
                    "file_additions": 1,
                    "file_deletions": 1,
                    "file_exists": true,
                    "file_name": "libr/util/calc.c",
                    "file_size": 10755
                }
            ],
            "interesting": {
                "reopen": false,
                "status": true
            },
            "is_parent": false,
            "sha": "18eaffc8b8fcc9e4e79f6d9fca60ba756c197b78"
        },
        {
            "associated_pull_request": [
                "https://github.com/radareorg/radare2/pull/11498"
            ],
            "date": "2018-09-12 15:22:18",
            "diff": "radareorg_radare2/issue_11407/commit_fc8d51bbef188698ef1d13c1a3a480fcd1fe587d.diff",
            "diff_additions": 1,
            "diff_deletions": 1,
            "diff_file_size": 10755,
            "diff_url": "https://github.com/radareorg/radare2/commit/fc8d51bbef188698ef1d13c1a3a480fcd1fe587d.diff",
            "exists": true,
            "files": [
                {
                    "file_additions": 1,
                    "file_deletions": 1,
                    "file_exists": true,
                    "file_name": "libr/util/calc.c",
                    "file_size": 10755
                }
            ],
            "interesting": {
                "reopen": false,
                "status": false
            },
            "is_parent": false,
            "sha": "fc8d51bbef188698ef1d13c1a3a480fcd1fe587d"
        },
        {
            "associated_pull_request": [
                "https://github.com/radareorg/radare2/pull/11498"
            ],
            "date": "2018-09-14 14:58:37",
            "diff": "radareorg_radare2/issue_11407/commit_e18c16e71460b1be9a31bd27a4f6e980eaccdf41.diff",
            "diff_additions": 1,
            "diff_deletions": 1,
            "diff_file_size": 10755,
            "diff_url": "https://github.com/radareorg/radare2/commit/e18c16e71460b1be9a31bd27a4f6e980eaccdf41.diff",
            "exists": true,
            "files": [
                {
                    "file_additions": 1,
                    "file_deletions": 1,
                    "file_exists": true,
                    "file_name": "libr/util/calc.c",
                    "file_size": 10755
                }
            ],
            "interesting": {
                "reopen": true,
                "status": false
            },
            "is_parent": false,
            "sha": "e18c16e71460b1be9a31bd27a4f6e980eaccdf41"
        }
    ],
    "first_commit": "2018-09-07 14:42:36",
    "last_commit": "2018-09-14 14:58:37",
    "number": 11407,
    "pull_request": "None",
    "score": {
        "accidental_reopen_likely": false,
        "all_labels": [
            "RSearch",
            "bug"
        ],
        "contains_keywords": [
            "report",
            "reason",
            "error",
            "bug",
            "crash",
            "test",
            "fix",
            "issu",
            "fault"
        ],
        "fix_size": 22,
        "has_labels": [
            "bug"
        ],
        "intersecting": {
            "computed_score": 1.0,
            "final_commit_size": 2,
            "intersection_size": 2,
            "previous_commits_size": 22
        },
        "is_makefile_based": true,
        "no_new_files": [],
        "no_other_files": true,
        "num_prohibited_files": 203242,
        "prohibited_files": [
            "hal/inc/pinmap_hal.h",
            "Debug/marvin.bin",
            "Debug/marvin.elf",
            "Debug/marvin.hex",
            "Debug/marvin.bin",
            "Debug/marvin.elf",
            "Debug/marvin.hex",
            "inc/spark_utilities.h",
            "Debug/marvin.bin",
            "Debug/marvin.elf"
        ],
        "reopen": false,
        "reopen_events": [
            [
                "2018-09-07 21:05:04",
                "commit"
            ],
            [
                "2018-09-08 10:08:52",
                "commit"
            ],
            [
                "2018-09-11 21:23:21",
                "commit"
            ],
            [
                "2018-09-11 22:28:57",
                "commit"
            ],
            [
                "2018-09-12 01:40:57",
                "commit"
            ],
            [
                "2018-09-12 02:29:33",
                "commit"
            ],
            [
                "2018-09-12 15:25:43",
                "commit"
            ],
            [
                "2018-09-13 19:42:25",
                "commit"
            ],
            [
                "2018-09-14 08:07:43",
                "commit"
            ],
            [
                "2018-09-14 10:02:46",
                "commit"
            ],
            [
                "2018-09-14 12:09:50",
                "commit"
            ],
            [
                "2018-09-14 14:58:41",
                "commit"
            ],
            [
                "2018-09-21 02:26:55",
                "closed"
            ],
            [
                "2018-09-21 02:28:04",
                "reopened"
            ],
            [
                "2018-10-11 16:02:01",
                "closed"
            ]
        ],
        "status": true,
        "strategy": true,
        "total_changes": 65
    }
}