{
    "all_issues": 3481,
    "interesting_issues": 9,
    "last_update": "2021-05-16 16:46:33.315851",
    "license": {
        "download": "https://raw.githubusercontent.com/fluent/fluent-bit/master/LICENSE",
        "name": "Apache License 2.0"
    },
    "ratio": 0.002585463947141626,
    "size": 47253,
    "stars": 2738,
    "url": "https://github.com/fluent/fluent-bit"
}