{
    "covered_issues": [
        56,
        36,
        31,
        21,
        16,
        15,
        14,
        13,
        11,
        10,
        9,
        6,
        5,
        3,
        2
    ],
    "finished": true
}