{
    "category": [
        "hardware/OS",
        "feature request"
    ],
    "commits": [
        {
            "associated_pull_request": [
                "https://github.com/openwall/john/pull/2423"
            ],
            "date": "2017-02-12 09:07:08",
            "diff": "openwall_john/issue_2419/commit_8226cb6082edf66423e6c6e945c900a8a9de7552.diff",
            "diff_additions": 28,
            "diff_deletions": 5,
            "diff_file_size": 38302,
            "diff_url": "https://github.com/openwall/john/commit/8226cb6082edf66423e6c6e945c900a8a9de7552.diff",
            "exists": true,
            "files": [
                {
                    "file_additions": 28,
                    "file_deletions": 4,
                    "file_exists": false,
                    "file_name": "src/common-opencl.c",
                    "file_size": 0
                },
                {
                    "file_additions": 0,
                    "file_deletions": 1,
                    "file_exists": true,
                    "file_name": "src/listconf.c",
                    "file_size": 38302
                }
            ],
            "interesting": {
                "reopen": false,
                "status": false
            },
            "is_parent": true,
            "sha": "8226cb6082edf66423e6c6e945c900a8a9de7552"
        },
        {
            "associated_pull_request": [],
            "date": "2017-02-12 14:50:23",
            "diff": "openwall_john/issue_2419/commit_013a525d0dbdabdf34b07ba8e32fb50e299d7651.diff",
            "diff_additions": 541,
            "diff_deletions": 1439,
            "diff_file_size": 54328,
            "diff_url": "https://github.com/openwall/john/commit/013a525d0dbdabdf34b07ba8e32fb50e299d7651.diff",
            "exists": true,
            "files": [
                {
                    "file_additions": 16,
                    "file_deletions": 113,
                    "file_exists": true,
                    "file_name": "src/office_common_plug.c",
                    "file_size": 4036
                },
                {
                    "file_additions": 63,
                    "file_deletions": 17,
                    "file_exists": true,
                    "file_name": "src/office_fmt_plug.c",
                    "file_size": 28621
                },
                {
                    "file_additions": 0,
                    "file_deletions": 433,
                    "file_exists": false,
                    "file_name": "src/opencl_office2007_fmt_plug.c",
                    "file_size": 0
                },
                {
                    "file_additions": 0,
                    "file_deletions": 435,
                    "file_exists": false,
                    "file_name": "src/opencl_office2010_fmt_plug.c",
                    "file_size": 0
                },
                {
                    "file_additions": 0,
                    "file_deletions": 441,
                    "file_exists": false,
                    "file_name": "src/opencl_office2013_fmt_plug.c",
                    "file_size": 0
                },
                {
                    "file_additions": 462,
                    "file_deletions": 0,
                    "file_exists": true,
                    "file_name": "src/opencl_office_fmt_plug.c",
                    "file_size": 21671
                }
            ],
            "interesting": {
                "reopen": false,
                "status": true
            },
            "is_parent": false,
            "sha": "013a525d0dbdabdf34b07ba8e32fb50e299d7651"
        },
        {
            "associated_pull_request": [],
            "date": "2017-02-12 15:43:20",
            "diff": "openwall_john/issue_2419/commit_68a45740f58a9e0cc80d9b89723795042345fb7a.diff",
            "diff_additions": 542,
            "diff_deletions": 1440,
            "diff_file_size": 54328,
            "diff_url": "https://github.com/openwall/john/commit/68a45740f58a9e0cc80d9b89723795042345fb7a.diff",
            "exists": true,
            "files": [
                {
                    "file_additions": 16,
                    "file_deletions": 113,
                    "file_exists": true,
                    "file_name": "src/office_common_plug.c",
                    "file_size": 4036
                },
                {
                    "file_additions": 64,
                    "file_deletions": 18,
                    "file_exists": true,
                    "file_name": "src/office_fmt_plug.c",
                    "file_size": 28621
                },
                {
                    "file_additions": 0,
                    "file_deletions": 433,
                    "file_exists": false,
                    "file_name": "src/opencl_office2007_fmt_plug.c",
                    "file_size": 0
                },
                {
                    "file_additions": 0,
                    "file_deletions": 435,
                    "file_exists": false,
                    "file_name": "src/opencl_office2010_fmt_plug.c",
                    "file_size": 0
                },
                {
                    "file_additions": 0,
                    "file_deletions": 441,
                    "file_exists": false,
                    "file_name": "src/opencl_office2013_fmt_plug.c",
                    "file_size": 0
                },
                {
                    "file_additions": 462,
                    "file_deletions": 0,
                    "file_exists": true,
                    "file_name": "src/opencl_office_fmt_plug.c",
                    "file_size": 21671
                }
            ],
            "interesting": {
                "reopen": false,
                "status": true
            },
            "is_parent": false,
            "sha": "68a45740f58a9e0cc80d9b89723795042345fb7a"
        },
        {
            "associated_pull_request": [],
            "date": "2017-02-12 15:48:41",
            "diff": "openwall_john/issue_2419/commit_de88760a26af869856d88b2f817d3131c3ab2d04.diff",
            "diff_additions": 542,
            "diff_deletions": 1440,
            "diff_file_size": 54328,
            "diff_url": "https://github.com/openwall/john/commit/de88760a26af869856d88b2f817d3131c3ab2d04.diff",
            "exists": true,
            "files": [
                {
                    "file_additions": 16,
                    "file_deletions": 113,
                    "file_exists": true,
                    "file_name": "src/office_common_plug.c",
                    "file_size": 4036
                },
                {
                    "file_additions": 64,
                    "file_deletions": 18,
                    "file_exists": true,
                    "file_name": "src/office_fmt_plug.c",
                    "file_size": 28621
                },
                {
                    "file_additions": 0,
                    "file_deletions": 433,
                    "file_exists": false,
                    "file_name": "src/opencl_office2007_fmt_plug.c",
                    "file_size": 0
                },
                {
                    "file_additions": 0,
                    "file_deletions": 435,
                    "file_exists": false,
                    "file_name": "src/opencl_office2010_fmt_plug.c",
                    "file_size": 0
                },
                {
                    "file_additions": 0,
                    "file_deletions": 441,
                    "file_exists": false,
                    "file_name": "src/opencl_office2013_fmt_plug.c",
                    "file_size": 0
                },
                {
                    "file_additions": 462,
                    "file_deletions": 0,
                    "file_exists": true,
                    "file_name": "src/opencl_office_fmt_plug.c",
                    "file_size": 21671
                }
            ],
            "interesting": {
                "reopen": false,
                "status": true
            },
            "is_parent": false,
            "sha": "de88760a26af869856d88b2f817d3131c3ab2d04"
        },
        {
            "associated_pull_request": [],
            "date": "2017-02-12 15:58:33",
            "diff": "openwall_john/issue_2419/commit_9619a86a9bb2a5d116ae7a210a390ad786f650a9.diff",
            "diff_additions": 542,
            "diff_deletions": 1440,
            "diff_file_size": 54328,
            "diff_url": "https://github.com/openwall/john/commit/9619a86a9bb2a5d116ae7a210a390ad786f650a9.diff",
            "exists": true,
            "files": [
                {
                    "file_additions": 16,
                    "file_deletions": 113,
                    "file_exists": true,
                    "file_name": "src/office_common_plug.c",
                    "file_size": 4036
                },
                {
                    "file_additions": 64,
                    "file_deletions": 18,
                    "file_exists": true,
                    "file_name": "src/office_fmt_plug.c",
                    "file_size": 28621
                },
                {
                    "file_additions": 0,
                    "file_deletions": 433,
                    "file_exists": false,
                    "file_name": "src/opencl_office2007_fmt_plug.c",
                    "file_size": 0
                },
                {
                    "file_additions": 0,
                    "file_deletions": 435,
                    "file_exists": false,
                    "file_name": "src/opencl_office2010_fmt_plug.c",
                    "file_size": 0
                },
                {
                    "file_additions": 0,
                    "file_deletions": 441,
                    "file_exists": false,
                    "file_name": "src/opencl_office2013_fmt_plug.c",
                    "file_size": 0
                },
                {
                    "file_additions": 462,
                    "file_deletions": 0,
                    "file_exists": true,
                    "file_name": "src/opencl_office_fmt_plug.c",
                    "file_size": 21671
                }
            ],
            "interesting": {
                "reopen": false,
                "status": true
            },
            "is_parent": false,
            "sha": "9619a86a9bb2a5d116ae7a210a390ad786f650a9"
        },
        {
            "associated_pull_request": [],
            "date": "2017-02-12 15:58:33",
            "diff": "openwall_john/issue_2419/commit_87b8ec843326505ab8307f46b6d5652afb4edadc.diff",
            "diff_additions": 542,
            "diff_deletions": 1440,
            "diff_file_size": 54328,
            "diff_url": "https://github.com/openwall/john/commit/87b8ec843326505ab8307f46b6d5652afb4edadc.diff",
            "exists": true,
            "files": [
                {
                    "file_additions": 16,
                    "file_deletions": 113,
                    "file_exists": true,
                    "file_name": "src/office_common_plug.c",
                    "file_size": 4036
                },
                {
                    "file_additions": 64,
                    "file_deletions": 18,
                    "file_exists": true,
                    "file_name": "src/office_fmt_plug.c",
                    "file_size": 28621
                },
                {
                    "file_additions": 0,
                    "file_deletions": 433,
                    "file_exists": false,
                    "file_name": "src/opencl_office2007_fmt_plug.c",
                    "file_size": 0
                },
                {
                    "file_additions": 0,
                    "file_deletions": 435,
                    "file_exists": false,
                    "file_name": "src/opencl_office2010_fmt_plug.c",
                    "file_size": 0
                },
                {
                    "file_additions": 0,
                    "file_deletions": 441,
                    "file_exists": false,
                    "file_name": "src/opencl_office2013_fmt_plug.c",
                    "file_size": 0
                },
                {
                    "file_additions": 462,
                    "file_deletions": 0,
                    "file_exists": true,
                    "file_name": "src/opencl_office_fmt_plug.c",
                    "file_size": 21671
                }
            ],
            "interesting": {
                "reopen": false,
                "status": true
            },
            "is_parent": false,
            "sha": "87b8ec843326505ab8307f46b6d5652afb4edadc"
        },
        {
            "associated_pull_request": [],
            "date": "2017-02-12 23:32:34",
            "diff": "openwall_john/issue_2419/commit_bd9734016d3728e490463b88bbc004dc4cbca40a.diff",
            "diff_additions": 542,
            "diff_deletions": 1440,
            "diff_file_size": 54328,
            "diff_url": "https://github.com/openwall/john/commit/bd9734016d3728e490463b88bbc004dc4cbca40a.diff",
            "exists": true,
            "files": [
                {
                    "file_additions": 16,
                    "file_deletions": 113,
                    "file_exists": true,
                    "file_name": "src/office_common_plug.c",
                    "file_size": 4036
                },
                {
                    "file_additions": 64,
                    "file_deletions": 18,
                    "file_exists": true,
                    "file_name": "src/office_fmt_plug.c",
                    "file_size": 28621
                },
                {
                    "file_additions": 0,
                    "file_deletions": 433,
                    "file_exists": false,
                    "file_name": "src/opencl_office2007_fmt_plug.c",
                    "file_size": 0
                },
                {
                    "file_additions": 0,
                    "file_deletions": 435,
                    "file_exists": false,
                    "file_name": "src/opencl_office2010_fmt_plug.c",
                    "file_size": 0
                },
                {
                    "file_additions": 0,
                    "file_deletions": 441,
                    "file_exists": false,
                    "file_name": "src/opencl_office2013_fmt_plug.c",
                    "file_size": 0
                },
                {
                    "file_additions": 462,
                    "file_deletions": 0,
                    "file_exists": true,
                    "file_name": "src/opencl_office_fmt_plug.c",
                    "file_size": 21671
                }
            ],
            "interesting": {
                "reopen": false,
                "status": true
            },
            "is_parent": false,
            "sha": "bd9734016d3728e490463b88bbc004dc4cbca40a"
        },
        {
            "associated_pull_request": [],
            "date": "2017-02-12 23:32:34",
            "diff": "openwall_john/issue_2419/commit_54c156287b62c46573255ed6e6ef3b924af7e130.diff",
            "diff_additions": 542,
            "diff_deletions": 1440,
            "diff_file_size": 54328,
            "diff_url": "https://github.com/openwall/john/commit/54c156287b62c46573255ed6e6ef3b924af7e130.diff",
            "exists": true,
            "files": [
                {
                    "file_additions": 16,
                    "file_deletions": 113,
                    "file_exists": true,
                    "file_name": "src/office_common_plug.c",
                    "file_size": 4036
                },
                {
                    "file_additions": 64,
                    "file_deletions": 18,
                    "file_exists": true,
                    "file_name": "src/office_fmt_plug.c",
                    "file_size": 28621
                },
                {
                    "file_additions": 0,
                    "file_deletions": 433,
                    "file_exists": false,
                    "file_name": "src/opencl_office2007_fmt_plug.c",
                    "file_size": 0
                },
                {
                    "file_additions": 0,
                    "file_deletions": 435,
                    "file_exists": false,
                    "file_name": "src/opencl_office2010_fmt_plug.c",
                    "file_size": 0
                },
                {
                    "file_additions": 0,
                    "file_deletions": 441,
                    "file_exists": false,
                    "file_name": "src/opencl_office2013_fmt_plug.c",
                    "file_size": 0
                },
                {
                    "file_additions": 462,
                    "file_deletions": 0,
                    "file_exists": true,
                    "file_name": "src/opencl_office_fmt_plug.c",
                    "file_size": 21671
                }
            ],
            "interesting": {
                "reopen": false,
                "status": true
            },
            "is_parent": false,
            "sha": "54c156287b62c46573255ed6e6ef3b924af7e130"
        },
        {
            "associated_pull_request": [
                "https://github.com/openwall/john/pull/2424"
            ],
            "date": "2017-02-13 09:26:01",
            "diff": "openwall_john/issue_2419/commit_8adbca2082c735ca147b0fe7917c76287d6ea280.diff",
            "diff_additions": 551,
            "diff_deletions": 1440,
            "diff_file_size": 54328,
            "diff_url": "https://github.com/openwall/john/commit/8adbca2082c735ca147b0fe7917c76287d6ea280.diff",
            "exists": true,
            "files": [
                {
                    "file_additions": 16,
                    "file_deletions": 113,
                    "file_exists": true,
                    "file_name": "src/office_common_plug.c",
                    "file_size": 4036
                },
                {
                    "file_additions": 64,
                    "file_deletions": 18,
                    "file_exists": true,
                    "file_name": "src/office_fmt_plug.c",
                    "file_size": 28621
                },
                {
                    "file_additions": 0,
                    "file_deletions": 433,
                    "file_exists": false,
                    "file_name": "src/opencl_office2007_fmt_plug.c",
                    "file_size": 0
                },
                {
                    "file_additions": 0,
                    "file_deletions": 435,
                    "file_exists": false,
                    "file_name": "src/opencl_office2010_fmt_plug.c",
                    "file_size": 0
                },
                {
                    "file_additions": 0,
                    "file_deletions": 441,
                    "file_exists": false,
                    "file_name": "src/opencl_office2013_fmt_plug.c",
                    "file_size": 0
                },
                {
                    "file_additions": 471,
                    "file_deletions": 0,
                    "file_exists": true,
                    "file_name": "src/opencl_office_fmt_plug.c",
                    "file_size": 21671
                }
            ],
            "interesting": {
                "reopen": false,
                "status": true
            },
            "is_parent": false,
            "sha": "8adbca2082c735ca147b0fe7917c76287d6ea280"
        },
        {
            "associated_pull_request": [
                "https://github.com/openwall/john/pull/2424"
            ],
            "date": "2017-02-13 22:31:28",
            "diff": "openwall_john/issue_2419/commit_6bc03fdcf5e80a5eca2d6696c034d69311fceacf.diff",
            "diff_additions": 551,
            "diff_deletions": 1440,
            "diff_file_size": 54328,
            "diff_url": "https://github.com/openwall/john/commit/6bc03fdcf5e80a5eca2d6696c034d69311fceacf.diff",
            "exists": true,
            "files": [
                {
                    "file_additions": 16,
                    "file_deletions": 113,
                    "file_exists": true,
                    "file_name": "src/office_common_plug.c",
                    "file_size": 4036
                },
                {
                    "file_additions": 64,
                    "file_deletions": 18,
                    "file_exists": true,
                    "file_name": "src/office_fmt_plug.c",
                    "file_size": 28621
                },
                {
                    "file_additions": 0,
                    "file_deletions": 433,
                    "file_exists": false,
                    "file_name": "src/opencl_office2007_fmt_plug.c",
                    "file_size": 0
                },
                {
                    "file_additions": 0,
                    "file_deletions": 435,
                    "file_exists": false,
                    "file_name": "src/opencl_office2010_fmt_plug.c",
                    "file_size": 0
                },
                {
                    "file_additions": 0,
                    "file_deletions": 441,
                    "file_exists": false,
                    "file_name": "src/opencl_office2013_fmt_plug.c",
                    "file_size": 0
                },
                {
                    "file_additions": 471,
                    "file_deletions": 0,
                    "file_exists": true,
                    "file_name": "src/opencl_office_fmt_plug.c",
                    "file_size": 21671
                }
            ],
            "interesting": {
                "reopen": false,
                "status": false
            },
            "is_parent": false,
            "sha": "6bc03fdcf5e80a5eca2d6696c034d69311fceacf"
        }
    ],
    "first_commit": "2017-02-12 09:07:08",
    "last_commit": "2017-02-13 22:31:28",
    "number": 2419,
    "pull_request": "None",
    "score": {
        "accidental_reopen_likely": false,
        "all_labels": [
            "enhancement"
        ],
        "contains_keywords": [
            "bug",
            "work",
            "debug"
        ],
        "fix_size": 1510,
        "has_labels": [],
        "intersecting": {
            "computed_score": 1.0,
            "final_commit_size": 1510,
            "intersection_size": 1510,
            "previous_commits_size": 1510
        },
        "is_makefile_based": false,
        "no_new_files": [],
        "no_other_files": false,
        "num_prohibited_files": 270898,
        "prohibited_files": [
            "hal/inc/pinmap_hal.h",
            "Debug/marvin.bin",
            "Debug/marvin.elf",
            "Debug/marvin.hex",
            "Debug/marvin.bin",
            "Debug/marvin.elf",
            "Debug/marvin.hex",
            "inc/spark_utilities.h",
            "Debug/marvin.bin",
            "Debug/marvin.elf"
        ],
        "reopen": false,
        "reopen_events": [
            [
                "2017-02-12 14:50:39",
                "commit"
            ],
            [
                "2017-02-12 15:17:01",
                "commit"
            ],
            [
                "2017-02-12 15:17:48",
                "commit"
            ],
            [
                "2017-02-12 15:43:32",
                "commit"
            ],
            [
                "2017-02-12 15:48:50",
                "commit"
            ],
            [
                "2017-02-12 15:58:44",
                "commit"
            ],
            [
                "2017-02-12 23:06:00",
                "commit"
            ],
            [
                "2017-02-12 23:46:25",
                "commit"
            ],
            [
                "2017-02-13 01:36:08",
                "commit"
            ],
            [
                "2017-02-13 09:29:20",
                "commit"
            ],
            [
                "2017-02-13 22:31:29",
                "closed"
            ],
            [
                "2017-02-13 22:31:29",
                "commit"
            ]
        ],
        "status": true,
        "strategy": true,
        "total_changes": 17887
    }
}