{
    "commits": [
        {
            "associated_pull_request": [
                "https://github.com/Hamlib/Hamlib/pull/804"
            ],
            "date": "2021-09-21 14:26:11+00:00",
            "diff": "hamlib_hamlib/issue_806/commit_4c0633bf6256af2ce64d7f0aff9b8ea9bc674209.diff",
            "diff_additions": 104,
            "diff_deletions": 40,
            "diff_file_size": 234840,
            "diff_url": "https://github.com/Hamlib/Hamlib/commit/4c0633bf6256af2ce64d7f0aff9b8ea9bc674209.diff",
            "exists": true,
            "files": [
                {
                    "file_additions": 46,
                    "file_deletions": 38,
                    "file_exists": true,
                    "file_name": "src/rig.c",
                    "file_size": 230163
                },
                {
                    "file_additions": 58,
                    "file_deletions": 2,
                    "file_exists": true,
                    "file_name": "tests/testcookie.c",
                    "file_size": 4677
                }
            ],
            "interesting": {
                "reopen": false,
                "status": false
            },
            "is_parent": true,
            "sha": "4c0633bf6256af2ce64d7f0aff9b8ea9bc674209"
        },
        {
            "associated_pull_request": [],
            "date": "2021-09-21 17:17:17+00:00",
            "diff": "hamlib_hamlib/issue_806/commit_a94dcddcf44c5ee1942f5c04a037edfb806f2878.diff",
            "diff_additions": 4,
            "diff_deletions": 1,
            "diff_file_size": 274691,
            "diff_url": "https://github.com/Hamlib/Hamlib/commit/a94dcddcf44c5ee1942f5c04a037edfb806f2878.diff",
            "exists": true,
            "files": [
                {
                    "file_additions": 4,
                    "file_deletions": 1,
                    "file_exists": true,
                    "file_name": "rigs/icom/icom.c",
                    "file_size": 274691
                }
            ],
            "interesting": {
                "reopen": false,
                "status": false
            },
            "is_parent": false,
            "sha": "a94dcddcf44c5ee1942f5c04a037edfb806f2878"
        },
        {
            "associated_pull_request": [],
            "date": "2021-09-22 15:40:56+00:00",
            "diff": "hamlib_hamlib/issue_806/commit_421c6e7c4e4d6ef552ca39241463c71244b424a2.diff",
            "diff_additions": 1,
            "diff_deletions": 1,
            "diff_file_size": 274691,
            "diff_url": "https://github.com/Hamlib/Hamlib/commit/421c6e7c4e4d6ef552ca39241463c71244b424a2.diff",
            "exists": true,
            "files": [
                {
                    "file_additions": 1,
                    "file_deletions": 1,
                    "file_exists": true,
                    "file_name": "rigs/icom/icom.c",
                    "file_size": 274691
                }
            ],
            "interesting": {
                "reopen": true,
                "status": false
            },
            "is_parent": false,
            "sha": "421c6e7c4e4d6ef552ca39241463c71244b424a2"
        },
        {
            "associated_pull_request": [],
            "date": "2021-09-26 22:03:47+00:00",
            "diff": "hamlib_hamlib/issue_806/commit_aae3ec49960d0a3805057971d731ed18051165da.diff",
            "diff_additions": 235,
            "diff_deletions": 65,
            "diff_file_size": 648836,
            "diff_url": "https://github.com/Hamlib/Hamlib/commit/aae3ec49960d0a3805057971d731ed18051165da.diff",
            "exists": true,
            "files": [
                {
                    "file_additions": 2,
                    "file_deletions": 1,
                    "file_exists": true,
                    "file_name": "rigs/icom/ic7000.c",
                    "file_size": 13838
                },
                {
                    "file_additions": 2,
                    "file_deletions": 1,
                    "file_exists": true,
                    "file_name": "rigs/icom/ic703.c",
                    "file_size": 7804
                },
                {
                    "file_additions": 6,
                    "file_deletions": 3,
                    "file_exists": true,
                    "file_name": "rigs/icom/ic706.c",
                    "file_size": 23583
                },
                {
                    "file_additions": 2,
                    "file_deletions": 2,
                    "file_exists": true,
                    "file_name": "rigs/icom/ic7100.c",
                    "file_size": 19387
                },
                {
                    "file_additions": 2,
                    "file_deletions": 1,
                    "file_exists": true,
                    "file_name": "rigs/icom/ic718.c",
                    "file_size": 6922
                },
                {
                    "file_additions": 2,
                    "file_deletions": 1,
                    "file_exists": true,
                    "file_name": "rigs/icom/ic7200.c",
                    "file_size": 11526
                },
                {
                    "file_additions": 6,
                    "file_deletions": 3,
                    "file_exists": true,
                    "file_name": "rigs/icom/ic7300.c",
                    "file_size": 81684
                },
                {
                    "file_additions": 2,
                    "file_deletions": 1,
                    "file_exists": true,
                    "file_name": "rigs/icom/ic7410.c",
                    "file_size": 10796
                },
                {
                    "file_additions": 4,
                    "file_deletions": 2,
                    "file_exists": true,
                    "file_name": "rigs/icom/ic746.c",
                    "file_size": 40843
                },
                {
                    "file_additions": 8,
                    "file_deletions": 4,
                    "file_exists": true,
                    "file_name": "rigs/icom/ic756.c",
                    "file_size": 37578
                },
                {
                    "file_additions": 2,
                    "file_deletions": 1,
                    "file_exists": true,
                    "file_name": "rigs/icom/ic7600.c",
                    "file_size": 17193
                },
                {
                    "file_additions": 2,
                    "file_deletions": 1,
                    "file_exists": true,
                    "file_name": "rigs/icom/ic7610.c",
                    "file_size": 21317
                },
                {
                    "file_additions": 2,
                    "file_deletions": 1,
                    "file_exists": true,
                    "file_name": "rigs/icom/ic7700.c",
                    "file_size": 15922
                },
                {
                    "file_additions": 2,
                    "file_deletions": 1,
                    "file_exists": true,
                    "file_name": "rigs/icom/ic7800.c",
                    "file_size": 18059
                },
                {
                    "file_additions": 2,
                    "file_deletions": 1,
                    "file_exists": true,
                    "file_name": "rigs/icom/ic781.c",
                    "file_size": 6725
                },
                {
                    "file_additions": 2,
                    "file_deletions": 1,
                    "file_exists": true,
                    "file_name": "rigs/icom/ic785x.c",
                    "file_size": 18280
                },
                {
                    "file_additions": 1,
                    "file_deletions": 0,
                    "file_exists": true,
                    "file_name": "rigs/icom/ic910.c",
                    "file_size": 11419
                },
                {
                    "file_additions": 2,
                    "file_deletions": 2,
                    "file_exists": true,
                    "file_name": "rigs/icom/ic9100.c",
                    "file_size": 11269
                },
                {
                    "file_additions": 184,
                    "file_deletions": 38,
                    "file_exists": true,
                    "file_name": "rigs/icom/icom.c",
                    "file_size": 274691
                }
            ],
            "interesting": {
                "reopen": false,
                "status": false
            },
            "is_parent": false,
            "sha": "aae3ec49960d0a3805057971d731ed18051165da"
        },
        {
            "associated_pull_request": [],
            "date": "2021-09-28 17:01:50+00:00",
            "diff": "hamlib_hamlib/issue_806/commit_3a76cb1b40d465e641a7f0d8032c0f7e8638b72b.diff",
            "diff_additions": 48,
            "diff_deletions": 17,
            "diff_file_size": 274691,
            "diff_url": "https://github.com/Hamlib/Hamlib/commit/3a76cb1b40d465e641a7f0d8032c0f7e8638b72b.diff",
            "exists": true,
            "files": [
                {
                    "file_additions": 48,
                    "file_deletions": 17,
                    "file_exists": true,
                    "file_name": "rigs/icom/icom.c",
                    "file_size": 274691
                }
            ],
            "interesting": {
                "reopen": false,
                "status": false
            },
            "is_parent": false,
            "sha": "3a76cb1b40d465e641a7f0d8032c0f7e8638b72b"
        },
        {
            "associated_pull_request": [],
            "date": "2021-09-28 19:06:50+00:00",
            "diff": "hamlib_hamlib/issue_806/commit_8399b4b4dc10541fb68d1cd265bfc718df202f5e.diff",
            "diff_additions": 9,
            "diff_deletions": 0,
            "diff_file_size": 274691,
            "diff_url": "https://github.com/Hamlib/Hamlib/commit/8399b4b4dc10541fb68d1cd265bfc718df202f5e.diff",
            "exists": true,
            "files": [
                {
                    "file_additions": 9,
                    "file_deletions": 0,
                    "file_exists": true,
                    "file_name": "rigs/icom/icom.c",
                    "file_size": 274691
                }
            ],
            "interesting": {
                "reopen": false,
                "status": false
            },
            "is_parent": false,
            "sha": "8399b4b4dc10541fb68d1cd265bfc718df202f5e"
        },
        {
            "associated_pull_request": [],
            "date": "2021-09-29 10:46:53+00:00",
            "diff": "hamlib_hamlib/issue_806/commit_a2b3a8d67e82dc3b8475fbeecdc46434cc91a357.diff",
            "diff_additions": 16,
            "diff_deletions": 12,
            "diff_file_size": 274691,
            "diff_url": "https://github.com/Hamlib/Hamlib/commit/a2b3a8d67e82dc3b8475fbeecdc46434cc91a357.diff",
            "exists": true,
            "files": [
                {
                    "file_additions": 16,
                    "file_deletions": 12,
                    "file_exists": true,
                    "file_name": "rigs/icom/icom.c",
                    "file_size": 274691
                }
            ],
            "interesting": {
                "reopen": false,
                "status": false
            },
            "is_parent": false,
            "sha": "a2b3a8d67e82dc3b8475fbeecdc46434cc91a357"
        },
        {
            "associated_pull_request": [],
            "date": "2021-09-22 15:40:56+00:00",
            "diff": "hamlib_hamlib/issue_806/commit_fdacf9d38892c71be7dbd2c77e6786bcaa6f30c2.diff",
            "diff_additions": 1,
            "diff_deletions": 1,
            "diff_file_size": 274691,
            "diff_url": "https://github.com/Hamlib/Hamlib/commit/fdacf9d38892c71be7dbd2c77e6786bcaa6f30c2.diff",
            "exists": true,
            "files": [
                {
                    "file_additions": 1,
                    "file_deletions": 1,
                    "file_exists": true,
                    "file_name": "rigs/icom/icom.c",
                    "file_size": 274691
                }
            ],
            "interesting": {
                "reopen": false,
                "status": false
            },
            "is_parent": false,
            "sha": "fdacf9d38892c71be7dbd2c77e6786bcaa6f30c2"
        },
        {
            "associated_pull_request": [],
            "date": "2021-09-26 22:03:47+00:00",
            "diff": "hamlib_hamlib/issue_806/commit_3b1ab6b329ba47023b355863e03852ab848a8907.diff",
            "diff_additions": 235,
            "diff_deletions": 65,
            "diff_file_size": 648836,
            "diff_url": "https://github.com/Hamlib/Hamlib/commit/3b1ab6b329ba47023b355863e03852ab848a8907.diff",
            "exists": true,
            "files": [
                {
                    "file_additions": 2,
                    "file_deletions": 1,
                    "file_exists": true,
                    "file_name": "rigs/icom/ic7000.c",
                    "file_size": 13838
                },
                {
                    "file_additions": 2,
                    "file_deletions": 1,
                    "file_exists": true,
                    "file_name": "rigs/icom/ic703.c",
                    "file_size": 7804
                },
                {
                    "file_additions": 6,
                    "file_deletions": 3,
                    "file_exists": true,
                    "file_name": "rigs/icom/ic706.c",
                    "file_size": 23583
                },
                {
                    "file_additions": 2,
                    "file_deletions": 2,
                    "file_exists": true,
                    "file_name": "rigs/icom/ic7100.c",
                    "file_size": 19387
                },
                {
                    "file_additions": 2,
                    "file_deletions": 1,
                    "file_exists": true,
                    "file_name": "rigs/icom/ic718.c",
                    "file_size": 6922
                },
                {
                    "file_additions": 2,
                    "file_deletions": 1,
                    "file_exists": true,
                    "file_name": "rigs/icom/ic7200.c",
                    "file_size": 11526
                },
                {
                    "file_additions": 6,
                    "file_deletions": 3,
                    "file_exists": true,
                    "file_name": "rigs/icom/ic7300.c",
                    "file_size": 81684
                },
                {
                    "file_additions": 2,
                    "file_deletions": 1,
                    "file_exists": true,
                    "file_name": "rigs/icom/ic7410.c",
                    "file_size": 10796
                },
                {
                    "file_additions": 4,
                    "file_deletions": 2,
                    "file_exists": true,
                    "file_name": "rigs/icom/ic746.c",
                    "file_size": 40843
                },
                {
                    "file_additions": 8,
                    "file_deletions": 4,
                    "file_exists": true,
                    "file_name": "rigs/icom/ic756.c",
                    "file_size": 37578
                },
                {
                    "file_additions": 2,
                    "file_deletions": 1,
                    "file_exists": true,
                    "file_name": "rigs/icom/ic7600.c",
                    "file_size": 17193
                },
                {
                    "file_additions": 2,
                    "file_deletions": 1,
                    "file_exists": true,
                    "file_name": "rigs/icom/ic7610.c",
                    "file_size": 21317
                },
                {
                    "file_additions": 2,
                    "file_deletions": 1,
                    "file_exists": true,
                    "file_name": "rigs/icom/ic7700.c",
                    "file_size": 15922
                },
                {
                    "file_additions": 2,
                    "file_deletions": 1,
                    "file_exists": true,
                    "file_name": "rigs/icom/ic7800.c",
                    "file_size": 18059
                },
                {
                    "file_additions": 2,
                    "file_deletions": 1,
                    "file_exists": true,
                    "file_name": "rigs/icom/ic781.c",
                    "file_size": 6725
                },
                {
                    "file_additions": 2,
                    "file_deletions": 1,
                    "file_exists": true,
                    "file_name": "rigs/icom/ic785x.c",
                    "file_size": 18280
                },
                {
                    "file_additions": 1,
                    "file_deletions": 0,
                    "file_exists": true,
                    "file_name": "rigs/icom/ic910.c",
                    "file_size": 11419
                },
                {
                    "file_additions": 2,
                    "file_deletions": 2,
                    "file_exists": true,
                    "file_name": "rigs/icom/ic9100.c",
                    "file_size": 11269
                },
                {
                    "file_additions": 184,
                    "file_deletions": 38,
                    "file_exists": true,
                    "file_name": "rigs/icom/icom.c",
                    "file_size": 274691
                }
            ],
            "interesting": {
                "reopen": false,
                "status": false
            },
            "is_parent": false,
            "sha": "3b1ab6b329ba47023b355863e03852ab848a8907"
        },
        {
            "associated_pull_request": [],
            "date": "2021-09-28 17:01:50+00:00",
            "diff": "hamlib_hamlib/issue_806/commit_b8ef618e7fab44ad1c5c5eda7e3d05441cb9d757.diff",
            "diff_additions": 48,
            "diff_deletions": 17,
            "diff_file_size": 274691,
            "diff_url": "https://github.com/Hamlib/Hamlib/commit/b8ef618e7fab44ad1c5c5eda7e3d05441cb9d757.diff",
            "exists": true,
            "files": [
                {
                    "file_additions": 48,
                    "file_deletions": 17,
                    "file_exists": true,
                    "file_name": "rigs/icom/icom.c",
                    "file_size": 274691
                }
            ],
            "interesting": {
                "reopen": false,
                "status": false
            },
            "is_parent": false,
            "sha": "b8ef618e7fab44ad1c5c5eda7e3d05441cb9d757"
        },
        {
            "associated_pull_request": [],
            "date": "2021-09-28 19:06:50+00:00",
            "diff": "hamlib_hamlib/issue_806/commit_489e225594dd34a60d2e86158c6026e294ce4d78.diff",
            "diff_additions": 9,
            "diff_deletions": 0,
            "diff_file_size": 274691,
            "diff_url": "https://github.com/Hamlib/Hamlib/commit/489e225594dd34a60d2e86158c6026e294ce4d78.diff",
            "exists": true,
            "files": [
                {
                    "file_additions": 9,
                    "file_deletions": 0,
                    "file_exists": true,
                    "file_name": "rigs/icom/icom.c",
                    "file_size": 274691
                }
            ],
            "interesting": {
                "reopen": false,
                "status": false
            },
            "is_parent": false,
            "sha": "489e225594dd34a60d2e86158c6026e294ce4d78"
        },
        {
            "associated_pull_request": [],
            "date": "2021-09-29 10:46:53+00:00",
            "diff": "hamlib_hamlib/issue_806/commit_99cf2f65d55be86bdf263f7ce34e32b0988c7f4c.diff",
            "diff_additions": 16,
            "diff_deletions": 12,
            "diff_file_size": 274691,
            "diff_url": "https://github.com/Hamlib/Hamlib/commit/99cf2f65d55be86bdf263f7ce34e32b0988c7f4c.diff",
            "exists": true,
            "files": [
                {
                    "file_additions": 16,
                    "file_deletions": 12,
                    "file_exists": true,
                    "file_name": "rigs/icom/icom.c",
                    "file_size": 274691
                }
            ],
            "interesting": {
                "reopen": false,
                "status": false
            },
            "is_parent": false,
            "sha": "99cf2f65d55be86bdf263f7ce34e32b0988c7f4c"
        }
    ],
    "first_commit": "2021-09-21 14:26:11+00:00",
    "last_commit": "2021-10-13 19:23:02+00:00",
    "number": 806,
    "pull_request": "None",
    "score": {
        "accidental_reopen_likely": false,
        "all_labels": [
            "bug",
            "needs test"
        ],
        "contains_keywords": [
            "work",
            "chang",
            "issu",
            "problem"
        ],
        "fix_size": 486,
        "has_labels": [
            "bug"
        ],
        "intersecting": {
            "computed_score": 0.7142857142857143,
            "final_commit_size": 28,
            "intersection_size": 20,
            "previous_commits_size": 478
        },
        "is_makefile_based": true,
        "no_new_files": [],
        "no_other_files": false,
        "num_prohibited_files": 876919,
        "prohibited_files": [
            "server/src/main/java/com/genymobile/scrcpy/Device.java",
            "server/src/main/java/com/genymobile/scrcpy/wrappers/SurfaceControl.java",
            "server/src/main/java/com/genymobile/scrcpy/Device.java",
            "server/src/main/java/com/genymobile/scrcpy/wrappers/SurfaceControl.java",
            "app/meson.build",
            "app/scrcpy.1",
            "app/src/common.h",
            "app/src/scrcpy.h",
            "app/src/server.h",
            "server/src/main/java/com/genymobile/scrcpy/Workarounds.java"
        ],
        "reopen": true,
        "reopen_events": [
            [
                "2021-09-21 17:18:04+00:00",
                "commit"
            ],
            [
                "2021-09-21 17:29:57+00:00",
                "closed"
            ],
            [
                "2021-09-22 15:41:41+00:00",
                "commit"
            ],
            [
                "2021-09-23 13:41:17+00:00",
                "reopened"
            ],
            [
                "2021-09-26 22:04:36+00:00",
                "commit"
            ],
            [
                "2021-09-28 17:03:23+00:00",
                "commit"
            ],
            [
                "2021-09-28 19:07:29+00:00",
                "commit"
            ],
            [
                "2021-09-29 10:47:48+00:00",
                "commit"
            ],
            [
                "2021-09-29 14:09:20+00:00",
                "closed"
            ],
            [
                "2021-10-13 19:23:51+00:00",
                "commit"
            ],
            [
                "2021-10-13 19:23:51+00:00",
                "commit"
            ],
            [
                "2021-10-13 19:23:51+00:00",
                "commit"
            ],
            [
                "2021-10-13 19:23:51+00:00",
                "commit"
            ],
            [
                "2021-10-13 19:23:51+00:00",
                "commit"
            ],
            [
                "2021-10-13 19:23:51+00:00",
                "commit"
            ]
        ],
        "status": false,
        "strategy": true,
        "total_changes": 957
    }
}