{
    "covered_issues": [
        61,
        45,
        44,
        42,
        37,
        34,
        30,
        28,
        26,
        25,
        23,
        21,
        20,
        19,
        18,
        12,
        10,
        7,
        6,
        5,
        4,
        2,
        1
    ],
    "finished": true
}