{
    "covered_issues": [
        331,
        329,
        328,
        325,
        324,
        323,
        322,
        321,
        320,
        317,
        316,
        315,
        311,
        308,
        306,
        305,
        302,
        301,
        300,
        299,
        298,
        297,
        295,
        294,
        293,
        292,
        291,
        290,
        289,
        286,
        285,
        283,
        280,
        279,
        277,
        276,
        275,
        274,
        273,
        272,
        271,
        269,
        268,
        265,
        259,
        257,
        256,
        255,
        252,
        250,
        249,
        248,
        243,
        242,
        241,
        239,
        238,
        237,
        236,
        235,
        233,
        232,
        231,
        230,
        229,
        227,
        226,
        223,
        216,
        214,
        211,
        210,
        207,
        206,
        205,
        204,
        203,
        202,
        201,
        200,
        196,
        194,
        192,
        191,
        189,
        187,
        186,
        185,
        184,
        183,
        182,
        181,
        179,
        177,
        176,
        174,
        173,
        172,
        171,
        170,
        168,
        167,
        166,
        164,
        163,
        161,
        159,
        158,
        157,
        154,
        153,
        152,
        151,
        150,
        148,
        147,
        146,
        143,
        142,
        141,
        140,
        139,
        138,
        137,
        136,
        135,
        134,
        132,
        130,
        129,
        128,
        127,
        125,
        124,
        122,
        120,
        119,
        118,
        117,
        116,
        115,
        114,
        113,
        112,
        111,
        108,
        107,
        106,
        105,
        104,
        102,
        101,
        100,
        99,
        96,
        95,
        92,
        91,
        90,
        89,
        88,
        87,
        86,
        85,
        84,
        83,
        82,
        81,
        80,
        79,
        77,
        75,
        72,
        68,
        66,
        65,
        64,
        63,
        61,
        60,
        57,
        53,
        52,
        50,
        49,
        48,
        47,
        45,
        43,
        42,
        41,
        40,
        39,
        38,
        35,
        30,
        28,
        26,
        25,
        23,
        22,
        21,
        19,
        18,
        17,
        16,
        14,
        13,
        12,
        10,
        9,
        4,
        3,
        2,
        1
    ],
    "finished": true
}