{
    "covered_issues": [
        152,
        147,
        146,
        142,
        137,
        132,
        128,
        121,
        120,
        118,
        116,
        113,
        111,
        110,
        109,
        108,
        105,
        103,
        102,
        92,
        91,
        90,
        88,
        80,
        79,
        78,
        77,
        76,
        74,
        68,
        67,
        62,
        61,
        58,
        56,
        54,
        53,
        52,
        51,
        46,
        44,
        43,
        35,
        34,
        24,
        23,
        22,
        20,
        17,
        12,
        11,
        10,
        8,
        6,
        2,
        1
    ],
    "finished": true
}