{
    "commits": [
        {
            "associated_pull_request": [
                "https://github.com/c3lang/c3c/pull/861"
            ],
            "date": "2023-07-18 10:18:12+00:00",
            "diff": "c3lang_c3c/issue_862/commit_491c5ceec5e74d5d492c4f2b3197b9b3f01815d5.diff",
            "diff_additions": 1,
            "diff_deletions": 1,
            "diff_file_size": 29575,
            "diff_url": "https://github.com/c3lang/c3c/commit/491c5ceec5e74d5d492c4f2b3197b9b3f01815d5.diff",
            "exists": true,
            "files": [
                {
                    "file_additions": 1,
                    "file_deletions": 1,
                    "file_exists": true,
                    "file_name": "src/compiler/sema_name_resolution.c",
                    "file_size": 29575
                }
            ],
            "interesting": {
                "reopen": false,
                "status": false
            },
            "is_parent": true,
            "sha": "491c5ceec5e74d5d492c4f2b3197b9b3f01815d5"
        },
        {
            "associated_pull_request": [],
            "date": "2023-07-18 20:28:43+00:00",
            "diff": "c3lang_c3c/issue_862/commit_e7a08fa0bab2cb60e7fe234694b2d6aba1a842ab.diff",
            "diff_additions": 5,
            "diff_deletions": 17,
            "diff_file_size": 294592,
            "diff_url": "https://github.com/c3lang/c3c/commit/e7a08fa0bab2cb60e7fe234694b2d6aba1a842ab.diff",
            "exists": true,
            "files": [
                {
                    "file_additions": 3,
                    "file_deletions": 4,
                    "file_exists": true,
                    "file_name": "src/compiler/llvm_codegen.c",
                    "file_size": 56781
                },
                {
                    "file_additions": 1,
                    "file_deletions": 1,
                    "file_exists": true,
                    "file_name": "src/compiler/llvm_codegen_expr.c",
                    "file_size": 233079
                },
                {
                    "file_additions": 1,
                    "file_deletions": 12,
                    "file_exists": true,
                    "file_name": "src/compiler/llvm_codegen_storeload.c",
                    "file_size": 4732
                }
            ],
            "interesting": {
                "reopen": false,
                "status": false
            },
            "is_parent": false,
            "sha": "e7a08fa0bab2cb60e7fe234694b2d6aba1a842ab"
        },
        {
            "associated_pull_request": [],
            "date": "2023-07-18 20:28:43+00:00",
            "diff": "c3lang_c3c/issue_862/commit_df4ee6ff49bfbed745dd2c546e091ecc8ac54964.diff",
            "diff_additions": 19,
            "diff_deletions": 22,
            "diff_file_size": 336780,
            "diff_url": "https://github.com/c3lang/c3c/commit/df4ee6ff49bfbed745dd2c546e091ecc8ac54964.diff",
            "exists": true,
            "files": [
                {
                    "file_additions": 5,
                    "file_deletions": 4,
                    "file_exists": true,
                    "file_name": "src/compiler/llvm_codegen.c",
                    "file_size": 56781
                },
                {
                    "file_additions": 11,
                    "file_deletions": 5,
                    "file_exists": true,
                    "file_name": "src/compiler/llvm_codegen_expr.c",
                    "file_size": 233079
                },
                {
                    "file_additions": 2,
                    "file_deletions": 1,
                    "file_exists": true,
                    "file_name": "src/compiler/llvm_codegen_stmt.c",
                    "file_size": 42188
                },
                {
                    "file_additions": 1,
                    "file_deletions": 12,
                    "file_exists": true,
                    "file_name": "src/compiler/llvm_codegen_storeload.c",
                    "file_size": 4732
                }
            ],
            "interesting": {
                "reopen": true,
                "status": false
            },
            "is_parent": false,
            "sha": "df4ee6ff49bfbed745dd2c546e091ecc8ac54964"
        },
        {
            "associated_pull_request": [],
            "date": "2023-07-19 09:38:18+00:00",
            "diff": "c3lang_c3c/issue_862/commit_5aae9f32043a9a2b43493743c73557f0465a4d4d.diff",
            "diff_additions": 1,
            "diff_deletions": 0,
            "diff_file_size": 26783,
            "diff_url": "https://github.com/c3lang/c3c/commit/5aae9f32043a9a2b43493743c73557f0465a4d4d.diff",
            "exists": true,
            "files": [
                {
                    "file_additions": 1,
                    "file_deletions": 0,
                    "file_exists": true,
                    "file_name": "src/compiler/copying.c",
                    "file_size": 26783
                }
            ],
            "interesting": {
                "reopen": false,
                "status": false
            },
            "is_parent": false,
            "sha": "5aae9f32043a9a2b43493743c73557f0465a4d4d"
        }
    ],
    "first_commit": "2023-07-18 10:18:12+00:00",
    "last_commit": "2023-07-19 09:38:18+00:00",
    "number": 862,
    "pull_request": "None",
    "score": {
        "accidental_reopen_likely": false,
        "all_labels": [
            "bug",
            "fixed needs check"
        ],
        "contains_keywords": [
            "fail",
            "fix",
            "issu",
            "test",
            "error"
        ],
        "fix_size": 42,
        "has_labels": [
            "bug"
        ],
        "intersecting": {
            "computed_score": 0.0,
            "final_commit_size": 2,
            "intersection_size": 0,
            "previous_commits_size": 40
        },
        "is_makefile_based": true,
        "no_new_files": [
            "src/compiler/copying.c"
        ],
        "no_other_files": false,
        "num_prohibited_files": 320921,
        "prohibited_files": [
            "server/src/main/java/com/genymobile/scrcpy/Device.java",
            "server/src/main/java/com/genymobile/scrcpy/wrappers/SurfaceControl.java",
            "server/src/main/java/com/genymobile/scrcpy/Device.java",
            "server/src/main/java/com/genymobile/scrcpy/wrappers/SurfaceControl.java",
            "app/meson.build",
            "app/scrcpy.1",
            "app/src/common.h",
            "app/src/scrcpy.h",
            "app/src/server.h",
            "server/src/main/java/com/genymobile/scrcpy/Workarounds.java"
        ],
        "reopen": true,
        "reopen_events": [
            [
                "2023-07-18 20:28:49+00:00",
                "commit"
            ],
            [
                "2023-07-18 21:16:46+00:00",
                "commit"
            ],
            [
                "2023-07-18 21:23:55+00:00",
                "commit"
            ],
            [
                "2023-07-18 23:18:17+00:00",
                "commit"
            ],
            [
                "2023-07-19 07:25:44+00:00",
                "closed"
            ],
            [
                "2023-07-19 07:39:06+00:00",
                "reopened"
            ],
            [
                "2023-07-19 09:38:28+00:00",
                "commit"
            ],
            [
                "2023-07-19 11:30:05+00:00",
                "closed"
            ]
        ],
        "status": false,
        "strategy": true,
        "total_changes": 66
    }
}