{
    "commits": [
        {
            "associated_pull_request": [],
            "date": "2020-12-14 13:07:03+00:00",
            "diff": "surge-synthesizer_surge/issue_3392/commit_b8fd53307397bb6e4d592a1d36cb550ac5beea02.diff",
            "diff_additions": 174,
            "diff_deletions": 4,
            "diff_file_size": 0,
            "diff_url": "https://github.com/surge-synthesizer/surge/commit/b8fd53307397bb6e4d592a1d36cb550ac5beea02.diff",
            "exists": true,
            "files": [
                {
                    "file_additions": 1,
                    "file_deletions": 1,
                    "file_exists": false,
                    "file_name": "src/common/dsp/FilterCoefficientMaker.cpp",
                    "file_size": 0
                },
                {
                    "file_additions": 47,
                    "file_deletions": 3,
                    "file_exists": false,
                    "file_name": "src/common/dsp/filters/NonlinearFeedback.cpp",
                    "file_size": 0
                },
                {
                    "file_additions": 122,
                    "file_deletions": 0,
                    "file_exists": false,
                    "file_name": "src/headless/HeadlessNonTestFunctions.cpp",
                    "file_size": 0
                },
                {
                    "file_additions": 4,
                    "file_deletions": 0,
                    "file_exists": false,
                    "file_name": "src/headless/main.cpp",
                    "file_size": 0
                }
            ],
            "interesting": {
                "reopen": false,
                "status": false
            },
            "is_parent": true,
            "sha": "b8fd53307397bb6e4d592a1d36cb550ac5beea02"
        },
        {
            "associated_pull_request": [],
            "date": "2020-12-14 02:27:49+00:00",
            "diff": "surge-synthesizer_surge/issue_3392/commit_aadbe82f3d5ffbd203bcdfc548a3a60d49775adc.diff",
            "diff_additions": 69,
            "diff_deletions": 34,
            "diff_file_size": 11179,
            "diff_url": "https://github.com/surge-synthesizer/surge/commit/aadbe82f3d5ffbd203bcdfc548a3a60d49775adc.diff",
            "exists": true,
            "files": [
                {
                    "file_additions": 57,
                    "file_deletions": 33,
                    "file_exists": true,
                    "file_name": "src/common/ModulatorPresetManager.cpp",
                    "file_size": 11179
                },
                {
                    "file_additions": 12,
                    "file_deletions": 1,
                    "file_exists": false,
                    "file_name": "src/common/gui/SurgeGUIEditor.cpp",
                    "file_size": 0
                }
            ],
            "interesting": {
                "reopen": false,
                "status": false
            },
            "is_parent": false,
            "sha": "aadbe82f3d5ffbd203bcdfc548a3a60d49775adc"
        },
        {
            "associated_pull_request": [
                "https://github.com/surge-synthesizer/surge/pull/3429"
            ],
            "date": "2020-12-14 02:27:49+00:00",
            "diff": "surge-synthesizer_surge/issue_3392/commit_258e4dd37abb28e784c5b4b3ddd98ade2e6a94c9.diff",
            "diff_additions": 77,
            "diff_deletions": 34,
            "diff_file_size": 11179,
            "diff_url": "https://github.com/surge-synthesizer/surge/commit/258e4dd37abb28e784c5b4b3ddd98ade2e6a94c9.diff",
            "exists": true,
            "files": [
                {
                    "file_additions": 57,
                    "file_deletions": 33,
                    "file_exists": true,
                    "file_name": "src/common/ModulatorPresetManager.cpp",
                    "file_size": 11179
                },
                {
                    "file_additions": 20,
                    "file_deletions": 1,
                    "file_exists": false,
                    "file_name": "src/common/gui/SurgeGUIEditor.cpp",
                    "file_size": 0
                }
            ],
            "interesting": {
                "reopen": false,
                "status": false
            },
            "is_parent": false,
            "sha": "258e4dd37abb28e784c5b4b3ddd98ade2e6a94c9"
        },
        {
            "associated_pull_request": [
                "https://github.com/surge-synthesizer/surge/pull/3429"
            ],
            "date": "2020-12-14 16:05:33+00:00",
            "diff": "surge-synthesizer_surge/issue_3392/commit_c8003b77b7cae9f4f4f9ae9faa2d839b615c4492.diff",
            "diff_additions": 77,
            "diff_deletions": 34,
            "diff_file_size": 11179,
            "diff_url": "https://github.com/surge-synthesizer/surge/commit/c8003b77b7cae9f4f4f9ae9faa2d839b615c4492.diff",
            "exists": true,
            "files": [
                {
                    "file_additions": 57,
                    "file_deletions": 33,
                    "file_exists": true,
                    "file_name": "src/common/ModulatorPresetManager.cpp",
                    "file_size": 11179
                },
                {
                    "file_additions": 20,
                    "file_deletions": 1,
                    "file_exists": false,
                    "file_name": "src/common/gui/SurgeGUIEditor.cpp",
                    "file_size": 0
                }
            ],
            "interesting": {
                "reopen": true,
                "status": false
            },
            "is_parent": false,
            "sha": "c8003b77b7cae9f4f4f9ae9faa2d839b615c4492"
        },
        {
            "associated_pull_request": [
                "https://github.com/surge-synthesizer/surge/pull/3679"
            ],
            "date": "2021-01-20 14:28:07+00:00",
            "diff": "surge-synthesizer_surge/issue_3392/commit_c1edb7b9839bd749b8a897a50e7cafe1a09ae6b8.diff",
            "diff_additions": 27,
            "diff_deletions": 0,
            "diff_file_size": 11179,
            "diff_url": "https://github.com/surge-synthesizer/surge/commit/c1edb7b9839bd749b8a897a50e7cafe1a09ae6b8.diff",
            "exists": true,
            "files": [
                {
                    "file_additions": 27,
                    "file_deletions": 0,
                    "file_exists": true,
                    "file_name": "src/common/ModulatorPresetManager.cpp",
                    "file_size": 11179
                }
            ],
            "interesting": {
                "reopen": false,
                "status": false
            },
            "is_parent": false,
            "sha": "c1edb7b9839bd749b8a897a50e7cafe1a09ae6b8"
        },
        {
            "associated_pull_request": [
                "https://github.com/surge-synthesizer/surge/pull/3679"
            ],
            "date": "2021-01-20 14:51:02+00:00",
            "diff": "surge-synthesizer_surge/issue_3392/commit_d36bd23d5041784db952c426976693c99e814e70.diff",
            "diff_additions": 27,
            "diff_deletions": 0,
            "diff_file_size": 11179,
            "diff_url": "https://github.com/surge-synthesizer/surge/commit/d36bd23d5041784db952c426976693c99e814e70.diff",
            "exists": true,
            "files": [
                {
                    "file_additions": 27,
                    "file_deletions": 0,
                    "file_exists": true,
                    "file_name": "src/common/ModulatorPresetManager.cpp",
                    "file_size": 11179
                }
            ],
            "interesting": {
                "reopen": false,
                "status": false
            },
            "is_parent": false,
            "sha": "d36bd23d5041784db952c426976693c99e814e70"
        }
    ],
    "first_commit": "2020-12-14 13:15:12+00:00",
    "last_commit": "2021-01-20 14:51:02+00:00",
    "number": 3392,
    "pull_request": "None",
    "score": {
        "accidental_reopen_likely": false,
        "all_labels": [
            "UI",
            "Bug Report"
        ],
        "contains_keywords": [
            "work",
            "chang",
            "fix"
        ],
        "fix_size": 99,
        "has_labels": [],
        "intersecting": {
            "computed_score": 1.0,
            "final_commit_size": 28,
            "intersection_size": 28,
            "previous_commits_size": 99
        },
        "is_makefile_based": true,
        "no_new_files": [],
        "no_other_files": false,
        "num_prohibited_files": 237714,
        "prohibited_files": [
            "server/src/main/java/com/genymobile/scrcpy/Device.java",
            "server/src/main/java/com/genymobile/scrcpy/wrappers/SurfaceControl.java",
            "server/src/main/java/com/genymobile/scrcpy/Device.java",
            "server/src/main/java/com/genymobile/scrcpy/wrappers/SurfaceControl.java",
            "app/meson.build",
            "app/scrcpy.1",
            "app/src/common.h",
            "app/src/scrcpy.h",
            "app/src/server.h",
            "server/src/main/java/com/genymobile/scrcpy/Workarounds.java"
        ],
        "reopen": true,
        "reopen_events": [
            [
                "2020-12-14 14:09:28+00:00",
                "commit"
            ],
            [
                "2020-12-14 14:48:11+00:00",
                "commit"
            ],
            [
                "2020-12-14 16:05:34+00:00",
                "closed"
            ],
            [
                "2020-12-14 16:05:35+00:00",
                "commit"
            ],
            [
                "2021-01-17 22:49:24+00:00",
                "reopened"
            ],
            [
                "2021-01-20 14:28:44+00:00",
                "commit"
            ],
            [
                "2021-01-20 14:51:03+00:00",
                "closed"
            ],
            [
                "2021-01-20 14:51:04+00:00",
                "commit"
            ]
        ],
        "status": false,
        "strategy": true,
        "total_changes": 557
    }
}