{
    "commits": [
        {
            "associated_pull_request": [
                "https://github.com/aitos-io/BoAT-X-Framework/pull/605"
            ],
            "date": "2022-03-11 03:57:55+00:00",
            "diff": "aitos-io_boat-x-framework/issue_594/commit_123680051b25c3e05e98a3920495091ff3cb5a52.diff",
            "diff_additions": 23,
            "diff_deletions": 0,
            "diff_file_size": 0,
            "diff_url": "https://github.com/aitos-io/BoAT-X-Framework/commit/123680051b25c3e05e98a3920495091ff3cb5a52.diff",
            "exists": true,
            "files": [
                {
                    "file_additions": 23,
                    "file_deletions": 0,
                    "file_exists": false,
                    "file_name": "tests/BoAT_ethereum_linuxDefault/01Wallet.c",
                    "file_size": 0
                }
            ],
            "interesting": {
                "reopen": false,
                "status": false
            },
            "is_parent": true,
            "sha": "123680051b25c3e05e98a3920495091ff3cb5a52"
        },
        {
            "associated_pull_request": [
                "https://github.com/aitos-io/BoAT-X-Framework/pull/605"
            ],
            "date": "2022-03-11 06:06:32+00:00",
            "diff": "aitos-io_boat-x-framework/issue_594/commit_77c3cda562000c55a3adc9c1af70c8f80e84023b.diff",
            "diff_additions": 20,
            "diff_deletions": 21,
            "diff_file_size": 0,
            "diff_url": "https://github.com/aitos-io/BoAT-X-Framework/commit/77c3cda562000c55a3adc9c1af70c8f80e84023b.diff",
            "exists": true,
            "files": [
                {
                    "file_additions": 20,
                    "file_deletions": 21,
                    "file_exists": false,
                    "file_name": "tests/BoAT_ethereum_linuxDefault/tcase_entry.c",
                    "file_size": 0
                }
            ],
            "interesting": {
                "reopen": true,
                "status": false
            },
            "is_parent": false,
            "sha": "77c3cda562000c55a3adc9c1af70c8f80e84023b"
        },
        {
            "associated_pull_request": [
                "https://github.com/aitos-io/BoAT-X-Framework/pull/761"
            ],
            "date": "2022-05-07 12:54:06+00:00",
            "diff": "aitos-io_boat-x-framework/issue_594/commit_265c5e0d61567bd240aa53e4a589a3799f68d018.diff",
            "diff_additions": 63,
            "diff_deletions": 63,
            "diff_file_size": 0,
            "diff_url": "https://github.com/aitos-io/BoAT-X-Framework/commit/265c5e0d61567bd240aa53e4a589a3799f68d018.diff",
            "exists": true,
            "files": [
                {
                    "file_additions": 63,
                    "file_deletions": 63,
                    "file_exists": false,
                    "file_name": "tests/BoAT_chainmaker_linuxDefault/tcase_entry.c",
                    "file_size": 0
                }
            ],
            "interesting": {
                "reopen": false,
                "status": false
            },
            "is_parent": false,
            "sha": "265c5e0d61567bd240aa53e4a589a3799f68d018"
        },
        {
            "associated_pull_request": [
                "https://github.com/aitos-io/BoAT-X-Framework/pull/761"
            ],
            "date": "2022-05-07 12:59:47+00:00",
            "diff": "aitos-io_boat-x-framework/issue_594/commit_245a9e038fde0fe276dcf180944b32f8f4362a7b.diff",
            "diff_additions": 74,
            "diff_deletions": 74,
            "diff_file_size": 0,
            "diff_url": "https://github.com/aitos-io/BoAT-X-Framework/commit/245a9e038fde0fe276dcf180944b32f8f4362a7b.diff",
            "exists": true,
            "files": [
                {
                    "file_additions": 74,
                    "file_deletions": 74,
                    "file_exists": false,
                    "file_name": "tests/BoAT_fabric_linuxDefault/tcase_entry.c",
                    "file_size": 0
                }
            ],
            "interesting": {
                "reopen": false,
                "status": false
            },
            "is_parent": false,
            "sha": "245a9e038fde0fe276dcf180944b32f8f4362a7b"
        }
    ],
    "first_commit": "2022-03-11 03:57:55+00:00",
    "last_commit": "2022-05-07 12:59:47+00:00",
    "number": 594,
    "pull_request": "None",
    "score": {
        "accidental_reopen_likely": false,
        "all_labels": [
            "enhancement",
            "Severity/minor",
            "Priority/P4"
        ],
        "contains_keywords": [
            "issu",
            "test"
        ],
        "fix_size": 164,
        "has_labels": [],
        "intersecting": {
            "computed_score": 0.0,
            "final_commit_size": 75,
            "intersection_size": 0,
            "previous_commits_size": 89
        },
        "is_makefile_based": true,
        "no_new_files": [
            "tests/BoAT_fabric_linuxDefault/tcase_entry.c"
        ],
        "no_other_files": true,
        "num_prohibited_files": 232744,
        "prohibited_files": [
            "server/src/main/java/com/genymobile/scrcpy/Device.java",
            "server/src/main/java/com/genymobile/scrcpy/wrappers/SurfaceControl.java",
            "server/src/main/java/com/genymobile/scrcpy/Device.java",
            "server/src/main/java/com/genymobile/scrcpy/wrappers/SurfaceControl.java",
            "app/meson.build",
            "app/scrcpy.1",
            "app/src/common.h",
            "app/src/scrcpy.h",
            "app/src/server.h",
            "server/src/main/java/com/genymobile/scrcpy/Workarounds.java"
        ],
        "reopen": true,
        "reopen_events": [
            [
                "2022-03-11 09:35:04+00:00",
                "commit"
            ],
            [
                "2022-05-07 07:36:02+00:00",
                "closed"
            ],
            [
                "2022-05-07 12:50:01+00:00",
                "reopened"
            ],
            [
                "2022-05-07 13:03:04+00:00",
                "commit"
            ],
            [
                "2022-05-07 13:03:04+00:00",
                "commit"
            ],
            [
                "2022-05-07 13:04:47+00:00",
                "closed"
            ]
        ],
        "status": false,
        "strategy": true,
        "total_changes": 338
    }
}