{
    "all_issues": 2827,
    "interesting_issues": 27,
    "last_update": "2021-05-16 22:08:17.250739",
    "license": {
        "download": "https://raw.githubusercontent.com/neomutt/neomutt/master/LICENSE.md",
        "name": "GNU General Public License v2.0"
    },
    "ratio": 0.00955076052352317,
    "size": 117312,
    "stars": 2166,
    "url": "https://github.com/neomutt/neomutt"
}