{
    "commits": [
        {
            "diff": "elastic_elasticsearch/issue_38027/commit_53e80e98148a714d90da8f49bb283d290d737109.diff",
            "diff_additions": 1,
            "diff_deletions": 0,
            "diff_file_size": 0,
            "files": [
                {
                    "file_additions": 1,
                    "file_deletions": 0,
                    "file_exists": false,
                    "file_name": "x-pack/plugin/security/src/test/java/org/elasticsearch/integration/ClusterPrivilegeTests.java",
                    "file_size": 0
                }
            ],
            "interesting": {
                "reopened": false,
                "status": false
            },
            "sha": "53e80e98148a714d90da8f49bb283d290d737109"
        },
        {
            "diff": "elastic_elasticsearch/issue_38027/commit_63c57b3b84931a92ce7489fcbe408ac2171014b1.diff",
            "diff_additions": 5,
            "diff_deletions": 2,
            "diff_file_size": 0,
            "files": [
                {
                    "file_additions": 5,
                    "file_deletions": 2,
                    "file_exists": false,
                    "file_name": "x-pack/plugin/ccr/src/test/java/org/elasticsearch/xpack/ccr/CcrRepositoryIT.java",
                    "file_size": 0
                }
            ],
            "interesting": {
                "reopened": true,
                "status": false
            },
            "sha": "63c57b3b84931a92ce7489fcbe408ac2171014b1"
        },
        {
            "diff": "elastic_elasticsearch/issue_38027/commit_f15d7b9b910907c56c1be04b86a1592c0adcd508.diff",
            "diff_additions": 1,
            "diff_deletions": 0,
            "diff_file_size": 0,
            "files": [
                {
                    "file_additions": 1,
                    "file_deletions": 0,
                    "file_exists": false,
                    "file_name": "x-pack/plugin/ccr/src/test/java/org/elasticsearch/xpack/ccr/CcrRepositoryIT.java",
                    "file_size": 0
                }
            ],
            "interesting": {
                "reopened": false,
                "status": false
            },
            "sha": "f15d7b9b910907c56c1be04b86a1592c0adcd508"
        },
        {
            "diff": "elastic_elasticsearch/issue_38027/commit_07fd2610b2c23d552d776268db036e96e642821d.diff",
            "diff_additions": 245,
            "diff_deletions": 30,
            "diff_file_size": 43970,
            "files": [
                {
                    "file_additions": 89,
                    "file_deletions": 0,
                    "file_exists": true,
                    "file_name": "server/src/main/java/org/elasticsearch/action/support/ListenerTimeouts.java",
                    "file_size": 4222
                },
                {
                    "file_additions": 120,
                    "file_deletions": 0,
                    "file_exists": true,
                    "file_name": "server/src/test/java/org/elasticsearch/action/support/ListenerTimeoutsTests.java",
                    "file_size": 4306
                },
                {
                    "file_additions": 9,
                    "file_deletions": 5,
                    "file_exists": true,
                    "file_name": "x-pack/plugin/ccr/src/main/java/org/elasticsearch/xpack/ccr/repository/CcrRepository.java",
                    "file_size": 35442
                },
                {
                    "file_additions": 27,
                    "file_deletions": 25,
                    "file_exists": false,
                    "file_name": "x-pack/plugin/ccr/src/test/java/org/elasticsearch/xpack/ccr/CcrRepositoryIT.java",
                    "file_size": 0
                }
            ],
            "interesting": {
                "reopened": false,
                "status": false
            },
            "sha": "07fd2610b2c23d552d776268db036e96e642821d"
        },
        {
            "diff": "elastic_elasticsearch/issue_38027/commit_cf82864b5a467ba2428cb9b260b4e9e2b29b1621.diff",
            "diff_additions": 245,
            "diff_deletions": 30,
            "diff_file_size": 43970,
            "files": [
                {
                    "file_additions": 89,
                    "file_deletions": 0,
                    "file_exists": true,
                    "file_name": "server/src/main/java/org/elasticsearch/action/support/ListenerTimeouts.java",
                    "file_size": 4222
                },
                {
                    "file_additions": 120,
                    "file_deletions": 0,
                    "file_exists": true,
                    "file_name": "server/src/test/java/org/elasticsearch/action/support/ListenerTimeoutsTests.java",
                    "file_size": 4306
                },
                {
                    "file_additions": 9,
                    "file_deletions": 5,
                    "file_exists": true,
                    "file_name": "x-pack/plugin/ccr/src/main/java/org/elasticsearch/xpack/ccr/repository/CcrRepository.java",
                    "file_size": 35442
                },
                {
                    "file_additions": 27,
                    "file_deletions": 25,
                    "file_exists": false,
                    "file_name": "x-pack/plugin/ccr/src/test/java/org/elasticsearch/xpack/ccr/CcrRepositoryIT.java",
                    "file_size": 0
                }
            ],
            "interesting": {
                "reopened": false,
                "status": false
            },
            "sha": "cf82864b5a467ba2428cb9b260b4e9e2b29b1621"
        },
        {
            "diff": "elastic_elasticsearch/issue_38027/commit_b2a9c15dcc9015501d508c0122e29e10a47625d9.diff",
            "diff_additions": 245,
            "diff_deletions": 30,
            "diff_file_size": 43970,
            "files": [
                {
                    "file_additions": 89,
                    "file_deletions": 0,
                    "file_exists": true,
                    "file_name": "server/src/main/java/org/elasticsearch/action/support/ListenerTimeouts.java",
                    "file_size": 4222
                },
                {
                    "file_additions": 120,
                    "file_deletions": 0,
                    "file_exists": true,
                    "file_name": "server/src/test/java/org/elasticsearch/action/support/ListenerTimeoutsTests.java",
                    "file_size": 4306
                },
                {
                    "file_additions": 9,
                    "file_deletions": 5,
                    "file_exists": true,
                    "file_name": "x-pack/plugin/ccr/src/main/java/org/elasticsearch/xpack/ccr/repository/CcrRepository.java",
                    "file_size": 35442
                },
                {
                    "file_additions": 27,
                    "file_deletions": 25,
                    "file_exists": false,
                    "file_name": "x-pack/plugin/ccr/src/test/java/org/elasticsearch/xpack/ccr/CcrRepositoryIT.java",
                    "file_size": 0
                }
            ],
            "interesting": {
                "reopened": false,
                "status": false
            },
            "sha": "b2a9c15dcc9015501d508c0122e29e10a47625d9"
        }
    ],
    "first_commit": "2019-01-30 14:11:44",
    "last_commit": "2019-02-16 18:27:15",
    "number": 38027,
    "score": 496.00479616306956
}