{
    "covered_issues": [
        42,
        31,
        30,
        26,
        22,
        20,
        13,
        12,
        11,
        7,
        5,
        3,
        1
    ],
    "finished": true
}