{
    "commits": [
        {
            "associated_pull_request": [],
            "date": "2020-09-16 10:22:57+00:00",
            "diff": "gluster_glusterfs/issue_1539/commit_d63b97c93a1d7d123f55e3652389af289ddd3096.diff",
            "diff_additions": 68,
            "diff_deletions": 386,
            "diff_file_size": 678673,
            "diff_url": "https://github.com/gluster/glusterfs/commit/d63b97c93a1d7d123f55e3652389af289ddd3096.diff",
            "exists": true,
            "files": [
                {
                    "file_additions": 15,
                    "file_deletions": 89,
                    "file_exists": true,
                    "file_name": "xlators/cluster/dht/src/dht-common.c",
                    "file_size": 360431
                },
                {
                    "file_additions": 15,
                    "file_deletions": 17,
                    "file_exists": true,
                    "file_name": "xlators/cluster/dht/src/dht-inode-write.c",
                    "file_size": 41222
                },
                {
                    "file_additions": 38,
                    "file_deletions": 196,
                    "file_exists": true,
                    "file_name": "xlators/cluster/dht/src/dht-rebalance.c",
                    "file_size": 145201
                },
                {
                    "file_additions": 0,
                    "file_deletions": 4,
                    "file_exists": true,
                    "file_name": "xlators/cluster/dht/src/dht-selfheal.c",
                    "file_size": 78893
                },
                {
                    "file_additions": 0,
                    "file_deletions": 79,
                    "file_exists": true,
                    "file_name": "xlators/cluster/dht/src/dht-shared.c",
                    "file_size": 34968
                },
                {
                    "file_additions": 0,
                    "file_deletions": 1,
                    "file_exists": true,
                    "file_name": "xlators/cluster/dht/src/nufa.c",
                    "file_size": 17958
                }
            ],
            "interesting": {
                "reopen": false,
                "status": false
            },
            "is_parent": true,
            "sha": "d63b97c93a1d7d123f55e3652389af289ddd3096"
        },
        {
            "associated_pull_request": [],
            "date": "2020-10-05 07:45:07+00:00",
            "diff": "gluster_glusterfs/issue_1539/commit_48a23965493e570827e51ec5018136ebe7897f3c.diff",
            "diff_additions": 3,
            "diff_deletions": 8,
            "diff_file_size": 221004,
            "diff_url": "https://github.com/gluster/glusterfs/commit/48a23965493e570827e51ec5018136ebe7897f3c.diff",
            "exists": true,
            "files": [
                {
                    "file_additions": 3,
                    "file_deletions": 8,
                    "file_exists": true,
                    "file_name": "xlators/mount/fuse/src/fuse-bridge.c",
                    "file_size": 221004
                }
            ],
            "interesting": {
                "reopen": true,
                "status": false
            },
            "is_parent": false,
            "sha": "48a23965493e570827e51ec5018136ebe7897f3c"
        },
        {
            "associated_pull_request": [],
            "date": "2020-10-05 07:45:07+00:00",
            "diff": "gluster_glusterfs/issue_1539/commit_84d5489b69cbdbf12aa193ba97af2e1ba32b34e1.diff",
            "diff_additions": 3,
            "diff_deletions": 8,
            "diff_file_size": 221004,
            "diff_url": "https://github.com/gluster/glusterfs/commit/84d5489b69cbdbf12aa193ba97af2e1ba32b34e1.diff",
            "exists": true,
            "files": [
                {
                    "file_additions": 3,
                    "file_deletions": 8,
                    "file_exists": true,
                    "file_name": "xlators/mount/fuse/src/fuse-bridge.c",
                    "file_size": 221004
                }
            ],
            "interesting": {
                "reopen": false,
                "status": false
            },
            "is_parent": false,
            "sha": "84d5489b69cbdbf12aa193ba97af2e1ba32b34e1"
        },
        {
            "associated_pull_request": [],
            "date": "2020-10-05 07:45:07+00:00",
            "diff": "gluster_glusterfs/issue_1539/commit_05e756291d629bdb2be5d950dc193bbdce217f9f.diff",
            "diff_additions": 3,
            "diff_deletions": 8,
            "diff_file_size": 221004,
            "diff_url": "https://github.com/gluster/glusterfs/commit/05e756291d629bdb2be5d950dc193bbdce217f9f.diff",
            "exists": true,
            "files": [
                {
                    "file_additions": 3,
                    "file_deletions": 8,
                    "file_exists": true,
                    "file_name": "xlators/mount/fuse/src/fuse-bridge.c",
                    "file_size": 221004
                }
            ],
            "interesting": {
                "reopen": false,
                "status": false
            },
            "is_parent": false,
            "sha": "05e756291d629bdb2be5d950dc193bbdce217f9f"
        },
        {
            "associated_pull_request": [],
            "date": "2020-10-05 07:45:07+00:00",
            "diff": "gluster_glusterfs/issue_1539/commit_f8dea1083dababd7bc6dcaec6580e4cd0a62758a.diff",
            "diff_additions": 3,
            "diff_deletions": 8,
            "diff_file_size": 221004,
            "diff_url": "https://github.com/gluster/glusterfs/commit/f8dea1083dababd7bc6dcaec6580e4cd0a62758a.diff",
            "exists": true,
            "files": [
                {
                    "file_additions": 3,
                    "file_deletions": 8,
                    "file_exists": true,
                    "file_name": "xlators/mount/fuse/src/fuse-bridge.c",
                    "file_size": 221004
                }
            ],
            "interesting": {
                "reopen": false,
                "status": false
            },
            "is_parent": false,
            "sha": "f8dea1083dababd7bc6dcaec6580e4cd0a62758a"
        },
        {
            "associated_pull_request": [
                "https://github.com/gluster/glusterfs/pull/1609"
            ],
            "date": "2020-10-05 07:45:07+00:00",
            "diff": "gluster_glusterfs/issue_1539/commit_ab20fdbc4d3427baad13bd2c93786e95f92cfaac.diff",
            "diff_additions": 3,
            "diff_deletions": 8,
            "diff_file_size": 221004,
            "diff_url": "https://github.com/gluster/glusterfs/commit/ab20fdbc4d3427baad13bd2c93786e95f92cfaac.diff",
            "exists": true,
            "files": [
                {
                    "file_additions": 3,
                    "file_deletions": 8,
                    "file_exists": true,
                    "file_name": "xlators/mount/fuse/src/fuse-bridge.c",
                    "file_size": 221004
                }
            ],
            "interesting": {
                "reopen": false,
                "status": false
            },
            "is_parent": false,
            "sha": "ab20fdbc4d3427baad13bd2c93786e95f92cfaac"
        },
        {
            "associated_pull_request": [
                "https://github.com/gluster/glusterfs/pull/1609"
            ],
            "date": "2021-02-03 15:05:49+00:00",
            "diff": "gluster_glusterfs/issue_1539/commit_e8e898fb7e385fbdaaffd9737b35396a0adb300d.diff",
            "diff_additions": 3,
            "diff_deletions": 8,
            "diff_file_size": 221004,
            "diff_url": "https://github.com/gluster/glusterfs/commit/e8e898fb7e385fbdaaffd9737b35396a0adb300d.diff",
            "exists": true,
            "files": [
                {
                    "file_additions": 3,
                    "file_deletions": 8,
                    "file_exists": true,
                    "file_name": "xlators/mount/fuse/src/fuse-bridge.c",
                    "file_size": 221004
                }
            ],
            "interesting": {
                "reopen": false,
                "status": false
            },
            "is_parent": false,
            "sha": "e8e898fb7e385fbdaaffd9737b35396a0adb300d"
        }
    ],
    "first_commit": "2020-10-01 14:50:15+00:00",
    "last_commit": "2021-02-03 15:05:49+00:00",
    "number": 1539,
    "pull_request": "None",
    "score": {
        "accidental_reopen_likely": false,
        "all_labels": [
            "CB: fuse",
            "Type:Bug"
        ],
        "contains_keywords": [
            "work",
            "fix",
            "issu",
            "patch",
            "remov",
            "crash"
        ],
        "fix_size": 31,
        "has_labels": [],
        "intersecting": {
            "computed_score": 1.0,
            "final_commit_size": 11,
            "intersection_size": 11,
            "previous_commits_size": 31
        },
        "is_makefile_based": true,
        "no_new_files": [],
        "no_other_files": false,
        "num_prohibited_files": 232380,
        "prohibited_files": [
            "server/src/main/java/com/genymobile/scrcpy/Device.java",
            "server/src/main/java/com/genymobile/scrcpy/wrappers/SurfaceControl.java",
            "server/src/main/java/com/genymobile/scrcpy/Device.java",
            "server/src/main/java/com/genymobile/scrcpy/wrappers/SurfaceControl.java",
            "app/meson.build",
            "app/scrcpy.1",
            "app/src/common.h",
            "app/src/scrcpy.h",
            "app/src/server.h",
            "server/src/main/java/com/genymobile/scrcpy/Workarounds.java"
        ],
        "reopen": true,
        "reopen_events": [
            [
                "2020-10-06 04:15:26+00:00",
                "closed"
            ],
            [
                "2020-10-06 04:15:26+00:00",
                "commit"
            ],
            [
                "2020-10-06 05:14:08+00:00",
                "reopened"
            ],
            [
                "2020-10-07 07:04:07+00:00",
                "commit"
            ],
            [
                "2020-10-12 08:43:35+00:00",
                "commit"
            ],
            [
                "2020-10-12 08:58:41+00:00",
                "commit"
            ],
            [
                "2020-10-20 06:44:50+00:00",
                "commit"
            ],
            [
                "2021-02-03 08:20:16+00:00",
                "commit"
            ],
            [
                "2021-02-03 15:05:53+00:00",
                "commit"
            ],
            [
                "2021-04-28 09:53:26+00:00",
                "closed"
            ]
        ],
        "status": false,
        "strategy": true,
        "total_changes": 520
    }
}