{
    "category": [
        "memory",
        "hardware/OS"
    ],
    "commits": [
        {
            "associated_pull_request": [],
            "date": "2019-04-11 12:18:58",
            "diff": "gpac_gpac/issue_1205/commit_f4616202e5578e65746cf7e7ceeba63bee1b094b.diff",
            "diff_additions": 49,
            "diff_deletions": 47,
            "diff_file_size": 696267,
            "diff_url": "https://github.com/gpac/gpac/commit/f4616202e5578e65746cf7e7ceeba63bee1b094b.diff",
            "exists": true,
            "files": [
                {
                    "file_additions": 1,
                    "file_deletions": 1,
                    "file_exists": true,
                    "file_name": "applications/mp4client/main.c",
                    "file_size": 83463
                },
                {
                    "file_additions": 11,
                    "file_deletions": 11,
                    "file_exists": true,
                    "file_name": "applications/osmo4_ios/main.c",
                    "file_size": 24617
                },
                {
                    "file_additions": 1,
                    "file_deletions": 1,
                    "file_exists": false,
                    "file_name": "applications/osmo4_sym/osmo4_view.cpp",
                    "file_size": 0
                },
                {
                    "file_additions": 1,
                    "file_deletions": 1,
                    "file_exists": true,
                    "file_name": "src/media_tools/media_export.c",
                    "file_size": 48509
                },
                {
                    "file_additions": 1,
                    "file_deletions": 1,
                    "file_exists": true,
                    "file_name": "src/media_tools/media_import.c",
                    "file_size": 49555
                },
                {
                    "file_additions": 2,
                    "file_deletions": 2,
                    "file_exists": true,
                    "file_name": "src/scene_manager/loader_bt.c",
                    "file_size": 115890
                },
                {
                    "file_additions": 1,
                    "file_deletions": 1,
                    "file_exists": true,
                    "file_name": "src/scene_manager/loader_isom.c",
                    "file_size": 13548
                },
                {
                    "file_additions": 1,
                    "file_deletions": 1,
                    "file_exists": true,
                    "file_name": "src/scene_manager/loader_qt.c",
                    "file_size": 5921
                },
                {
                    "file_additions": 4,
                    "file_deletions": 4,
                    "file_exists": true,
                    "file_name": "src/scene_manager/loader_svg.c",
                    "file_size": 76564
                },
                {
                    "file_additions": 7,
                    "file_deletions": 7,
                    "file_exists": true,
                    "file_name": "src/scene_manager/loader_xmt.c",
                    "file_size": 104914
                },
                {
                    "file_additions": 3,
                    "file_deletions": 3,
                    "file_exists": true,
                    "file_name": "src/scene_manager/swf_parse.c",
                    "file_size": 68830
                },
                {
                    "file_additions": 1,
                    "file_deletions": 1,
                    "file_exists": true,
                    "file_name": "src/scene_manager/swf_svg.c",
                    "file_size": 15956
                },
                {
                    "file_additions": 1,
                    "file_deletions": 1,
                    "file_exists": false,
                    "file_name": "src/scenegraph/xbl_process.c",
                    "file_size": 0
                },
                {
                    "file_additions": 1,
                    "file_deletions": 1,
                    "file_exists": true,
                    "file_name": "src/utils/alloc.c",
                    "file_size": 27666
                },
                {
                    "file_additions": 13,
                    "file_deletions": 11,
                    "file_exists": true,
                    "file_name": "src/utils/xml_parser.c",
                    "file_size": 60834
                }
            ],
            "interesting": {
                "reopen": false,
                "status": false
            },
            "is_parent": true,
            "sha": "f4616202e5578e65746cf7e7ceeba63bee1b094b"
        },
        {
            "associated_pull_request": [],
            "date": "2019-04-11 12:54:53",
            "diff": "gpac_gpac/issue_1205/commit_f36525c5beafb78959c3a07d6622c9028de348da.diff",
            "diff_additions": 5,
            "diff_deletions": 0,
            "diff_file_size": 68714,
            "diff_url": "https://github.com/gpac/gpac/commit/f36525c5beafb78959c3a07d6622c9028de348da.diff",
            "exists": true,
            "files": [
                {
                    "file_additions": 5,
                    "file_deletions": 0,
                    "file_exists": true,
                    "file_name": "src/utils/os_divers.c",
                    "file_size": 68714
                }
            ],
            "interesting": {
                "reopen": false,
                "status": true
            },
            "is_parent": false,
            "sha": "f36525c5beafb78959c3a07d6622c9028de348da"
        },
        {
            "associated_pull_request": [],
            "date": "2019-04-11 12:54:53",
            "diff": "gpac_gpac/issue_1205/commit_f3698bb1bce62402805c3fda96551a23101a32f9.diff",
            "diff_additions": 6,
            "diff_deletions": 0,
            "diff_file_size": 68714,
            "diff_url": "https://github.com/gpac/gpac/commit/f3698bb1bce62402805c3fda96551a23101a32f9.diff",
            "exists": true,
            "files": [
                {
                    "file_additions": 6,
                    "file_deletions": 0,
                    "file_exists": true,
                    "file_name": "src/utils/os_divers.c",
                    "file_size": 68714
                }
            ],
            "interesting": {
                "reopen": false,
                "status": false
            },
            "is_parent": false,
            "sha": "f3698bb1bce62402805c3fda96551a23101a32f9"
        }
    ],
    "first_commit": "2019-04-11 12:18:58",
    "last_commit": "2019-04-11 13:24:52",
    "number": 1205,
    "pull_request": "None",
    "score": {
        "accidental_reopen_likely": false,
        "all_labels": [],
        "contains_keywords": [
            "fix",
            "issu"
        ],
        "fix_size": 9,
        "has_labels": [],
        "intersecting": {
            "computed_score": 0.5714285714285714,
            "final_commit_size": 7,
            "intersection_size": 4,
            "previous_commits_size": 6
        },
        "is_makefile_based": true,
        "no_new_files": [],
        "no_other_files": true,
        "num_prohibited_files": 53817,
        "prohibited_files": [
            "hal/inc/pinmap_hal.h",
            "Debug/marvin.bin",
            "Debug/marvin.elf",
            "Debug/marvin.hex",
            "Debug/marvin.bin",
            "Debug/marvin.elf",
            "Debug/marvin.hex",
            "inc/spark_utilities.h",
            "Debug/marvin.bin",
            "Debug/marvin.elf"
        ],
        "reopen": false,
        "reopen_events": [
            [
                "2019-04-11 13:01:46",
                "closed"
            ],
            [
                "2019-04-11 13:01:46",
                "commit"
            ],
            [
                "2019-04-11 13:25:12",
                "commit"
            ]
        ],
        "status": true,
        "strategy": true,
        "total_changes": 107
    }
}