{
    "commits": [
        {
            "associated_pull_request": [],
            "date": "2016-12-12 11:03:25+00:00",
            "diff": "",
            "diff_additions": 0,
            "diff_deletions": 0,
            "diff_file_size": 0,
            "diff_url": "https://github.com/mpv-player/mpv/commit/765a7228d1815622ab0533cf2f1ffb3de04f24bc.diff",
            "exists": true,
            "files": [],
            "interesting": {
                "reopen": false,
                "status": false
            },
            "is_parent": true,
            "sha": "765a7228d1815622ab0533cf2f1ffb3de04f24bc"
        },
        {
            "associated_pull_request": [
                "https://github.com/mpv-player/mpv/pull/3894"
            ],
            "date": "2016-12-10 21:01:39+00:00",
            "diff": "mpv-player_mpv/issue_2451/commit_bf5727a60fbae12510238c23a38b89822b128baa.diff",
            "diff_additions": 9,
            "diff_deletions": 4,
            "diff_file_size": 70235,
            "diff_url": "https://github.com/mpv-player/mpv/commit/bf5727a60fbae12510238c23a38b89822b128baa.diff",
            "exists": true,
            "files": [
                {
                    "file_additions": 9,
                    "file_deletions": 4,
                    "file_exists": true,
                    "file_name": "video/out/w32_common.c",
                    "file_size": 70235
                }
            ],
            "interesting": {
                "reopen": true,
                "status": false
            },
            "is_parent": false,
            "sha": "bf5727a60fbae12510238c23a38b89822b128baa"
        },
        {
            "associated_pull_request": [
                "https://github.com/mpv-player/mpv/pull/5210"
            ],
            "date": "2017-12-17 00:20:53+00:00",
            "diff": "mpv-player_mpv/issue_2451/commit_d13f9d08866a46bfaca16afbc2a0cc06b31d18a3.diff",
            "diff_additions": 151,
            "diff_deletions": 131,
            "diff_file_size": 70235,
            "diff_url": "https://github.com/mpv-player/mpv/commit/d13f9d08866a46bfaca16afbc2a0cc06b31d18a3.diff",
            "exists": true,
            "files": [
                {
                    "file_additions": 151,
                    "file_deletions": 131,
                    "file_exists": true,
                    "file_name": "video/out/w32_common.c",
                    "file_size": 70235
                }
            ],
            "interesting": {
                "reopen": false,
                "status": false
            },
            "is_parent": false,
            "sha": "d13f9d08866a46bfaca16afbc2a0cc06b31d18a3"
        }
    ],
    "first_commit": "2016-12-12 11:10:10+00:00",
    "last_commit": "2017-12-19 12:22:52+00:00",
    "number": 2451,
    "pull_request": "None",
    "score": {
        "accidental_reopen_likely": false,
        "all_labels": [
            "os:win"
        ],
        "contains_keywords": [
            "work",
            "chang",
            "fix",
            "issu",
            "patch",
            "debug",
            "test",
            "attempt",
            "fault",
            "remov",
            "bug",
            "problem",
            "report"
        ],
        "fix_size": 209,
        "has_labels": [],
        "intersecting": {
            "computed_score": 0.005,
            "final_commit_size": 200,
            "intersection_size": 1,
            "previous_commits_size": 10
        },
        "is_makefile_based": false,
        "no_new_files": [],
        "no_other_files": true,
        "num_prohibited_files": 7438,
        "prohibited_files": [
            "server/src/main/java/com/genymobile/scrcpy/Device.java",
            "server/src/main/java/com/genymobile/scrcpy/wrappers/SurfaceControl.java",
            "server/src/main/java/com/genymobile/scrcpy/Device.java",
            "server/src/main/java/com/genymobile/scrcpy/wrappers/SurfaceControl.java",
            "app/meson.build",
            "app/scrcpy.1",
            "app/src/common.h",
            "app/src/scrcpy.h",
            "app/src/server.h",
            "server/src/main/java/com/genymobile/scrcpy/Workarounds.java"
        ],
        "reopen": true,
        "reopen_events": [
            [
                "2016-12-12 11:22:43+00:00",
                "closed"
            ],
            [
                "2016-12-12 11:22:47+00:00",
                "commit"
            ],
            [
                "2016-12-16 15:36:54+00:00",
                "reopened"
            ],
            [
                "2017-12-19 12:23:00+00:00",
                "closed"
            ],
            [
                "2017-12-19 12:23:00+00:00",
                "commit"
            ]
        ],
        "status": false,
        "strategy": true,
        "total_changes": 295
    }
}