{
    "category": [
        "control flow",
        "feature request"
    ],
    "commits": [
        {
            "associated_pull_request": [
                "https://github.com/radareorg/radare2/pull/14527"
            ],
            "date": "2019-07-09 14:58:56",
            "diff": "radareorg_radare2/issue_14521/commit_801c419f98821b54d3099dc99161aa91023fed77.diff",
            "diff_additions": 2,
            "diff_deletions": 5,
            "diff_file_size": 50690,
            "diff_url": "https://github.com/radareorg/radare2/commit/801c419f98821b54d3099dc99161aa91023fed77.diff",
            "exists": true,
            "files": [
                {
                    "file_additions": 2,
                    "file_deletions": 5,
                    "file_exists": true,
                    "file_name": "libr/cons/dietline.c",
                    "file_size": 50690
                }
            ],
            "interesting": {
                "reopen": false,
                "status": false
            },
            "is_parent": true,
            "sha": "801c419f98821b54d3099dc99161aa91023fed77"
        },
        {
            "associated_pull_request": [
                "https://github.com/radareorg/radare2/pull/14527"
            ],
            "date": "2019-07-10 02:35:01",
            "diff": "radareorg_radare2/issue_14521/commit_5c8274a586464716bd32227dc58e1908c3cd7ebc.diff",
            "diff_additions": 4,
            "diff_deletions": 1,
            "diff_file_size": 50690,
            "diff_url": "https://github.com/radareorg/radare2/commit/5c8274a586464716bd32227dc58e1908c3cd7ebc.diff",
            "exists": true,
            "files": [
                {
                    "file_additions": 4,
                    "file_deletions": 1,
                    "file_exists": true,
                    "file_name": "libr/cons/dietline.c",
                    "file_size": 50690
                }
            ],
            "interesting": {
                "reopen": false,
                "status": true
            },
            "is_parent": false,
            "sha": "5c8274a586464716bd32227dc58e1908c3cd7ebc"
        },
        {
            "associated_pull_request": [
                "https://github.com/radareorg/radare2/pull/14527"
            ],
            "date": "2019-07-10 04:27:16",
            "diff": "radareorg_radare2/issue_14521/commit_6addc9e83c29acc21134f65126c334a79f87d1c3.diff",
            "diff_additions": 13,
            "diff_deletions": 35,
            "diff_file_size": 50690,
            "diff_url": "https://github.com/radareorg/radare2/commit/6addc9e83c29acc21134f65126c334a79f87d1c3.diff",
            "exists": true,
            "files": [
                {
                    "file_additions": 13,
                    "file_deletions": 35,
                    "file_exists": true,
                    "file_name": "libr/cons/dietline.c",
                    "file_size": 50690
                }
            ],
            "interesting": {
                "reopen": false,
                "status": false
            },
            "is_parent": false,
            "sha": "6addc9e83c29acc21134f65126c334a79f87d1c3"
        }
    ],
    "first_commit": "2019-07-10 02:17:25",
    "last_commit": "2019-07-10 04:27:16",
    "number": 14521,
    "pull_request": "None",
    "score": {
        "accidental_reopen_likely": false,
        "all_labels": [
            "consoleui",
            "enhancement"
        ],
        "contains_keywords": [
            "warn",
            "chang"
        ],
        "fix_size": 42,
        "has_labels": [],
        "intersecting": {
            "computed_score": 0.11904761904761904,
            "final_commit_size": 42,
            "intersection_size": 5,
            "previous_commits_size": 5
        },
        "is_makefile_based": true,
        "no_new_files": [],
        "no_other_files": true,
        "num_prohibited_files": 46926,
        "prohibited_files": [
            "hal/inc/pinmap_hal.h",
            "Debug/marvin.bin",
            "Debug/marvin.elf",
            "Debug/marvin.hex",
            "Debug/marvin.bin",
            "Debug/marvin.elf",
            "Debug/marvin.hex",
            "inc/spark_utilities.h",
            "Debug/marvin.bin",
            "Debug/marvin.elf"
        ],
        "reopen": false,
        "reopen_events": [
            [
                "2019-07-10 02:35:32",
                "commit"
            ],
            [
                "2019-07-10 04:27:25",
                "closed"
            ],
            [
                "2019-07-10 04:27:25",
                "commit"
            ]
        ],
        "status": true,
        "strategy": true,
        "total_changes": 60
    }
}