{
    "category": [
        "GUI",
        "control flow"
    ],
    "commits": [
        {
            "associated_pull_request": [
                "https://github.com/surge-synthesizer/surge/pull/645"
            ],
            "date": "2019-02-21 23:32:00",
            "diff": "",
            "diff_additions": 0,
            "diff_deletions": 0,
            "diff_file_size": 0,
            "diff_url": "https://github.com/surge-synthesizer/surge/commit/bee15f696d78264e0b6c9dfc4a58c86e0c13a884.diff",
            "exists": true,
            "files": [],
            "interesting": {
                "reopen": false,
                "status": false
            },
            "is_parent": true,
            "sha": "bee15f696d78264e0b6c9dfc4a58c86e0c13a884"
        },
        {
            "associated_pull_request": [],
            "date": "2019-07-27 15:13:44",
            "diff": "surge-synthesizer_surge/issue_514/commit_8a2ac41f28b6960a61b3cb4f494885d73b42f3fb.diff",
            "diff_additions": 262,
            "diff_deletions": 1,
            "diff_file_size": 72750,
            "diff_url": "https://github.com/surge-synthesizer/surge/commit/8a2ac41f28b6960a61b3cb4f494885d73b42f3fb.diff",
            "exists": true,
            "files": [
                {
                    "file_additions": 1,
                    "file_deletions": 1,
                    "file_exists": true,
                    "file_name": "src/common/SurgeStorage.cpp",
                    "file_size": 72750
                },
                {
                    "file_additions": 42,
                    "file_deletions": 0,
                    "file_exists": false,
                    "file_name": "src/common/gui/SurgeGUIEditor.cpp",
                    "file_size": 0
                },
                {
                    "file_additions": 219,
                    "file_deletions": 0,
                    "file_exists": false,
                    "file_name": "src/linux/LinuxVST3Helpers.cpp",
                    "file_size": 0
                }
            ],
            "interesting": {
                "reopen": false,
                "status": false
            },
            "is_parent": false,
            "sha": "8a2ac41f28b6960a61b3cb4f494885d73b42f3fb"
        },
        {
            "associated_pull_request": [
                "https://github.com/surge-synthesizer/surge/pull/979"
            ],
            "date": "2019-07-27 15:13:44",
            "diff": "surge-synthesizer_surge/issue_514/commit_da709f4b978d400ec2d46db06bcb0bf73c957d2c.diff",
            "diff_additions": 260,
            "diff_deletions": 1,
            "diff_file_size": 72750,
            "diff_url": "https://github.com/surge-synthesizer/surge/commit/da709f4b978d400ec2d46db06bcb0bf73c957d2c.diff",
            "exists": true,
            "files": [
                {
                    "file_additions": 1,
                    "file_deletions": 1,
                    "file_exists": true,
                    "file_name": "src/common/SurgeStorage.cpp",
                    "file_size": 72750
                },
                {
                    "file_additions": 39,
                    "file_deletions": 0,
                    "file_exists": false,
                    "file_name": "src/common/gui/SurgeGUIEditor.cpp",
                    "file_size": 0
                },
                {
                    "file_additions": 220,
                    "file_deletions": 0,
                    "file_exists": false,
                    "file_name": "src/linux/LinuxVST3Helpers.cpp",
                    "file_size": 0
                }
            ],
            "interesting": {
                "reopen": false,
                "status": false
            },
            "is_parent": false,
            "sha": "da709f4b978d400ec2d46db06bcb0bf73c957d2c"
        },
        {
            "associated_pull_request": [
                "https://github.com/surge-synthesizer/surge/pull/979"
            ],
            "date": "2019-07-29 00:56:28",
            "diff": "surge-synthesizer_surge/issue_514/commit_514ed95dfa5e547803f02a8bb957bad26472ddac.diff",
            "diff_additions": 260,
            "diff_deletions": 1,
            "diff_file_size": 72750,
            "diff_url": "https://github.com/surge-synthesizer/surge/commit/514ed95dfa5e547803f02a8bb957bad26472ddac.diff",
            "exists": true,
            "files": [
                {
                    "file_additions": 1,
                    "file_deletions": 1,
                    "file_exists": true,
                    "file_name": "src/common/SurgeStorage.cpp",
                    "file_size": 72750
                },
                {
                    "file_additions": 39,
                    "file_deletions": 0,
                    "file_exists": false,
                    "file_name": "src/common/gui/SurgeGUIEditor.cpp",
                    "file_size": 0
                },
                {
                    "file_additions": 220,
                    "file_deletions": 0,
                    "file_exists": false,
                    "file_name": "src/linux/LinuxVST3Helpers.cpp",
                    "file_size": 0
                }
            ],
            "interesting": {
                "reopen": false,
                "status": false
            },
            "is_parent": false,
            "sha": "514ed95dfa5e547803f02a8bb957bad26472ddac"
        },
        {
            "associated_pull_request": [],
            "date": "2019-08-18 12:57:02",
            "diff": "surge-synthesizer_surge/issue_514/commit_83f77fbd03eea4487f387e7dd1fc7f78aa2dc4f5.diff",
            "diff_additions": 12,
            "diff_deletions": 4,
            "diff_file_size": 0,
            "diff_url": "https://github.com/surge-synthesizer/surge/commit/83f77fbd03eea4487f387e7dd1fc7f78aa2dc4f5.diff",
            "exists": true,
            "files": [
                {
                    "file_additions": 2,
                    "file_deletions": 0,
                    "file_exists": false,
                    "file_name": "src/common/gui/SurgeGUIEditor.cpp",
                    "file_size": 0
                },
                {
                    "file_additions": 5,
                    "file_deletions": 0,
                    "file_exists": false,
                    "file_name": "src/linux/LinuxVST3Helpers.cpp",
                    "file_size": 0
                },
                {
                    "file_additions": 5,
                    "file_deletions": 4,
                    "file_exists": false,
                    "file_name": "src/vst3/SurgeVst3Processor.cpp",
                    "file_size": 0
                }
            ],
            "interesting": {
                "reopen": false,
                "status": true
            },
            "is_parent": false,
            "sha": "83f77fbd03eea4487f387e7dd1fc7f78aa2dc4f5"
        },
        {
            "associated_pull_request": [
                "https://github.com/surge-synthesizer/surge/pull/1047"
            ],
            "date": "2019-08-18 12:57:02",
            "diff": "surge-synthesizer_surge/issue_514/commit_2a6271a47275dcfe4f7d229267a8ca1b0fa72843.diff",
            "diff_additions": 14,
            "diff_deletions": 4,
            "diff_file_size": 0,
            "diff_url": "https://github.com/surge-synthesizer/surge/commit/2a6271a47275dcfe4f7d229267a8ca1b0fa72843.diff",
            "exists": true,
            "files": [
                {
                    "file_additions": 4,
                    "file_deletions": 0,
                    "file_exists": false,
                    "file_name": "src/common/gui/SurgeGUIEditor.cpp",
                    "file_size": 0
                },
                {
                    "file_additions": 5,
                    "file_deletions": 0,
                    "file_exists": false,
                    "file_name": "src/linux/LinuxVST3Helpers.cpp",
                    "file_size": 0
                },
                {
                    "file_additions": 5,
                    "file_deletions": 4,
                    "file_exists": false,
                    "file_name": "src/vst3/SurgeVst3Processor.cpp",
                    "file_size": 0
                }
            ],
            "interesting": {
                "reopen": false,
                "status": false
            },
            "is_parent": false,
            "sha": "2a6271a47275dcfe4f7d229267a8ca1b0fa72843"
        },
        {
            "associated_pull_request": [
                "https://github.com/surge-synthesizer/surge/pull/1047"
            ],
            "date": "2019-08-18 13:14:55",
            "diff": "surge-synthesizer_surge/issue_514/commit_f24dc276890491ff3558ac1bbe0e4005e1f2c192.diff",
            "diff_additions": 14,
            "diff_deletions": 4,
            "diff_file_size": 0,
            "diff_url": "https://github.com/surge-synthesizer/surge/commit/f24dc276890491ff3558ac1bbe0e4005e1f2c192.diff",
            "exists": true,
            "files": [
                {
                    "file_additions": 4,
                    "file_deletions": 0,
                    "file_exists": false,
                    "file_name": "src/common/gui/SurgeGUIEditor.cpp",
                    "file_size": 0
                },
                {
                    "file_additions": 5,
                    "file_deletions": 0,
                    "file_exists": false,
                    "file_name": "src/linux/LinuxVST3Helpers.cpp",
                    "file_size": 0
                },
                {
                    "file_additions": 5,
                    "file_deletions": 4,
                    "file_exists": false,
                    "file_name": "src/vst3/SurgeVst3Processor.cpp",
                    "file_size": 0
                }
            ],
            "interesting": {
                "reopen": false,
                "status": false
            },
            "is_parent": false,
            "sha": "f24dc276890491ff3558ac1bbe0e4005e1f2c192"
        },
        {
            "associated_pull_request": [
                "https://github.com/surge-synthesizer/surge/pull/1067"
            ],
            "date": "2019-08-20 18:09:16",
            "diff": "surge-synthesizer_surge/issue_514/commit_c25c137ea2d4cd0ad29b4218f644f6a621bc259f.diff",
            "diff_additions": 13,
            "diff_deletions": 22,
            "diff_file_size": 0,
            "diff_url": "https://github.com/surge-synthesizer/surge/commit/c25c137ea2d4cd0ad29b4218f644f6a621bc259f.diff",
            "exists": true,
            "files": [
                {
                    "file_additions": 13,
                    "file_deletions": 22,
                    "file_exists": false,
                    "file_name": "src/linux/LinuxVST3Helpers.cpp",
                    "file_size": 0
                }
            ],
            "interesting": {
                "reopen": false,
                "status": false
            },
            "is_parent": false,
            "sha": "c25c137ea2d4cd0ad29b4218f644f6a621bc259f"
        },
        {
            "associated_pull_request": [
                "https://github.com/surge-synthesizer/surge/pull/1067"
            ],
            "date": "2019-08-20 18:40:25",
            "diff": "surge-synthesizer_surge/issue_514/commit_ff9bff7fb4bb9f574a85c6adf7de65aed2b50a35.diff",
            "diff_additions": 13,
            "diff_deletions": 22,
            "diff_file_size": 0,
            "diff_url": "https://github.com/surge-synthesizer/surge/commit/ff9bff7fb4bb9f574a85c6adf7de65aed2b50a35.diff",
            "exists": true,
            "files": [
                {
                    "file_additions": 13,
                    "file_deletions": 22,
                    "file_exists": false,
                    "file_name": "src/linux/LinuxVST3Helpers.cpp",
                    "file_size": 0
                }
            ],
            "interesting": {
                "reopen": false,
                "status": false
            },
            "is_parent": false,
            "sha": "ff9bff7fb4bb9f574a85c6adf7de65aed2b50a35"
        }
    ],
    "first_commit": "2019-02-21 23:32:00",
    "last_commit": "2019-08-20 18:40:25",
    "number": 514,
    "pull_request": "None",
    "score": {
        "accidental_reopen_likely": false,
        "all_labels": [
            "Linux",
            "VST3"
        ],
        "contains_keywords": [
            "fault",
            "issu",
            "problem",
            "crash",
            "chang",
            "work",
            "debug",
            "fix",
            "test",
            "bug",
            "fail"
        ],
        "fix_size": 106,
        "has_labels": [],
        "intersecting": {
            "computed_score": 1.0,
            "final_commit_size": 34,
            "intersection_size": 34,
            "previous_commits_size": 106
        },
        "is_makefile_based": true,
        "no_new_files": [],
        "no_other_files": false,
        "num_prohibited_files": 86680,
        "prohibited_files": [
            "tools/building.py",
            "tools/building.py",
            "tools/building.py",
            "emcc.py",
            "src/library_emmalloc.js",
            "src/shell.js",
            "tests/test_core.py",
            "src/shell.js",
            "tests/test_core.py",
            "src/library.js"
        ],
        "reopen": false,
        "reopen_events": [
            [
                "2019-02-22 01:33:25",
                "commit"
            ],
            [
                "2019-02-22 01:45:30",
                "commit"
            ],
            [
                "2019-07-10 02:36:21",
                "commit"
            ],
            [
                "2019-07-27 22:08:19",
                "commit"
            ],
            [
                "2019-07-29 00:48:56",
                "commit"
            ],
            [
                "2019-07-29 00:56:29",
                "commit"
            ],
            [
                "2019-08-18 12:57:57",
                "commit"
            ],
            [
                "2019-08-18 13:07:28",
                "commit"
            ],
            [
                "2019-08-18 13:14:56",
                "commit"
            ],
            [
                "2019-08-20 18:33:32",
                "commit"
            ],
            [
                "2019-08-20 18:40:27",
                "commit"
            ],
            [
                "2020-05-27 14:11:25",
                "closed"
            ]
        ],
        "status": true,
        "strategy": true,
        "total_changes": 907
    }
}