{
    "covered_issues": [
        79,
        77,
        68,
        60,
        57,
        50,
        47,
        45,
        35,
        34,
        33,
        31,
        26,
        21,
        20,
        19,
        17,
        16,
        15,
        14,
        12,
        10,
        9,
        8,
        6,
        4,
        3
    ],
    "finished": true
}