{
    "commits": [
        {
            "associated_pull_request": [],
            "date": "2016-08-03 15:14:00+00:00",
            "diff": "",
            "diff_additions": 0,
            "diff_deletions": 0,
            "diff_file_size": 0,
            "diff_url": "https://github.com/checkpoint-restore/criu/commit/e8dde5856efdb200d0eb40522340e348467a7c88.diff",
            "exists": true,
            "files": [],
            "interesting": {
                "reopen": false,
                "status": false
            },
            "is_parent": true,
            "sha": "e8dde5856efdb200d0eb40522340e348467a7c88"
        },
        {
            "associated_pull_request": [],
            "date": "2016-08-18 06:37:36+00:00",
            "diff": "checkpoint-restore_criu/issue_203/commit_fe41273593bc2c534817420002d0fdda33b2f46d.diff",
            "diff_additions": 1,
            "diff_deletions": 1,
            "diff_file_size": 17049,
            "diff_url": "https://github.com/checkpoint-restore/criu/commit/fe41273593bc2c534817420002d0fdda33b2f46d.diff",
            "exists": true,
            "files": [
                {
                    "file_additions": 1,
                    "file_deletions": 1,
                    "file_exists": true,
                    "file_name": "criu/parasite-syscall.c",
                    "file_size": 17049
                }
            ],
            "interesting": {
                "reopen": false,
                "status": false
            },
            "is_parent": false,
            "sha": "fe41273593bc2c534817420002d0fdda33b2f46d"
        },
        {
            "associated_pull_request": [],
            "date": "2016-08-18 06:30:52+00:00",
            "diff": "checkpoint-restore_criu/issue_203/commit_e5159c6a77ed8d425b1668f383177a96c2e1850f.diff",
            "diff_additions": 1,
            "diff_deletions": 1,
            "diff_file_size": 17049,
            "diff_url": "https://github.com/checkpoint-restore/criu/commit/e5159c6a77ed8d425b1668f383177a96c2e1850f.diff",
            "exists": true,
            "files": [
                {
                    "file_additions": 1,
                    "file_deletions": 1,
                    "file_exists": true,
                    "file_name": "criu/parasite-syscall.c",
                    "file_size": 17049
                }
            ],
            "interesting": {
                "reopen": true,
                "status": false
            },
            "is_parent": false,
            "sha": "e5159c6a77ed8d425b1668f383177a96c2e1850f"
        },
        {
            "associated_pull_request": [],
            "date": "2016-08-23 14:02:07+00:00",
            "diff": "checkpoint-restore_criu/issue_203/commit_26e3e90733f0b644ea70c9514bff453bbf14d49a.diff",
            "diff_additions": 2,
            "diff_deletions": 10,
            "diff_file_size": 88900,
            "diff_url": "https://github.com/checkpoint-restore/criu/commit/26e3e90733f0b644ea70c9514bff453bbf14d49a.diff",
            "exists": true,
            "files": [
                {
                    "file_additions": 0,
                    "file_deletions": 8,
                    "file_exists": true,
                    "file_name": "criu/cr-dump.c",
                    "file_size": 52515
                },
                {
                    "file_additions": 2,
                    "file_deletions": 2,
                    "file_exists": true,
                    "file_name": "criu/mem.c",
                    "file_size": 36385
                }
            ],
            "interesting": {
                "reopen": false,
                "status": false
            },
            "is_parent": false,
            "sha": "26e3e90733f0b644ea70c9514bff453bbf14d49a"
        },
        {
            "associated_pull_request": [],
            "date": "2016-08-23 18:57:00+00:00",
            "diff": "checkpoint-restore_criu/issue_203/commit_85e4d172dc12b02b1f2608b613511c721931a5c5.diff",
            "diff_additions": 2,
            "diff_deletions": 10,
            "diff_file_size": 88900,
            "diff_url": "https://github.com/checkpoint-restore/criu/commit/85e4d172dc12b02b1f2608b613511c721931a5c5.diff",
            "exists": true,
            "files": [
                {
                    "file_additions": 0,
                    "file_deletions": 8,
                    "file_exists": true,
                    "file_name": "criu/cr-dump.c",
                    "file_size": 52515
                },
                {
                    "file_additions": 2,
                    "file_deletions": 2,
                    "file_exists": true,
                    "file_name": "criu/mem.c",
                    "file_size": 36385
                }
            ],
            "interesting": {
                "reopen": false,
                "status": false
            },
            "is_parent": false,
            "sha": "85e4d172dc12b02b1f2608b613511c721931a5c5"
        },
        {
            "associated_pull_request": [],
            "date": "2016-08-18 06:37:00+00:00",
            "diff": "checkpoint-restore_criu/issue_203/commit_1b809cda61758d14a522aeaed71b39a9bdb93d5b.diff",
            "diff_additions": 1,
            "diff_deletions": 1,
            "diff_file_size": 17049,
            "diff_url": "https://github.com/checkpoint-restore/criu/commit/1b809cda61758d14a522aeaed71b39a9bdb93d5b.diff",
            "exists": true,
            "files": [
                {
                    "file_additions": 1,
                    "file_deletions": 1,
                    "file_exists": true,
                    "file_name": "criu/parasite-syscall.c",
                    "file_size": 17049
                }
            ],
            "interesting": {
                "reopen": false,
                "status": false
            },
            "is_parent": false,
            "sha": "1b809cda61758d14a522aeaed71b39a9bdb93d5b"
        }
    ],
    "first_commit": "2016-08-15 18:13:18+00:00",
    "last_commit": "2016-09-06 16:00:23+00:00",
    "number": 203,
    "pull_request": "None",
    "score": {
        "accidental_reopen_likely": false,
        "all_labels": [
            "bug"
        ],
        "contains_keywords": [
            "work",
            "chang",
            "fix",
            "issu",
            "patch",
            "perform",
            "test",
            "attempt",
            "fault",
            "bug"
        ],
        "fix_size": 16,
        "has_labels": [
            "bug"
        ],
        "intersecting": {
            "computed_score": 0.5,
            "final_commit_size": 2,
            "intersection_size": 1,
            "previous_commits_size": 15
        },
        "is_makefile_based": true,
        "no_new_files": [],
        "no_other_files": false,
        "num_prohibited_files": 245633,
        "prohibited_files": [
            "server/src/main/java/com/genymobile/scrcpy/Device.java",
            "server/src/main/java/com/genymobile/scrcpy/wrappers/SurfaceControl.java",
            "server/src/main/java/com/genymobile/scrcpy/Device.java",
            "server/src/main/java/com/genymobile/scrcpy/wrappers/SurfaceControl.java",
            "app/meson.build",
            "app/scrcpy.1",
            "app/src/common.h",
            "app/src/scrcpy.h",
            "app/src/server.h",
            "server/src/main/java/com/genymobile/scrcpy/Workarounds.java"
        ],
        "reopen": true,
        "reopen_events": [
            [
                "2016-08-18 06:42:34+00:00",
                "commit"
            ],
            [
                "2016-08-19 10:45:13+00:00",
                "commit"
            ],
            [
                "2016-08-19 10:45:45+00:00",
                "closed"
            ],
            [
                "2016-08-19 18:51:31+00:00",
                "commit"
            ],
            [
                "2016-08-23 12:14:43+00:00",
                "reopened"
            ],
            [
                "2016-08-25 15:06:15+00:00",
                "commit"
            ],
            [
                "2016-08-25 18:18:19+00:00",
                "commit"
            ],
            [
                "2016-08-25 18:19:07+00:00",
                "closed"
            ],
            [
                "2016-09-06 16:32:50+00:00",
                "commit"
            ]
        ],
        "status": false,
        "strategy": true,
        "total_changes": 30
    }
}