{
    "covered_issues": [
        729,
        725,
        721,
        718,
        716,
        712,
        711,
        710,
        709,
        706,
        704,
        702,
        696,
        688,
        684,
        683,
        682,
        681,
        680,
        679,
        678,
        677,
        676,
        675,
        674,
        673,
        672,
        671,
        670,
        669,
        668,
        667,
        666,
        660,
        659,
        657,
        655,
        654,
        647,
        646,
        643,
        637,
        630,
        626,
        616,
        613,
        611,
        604,
        597,
        572,
        569,
        568,
        561,
        559,
        554,
        553,
        552,
        545,
        534,
        531,
        529,
        527,
        525,
        509,
        508,
        506,
        501,
        498,
        497,
        496,
        489,
        488,
        487,
        486,
        483,
        480,
        476,
        475,
        465,
        463,
        455,
        451,
        445,
        439,
        436,
        435,
        434,
        432,
        429,
        424,
        421,
        418,
        414,
        413,
        406,
        399,
        394,
        387,
        385,
        384,
        366,
        365,
        363,
        357,
        355,
        354,
        352,
        351,
        348,
        334,
        330,
        319,
        316,
        313,
        312,
        296,
        291,
        279,
        263,
        257,
        254,
        242,
        233,
        232,
        225,
        223,
        221,
        208,
        204,
        198,
        195,
        194,
        192,
        186,
        184,
        183,
        182,
        181,
        167,
        164,
        163,
        162,
        160,
        159,
        158,
        156,
        151,
        150,
        149,
        139,
        138,
        137,
        135,
        132,
        124,
        116,
        115,
        113,
        112,
        110,
        107,
        106,
        105,
        97,
        91,
        88,
        82,
        81,
        77,
        75,
        74,
        73,
        72,
        70,
        69,
        66,
        65,
        64,
        63,
        62,
        58,
        57,
        56,
        55,
        54,
        53,
        52,
        46,
        44,
        43,
        42,
        39,
        36,
        35,
        34,
        33,
        29,
        27,
        23,
        22,
        20,
        14,
        13,
        12,
        11,
        10,
        8,
        7,
        6,
        5,
        4,
        3,
        1
    ],
    "finished": true
}