{
    "covered_issues": [
        296,
        294,
        290,
        283,
        276,
        272,
        271,
        269,
        266,
        262,
        256,
        255,
        254,
        253,
        251,
        249,
        248,
        247,
        246,
        245,
        244,
        243,
        242,
        240,
        238,
        235,
        234,
        233,
        232,
        231,
        228,
        226,
        225,
        223,
        219,
        210,
        204,
        202,
        200,
        199,
        197,
        196,
        195,
        194,
        192,
        191,
        190,
        189,
        188,
        185,
        184,
        182,
        180,
        178,
        177,
        176,
        175,
        174,
        173,
        169,
        168,
        166,
        165,
        163,
        161,
        159,
        157,
        153,
        150,
        147,
        145,
        144,
        142,
        141,
        139,
        136,
        135,
        132,
        131,
        130,
        129,
        124,
        123,
        119,
        116,
        115,
        113,
        112,
        111,
        110,
        103,
        102,
        98,
        97,
        96,
        95,
        94,
        93,
        90,
        89,
        88,
        87,
        86,
        85,
        83,
        80,
        77,
        76,
        73,
        72,
        71,
        69,
        67,
        66,
        65,
        63,
        61,
        57,
        55,
        51,
        50,
        49,
        47,
        46,
        44,
        39,
        37,
        36,
        31,
        18,
        17,
        14,
        12,
        10,
        7,
        6,
        5,
        4,
        3
    ],
    "finished": true
}