{
    "covered_issues": [
        20,
        18,
        16,
        14,
        13,
        11,
        10,
        9,
        8,
        7,
        5,
        3,
        2
    ],
    "finished": true
}