{
    "covered_issues": [
        63,
        59,
        58,
        57,
        56,
        55,
        53,
        52,
        51,
        49,
        47,
        45,
        43,
        42,
        41,
        37,
        35,
        34,
        31,
        30,
        21,
        19,
        13,
        11,
        9,
        6,
        3,
        2,
        1
    ],
    "finished": true
}