{
    "commits": [
        {
            "associated_pull_request": [],
            "date": "2020-07-12 18:44:15+00:00",
            "diff": "atar-axis_xpadneo/issue_228/commit_d74f32ec92d2670cf73302d31644dd030d7fcd97.diff",
            "diff_additions": 50,
            "diff_deletions": 44,
            "diff_file_size": 41306,
            "diff_url": "https://github.com/atar-axis/xpadneo/commit/d74f32ec92d2670cf73302d31644dd030d7fcd97.diff",
            "exists": true,
            "files": [
                {
                    "file_additions": 50,
                    "file_deletions": 44,
                    "file_exists": true,
                    "file_name": "hid-xpadneo/src/hid-xpadneo.c",
                    "file_size": 41306
                }
            ],
            "interesting": {
                "reopen": false,
                "status": false
            },
            "is_parent": true,
            "sha": "d74f32ec92d2670cf73302d31644dd030d7fcd97"
        },
        {
            "associated_pull_request": [],
            "date": "2020-07-12 18:45:11+00:00",
            "diff": "atar-axis_xpadneo/issue_228/commit_486d98114312e330dbc04c0df1c297a6cbb22df8.diff",
            "diff_additions": 4,
            "diff_deletions": 2,
            "diff_file_size": 41306,
            "diff_url": "https://github.com/atar-axis/xpadneo/commit/486d98114312e330dbc04c0df1c297a6cbb22df8.diff",
            "exists": true,
            "files": [
                {
                    "file_additions": 4,
                    "file_deletions": 2,
                    "file_exists": true,
                    "file_name": "hid-xpadneo/src/hid-xpadneo.c",
                    "file_size": 41306
                }
            ],
            "interesting": {
                "reopen": false,
                "status": false
            },
            "is_parent": false,
            "sha": "486d98114312e330dbc04c0df1c297a6cbb22df8"
        },
        {
            "associated_pull_request": [],
            "date": "2020-07-12 21:52:03+00:00",
            "diff": "atar-axis_xpadneo/issue_228/commit_aedfb52b59b2da1f6bd244c9c80a3f09cc50084b.diff",
            "diff_additions": 6,
            "diff_deletions": 2,
            "diff_file_size": 41306,
            "diff_url": "https://github.com/atar-axis/xpadneo/commit/aedfb52b59b2da1f6bd244c9c80a3f09cc50084b.diff",
            "exists": true,
            "files": [
                {
                    "file_additions": 6,
                    "file_deletions": 2,
                    "file_exists": true,
                    "file_name": "hid-xpadneo/src/hid-xpadneo.c",
                    "file_size": 41306
                }
            ],
            "interesting": {
                "reopen": false,
                "status": false
            },
            "is_parent": false,
            "sha": "aedfb52b59b2da1f6bd244c9c80a3f09cc50084b"
        },
        {
            "associated_pull_request": [],
            "date": "2020-07-12 18:45:11+00:00",
            "diff": "atar-axis_xpadneo/issue_228/commit_9ec40ef23467bb701206399482273576ad640e18.diff",
            "diff_additions": 10,
            "diff_deletions": 2,
            "diff_file_size": 41306,
            "diff_url": "https://github.com/atar-axis/xpadneo/commit/9ec40ef23467bb701206399482273576ad640e18.diff",
            "exists": true,
            "files": [
                {
                    "file_additions": 10,
                    "file_deletions": 2,
                    "file_exists": true,
                    "file_name": "hid-xpadneo/src/hid-xpadneo.c",
                    "file_size": 41306
                }
            ],
            "interesting": {
                "reopen": false,
                "status": false
            },
            "is_parent": false,
            "sha": "9ec40ef23467bb701206399482273576ad640e18"
        },
        {
            "associated_pull_request": [],
            "date": "2020-07-12 21:52:03+00:00",
            "diff": "atar-axis_xpadneo/issue_228/commit_83ad155a82a21fb1929af8a38b1d3fe154f13068.diff",
            "diff_additions": 7,
            "diff_deletions": 3,
            "diff_file_size": 41306,
            "diff_url": "https://github.com/atar-axis/xpadneo/commit/83ad155a82a21fb1929af8a38b1d3fe154f13068.diff",
            "exists": true,
            "files": [
                {
                    "file_additions": 7,
                    "file_deletions": 3,
                    "file_exists": true,
                    "file_name": "hid-xpadneo/src/hid-xpadneo.c",
                    "file_size": 41306
                }
            ],
            "interesting": {
                "reopen": false,
                "status": false
            },
            "is_parent": false,
            "sha": "83ad155a82a21fb1929af8a38b1d3fe154f13068"
        },
        {
            "associated_pull_request": [],
            "date": "2020-07-12 18:45:11+00:00",
            "diff": "atar-axis_xpadneo/issue_228/commit_81f5e410910c0b3ec251b95cea2bc8293b62d0fd.diff",
            "diff_additions": 10,
            "diff_deletions": 2,
            "diff_file_size": 41306,
            "diff_url": "https://github.com/atar-axis/xpadneo/commit/81f5e410910c0b3ec251b95cea2bc8293b62d0fd.diff",
            "exists": true,
            "files": [
                {
                    "file_additions": 10,
                    "file_deletions": 2,
                    "file_exists": true,
                    "file_name": "hid-xpadneo/src/hid-xpadneo.c",
                    "file_size": 41306
                }
            ],
            "interesting": {
                "reopen": false,
                "status": false
            },
            "is_parent": false,
            "sha": "81f5e410910c0b3ec251b95cea2bc8293b62d0fd"
        },
        {
            "associated_pull_request": [],
            "date": "2020-07-12 21:52:03+00:00",
            "diff": "atar-axis_xpadneo/issue_228/commit_7cbf98a16f865b5bf19b2b923a77e40459e8cd89.diff",
            "diff_additions": 7,
            "diff_deletions": 3,
            "diff_file_size": 41306,
            "diff_url": "https://github.com/atar-axis/xpadneo/commit/7cbf98a16f865b5bf19b2b923a77e40459e8cd89.diff",
            "exists": true,
            "files": [
                {
                    "file_additions": 7,
                    "file_deletions": 3,
                    "file_exists": true,
                    "file_name": "hid-xpadneo/src/hid-xpadneo.c",
                    "file_size": 41306
                }
            ],
            "interesting": {
                "reopen": false,
                "status": false
            },
            "is_parent": false,
            "sha": "7cbf98a16f865b5bf19b2b923a77e40459e8cd89"
        },
        {
            "associated_pull_request": [],
            "date": "2020-07-12 18:45:11+00:00",
            "diff": "atar-axis_xpadneo/issue_228/commit_3b445daa37401939e9030362b26b1d15c89cc297.diff",
            "diff_additions": 10,
            "diff_deletions": 2,
            "diff_file_size": 41306,
            "diff_url": "https://github.com/atar-axis/xpadneo/commit/3b445daa37401939e9030362b26b1d15c89cc297.diff",
            "exists": true,
            "files": [
                {
                    "file_additions": 10,
                    "file_deletions": 2,
                    "file_exists": true,
                    "file_name": "hid-xpadneo/src/hid-xpadneo.c",
                    "file_size": 41306
                }
            ],
            "interesting": {
                "reopen": false,
                "status": false
            },
            "is_parent": false,
            "sha": "3b445daa37401939e9030362b26b1d15c89cc297"
        },
        {
            "associated_pull_request": [
                "https://github.com/atar-axis/xpadneo/pull/229"
            ],
            "date": "2020-07-12 21:52:03+00:00",
            "diff": "atar-axis_xpadneo/issue_228/commit_87fb3cd90da12fa85e3f908edc19350a3eb68547.diff",
            "diff_additions": 7,
            "diff_deletions": 3,
            "diff_file_size": 41306,
            "diff_url": "https://github.com/atar-axis/xpadneo/commit/87fb3cd90da12fa85e3f908edc19350a3eb68547.diff",
            "exists": true,
            "files": [
                {
                    "file_additions": 7,
                    "file_deletions": 3,
                    "file_exists": true,
                    "file_name": "hid-xpadneo/src/hid-xpadneo.c",
                    "file_size": 41306
                }
            ],
            "interesting": {
                "reopen": false,
                "status": false
            },
            "is_parent": false,
            "sha": "87fb3cd90da12fa85e3f908edc19350a3eb68547"
        },
        {
            "associated_pull_request": [],
            "date": "2020-07-12 18:45:11+00:00",
            "diff": "atar-axis_xpadneo/issue_228/commit_39c38276c0bf00231668767a3c5aeef250607e4b.diff",
            "diff_additions": 12,
            "diff_deletions": 2,
            "diff_file_size": 41306,
            "diff_url": "https://github.com/atar-axis/xpadneo/commit/39c38276c0bf00231668767a3c5aeef250607e4b.diff",
            "exists": true,
            "files": [
                {
                    "file_additions": 12,
                    "file_deletions": 2,
                    "file_exists": true,
                    "file_name": "hid-xpadneo/src/hid-xpadneo.c",
                    "file_size": 41306
                }
            ],
            "interesting": {
                "reopen": false,
                "status": false
            },
            "is_parent": false,
            "sha": "39c38276c0bf00231668767a3c5aeef250607e4b"
        },
        {
            "associated_pull_request": [],
            "date": "2020-07-12 18:45:11+00:00",
            "diff": "atar-axis_xpadneo/issue_228/commit_2bab3f2765559b004893443c37014acc118e521f.diff",
            "diff_additions": 12,
            "diff_deletions": 2,
            "diff_file_size": 41306,
            "diff_url": "https://github.com/atar-axis/xpadneo/commit/2bab3f2765559b004893443c37014acc118e521f.diff",
            "exists": true,
            "files": [
                {
                    "file_additions": 12,
                    "file_deletions": 2,
                    "file_exists": true,
                    "file_name": "hid-xpadneo/src/hid-xpadneo.c",
                    "file_size": 41306
                }
            ],
            "interesting": {
                "reopen": false,
                "status": false
            },
            "is_parent": false,
            "sha": "2bab3f2765559b004893443c37014acc118e521f"
        },
        {
            "associated_pull_request": [],
            "date": "2020-07-12 18:45:11+00:00",
            "diff": "atar-axis_xpadneo/issue_228/commit_a7a79fdfa4e02ca3ad0bb65c8a8d1773906f36f4.diff",
            "diff_additions": 12,
            "diff_deletions": 2,
            "diff_file_size": 41306,
            "diff_url": "https://github.com/atar-axis/xpadneo/commit/a7a79fdfa4e02ca3ad0bb65c8a8d1773906f36f4.diff",
            "exists": true,
            "files": [
                {
                    "file_additions": 12,
                    "file_deletions": 2,
                    "file_exists": true,
                    "file_name": "hid-xpadneo/src/hid-xpadneo.c",
                    "file_size": 41306
                }
            ],
            "interesting": {
                "reopen": false,
                "status": false
            },
            "is_parent": false,
            "sha": "a7a79fdfa4e02ca3ad0bb65c8a8d1773906f36f4"
        },
        {
            "associated_pull_request": [],
            "date": "2020-07-12 18:45:11+00:00",
            "diff": "atar-axis_xpadneo/issue_228/commit_199eba709c8f3f0d3d59c011d663e62973c21a83.diff",
            "diff_additions": 12,
            "diff_deletions": 2,
            "diff_file_size": 41306,
            "diff_url": "https://github.com/atar-axis/xpadneo/commit/199eba709c8f3f0d3d59c011d663e62973c21a83.diff",
            "exists": true,
            "files": [
                {
                    "file_additions": 12,
                    "file_deletions": 2,
                    "file_exists": true,
                    "file_name": "hid-xpadneo/src/hid-xpadneo.c",
                    "file_size": 41306
                }
            ],
            "interesting": {
                "reopen": false,
                "status": false
            },
            "is_parent": false,
            "sha": "199eba709c8f3f0d3d59c011d663e62973c21a83"
        },
        {
            "associated_pull_request": [
                "https://github.com/atar-axis/xpadneo/pull/229"
            ],
            "date": "2020-07-12 18:45:11+00:00",
            "diff": "atar-axis_xpadneo/issue_228/commit_f5ef8310cc666f2d90331c90966d4a03a7adf399.diff",
            "diff_additions": 12,
            "diff_deletions": 2,
            "diff_file_size": 41306,
            "diff_url": "https://github.com/atar-axis/xpadneo/commit/f5ef8310cc666f2d90331c90966d4a03a7adf399.diff",
            "exists": true,
            "files": [
                {
                    "file_additions": 12,
                    "file_deletions": 2,
                    "file_exists": true,
                    "file_name": "hid-xpadneo/src/hid-xpadneo.c",
                    "file_size": 41306
                }
            ],
            "interesting": {
                "reopen": false,
                "status": false
            },
            "is_parent": false,
            "sha": "f5ef8310cc666f2d90331c90966d4a03a7adf399"
        },
        {
            "associated_pull_request": [
                "https://github.com/atar-axis/xpadneo/pull/229"
            ],
            "date": "2020-07-12 21:52:03+00:00",
            "diff": "atar-axis_xpadneo/issue_228/commit_854929e0bb974c9a798b480aa06b3bb3464493b4.diff",
            "diff_additions": 7,
            "diff_deletions": 3,
            "diff_file_size": 41306,
            "diff_url": "https://github.com/atar-axis/xpadneo/commit/854929e0bb974c9a798b480aa06b3bb3464493b4.diff",
            "exists": true,
            "files": [
                {
                    "file_additions": 7,
                    "file_deletions": 3,
                    "file_exists": true,
                    "file_name": "hid-xpadneo/src/hid-xpadneo.c",
                    "file_size": 41306
                }
            ],
            "interesting": {
                "reopen": false,
                "status": false
            },
            "is_parent": false,
            "sha": "854929e0bb974c9a798b480aa06b3bb3464493b4"
        },
        {
            "associated_pull_request": [
                "https://github.com/atar-axis/xpadneo/pull/229"
            ],
            "date": "2020-07-12 18:45:11+00:00",
            "diff": "atar-axis_xpadneo/issue_228/commit_3edee83eab69bbdd26d2121938280fbf7d7a3fd5.diff",
            "diff_additions": 12,
            "diff_deletions": 2,
            "diff_file_size": 41306,
            "diff_url": "https://github.com/atar-axis/xpadneo/commit/3edee83eab69bbdd26d2121938280fbf7d7a3fd5.diff",
            "exists": true,
            "files": [
                {
                    "file_additions": 12,
                    "file_deletions": 2,
                    "file_exists": true,
                    "file_name": "hid-xpadneo/src/hid-xpadneo.c",
                    "file_size": 41306
                }
            ],
            "interesting": {
                "reopen": true,
                "status": false
            },
            "is_parent": false,
            "sha": "3edee83eab69bbdd26d2121938280fbf7d7a3fd5"
        },
        {
            "associated_pull_request": [],
            "date": "2020-07-12 21:52:03+00:00",
            "diff": "atar-axis_xpadneo/issue_228/commit_0b4ff6972d81bb14ba98ef3b20175ca5e8769a06.diff",
            "diff_additions": 7,
            "diff_deletions": 2,
            "diff_file_size": 41306,
            "diff_url": "https://github.com/atar-axis/xpadneo/commit/0b4ff6972d81bb14ba98ef3b20175ca5e8769a06.diff",
            "exists": true,
            "files": [
                {
                    "file_additions": 7,
                    "file_deletions": 2,
                    "file_exists": true,
                    "file_name": "hid-xpadneo/src/hid-xpadneo.c",
                    "file_size": 41306
                }
            ],
            "interesting": {
                "reopen": false,
                "status": false
            },
            "is_parent": false,
            "sha": "0b4ff6972d81bb14ba98ef3b20175ca5e8769a06"
        },
        {
            "associated_pull_request": [],
            "date": "2020-07-12 18:45:11+00:00",
            "diff": "atar-axis_xpadneo/issue_228/commit_748fb96ea79429f4677be7a44093c52b636f11b3.diff",
            "diff_additions": 12,
            "diff_deletions": 2,
            "diff_file_size": 41306,
            "diff_url": "https://github.com/atar-axis/xpadneo/commit/748fb96ea79429f4677be7a44093c52b636f11b3.diff",
            "exists": true,
            "files": [
                {
                    "file_additions": 12,
                    "file_deletions": 2,
                    "file_exists": true,
                    "file_name": "hid-xpadneo/src/hid-xpadneo.c",
                    "file_size": 41306
                }
            ],
            "interesting": {
                "reopen": false,
                "status": false
            },
            "is_parent": false,
            "sha": "748fb96ea79429f4677be7a44093c52b636f11b3"
        }
    ],
    "first_commit": "2020-07-12 18:44:15+00:00",
    "last_commit": "2020-07-25 14:09:43+00:00",
    "number": 228,
    "pull_request": "None",
    "score": {
        "accidental_reopen_likely": false,
        "all_labels": [
            "0 | type: bug",
            "0 | type: enhancement",
            "1 | state: testing solution",
            "0 | type: hardware support"
        ],
        "contains_keywords": [
            "confirm",
            "work",
            "chang",
            "fix",
            "issu",
            "patch",
            "debug",
            "reason",
            "test",
            "fault",
            "remov",
            "warn",
            "bug",
            "problem",
            "report"
        ],
        "fix_size": 65,
        "has_labels": [],
        "intersecting": {
            "computed_score": 0.3333333333333333,
            "final_commit_size": 15,
            "intersection_size": 5,
            "previous_commits_size": 55
        },
        "is_makefile_based": false,
        "no_new_files": [],
        "no_other_files": true,
        "num_prohibited_files": 862812,
        "prohibited_files": [
            "server/src/main/java/com/genymobile/scrcpy/Device.java",
            "server/src/main/java/com/genymobile/scrcpy/wrappers/SurfaceControl.java",
            "server/src/main/java/com/genymobile/scrcpy/Device.java",
            "server/src/main/java/com/genymobile/scrcpy/wrappers/SurfaceControl.java",
            "app/meson.build",
            "app/scrcpy.1",
            "app/src/common.h",
            "app/src/scrcpy.h",
            "app/src/server.h",
            "server/src/main/java/com/genymobile/scrcpy/Workarounds.java"
        ],
        "reopen": true,
        "reopen_events": [
            [
                "2020-07-12 18:45:51+00:00",
                "commit"
            ],
            [
                "2020-07-12 22:10:46+00:00",
                "commit"
            ],
            [
                "2020-07-12 22:10:46+00:00",
                "commit"
            ],
            [
                "2020-07-12 22:34:02+00:00",
                "commit"
            ],
            [
                "2020-07-12 22:34:02+00:00",
                "commit"
            ],
            [
                "2020-07-12 23:03:54+00:00",
                "commit"
            ],
            [
                "2020-07-12 23:03:54+00:00",
                "commit"
            ],
            [
                "2020-07-13 00:48:34+00:00",
                "commit"
            ],
            [
                "2020-07-13 00:48:34+00:00",
                "commit"
            ],
            [
                "2020-07-13 01:21:13+00:00",
                "commit"
            ],
            [
                "2020-07-13 02:09:32+00:00",
                "commit"
            ],
            [
                "2020-07-13 21:25:24+00:00",
                "commit"
            ],
            [
                "2020-07-14 09:11:43+00:00",
                "commit"
            ],
            [
                "2020-07-15 23:11:51+00:00",
                "closed"
            ],
            [
                "2020-07-15 23:11:51+00:00",
                "commit"
            ],
            [
                "2020-07-15 23:11:52+00:00",
                "commit"
            ],
            [
                "2020-07-15 23:14:03+00:00",
                "reopened"
            ],
            [
                "2020-07-21 13:26:48+00:00",
                "closed"
            ],
            [
                "2020-07-21 17:39:51+00:00",
                "reopened"
            ],
            [
                "2020-07-22 05:28:34+00:00",
                "commit"
            ],
            [
                "2020-07-25 13:28:49+00:00",
                "closed"
            ],
            [
                "2020-07-25 13:28:49+00:00",
                "commit"
            ],
            [
                "2020-07-25 13:43:07+00:00",
                "commit"
            ],
            [
                "2020-07-25 14:09:58+00:00",
                "commit"
            ],
            [
                "2020-07-25 14:09:58+00:00",
                "commit"
            ]
        ],
        "status": false,
        "strategy": true,
        "total_changes": 291
    }
}