{
    "category": [
        "memory",
        "GUI"
    ],
    "commits": [
        {
            "associated_pull_request": [],
            "date": "2020-04-19 19:00:05",
            "diff": "pygame_pygame/issue_941/commit_6408af23e6afb90cfd2d7a086cf9ebb5317abe07.diff",
            "diff_additions": 2,
            "diff_deletions": 2,
            "diff_file_size": 135974,
            "diff_url": "https://github.com/pygame/pygame/commit/6408af23e6afb90cfd2d7a086cf9ebb5317abe07.diff",
            "exists": true,
            "files": [
                {
                    "file_additions": 2,
                    "file_deletions": 2,
                    "file_exists": true,
                    "file_name": "src_c/surface.c",
                    "file_size": 135974
                }
            ],
            "interesting": {
                "reopen": false,
                "status": false
            },
            "is_parent": true,
            "sha": "6408af23e6afb90cfd2d7a086cf9ebb5317abe07"
        },
        {
            "associated_pull_request": [],
            "date": "2020-04-19 19:13:21",
            "diff": "pygame_pygame/issue_941/commit_fc8618c6bb6645160da13440871b27c4c5f106f7.diff",
            "diff_additions": 7,
            "diff_deletions": 3,
            "diff_file_size": 14805,
            "diff_url": "https://github.com/pygame/pygame/commit/fc8618c6bb6645160da13440871b27c4c5f106f7.diff",
            "exists": true,
            "files": [
                {
                    "file_additions": 7,
                    "file_deletions": 3,
                    "file_exists": true,
                    "file_name": "src_c/mouse.c",
                    "file_size": 14805
                }
            ],
            "interesting": {
                "reopen": false,
                "status": true
            },
            "is_parent": false,
            "sha": "fc8618c6bb6645160da13440871b27c4c5f106f7"
        },
        {
            "associated_pull_request": [
                "https://github.com/pygame/pygame/pull/1653"
            ],
            "date": "2020-04-22 19:51:45",
            "diff": "pygame_pygame/issue_941/commit_cbc070b580cc5d72a3701d1d98e7e6dd268c3285.diff",
            "diff_additions": 9,
            "diff_deletions": 5,
            "diff_file_size": 150779,
            "diff_url": "https://github.com/pygame/pygame/commit/cbc070b580cc5d72a3701d1d98e7e6dd268c3285.diff",
            "exists": true,
            "files": [
                {
                    "file_additions": 7,
                    "file_deletions": 3,
                    "file_exists": true,
                    "file_name": "src_c/mouse.c",
                    "file_size": 14805
                },
                {
                    "file_additions": 2,
                    "file_deletions": 2,
                    "file_exists": true,
                    "file_name": "src_c/surface.c",
                    "file_size": 135974
                }
            ],
            "interesting": {
                "reopen": false,
                "status": false
            },
            "is_parent": false,
            "sha": "cbc070b580cc5d72a3701d1d98e7e6dd268c3285"
        }
    ],
    "first_commit": "2020-04-19 19:00:07",
    "last_commit": "2020-04-22 19:51:45",
    "number": 941,
    "pull_request": "None",
    "score": {
        "accidental_reopen_likely": false,
        "all_labels": [
            "SDL2",
            "mouse"
        ],
        "contains_keywords": [
            "chang",
            "remov",
            "attempt",
            "issu"
        ],
        "fix_size": 13,
        "has_labels": [],
        "intersecting": {
            "computed_score": 0.7692307692307693,
            "final_commit_size": 13,
            "intersection_size": 10,
            "previous_commits_size": 10
        },
        "is_makefile_based": false,
        "no_new_files": [
            "src_c/surface.c"
        ],
        "no_other_files": false,
        "num_prohibited_files": 66022,
        "prohibited_files": [
            "hal/inc/pinmap_hal.h",
            "Debug/marvin.bin",
            "Debug/marvin.elf",
            "Debug/marvin.hex",
            "Debug/marvin.bin",
            "Debug/marvin.elf",
            "Debug/marvin.hex",
            "inc/spark_utilities.h",
            "Debug/marvin.bin",
            "Debug/marvin.elf"
        ],
        "reopen": false,
        "reopen_events": [
            [
                "2020-04-19 19:20:24",
                "commit"
            ],
            [
                "2020-04-19 21:28:00",
                "commit"
            ],
            [
                "2020-04-22 19:51:47",
                "closed"
            ],
            [
                "2020-04-22 19:51:47",
                "commit"
            ],
            [
                "2020-04-22 19:51:47",
                "commit"
            ]
        ],
        "status": true,
        "strategy": true,
        "total_changes": 28
    }
}