{
    "category": [
        "GUI",
        "network/protocol"
    ],
    "commits": [
        {
            "associated_pull_request": [],
            "date": "2015-09-14 08:22:43",
            "diff": "i3_i3/issue_1924/commit_7de15b38156a0019222d014ab23b612699c277dd.diff",
            "diff_additions": 4,
            "diff_deletions": 4,
            "diff_file_size": 37454,
            "diff_url": "https://github.com/i3/i3/commit/7de15b38156a0019222d014ab23b612699c277dd.diff",
            "exists": true,
            "files": [
                {
                    "file_additions": 4,
                    "file_deletions": 4,
                    "file_exists": true,
                    "file_name": "src/workspace.c",
                    "file_size": 37454
                }
            ],
            "interesting": {
                "reopen": false,
                "status": false
            },
            "is_parent": true,
            "sha": "7de15b38156a0019222d014ab23b612699c277dd"
        },
        {
            "associated_pull_request": [],
            "date": "2015-09-16 17:01:05",
            "diff": "i3_i3/issue_1924/commit_10a78ac06bbfbe3d7e17fb30c29de3c56f0b5e05.diff",
            "diff_additions": 1,
            "diff_deletions": 1,
            "diff_file_size": 54833,
            "diff_url": "https://github.com/i3/i3/commit/10a78ac06bbfbe3d7e17fb30c29de3c56f0b5e05.diff",
            "exists": true,
            "files": [
                {
                    "file_additions": 1,
                    "file_deletions": 1,
                    "file_exists": true,
                    "file_name": "src/x.c",
                    "file_size": 54833
                }
            ],
            "interesting": {
                "reopen": true,
                "status": false
            },
            "is_parent": false,
            "sha": "10a78ac06bbfbe3d7e17fb30c29de3c56f0b5e05"
        },
        {
            "associated_pull_request": [],
            "date": "2015-09-17 20:52:56",
            "diff": "i3_i3/issue_1924/commit_9493fa3374f8c356b9caa92516abcb8f361d7750.diff",
            "diff_additions": 11,
            "diff_deletions": 8,
            "diff_file_size": 169660,
            "diff_url": "https://github.com/i3/i3/commit/9493fa3374f8c356b9caa92516abcb8f361d7750.diff",
            "exists": true,
            "files": [
                {
                    "file_additions": 1,
                    "file_deletions": 1,
                    "file_exists": true,
                    "file_name": "src/commands.c",
                    "file_size": 76096
                },
                {
                    "file_additions": 1,
                    "file_deletions": 1,
                    "file_exists": true,
                    "file_name": "src/handlers.c",
                    "file_size": 51996
                },
                {
                    "file_additions": 7,
                    "file_deletions": 5,
                    "file_exists": true,
                    "file_name": "src/output.c",
                    "file_size": 4114
                },
                {
                    "file_additions": 2,
                    "file_deletions": 1,
                    "file_exists": true,
                    "file_name": "src/workspace.c",
                    "file_size": 37454
                }
            ],
            "interesting": {
                "reopen": false,
                "status": false
            },
            "is_parent": false,
            "sha": "9493fa3374f8c356b9caa92516abcb8f361d7750"
        },
        {
            "associated_pull_request": [],
            "date": "2015-09-17 20:52:56",
            "diff": "i3_i3/issue_1924/commit_7d964a41e7e4817c1a75ae2fd88769b182a39db0.diff",
            "diff_additions": 21,
            "diff_deletions": 13,
            "diff_file_size": 169660,
            "diff_url": "https://github.com/i3/i3/commit/7d964a41e7e4817c1a75ae2fd88769b182a39db0.diff",
            "exists": true,
            "files": [
                {
                    "file_additions": 1,
                    "file_deletions": 1,
                    "file_exists": true,
                    "file_name": "src/commands.c",
                    "file_size": 76096
                },
                {
                    "file_additions": 1,
                    "file_deletions": 1,
                    "file_exists": true,
                    "file_name": "src/handlers.c",
                    "file_size": 51996
                },
                {
                    "file_additions": 17,
                    "file_deletions": 10,
                    "file_exists": true,
                    "file_name": "src/output.c",
                    "file_size": 4114
                },
                {
                    "file_additions": 2,
                    "file_deletions": 1,
                    "file_exists": true,
                    "file_name": "src/workspace.c",
                    "file_size": 37454
                }
            ],
            "interesting": {
                "reopen": false,
                "status": false
            },
            "is_parent": false,
            "sha": "7d964a41e7e4817c1a75ae2fd88769b182a39db0"
        },
        {
            "associated_pull_request": [],
            "date": "2015-09-17 20:52:56",
            "diff": "i3_i3/issue_1924/commit_4b3e9d19e7e834eb3ac32ec1480535914e52e079.diff",
            "diff_additions": 21,
            "diff_deletions": 13,
            "diff_file_size": 169660,
            "diff_url": "https://github.com/i3/i3/commit/4b3e9d19e7e834eb3ac32ec1480535914e52e079.diff",
            "exists": true,
            "files": [
                {
                    "file_additions": 1,
                    "file_deletions": 1,
                    "file_exists": true,
                    "file_name": "src/commands.c",
                    "file_size": 76096
                },
                {
                    "file_additions": 1,
                    "file_deletions": 1,
                    "file_exists": true,
                    "file_name": "src/handlers.c",
                    "file_size": 51996
                },
                {
                    "file_additions": 17,
                    "file_deletions": 10,
                    "file_exists": true,
                    "file_name": "src/output.c",
                    "file_size": 4114
                },
                {
                    "file_additions": 2,
                    "file_deletions": 1,
                    "file_exists": true,
                    "file_name": "src/workspace.c",
                    "file_size": 37454
                }
            ],
            "interesting": {
                "reopen": false,
                "status": false
            },
            "is_parent": false,
            "sha": "4b3e9d19e7e834eb3ac32ec1480535914e52e079"
        },
        {
            "associated_pull_request": [],
            "date": "2015-09-17 20:52:56",
            "diff": "i3_i3/issue_1924/commit_dd4ecfc06f2d6b0e07cdca3cab0e03e2329ea12b.diff",
            "diff_additions": 17,
            "diff_deletions": 13,
            "diff_file_size": 169660,
            "diff_url": "https://github.com/i3/i3/commit/dd4ecfc06f2d6b0e07cdca3cab0e03e2329ea12b.diff",
            "exists": true,
            "files": [
                {
                    "file_additions": 1,
                    "file_deletions": 1,
                    "file_exists": true,
                    "file_name": "src/commands.c",
                    "file_size": 76096
                },
                {
                    "file_additions": 1,
                    "file_deletions": 1,
                    "file_exists": true,
                    "file_name": "src/handlers.c",
                    "file_size": 51996
                },
                {
                    "file_additions": 13,
                    "file_deletions": 10,
                    "file_exists": true,
                    "file_name": "src/output.c",
                    "file_size": 4114
                },
                {
                    "file_additions": 2,
                    "file_deletions": 1,
                    "file_exists": true,
                    "file_name": "src/workspace.c",
                    "file_size": 37454
                }
            ],
            "interesting": {
                "reopen": false,
                "status": false
            },
            "is_parent": false,
            "sha": "dd4ecfc06f2d6b0e07cdca3cab0e03e2329ea12b"
        },
        {
            "associated_pull_request": [
                "https://github.com/i3/i3/pull/1931"
            ],
            "date": "2015-09-17 20:52:56",
            "diff": "i3_i3/issue_1924/commit_922afe1919d7969a9bfd6083504e563642f07eff.diff",
            "diff_additions": 17,
            "diff_deletions": 13,
            "diff_file_size": 169660,
            "diff_url": "https://github.com/i3/i3/commit/922afe1919d7969a9bfd6083504e563642f07eff.diff",
            "exists": true,
            "files": [
                {
                    "file_additions": 1,
                    "file_deletions": 1,
                    "file_exists": true,
                    "file_name": "src/commands.c",
                    "file_size": 76096
                },
                {
                    "file_additions": 1,
                    "file_deletions": 1,
                    "file_exists": true,
                    "file_name": "src/handlers.c",
                    "file_size": 51996
                },
                {
                    "file_additions": 13,
                    "file_deletions": 10,
                    "file_exists": true,
                    "file_name": "src/output.c",
                    "file_size": 4114
                },
                {
                    "file_additions": 2,
                    "file_deletions": 1,
                    "file_exists": true,
                    "file_name": "src/workspace.c",
                    "file_size": 37454
                }
            ],
            "interesting": {
                "reopen": false,
                "status": false
            },
            "is_parent": false,
            "sha": "922afe1919d7969a9bfd6083504e563642f07eff"
        }
    ],
    "first_commit": "2015-09-14 08:22:43",
    "last_commit": "2015-09-24 20:10:17",
    "number": 1924,
    "pull_request": "None",
    "score": {
        "accidental_reopen_likely": false,
        "all_labels": [
            "4.10",
            "bug",
            "reproducible"
        ],
        "contains_keywords": [
            "work",
            "report",
            "fix",
            "reason",
            "fault",
            "bug",
            "issu",
            "error",
            "debug",
            "chang",
            "problem"
        ],
        "fix_size": 34,
        "has_labels": [
            "bug"
        ],
        "intersecting": {
            "computed_score": 1.0,
            "final_commit_size": 23,
            "intersection_size": 23,
            "previous_commits_size": 34
        },
        "is_makefile_based": false,
        "no_new_files": [],
        "no_other_files": false,
        "num_prohibited_files": 149347,
        "prohibited_files": [
            "kill.h",
            "meminfo.h",
            "kill.h",
            "meminfo.h",
            "kill.h",
            "meminfo.h",
            "testsuite_cli_test.go",
            "testsuite_cli_test.go",
            "common.mk",
            "i3bar/include/draw_util.h"
        ],
        "reopen": true,
        "reopen_events": [
            [
                "2015-09-16 17:02:13",
                "commit"
            ],
            [
                "2015-09-16 17:19:34",
                "closed"
            ],
            [
                "2015-09-17 06:43:34",
                "reopened"
            ],
            [
                "2015-09-17 20:53:05",
                "commit"
            ],
            [
                "2015-09-17 21:06:58",
                "commit"
            ],
            [
                "2015-09-17 21:08:43",
                "commit"
            ],
            [
                "2015-09-24 20:05:58",
                "commit"
            ],
            [
                "2015-09-24 20:11:29",
                "commit"
            ],
            [
                "2015-09-24 20:34:29",
                "closed"
            ]
        ],
        "status": false,
        "strategy": true,
        "total_changes": 157
    }
}