{
    "category": [
        "memory",
        "build/refactor/preprocessing"
    ],
    "commits": [
        {
            "associated_pull_request": [
                "https://github.com/adsr/phpspy/pull/33"
            ],
            "date": "2018-10-28 21:45:39",
            "diff": "adsr_phpspy/issue_35/commit_a10d8f41d826a34c24d52d9522a32c0779603a2a.diff",
            "diff_additions": 42,
            "diff_deletions": 3,
            "diff_file_size": 33678,
            "diff_url": "https://github.com/adsr/phpspy/commit/a10d8f41d826a34c24d52d9522a32c0779603a2a.diff",
            "exists": true,
            "files": [
                {
                    "file_additions": 2,
                    "file_deletions": 2,
                    "file_exists": false,
                    "file_name": "addr_libdw.c",
                    "file_size": 0
                },
                {
                    "file_additions": 40,
                    "file_deletions": 1,
                    "file_exists": true,
                    "file_name": "phpspy.c",
                    "file_size": 33678
                }
            ],
            "interesting": {
                "reopen": false,
                "status": false
            },
            "is_parent": true,
            "sha": "a10d8f41d826a34c24d52d9522a32c0779603a2a"
        },
        {
            "associated_pull_request": [],
            "date": "2018-10-29 21:59:39",
            "diff": "adsr_phpspy/issue_35/commit_004a697a4af31a4795143064d5cd9453b33d3c16.diff",
            "diff_additions": 16,
            "diff_deletions": 14,
            "diff_file_size": 61087,
            "diff_url": "https://github.com/adsr/phpspy/commit/004a697a4af31a4795143064d5cd9453b33d3c16.diff",
            "exists": true,
            "files": [
                {
                    "file_additions": 3,
                    "file_deletions": 2,
                    "file_exists": true,
                    "file_name": "event_fout.c",
                    "file_size": 8087
                },
                {
                    "file_additions": 9,
                    "file_deletions": 10,
                    "file_exists": true,
                    "file_name": "phpspy.c",
                    "file_size": 33678
                },
                {
                    "file_additions": 4,
                    "file_deletions": 2,
                    "file_exists": true,
                    "file_name": "phpspy_trace.c",
                    "file_size": 19322
                }
            ],
            "interesting": {
                "reopen": false,
                "status": true
            },
            "is_parent": false,
            "sha": "004a697a4af31a4795143064d5cd9453b33d3c16"
        },
        {
            "associated_pull_request": [],
            "date": "2018-10-29 21:59:39",
            "diff": "adsr_phpspy/issue_35/commit_2ff7e571c17cf0cff417bf3e63e747d4ab19aee0.diff",
            "diff_additions": 50,
            "diff_deletions": 24,
            "diff_file_size": 61087,
            "diff_url": "https://github.com/adsr/phpspy/commit/2ff7e571c17cf0cff417bf3e63e747d4ab19aee0.diff",
            "exists": true,
            "files": [
                {
                    "file_additions": 3,
                    "file_deletions": 2,
                    "file_exists": true,
                    "file_name": "event_fout.c",
                    "file_size": 8087
                },
                {
                    "file_additions": 33,
                    "file_deletions": 11,
                    "file_exists": true,
                    "file_name": "phpspy.c",
                    "file_size": 33678
                },
                {
                    "file_additions": 14,
                    "file_deletions": 11,
                    "file_exists": true,
                    "file_name": "phpspy_trace.c",
                    "file_size": 19322
                }
            ],
            "interesting": {
                "reopen": false,
                "status": true
            },
            "is_parent": false,
            "sha": "2ff7e571c17cf0cff417bf3e63e747d4ab19aee0"
        },
        {
            "associated_pull_request": [],
            "date": "2018-10-29 21:59:39",
            "diff": "adsr_phpspy/issue_35/commit_033fd48868d99a2656847f627f7c6d2d8fe2ddbf.diff",
            "diff_additions": 50,
            "diff_deletions": 24,
            "diff_file_size": 61087,
            "diff_url": "https://github.com/adsr/phpspy/commit/033fd48868d99a2656847f627f7c6d2d8fe2ddbf.diff",
            "exists": true,
            "files": [
                {
                    "file_additions": 3,
                    "file_deletions": 2,
                    "file_exists": true,
                    "file_name": "event_fout.c",
                    "file_size": 8087
                },
                {
                    "file_additions": 33,
                    "file_deletions": 11,
                    "file_exists": true,
                    "file_name": "phpspy.c",
                    "file_size": 33678
                },
                {
                    "file_additions": 14,
                    "file_deletions": 11,
                    "file_exists": true,
                    "file_name": "phpspy_trace.c",
                    "file_size": 19322
                }
            ],
            "interesting": {
                "reopen": false,
                "status": true
            },
            "is_parent": false,
            "sha": "033fd48868d99a2656847f627f7c6d2d8fe2ddbf"
        },
        {
            "associated_pull_request": [
                "https://github.com/adsr/phpspy/pull/52"
            ],
            "date": "2018-11-21 16:58:20",
            "diff": "adsr_phpspy/issue_35/commit_81618bf02c4c05382215c1e37b6578f3dc6e8e31.diff",
            "diff_additions": 53,
            "diff_deletions": 25,
            "diff_file_size": 61087,
            "diff_url": "https://github.com/adsr/phpspy/commit/81618bf02c4c05382215c1e37b6578f3dc6e8e31.diff",
            "exists": true,
            "files": [
                {
                    "file_additions": 1,
                    "file_deletions": 1,
                    "file_exists": true,
                    "file_name": "event_fout.c",
                    "file_size": 8087
                },
                {
                    "file_additions": 31,
                    "file_deletions": 8,
                    "file_exists": true,
                    "file_name": "phpspy.c",
                    "file_size": 33678
                },
                {
                    "file_additions": 21,
                    "file_deletions": 16,
                    "file_exists": true,
                    "file_name": "phpspy_trace.c",
                    "file_size": 19322
                }
            ],
            "interesting": {
                "reopen": false,
                "status": false
            },
            "is_parent": false,
            "sha": "81618bf02c4c05382215c1e37b6578f3dc6e8e31"
        },
        {
            "associated_pull_request": [
                "https://github.com/adsr/phpspy/pull/52"
            ],
            "date": "2018-11-21 16:58:20",
            "diff": "adsr_phpspy/issue_35/commit_3819a62f8a5ff8565c6e7b2f5131991951d2ac83.diff",
            "diff_additions": 53,
            "diff_deletions": 25,
            "diff_file_size": 61087,
            "diff_url": "https://github.com/adsr/phpspy/commit/3819a62f8a5ff8565c6e7b2f5131991951d2ac83.diff",
            "exists": true,
            "files": [
                {
                    "file_additions": 1,
                    "file_deletions": 1,
                    "file_exists": true,
                    "file_name": "event_fout.c",
                    "file_size": 8087
                },
                {
                    "file_additions": 31,
                    "file_deletions": 8,
                    "file_exists": true,
                    "file_name": "phpspy.c",
                    "file_size": 33678
                },
                {
                    "file_additions": 21,
                    "file_deletions": 16,
                    "file_exists": true,
                    "file_name": "phpspy_trace.c",
                    "file_size": 19322
                }
            ],
            "interesting": {
                "reopen": false,
                "status": false
            },
            "is_parent": false,
            "sha": "3819a62f8a5ff8565c6e7b2f5131991951d2ac83"
        }
    ],
    "first_commit": "2018-10-28 21:45:39",
    "last_commit": "2018-11-21 17:03:44",
    "number": 35,
    "pull_request": "None",
    "score": {
        "accidental_reopen_likely": false,
        "all_labels": [],
        "contains_keywords": [
            "fix"
        ],
        "fix_size": 127,
        "has_labels": [],
        "intersecting": {
            "computed_score": 1.0,
            "final_commit_size": 71,
            "intersection_size": 71,
            "previous_commits_size": 127
        },
        "is_makefile_based": true,
        "no_new_files": [],
        "no_other_files": false,
        "num_prohibited_files": 172801,
        "prohibited_files": [
            "hal/inc/pinmap_hal.h",
            "Debug/marvin.bin",
            "Debug/marvin.elf",
            "Debug/marvin.hex",
            "Debug/marvin.bin",
            "Debug/marvin.elf",
            "Debug/marvin.hex",
            "inc/spark_utilities.h",
            "Debug/marvin.bin",
            "Debug/marvin.elf"
        ],
        "reopen": false,
        "reopen_events": [
            [
                "2018-10-29 22:00:28",
                "commit"
            ],
            [
                "2018-10-29 22:01:06",
                "commit"
            ],
            [
                "2018-10-30 20:47:14",
                "commit"
            ],
            [
                "2018-11-05 14:52:09",
                "commit"
            ],
            [
                "2018-11-05 14:55:32",
                "commit"
            ],
            [
                "2018-11-21 16:58:33",
                "commit"
            ],
            [
                "2018-11-21 17:03:46",
                "commit"
            ],
            [
                "2018-11-21 17:03:51",
                "closed"
            ]
        ],
        "status": true,
        "strategy": true,
        "total_changes": 379
    }
}