{
    "commits": [
        {
            "diff": "spring-projects_spring-boot/issue_12228/commit_1ef0098ab58ee12677da1bf9d42ce03331ca3226.diff",
            "diff_additions": 1030,
            "diff_deletions": 7,
            "diff_file_size": 51440,
            "files": [
                {
                    "file_additions": 2,
                    "file_deletions": 2,
                    "file_exists": false,
                    "file_name": "spring-boot-project/spring-boot-actuator-autoconfigure/src/main/java/org/springframework/boot/actuate/autoconfigure/metrics/web/client/RestTemplateMetricsAutoConfiguration.java",
                    "file_size": 0
                },
                {
                    "file_additions": 72,
                    "file_deletions": 0,
                    "file_exists": false,
                    "file_name": "spring-boot-project/spring-boot-actuator-autoconfigure/src/main/java/org/springframework/boot/actuate/autoconfigure/metrics/web/reactive/WebClientMetricsAutoConfiguration.java",
                    "file_size": 0
                },
                {
                    "file_additions": 2,
                    "file_deletions": 2,
                    "file_exists": true,
                    "file_name": "spring-boot-project/spring-boot-actuator-autoconfigure/src/main/java/org/springframework/boot/actuate/autoconfigure/metrics/web/reactive/WebFluxMetricsAutoConfiguration.java",
                    "file_size": 4184
                },
                {
                    "file_additions": 2,
                    "file_deletions": 0,
                    "file_exists": true,
                    "file_name": "spring-boot-project/spring-boot-actuator-autoconfigure/src/test/java/org/springframework/boot/actuate/autoconfigure/metrics/test/MetricsRun.java",
                    "file_size": 5274
                },
                {
                    "file_additions": 3,
                    "file_deletions": 1,
                    "file_exists": false,
                    "file_name": "spring-boot-project/spring-boot-actuator-autoconfigure/src/test/java/org/springframework/boot/actuate/autoconfigure/metrics/web/client/RestTemplateMetricsAutoConfigurationTests.java",
                    "file_size": 0
                },
                {
                    "file_additions": 124,
                    "file_deletions": 0,
                    "file_exists": false,
                    "file_name": "spring-boot-project/spring-boot-actuator-autoconfigure/src/test/java/org/springframework/boot/actuate/autoconfigure/metrics/web/reactive/WebClientMetricsAutoConfigurationTests.java",
                    "file_size": 0
                },
                {
                    "file_additions": 78,
                    "file_deletions": 0,
                    "file_exists": true,
                    "file_name": "spring-boot-project/spring-boot-actuator-autoconfigure/src/test/java/org/springframework/boot/actuate/autoconfigure/metrics/web/reactive/WebFluxMetricsAutoConfigurationTests.java",
                    "file_size": 6462
                },
                {
                    "file_additions": 50,
                    "file_deletions": 0,
                    "file_exists": true,
                    "file_name": "spring-boot-project/spring-boot-actuator/src/main/java/org/springframework/boot/actuate/metrics/web/reactive/client/DefaultWebClientExchangeTagsProvider.java",
                    "file_size": 1612
                },
                {
                    "file_additions": 57,
                    "file_deletions": 0,
                    "file_exists": true,
                    "file_name": "spring-boot-project/spring-boot-actuator/src/main/java/org/springframework/boot/actuate/metrics/web/reactive/client/MetricsWebClientCustomizer.java",
                    "file_size": 2185
                },
                {
                    "file_additions": 69,
                    "file_deletions": 0,
                    "file_exists": true,
                    "file_name": "spring-boot-project/spring-boot-actuator/src/main/java/org/springframework/boot/actuate/metrics/web/reactive/client/MetricsWebClientFilterFunction.java",
                    "file_size": 4130
                },
                {
                    "file_additions": 107,
                    "file_deletions": 0,
                    "file_exists": true,
                    "file_name": "spring-boot-project/spring-boot-actuator/src/main/java/org/springframework/boot/actuate/metrics/web/reactive/client/WebClientExchangeTags.java",
                    "file_size": 4173
                },
                {
                    "file_additions": 42,
                    "file_deletions": 0,
                    "file_exists": true,
                    "file_name": "spring-boot-project/spring-boot-actuator/src/main/java/org/springframework/boot/actuate/metrics/web/reactive/client/WebClientExchangeTagsProvider.java",
                    "file_size": 1547
                },
                {
                    "file_additions": 21,
                    "file_deletions": 0,
                    "file_exists": true,
                    "file_name": "spring-boot-project/spring-boot-actuator/src/main/java/org/springframework/boot/actuate/metrics/web/reactive/client/package-info.java",
                    "file_size": 804
                },
                {
                    "file_additions": 2,
                    "file_deletions": 2,
                    "file_exists": true,
                    "file_name": "spring-boot-project/spring-boot-actuator/src/main/java/org/springframework/boot/actuate/metrics/web/reactive/server/WebFluxTagsProvider.java",
                    "file_size": 1338
                },
                {
                    "file_additions": 99,
                    "file_deletions": 0,
                    "file_exists": true,
                    "file_name": "spring-boot-project/spring-boot-actuator/src/test/java/org/springframework/boot/actuate/metrics/web/reactive/client/DefaultWebClientExchangeTagsProviderTests.java",
                    "file_size": 4009
                },
                {
                    "file_additions": 67,
                    "file_deletions": 0,
                    "file_exists": true,
                    "file_name": "spring-boot-project/spring-boot-actuator/src/test/java/org/springframework/boot/actuate/metrics/web/reactive/client/MetricsWebClientCustomizerTests.java",
                    "file_size": 2190
                },
                {
                    "file_additions": 119,
                    "file_deletions": 0,
                    "file_exists": true,
                    "file_name": "spring-boot-project/spring-boot-actuator/src/test/java/org/springframework/boot/actuate/metrics/web/reactive/client/MetricsWebClientFilterFunctionTests.java",
                    "file_size": 7403
                },
                {
                    "file_additions": 114,
                    "file_deletions": 0,
                    "file_exists": true,
                    "file_name": "spring-boot-project/spring-boot-actuator/src/test/java/org/springframework/boot/actuate/metrics/web/reactive/client/WebClientExchangeTagsTests.java",
                    "file_size": 6129
                }
            ],
            "interesting": {
                "reopened": false,
                "status": true
            },
            "sha": "1ef0098ab58ee12677da1bf9d42ce03331ca3226"
        },
        {
            "diff": "spring-projects_spring-boot/issue_12228/commit_4347ede2e00dae0ebc879a3c2650a06dafb7e9b7.diff",
            "diff_additions": 20,
            "diff_deletions": 9,
            "diff_file_size": 4130,
            "files": [
                {
                    "file_additions": 20,
                    "file_deletions": 9,
                    "file_exists": true,
                    "file_name": "spring-boot-project/spring-boot-actuator/src/main/java/org/springframework/boot/actuate/metrics/web/reactive/client/MetricsWebClientFilterFunction.java",
                    "file_size": 4130
                }
            ],
            "interesting": {
                "reopened": true,
                "status": false
            },
            "sha": "4347ede2e00dae0ebc879a3c2650a06dafb7e9b7"
        },
        {
            "diff": "spring-projects_spring-boot/issue_12228/commit_bdd95f09a49bf02f4fef3d83815303e7d924f898.diff",
            "diff_additions": 38,
            "diff_deletions": 10,
            "diff_file_size": 11533,
            "files": [
                {
                    "file_additions": 17,
                    "file_deletions": 10,
                    "file_exists": true,
                    "file_name": "spring-boot-project/spring-boot-actuator/src/main/java/org/springframework/boot/actuate/metrics/web/reactive/client/MetricsWebClientFilterFunction.java",
                    "file_size": 4130
                },
                {
                    "file_additions": 21,
                    "file_deletions": 0,
                    "file_exists": true,
                    "file_name": "spring-boot-project/spring-boot-actuator/src/test/java/org/springframework/boot/actuate/metrics/web/reactive/client/MetricsWebClientFilterFunctionTests.java",
                    "file_size": 7403
                }
            ],
            "interesting": {
                "reopened": false,
                "status": true
            },
            "sha": "bdd95f09a49bf02f4fef3d83815303e7d924f898"
        }
    ],
    "first_commit": "2018-04-27 08:20:18",
    "last_commit": "2018-07-05 13:58:34",
    "number": 12228,
    "score": 144.00359066427288
}