{
    "commits": [
        {
            "associated_pull_request": [],
            "date": "2018-04-20 19:29:54+00:00",
            "diff": "igraph_igraph/issue_1094/commit_823ba9db4033c5c51cd364d27951e965f600a231.diff",
            "diff_additions": 2,
            "diff_deletions": 2,
            "diff_file_size": 0,
            "diff_url": "https://github.com/igraph/igraph/commit/823ba9db4033c5c51cd364d27951e965f600a231.diff",
            "exists": true,
            "files": [
                {
                    "file_additions": 2,
                    "file_deletions": 2,
                    "file_exists": false,
                    "file_name": "src/centrality.c",
                    "file_size": 0
                }
            ],
            "interesting": {
                "reopen": false,
                "status": false
            },
            "is_parent": true,
            "sha": "823ba9db4033c5c51cd364d27951e965f600a231"
        },
        {
            "associated_pull_request": [],
            "date": "2018-04-22 13:27:19+00:00",
            "diff": "igraph_igraph/issue_1094/commit_cfbecdedf4355a9794b8782c214f34ce876116e4.diff",
            "diff_additions": 2,
            "diff_deletions": 2,
            "diff_file_size": 0,
            "diff_url": "https://github.com/igraph/igraph/commit/cfbecdedf4355a9794b8782c214f34ce876116e4.diff",
            "exists": true,
            "files": [
                {
                    "file_additions": 2,
                    "file_deletions": 2,
                    "file_exists": false,
                    "file_name": "src/games.c",
                    "file_size": 0
                }
            ],
            "interesting": {
                "reopen": true,
                "status": false
            },
            "is_parent": false,
            "sha": "cfbecdedf4355a9794b8782c214f34ce876116e4"
        },
        {
            "associated_pull_request": [],
            "date": "2018-04-22 19:47:25+00:00",
            "diff": "igraph_igraph/issue_1094/commit_6711eba455db597c682ea9c14e06ed7c43752bc5.diff",
            "diff_additions": 6,
            "diff_deletions": 3,
            "diff_file_size": 0,
            "diff_url": "https://github.com/igraph/igraph/commit/6711eba455db597c682ea9c14e06ed7c43752bc5.diff",
            "exists": true,
            "files": [
                {
                    "file_additions": 6,
                    "file_deletions": 3,
                    "file_exists": false,
                    "file_name": "src/games.c",
                    "file_size": 0
                }
            ],
            "interesting": {
                "reopen": false,
                "status": false
            },
            "is_parent": false,
            "sha": "6711eba455db597c682ea9c14e06ed7c43752bc5"
        }
    ],
    "first_commit": "2018-04-20 19:29:54+00:00",
    "last_commit": "2018-04-22 19:47:25+00:00",
    "number": 1094,
    "pull_request": "None",
    "score": {
        "accidental_reopen_likely": false,
        "all_labels": [],
        "contains_keywords": [
            "fix",
            "issu",
            "error"
        ],
        "fix_size": 9,
        "has_labels": [],
        "intersecting": {
            "computed_score": 0.3333333333333333,
            "final_commit_size": 9,
            "intersection_size": 3,
            "previous_commits_size": 3
        },
        "is_makefile_based": true,
        "no_new_files": [],
        "no_other_files": true,
        "num_prohibited_files": 144015,
        "prohibited_files": [
            "server/src/main/java/com/genymobile/scrcpy/Device.java",
            "server/src/main/java/com/genymobile/scrcpy/wrappers/SurfaceControl.java",
            "server/src/main/java/com/genymobile/scrcpy/Device.java",
            "server/src/main/java/com/genymobile/scrcpy/wrappers/SurfaceControl.java",
            "app/meson.build",
            "app/scrcpy.1",
            "app/src/common.h",
            "app/src/scrcpy.h",
            "app/src/server.h",
            "server/src/main/java/com/genymobile/scrcpy/Workarounds.java"
        ],
        "reopen": true,
        "reopen_events": [
            [
                "2018-04-22 13:27:44+00:00",
                "closed"
            ],
            [
                "2018-04-22 13:27:44+00:00",
                "commit"
            ],
            [
                "2018-04-22 19:46:11+00:00",
                "reopened"
            ],
            [
                "2018-04-22 19:47:33+00:00",
                "commit"
            ],
            [
                "2018-04-22 19:48:12+00:00",
                "closed"
            ]
        ],
        "status": false,
        "strategy": true,
        "total_changes": 17
    }
}