{
    "category": [
        "memory",
        "feature request"
    ],
    "commits": [
        {
            "associated_pull_request": [],
            "date": "2016-02-03 16:55:51",
            "diff": "gpac_gpac/issue_396/commit_57d7793d2202cdaf8f7d9a24fccde6896652c7c3.diff",
            "diff_additions": 1,
            "diff_deletions": 1,
            "diff_file_size": 247972,
            "diff_url": "https://github.com/gpac/gpac/commit/57d7793d2202cdaf8f7d9a24fccde6896652c7c3.diff",
            "exists": true,
            "files": [
                {
                    "file_additions": 1,
                    "file_deletions": 1,
                    "file_exists": true,
                    "file_name": "applications/mp4box/main.c",
                    "file_size": 247972
                }
            ],
            "interesting": {
                "reopen": false,
                "status": true
            },
            "is_parent": true,
            "sha": "57d7793d2202cdaf8f7d9a24fccde6896652c7c3"
        },
        {
            "associated_pull_request": [],
            "date": "2016-02-03 17:21:58",
            "diff": "gpac_gpac/issue_396/commit_847fe0dbc32b24d9225e7dcae3fc3ed1e8c42c86.diff",
            "diff_additions": 15,
            "diff_deletions": 13,
            "diff_file_size": 50768,
            "diff_url": "https://github.com/gpac/gpac/commit/847fe0dbc32b24d9225e7dcae3fc3ed1e8c42c86.diff",
            "exists": true,
            "files": [
                {
                    "file_additions": 15,
                    "file_deletions": 13,
                    "file_exists": true,
                    "file_name": "src/isomedia/iff.c",
                    "file_size": 50768
                }
            ],
            "interesting": {
                "reopen": true,
                "status": true
            },
            "is_parent": false,
            "sha": "847fe0dbc32b24d9225e7dcae3fc3ed1e8c42c86"
        },
        {
            "associated_pull_request": [],
            "date": "2016-02-04 07:48:11",
            "diff": "gpac_gpac/issue_396/commit_ad26ca80d8738e67f49959936bfbc6161ad1140f.diff",
            "diff_additions": 4,
            "diff_deletions": 3,
            "diff_file_size": 50768,
            "diff_url": "https://github.com/gpac/gpac/commit/ad26ca80d8738e67f49959936bfbc6161ad1140f.diff",
            "exists": true,
            "files": [
                {
                    "file_additions": 4,
                    "file_deletions": 3,
                    "file_exists": true,
                    "file_name": "src/isomedia/iff.c",
                    "file_size": 50768
                }
            ],
            "interesting": {
                "reopen": false,
                "status": true
            },
            "is_parent": false,
            "sha": "ad26ca80d8738e67f49959936bfbc6161ad1140f"
        }
    ],
    "first_commit": "2016-02-03 16:55:51",
    "last_commit": "2016-02-04 07:48:11",
    "number": 396,
    "pull_request": "None",
    "score": {
        "accidental_reopen_likely": false,
        "all_labels": [],
        "contains_keywords": [
            "bug",
            "test",
            "fix",
            "patch",
            "work"
        ],
        "fix_size": 22,
        "has_labels": [],
        "intersecting": {
            "computed_score": 1.0,
            "final_commit_size": 6,
            "intersection_size": 6,
            "previous_commits_size": 22
        },
        "is_makefile_based": true,
        "no_new_files": [],
        "no_other_files": false,
        "num_prohibited_files": 53606,
        "prohibited_files": [
            "hal/inc/pinmap_hal.h",
            "Debug/marvin.bin",
            "Debug/marvin.elf",
            "Debug/marvin.hex",
            "Debug/marvin.bin",
            "Debug/marvin.elf",
            "Debug/marvin.hex",
            "inc/spark_utilities.h",
            "Debug/marvin.bin",
            "Debug/marvin.elf"
        ],
        "reopen": true,
        "reopen_events": [
            [
                "2016-02-03 17:22:30",
                "commit"
            ],
            [
                "2016-02-03 18:48:52",
                "closed"
            ],
            [
                "2016-02-03 20:36:29",
                "reopened"
            ],
            [
                "2016-02-04 07:48:18",
                "commit"
            ],
            [
                "2016-02-04 07:48:40",
                "closed"
            ]
        ],
        "status": false,
        "strategy": true,
        "total_changes": 37
    }
}