{
    "commits": [
        {
            "diff": "spring-projects_spring-boot/issue_15455/commit_c01a8d744ca2033b592242b528cb55d6197c8a5f.diff",
            "diff_additions": 264,
            "diff_deletions": 207,
            "diff_file_size": 271971,
            "files": [
                {
                    "file_additions": 2,
                    "file_deletions": 2,
                    "file_exists": true,
                    "file_name": "spring-boot-project/spring-boot-actuator-autoconfigure/src/main/java/org/springframework/boot/actuate/autoconfigure/web/server/OnManagementPortCondition.java",
                    "file_size": 2977
                },
                {
                    "file_additions": 4,
                    "file_deletions": 5,
                    "file_exists": true,
                    "file_name": "spring-boot-project/spring-boot-actuator-autoconfigure/src/main/java/org/springframework/boot/actuate/autoconfigure/web/servlet/CompositeHandlerAdapter.java",
                    "file_size": 2607
                },
                {
                    "file_additions": 81,
                    "file_deletions": 0,
                    "file_exists": true,
                    "file_name": "spring-boot-project/spring-boot-actuator/src/test/java/org/springframework/boot/actuate/cassandra/CassandraHealthIndicatorTests.java",
                    "file_size": 2927
                },
                {
                    "file_additions": 1,
                    "file_deletions": 1,
                    "file_exists": true,
                    "file_name": "spring-boot-project/spring-boot-autoconfigure/src/main/java/org/springframework/boot/autoconfigure/condition/ConditionMessage.java",
                    "file_size": 13324
                },
                {
                    "file_additions": 2,
                    "file_deletions": 2,
                    "file_exists": true,
                    "file_name": "spring-boot-project/spring-boot-autoconfigure/src/main/java/org/springframework/boot/autoconfigure/mustache/MustacheEnvironmentCollector.java",
                    "file_size": 2022
                },
                {
                    "file_additions": 2,
                    "file_deletions": 2,
                    "file_exists": true,
                    "file_name": "spring-boot-project/spring-boot-autoconfigure/src/main/java/org/springframework/boot/autoconfigure/session/SessionAutoConfiguration.java",
                    "file_size": 13621
                },
                {
                    "file_additions": 1,
                    "file_deletions": 2,
                    "file_exists": true,
                    "file_name": "spring-boot-project/spring-boot-autoconfigure/src/main/java/org/springframework/boot/autoconfigure/transaction/jta/JtaAutoConfiguration.java",
                    "file_size": 2056
                },
                {
                    "file_additions": 2,
                    "file_deletions": 7,
                    "file_exists": false,
                    "file_name": "spring-boot-project/spring-boot-autoconfigure/src/test/java/org/springframework/boot/autoconfigure/elasticsearch/rest/RestClientAutoConfigurationTests.java",
                    "file_size": 0
                },
                {
                    "file_additions": 2,
                    "file_deletions": 19,
                    "file_exists": true,
                    "file_name": "spring-boot-project/spring-boot-autoconfigure/src/test/java/org/springframework/boot/autoconfigure/gson/GsonAutoConfigurationTests.java",
                    "file_size": 7790
                },
                {
                    "file_additions": 1,
                    "file_deletions": 1,
                    "file_exists": true,
                    "file_name": "spring-boot-project/spring-boot-autoconfigure/src/test/java/org/springframework/boot/autoconfigure/hateoas/HypermediaAutoConfigurationTests.java",
                    "file_size": 5152
                },
                {
                    "file_additions": 3,
                    "file_deletions": 6,
                    "file_exists": true,
                    "file_name": "spring-boot-project/spring-boot-autoconfigure/src/test/java/org/springframework/boot/autoconfigure/orm/jpa/AbstractJpaAutoConfigurationTests.java",
                    "file_size": 15263
                },
                {
                    "file_additions": 8,
                    "file_deletions": 20,
                    "file_exists": true,
                    "file_name": "spring-boot-project/spring-boot-autoconfigure/src/test/java/org/springframework/boot/autoconfigure/transaction/jta/JtaAutoConfigurationTests.java",
                    "file_size": 7727
                },
                {
                    "file_additions": 15,
                    "file_deletions": 41,
                    "file_exists": true,
                    "file_name": "spring-boot-project/spring-boot-properties-migrator/src/main/java/org/springframework/boot/context/properties/migrator/PropertiesMigrationReport.java",
                    "file_size": 4709
                },
                {
                    "file_additions": 27,
                    "file_deletions": 55,
                    "file_exists": true,
                    "file_name": "spring-boot-project/spring-boot-properties-migrator/src/main/java/org/springframework/boot/context/properties/migrator/PropertiesMigrationReporter.java",
                    "file_size": 5863
                },
                {
                    "file_additions": 77,
                    "file_deletions": 7,
                    "file_exists": true,
                    "file_name": "spring-boot-project/spring-boot-properties-migrator/src/main/java/org/springframework/boot/context/properties/migrator/PropertyMigration.java",
                    "file_size": 4416
                },
                {
                    "file_additions": 13,
                    "file_deletions": 0,
                    "file_exists": true,
                    "file_name": "spring-boot-project/spring-boot-properties-migrator/src/test/java/org/springframework/boot/context/properties/migrator/PropertiesMigrationReporterTests.java",
                    "file_size": 9162
                },
                {
                    "file_additions": 1,
                    "file_deletions": 1,
                    "file_exists": true,
                    "file_name": "spring-boot-project/spring-boot-tools/spring-boot-autoconfigure-processor/src/main/java/org/springframework/boot/autoconfigureprocessor/AutoConfigureAnnotationProcessor.java",
                    "file_size": 10242
                },
                {
                    "file_additions": 1,
                    "file_deletions": 5,
                    "file_exists": true,
                    "file_name": "spring-boot-project/spring-boot-tools/spring-boot-configuration-processor/src/main/java/org/springframework/boot/configurationprocessor/TypeElementMembers.java",
                    "file_size": 7219
                },
                {
                    "file_additions": 1,
                    "file_deletions": 5,
                    "file_exists": true,
                    "file_name": "spring-boot-project/spring-boot-tools/spring-boot-configuration-processor/src/main/java/org/springframework/boot/configurationprocessor/metadata/ConfigurationMetadata.java",
                    "file_size": 6429
                },
                {
                    "file_additions": 2,
                    "file_deletions": 0,
                    "file_exists": true,
                    "file_name": "spring-boot-project/spring-boot-tools/spring-boot-gradle-plugin/src/main/java/org/springframework/boot/gradle/tasks/bundling/BootJar.java",
                    "file_size": 9591
                },
                {
                    "file_additions": 2,
                    "file_deletions": 0,
                    "file_exists": true,
                    "file_name": "spring-boot-project/spring-boot-tools/spring-boot-gradle-plugin/src/main/java/org/springframework/boot/gradle/tasks/bundling/BootWar.java",
                    "file_size": 9077
                },
                {
                    "file_additions": 2,
                    "file_deletions": 2,
                    "file_exists": true,
                    "file_name": "spring-boot-project/spring-boot-tools/spring-boot-loader-tools/src/main/java/org/springframework/boot/loader/tools/Repackager.java",
                    "file_size": 5246
                },
                {
                    "file_additions": 1,
                    "file_deletions": 1,
                    "file_exists": true,
                    "file_name": "spring-boot-project/spring-boot-tools/spring-boot-loader/src/main/java/org/springframework/boot/loader/jar/JarURLConnection.java",
                    "file_size": 10981
                },
                {
                    "file_additions": 1,
                    "file_deletions": 1,
                    "file_exists": true,
                    "file_name": "spring-boot-project/spring-boot/src/main/java/org/springframework/boot/diagnostics/analyzer/NoUniqueBeanDefinitionFailureAnalyzer.java",
                    "file_size": 3714
                },
                {
                    "file_additions": 1,
                    "file_deletions": 1,
                    "file_exists": true,
                    "file_name": "spring-boot-project/spring-boot/src/main/java/org/springframework/boot/logging/logback/LogbackLoggingSystem.java",
                    "file_size": 12378
                },
                {
                    "file_additions": 6,
                    "file_deletions": 10,
                    "file_exists": true,
                    "file_name": "spring-boot-project/spring-boot/src/test/java/org/springframework/boot/SpringApplicationTests.java",
                    "file_size": 67205
                },
                {
                    "file_additions": 1,
                    "file_deletions": 1,
                    "file_exists": true,
                    "file_name": "spring-boot-project/spring-boot/src/test/java/org/springframework/boot/context/properties/source/FilteredConfigurationPropertiesSourceTests.java",
                    "file_size": 4448
                },
                {
                    "file_additions": 2,
                    "file_deletions": 2,
                    "file_exists": true,
                    "file_name": "spring-boot-project/spring-boot/src/test/java/org/springframework/boot/context/properties/source/FilteredIterableConfigurationPropertiesSourceTests.java",
                    "file_size": 2199
                },
                {
                    "file_additions": 2,
                    "file_deletions": 8,
                    "file_exists": true,
                    "file_name": "spring-boot-project/spring-boot/src/test/java/org/springframework/boot/web/servlet/context/ServletWebServerApplicationContextTests.java",
                    "file_size": 23626
                }
            ],
            "interesting": {
                "reopened": false,
                "status": false
            },
            "sha": "c01a8d744ca2033b592242b528cb55d6197c8a5f"
        },
        {
            "diff": "spring-projects_spring-boot/issue_15455/commit_597e29c71e9e716256e3ba6a4f30fd55a67d1fda.diff",
            "diff_additions": 592,
            "diff_deletions": 591,
            "diff_file_size": 18482,
            "files": [
                {
                    "file_additions": 592,
                    "file_deletions": 591,
                    "file_exists": true,
                    "file_name": "spring-boot-project/spring-boot-tools/spring-boot-maven-plugin/src/main/java/org/springframework/boot/maven/AbstractRunMojo.java",
                    "file_size": 18482
                }
            ],
            "interesting": {
                "reopened": false,
                "status": true
            },
            "sha": "597e29c71e9e716256e3ba6a4f30fd55a67d1fda"
        },
        {
            "diff": "spring-projects_spring-boot/issue_15455/commit_51936e1a5cd032c9e622c30ac18ec9b38d5a294e.diff",
            "diff_additions": 20,
            "diff_deletions": 4,
            "diff_file_size": 18482,
            "files": [
                {
                    "file_additions": 20,
                    "file_deletions": 4,
                    "file_exists": true,
                    "file_name": "spring-boot-project/spring-boot-tools/spring-boot-maven-plugin/src/main/java/org/springframework/boot/maven/AbstractRunMojo.java",
                    "file_size": 18482
                }
            ],
            "interesting": {
                "reopened": false,
                "status": false
            },
            "sha": "51936e1a5cd032c9e622c30ac18ec9b38d5a294e"
        }
    ],
    "first_commit": "2018-12-30 09:17:48",
    "last_commit": "2018-12-31 08:50:35",
    "number": 15455,
    "score": 320.0023837902265
}