{
    "commits": [
        {
            "associated_pull_request": [],
            "date": "2018-08-17 15:17:09+00:00",
            "diff": "openzfs_zfs/issue_7835/commit_c197a77c3cf36531e4cf79e524e1ccf7ec00cc4c.diff",
            "diff_additions": 10,
            "diff_deletions": 3,
            "diff_file_size": 197472,
            "diff_url": "https://github.com/openzfs/zfs/commit/c197a77c3cf36531e4cf79e524e1ccf7ec00cc4c.diff",
            "exists": true,
            "files": [
                {
                    "file_additions": 10,
                    "file_deletions": 3,
                    "file_exists": true,
                    "file_name": "module/zfs/metaslab.c",
                    "file_size": 197472
                }
            ],
            "interesting": {
                "reopen": false,
                "status": false
            },
            "is_parent": true,
            "sha": "c197a77c3cf36531e4cf79e524e1ccf7ec00cc4c"
        },
        {
            "associated_pull_request": [
                "https://github.com/openzfs/zfs/pull/7838"
            ],
            "date": "2018-09-05 00:21:24+00:00",
            "diff": "openzfs_zfs/issue_7835/commit_a6214a0ae9e78d3cac0e495e2fcf7af0858a872f.diff",
            "diff_additions": 1,
            "diff_deletions": 1,
            "diff_file_size": 0,
            "diff_url": "https://github.com/openzfs/zfs/commit/a6214a0ae9e78d3cac0e495e2fcf7af0858a872f.diff",
            "exists": true,
            "files": [
                {
                    "file_additions": 1,
                    "file_deletions": 1,
                    "file_exists": false,
                    "file_name": "module/zfs/zfs_ctldir.c",
                    "file_size": 0
                }
            ],
            "interesting": {
                "reopen": true,
                "status": false
            },
            "is_parent": false,
            "sha": "a6214a0ae9e78d3cac0e495e2fcf7af0858a872f"
        },
        {
            "associated_pull_request": [
                "https://github.com/openzfs/zfs/pull/8045"
            ],
            "date": "2018-11-09 00:17:12+00:00",
            "diff": "openzfs_zfs/issue_7835/commit_877d925a9e816337bb62ee61d564118db0181477.diff",
            "diff_additions": 2,
            "diff_deletions": 1,
            "diff_file_size": 0,
            "diff_url": "https://github.com/openzfs/zfs/commit/877d925a9e816337bb62ee61d564118db0181477.diff",
            "exists": true,
            "files": [
                {
                    "file_additions": 2,
                    "file_deletions": 1,
                    "file_exists": false,
                    "file_name": "module/zfs/zfs_ctldir.c",
                    "file_size": 0
                }
            ],
            "interesting": {
                "reopen": false,
                "status": false
            },
            "is_parent": false,
            "sha": "877d925a9e816337bb62ee61d564118db0181477"
        },
        {
            "associated_pull_request": [],
            "date": "2018-11-09 00:17:12+00:00",
            "diff": "openzfs_zfs/issue_7835/commit_cac605369ccd937b06da5bca44b9e860117b5e69.diff",
            "diff_additions": 2,
            "diff_deletions": 1,
            "diff_file_size": 0,
            "diff_url": "https://github.com/openzfs/zfs/commit/cac605369ccd937b06da5bca44b9e860117b5e69.diff",
            "exists": true,
            "files": [
                {
                    "file_additions": 2,
                    "file_deletions": 1,
                    "file_exists": false,
                    "file_name": "module/zfs/zfs_ctldir.c",
                    "file_size": 0
                }
            ],
            "interesting": {
                "reopen": false,
                "status": false
            },
            "is_parent": false,
            "sha": "cac605369ccd937b06da5bca44b9e860117b5e69"
        }
    ],
    "first_commit": "2018-09-02 19:22:45+00:00",
    "last_commit": "2019-01-07 15:43:58+00:00",
    "number": 7835,
    "pull_request": "None",
    "score": {
        "accidental_reopen_likely": false,
        "all_labels": [
            "Type: Documentation"
        ],
        "contains_keywords": [
            "fail",
            "chang",
            "issu",
            "perform",
            "test",
            "fault",
            "remov",
            "problem"
        ],
        "fix_size": 4,
        "has_labels": [],
        "intersecting": {
            "computed_score": 1.0,
            "final_commit_size": 4,
            "intersection_size": 4,
            "previous_commits_size": 4
        },
        "is_makefile_based": true,
        "no_new_files": [],
        "no_other_files": false,
        "num_prohibited_files": 34087,
        "prohibited_files": [
            "server/src/main/java/com/genymobile/scrcpy/Device.java",
            "server/src/main/java/com/genymobile/scrcpy/wrappers/SurfaceControl.java",
            "server/src/main/java/com/genymobile/scrcpy/Device.java",
            "server/src/main/java/com/genymobile/scrcpy/wrappers/SurfaceControl.java",
            "app/meson.build",
            "app/scrcpy.1",
            "app/src/common.h",
            "app/src/scrcpy.h",
            "app/src/server.h",
            "server/src/main/java/com/genymobile/scrcpy/Workarounds.java"
        ],
        "reopen": true,
        "reopen_events": [
            [
                "2018-09-05 00:21:37+00:00",
                "closed"
            ],
            [
                "2018-09-05 00:21:37+00:00",
                "commit"
            ],
            [
                "2018-09-10 11:04:26+00:00",
                "reopened"
            ],
            [
                "2018-11-09 00:17:24+00:00",
                "closed"
            ],
            [
                "2018-11-09 00:17:24+00:00",
                "commit"
            ],
            [
                "2019-01-07 15:45:28+00:00",
                "commit"
            ]
        ],
        "status": false,
        "strategy": true,
        "total_changes": 21
    }
}