{
    "commits": [
        {
            "associated_pull_request": [],
            "date": "2015-01-04 15:15:53+00:00",
            "diff": "openwall_john/issue_1000/commit_736c18daa963734fdd9c4d42a3b95b9632cb2680.diff",
            "diff_additions": 2,
            "diff_deletions": 2,
            "diff_file_size": 5687,
            "diff_url": "https://github.com/openwall/john/commit/736c18daa963734fdd9c4d42a3b95b9632cb2680.diff",
            "exists": true,
            "files": [
                {
                    "file_additions": 2,
                    "file_deletions": 2,
                    "file_exists": true,
                    "file_name": "src/BFEgg_fmt_plug.c",
                    "file_size": 5687
                }
            ],
            "interesting": {
                "reopen": false,
                "status": false
            },
            "is_parent": true,
            "sha": "736c18daa963734fdd9c4d42a3b95b9632cb2680"
        },
        {
            "associated_pull_request": [],
            "date": "2015-01-05 11:46:25+00:00",
            "diff": "openwall_john/issue_1000/commit_3dcef362aa1c16e1456549133027a78227ad0c32.diff",
            "diff_additions": 7,
            "diff_deletions": 0,
            "diff_file_size": 77686,
            "diff_url": "https://github.com/openwall/john/commit/3dcef362aa1c16e1456549133027a78227ad0c32.diff",
            "exists": true,
            "files": [
                {
                    "file_additions": 3,
                    "file_deletions": 0,
                    "file_exists": true,
                    "file_name": "src/unrar.c",
                    "file_size": 38881
                },
                {
                    "file_additions": 4,
                    "file_deletions": 0,
                    "file_exists": true,
                    "file_name": "src/unrarvm.c",
                    "file_size": 38805
                }
            ],
            "interesting": {
                "reopen": true,
                "status": false
            },
            "is_parent": false,
            "sha": "3dcef362aa1c16e1456549133027a78227ad0c32"
        },
        {
            "associated_pull_request": [],
            "date": "2015-01-05 13:07:15+00:00",
            "diff": "openwall_john/issue_1000/commit_2383c3012769b05ac63f66973cbabc002d67f87d.diff",
            "diff_additions": 3,
            "diff_deletions": 1,
            "diff_file_size": 38881,
            "diff_url": "https://github.com/openwall/john/commit/2383c3012769b05ac63f66973cbabc002d67f87d.diff",
            "exists": true,
            "files": [
                {
                    "file_additions": 3,
                    "file_deletions": 1,
                    "file_exists": true,
                    "file_name": "src/unrar.c",
                    "file_size": 38881
                }
            ],
            "interesting": {
                "reopen": false,
                "status": false
            },
            "is_parent": false,
            "sha": "2383c3012769b05ac63f66973cbabc002d67f87d"
        },
        {
            "associated_pull_request": [],
            "date": "2015-01-05 19:52:09+00:00",
            "diff": "openwall_john/issue_1000/commit_166f6ce057ac2706a5af799ee584809804d022f0.diff",
            "diff_additions": 7,
            "diff_deletions": 3,
            "diff_file_size": 38881,
            "diff_url": "https://github.com/openwall/john/commit/166f6ce057ac2706a5af799ee584809804d022f0.diff",
            "exists": true,
            "files": [
                {
                    "file_additions": 7,
                    "file_deletions": 3,
                    "file_exists": true,
                    "file_name": "src/unrar.c",
                    "file_size": 38881
                }
            ],
            "interesting": {
                "reopen": false,
                "status": false
            },
            "is_parent": false,
            "sha": "166f6ce057ac2706a5af799ee584809804d022f0"
        },
        {
            "associated_pull_request": [],
            "date": "2015-01-06 17:58:32+00:00",
            "diff": "openwall_john/issue_1000/commit_aa9589edf0f23be071c8d49bc6c0e5aa1e8bd179.diff",
            "diff_additions": 6,
            "diff_deletions": 2,
            "diff_file_size": 77686,
            "diff_url": "https://github.com/openwall/john/commit/aa9589edf0f23be071c8d49bc6c0e5aa1e8bd179.diff",
            "exists": true,
            "files": [
                {
                    "file_additions": 2,
                    "file_deletions": 2,
                    "file_exists": true,
                    "file_name": "src/unrar.c",
                    "file_size": 38881
                },
                {
                    "file_additions": 4,
                    "file_deletions": 0,
                    "file_exists": true,
                    "file_name": "src/unrarvm.c",
                    "file_size": 38805
                }
            ],
            "interesting": {
                "reopen": false,
                "status": false
            },
            "is_parent": false,
            "sha": "aa9589edf0f23be071c8d49bc6c0e5aa1e8bd179"
        }
    ],
    "first_commit": "2015-01-04 15:15:53+00:00",
    "last_commit": "2015-01-06 17:58:32+00:00",
    "number": 1000,
    "pull_request": "None",
    "score": {
        "accidental_reopen_likely": false,
        "all_labels": [
            "bug"
        ],
        "contains_keywords": [
            "chang",
            "fix",
            "issu",
            "error",
            "problem",
            "crash"
        ],
        "fix_size": 23,
        "has_labels": [
            "bug"
        ],
        "intersecting": {
            "computed_score": 0.5,
            "final_commit_size": 8,
            "intersection_size": 4,
            "previous_commits_size": 19
        },
        "is_makefile_based": false,
        "no_new_files": [],
        "no_other_files": true,
        "num_prohibited_files": 68445,
        "prohibited_files": [
            "server/src/main/java/com/genymobile/scrcpy/Device.java",
            "server/src/main/java/com/genymobile/scrcpy/wrappers/SurfaceControl.java",
            "server/src/main/java/com/genymobile/scrcpy/Device.java",
            "server/src/main/java/com/genymobile/scrcpy/wrappers/SurfaceControl.java",
            "app/meson.build",
            "app/scrcpy.1",
            "app/src/common.h",
            "app/src/scrcpy.h",
            "app/src/server.h",
            "server/src/main/java/com/genymobile/scrcpy/Workarounds.java"
        ],
        "reopen": true,
        "reopen_events": [
            [
                "2015-01-05 12:51:31+00:00",
                "closed"
            ],
            [
                "2015-01-05 12:51:31+00:00",
                "commit"
            ],
            [
                "2015-01-05 12:52:04+00:00",
                "reopened"
            ],
            [
                "2015-01-05 13:07:21+00:00",
                "closed"
            ],
            [
                "2015-01-05 13:07:21+00:00",
                "commit"
            ],
            [
                "2015-01-05 19:52:52+00:00",
                "commit"
            ],
            [
                "2015-01-06 17:58:35+00:00",
                "commit"
            ]
        ],
        "status": false,
        "strategy": true,
        "total_changes": 33
    }
}