{
    "commits": [
        {
            "associated_pull_request": [],
            "date": "2020-10-02 09:19:23+00:00",
            "diff": "",
            "diff_additions": 0,
            "diff_deletions": 0,
            "diff_file_size": 0,
            "diff_url": "https://github.com/digital-fabric/polyphony/commit/25ef1f286e88c13ec2f6608979b9e48892305edb.diff",
            "exists": true,
            "files": [],
            "interesting": {
                "reopen": false,
                "status": false
            },
            "is_parent": true,
            "sha": "25ef1f286e88c13ec2f6608979b9e48892305edb"
        },
        {
            "associated_pull_request": [],
            "date": "2020-10-04 17:31:25+00:00",
            "diff": "digital-fabric_polyphony/issue_43/commit_4f093e8303ebe28851af4289a05cc25b14cc1b29.diff",
            "diff_additions": 5,
            "diff_deletions": 7,
            "diff_file_size": 29543,
            "diff_url": "https://github.com/digital-fabric/polyphony/commit/4f093e8303ebe28851af4289a05cc25b14cc1b29.diff",
            "exists": true,
            "files": [
                {
                    "file_additions": 0,
                    "file_deletions": 2,
                    "file_exists": true,
                    "file_name": "ext/polyphony/fiber.c",
                    "file_size": 7461
                },
                {
                    "file_additions": 4,
                    "file_deletions": 2,
                    "file_exists": true,
                    "file_name": "ext/polyphony/polyphony.c",
                    "file_size": 17089
                },
                {
                    "file_additions": 1,
                    "file_deletions": 3,
                    "file_exists": true,
                    "file_name": "ext/polyphony/thread.c",
                    "file_size": 4993
                }
            ],
            "interesting": {
                "reopen": false,
                "status": false
            },
            "is_parent": false,
            "sha": "4f093e8303ebe28851af4289a05cc25b14cc1b29"
        },
        {
            "associated_pull_request": [],
            "date": "2020-11-04 06:29:59+00:00",
            "diff": "digital-fabric_polyphony/issue_43/commit_c7408666f3ecec021592591b95ea5c597112976e.diff",
            "diff_additions": 0,
            "diff_deletions": 2,
            "diff_file_size": 4993,
            "diff_url": "https://github.com/digital-fabric/polyphony/commit/c7408666f3ecec021592591b95ea5c597112976e.diff",
            "exists": true,
            "files": [
                {
                    "file_additions": 0,
                    "file_deletions": 2,
                    "file_exists": true,
                    "file_name": "ext/polyphony/thread.c",
                    "file_size": 4993
                }
            ],
            "interesting": {
                "reopen": true,
                "status": false
            },
            "is_parent": false,
            "sha": "c7408666f3ecec021592591b95ea5c597112976e"
        },
        {
            "associated_pull_request": [],
            "date": "2021-05-10 15:19:26+00:00",
            "diff": "digital-fabric_polyphony/issue_43/commit_24d67efbf1aea8583e46943ef5c554acbe2c680c.diff",
            "diff_additions": 3,
            "diff_deletions": 3,
            "diff_file_size": 46860,
            "diff_url": "https://github.com/digital-fabric/polyphony/commit/24d67efbf1aea8583e46943ef5c554acbe2c680c.diff",
            "exists": true,
            "files": [
                {
                    "file_additions": 3,
                    "file_deletions": 3,
                    "file_exists": true,
                    "file_name": "ext/polyphony/backend_libev.c",
                    "file_size": 46860
                }
            ],
            "interesting": {
                "reopen": false,
                "status": false
            },
            "is_parent": false,
            "sha": "24d67efbf1aea8583e46943ef5c554acbe2c680c"
        }
    ],
    "first_commit": "2020-10-02 09:20:36+00:00",
    "last_commit": "2021-05-10 15:19:26+00:00",
    "number": 43,
    "pull_request": "None",
    "score": {
        "accidental_reopen_likely": true,
        "all_labels": [],
        "contains_keywords": [
            "work",
            "fail",
            "fix",
            "issu",
            "test",
            "error",
            "problem",
            "report"
        ],
        "fix_size": 18,
        "has_labels": [],
        "intersecting": {
            "computed_score": 0.0,
            "final_commit_size": 4,
            "intersection_size": 0,
            "previous_commits_size": 14
        },
        "is_makefile_based": false,
        "no_new_files": [
            "ext/polyphony/backend_libev.c"
        ],
        "no_other_files": false,
        "num_prohibited_files": 189199,
        "prohibited_files": [
            "server/src/main/java/com/genymobile/scrcpy/Device.java",
            "server/src/main/java/com/genymobile/scrcpy/wrappers/SurfaceControl.java",
            "server/src/main/java/com/genymobile/scrcpy/Device.java",
            "server/src/main/java/com/genymobile/scrcpy/wrappers/SurfaceControl.java",
            "app/meson.build",
            "app/scrcpy.1",
            "app/src/common.h",
            "app/src/scrcpy.h",
            "app/src/server.h",
            "server/src/main/java/com/genymobile/scrcpy/Workarounds.java"
        ],
        "reopen": true,
        "reopen_events": [
            [
                "2020-10-04 17:36:49+00:00",
                "commit"
            ],
            [
                "2020-10-05 17:28:55+00:00",
                "closed"
            ],
            [
                "2020-11-04 06:37:36+00:00",
                "commit"
            ],
            [
                "2021-05-10 15:13:31+00:00",
                "reopened"
            ],
            [
                "2021-05-10 15:16:43+00:00",
                "closed"
            ],
            [
                "2021-05-10 15:19:58+00:00",
                "commit"
            ]
        ],
        "status": false,
        "strategy": true,
        "total_changes": 20
    }
}