{
    "category": [
        "hardware/OS",
        "control flow"
    ],
    "commits": [
        {
            "associated_pull_request": [
                "https://github.com/AOMediaCodec/SVT-AV1/pull/769"
            ],
            "date": "2019-10-30 00:27:08",
            "diff": "aomediacodec_svt-av1/issue_852/commit_29a081919866142203f14c3eb0692b32eca7006d.diff",
            "diff_additions": 105,
            "diff_deletions": 208,
            "diff_file_size": 103064,
            "diff_url": "https://github.com/AOMediaCodec/SVT-AV1/commit/29a081919866142203f14c3eb0692b32eca7006d.diff",
            "exists": true,
            "files": [
                {
                    "file_additions": 105,
                    "file_deletions": 208,
                    "file_exists": true,
                    "file_name": "Source/Lib/Common/Codec/EbInterPrediction.c",
                    "file_size": 103064
                }
            ],
            "interesting": {
                "reopen": false,
                "status": false
            },
            "is_parent": true,
            "sha": "29a081919866142203f14c3eb0692b32eca7006d"
        },
        {
            "associated_pull_request": [],
            "date": "2019-12-06 02:25:34",
            "diff": "aomediacodec_svt-av1/issue_852/commit_f0b03f7cca7dcbd7a09286afd3e241edf9ed19ad.diff",
            "diff_additions": 1,
            "diff_deletions": 0,
            "diff_file_size": 0,
            "diff_url": "https://github.com/AOMediaCodec/SVT-AV1/commit/f0b03f7cca7dcbd7a09286afd3e241edf9ed19ad.diff",
            "exists": true,
            "files": [
                {
                    "file_additions": 1,
                    "file_deletions": 0,
                    "file_exists": false,
                    "file_name": "Source/Lib/Common/Codec/EbModeDecisionProcess.c",
                    "file_size": 0
                }
            ],
            "interesting": {
                "reopen": false,
                "status": true
            },
            "is_parent": false,
            "sha": "f0b03f7cca7dcbd7a09286afd3e241edf9ed19ad"
        },
        {
            "associated_pull_request": [
                "https://github.com/AOMediaCodec/SVT-AV1/pull/863"
            ],
            "date": "2019-12-10 02:12:33",
            "diff": "aomediacodec_svt-av1/issue_852/commit_3e04a662ce43cd6e25c3e16818abcf45cd54af68.diff",
            "diff_additions": 1,
            "diff_deletions": 0,
            "diff_file_size": 0,
            "diff_url": "https://github.com/AOMediaCodec/SVT-AV1/commit/3e04a662ce43cd6e25c3e16818abcf45cd54af68.diff",
            "exists": true,
            "files": [
                {
                    "file_additions": 1,
                    "file_deletions": 0,
                    "file_exists": false,
                    "file_name": "Source/Lib/Common/Codec/EbModeDecisionProcess.c",
                    "file_size": 0
                }
            ],
            "interesting": {
                "reopen": false,
                "status": false
            },
            "is_parent": false,
            "sha": "3e04a662ce43cd6e25c3e16818abcf45cd54af68"
        },
        {
            "associated_pull_request": [
                "https://github.com/AOMediaCodec/SVT-AV1/pull/863"
            ],
            "date": "2019-12-10 02:12:33",
            "diff": "aomediacodec_svt-av1/issue_852/commit_bd05c08ddf3cb2e28ca27f21caad2092b94f8960.diff",
            "diff_additions": 1,
            "diff_deletions": 0,
            "diff_file_size": 0,
            "diff_url": "https://github.com/AOMediaCodec/SVT-AV1/commit/bd05c08ddf3cb2e28ca27f21caad2092b94f8960.diff",
            "exists": true,
            "files": [
                {
                    "file_additions": 1,
                    "file_deletions": 0,
                    "file_exists": false,
                    "file_name": "Source/Lib/Common/Codec/EbModeDecisionProcess.c",
                    "file_size": 0
                }
            ],
            "interesting": {
                "reopen": false,
                "status": false
            },
            "is_parent": false,
            "sha": "bd05c08ddf3cb2e28ca27f21caad2092b94f8960"
        }
    ],
    "first_commit": "2019-11-09 01:38:05",
    "last_commit": "2019-12-10 07:12:36",
    "number": 852,
    "pull_request": "None",
    "score": {
        "accidental_reopen_likely": false,
        "all_labels": [],
        "contains_keywords": [
            "work",
            "report",
            "fix",
            "patch",
            "bug",
            "test",
            "issu",
            "error",
            "debug",
            "fail"
        ],
        "fix_size": 3,
        "has_labels": [],
        "intersecting": {
            "computed_score": 1.0,
            "final_commit_size": 2,
            "intersection_size": 2,
            "previous_commits_size": 3
        },
        "is_makefile_based": true,
        "no_new_files": [],
        "no_other_files": true,
        "num_prohibited_files": 93680,
        "prohibited_files": [
            "kill.h",
            "meminfo.h",
            "kill.h",
            "meminfo.h",
            "kill.h",
            "meminfo.h",
            "testsuite_cli_test.go",
            "testsuite_cli_test.go",
            "common.mk",
            "i3bar/include/draw_util.h"
        ],
        "reopen": false,
        "reopen_events": [
            [
                "2019-12-06 02:25:51",
                "commit"
            ],
            [
                "2019-12-10 02:13:57",
                "commit"
            ],
            [
                "2019-12-10 07:12:38",
                "commit"
            ],
            [
                "2019-12-11 04:01:08",
                "closed"
            ]
        ],
        "status": true,
        "strategy": true,
        "total_changes": 316
    }
}