{
    "commits": [
        {
            "associated_pull_request": [
                "https://github.com/bitcraze/crazyflie-firmware/pull/794"
            ],
            "date": "2021-06-15 09:01:42+00:00",
            "diff": "",
            "diff_additions": 0,
            "diff_deletions": 0,
            "diff_file_size": 0,
            "diff_url": "https://github.com/bitcraze/crazyflie-firmware/commit/a7e0aae54b23574effeebe065b8720b93f108e76.diff",
            "exists": true,
            "files": [],
            "interesting": {
                "reopen": false,
                "status": false
            },
            "is_parent": true,
            "sha": "a7e0aae54b23574effeebe065b8720b93f108e76"
        },
        {
            "associated_pull_request": [
                "https://github.com/bitcraze/crazyflie-firmware/pull/800"
            ],
            "date": "2021-06-22 04:23:39+00:00",
            "diff": "bitcraze_crazyflie-firmware/issue_798/commit_68ec0321592cea15514c38c8e11da88449e97263.diff",
            "diff_additions": 3,
            "diff_deletions": 3,
            "diff_file_size": 27779,
            "diff_url": "https://github.com/bitcraze/crazyflie-firmware/commit/68ec0321592cea15514c38c8e11da88449e97263.diff",
            "exists": true,
            "files": [
                {
                    "file_additions": 3,
                    "file_deletions": 3,
                    "file_exists": true,
                    "file_name": "src/modules/src/log.c",
                    "file_size": 27779
                }
            ],
            "interesting": {
                "reopen": true,
                "status": false
            },
            "is_parent": false,
            "sha": "68ec0321592cea15514c38c8e11da88449e97263"
        },
        {
            "associated_pull_request": [
                "https://github.com/bitcraze/crazyflie-firmware/pull/800"
            ],
            "date": "2021-07-01 06:59:55+00:00",
            "diff": "bitcraze_crazyflie-firmware/issue_798/commit_a096b497907ee0688bea24fb7f3be74bbb9c2ef6.diff",
            "diff_additions": 17,
            "diff_deletions": 17,
            "diff_file_size": 27779,
            "diff_url": "https://github.com/bitcraze/crazyflie-firmware/commit/a096b497907ee0688bea24fb7f3be74bbb9c2ef6.diff",
            "exists": true,
            "files": [
                {
                    "file_additions": 17,
                    "file_deletions": 17,
                    "file_exists": true,
                    "file_name": "src/modules/src/log.c",
                    "file_size": 27779
                }
            ],
            "interesting": {
                "reopen": false,
                "status": false
            },
            "is_parent": false,
            "sha": "a096b497907ee0688bea24fb7f3be74bbb9c2ef6"
        }
    ],
    "first_commit": "2021-06-15 09:01:42+00:00",
    "last_commit": "2021-07-01 06:59:55+00:00",
    "number": 798,
    "pull_request": "None",
    "score": {
        "accidental_reopen_likely": false,
        "all_labels": [],
        "contains_keywords": [
            "chang",
            "fix",
            "issu",
            "test",
            "bug",
            "problem"
        ],
        "fix_size": 18,
        "has_labels": [],
        "intersecting": {
            "computed_score": 0.2222222222222222,
            "final_commit_size": 18,
            "intersection_size": 4,
            "previous_commits_size": 4
        },
        "is_makefile_based": true,
        "no_new_files": [],
        "no_other_files": true,
        "num_prohibited_files": 111004,
        "prohibited_files": [
            "server/src/main/java/com/genymobile/scrcpy/Device.java",
            "server/src/main/java/com/genymobile/scrcpy/wrappers/SurfaceControl.java",
            "server/src/main/java/com/genymobile/scrcpy/Device.java",
            "server/src/main/java/com/genymobile/scrcpy/wrappers/SurfaceControl.java",
            "app/meson.build",
            "app/scrcpy.1",
            "app/src/common.h",
            "app/src/scrcpy.h",
            "app/src/server.h",
            "server/src/main/java/com/genymobile/scrcpy/Workarounds.java"
        ],
        "reopen": true,
        "reopen_events": [
            [
                "2021-06-22 04:25:18+00:00",
                "commit"
            ],
            [
                "2021-06-22 06:06:16+00:00",
                "closed"
            ],
            [
                "2021-06-22 06:06:44+00:00",
                "reopened"
            ],
            [
                "2021-07-01 06:59:56+00:00",
                "closed"
            ],
            [
                "2021-07-01 06:59:58+00:00",
                "commit"
            ]
        ],
        "status": false,
        "strategy": true,
        "total_changes": 40
    }
}