{
    "covered_issues": [
        372,
        371,
        369,
        366,
        364,
        363,
        362,
        361,
        360,
        354,
        353,
        351,
        349,
        348,
        346,
        340,
        334,
        332,
        331,
        329,
        326,
        324,
        322,
        321,
        320,
        318,
        317,
        313,
        312,
        310,
        309,
        308,
        301,
        293,
        292,
        291,
        290,
        289,
        287,
        286,
        285,
        284,
        281,
        276,
        274,
        273,
        272,
        271,
        270,
        269,
        264,
        254,
        253,
        252,
        251,
        250,
        245,
        242,
        241,
        240,
        239,
        238,
        235,
        233,
        231,
        226,
        222,
        221,
        216,
        214,
        213,
        205,
        204,
        203,
        202,
        200,
        193,
        192,
        190,
        189,
        186,
        183,
        180,
        179,
        178,
        177,
        172,
        169,
        166,
        165,
        164,
        163,
        160,
        159,
        158,
        157,
        155,
        154,
        153,
        152,
        150,
        149,
        148,
        147,
        146,
        145,
        144,
        137,
        134,
        133,
        132,
        130,
        129,
        128,
        122,
        121,
        120,
        119,
        118,
        114,
        113,
        112,
        111,
        104,
        103,
        100,
        97,
        93,
        90,
        88,
        85,
        83,
        80,
        77,
        75,
        74,
        72,
        71,
        68,
        67,
        61,
        60,
        59,
        54,
        47,
        46,
        44,
        32,
        29,
        28,
        27,
        26
    ],
    "finished": true
}