{
    "category": [
        "memory",
        "network/protocol"
    ],
    "commits": [
        {
            "associated_pull_request": [],
            "date": "2017-07-06 12:53:47",
            "diff": "imagemagick_imagemagick/issue_541/commit_94a7b680a9148b92ac5e4045fff21c7cd543bae0.diff",
            "diff_additions": 1,
            "diff_deletions": 1,
            "diff_file_size": 57301,
            "diff_url": "https://github.com/ImageMagick/ImageMagick/commit/94a7b680a9148b92ac5e4045fff21c7cd543bae0.diff",
            "exists": true,
            "files": [
                {
                    "file_additions": 1,
                    "file_deletions": 1,
                    "file_exists": true,
                    "file_name": "coders/mpc.c",
                    "file_size": 57301
                }
            ],
            "interesting": {
                "reopen": false,
                "status": false
            },
            "is_parent": true,
            "sha": "94a7b680a9148b92ac5e4045fff21c7cd543bae0"
        },
        {
            "associated_pull_request": [],
            "date": "2017-07-06 16:18:24",
            "diff": "imagemagick_imagemagick/issue_541/commit_280e5924d3c97c916819fbfb4f7c5027dcbc20f8.diff",
            "diff_additions": 4,
            "diff_deletions": 3,
            "diff_file_size": 456114,
            "diff_url": "https://github.com/ImageMagick/ImageMagick/commit/280e5924d3c97c916819fbfb4f7c5027dcbc20f8.diff",
            "exists": true,
            "files": [
                {
                    "file_additions": 4,
                    "file_deletions": 3,
                    "file_exists": true,
                    "file_name": "coders/png.c",
                    "file_size": 456114
                }
            ],
            "interesting": {
                "reopen": false,
                "status": true
            },
            "is_parent": false,
            "sha": "280e5924d3c97c916819fbfb4f7c5027dcbc20f8"
        },
        {
            "associated_pull_request": [],
            "date": "2017-07-06 16:20:03",
            "diff": "imagemagick_imagemagick/issue_541/commit_7a9a910c34d1da41883719613b8f1b6cacb8277d.diff",
            "diff_additions": 4,
            "diff_deletions": 2,
            "diff_file_size": 456114,
            "diff_url": "https://github.com/ImageMagick/ImageMagick/commit/7a9a910c34d1da41883719613b8f1b6cacb8277d.diff",
            "exists": true,
            "files": [
                {
                    "file_additions": 4,
                    "file_deletions": 2,
                    "file_exists": true,
                    "file_name": "coders/png.c",
                    "file_size": 456114
                }
            ],
            "interesting": {
                "reopen": false,
                "status": false
            },
            "is_parent": false,
            "sha": "7a9a910c34d1da41883719613b8f1b6cacb8277d"
        },
        {
            "associated_pull_request": [],
            "date": "2017-07-10 12:49:19",
            "diff": "imagemagick_imagemagick/issue_541/commit_6a4f9c1feb7153807f22435ac6853956a1648707.diff",
            "diff_additions": 4,
            "diff_deletions": 4,
            "diff_file_size": 456114,
            "diff_url": "https://github.com/ImageMagick/ImageMagick/commit/6a4f9c1feb7153807f22435ac6853956a1648707.diff",
            "exists": true,
            "files": [
                {
                    "file_additions": 4,
                    "file_deletions": 4,
                    "file_exists": true,
                    "file_name": "coders/png.c",
                    "file_size": 456114
                }
            ],
            "interesting": {
                "reopen": false,
                "status": false
            },
            "is_parent": false,
            "sha": "6a4f9c1feb7153807f22435ac6853956a1648707"
        }
    ],
    "first_commit": "2017-07-06 12:53:47",
    "last_commit": "2017-07-10 12:49:19",
    "number": 541,
    "pull_request": "None",
    "score": {
        "accidental_reopen_likely": false,
        "all_labels": [
            "bug"
        ],
        "contains_keywords": [
            "report",
            "problem",
            "fix",
            "patch",
            "issu"
        ],
        "fix_size": 15,
        "has_labels": [
            "bug"
        ],
        "intersecting": {
            "computed_score": 0.2,
            "final_commit_size": 5,
            "intersection_size": 1,
            "previous_commits_size": 11
        },
        "is_makefile_based": true,
        "no_new_files": [],
        "no_other_files": true,
        "num_prohibited_files": 57880,
        "prohibited_files": [
            "hal/inc/pinmap_hal.h",
            "Debug/marvin.bin",
            "Debug/marvin.elf",
            "Debug/marvin.hex",
            "Debug/marvin.bin",
            "Debug/marvin.elf",
            "Debug/marvin.hex",
            "inc/spark_utilities.h",
            "Debug/marvin.bin",
            "Debug/marvin.elf"
        ],
        "reopen": false,
        "reopen_events": [
            [
                "2017-07-06 16:31:30",
                "commit"
            ],
            [
                "2017-07-06 16:31:36",
                "commit"
            ],
            [
                "2017-07-06 17:36:45",
                "closed"
            ],
            [
                "2017-07-10 13:01:54",
                "commit"
            ]
        ],
        "status": true,
        "strategy": true,
        "total_changes": 23
    }
}