{
    "commits": [
        {
            "associated_pull_request": [],
            "date": "2020-03-10 09:35:08+00:00",
            "diff": "gluster_glusterfs/issue_832/commit_2668e9f1892dbe898e41e3a14701258d78cb8f46.diff",
            "diff_additions": 3,
            "diff_deletions": 3,
            "diff_file_size": 309629,
            "diff_url": "https://github.com/gluster/glusterfs/commit/2668e9f1892dbe898e41e3a14701258d78cb8f46.diff",
            "exists": true,
            "files": [
                {
                    "file_additions": 3,
                    "file_deletions": 3,
                    "file_exists": true,
                    "file_name": "cli/src/cli-rpc-ops.c",
                    "file_size": 309629
                }
            ],
            "interesting": {
                "reopen": false,
                "status": false
            },
            "is_parent": true,
            "sha": "2668e9f1892dbe898e41e3a14701258d78cb8f46"
        },
        {
            "associated_pull_request": [],
            "date": "2020-03-03 19:16:08+00:00",
            "diff": "gluster_glusterfs/issue_832/commit_eb916c057036db8289b41265797e5dce066d1512.diff",
            "diff_additions": 10,
            "diff_deletions": 0,
            "diff_file_size": 9456,
            "diff_url": "https://github.com/gluster/glusterfs/commit/eb916c057036db8289b41265797e5dce066d1512.diff",
            "exists": true,
            "files": [
                {
                    "file_additions": 10,
                    "file_deletions": 0,
                    "file_exists": true,
                    "file_name": "xlators/features/utime/src/utime.c",
                    "file_size": 9456
                }
            ],
            "interesting": {
                "reopen": true,
                "status": false
            },
            "is_parent": false,
            "sha": "eb916c057036db8289b41265797e5dce066d1512"
        },
        {
            "associated_pull_request": [],
            "date": "2020-04-02 10:00:28+00:00",
            "diff": "gluster_glusterfs/issue_832/commit_f55c45537435cc2a1412c80a6c922db63ce65965.diff",
            "diff_additions": 20,
            "diff_deletions": 15,
            "diff_file_size": 9456,
            "diff_url": "https://github.com/gluster/glusterfs/commit/f55c45537435cc2a1412c80a6c922db63ce65965.diff",
            "exists": true,
            "files": [
                {
                    "file_additions": 20,
                    "file_deletions": 15,
                    "file_exists": true,
                    "file_name": "xlators/features/utime/src/utime.c",
                    "file_size": 9456
                }
            ],
            "interesting": {
                "reopen": false,
                "status": false
            },
            "is_parent": false,
            "sha": "f55c45537435cc2a1412c80a6c922db63ce65965"
        },
        {
            "associated_pull_request": [],
            "date": "2020-04-02 10:00:28+00:00",
            "diff": "gluster_glusterfs/issue_832/commit_b0e61d5a15e61c7defd47781bf05a859b0145124.diff",
            "diff_additions": 20,
            "diff_deletions": 15,
            "diff_file_size": 9456,
            "diff_url": "https://github.com/gluster/glusterfs/commit/b0e61d5a15e61c7defd47781bf05a859b0145124.diff",
            "exists": true,
            "files": [
                {
                    "file_additions": 20,
                    "file_deletions": 15,
                    "file_exists": true,
                    "file_name": "xlators/features/utime/src/utime.c",
                    "file_size": 9456
                }
            ],
            "interesting": {
                "reopen": false,
                "status": false
            },
            "is_parent": false,
            "sha": "b0e61d5a15e61c7defd47781bf05a859b0145124"
        },
        {
            "associated_pull_request": [],
            "date": "2020-04-02 10:00:28+00:00",
            "diff": "gluster_glusterfs/issue_832/commit_09d03c77c0c4d97a7f7b5a5d57349a6bd96544e7.diff",
            "diff_additions": 20,
            "diff_deletions": 15,
            "diff_file_size": 9456,
            "diff_url": "https://github.com/gluster/glusterfs/commit/09d03c77c0c4d97a7f7b5a5d57349a6bd96544e7.diff",
            "exists": true,
            "files": [
                {
                    "file_additions": 20,
                    "file_deletions": 15,
                    "file_exists": true,
                    "file_name": "xlators/features/utime/src/utime.c",
                    "file_size": 9456
                }
            ],
            "interesting": {
                "reopen": false,
                "status": false
            },
            "is_parent": false,
            "sha": "09d03c77c0c4d97a7f7b5a5d57349a6bd96544e7"
        }
    ],
    "first_commit": "2020-03-13 06:22:35+00:00",
    "last_commit": "2020-04-22 05:23:09+00:00",
    "number": 832,
    "pull_request": "None",
    "score": {
        "accidental_reopen_likely": false,
        "all_labels": [
            "Type:Bug",
            "wontfix",
            "release 7",
            "release-6"
        ],
        "contains_keywords": [
            "work",
            "fail",
            "chang",
            "fix",
            "issu",
            "patch",
            "error",
            "crash"
        ],
        "fix_size": 31,
        "has_labels": [],
        "intersecting": {
            "computed_score": 1.0,
            "final_commit_size": 31,
            "intersection_size": 31,
            "previous_commits_size": 31
        },
        "is_makefile_based": true,
        "no_new_files": [],
        "no_other_files": false,
        "num_prohibited_files": 221270,
        "prohibited_files": [
            "server/src/main/java/com/genymobile/scrcpy/Device.java",
            "server/src/main/java/com/genymobile/scrcpy/wrappers/SurfaceControl.java",
            "server/src/main/java/com/genymobile/scrcpy/Device.java",
            "server/src/main/java/com/genymobile/scrcpy/wrappers/SurfaceControl.java",
            "app/meson.build",
            "app/scrcpy.1",
            "app/src/common.h",
            "app/src/scrcpy.h",
            "app/src/server.h",
            "server/src/main/java/com/genymobile/scrcpy/Workarounds.java"
        ],
        "reopen": true,
        "reopen_events": [
            [
                "2020-03-13 12:15:42+00:00",
                "closed"
            ],
            [
                "2020-03-13 12:15:42+00:00",
                "commit"
            ],
            [
                "2020-03-30 08:31:03+00:00",
                "reopened"
            ],
            [
                "2020-04-03 07:47:04+00:00",
                "commit"
            ],
            [
                "2020-04-07 11:15:00+00:00",
                "commit"
            ],
            [
                "2020-04-08 06:34:57+00:00",
                "commit"
            ],
            [
                "2020-04-22 05:22:57+00:00",
                "commit"
            ],
            [
                "2020-04-22 05:23:29+00:00",
                "commit"
            ],
            [
                "2020-11-25 09:00:20+00:00",
                "closed"
            ]
        ],
        "status": false,
        "strategy": true,
        "total_changes": 121
    }
}