{
    "covered_issues": [
        120,
        119,
        115,
        112,
        111,
        109,
        108,
        106,
        105,
        104,
        103,
        99,
        97,
        94,
        93,
        92,
        91,
        90,
        89,
        88,
        87,
        86,
        85,
        83,
        82,
        80,
        79,
        78,
        77,
        76,
        75,
        72,
        71,
        70,
        69,
        68,
        67,
        66,
        65,
        63,
        62,
        60,
        58,
        57,
        56,
        55,
        52,
        51,
        48,
        47,
        46,
        45,
        44,
        43,
        42,
        41,
        38,
        37,
        36,
        34,
        33,
        32,
        31,
        30,
        29,
        28,
        26,
        25,
        24,
        23,
        22,
        21,
        18,
        17,
        16,
        15,
        14,
        12,
        11,
        10,
        9,
        8,
        7,
        6,
        5,
        1
    ],
    "finished": true
}