{
    "category": [
        "memory",
        "hardware/OS"
    ],
    "commits": [
        {
            "associated_pull_request": [],
            "date": "2014-06-06 18:58:58",
            "diff": "",
            "diff_additions": 0,
            "diff_deletions": 0,
            "diff_file_size": 0,
            "diff_url": "https://github.com/openzfs/zfs/commit/21b446a79e2ebd372d34c81a1d97f5f4519ebea9.diff",
            "exists": true,
            "files": [],
            "interesting": {
                "reopen": false,
                "status": false
            },
            "is_parent": true,
            "sha": "21b446a79e2ebd372d34c81a1d97f5f4519ebea9"
        },
        {
            "associated_pull_request": [],
            "date": "2014-06-10 21:37:13",
            "diff": "openzfs_zfs/issue_2293/commit_112228d16947d8dcbacc19cadce33b92df12cb1a.diff",
            "diff_additions": 0,
            "diff_deletions": 2,
            "diff_file_size": 149331,
            "diff_url": "https://github.com/openzfs/zfs/commit/112228d16947d8dcbacc19cadce33b92df12cb1a.diff",
            "exists": true,
            "files": [
                {
                    "file_additions": 0,
                    "file_deletions": 2,
                    "file_exists": true,
                    "file_name": "module/zfs/zio.c",
                    "file_size": 149331
                }
            ],
            "interesting": {
                "reopen": false,
                "status": false
            },
            "is_parent": false,
            "sha": "112228d16947d8dcbacc19cadce33b92df12cb1a"
        },
        {
            "associated_pull_request": [],
            "date": "2014-09-25 22:15:45",
            "diff": "openzfs_zfs/issue_2293/commit_911194e974923fcf50896f0c1140acb7ac4bdac7.diff",
            "diff_additions": 22,
            "diff_deletions": 26,
            "diff_file_size": 28013,
            "diff_url": "https://github.com/openzfs/zfs/commit/911194e974923fcf50896f0c1140acb7ac4bdac7.diff",
            "exists": true,
            "files": [
                {
                    "file_additions": 22,
                    "file_deletions": 26,
                    "file_exists": true,
                    "file_name": "lib/libzpool/kernel.c",
                    "file_size": 28013
                }
            ],
            "interesting": {
                "reopen": false,
                "status": true
            },
            "is_parent": false,
            "sha": "911194e974923fcf50896f0c1140acb7ac4bdac7"
        },
        {
            "associated_pull_request": [],
            "date": "2014-09-25 22:15:45",
            "diff": "openzfs_zfs/issue_2293/commit_8389ad9b139b3d7029d349a6bb31a2d02b3d0fe1.diff",
            "diff_additions": 24,
            "diff_deletions": 26,
            "diff_file_size": 28013,
            "diff_url": "https://github.com/openzfs/zfs/commit/8389ad9b139b3d7029d349a6bb31a2d02b3d0fe1.diff",
            "exists": true,
            "files": [
                {
                    "file_additions": 24,
                    "file_deletions": 26,
                    "file_exists": true,
                    "file_name": "lib/libzpool/kernel.c",
                    "file_size": 28013
                }
            ],
            "interesting": {
                "reopen": false,
                "status": true
            },
            "is_parent": false,
            "sha": "8389ad9b139b3d7029d349a6bb31a2d02b3d0fe1"
        },
        {
            "associated_pull_request": [],
            "date": "2014-09-25 22:15:45",
            "diff": "openzfs_zfs/issue_2293/commit_77d5fcf9c954bdc42a2a6f1dcd2ec87ca3767981.diff",
            "diff_additions": 24,
            "diff_deletions": 24,
            "diff_file_size": 28013,
            "diff_url": "https://github.com/openzfs/zfs/commit/77d5fcf9c954bdc42a2a6f1dcd2ec87ca3767981.diff",
            "exists": true,
            "files": [
                {
                    "file_additions": 24,
                    "file_deletions": 24,
                    "file_exists": true,
                    "file_name": "lib/libzpool/kernel.c",
                    "file_size": 28013
                }
            ],
            "interesting": {
                "reopen": false,
                "status": true
            },
            "is_parent": false,
            "sha": "77d5fcf9c954bdc42a2a6f1dcd2ec87ca3767981"
        },
        {
            "associated_pull_request": [],
            "date": "2014-09-25 22:15:45",
            "diff": "openzfs_zfs/issue_2293/commit_aa0ac7caa438bf3981456c559d4224be104ccc7d.diff",
            "diff_additions": 24,
            "diff_deletions": 24,
            "diff_file_size": 28013,
            "diff_url": "https://github.com/openzfs/zfs/commit/aa0ac7caa438bf3981456c559d4224be104ccc7d.diff",
            "exists": true,
            "files": [
                {
                    "file_additions": 24,
                    "file_deletions": 24,
                    "file_exists": true,
                    "file_name": "lib/libzpool/kernel.c",
                    "file_size": 28013
                }
            ],
            "interesting": {
                "reopen": false,
                "status": false
            },
            "is_parent": false,
            "sha": "aa0ac7caa438bf3981456c559d4224be104ccc7d"
        }
    ],
    "first_commit": "2014-06-06 22:49:34",
    "last_commit": "2014-09-30 17:46:55",
    "number": 2293,
    "pull_request": "None",
    "score": {
        "accidental_reopen_likely": false,
        "all_labels": [
            "Component: Test Suite"
        ],
        "contains_keywords": [
            "fail",
            "chang",
            "reason",
            "bug",
            "test",
            "fix",
            "patch",
            "attempt",
            "issu",
            "fault",
            "debug"
        ],
        "fix_size": 33,
        "has_labels": [],
        "intersecting": {
            "computed_score": 1.0,
            "final_commit_size": 30,
            "intersection_size": 30,
            "previous_commits_size": 33
        },
        "is_makefile_based": true,
        "no_new_files": [],
        "no_other_files": false,
        "num_prohibited_files": 47551,
        "prohibited_files": [
            "hal/inc/pinmap_hal.h",
            "Debug/marvin.bin",
            "Debug/marvin.elf",
            "Debug/marvin.hex",
            "Debug/marvin.bin",
            "Debug/marvin.elf",
            "Debug/marvin.hex",
            "inc/spark_utilities.h",
            "Debug/marvin.bin",
            "Debug/marvin.elf"
        ],
        "reopen": false,
        "reopen_events": [
            [
                "2014-06-10 23:44:40",
                "commit"
            ],
            [
                "2014-06-11 23:34:09",
                "commit"
            ],
            [
                "2014-09-25 23:39:47",
                "commit"
            ],
            [
                "2014-09-26 16:13:52",
                "commit"
            ],
            [
                "2014-09-27 17:01:38",
                "commit"
            ],
            [
                "2014-09-30 17:52:02",
                "commit"
            ],
            [
                "2014-12-24 00:34:22",
                "closed"
            ]
        ],
        "status": true,
        "strategy": true,
        "total_changes": 196
    }
}