{
    "commits": [
        {
            "associated_pull_request": [],
            "date": "2019-07-20 16:19:40+00:00",
            "diff": "fangfufu_httpdirfs/issue_36/commit_78d816716cb0dead3f74996b0b3c5844770533db.diff",
            "diff_additions": 6,
            "diff_deletions": 6,
            "diff_file_size": 35628,
            "diff_url": "https://github.com/fangfufu/httpdirfs/commit/78d816716cb0dead3f74996b0b3c5844770533db.diff",
            "exists": true,
            "files": [
                {
                    "file_additions": 6,
                    "file_deletions": 6,
                    "file_exists": true,
                    "file_name": "src/link.c",
                    "file_size": 35628
                }
            ],
            "interesting": {
                "reopen": false,
                "status": false
            },
            "is_parent": true,
            "sha": "78d816716cb0dead3f74996b0b3c5844770533db"
        },
        {
            "associated_pull_request": [],
            "date": "2019-07-20 18:23:24+00:00",
            "diff": "fangfufu_httpdirfs/issue_36/commit_08f795194143bb5ddf02c7252f1d2f31c5838b26.diff",
            "diff_additions": 4,
            "diff_deletions": 2,
            "diff_file_size": 44753,
            "diff_url": "https://github.com/fangfufu/httpdirfs/commit/08f795194143bb5ddf02c7252f1d2f31c5838b26.diff",
            "exists": true,
            "files": [
                {
                    "file_additions": 4,
                    "file_deletions": 1,
                    "file_exists": true,
                    "file_name": "src/link.c",
                    "file_size": 35628
                },
                {
                    "file_additions": 0,
                    "file_deletions": 1,
                    "file_exists": true,
                    "file_name": "src/network.c",
                    "file_size": 9125
                }
            ],
            "interesting": {
                "reopen": false,
                "status": false
            },
            "is_parent": false,
            "sha": "08f795194143bb5ddf02c7252f1d2f31c5838b26"
        },
        {
            "associated_pull_request": [],
            "date": "2019-07-20 18:23:24+00:00",
            "diff": "fangfufu_httpdirfs/issue_36/commit_4491377f64139c9d05b31e7b26ce4d472a50909c.diff",
            "diff_additions": 3,
            "diff_deletions": 1,
            "diff_file_size": 44753,
            "diff_url": "https://github.com/fangfufu/httpdirfs/commit/4491377f64139c9d05b31e7b26ce4d472a50909c.diff",
            "exists": true,
            "files": [
                {
                    "file_additions": 3,
                    "file_deletions": 0,
                    "file_exists": true,
                    "file_name": "src/link.c",
                    "file_size": 35628
                },
                {
                    "file_additions": 0,
                    "file_deletions": 1,
                    "file_exists": true,
                    "file_name": "src/network.c",
                    "file_size": 9125
                }
            ],
            "interesting": {
                "reopen": true,
                "status": false
            },
            "is_parent": false,
            "sha": "4491377f64139c9d05b31e7b26ce4d472a50909c"
        },
        {
            "associated_pull_request": [],
            "date": "2019-07-21 07:41:02+00:00",
            "diff": "fangfufu_httpdirfs/issue_36/commit_ed37aa5ca0034a119125df28a33bbd042d310b57.diff",
            "diff_additions": 2,
            "diff_deletions": 5,
            "diff_file_size": 44753,
            "diff_url": "https://github.com/fangfufu/httpdirfs/commit/ed37aa5ca0034a119125df28a33bbd042d310b57.diff",
            "exists": true,
            "files": [
                {
                    "file_additions": 0,
                    "file_deletions": 4,
                    "file_exists": true,
                    "file_name": "src/link.c",
                    "file_size": 35628
                },
                {
                    "file_additions": 2,
                    "file_deletions": 1,
                    "file_exists": true,
                    "file_name": "src/network.c",
                    "file_size": 9125
                }
            ],
            "interesting": {
                "reopen": false,
                "status": false
            },
            "is_parent": false,
            "sha": "ed37aa5ca0034a119125df28a33bbd042d310b57"
        }
    ],
    "first_commit": "2019-07-20 16:19:40+00:00",
    "last_commit": "2019-07-21 07:41:02+00:00",
    "number": 36,
    "pull_request": "None",
    "score": {
        "accidental_reopen_likely": false,
        "all_labels": [
            "bug"
        ],
        "contains_keywords": [
            "work",
            "fix",
            "issu",
            "perform",
            "debug",
            "test",
            "remov",
            "bug",
            "problem",
            "crash",
            "workaround"
        ],
        "fix_size": 13,
        "has_labels": [
            "bug"
        ],
        "intersecting": {
            "computed_score": 0.4444444444444444,
            "final_commit_size": 9,
            "intersection_size": 4,
            "previous_commits_size": 8
        },
        "is_makefile_based": true,
        "no_new_files": [],
        "no_other_files": true,
        "num_prohibited_files": 249932,
        "prohibited_files": [
            "server/src/main/java/com/genymobile/scrcpy/Device.java",
            "server/src/main/java/com/genymobile/scrcpy/wrappers/SurfaceControl.java",
            "server/src/main/java/com/genymobile/scrcpy/Device.java",
            "server/src/main/java/com/genymobile/scrcpy/wrappers/SurfaceControl.java",
            "app/meson.build",
            "app/scrcpy.1",
            "app/src/common.h",
            "app/src/scrcpy.h",
            "app/src/server.h",
            "server/src/main/java/com/genymobile/scrcpy/Workarounds.java"
        ],
        "reopen": true,
        "reopen_events": [
            [
                "2019-07-20 18:24:28+00:00",
                "commit"
            ],
            [
                "2019-07-20 18:25:36+00:00",
                "commit"
            ],
            [
                "2019-07-20 18:26:41+00:00",
                "closed"
            ],
            [
                "2019-07-20 18:33:12+00:00",
                "reopened"
            ],
            [
                "2019-07-21 08:02:48+00:00",
                "commit"
            ],
            [
                "2019-07-21 08:07:45+00:00",
                "closed"
            ]
        ],
        "status": false,
        "strategy": true,
        "total_changes": 29
    }
}