{
    "commits": [
        {
            "associated_pull_request": [],
            "date": "2022-08-23 14:24:21+00:00",
            "diff": "libsdl-org_sdl/issue_6116/commit_b6a3d76225b7c4d7d2ef11dd576fce6daa56dbce.diff",
            "diff_additions": 11,
            "diff_deletions": 6,
            "diff_file_size": 0,
            "diff_url": "https://github.com/libsdl-org/SDL/commit/b6a3d76225b7c4d7d2ef11dd576fce6daa56dbce.diff",
            "exists": true,
            "files": [
                {
                    "file_additions": 11,
                    "file_deletions": 6,
                    "file_exists": false,
                    "file_name": "src/joystick/SDL_gamecontroller.c",
                    "file_size": 0
                }
            ],
            "interesting": {
                "reopen": false,
                "status": false
            },
            "is_parent": true,
            "sha": "b6a3d76225b7c4d7d2ef11dd576fce6daa56dbce"
        },
        {
            "associated_pull_request": [],
            "date": "2022-08-23 14:42:48+00:00",
            "diff": "libsdl-org_sdl/issue_6116/commit_9d7bd0bc43f0ea2fc9cd6e4abf4086ce8dee9d8e.diff",
            "diff_additions": 2,
            "diff_deletions": 2,
            "diff_file_size": 140809,
            "diff_url": "https://github.com/libsdl-org/SDL/commit/9d7bd0bc43f0ea2fc9cd6e4abf4086ce8dee9d8e.diff",
            "exists": true,
            "files": [
                {
                    "file_additions": 2,
                    "file_deletions": 2,
                    "file_exists": true,
                    "file_name": "src/render/SDL_render.c",
                    "file_size": 140809
                }
            ],
            "interesting": {
                "reopen": true,
                "status": false
            },
            "is_parent": false,
            "sha": "9d7bd0bc43f0ea2fc9cd6e4abf4086ce8dee9d8e"
        },
        {
            "associated_pull_request": [
                "https://github.com/libsdl-org/SDL/pull/7236"
            ],
            "date": "2023-02-03 23:45:43+00:00",
            "diff": "libsdl-org_sdl/issue_6116/commit_60a4ffd7191706c8c33ebde20b34d3c15c3a5aa0.diff",
            "diff_additions": 5,
            "diff_deletions": 0,
            "diff_file_size": 140809,
            "diff_url": "https://github.com/libsdl-org/SDL/commit/60a4ffd7191706c8c33ebde20b34d3c15c3a5aa0.diff",
            "exists": true,
            "files": [
                {
                    "file_additions": 5,
                    "file_deletions": 0,
                    "file_exists": true,
                    "file_name": "src/render/SDL_render.c",
                    "file_size": 140809
                }
            ],
            "interesting": {
                "reopen": false,
                "status": false
            },
            "is_parent": false,
            "sha": "60a4ffd7191706c8c33ebde20b34d3c15c3a5aa0"
        },
        {
            "associated_pull_request": [
                "https://github.com/libsdl-org/SDL/pull/7236"
            ],
            "date": "2023-02-03 23:45:43+00:00",
            "diff": "libsdl-org_sdl/issue_6116/commit_2a83093b36008080654bbaa1fa89d0d37c5d0a3b.diff",
            "diff_additions": 5,
            "diff_deletions": 0,
            "diff_file_size": 140809,
            "diff_url": "https://github.com/libsdl-org/SDL/commit/2a83093b36008080654bbaa1fa89d0d37c5d0a3b.diff",
            "exists": true,
            "files": [
                {
                    "file_additions": 5,
                    "file_deletions": 0,
                    "file_exists": true,
                    "file_name": "src/render/SDL_render.c",
                    "file_size": 140809
                }
            ],
            "interesting": {
                "reopen": false,
                "status": false
            },
            "is_parent": false,
            "sha": "2a83093b36008080654bbaa1fa89d0d37c5d0a3b"
        }
    ],
    "first_commit": "2022-08-23 14:24:21+00:00",
    "last_commit": "2023-02-04 04:53:30+00:00",
    "number": 6116,
    "pull_request": "None",
    "score": {
        "accidental_reopen_likely": false,
        "all_labels": [],
        "contains_keywords": [
            "issu",
            "patch",
            "perform",
            "reason",
            "bug"
        ],
        "fix_size": 8,
        "has_labels": [],
        "intersecting": {
            "computed_score": 1.0,
            "final_commit_size": 6,
            "intersection_size": 6,
            "previous_commits_size": 8
        },
        "is_makefile_based": true,
        "no_new_files": [],
        "no_other_files": true,
        "num_prohibited_files": 98050,
        "prohibited_files": [
            "server/src/main/java/com/genymobile/scrcpy/Device.java",
            "server/src/main/java/com/genymobile/scrcpy/wrappers/SurfaceControl.java",
            "server/src/main/java/com/genymobile/scrcpy/Device.java",
            "server/src/main/java/com/genymobile/scrcpy/wrappers/SurfaceControl.java",
            "app/meson.build",
            "app/scrcpy.1",
            "app/src/common.h",
            "app/src/scrcpy.h",
            "app/src/server.h",
            "server/src/main/java/com/genymobile/scrcpy/Workarounds.java"
        ],
        "reopen": true,
        "reopen_events": [
            [
                "2022-08-23 14:44:39+00:00",
                "closed"
            ],
            [
                "2022-08-23 14:44:39+00:00",
                "commit"
            ],
            [
                "2022-10-05 19:53:13+00:00",
                "commit"
            ],
            [
                "2023-01-30 01:21:42+00:00",
                "reopened"
            ],
            [
                "2023-02-03 23:47:13+00:00",
                "commit"
            ],
            [
                "2023-02-04 04:53:32+00:00",
                "closed"
            ],
            [
                "2023-02-04 04:53:33+00:00",
                "commit"
            ]
        ],
        "status": false,
        "strategy": true,
        "total_changes": 31
    }
}