{
    "covered_issues": [
        183,
        172,
        170,
        165,
        159,
        153,
        144,
        133,
        131,
        129,
        126,
        119,
        118,
        109,
        105,
        104,
        103,
        100,
        99,
        98,
        96,
        93,
        88,
        87,
        84,
        83,
        82,
        43,
        42,
        41,
        40,
        39,
        38,
        36,
        35,
        33,
        32,
        30,
        29,
        28,
        27,
        25,
        24,
        21,
        18,
        10,
        9,
        8,
        4,
        2
    ],
    "finished": true
}