{
    "category": [
        "GUI",
        "network/protocol"
    ],
    "commits": [
        {
            "associated_pull_request": [],
            "date": "2015-08-27 11:54:50",
            "diff": "open62541_open62541/issue_350/commit_ba7d4e2433b58044604c94da700978541faee003.diff",
            "diff_additions": 4,
            "diff_deletions": 3,
            "diff_file_size": 0,
            "diff_url": "https://github.com/open62541/open62541/commit/ba7d4e2433b58044604c94da700978541faee003.diff",
            "exists": true,
            "files": [
                {
                    "file_additions": 4,
                    "file_deletions": 3,
                    "file_exists": false,
                    "file_name": "examples/networklayer_tcp.c",
                    "file_size": 0
                }
            ],
            "interesting": {
                "reopen": false,
                "status": false
            },
            "is_parent": true,
            "sha": "ba7d4e2433b58044604c94da700978541faee003"
        },
        {
            "associated_pull_request": [],
            "date": "2015-08-27 14:21:03",
            "diff": "open62541_open62541/issue_350/commit_be91c9dea2c51e60cef84b277df30bf69abe5970.diff",
            "diff_additions": 5,
            "diff_deletions": 7,
            "diff_file_size": 29099,
            "diff_url": "https://github.com/open62541/open62541/commit/be91c9dea2c51e60cef84b277df30bf69abe5970.diff",
            "exists": true,
            "files": [
                {
                    "file_additions": 5,
                    "file_deletions": 7,
                    "file_exists": true,
                    "file_name": "src/client/ua_client.c",
                    "file_size": 29099
                }
            ],
            "interesting": {
                "reopen": false,
                "status": false
            },
            "is_parent": false,
            "sha": "be91c9dea2c51e60cef84b277df30bf69abe5970"
        },
        {
            "associated_pull_request": [
                "https://github.com/open62541/open62541/pull/352"
            ],
            "date": "2015-08-28 08:04:33",
            "diff": "open62541_open62541/issue_350/commit_0b8d8d566e59bab2a6845381e2b62a6f4053da93.diff",
            "diff_additions": 67,
            "diff_deletions": 11,
            "diff_file_size": 41815,
            "diff_url": "https://github.com/open62541/open62541/commit/0b8d8d566e59bab2a6845381e2b62a6f4053da93.diff",
            "exists": true,
            "files": [
                {
                    "file_additions": 1,
                    "file_deletions": 0,
                    "file_exists": true,
                    "file_name": "examples/client.c",
                    "file_size": 12716
                },
                {
                    "file_additions": 66,
                    "file_deletions": 11,
                    "file_exists": true,
                    "file_name": "src/client/ua_client.c",
                    "file_size": 29099
                }
            ],
            "interesting": {
                "reopen": false,
                "status": true
            },
            "is_parent": false,
            "sha": "0b8d8d566e59bab2a6845381e2b62a6f4053da93"
        },
        {
            "associated_pull_request": [],
            "date": "2015-08-28 11:45:25",
            "diff": "open62541_open62541/issue_350/commit_7d8f2c7b3add41828c0b51b0c7e212cb04f202f0.diff",
            "diff_additions": 67,
            "diff_deletions": 11,
            "diff_file_size": 41815,
            "diff_url": "https://github.com/open62541/open62541/commit/7d8f2c7b3add41828c0b51b0c7e212cb04f202f0.diff",
            "exists": true,
            "files": [
                {
                    "file_additions": 1,
                    "file_deletions": 0,
                    "file_exists": true,
                    "file_name": "examples/client.c",
                    "file_size": 12716
                },
                {
                    "file_additions": 66,
                    "file_deletions": 11,
                    "file_exists": true,
                    "file_name": "src/client/ua_client.c",
                    "file_size": 29099
                }
            ],
            "interesting": {
                "reopen": false,
                "status": false
            },
            "is_parent": false,
            "sha": "7d8f2c7b3add41828c0b51b0c7e212cb04f202f0"
        }
    ],
    "first_commit": "2015-08-27 11:54:50",
    "last_commit": "2015-08-28 11:45:25",
    "number": 350,
    "pull_request": "None",
    "score": {
        "accidental_reopen_likely": false,
        "all_labels": [],
        "contains_keywords": [
            "fix",
            "bug",
            "test",
            "issu",
            "chang",
            "leak"
        ],
        "fix_size": 85,
        "has_labels": [],
        "intersecting": {
            "computed_score": 1.0,
            "final_commit_size": 79,
            "intersection_size": 79,
            "previous_commits_size": 85
        },
        "is_makefile_based": true,
        "no_new_files": [],
        "no_other_files": false,
        "num_prohibited_files": 40758,
        "prohibited_files": [
            "kill.h",
            "meminfo.h",
            "kill.h",
            "meminfo.h",
            "kill.h",
            "meminfo.h",
            "testsuite_cli_test.go",
            "testsuite_cli_test.go",
            "common.mk",
            "i3bar/include/draw_util.h"
        ],
        "reopen": false,
        "reopen_events": [
            [
                "2015-08-27 17:48:43",
                "commit"
            ],
            [
                "2015-08-28 08:05:22",
                "commit"
            ],
            [
                "2015-08-28 11:45:26",
                "commit"
            ],
            [
                "2015-08-29 14:49:34",
                "closed"
            ]
        ],
        "status": true,
        "strategy": true,
        "total_changes": 175
    }
}