{
    "covered_issues": [
        57,
        53,
        45,
        44,
        42,
        38,
        37,
        36,
        32,
        31,
        29,
        28,
        27,
        26,
        23,
        21,
        20,
        19,
        18,
        16,
        15,
        11,
        5,
        2,
        1
    ],
    "finished": true
}