{
    "commits": [
        {
            "diff": "spring-projects_spring-boot/issue_19321/commit_f94c770b0c1ed77c63ebc7ecb5617fd87360fc62.diff",
            "diff_additions": 12,
            "diff_deletions": 3,
            "diff_file_size": 6846,
            "files": [
                {
                    "file_additions": 12,
                    "file_deletions": 3,
                    "file_exists": true,
                    "file_name": "spring-boot-project/spring-boot-autoconfigure/src/main/java/org/springframework/boot/autoconfigure/jdbc/DataSourceInitializer.java",
                    "file_size": 6846
                }
            ],
            "interesting": {
                "reopened": false,
                "status": false
            },
            "sha": "f94c770b0c1ed77c63ebc7ecb5617fd87360fc62"
        },
        {
            "diff": "spring-projects_spring-boot/issue_19321/commit_3be219a3d5af2f2125243426dd64b1c27a341559.diff",
            "diff_additions": 61,
            "diff_deletions": 5,
            "diff_file_size": 9537,
            "files": [
                {
                    "file_additions": 23,
                    "file_deletions": 5,
                    "file_exists": true,
                    "file_name": "spring-boot-project/spring-boot-autoconfigure/src/main/java/org/springframework/boot/autoconfigure/jdbc/DataSourceInitializer.java",
                    "file_size": 6846
                },
                {
                    "file_additions": 38,
                    "file_deletions": 0,
                    "file_exists": true,
                    "file_name": "spring-boot-project/spring-boot-test-autoconfigure/src/test/java/org/springframework/boot/test/autoconfigure/jdbc/TestDatabaseAutoConfigurationTests.java",
                    "file_size": 2691
                }
            ],
            "interesting": {
                "reopened": true,
                "status": false
            },
            "sha": "3be219a3d5af2f2125243426dd64b1c27a341559"
        },
        {
            "diff": "spring-projects_spring-boot/issue_19321/commit_28ccf54b21d27b620fd0e6c8fd39e0fa0d5cb16e.diff",
            "diff_additions": 56,
            "diff_deletions": 0,
            "diff_file_size": 9292,
            "files": [
                {
                    "file_additions": 8,
                    "file_deletions": 0,
                    "file_exists": true,
                    "file_name": "spring-boot-project/spring-boot-test-autoconfigure/src/main/java/org/springframework/boot/test/autoconfigure/jdbc/TestDatabaseAutoConfiguration.java",
                    "file_size": 7704
                },
                {
                    "file_additions": 48,
                    "file_deletions": 0,
                    "file_exists": true,
                    "file_name": "spring-boot-project/spring-boot-test-autoconfigure/src/test/java/org/springframework/boot/test/autoconfigure/orm/jpa/DataJpaTestSchemaCredentialsIntegrationTests.java",
                    "file_size": 1588
                }
            ],
            "interesting": {
                "reopened": false,
                "status": true
            },
            "sha": "28ccf54b21d27b620fd0e6c8fd39e0fa0d5cb16e"
        }
    ],
    "first_commit": "2019-12-06 07:13:57",
    "last_commit": "2020-11-04 09:30:19",
    "number": 19321,
    "score": 144.02919708029196
}