{
    "category": [
        "hardware/OS",
        "multithreading"
    ],
    "commits": [
        {
            "associated_pull_request": [],
            "date": "2020-08-17 17:20:38",
            "diff": "timescale_timescaledb/issue_1986/commit_355b3bac490aaae8aa52848caf69aa0333a0c130.diff",
            "diff_additions": 15,
            "diff_deletions": 1,
            "diff_file_size": 107735,
            "diff_url": "https://github.com/timescale/timescaledb/commit/355b3bac490aaae8aa52848caf69aa0333a0c130.diff",
            "exists": true,
            "files": [
                {
                    "file_additions": 15,
                    "file_deletions": 1,
                    "file_exists": true,
                    "file_name": "src/chunk.c",
                    "file_size": 107735
                }
            ],
            "interesting": {
                "reopen": false,
                "status": false
            },
            "is_parent": true,
            "sha": "355b3bac490aaae8aa52848caf69aa0333a0c130"
        },
        {
            "associated_pull_request": [],
            "date": "2020-07-29 10:29:07",
            "diff": "timescale_timescaledb/issue_1986/commit_14f59313ca0ea44a19dfd094d850f2390dbbaf4c.diff",
            "diff_additions": 15,
            "diff_deletions": 1,
            "diff_file_size": 34990,
            "diff_url": "https://github.com/timescale/timescaledb/commit/14f59313ca0ea44a19dfd094d850f2390dbbaf4c.diff",
            "exists": true,
            "files": [
                {
                    "file_additions": 5,
                    "file_deletions": 0,
                    "file_exists": true,
                    "file_name": "src/dimension_slice.c",
                    "file_size": 26102
                },
                {
                    "file_additions": 10,
                    "file_deletions": 1,
                    "file_exists": true,
                    "file_name": "src/hypercube.c",
                    "file_size": 8888
                }
            ],
            "interesting": {
                "reopen": false,
                "status": false
            },
            "is_parent": false,
            "sha": "14f59313ca0ea44a19dfd094d850f2390dbbaf4c"
        },
        {
            "associated_pull_request": [],
            "date": "2020-07-29 10:29:07",
            "diff": "timescale_timescaledb/issue_1986/commit_f44dce67bd5c5d826a762c9f4825d0e2f5ee4c48.diff",
            "diff_additions": 56,
            "diff_deletions": 3,
            "diff_file_size": 224836,
            "diff_url": "https://github.com/timescale/timescaledb/commit/f44dce67bd5c5d826a762c9f4825d0e2f5ee4c48.diff",
            "exists": true,
            "files": [
                {
                    "file_additions": 3,
                    "file_deletions": 0,
                    "file_exists": true,
                    "file_name": "src/chunk.c",
                    "file_size": 107735
                },
                {
                    "file_additions": 27,
                    "file_deletions": 1,
                    "file_exists": true,
                    "file_name": "src/dimension_slice.c",
                    "file_size": 26102
                },
                {
                    "file_additions": 10,
                    "file_deletions": 1,
                    "file_exists": true,
                    "file_name": "src/hypercube.c",
                    "file_size": 8888
                },
                {
                    "file_additions": 16,
                    "file_deletions": 1,
                    "file_exists": true,
                    "file_name": "src/hypertable.c",
                    "file_size": 82111
                }
            ],
            "interesting": {
                "reopen": false,
                "status": false
            },
            "is_parent": false,
            "sha": "f44dce67bd5c5d826a762c9f4825d0e2f5ee4c48"
        },
        {
            "associated_pull_request": [],
            "date": "2020-07-29 10:29:07",
            "diff": "timescale_timescaledb/issue_1986/commit_1f4913473de760056463dc884aba0836fdef7e2f.diff",
            "diff_additions": 48,
            "diff_deletions": 6,
            "diff_file_size": 224836,
            "diff_url": "https://github.com/timescale/timescaledb/commit/1f4913473de760056463dc884aba0836fdef7e2f.diff",
            "exists": true,
            "files": [
                {
                    "file_additions": 6,
                    "file_deletions": 4,
                    "file_exists": true,
                    "file_name": "src/chunk.c",
                    "file_size": 107735
                },
                {
                    "file_additions": 27,
                    "file_deletions": 1,
                    "file_exists": true,
                    "file_name": "src/dimension_slice.c",
                    "file_size": 26102
                },
                {
                    "file_additions": 10,
                    "file_deletions": 1,
                    "file_exists": true,
                    "file_name": "src/hypercube.c",
                    "file_size": 8888
                },
                {
                    "file_additions": 5,
                    "file_deletions": 0,
                    "file_exists": true,
                    "file_name": "src/hypertable.c",
                    "file_size": 82111
                }
            ],
            "interesting": {
                "reopen": false,
                "status": false
            },
            "is_parent": false,
            "sha": "1f4913473de760056463dc884aba0836fdef7e2f"
        },
        {
            "associated_pull_request": [],
            "date": "2020-07-29 10:29:07",
            "diff": "timescale_timescaledb/issue_1986/commit_f5a2807e90b7c7127b1c5128b163babb7442b99e.diff",
            "diff_additions": 48,
            "diff_deletions": 6,
            "diff_file_size": 224836,
            "diff_url": "https://github.com/timescale/timescaledb/commit/f5a2807e90b7c7127b1c5128b163babb7442b99e.diff",
            "exists": true,
            "files": [
                {
                    "file_additions": 6,
                    "file_deletions": 4,
                    "file_exists": true,
                    "file_name": "src/chunk.c",
                    "file_size": 107735
                },
                {
                    "file_additions": 27,
                    "file_deletions": 1,
                    "file_exists": true,
                    "file_name": "src/dimension_slice.c",
                    "file_size": 26102
                },
                {
                    "file_additions": 10,
                    "file_deletions": 1,
                    "file_exists": true,
                    "file_name": "src/hypercube.c",
                    "file_size": 8888
                },
                {
                    "file_additions": 5,
                    "file_deletions": 0,
                    "file_exists": true,
                    "file_name": "src/hypertable.c",
                    "file_size": 82111
                }
            ],
            "interesting": {
                "reopen": false,
                "status": false
            },
            "is_parent": false,
            "sha": "f5a2807e90b7c7127b1c5128b163babb7442b99e"
        },
        {
            "associated_pull_request": [],
            "date": "2020-07-29 10:29:07",
            "diff": "timescale_timescaledb/issue_1986/commit_d3056a84b3beaa1a4b3a7ac1ca8bb2297e09356f.diff",
            "diff_additions": 48,
            "diff_deletions": 6,
            "diff_file_size": 224836,
            "diff_url": "https://github.com/timescale/timescaledb/commit/d3056a84b3beaa1a4b3a7ac1ca8bb2297e09356f.diff",
            "exists": true,
            "files": [
                {
                    "file_additions": 6,
                    "file_deletions": 4,
                    "file_exists": true,
                    "file_name": "src/chunk.c",
                    "file_size": 107735
                },
                {
                    "file_additions": 27,
                    "file_deletions": 1,
                    "file_exists": true,
                    "file_name": "src/dimension_slice.c",
                    "file_size": 26102
                },
                {
                    "file_additions": 10,
                    "file_deletions": 1,
                    "file_exists": true,
                    "file_name": "src/hypercube.c",
                    "file_size": 8888
                },
                {
                    "file_additions": 5,
                    "file_deletions": 0,
                    "file_exists": true,
                    "file_name": "src/hypertable.c",
                    "file_size": 82111
                }
            ],
            "interesting": {
                "reopen": false,
                "status": true
            },
            "is_parent": false,
            "sha": "d3056a84b3beaa1a4b3a7ac1ca8bb2297e09356f"
        },
        {
            "associated_pull_request": [],
            "date": "2020-07-29 10:29:07",
            "diff": "timescale_timescaledb/issue_1986/commit_6f925dd7c540622f65ce56b3a418658ff400b5d4.diff",
            "diff_additions": 48,
            "diff_deletions": 6,
            "diff_file_size": 224836,
            "diff_url": "https://github.com/timescale/timescaledb/commit/6f925dd7c540622f65ce56b3a418658ff400b5d4.diff",
            "exists": true,
            "files": [
                {
                    "file_additions": 6,
                    "file_deletions": 4,
                    "file_exists": true,
                    "file_name": "src/chunk.c",
                    "file_size": 107735
                },
                {
                    "file_additions": 27,
                    "file_deletions": 1,
                    "file_exists": true,
                    "file_name": "src/dimension_slice.c",
                    "file_size": 26102
                },
                {
                    "file_additions": 10,
                    "file_deletions": 1,
                    "file_exists": true,
                    "file_name": "src/hypercube.c",
                    "file_size": 8888
                },
                {
                    "file_additions": 5,
                    "file_deletions": 0,
                    "file_exists": true,
                    "file_name": "src/hypertable.c",
                    "file_size": 82111
                }
            ],
            "interesting": {
                "reopen": false,
                "status": false
            },
            "is_parent": false,
            "sha": "6f925dd7c540622f65ce56b3a418658ff400b5d4"
        },
        {
            "associated_pull_request": [],
            "date": "2020-07-29 10:29:07",
            "diff": "timescale_timescaledb/issue_1986/commit_5c9223f5f0bf9979494c6bed9c920b764bc3264d.diff",
            "diff_additions": 48,
            "diff_deletions": 6,
            "diff_file_size": 224836,
            "diff_url": "https://github.com/timescale/timescaledb/commit/5c9223f5f0bf9979494c6bed9c920b764bc3264d.diff",
            "exists": true,
            "files": [
                {
                    "file_additions": 6,
                    "file_deletions": 4,
                    "file_exists": true,
                    "file_name": "src/chunk.c",
                    "file_size": 107735
                },
                {
                    "file_additions": 27,
                    "file_deletions": 1,
                    "file_exists": true,
                    "file_name": "src/dimension_slice.c",
                    "file_size": 26102
                },
                {
                    "file_additions": 10,
                    "file_deletions": 1,
                    "file_exists": true,
                    "file_name": "src/hypercube.c",
                    "file_size": 8888
                },
                {
                    "file_additions": 5,
                    "file_deletions": 0,
                    "file_exists": true,
                    "file_name": "src/hypertable.c",
                    "file_size": 82111
                }
            ],
            "interesting": {
                "reopen": false,
                "status": false
            },
            "is_parent": false,
            "sha": "5c9223f5f0bf9979494c6bed9c920b764bc3264d"
        },
        {
            "associated_pull_request": [],
            "date": "2020-07-29 10:29:07",
            "diff": "timescale_timescaledb/issue_1986/commit_2ba37f53dbe8afff5c170772dbaa7895b2c5eb14.diff",
            "diff_additions": 108,
            "diff_deletions": 56,
            "diff_file_size": 240758,
            "diff_url": "https://github.com/timescale/timescaledb/commit/2ba37f53dbe8afff5c170772dbaa7895b2c5eb14.diff",
            "exists": true,
            "files": [
                {
                    "file_additions": 76,
                    "file_deletions": 51,
                    "file_exists": true,
                    "file_name": "src/chunk.c",
                    "file_size": 107735
                },
                {
                    "file_additions": 5,
                    "file_deletions": 2,
                    "file_exists": true,
                    "file_name": "src/debug_wait.c",
                    "file_size": 5255
                },
                {
                    "file_additions": 10,
                    "file_deletions": 1,
                    "file_exists": true,
                    "file_name": "src/dimension_slice.c",
                    "file_size": 26102
                },
                {
                    "file_additions": 11,
                    "file_deletions": 1,
                    "file_exists": true,
                    "file_name": "src/hypercube.c",
                    "file_size": 8888
                },
                {
                    "file_additions": 5,
                    "file_deletions": 0,
                    "file_exists": true,
                    "file_name": "src/hypertable.c",
                    "file_size": 82111
                },
                {
                    "file_additions": 1,
                    "file_deletions": 1,
                    "file_exists": true,
                    "file_name": "src/scanner.c",
                    "file_size": 10667
                }
            ],
            "interesting": {
                "reopen": false,
                "status": false
            },
            "is_parent": false,
            "sha": "2ba37f53dbe8afff5c170772dbaa7895b2c5eb14"
        },
        {
            "associated_pull_request": [],
            "date": "2020-07-29 10:29:07",
            "diff": "timescale_timescaledb/issue_1986/commit_243bc5c11c5a5c349f21ee416a6f1e309674aaea.diff",
            "diff_additions": 110,
            "diff_deletions": 56,
            "diff_file_size": 240758,
            "diff_url": "https://github.com/timescale/timescaledb/commit/243bc5c11c5a5c349f21ee416a6f1e309674aaea.diff",
            "exists": true,
            "files": [
                {
                    "file_additions": 76,
                    "file_deletions": 51,
                    "file_exists": true,
                    "file_name": "src/chunk.c",
                    "file_size": 107735
                },
                {
                    "file_additions": 5,
                    "file_deletions": 2,
                    "file_exists": true,
                    "file_name": "src/debug_wait.c",
                    "file_size": 5255
                },
                {
                    "file_additions": 10,
                    "file_deletions": 1,
                    "file_exists": true,
                    "file_name": "src/dimension_slice.c",
                    "file_size": 26102
                },
                {
                    "file_additions": 13,
                    "file_deletions": 1,
                    "file_exists": true,
                    "file_name": "src/hypercube.c",
                    "file_size": 8888
                },
                {
                    "file_additions": 5,
                    "file_deletions": 0,
                    "file_exists": true,
                    "file_name": "src/hypertable.c",
                    "file_size": 82111
                },
                {
                    "file_additions": 1,
                    "file_deletions": 1,
                    "file_exists": true,
                    "file_name": "src/scanner.c",
                    "file_size": 10667
                }
            ],
            "interesting": {
                "reopen": false,
                "status": true
            },
            "is_parent": false,
            "sha": "243bc5c11c5a5c349f21ee416a6f1e309674aaea"
        },
        {
            "associated_pull_request": [
                "https://github.com/timescale/timescaledb/pull/2150"
            ],
            "date": "2020-07-29 10:29:07",
            "diff": "timescale_timescaledb/issue_1986/commit_cfc4fb406708b49e2c5b0c799639e6051438b921.diff",
            "diff_additions": 110,
            "diff_deletions": 56,
            "diff_file_size": 240758,
            "diff_url": "https://github.com/timescale/timescaledb/commit/cfc4fb406708b49e2c5b0c799639e6051438b921.diff",
            "exists": true,
            "files": [
                {
                    "file_additions": 76,
                    "file_deletions": 51,
                    "file_exists": true,
                    "file_name": "src/chunk.c",
                    "file_size": 107735
                },
                {
                    "file_additions": 5,
                    "file_deletions": 2,
                    "file_exists": true,
                    "file_name": "src/debug_wait.c",
                    "file_size": 5255
                },
                {
                    "file_additions": 10,
                    "file_deletions": 1,
                    "file_exists": true,
                    "file_name": "src/dimension_slice.c",
                    "file_size": 26102
                },
                {
                    "file_additions": 13,
                    "file_deletions": 1,
                    "file_exists": true,
                    "file_name": "src/hypercube.c",
                    "file_size": 8888
                },
                {
                    "file_additions": 5,
                    "file_deletions": 0,
                    "file_exists": true,
                    "file_name": "src/hypertable.c",
                    "file_size": 82111
                },
                {
                    "file_additions": 1,
                    "file_deletions": 1,
                    "file_exists": true,
                    "file_name": "src/scanner.c",
                    "file_size": 10667
                }
            ],
            "interesting": {
                "reopen": false,
                "status": false
            },
            "is_parent": false,
            "sha": "cfc4fb406708b49e2c5b0c799639e6051438b921"
        },
        {
            "associated_pull_request": [
                "https://github.com/timescale/timescaledb/pull/2150"
            ],
            "date": "2020-07-29 10:29:07",
            "diff": "timescale_timescaledb/issue_1986/commit_769bc31dc20d30468eb9c36b9171e109bedde4b3.diff",
            "diff_additions": 110,
            "diff_deletions": 56,
            "diff_file_size": 240758,
            "diff_url": "https://github.com/timescale/timescaledb/commit/769bc31dc20d30468eb9c36b9171e109bedde4b3.diff",
            "exists": true,
            "files": [
                {
                    "file_additions": 76,
                    "file_deletions": 51,
                    "file_exists": true,
                    "file_name": "src/chunk.c",
                    "file_size": 107735
                },
                {
                    "file_additions": 5,
                    "file_deletions": 2,
                    "file_exists": true,
                    "file_name": "src/debug_wait.c",
                    "file_size": 5255
                },
                {
                    "file_additions": 10,
                    "file_deletions": 1,
                    "file_exists": true,
                    "file_name": "src/dimension_slice.c",
                    "file_size": 26102
                },
                {
                    "file_additions": 13,
                    "file_deletions": 1,
                    "file_exists": true,
                    "file_name": "src/hypercube.c",
                    "file_size": 8888
                },
                {
                    "file_additions": 5,
                    "file_deletions": 0,
                    "file_exists": true,
                    "file_name": "src/hypertable.c",
                    "file_size": 82111
                },
                {
                    "file_additions": 1,
                    "file_deletions": 1,
                    "file_exists": true,
                    "file_name": "src/scanner.c",
                    "file_size": 10667
                }
            ],
            "interesting": {
                "reopen": false,
                "status": false
            },
            "is_parent": false,
            "sha": "769bc31dc20d30468eb9c36b9171e109bedde4b3"
        },
        {
            "associated_pull_request": [
                "https://github.com/timescale/timescaledb/pull/2261"
            ],
            "date": "2020-07-29 10:29:07",
            "diff": "timescale_timescaledb/issue_1986/commit_3dfba91756ec71ac69d0f93caa22937f8baa1f10.diff",
            "diff_additions": 110,
            "diff_deletions": 58,
            "diff_file_size": 240758,
            "diff_url": "https://github.com/timescale/timescaledb/commit/3dfba91756ec71ac69d0f93caa22937f8baa1f10.diff",
            "exists": true,
            "files": [
                {
                    "file_additions": 78,
                    "file_deletions": 53,
                    "file_exists": true,
                    "file_name": "src/chunk.c",
                    "file_size": 107735
                },
                {
                    "file_additions": 5,
                    "file_deletions": 2,
                    "file_exists": true,
                    "file_name": "src/debug_wait.c",
                    "file_size": 5255
                },
                {
                    "file_additions": 10,
                    "file_deletions": 1,
                    "file_exists": true,
                    "file_name": "src/dimension_slice.c",
                    "file_size": 26102
                },
                {
                    "file_additions": 11,
                    "file_deletions": 1,
                    "file_exists": true,
                    "file_name": "src/hypercube.c",
                    "file_size": 8888
                },
                {
                    "file_additions": 5,
                    "file_deletions": 0,
                    "file_exists": true,
                    "file_name": "src/hypertable.c",
                    "file_size": 82111
                },
                {
                    "file_additions": 1,
                    "file_deletions": 1,
                    "file_exists": true,
                    "file_name": "src/scanner.c",
                    "file_size": 10667
                }
            ],
            "interesting": {
                "reopen": false,
                "status": true
            },
            "is_parent": false,
            "sha": "3dfba91756ec71ac69d0f93caa22937f8baa1f10"
        },
        {
            "associated_pull_request": [
                "https://github.com/timescale/timescaledb/pull/2261"
            ],
            "date": "2020-07-29 10:29:07",
            "diff": "timescale_timescaledb/issue_1986/commit_a3b711727c821236052005f06d372e5d9121f69a.diff",
            "diff_additions": 110,
            "diff_deletions": 58,
            "diff_file_size": 240758,
            "diff_url": "https://github.com/timescale/timescaledb/commit/a3b711727c821236052005f06d372e5d9121f69a.diff",
            "exists": true,
            "files": [
                {
                    "file_additions": 78,
                    "file_deletions": 53,
                    "file_exists": true,
                    "file_name": "src/chunk.c",
                    "file_size": 107735
                },
                {
                    "file_additions": 5,
                    "file_deletions": 2,
                    "file_exists": true,
                    "file_name": "src/debug_wait.c",
                    "file_size": 5255
                },
                {
                    "file_additions": 10,
                    "file_deletions": 1,
                    "file_exists": true,
                    "file_name": "src/dimension_slice.c",
                    "file_size": 26102
                },
                {
                    "file_additions": 11,
                    "file_deletions": 1,
                    "file_exists": true,
                    "file_name": "src/hypercube.c",
                    "file_size": 8888
                },
                {
                    "file_additions": 5,
                    "file_deletions": 0,
                    "file_exists": true,
                    "file_name": "src/hypertable.c",
                    "file_size": 82111
                },
                {
                    "file_additions": 1,
                    "file_deletions": 1,
                    "file_exists": true,
                    "file_name": "src/scanner.c",
                    "file_size": 10667
                }
            ],
            "interesting": {
                "reopen": true,
                "status": false
            },
            "is_parent": false,
            "sha": "a3b711727c821236052005f06d372e5d9121f69a"
        },
        {
            "associated_pull_request": [],
            "date": "2020-10-08 10:51:05",
            "diff": "timescale_timescaledb/issue_1986/commit_d184d9157df856692fca18d057b68c981d42ebb0.diff",
            "diff_additions": 87,
            "diff_deletions": 13,
            "diff_file_size": 142725,
            "diff_url": "https://github.com/timescale/timescaledb/commit/d184d9157df856692fca18d057b68c981d42ebb0.diff",
            "exists": true,
            "files": [
                {
                    "file_additions": 8,
                    "file_deletions": 0,
                    "file_exists": true,
                    "file_name": "src/chunk.c",
                    "file_size": 107735
                },
                {
                    "file_additions": 49,
                    "file_deletions": 9,
                    "file_exists": true,
                    "file_name": "src/dimension_slice.c",
                    "file_size": 26102
                },
                {
                    "file_additions": 30,
                    "file_deletions": 4,
                    "file_exists": true,
                    "file_name": "src/hypercube.c",
                    "file_size": 8888
                }
            ],
            "interesting": {
                "reopen": false,
                "status": false
            },
            "is_parent": false,
            "sha": "d184d9157df856692fca18d057b68c981d42ebb0"
        },
        {
            "associated_pull_request": [],
            "date": "2020-10-08 10:51:05",
            "diff": "timescale_timescaledb/issue_1986/commit_53dc07d233a417dd94c6057ce9946c94f097b1ae.diff",
            "diff_additions": 87,
            "diff_deletions": 13,
            "diff_file_size": 142725,
            "diff_url": "https://github.com/timescale/timescaledb/commit/53dc07d233a417dd94c6057ce9946c94f097b1ae.diff",
            "exists": true,
            "files": [
                {
                    "file_additions": 8,
                    "file_deletions": 0,
                    "file_exists": true,
                    "file_name": "src/chunk.c",
                    "file_size": 107735
                },
                {
                    "file_additions": 49,
                    "file_deletions": 9,
                    "file_exists": true,
                    "file_name": "src/dimension_slice.c",
                    "file_size": 26102
                },
                {
                    "file_additions": 30,
                    "file_deletions": 4,
                    "file_exists": true,
                    "file_name": "src/hypercube.c",
                    "file_size": 8888
                }
            ],
            "interesting": {
                "reopen": false,
                "status": true
            },
            "is_parent": false,
            "sha": "53dc07d233a417dd94c6057ce9946c94f097b1ae"
        },
        {
            "associated_pull_request": [],
            "date": "2020-10-08 10:51:05",
            "diff": "timescale_timescaledb/issue_1986/commit_7e5dfb8eafe8df554d29b36cdcd02343639a4f1f.diff",
            "diff_additions": 87,
            "diff_deletions": 13,
            "diff_file_size": 142725,
            "diff_url": "https://github.com/timescale/timescaledb/commit/7e5dfb8eafe8df554d29b36cdcd02343639a4f1f.diff",
            "exists": true,
            "files": [
                {
                    "file_additions": 8,
                    "file_deletions": 0,
                    "file_exists": true,
                    "file_name": "src/chunk.c",
                    "file_size": 107735
                },
                {
                    "file_additions": 49,
                    "file_deletions": 9,
                    "file_exists": true,
                    "file_name": "src/dimension_slice.c",
                    "file_size": 26102
                },
                {
                    "file_additions": 30,
                    "file_deletions": 4,
                    "file_exists": true,
                    "file_name": "src/hypercube.c",
                    "file_size": 8888
                }
            ],
            "interesting": {
                "reopen": false,
                "status": true
            },
            "is_parent": false,
            "sha": "7e5dfb8eafe8df554d29b36cdcd02343639a4f1f"
        },
        {
            "associated_pull_request": [],
            "date": "2020-10-08 10:51:05",
            "diff": "timescale_timescaledb/issue_1986/commit_b02d1a38440fe6e29e028cc83f4181e9d47f6f5a.diff",
            "diff_additions": 87,
            "diff_deletions": 13,
            "diff_file_size": 142725,
            "diff_url": "https://github.com/timescale/timescaledb/commit/b02d1a38440fe6e29e028cc83f4181e9d47f6f5a.diff",
            "exists": true,
            "files": [
                {
                    "file_additions": 8,
                    "file_deletions": 0,
                    "file_exists": true,
                    "file_name": "src/chunk.c",
                    "file_size": 107735
                },
                {
                    "file_additions": 49,
                    "file_deletions": 9,
                    "file_exists": true,
                    "file_name": "src/dimension_slice.c",
                    "file_size": 26102
                },
                {
                    "file_additions": 30,
                    "file_deletions": 4,
                    "file_exists": true,
                    "file_name": "src/hypercube.c",
                    "file_size": 8888
                }
            ],
            "interesting": {
                "reopen": false,
                "status": true
            },
            "is_parent": false,
            "sha": "b02d1a38440fe6e29e028cc83f4181e9d47f6f5a"
        },
        {
            "associated_pull_request": [],
            "date": "2020-10-08 10:51:05",
            "diff": "timescale_timescaledb/issue_1986/commit_5dd6b545ec42c906863e58146a092ba35c7ca2c1.diff",
            "diff_additions": 118,
            "diff_deletions": 32,
            "diff_file_size": 224836,
            "diff_url": "https://github.com/timescale/timescaledb/commit/5dd6b545ec42c906863e58146a092ba35c7ca2c1.diff",
            "exists": true,
            "files": [
                {
                    "file_additions": 25,
                    "file_deletions": 9,
                    "file_exists": true,
                    "file_name": "src/chunk.c",
                    "file_size": 107735
                },
                {
                    "file_additions": 56,
                    "file_deletions": 14,
                    "file_exists": true,
                    "file_name": "src/dimension_slice.c",
                    "file_size": 26102
                },
                {
                    "file_additions": 30,
                    "file_deletions": 4,
                    "file_exists": true,
                    "file_name": "src/hypercube.c",
                    "file_size": 8888
                },
                {
                    "file_additions": 7,
                    "file_deletions": 5,
                    "file_exists": true,
                    "file_name": "src/hypertable.c",
                    "file_size": 82111
                }
            ],
            "interesting": {
                "reopen": false,
                "status": true
            },
            "is_parent": false,
            "sha": "5dd6b545ec42c906863e58146a092ba35c7ca2c1"
        },
        {
            "associated_pull_request": [],
            "date": "2020-10-08 10:51:05",
            "diff": "timescale_timescaledb/issue_1986/commit_e16b9da06febcfb07440964c21cc267cbbe8c821.diff",
            "diff_additions": 118,
            "diff_deletions": 32,
            "diff_file_size": 224836,
            "diff_url": "https://github.com/timescale/timescaledb/commit/e16b9da06febcfb07440964c21cc267cbbe8c821.diff",
            "exists": true,
            "files": [
                {
                    "file_additions": 25,
                    "file_deletions": 9,
                    "file_exists": true,
                    "file_name": "src/chunk.c",
                    "file_size": 107735
                },
                {
                    "file_additions": 56,
                    "file_deletions": 14,
                    "file_exists": true,
                    "file_name": "src/dimension_slice.c",
                    "file_size": 26102
                },
                {
                    "file_additions": 30,
                    "file_deletions": 4,
                    "file_exists": true,
                    "file_name": "src/hypercube.c",
                    "file_size": 8888
                },
                {
                    "file_additions": 7,
                    "file_deletions": 5,
                    "file_exists": true,
                    "file_name": "src/hypertable.c",
                    "file_size": 82111
                }
            ],
            "interesting": {
                "reopen": false,
                "status": true
            },
            "is_parent": false,
            "sha": "e16b9da06febcfb07440964c21cc267cbbe8c821"
        },
        {
            "associated_pull_request": [
                "https://github.com/timescale/timescaledb/pull/2514"
            ],
            "date": "2020-10-08 10:51:05",
            "diff": "timescale_timescaledb/issue_1986/commit_d9a1bd5eafeea47efdcd702d164f41ac8c3cbe27.diff",
            "diff_additions": 118,
            "diff_deletions": 32,
            "diff_file_size": 224836,
            "diff_url": "https://github.com/timescale/timescaledb/commit/d9a1bd5eafeea47efdcd702d164f41ac8c3cbe27.diff",
            "exists": true,
            "files": [
                {
                    "file_additions": 25,
                    "file_deletions": 9,
                    "file_exists": true,
                    "file_name": "src/chunk.c",
                    "file_size": 107735
                },
                {
                    "file_additions": 56,
                    "file_deletions": 14,
                    "file_exists": true,
                    "file_name": "src/dimension_slice.c",
                    "file_size": 26102
                },
                {
                    "file_additions": 30,
                    "file_deletions": 4,
                    "file_exists": true,
                    "file_name": "src/hypercube.c",
                    "file_size": 8888
                },
                {
                    "file_additions": 7,
                    "file_deletions": 5,
                    "file_exists": true,
                    "file_name": "src/hypertable.c",
                    "file_size": 82111
                }
            ],
            "interesting": {
                "reopen": false,
                "status": true
            },
            "is_parent": false,
            "sha": "d9a1bd5eafeea47efdcd702d164f41ac8c3cbe27"
        },
        {
            "associated_pull_request": [
                "https://github.com/timescale/timescaledb/pull/2514"
            ],
            "date": "2020-10-08 10:51:05",
            "diff": "timescale_timescaledb/issue_1986/commit_2cc2df23bdd18d42dd91e5917baf04af261ac946.diff",
            "diff_additions": 118,
            "diff_deletions": 32,
            "diff_file_size": 224836,
            "diff_url": "https://github.com/timescale/timescaledb/commit/2cc2df23bdd18d42dd91e5917baf04af261ac946.diff",
            "exists": true,
            "files": [
                {
                    "file_additions": 25,
                    "file_deletions": 9,
                    "file_exists": true,
                    "file_name": "src/chunk.c",
                    "file_size": 107735
                },
                {
                    "file_additions": 56,
                    "file_deletions": 14,
                    "file_exists": true,
                    "file_name": "src/dimension_slice.c",
                    "file_size": 26102
                },
                {
                    "file_additions": 30,
                    "file_deletions": 4,
                    "file_exists": true,
                    "file_name": "src/hypercube.c",
                    "file_size": 8888
                },
                {
                    "file_additions": 7,
                    "file_deletions": 5,
                    "file_exists": true,
                    "file_name": "src/hypertable.c",
                    "file_size": 82111
                }
            ],
            "interesting": {
                "reopen": false,
                "status": true
            },
            "is_parent": false,
            "sha": "2cc2df23bdd18d42dd91e5917baf04af261ac946"
        },
        {
            "associated_pull_request": [],
            "date": "2020-10-08 10:51:05",
            "diff": "timescale_timescaledb/issue_1986/commit_d995edb3dd39eb43ed4025ad267de8e37b12fb30.diff",
            "diff_additions": 118,
            "diff_deletions": 32,
            "diff_file_size": 224836,
            "diff_url": "https://github.com/timescale/timescaledb/commit/d995edb3dd39eb43ed4025ad267de8e37b12fb30.diff",
            "exists": true,
            "files": [
                {
                    "file_additions": 25,
                    "file_deletions": 9,
                    "file_exists": true,
                    "file_name": "src/chunk.c",
                    "file_size": 107735
                },
                {
                    "file_additions": 56,
                    "file_deletions": 14,
                    "file_exists": true,
                    "file_name": "src/dimension_slice.c",
                    "file_size": 26102
                },
                {
                    "file_additions": 30,
                    "file_deletions": 4,
                    "file_exists": true,
                    "file_name": "src/hypercube.c",
                    "file_size": 8888
                },
                {
                    "file_additions": 7,
                    "file_deletions": 5,
                    "file_exists": true,
                    "file_name": "src/hypertable.c",
                    "file_size": 82111
                }
            ],
            "interesting": {
                "reopen": false,
                "status": false
            },
            "is_parent": false,
            "sha": "d995edb3dd39eb43ed4025ad267de8e37b12fb30"
        },
        {
            "associated_pull_request": [
                "https://github.com/timescale/timescaledb/pull/2800"
            ],
            "date": "2020-10-08 10:51:05",
            "diff": "timescale_timescaledb/issue_1986/commit_079f98f1c8d8ac77b6d7ec45aeb4c52e541db2e8.diff",
            "diff_additions": 95,
            "diff_deletions": 28,
            "diff_file_size": 224836,
            "diff_url": "https://github.com/timescale/timescaledb/commit/079f98f1c8d8ac77b6d7ec45aeb4c52e541db2e8.diff",
            "exists": true,
            "files": [
                {
                    "file_additions": 18,
                    "file_deletions": 9,
                    "file_exists": true,
                    "file_name": "src/chunk.c",
                    "file_size": 107735
                },
                {
                    "file_additions": 69,
                    "file_deletions": 10,
                    "file_exists": true,
                    "file_name": "src/dimension_slice.c",
                    "file_size": 26102
                },
                {
                    "file_additions": 1,
                    "file_deletions": 4,
                    "file_exists": true,
                    "file_name": "src/hypercube.c",
                    "file_size": 8888
                },
                {
                    "file_additions": 7,
                    "file_deletions": 5,
                    "file_exists": true,
                    "file_name": "src/hypertable.c",
                    "file_size": 82111
                }
            ],
            "interesting": {
                "reopen": false,
                "status": false
            },
            "is_parent": false,
            "sha": "079f98f1c8d8ac77b6d7ec45aeb4c52e541db2e8"
        },
        {
            "associated_pull_request": [
                "https://github.com/timescale/timescaledb/pull/2800"
            ],
            "date": "2020-10-08 10:51:05",
            "diff": "timescale_timescaledb/issue_1986/commit_59f07dd2b67f79fbbe654843d2dd3d63bba6da15.diff",
            "diff_additions": 95,
            "diff_deletions": 28,
            "diff_file_size": 224836,
            "diff_url": "https://github.com/timescale/timescaledb/commit/59f07dd2b67f79fbbe654843d2dd3d63bba6da15.diff",
            "exists": true,
            "files": [
                {
                    "file_additions": 18,
                    "file_deletions": 9,
                    "file_exists": true,
                    "file_name": "src/chunk.c",
                    "file_size": 107735
                },
                {
                    "file_additions": 69,
                    "file_deletions": 10,
                    "file_exists": true,
                    "file_name": "src/dimension_slice.c",
                    "file_size": 26102
                },
                {
                    "file_additions": 1,
                    "file_deletions": 4,
                    "file_exists": true,
                    "file_name": "src/hypercube.c",
                    "file_size": 8888
                },
                {
                    "file_additions": 7,
                    "file_deletions": 5,
                    "file_exists": true,
                    "file_name": "src/hypertable.c",
                    "file_size": 82111
                }
            ],
            "interesting": {
                "reopen": false,
                "status": false
            },
            "is_parent": false,
            "sha": "59f07dd2b67f79fbbe654843d2dd3d63bba6da15"
        }
    ],
    "first_commit": "2020-08-18 06:02:08",
    "last_commit": "2021-01-13 15:18:59",
    "number": 1986,
    "pull_request": "None",
    "score": {
        "accidental_reopen_likely": false,
        "all_labels": [
            "bug",
            "segfault",
            "severity-p1"
        ],
        "contains_keywords": [
            "fail",
            "report",
            "warn",
            "chang",
            "confirm",
            "error",
            "workaround",
            "bug",
            "problem",
            "crash",
            "test",
            "fix",
            "patch",
            "remov",
            "attempt",
            "issu",
            "work",
            "fault",
            "debug"
        ],
        "fix_size": 528,
        "has_labels": [
            "bug"
        ],
        "intersecting": {
            "computed_score": 1.0,
            "final_commit_size": 117,
            "intersection_size": 117,
            "previous_commits_size": 528
        },
        "is_makefile_based": true,
        "no_new_files": [],
        "no_other_files": false,
        "num_prohibited_files": 441500,
        "prohibited_files": [
            "hal/inc/pinmap_hal.h",
            "Debug/marvin.bin",
            "Debug/marvin.elf",
            "Debug/marvin.hex",
            "Debug/marvin.bin",
            "Debug/marvin.elf",
            "Debug/marvin.hex",
            "inc/spark_utilities.h",
            "Debug/marvin.bin",
            "Debug/marvin.elf"
        ],
        "reopen": true,
        "reopen_events": [
            [
                "2020-07-02 17:34:36",
                "closed"
            ],
            [
                "2020-07-13 05:03:11",
                "reopened"
            ],
            [
                "2020-07-20 09:31:36",
                "closed"
            ],
            [
                "2020-07-28 08:44:10",
                "reopened"
            ],
            [
                "2020-08-18 06:02:34",
                "commit"
            ],
            [
                "2020-08-18 06:18:56",
                "commit"
            ],
            [
                "2020-08-18 06:29:33",
                "commit"
            ],
            [
                "2020-08-18 07:27:20",
                "commit"
            ],
            [
                "2020-08-18 07:33:31",
                "commit"
            ],
            [
                "2020-08-18 09:14:40",
                "commit"
            ],
            [
                "2020-08-18 09:21:53",
                "commit"
            ],
            [
                "2020-08-18 09:41:15",
                "commit"
            ],
            [
                "2020-08-24 12:37:08",
                "commit"
            ],
            [
                "2020-08-24 15:06:26",
                "commit"
            ],
            [
                "2020-08-24 15:08:29",
                "commit"
            ],
            [
                "2020-08-24 15:46:41",
                "commit"
            ],
            [
                "2020-08-26 06:50:10",
                "commit"
            ],
            [
                "2020-08-26 07:08:08",
                "commit"
            ],
            [
                "2020-08-26 07:28:37",
                "commit"
            ],
            [
                "2020-08-26 07:44:22",
                "closed"
            ],
            [
                "2020-08-26 07:44:23",
                "commit"
            ],
            [
                "2020-08-26 08:32:19",
                "commit"
            ],
            [
                "2020-08-26 09:27:54",
                "commit"
            ],
            [
                "2020-09-03 08:00:39",
                "reopened"
            ],
            [
                "2020-10-07 14:08:38",
                "closed"
            ],
            [
                "2020-10-08 07:56:36",
                "reopened"
            ],
            [
                "2020-10-08 11:49:41",
                "commit"
            ],
            [
                "2020-10-08 11:55:27",
                "commit"
            ],
            [
                "2020-10-15 08:32:03",
                "commit"
            ],
            [
                "2020-10-15 08:33:09",
                "commit"
            ],
            [
                "2020-10-15 10:36:22",
                "commit"
            ],
            [
                "2020-10-15 15:33:25",
                "commit"
            ],
            [
                "2020-10-15 17:06:38",
                "commit"
            ],
            [
                "2020-10-15 18:49:56",
                "commit"
            ],
            [
                "2020-10-15 19:56:12",
                "closed"
            ],
            [
                "2020-10-15 19:56:16",
                "commit"
            ],
            [
                "2020-10-16 06:56:19",
                "commit"
            ],
            [
                "2020-10-16 11:45:37",
                "commit"
            ],
            [
                "2020-10-16 11:53:18",
                "commit"
            ],
            [
                "2020-10-16 11:56:49",
                "commit"
            ],
            [
                "2020-10-16 12:14:43",
                "commit"
            ],
            [
                "2020-10-16 16:51:11",
                "commit"
            ],
            [
                "2020-10-16 19:57:36",
                "commit"
            ],
            [
                "2020-10-16 20:00:12",
                "commit"
            ],
            [
                "2020-10-16 20:12:47",
                "commit"
            ],
            [
                "2020-10-16 20:13:34",
                "commit"
            ],
            [
                "2020-10-17 06:13:50",
                "commit"
            ],
            [
                "2020-10-17 08:36:07",
                "commit"
            ],
            [
                "2020-10-19 07:50:39",
                "commit"
            ],
            [
                "2020-10-19 07:56:08",
                "commit"
            ],
            [
                "2020-10-19 09:16:19",
                "commit"
            ],
            [
                "2020-10-19 09:41:14",
                "commit"
            ],
            [
                "2020-10-20 13:14:40",
                "commit"
            ],
            [
                "2021-01-11 10:50:51",
                "commit"
            ],
            [
                "2021-01-13 14:36:18",
                "commit"
            ],
            [
                "2021-01-13 15:23:08",
                "commit"
            ]
        ],
        "status": false,
        "strategy": true,
        "total_changes": 2755
    }
}