{
    "category": [
        "memory"
    ],
    "commits": [
        {
            "associated_pull_request": [],
            "date": "2014-12-30 15:42:05",
            "diff": "openwall_john/issue_977/commit_d91aae56967db14438d672204f000d5380585aa5.diff",
            "diff_additions": 8,
            "diff_deletions": 8,
            "diff_file_size": 8566,
            "diff_url": "https://github.com/openwall/john/commit/d91aae56967db14438d672204f000d5380585aa5.diff",
            "exists": true,
            "files": [
                {
                    "file_additions": 8,
                    "file_deletions": 8,
                    "file_exists": true,
                    "file_name": "src/KRB4_fmt_plug.c",
                    "file_size": 8566
                }
            ],
            "interesting": {
                "reopen": false,
                "status": false
            },
            "is_parent": true,
            "sha": "d91aae56967db14438d672204f000d5380585aa5"
        },
        {
            "associated_pull_request": [],
            "date": "2014-12-30 16:07:57",
            "diff": "openwall_john/issue_977/commit_c0cdf1912a0092297dc8a0f9af28593a01a74f08.diff",
            "diff_additions": 1,
            "diff_deletions": 1,
            "diff_file_size": 6155,
            "diff_url": "https://github.com/openwall/john/commit/c0cdf1912a0092297dc8a0f9af28593a01a74f08.diff",
            "exists": true,
            "files": [
                {
                    "file_additions": 1,
                    "file_deletions": 1,
                    "file_exists": true,
                    "file_name": "src/pbkdf2-hmac-sha512_fmt_plug.c",
                    "file_size": 6155
                }
            ],
            "interesting": {
                "reopen": true,
                "status": false
            },
            "is_parent": false,
            "sha": "c0cdf1912a0092297dc8a0f9af28593a01a74f08"
        },
        {
            "associated_pull_request": [],
            "date": "2014-12-30 16:16:56",
            "diff": "openwall_john/issue_977/commit_5391a515eae6a13e75abb37c4ff733752986d16d.diff",
            "diff_additions": 3,
            "diff_deletions": 0,
            "diff_file_size": 6155,
            "diff_url": "https://github.com/openwall/john/commit/5391a515eae6a13e75abb37c4ff733752986d16d.diff",
            "exists": true,
            "files": [
                {
                    "file_additions": 3,
                    "file_deletions": 0,
                    "file_exists": true,
                    "file_name": "src/pbkdf2-hmac-sha512_fmt_plug.c",
                    "file_size": 6155
                }
            ],
            "interesting": {
                "reopen": false,
                "status": false
            },
            "is_parent": false,
            "sha": "5391a515eae6a13e75abb37c4ff733752986d16d"
        }
    ],
    "first_commit": "2014-12-30 15:42:05",
    "last_commit": "2014-12-30 16:16:56",
    "number": 977,
    "pull_request": "None",
    "score": {
        "accidental_reopen_likely": false,
        "all_labels": [
            "bug"
        ],
        "contains_keywords": [
            "error",
            "bug",
            "fix"
        ],
        "fix_size": 5,
        "has_labels": [
            "bug"
        ],
        "intersecting": {
            "computed_score": 0.25,
            "final_commit_size": 4,
            "intersection_size": 1,
            "previous_commits_size": 2
        },
        "is_makefile_based": false,
        "no_new_files": [],
        "no_other_files": true,
        "num_prohibited_files": 66744,
        "prohibited_files": [
            "hal/inc/pinmap_hal.h",
            "Debug/marvin.bin",
            "Debug/marvin.elf",
            "Debug/marvin.hex",
            "Debug/marvin.bin",
            "Debug/marvin.elf",
            "Debug/marvin.hex",
            "inc/spark_utilities.h",
            "Debug/marvin.bin",
            "Debug/marvin.elf"
        ],
        "reopen": true,
        "reopen_events": [
            [
                "2014-12-30 16:08:05",
                "closed"
            ],
            [
                "2014-12-30 16:08:05",
                "commit"
            ],
            [
                "2014-12-30 16:09:43",
                "reopened"
            ],
            [
                "2014-12-30 16:17:04",
                "closed"
            ],
            [
                "2014-12-30 16:17:04",
                "commit"
            ]
        ],
        "status": false,
        "strategy": true,
        "total_changes": 21
    }
}