{
    "commits": [
        {
            "diff": "spring-projects_spring-boot/issue_9552/commit_c3bc32db02c08c10965a65b0def352208206283c.diff",
            "diff_additions": 8,
            "diff_deletions": 15,
            "diff_file_size": 0,
            "files": [
                {
                    "file_additions": 4,
                    "file_deletions": 6,
                    "file_exists": false,
                    "file_name": "spring-boot-integration-tests/spring-boot-devtools-tests/src/test/java/org/springframework/boot/devtools/tests/JarFileRemoteApplicationLauncher.java",
                    "file_size": 0
                },
                {
                    "file_additions": 4,
                    "file_deletions": 9,
                    "file_exists": false,
                    "file_name": "spring-boot-samples/spring-boot-sample-integration/src/test/java/sample/integration/consumer/SampleIntegrationApplicationTests.java",
                    "file_size": 0
                }
            ],
            "interesting": {
                "reopened": false,
                "status": false
            },
            "sha": "c3bc32db02c08c10965a65b0def352208206283c"
        },
        {
            "diff": "spring-projects_spring-boot/issue_9552/commit_c00a42f437258e4b59e37ced1adc9cf82856d64e.diff",
            "diff_additions": 206,
            "diff_deletions": 2,
            "diff_file_size": 0,
            "files": [
                {
                    "file_additions": 58,
                    "file_deletions": 0,
                    "file_exists": false,
                    "file_name": "spring-boot-autoconfigure/src/main/java/org/springframework/boot/autoconfigure/session/MongoSessionConfiguration.java",
                    "file_size": 0
                },
                {
                    "file_additions": 43,
                    "file_deletions": 0,
                    "file_exists": false,
                    "file_name": "spring-boot-autoconfigure/src/main/java/org/springframework/boot/autoconfigure/session/MongoSessionProperties.java",
                    "file_size": 0
                },
                {
                    "file_additions": 3,
                    "file_deletions": 1,
                    "file_exists": false,
                    "file_name": "spring-boot-autoconfigure/src/main/java/org/springframework/boot/autoconfigure/session/SessionAutoConfiguration.java",
                    "file_size": 0
                },
                {
                    "file_additions": 1,
                    "file_deletions": 0,
                    "file_exists": false,
                    "file_name": "spring-boot-autoconfigure/src/main/java/org/springframework/boot/autoconfigure/session/SessionStoreMappings.java",
                    "file_size": 0
                },
                {
                    "file_additions": 5,
                    "file_deletions": 0,
                    "file_exists": false,
                    "file_name": "spring-boot-autoconfigure/src/main/java/org/springframework/boot/autoconfigure/session/StoreType.java",
                    "file_size": 0
                },
                {
                    "file_additions": 2,
                    "file_deletions": 0,
                    "file_exists": false,
                    "file_name": "spring-boot-autoconfigure/src/test/java/org/springframework/boot/autoconfigure/session/SessionAutoConfigurationJdbcTests.java",
                    "file_size": 0
                },
                {
                    "file_additions": 91,
                    "file_deletions": 0,
                    "file_exists": false,
                    "file_name": "spring-boot-autoconfigure/src/test/java/org/springframework/boot/autoconfigure/session/SessionAutoConfigurationMongoTests.java",
                    "file_size": 0
                },
                {
                    "file_additions": 3,
                    "file_deletions": 1,
                    "file_exists": false,
                    "file_name": "spring-boot-autoconfigure/src/test/java/org/springframework/boot/autoconfigure/session/SessionAutoConfigurationRedisTests.java",
                    "file_size": 0
                }
            ],
            "interesting": {
                "reopened": true,
                "status": true
            },
            "sha": "c00a42f437258e4b59e37ced1adc9cf82856d64e"
        },
        {
            "diff": "spring-projects_spring-boot/issue_9552/commit_94aac343a3b92cfc8e01f8628c243fdcdc8bd759.diff",
            "diff_additions": 2,
            "diff_deletions": 0,
            "diff_file_size": 0,
            "files": [
                {
                    "file_additions": 2,
                    "file_deletions": 0,
                    "file_exists": false,
                    "file_name": "spring-boot-autoconfigure/src/main/java/org/springframework/boot/autoconfigure/session/MongoSessionConfiguration.java",
                    "file_size": 0
                }
            ],
            "interesting": {
                "reopened": false,
                "status": false
            },
            "sha": "94aac343a3b92cfc8e01f8628c243fdcdc8bd759"
        },
        {
            "diff": "spring-projects_spring-boot/issue_9552/commit_a1e26eaeea90e133511ecae1f163d46ac98da66f.diff",
            "diff_additions": 7,
            "diff_deletions": 7,
            "diff_file_size": 0,
            "files": [
                {
                    "file_additions": 1,
                    "file_deletions": 1,
                    "file_exists": false,
                    "file_name": "spring-boot-autoconfigure/src/main/java/org/springframework/boot/autoconfigure/session/MongoSessionProperties.java",
                    "file_size": 0
                },
                {
                    "file_additions": 1,
                    "file_deletions": 1,
                    "file_exists": false,
                    "file_name": "spring-boot-autoconfigure/src/main/java/org/springframework/boot/autoconfigure/session/SessionStoreMappings.java",
                    "file_size": 0
                },
                {
                    "file_additions": 2,
                    "file_deletions": 2,
                    "file_exists": false,
                    "file_name": "spring-boot-autoconfigure/src/main/java/org/springframework/boot/autoconfigure/session/StoreType.java",
                    "file_size": 0
                },
                {
                    "file_additions": 3,
                    "file_deletions": 3,
                    "file_exists": false,
                    "file_name": "spring-boot-autoconfigure/src/test/java/org/springframework/boot/autoconfigure/session/SessionAutoConfigurationMongoTests.java",
                    "file_size": 0
                }
            ],
            "interesting": {
                "reopened": false,
                "status": true
            },
            "sha": "a1e26eaeea90e133511ecae1f163d46ac98da66f"
        },
        {
            "diff": "spring-projects_spring-boot/issue_9552/commit_2f794ee8d965a95a552b21707e904b0127de2e88.diff",
            "diff_additions": 2,
            "diff_deletions": 0,
            "diff_file_size": 0,
            "files": [
                {
                    "file_additions": 2,
                    "file_deletions": 0,
                    "file_exists": false,
                    "file_name": "spring-boot-autoconfigure/src/main/java/org/springframework/boot/autoconfigure/session/SessionAutoConfiguration.java",
                    "file_size": 0
                }
            ],
            "interesting": {
                "reopened": false,
                "status": true
            },
            "sha": "2f794ee8d965a95a552b21707e904b0127de2e88"
        }
    ],
    "first_commit": "2017-09-21 11:03:51",
    "last_commit": "2017-09-25 13:34:03",
    "number": 9552,
    "score": 144.01606425702812
}