{
    "covered_issues": [
        167,
        166,
        161,
        159,
        158,
        155,
        154,
        151,
        150,
        146,
        145,
        144,
        143,
        141,
        139,
        137,
        135,
        130,
        128,
        127,
        126,
        124,
        122,
        120,
        119,
        115,
        114,
        113,
        112,
        111,
        110,
        109,
        108,
        107,
        106,
        105,
        104,
        103,
        100,
        98,
        97,
        96,
        95,
        93,
        92,
        89,
        83,
        81,
        80,
        79,
        78,
        76,
        75,
        74,
        72,
        69,
        68,
        67,
        66,
        65,
        64,
        61,
        58,
        55,
        53,
        51,
        50,
        49,
        48,
        47,
        45,
        44,
        42,
        41,
        39,
        37,
        36,
        35,
        34,
        31,
        29,
        28,
        27,
        26,
        23,
        22,
        15,
        14,
        13,
        9,
        8,
        7,
        6,
        5,
        3,
        2,
        1
    ],
    "finished": true
}