{
    "commits": [
        {
            "associated_pull_request": [],
            "date": "2020-07-25 20:34:50+00:00",
            "diff": "",
            "diff_additions": 0,
            "diff_deletions": 0,
            "diff_file_size": 0,
            "diff_url": "https://github.com/rusefi/rusefi/commit/47e130282782162a0f5f9a4de9be369e7fc3e9ea.diff",
            "exists": true,
            "files": [],
            "interesting": {
                "reopen": false,
                "status": false
            },
            "is_parent": true,
            "sha": "47e130282782162a0f5f9a4de9be369e7fc3e9ea"
        },
        {
            "associated_pull_request": [],
            "date": "2020-07-25 23:04:15+00:00",
            "diff": "rusefi_rusefi/issue_1638/commit_a81a5e3c04bbe08c7af144dd1e7c1bab80e09d78.diff",
            "diff_additions": 2,
            "diff_deletions": 0,
            "diff_file_size": 27604,
            "diff_url": "https://github.com/rusefi/rusefi/commit/a81a5e3c04bbe08c7af144dd1e7c1bab80e09d78.diff",
            "exists": true,
            "files": [
                {
                    "file_additions": 2,
                    "file_deletions": 0,
                    "file_exists": true,
                    "file_name": "firmware/controllers/system/efi_gpio.cpp",
                    "file_size": 27604
                }
            ],
            "interesting": {
                "reopen": true,
                "status": false
            },
            "is_parent": false,
            "sha": "a81a5e3c04bbe08c7af144dd1e7c1bab80e09d78"
        },
        {
            "associated_pull_request": [],
            "date": "2020-07-25 23:14:09+00:00",
            "diff": "rusefi_rusefi/issue_1638/commit_f42e08c8e532b14c709e7cc17da7476af2e3e0d4.diff",
            "diff_additions": 2,
            "diff_deletions": 1,
            "diff_file_size": 27604,
            "diff_url": "https://github.com/rusefi/rusefi/commit/f42e08c8e532b14c709e7cc17da7476af2e3e0d4.diff",
            "exists": true,
            "files": [
                {
                    "file_additions": 2,
                    "file_deletions": 1,
                    "file_exists": true,
                    "file_name": "firmware/controllers/system/efi_gpio.cpp",
                    "file_size": 27604
                }
            ],
            "interesting": {
                "reopen": false,
                "status": false
            },
            "is_parent": false,
            "sha": "f42e08c8e532b14c709e7cc17da7476af2e3e0d4"
        }
    ],
    "first_commit": "2020-07-25 20:34:50+00:00",
    "last_commit": "2020-07-25 23:14:09+00:00",
    "number": 1638,
    "pull_request": "None",
    "score": {
        "accidental_reopen_likely": false,
        "all_labels": [],
        "contains_keywords": [
            "work",
            "fail",
            "fix",
            "CI",
            "test",
            "error",
            "workaround"
        ],
        "fix_size": 4,
        "has_labels": [],
        "intersecting": {
            "computed_score": 0.6666666666666666,
            "final_commit_size": 3,
            "intersection_size": 2,
            "previous_commits_size": 3
        },
        "is_makefile_based": false,
        "no_new_files": [],
        "no_other_files": true,
        "num_prohibited_files": 127162,
        "prohibited_files": [
            "server/src/main/java/com/genymobile/scrcpy/Device.java",
            "server/src/main/java/com/genymobile/scrcpy/wrappers/SurfaceControl.java",
            "server/src/main/java/com/genymobile/scrcpy/Device.java",
            "server/src/main/java/com/genymobile/scrcpy/wrappers/SurfaceControl.java",
            "app/meson.build",
            "app/scrcpy.1",
            "app/src/common.h",
            "app/src/scrcpy.h",
            "app/src/server.h",
            "server/src/main/java/com/genymobile/scrcpy/Workarounds.java"
        ],
        "reopen": true,
        "reopen_events": [
            [
                "2020-07-25 21:23:03+00:00",
                "commit"
            ],
            [
                "2020-07-25 21:25:34+00:00",
                "commit"
            ],
            [
                "2020-07-25 21:40:19+00:00",
                "commit"
            ],
            [
                "2020-07-25 23:04:18+00:00",
                "closed"
            ],
            [
                "2020-07-25 23:04:18+00:00",
                "commit"
            ],
            [
                "2020-07-25 23:12:58+00:00",
                "reopened"
            ],
            [
                "2020-07-25 23:14:11+00:00",
                "commit"
            ],
            [
                "2021-03-08 01:22:17+00:00",
                "closed"
            ]
        ],
        "status": false,
        "strategy": true,
        "total_changes": 5
    }
}