{
    "commits": [
        {
            "associated_pull_request": [
                "https://github.com/DynamoRIO/dynamorio/pull/2455"
            ],
            "date": "2017-05-30 22:16:35+00:00",
            "diff": "",
            "diff_additions": 0,
            "diff_deletions": 0,
            "diff_file_size": 0,
            "diff_url": "https://github.com/DynamoRIO/dynamorio/commit/efa4e85add6017027475c428a9a8ba63ee58d539.diff",
            "exists": true,
            "files": [],
            "interesting": {
                "reopen": false,
                "status": false
            },
            "is_parent": true,
            "sha": "efa4e85add6017027475c428a9a8ba63ee58d539"
        },
        {
            "associated_pull_request": [
                "https://github.com/DynamoRIO/dynamorio/pull/2456"
            ],
            "date": "2017-05-31 17:56:42+00:00",
            "diff": "dynamorio_dynamorio/issue_2045/commit_988f2341c4e39dd1ca8500a7e7306d284f8abd1b.diff",
            "diff_additions": 10,
            "diff_deletions": 5,
            "diff_file_size": 55744,
            "diff_url": "https://github.com/DynamoRIO/dynamorio/commit/988f2341c4e39dd1ca8500a7e7306d284f8abd1b.diff",
            "exists": true,
            "files": [
                {
                    "file_additions": 5,
                    "file_deletions": 2,
                    "file_exists": true,
                    "file_name": "clients/drcachesim/common/named_pipe_unix.cpp",
                    "file_size": 5746
                },
                {
                    "file_additions": 5,
                    "file_deletions": 3,
                    "file_exists": true,
                    "file_name": "clients/drcachesim/common/options.cpp",
                    "file_size": 49998
                }
            ],
            "interesting": {
                "reopen": true,
                "status": false
            },
            "is_parent": false,
            "sha": "988f2341c4e39dd1ca8500a7e7306d284f8abd1b"
        },
        {
            "associated_pull_request": [
                "https://github.com/DynamoRIO/dynamorio/pull/2731"
            ],
            "date": "2017-12-03 00:14:04+00:00",
            "diff": "dynamorio_dynamorio/issue_2045/commit_b76cd991eb5f9e3cbfcb1bc94ac0071eecfbae17.diff",
            "diff_additions": 98,
            "diff_deletions": 11,
            "diff_file_size": 197685,
            "diff_url": "https://github.com/DynamoRIO/dynamorio/commit/b76cd991eb5f9e3cbfcb1bc94ac0071eecfbae17.diff",
            "exists": true,
            "files": [
                {
                    "file_additions": 6,
                    "file_deletions": 0,
                    "file_exists": true,
                    "file_name": "clients/drcachesim/analyzer.cpp",
                    "file_size": 35593
                },
                {
                    "file_additions": 9,
                    "file_deletions": 0,
                    "file_exists": true,
                    "file_name": "clients/drcachesim/analyzer_multi.cpp",
                    "file_size": 24368
                },
                {
                    "file_additions": 6,
                    "file_deletions": 0,
                    "file_exists": true,
                    "file_name": "clients/drcachesim/common/named_pipe_unix.cpp",
                    "file_size": 5746
                },
                {
                    "file_additions": 7,
                    "file_deletions": 1,
                    "file_exists": true,
                    "file_name": "clients/drcachesim/common/named_pipe_win.cpp",
                    "file_size": 5124
                },
                {
                    "file_additions": 45,
                    "file_deletions": 4,
                    "file_exists": true,
                    "file_name": "clients/drcachesim/launcher.cpp",
                    "file_size": 15973
                },
                {
                    "file_additions": 18,
                    "file_deletions": 4,
                    "file_exists": true,
                    "file_name": "clients/drcachesim/reader/ipc_reader.cpp",
                    "file_size": 3938
                },
                {
                    "file_additions": 7,
                    "file_deletions": 2,
                    "file_exists": true,
                    "file_name": "clients/drcachesim/tracer/tracer.cpp",
                    "file_size": 106943
                }
            ],
            "interesting": {
                "reopen": false,
                "status": false
            },
            "is_parent": false,
            "sha": "b76cd991eb5f9e3cbfcb1bc94ac0071eecfbae17"
        },
        {
            "associated_pull_request": [
                "https://github.com/DynamoRIO/dynamorio/pull/2731"
            ],
            "date": "2017-12-03 04:52:49+00:00",
            "diff": "dynamorio_dynamorio/issue_2045/commit_b1583b7296b8e71bf78f9627c3f3ae4c88cf9785.diff",
            "diff_additions": 99,
            "diff_deletions": 11,
            "diff_file_size": 197685,
            "diff_url": "https://github.com/DynamoRIO/dynamorio/commit/b1583b7296b8e71bf78f9627c3f3ae4c88cf9785.diff",
            "exists": true,
            "files": [
                {
                    "file_additions": 6,
                    "file_deletions": 0,
                    "file_exists": true,
                    "file_name": "clients/drcachesim/analyzer.cpp",
                    "file_size": 35593
                },
                {
                    "file_additions": 9,
                    "file_deletions": 0,
                    "file_exists": true,
                    "file_name": "clients/drcachesim/analyzer_multi.cpp",
                    "file_size": 24368
                },
                {
                    "file_additions": 6,
                    "file_deletions": 0,
                    "file_exists": true,
                    "file_name": "clients/drcachesim/common/named_pipe_unix.cpp",
                    "file_size": 5746
                },
                {
                    "file_additions": 7,
                    "file_deletions": 1,
                    "file_exists": true,
                    "file_name": "clients/drcachesim/common/named_pipe_win.cpp",
                    "file_size": 5124
                },
                {
                    "file_additions": 46,
                    "file_deletions": 4,
                    "file_exists": true,
                    "file_name": "clients/drcachesim/launcher.cpp",
                    "file_size": 15973
                },
                {
                    "file_additions": 18,
                    "file_deletions": 4,
                    "file_exists": true,
                    "file_name": "clients/drcachesim/reader/ipc_reader.cpp",
                    "file_size": 3938
                },
                {
                    "file_additions": 7,
                    "file_deletions": 2,
                    "file_exists": true,
                    "file_name": "clients/drcachesim/tracer/tracer.cpp",
                    "file_size": 106943
                }
            ],
            "interesting": {
                "reopen": false,
                "status": false
            },
            "is_parent": false,
            "sha": "b1583b7296b8e71bf78f9627c3f3ae4c88cf9785"
        },
        {
            "associated_pull_request": [],
            "date": "2017-12-03 04:52:49+00:00",
            "diff": "dynamorio_dynamorio/issue_2045/commit_12f661fe181a9ceef00f2adf10772ce15c486c85.diff",
            "diff_additions": 99,
            "diff_deletions": 11,
            "diff_file_size": 197685,
            "diff_url": "https://github.com/DynamoRIO/dynamorio/commit/12f661fe181a9ceef00f2adf10772ce15c486c85.diff",
            "exists": true,
            "files": [
                {
                    "file_additions": 6,
                    "file_deletions": 0,
                    "file_exists": true,
                    "file_name": "clients/drcachesim/analyzer.cpp",
                    "file_size": 35593
                },
                {
                    "file_additions": 9,
                    "file_deletions": 0,
                    "file_exists": true,
                    "file_name": "clients/drcachesim/analyzer_multi.cpp",
                    "file_size": 24368
                },
                {
                    "file_additions": 6,
                    "file_deletions": 0,
                    "file_exists": true,
                    "file_name": "clients/drcachesim/common/named_pipe_unix.cpp",
                    "file_size": 5746
                },
                {
                    "file_additions": 7,
                    "file_deletions": 1,
                    "file_exists": true,
                    "file_name": "clients/drcachesim/common/named_pipe_win.cpp",
                    "file_size": 5124
                },
                {
                    "file_additions": 46,
                    "file_deletions": 4,
                    "file_exists": true,
                    "file_name": "clients/drcachesim/launcher.cpp",
                    "file_size": 15973
                },
                {
                    "file_additions": 18,
                    "file_deletions": 4,
                    "file_exists": true,
                    "file_name": "clients/drcachesim/reader/ipc_reader.cpp",
                    "file_size": 3938
                },
                {
                    "file_additions": 7,
                    "file_deletions": 2,
                    "file_exists": true,
                    "file_name": "clients/drcachesim/tracer/tracer.cpp",
                    "file_size": 106943
                }
            ],
            "interesting": {
                "reopen": false,
                "status": false
            },
            "is_parent": false,
            "sha": "12f661fe181a9ceef00f2adf10772ce15c486c85"
        }
    ],
    "first_commit": "2017-05-30 22:16:35+00:00",
    "last_commit": "2017-12-04 23:07:13+00:00",
    "number": 2045,
    "pull_request": "None",
    "score": {
        "accidental_reopen_likely": false,
        "all_labels": [
            "Component-Tests",
            "OpSys-Linux",
            "Bug-Assert",
            "Component-DRTool",
            "Component-DrCacheSim"
        ],
        "contains_keywords": [
            "fail",
            "fix",
            "issu",
            "test",
            "error",
            "problem"
        ],
        "fix_size": 127,
        "has_labels": [],
        "intersecting": {
            "computed_score": 1.0,
            "final_commit_size": 112,
            "intersection_size": 112,
            "previous_commits_size": 127
        },
        "is_makefile_based": true,
        "no_new_files": [],
        "no_other_files": false,
        "num_prohibited_files": 166300,
        "prohibited_files": [
            "server/src/main/java/com/genymobile/scrcpy/Device.java",
            "server/src/main/java/com/genymobile/scrcpy/wrappers/SurfaceControl.java",
            "server/src/main/java/com/genymobile/scrcpy/Device.java",
            "server/src/main/java/com/genymobile/scrcpy/wrappers/SurfaceControl.java",
            "app/meson.build",
            "app/scrcpy.1",
            "app/src/common.h",
            "app/src/scrcpy.h",
            "app/src/server.h",
            "server/src/main/java/com/genymobile/scrcpy/Workarounds.java"
        ],
        "reopen": true,
        "reopen_events": [
            [
                "2017-05-31 15:18:39+00:00",
                "closed"
            ],
            [
                "2017-05-31 17:56:44+00:00",
                "commit"
            ],
            [
                "2017-12-02 21:52:37+00:00",
                "reopened"
            ],
            [
                "2017-12-03 02:33:00+00:00",
                "commit"
            ],
            [
                "2017-12-03 04:52:50+00:00",
                "closed"
            ],
            [
                "2017-12-03 04:52:52+00:00",
                "commit"
            ],
            [
                "2017-12-04 23:07:24+00:00",
                "commit"
            ]
        ],
        "status": false,
        "strategy": true,
        "total_changes": 344
    }
}