{
    "all_issues": 676,
    "interesting_issues": 1,
    "last_update": "2023-10-27 00:48:11.525293",
    "license": {
        "download": "undefined",
        "name": "unknown"
    },
    "ratio": 0.0014792899408284023,
    "size": 2317,
    "stars": 3465,
    "url": "https://github.com/OpenKinect/libfreenect"
}