{
    "covered_issues": [
        40,
        39,
        38,
        37,
        36,
        35,
        34,
        33,
        32,
        31,
        29,
        28,
        26,
        25,
        24,
        23,
        22,
        21,
        20,
        19,
        17,
        16,
        15,
        14,
        11,
        10,
        8,
        6,
        4,
        3,
        2,
        1
    ],
    "finished": true
}