{
    "commits": [
        {
            "associated_pull_request": [],
            "date": "2017-05-27 10:18:20+00:00",
            "diff": "radareorg_radare2/issue_7521/commit_929a622cb07fe803104662e08fde1cc19d9f75c1.diff",
            "diff_additions": 3,
            "diff_deletions": 3,
            "diff_file_size": 208018,
            "diff_url": "https://github.com/radareorg/radare2/commit/929a622cb07fe803104662e08fde1cc19d9f75c1.diff",
            "exists": true,
            "files": [
                {
                    "file_additions": 1,
                    "file_deletions": 1,
                    "file_exists": true,
                    "file_name": "libr/core/cmd.c",
                    "file_size": 165748
                },
                {
                    "file_additions": 2,
                    "file_deletions": 2,
                    "file_exists": true,
                    "file_name": "libr/debug/p/native/xnu/xnu_debug.c",
                    "file_size": 42270
                }
            ],
            "interesting": {
                "reopen": false,
                "status": false
            },
            "is_parent": true,
            "sha": "929a622cb07fe803104662e08fde1cc19d9f75c1"
        },
        {
            "associated_pull_request": [],
            "date": "2017-05-27 11:01:25+00:00",
            "diff": "radareorg_radare2/issue_7521/commit_e6ceba4cc24453ab716099d97154830972d82d72.diff",
            "diff_additions": 1,
            "diff_deletions": 1,
            "diff_file_size": 17078,
            "diff_url": "https://github.com/radareorg/radare2/commit/e6ceba4cc24453ab716099d97154830972d82d72.diff",
            "exists": true,
            "files": [
                {
                    "file_additions": 1,
                    "file_deletions": 1,
                    "file_exists": true,
                    "file_name": "libr/io/io.c",
                    "file_size": 17078
                }
            ],
            "interesting": {
                "reopen": true,
                "status": false
            },
            "is_parent": false,
            "sha": "e6ceba4cc24453ab716099d97154830972d82d72"
        },
        {
            "associated_pull_request": [],
            "date": "2017-05-28 21:38:14+00:00",
            "diff": "radareorg_radare2/issue_7521/commit_d8fff83c2e86b9110cf1309ef92e3847b7514122.diff",
            "diff_additions": 10,
            "diff_deletions": 9,
            "diff_file_size": 0,
            "diff_url": "https://github.com/radareorg/radare2/commit/d8fff83c2e86b9110cf1309ef92e3847b7514122.diff",
            "exists": true,
            "files": [
                {
                    "file_additions": 10,
                    "file_deletions": 9,
                    "file_exists": false,
                    "file_name": "libr/core/file.c",
                    "file_size": 0
                }
            ],
            "interesting": {
                "reopen": false,
                "status": false
            },
            "is_parent": false,
            "sha": "d8fff83c2e86b9110cf1309ef92e3847b7514122"
        }
    ],
    "first_commit": "2017-05-27 10:50:20+00:00",
    "last_commit": "2017-05-28 21:38:14+00:00",
    "number": 7521,
    "pull_request": "None",
    "score": {
        "accidental_reopen_likely": false,
        "all_labels": [],
        "contains_keywords": [
            "confirm",
            "work",
            "fail",
            "fix",
            "issu",
            "debug",
            "attempt",
            "fault",
            "leak",
            "warn",
            "bug",
            "crash"
        ],
        "fix_size": 19,
        "has_labels": [],
        "intersecting": {
            "computed_score": 0.0,
            "final_commit_size": 17,
            "intersection_size": 0,
            "previous_commits_size": 2
        },
        "is_makefile_based": true,
        "no_new_files": [
            "libr/core/file.c"
        ],
        "no_other_files": false,
        "num_prohibited_files": 15077,
        "prohibited_files": [
            "server/src/main/java/com/genymobile/scrcpy/Device.java",
            "server/src/main/java/com/genymobile/scrcpy/wrappers/SurfaceControl.java",
            "server/src/main/java/com/genymobile/scrcpy/Device.java",
            "server/src/main/java/com/genymobile/scrcpy/wrappers/SurfaceControl.java",
            "app/meson.build",
            "app/scrcpy.1",
            "app/src/common.h",
            "app/src/scrcpy.h",
            "app/src/server.h",
            "server/src/main/java/com/genymobile/scrcpy/Workarounds.java"
        ],
        "reopen": true,
        "reopen_events": [
            [
                "2017-05-27 11:01:32+00:00",
                "closed"
            ],
            [
                "2017-05-27 11:01:32+00:00",
                "commit"
            ],
            [
                "2017-05-27 17:58:49+00:00",
                "reopened"
            ],
            [
                "2017-05-27 22:40:34+00:00",
                "closed"
            ],
            [
                "2017-05-28 15:59:46+00:00",
                "reopened"
            ],
            [
                "2017-05-28 21:38:39+00:00",
                "commit"
            ],
            [
                "2017-05-28 22:13:35+00:00",
                "closed"
            ]
        ],
        "status": false,
        "strategy": true,
        "total_changes": 27
    }
}