{
    "category": [
        "feature request",
        "wrong API usage"
    ],
    "commits": [
        {
            "associated_pull_request": [
                "https://github.com/radareorg/radare2/pull/17627"
            ],
            "date": "2020-09-10 07:21:49",
            "diff": "",
            "diff_additions": 0,
            "diff_deletions": 0,
            "diff_file_size": 0,
            "diff_url": "https://github.com/radareorg/radare2/commit/391f8b77eba7a94045b2eba397a3b9328b368507.diff",
            "exists": true,
            "files": [],
            "interesting": {
                "reopen": false,
                "status": true
            },
            "is_parent": true,
            "sha": "391f8b77eba7a94045b2eba397a3b9328b368507"
        },
        {
            "associated_pull_request": [
                "https://github.com/radareorg/radare2/pull/17629"
            ],
            "date": "2020-09-10 14:41:14",
            "diff": "radareorg_radare2/issue_17351/commit_24dd46ec8fe6e5a3a96da9af452f64fe9c758ed1.diff",
            "diff_additions": 19644,
            "diff_deletions": 20121,
            "diff_file_size": 0,
            "diff_url": "https://github.com/radareorg/radare2/commit/24dd46ec8fe6e5a3a96da9af452f64fe9c758ed1.diff",
            "exists": true,
            "files": [
                {
                    "file_additions": 19637,
                    "file_deletions": 20114,
                    "file_exists": false,
                    "file_name": "shlr/radare2-shell-parser/src/parser.c",
                    "file_size": 0
                },
                {
                    "file_additions": 7,
                    "file_deletions": 7,
                    "file_exists": false,
                    "file_name": "shlr/radare2-shell-parser/src/scanner.c",
                    "file_size": 0
                }
            ],
            "interesting": {
                "reopen": false,
                "status": true
            },
            "is_parent": false,
            "sha": "24dd46ec8fe6e5a3a96da9af452f64fe9c758ed1"
        },
        {
            "associated_pull_request": [
                "https://github.com/radareorg/radare2/pull/17629"
            ],
            "date": "2020-09-15 14:06:08",
            "diff": "radareorg_radare2/issue_17351/commit_87495e591d3fb3a7911f3488595b66024c812926.diff",
            "diff_additions": 20319,
            "diff_deletions": 20884,
            "diff_file_size": 0,
            "diff_url": "https://github.com/radareorg/radare2/commit/87495e591d3fb3a7911f3488595b66024c812926.diff",
            "exists": true,
            "files": [
                {
                    "file_additions": 20308,
                    "file_deletions": 20876,
                    "file_exists": false,
                    "file_name": "shlr/radare2-shell-parser/src/parser.c",
                    "file_size": 0
                },
                {
                    "file_additions": 11,
                    "file_deletions": 8,
                    "file_exists": false,
                    "file_name": "shlr/radare2-shell-parser/src/scanner.c",
                    "file_size": 0
                }
            ],
            "interesting": {
                "reopen": false,
                "status": false
            },
            "is_parent": false,
            "sha": "87495e591d3fb3a7911f3488595b66024c812926"
        }
    ],
    "first_commit": "2020-09-10 07:21:49",
    "last_commit": "2020-09-15 14:06:08",
    "number": 17351,
    "pull_request": "None",
    "score": {
        "accidental_reopen_likely": false,
        "all_labels": [
            "input",
            "newshell"
        ],
        "contains_keywords": [
            "bug",
            "test",
            "fix",
            "issu"
        ],
        "fix_size": 26273,
        "has_labels": [],
        "intersecting": {
            "computed_score": 0.8909584160019436,
            "final_commit_size": 24697,
            "intersection_size": 22004,
            "previous_commits_size": 23580
        },
        "is_makefile_based": true,
        "no_new_files": [],
        "no_other_files": false,
        "num_prohibited_files": 30769,
        "prohibited_files": [
            "hal/inc/pinmap_hal.h",
            "Debug/marvin.bin",
            "Debug/marvin.elf",
            "Debug/marvin.hex",
            "Debug/marvin.bin",
            "Debug/marvin.elf",
            "Debug/marvin.hex",
            "inc/spark_utilities.h",
            "Debug/marvin.bin",
            "Debug/marvin.elf"
        ],
        "reopen": false,
        "reopen_events": [
            [
                "2020-09-10 14:42:00",
                "commit"
            ],
            [
                "2020-09-15 14:06:09",
                "closed"
            ],
            [
                "2020-09-15 14:06:13",
                "commit"
            ]
        ],
        "status": true,
        "strategy": true,
        "total_changes": 80968
    }
}