{
    "commits": [
        {
            "diff": "spring-projects_spring-boot/issue_5138/commit_1c170b35ea5c888f55da791f061f94de69c0d31e.diff",
            "diff_additions": 105,
            "diff_deletions": 12,
            "diff_file_size": 0,
            "files": [
                {
                    "file_additions": 16,
                    "file_deletions": 2,
                    "file_exists": false,
                    "file_name": "spring-boot-devtools/src/main/java/org/springframework/boot/devtools/tunnel/client/HttpTunnelConnection.java",
                    "file_size": 0
                },
                {
                    "file_additions": 6,
                    "file_deletions": 1,
                    "file_exists": false,
                    "file_name": "spring-boot-devtools/src/main/java/org/springframework/boot/devtools/tunnel/client/TunnelClient.java",
                    "file_size": 0
                },
                {
                    "file_additions": 9,
                    "file_deletions": 1,
                    "file_exists": false,
                    "file_name": "spring-boot-devtools/src/main/java/org/springframework/boot/devtools/tunnel/server/HttpTunnelServer.java",
                    "file_size": 0
                },
                {
                    "file_additions": 26,
                    "file_deletions": 0,
                    "file_exists": false,
                    "file_name": "spring-boot-devtools/src/main/java/org/springframework/boot/devtools/tunnel/server/RemoteDebugNotRunningException.java",
                    "file_size": 0
                },
                {
                    "file_additions": 5,
                    "file_deletions": 3,
                    "file_exists": false,
                    "file_name": "spring-boot-devtools/src/main/java/org/springframework/boot/devtools/tunnel/server/RemoteDebugPortProvider.java",
                    "file_size": 0
                },
                {
                    "file_additions": 15,
                    "file_deletions": 4,
                    "file_exists": false,
                    "file_name": "spring-boot-devtools/src/test/java/org/springframework/boot/devtools/test/MockClientHttpRequestFactory.java",
                    "file_size": 0
                },
                {
                    "file_additions": 28,
                    "file_deletions": 1,
                    "file_exists": false,
                    "file_name": "spring-boot-devtools/src/test/java/org/springframework/boot/devtools/tunnel/client/HttpTunnelConnectionTests.java",
                    "file_size": 0
                }
            ],
            "interesting": {
                "reopened": false,
                "status": false
            },
            "sha": "1c170b35ea5c888f55da791f061f94de69c0d31e"
        },
        {
            "diff": "spring-projects_spring-boot/issue_5138/commit_b726974bca3fcc618527610f486d05637152ebcc.diff",
            "diff_additions": 251,
            "diff_deletions": 57,
            "diff_file_size": 0,
            "files": [
                {
                    "file_additions": 10,
                    "file_deletions": 23,
                    "file_exists": false,
                    "file_name": "spring-boot-autoconfigure/src/main/java/org/springframework/boot/autoconfigure/amqp/RabbitAnnotationDrivenConfiguration.java",
                    "file_size": 0
                },
                {
                    "file_additions": 87,
                    "file_deletions": 0,
                    "file_exists": false,
                    "file_name": "spring-boot-autoconfigure/src/main/java/org/springframework/boot/autoconfigure/amqp/RabbitListenerContainerFactoryConfigurer.java",
                    "file_size": 0
                },
                {
                    "file_additions": 8,
                    "file_deletions": 34,
                    "file_exists": false,
                    "file_name": "spring-boot-autoconfigure/src/main/java/org/springframework/boot/autoconfigure/jms/JmsAnnotationDrivenConfiguration.java",
                    "file_size": 0
                },
                {
                    "file_additions": 116,
                    "file_deletions": 0,
                    "file_exists": false,
                    "file_name": "spring-boot-autoconfigure/src/main/java/org/springframework/boot/autoconfigure/jms/JmsListenerContainerFactoryConfigurer.java",
                    "file_size": 0
                },
                {
                    "file_additions": 30,
                    "file_deletions": 0,
                    "file_exists": false,
                    "file_name": "spring-boot-autoconfigure/src/test/java/org/springframework/boot/autoconfigure/jms/JmsAutoConfigurationTests.java",
                    "file_size": 0
                }
            ],
            "interesting": {
                "reopened": true,
                "status": false
            },
            "sha": "b726974bca3fcc618527610f486d05637152ebcc"
        },
        {
            "diff": "spring-projects_spring-boot/issue_5138/commit_c4205d04b30cad4390b2f3c21d198b4181c9d957.diff",
            "diff_additions": 51,
            "diff_deletions": 54,
            "diff_file_size": 0,
            "files": [
                {
                    "file_additions": 14,
                    "file_deletions": 4,
                    "file_exists": false,
                    "file_name": "spring-boot-autoconfigure/src/main/java/org/springframework/boot/autoconfigure/amqp/RabbitAnnotationDrivenConfiguration.java",
                    "file_size": 0
                },
                {
                    "file_additions": 4,
                    "file_deletions": 19,
                    "file_exists": false,
                    "file_name": "spring-boot-autoconfigure/src/main/java/org/springframework/boot/autoconfigure/amqp/SimpleRabbitListenerContainerFactoryConfigurer.java",
                    "file_size": 0
                },
                {
                    "file_additions": 7,
                    "file_deletions": 24,
                    "file_exists": false,
                    "file_name": "spring-boot-autoconfigure/src/main/java/org/springframework/boot/autoconfigure/jms/DefaultJmsListenerContainerFactoryConfigurer.java",
                    "file_size": 0
                },
                {
                    "file_additions": 22,
                    "file_deletions": 4,
                    "file_exists": false,
                    "file_name": "spring-boot-autoconfigure/src/main/java/org/springframework/boot/autoconfigure/jms/JmsAnnotationDrivenConfiguration.java",
                    "file_size": 0
                },
                {
                    "file_additions": 4,
                    "file_deletions": 3,
                    "file_exists": false,
                    "file_name": "spring-boot-autoconfigure/src/test/java/org/springframework/boot/autoconfigure/jms/JmsAutoConfigurationTests.java",
                    "file_size": 0
                }
            ],
            "interesting": {
                "reopened": false,
                "status": false
            },
            "sha": "c4205d04b30cad4390b2f3c21d198b4181c9d957"
        }
    ],
    "first_commit": "2016-02-12 12:50:58",
    "last_commit": "2016-02-23 13:43:33",
    "number": 5138,
    "score": 128.00754716981132
}