{
    "category": [
        "memory",
        "network/protocols"
    ],
    "commits": [
        {
            "associated_pull_request": [],
            "date": "2017-07-26 08:03:09",
            "diff": "",
            "diff_additions": 0,
            "diff_deletions": 0,
            "diff_file_size": 0,
            "diff_url": "https://github.com/darlinghq/darling/commit/a047ce77b0cf015feb1f3f44d2cf3acb5e5f17b4.diff",
            "exists": true,
            "files": [],
            "interesting": {
                "reopen": false,
                "status": false
            },
            "is_parent": true,
            "sha": "a047ce77b0cf015feb1f3f44d2cf3acb5e5f17b4"
        },
        {
            "associated_pull_request": [],
            "date": "2017-07-26 08:03:47",
            "diff": "darlinghq_darling/issue_303/commit_451517b50cadf92df6980c4a817213ac18514676.diff",
            "diff_additions": 11,
            "diff_deletions": 0,
            "diff_file_size": 13078,
            "diff_url": "https://github.com/darlinghq/darling/commit/451517b50cadf92df6980c4a817213ac18514676.diff",
            "exists": true,
            "files": [
                {
                    "file_additions": 2,
                    "file_deletions": 0,
                    "file_exists": true,
                    "file_name": "src/kernel/emulation/linux/syscalls.c",
                    "file_size": 12904
                },
                {
                    "file_additions": 9,
                    "file_deletions": 0,
                    "file_exists": true,
                    "file_name": "src/kernel/emulation/linux/unistd/initgroups.c",
                    "file_size": 174
                }
            ],
            "interesting": {
                "reopen": true,
                "status": false
            },
            "is_parent": false,
            "sha": "451517b50cadf92df6980c4a817213ac18514676"
        },
        {
            "associated_pull_request": [],
            "date": "2020-03-18 02:31:05",
            "diff": "darlinghq_darling/issue_303/commit_1bda33a4e8c8da4deb872548309458cc1d22937b.diff",
            "diff_additions": 8,
            "diff_deletions": 1,
            "diff_file_size": 1089,
            "diff_url": "https://github.com/darlinghq/darling/commit/1bda33a4e8c8da4deb872548309458cc1d22937b.diff",
            "exists": true,
            "files": [
                {
                    "file_additions": 8,
                    "file_deletions": 1,
                    "file_exists": true,
                    "file_name": "src/kernel/libsyscall/wrappers/mach_boottime.c",
                    "file_size": 1089
                }
            ],
            "interesting": {
                "reopen": false,
                "status": false
            },
            "is_parent": false,
            "sha": "1bda33a4e8c8da4deb872548309458cc1d22937b"
        },
        {
            "associated_pull_request": [],
            "date": "2020-03-18 20:17:00",
            "diff": "darlinghq_darling/issue_303/commit_36c05d26811f331cac0d1653ef5752e000588d64.diff",
            "diff_additions": 2,
            "diff_deletions": 1,
            "diff_file_size": 6150,
            "diff_url": "https://github.com/darlinghq/darling/commit/36c05d26811f331cac0d1653ef5752e000588d64.diff",
            "exists": true,
            "files": [
                {
                    "file_additions": 2,
                    "file_deletions": 1,
                    "file_exists": true,
                    "file_name": "src/kernel/emulation/linux/network/getsockopt.c",
                    "file_size": 6150
                }
            ],
            "interesting": {
                "reopen": false,
                "status": false
            },
            "is_parent": false,
            "sha": "36c05d26811f331cac0d1653ef5752e000588d64"
        }
    ],
    "first_commit": "2017-07-26 08:03:09",
    "last_commit": "2020-03-18 20:21:34",
    "number": 303,
    "pull_request": "None",
    "score": {
        "accidental_reopen_likely": false,
        "all_labels": [
            "Regression"
        ],
        "contains_keywords": [
            "crash",
            "fix",
            "work",
            "fault"
        ],
        "fix_size": 16,
        "has_labels": [],
        "intersecting": {
            "computed_score": 0.0,
            "final_commit_size": 3,
            "intersection_size": 0,
            "previous_commits_size": 13
        },
        "is_makefile_based": true,
        "no_new_files": [
            "src/kernel/emulation/linux/network/getsockopt.c"
        ],
        "no_other_files": false,
        "num_prohibited_files": 40995,
        "prohibited_files": [
            "hal/inc/pinmap_hal.h",
            "Debug/marvin.bin",
            "Debug/marvin.elf",
            "Debug/marvin.hex",
            "Debug/marvin.bin",
            "Debug/marvin.elf",
            "Debug/marvin.hex",
            "inc/spark_utilities.h",
            "Debug/marvin.bin",
            "Debug/marvin.elf"
        ],
        "reopen": true,
        "reopen_events": [
            [
                "2017-07-26 08:04:34",
                "closed"
            ],
            [
                "2017-07-26 08:04:34",
                "commit"
            ],
            [
                "2017-07-26 08:04:53",
                "reopened"
            ],
            [
                "2020-03-18 02:32:35",
                "commit"
            ],
            [
                "2020-03-18 20:21:39",
                "closed"
            ],
            [
                "2020-03-18 20:21:39",
                "commit"
            ]
        ],
        "status": false,
        "strategy": true,
        "total_changes": 23
    }
}