{
    "commits": [
        {
            "associated_pull_request": [],
            "date": "2017-05-10 16:00:29+00:00",
            "diff": "",
            "diff_additions": 0,
            "diff_deletions": 0,
            "diff_file_size": 0,
            "diff_url": "https://github.com/tmk/tmk_keyboard/commit/cf9f157a7f6a703cba81a4b512c01d07b0bea6cf.diff",
            "exists": true,
            "files": [],
            "interesting": {
                "reopen": false,
                "status": false
            },
            "is_parent": true,
            "sha": "cf9f157a7f6a703cba81a4b512c01d07b0bea6cf"
        },
        {
            "associated_pull_request": [],
            "date": "2017-05-26 03:03:30+00:00",
            "diff": "tmk_tmk_keyboard/issue_248/commit_ba2883fd9ab040fc670ad729e6cddd4c67c8188c.diff",
            "diff_additions": 38,
            "diff_deletions": 14,
            "diff_file_size": 38315,
            "diff_url": "https://github.com/tmk/tmk_keyboard/commit/ba2883fd9ab040fc670ad729e6cddd4c67c8188c.diff",
            "exists": true,
            "files": [
                {
                    "file_additions": 3,
                    "file_deletions": 3,
                    "file_exists": true,
                    "file_name": "tmk_core/common/action.c",
                    "file_size": 21300
                },
                {
                    "file_additions": 30,
                    "file_deletions": 6,
                    "file_exists": true,
                    "file_name": "tmk_core/common/action_layer.c",
                    "file_size": 3440
                },
                {
                    "file_additions": 5,
                    "file_deletions": 5,
                    "file_exists": true,
                    "file_name": "tmk_core/common/action_tapping.c",
                    "file_size": 13575
                }
            ],
            "interesting": {
                "reopen": true,
                "status": false
            },
            "is_parent": false,
            "sha": "ba2883fd9ab040fc670ad729e6cddd4c67c8188c"
        },
        {
            "associated_pull_request": [],
            "date": "2017-05-26 03:03:30+00:00",
            "diff": "tmk_tmk_keyboard/issue_248/commit_5a831ec07d777799b5832c756598a260a8724de5.diff",
            "diff_additions": 38,
            "diff_deletions": 14,
            "diff_file_size": 0,
            "diff_url": "https://github.com/tmk/tmk_keyboard/commit/5a831ec07d777799b5832c756598a260a8724de5.diff",
            "exists": true,
            "files": [
                {
                    "file_additions": 3,
                    "file_deletions": 3,
                    "file_exists": false,
                    "file_name": "common/action.c",
                    "file_size": 0
                },
                {
                    "file_additions": 30,
                    "file_deletions": 6,
                    "file_exists": false,
                    "file_name": "common/action_layer.c",
                    "file_size": 0
                },
                {
                    "file_additions": 5,
                    "file_deletions": 5,
                    "file_exists": false,
                    "file_name": "common/action_tapping.c",
                    "file_size": 0
                }
            ],
            "interesting": {
                "reopen": false,
                "status": false
            },
            "is_parent": false,
            "sha": "5a831ec07d777799b5832c756598a260a8724de5"
        }
    ],
    "first_commit": "2017-05-10 16:00:29+00:00",
    "last_commit": "2017-05-30 06:25:26+00:00",
    "number": 248,
    "pull_request": "None",
    "score": {
        "accidental_reopen_likely": true,
        "all_labels": [
            "KEYMAP"
        ],
        "contains_keywords": [
            "work",
            "problem",
            "workaround"
        ],
        "fix_size": 92,
        "has_labels": [],
        "intersecting": {
            "computed_score": 0.0,
            "final_commit_size": 46,
            "intersection_size": 0,
            "previous_commits_size": 46
        },
        "is_makefile_based": false,
        "no_new_files": [
            "common/action.c",
            "common/action_layer.c",
            "common/action_tapping.c"
        ],
        "no_other_files": false,
        "num_prohibited_files": 98115,
        "prohibited_files": [
            "server/src/main/java/com/genymobile/scrcpy/Device.java",
            "server/src/main/java/com/genymobile/scrcpy/wrappers/SurfaceControl.java",
            "server/src/main/java/com/genymobile/scrcpy/Device.java",
            "server/src/main/java/com/genymobile/scrcpy/wrappers/SurfaceControl.java",
            "app/meson.build",
            "app/scrcpy.1",
            "app/src/common.h",
            "app/src/scrcpy.h",
            "app/src/server.h",
            "server/src/main/java/com/genymobile/scrcpy/Workarounds.java"
        ],
        "reopen": true,
        "reopen_events": [
            [
                "2015-09-26 21:16:28+00:00",
                "closed"
            ],
            [
                "2017-05-30 16:29:45+00:00",
                "commit"
            ],
            [
                "2017-05-30 16:35:49+00:00",
                "reopened"
            ],
            [
                "2017-05-30 16:35:53+00:00",
                "closed"
            ],
            [
                "2017-06-29 16:57:20+00:00",
                "commit"
            ],
            [
                "2018-02-01 03:42:38+00:00",
                "commit"
            ]
        ],
        "status": false,
        "strategy": true,
        "total_changes": 104
    }
}