{
    "covered_issues": [
        107,
        106,
        105,
        104,
        103,
        102,
        101,
        98,
        97,
        94,
        92,
        91,
        90,
        89,
        87,
        86,
        85,
        83,
        82,
        81,
        80,
        79,
        77,
        73,
        71,
        68,
        64,
        63,
        62,
        61,
        59,
        58,
        57,
        56,
        55,
        51,
        46,
        45,
        44,
        39,
        37,
        36,
        32,
        31,
        30,
        29,
        27,
        26,
        25,
        24,
        19,
        18,
        17,
        16,
        15,
        14,
        13,
        12,
        11,
        10,
        9,
        8,
        7,
        6,
        5,
        4,
        3,
        1
    ],
    "finished": true
}