{
    "commits": [
        {
            "diff": "spring-projects_spring-boot/issue_4393/commit_b8dc4e74e47d16b5d6826bcddb01f75e652d0f23.diff",
            "diff_additions": 5,
            "diff_deletions": 0,
            "diff_file_size": 0,
            "files": [
                {
                    "file_additions": 4,
                    "file_deletions": 0,
                    "file_exists": false,
                    "file_name": "spring-boot/src/main/java/org/springframework/boot/context/properties/ConfigurationProperties.java",
                    "file_size": 0
                },
                {
                    "file_additions": 1,
                    "file_deletions": 0,
                    "file_exists": false,
                    "file_name": "spring-boot/src/main/java/org/springframework/boot/context/properties/ConfigurationPropertiesBindingPostProcessor.java",
                    "file_size": 0
                }
            ],
            "interesting": {
                "reopened": false,
                "status": false
            },
            "sha": "b8dc4e74e47d16b5d6826bcddb01f75e652d0f23"
        },
        {
            "diff": "spring-projects_spring-boot/issue_4393/commit_1863d8a04045a1f35067d16ddea3eb55abe9047e.diff",
            "diff_additions": 17,
            "diff_deletions": 51,
            "diff_file_size": 0,
            "files": [
                {
                    "file_additions": 4,
                    "file_deletions": 35,
                    "file_exists": false,
                    "file_name": "spring-boot-autoconfigure/src/main/java/org/springframework/boot/autoconfigure/thymeleaf/ThymeleafAutoConfiguration.java",
                    "file_size": 0
                },
                {
                    "file_additions": 9,
                    "file_deletions": 9,
                    "file_exists": false,
                    "file_name": "spring-boot-autoconfigure/src/test/java/org/springframework/boot/autoconfigure/thymeleaf/ThymeleafAutoConfigurationTests.java",
                    "file_size": 0
                },
                {
                    "file_additions": 4,
                    "file_deletions": 7,
                    "file_exists": false,
                    "file_name": "spring-boot-devtools/src/test/java/org/springframework/boot/devtools/autoconfigure/LocalDevToolsAutoConfigurationTests.java",
                    "file_size": 0
                }
            ],
            "interesting": {
                "reopened": false,
                "status": true
            },
            "sha": "1863d8a04045a1f35067d16ddea3eb55abe9047e"
        },
        {
            "diff": "spring-projects_spring-boot/issue_4393/commit_db83e89922c2ee7e3886175a875a06bc6faa5b86.diff",
            "diff_additions": 730,
            "diff_deletions": 105,
            "diff_file_size": 0,
            "files": [
                {
                    "file_additions": 81,
                    "file_deletions": 0,
                    "file_exists": false,
                    "file_name": "spring-boot-autoconfigure/src/main/java/org/springframework/boot/autoconfigure/thymeleaf/AbstractTemplateResolverConfiguration.java",
                    "file_size": 0
                },
                {
                    "file_additions": 78,
                    "file_deletions": 0,
                    "file_exists": false,
                    "file_name": "spring-boot-autoconfigure/src/main/java/org/springframework/boot/autoconfigure/thymeleaf/AbstractThymeleafViewResolverConfiguration.java",
                    "file_size": 0
                },
                {
                    "file_additions": 86,
                    "file_deletions": 105,
                    "file_exists": false,
                    "file_name": "spring-boot-autoconfigure/src/main/java/org/springframework/boot/autoconfigure/thymeleaf/ThymeleafAutoConfiguration.java",
                    "file_size": 0
                },
                {
                    "file_additions": 58,
                    "file_deletions": 0,
                    "file_exists": false,
                    "file_name": "spring-boot-samples/spring-boot-sample-web-thymeleaf3/src/main/java/sample/web/thymeleaf3/InMemoryMessageRepository.java",
                    "file_size": 0
                },
                {
                    "file_additions": 69,
                    "file_deletions": 0,
                    "file_exists": false,
                    "file_name": "spring-boot-samples/spring-boot-sample-web-thymeleaf3/src/main/java/sample/web/thymeleaf3/Message.java",
                    "file_size": 0
                },
                {
                    "file_additions": 32,
                    "file_deletions": 0,
                    "file_exists": false,
                    "file_name": "spring-boot-samples/spring-boot-sample-web-thymeleaf3/src/main/java/sample/web/thymeleaf3/MessageRepository.java",
                    "file_size": 0
                },
                {
                    "file_additions": 46,
                    "file_deletions": 0,
                    "file_exists": false,
                    "file_name": "spring-boot-samples/spring-boot-sample-web-thymeleaf3/src/main/java/sample/web/thymeleaf3/SampleWebThymeleaf3Application.java",
                    "file_size": 0
                },
                {
                    "file_additions": 92,
                    "file_deletions": 0,
                    "file_exists": false,
                    "file_name": "spring-boot-samples/spring-boot-sample-web-thymeleaf3/src/main/java/sample/web/thymeleaf3/mvc/MessageController.java",
                    "file_size": 0
                },
                {
                    "file_additions": 111,
                    "file_deletions": 0,
                    "file_exists": false,
                    "file_name": "spring-boot-samples/spring-boot-sample-web-thymeleaf3/src/test/java/sample/web/thymeleaf3/MessageControllerWebTests.java",
                    "file_size": 0
                },
                {
                    "file_additions": 77,
                    "file_deletions": 0,
                    "file_exists": false,
                    "file_name": "spring-boot-samples/spring-boot-sample-web-thymeleaf3/src/test/java/sample/web/thymeleaf3/SampleWebThymeleaf3ApplicationTests.java",
                    "file_size": 0
                }
            ],
            "interesting": {
                "reopened": false,
                "status": false
            },
            "sha": "db83e89922c2ee7e3886175a875a06bc6faa5b86"
        }
    ],
    "first_commit": "2016-03-09 16:17:25",
    "last_commit": "2016-07-12 22:02:04",
    "number": 4393,
    "score": 272.0044052863436
}