{
    "covered_issues": [
        62,
        52,
        49,
        48,
        46,
        45,
        44,
        43,
        42,
        41,
        40,
        36,
        35,
        34,
        33,
        32,
        27,
        26,
        25,
        24,
        23,
        21,
        19,
        18,
        17,
        16,
        15,
        14,
        13,
        12,
        11,
        10,
        9,
        8,
        7,
        6,
        5,
        4,
        3,
        2,
        1
    ],
    "finished": true
}