{
    "commits": [
        {
            "diff": "spring-projects_spring-boot/issue_20135/commit_fe325c06c210fe525b7e1bfdb5c8bebb708b634b.diff",
            "diff_additions": 1,
            "diff_deletions": 1,
            "diff_file_size": 2564,
            "files": [
                {
                    "file_additions": 1,
                    "file_deletions": 1,
                    "file_exists": true,
                    "file_name": "spring-boot-project/spring-boot/src/test/java/org/springframework/boot/web/server/SslConfigurationValidatorTests.java",
                    "file_size": 2564
                }
            ],
            "interesting": {
                "reopened": false,
                "status": false
            },
            "sha": "fe325c06c210fe525b7e1bfdb5c8bebb708b634b"
        },
        {
            "diff": "spring-projects_spring-boot/issue_20135/commit_d8ae91354378dd69996cb40f8dad23383d19a1fe.diff",
            "diff_additions": 4,
            "diff_deletions": 0,
            "diff_file_size": 5641,
            "files": [
                {
                    "file_additions": 4,
                    "file_deletions": 0,
                    "file_exists": true,
                    "file_name": "spring-boot-project/spring-boot-tools/spring-boot-gradle-plugin/src/main/java/org/springframework/boot/gradle/tasks/buildinfo/BuildInfoProperties.java",
                    "file_size": 5641
                }
            ],
            "interesting": {
                "reopened": false,
                "status": true
            },
            "sha": "d8ae91354378dd69996cb40f8dad23383d19a1fe"
        },
        {
            "diff": "spring-projects_spring-boot/issue_20135/commit_c8907d46b40348f47a60055ca4016a6cba95d90c.diff",
            "diff_additions": 43,
            "diff_deletions": 74,
            "diff_file_size": 15693,
            "files": [
                {
                    "file_additions": 2,
                    "file_deletions": 2,
                    "file_exists": true,
                    "file_name": "spring-boot-project/spring-boot-tools/spring-boot-gradle-plugin/src/main/java/org/springframework/boot/gradle/tasks/buildinfo/BuildInfo.java",
                    "file_size": 3753
                },
                {
                    "file_additions": 40,
                    "file_deletions": 71,
                    "file_exists": true,
                    "file_name": "spring-boot-project/spring-boot-tools/spring-boot-gradle-plugin/src/main/java/org/springframework/boot/gradle/tasks/buildinfo/BuildInfoProperties.java",
                    "file_size": 5641
                },
                {
                    "file_additions": 1,
                    "file_deletions": 1,
                    "file_exists": true,
                    "file_name": "spring-boot-project/spring-boot-tools/spring-boot-gradle-plugin/src/test/java/org/springframework/boot/gradle/tasks/buildinfo/BuildInfoIntegrationTests.java",
                    "file_size": 6299
                }
            ],
            "interesting": {
                "reopened": false,
                "status": false
            },
            "sha": "c8907d46b40348f47a60055ca4016a6cba95d90c"
        }
    ],
    "first_commit": "2020-02-12 03:43:42",
    "last_commit": "2020-02-14 11:56:19",
    "number": 20135,
    "score": 272.0325203252033
}