{
    "category": [
        "GUI",
        "network/protocol"
    ],
    "commits": [
        {
            "associated_pull_request": [],
            "date": "2015-09-05 17:20:35",
            "diff": "pipelinedb_pipelinedb/issue_1120/commit_59b446c9f53e4e855da2cc063eec7455718fffe8.diff",
            "diff_additions": 4,
            "diff_deletions": 0,
            "diff_file_size": 0,
            "diff_url": "https://github.com/pipelinedb/pipelinedb/commit/59b446c9f53e4e855da2cc063eec7455718fffe8.diff",
            "exists": true,
            "files": [
                {
                    "file_additions": 4,
                    "file_deletions": 0,
                    "file_exists": false,
                    "file_name": "src/backend/pipeline/cont_analyze.c",
                    "file_size": 0
                }
            ],
            "interesting": {
                "reopen": false,
                "status": false
            },
            "is_parent": true,
            "sha": "59b446c9f53e4e855da2cc063eec7455718fffe8"
        },
        {
            "associated_pull_request": [],
            "date": "2015-09-05 20:37:37",
            "diff": "pipelinedb_pipelinedb/issue_1120/commit_31a4ad62d37b2d42cce594b744752cb91bde780c.diff",
            "diff_additions": 88,
            "diff_deletions": 49,
            "diff_file_size": 0,
            "diff_url": "https://github.com/pipelinedb/pipelinedb/commit/31a4ad62d37b2d42cce594b744752cb91bde780c.diff",
            "exists": true,
            "files": [
                {
                    "file_additions": 38,
                    "file_deletions": 9,
                    "file_exists": false,
                    "file_name": "src/backend/commands/pipelinecmds.c",
                    "file_size": 0
                },
                {
                    "file_additions": 1,
                    "file_deletions": 0,
                    "file_exists": false,
                    "file_name": "src/backend/nodes/makefuncs.c",
                    "file_size": 0
                },
                {
                    "file_additions": 38,
                    "file_deletions": 40,
                    "file_exists": false,
                    "file_name": "src/backend/pipeline/cont_analyze.c",
                    "file_size": 0
                },
                {
                    "file_additions": 11,
                    "file_deletions": 0,
                    "file_exists": false,
                    "file_name": "src/backend/utils/misc/guc.c",
                    "file_size": 0
                }
            ],
            "interesting": {
                "reopen": false,
                "status": true
            },
            "is_parent": false,
            "sha": "31a4ad62d37b2d42cce594b744752cb91bde780c"
        },
        {
            "associated_pull_request": [],
            "date": "2015-09-06 21:08:44",
            "diff": "pipelinedb_pipelinedb/issue_1120/commit_2a852bcba5a7fcac90472d2bd3b25e7c12613af2.diff",
            "diff_additions": 220,
            "diff_deletions": 49,
            "diff_file_size": 0,
            "diff_url": "https://github.com/pipelinedb/pipelinedb/commit/2a852bcba5a7fcac90472d2bd3b25e7c12613af2.diff",
            "exists": true,
            "files": [
                {
                    "file_additions": 4,
                    "file_deletions": 0,
                    "file_exists": false,
                    "file_name": "src/backend/catalog/dependency.c",
                    "file_size": 0
                },
                {
                    "file_additions": 21,
                    "file_deletions": 0,
                    "file_exists": false,
                    "file_name": "src/backend/catalog/pipeline_query.c",
                    "file_size": 0
                },
                {
                    "file_additions": 38,
                    "file_deletions": 9,
                    "file_exists": false,
                    "file_name": "src/backend/commands/pipelinecmds.c",
                    "file_size": 0
                },
                {
                    "file_additions": 1,
                    "file_deletions": 0,
                    "file_exists": false,
                    "file_name": "src/backend/nodes/makefuncs.c",
                    "file_size": 0
                },
                {
                    "file_additions": 3,
                    "file_deletions": 0,
                    "file_exists": false,
                    "file_name": "src/backend/parser/analyze.c",
                    "file_size": 0
                },
                {
                    "file_additions": 136,
                    "file_deletions": 40,
                    "file_exists": false,
                    "file_name": "src/backend/pipeline/cont_analyze.c",
                    "file_size": 0
                },
                {
                    "file_additions": 6,
                    "file_deletions": 0,
                    "file_exists": false,
                    "file_name": "src/backend/utils/adt/ruleutils.c",
                    "file_size": 0
                },
                {
                    "file_additions": 11,
                    "file_deletions": 0,
                    "file_exists": false,
                    "file_name": "src/backend/utils/misc/guc.c",
                    "file_size": 0
                }
            ],
            "interesting": {
                "reopen": false,
                "status": true
            },
            "is_parent": false,
            "sha": "2a852bcba5a7fcac90472d2bd3b25e7c12613af2"
        },
        {
            "associated_pull_request": [],
            "date": "2015-09-06 21:24:57",
            "diff": "pipelinedb_pipelinedb/issue_1120/commit_66173a047611bd53d23a7a4e4ff8c00d7d4e7db2.diff",
            "diff_additions": 224,
            "diff_deletions": 49,
            "diff_file_size": 0,
            "diff_url": "https://github.com/pipelinedb/pipelinedb/commit/66173a047611bd53d23a7a4e4ff8c00d7d4e7db2.diff",
            "exists": true,
            "files": [
                {
                    "file_additions": 4,
                    "file_deletions": 0,
                    "file_exists": false,
                    "file_name": "src/backend/catalog/dependency.c",
                    "file_size": 0
                },
                {
                    "file_additions": 21,
                    "file_deletions": 0,
                    "file_exists": false,
                    "file_name": "src/backend/catalog/pipeline_query.c",
                    "file_size": 0
                },
                {
                    "file_additions": 38,
                    "file_deletions": 9,
                    "file_exists": false,
                    "file_name": "src/backend/commands/pipelinecmds.c",
                    "file_size": 0
                },
                {
                    "file_additions": 1,
                    "file_deletions": 0,
                    "file_exists": false,
                    "file_name": "src/backend/nodes/makefuncs.c",
                    "file_size": 0
                },
                {
                    "file_additions": 3,
                    "file_deletions": 0,
                    "file_exists": false,
                    "file_name": "src/backend/parser/analyze.c",
                    "file_size": 0
                },
                {
                    "file_additions": 140,
                    "file_deletions": 40,
                    "file_exists": false,
                    "file_name": "src/backend/pipeline/cont_analyze.c",
                    "file_size": 0
                },
                {
                    "file_additions": 6,
                    "file_deletions": 0,
                    "file_exists": false,
                    "file_name": "src/backend/utils/adt/ruleutils.c",
                    "file_size": 0
                },
                {
                    "file_additions": 11,
                    "file_deletions": 0,
                    "file_exists": false,
                    "file_name": "src/backend/utils/misc/guc.c",
                    "file_size": 0
                }
            ],
            "interesting": {
                "reopen": false,
                "status": false
            },
            "is_parent": false,
            "sha": "66173a047611bd53d23a7a4e4ff8c00d7d4e7db2"
        },
        {
            "associated_pull_request": [],
            "date": "2015-09-06 21:47:09",
            "diff": "pipelinedb_pipelinedb/issue_1120/commit_d564a1253ba0ed52e1c282a80b09f350744685e5.diff",
            "diff_additions": 225,
            "diff_deletions": 49,
            "diff_file_size": 0,
            "diff_url": "https://github.com/pipelinedb/pipelinedb/commit/d564a1253ba0ed52e1c282a80b09f350744685e5.diff",
            "exists": true,
            "files": [
                {
                    "file_additions": 4,
                    "file_deletions": 0,
                    "file_exists": false,
                    "file_name": "src/backend/catalog/dependency.c",
                    "file_size": 0
                },
                {
                    "file_additions": 21,
                    "file_deletions": 0,
                    "file_exists": false,
                    "file_name": "src/backend/catalog/pipeline_query.c",
                    "file_size": 0
                },
                {
                    "file_additions": 38,
                    "file_deletions": 9,
                    "file_exists": false,
                    "file_name": "src/backend/commands/pipelinecmds.c",
                    "file_size": 0
                },
                {
                    "file_additions": 1,
                    "file_deletions": 0,
                    "file_exists": false,
                    "file_name": "src/backend/nodes/makefuncs.c",
                    "file_size": 0
                },
                {
                    "file_additions": 3,
                    "file_deletions": 0,
                    "file_exists": false,
                    "file_name": "src/backend/parser/analyze.c",
                    "file_size": 0
                },
                {
                    "file_additions": 141,
                    "file_deletions": 40,
                    "file_exists": false,
                    "file_name": "src/backend/pipeline/cont_analyze.c",
                    "file_size": 0
                },
                {
                    "file_additions": 6,
                    "file_deletions": 0,
                    "file_exists": false,
                    "file_name": "src/backend/utils/adt/ruleutils.c",
                    "file_size": 0
                },
                {
                    "file_additions": 11,
                    "file_deletions": 0,
                    "file_exists": false,
                    "file_name": "src/backend/utils/misc/guc.c",
                    "file_size": 0
                }
            ],
            "interesting": {
                "reopen": false,
                "status": true
            },
            "is_parent": false,
            "sha": "d564a1253ba0ed52e1c282a80b09f350744685e5"
        },
        {
            "associated_pull_request": [],
            "date": "2015-09-06 21:53:48",
            "diff": "pipelinedb_pipelinedb/issue_1120/commit_6e91f1e4aa726d27513b4dbe17ef98cdcb8b0698.diff",
            "diff_additions": 225,
            "diff_deletions": 49,
            "diff_file_size": 0,
            "diff_url": "https://github.com/pipelinedb/pipelinedb/commit/6e91f1e4aa726d27513b4dbe17ef98cdcb8b0698.diff",
            "exists": true,
            "files": [
                {
                    "file_additions": 4,
                    "file_deletions": 0,
                    "file_exists": false,
                    "file_name": "src/backend/catalog/dependency.c",
                    "file_size": 0
                },
                {
                    "file_additions": 21,
                    "file_deletions": 0,
                    "file_exists": false,
                    "file_name": "src/backend/catalog/pipeline_query.c",
                    "file_size": 0
                },
                {
                    "file_additions": 38,
                    "file_deletions": 9,
                    "file_exists": false,
                    "file_name": "src/backend/commands/pipelinecmds.c",
                    "file_size": 0
                },
                {
                    "file_additions": 1,
                    "file_deletions": 0,
                    "file_exists": false,
                    "file_name": "src/backend/nodes/makefuncs.c",
                    "file_size": 0
                },
                {
                    "file_additions": 3,
                    "file_deletions": 0,
                    "file_exists": false,
                    "file_name": "src/backend/parser/analyze.c",
                    "file_size": 0
                },
                {
                    "file_additions": 141,
                    "file_deletions": 40,
                    "file_exists": false,
                    "file_name": "src/backend/pipeline/cont_analyze.c",
                    "file_size": 0
                },
                {
                    "file_additions": 6,
                    "file_deletions": 0,
                    "file_exists": false,
                    "file_name": "src/backend/utils/adt/ruleutils.c",
                    "file_size": 0
                },
                {
                    "file_additions": 11,
                    "file_deletions": 0,
                    "file_exists": false,
                    "file_name": "src/backend/utils/misc/guc.c",
                    "file_size": 0
                }
            ],
            "interesting": {
                "reopen": false,
                "status": false
            },
            "is_parent": false,
            "sha": "6e91f1e4aa726d27513b4dbe17ef98cdcb8b0698"
        },
        {
            "associated_pull_request": [],
            "date": "2015-09-06 22:01:00",
            "diff": "pipelinedb_pipelinedb/issue_1120/commit_f77f8908f00adf49970b0ffc2c98bc0a7d358928.diff",
            "diff_additions": 225,
            "diff_deletions": 49,
            "diff_file_size": 0,
            "diff_url": "https://github.com/pipelinedb/pipelinedb/commit/f77f8908f00adf49970b0ffc2c98bc0a7d358928.diff",
            "exists": true,
            "files": [
                {
                    "file_additions": 4,
                    "file_deletions": 0,
                    "file_exists": false,
                    "file_name": "src/backend/catalog/dependency.c",
                    "file_size": 0
                },
                {
                    "file_additions": 21,
                    "file_deletions": 0,
                    "file_exists": false,
                    "file_name": "src/backend/catalog/pipeline_query.c",
                    "file_size": 0
                },
                {
                    "file_additions": 38,
                    "file_deletions": 9,
                    "file_exists": false,
                    "file_name": "src/backend/commands/pipelinecmds.c",
                    "file_size": 0
                },
                {
                    "file_additions": 1,
                    "file_deletions": 0,
                    "file_exists": false,
                    "file_name": "src/backend/nodes/makefuncs.c",
                    "file_size": 0
                },
                {
                    "file_additions": 3,
                    "file_deletions": 0,
                    "file_exists": false,
                    "file_name": "src/backend/parser/analyze.c",
                    "file_size": 0
                },
                {
                    "file_additions": 141,
                    "file_deletions": 40,
                    "file_exists": false,
                    "file_name": "src/backend/pipeline/cont_analyze.c",
                    "file_size": 0
                },
                {
                    "file_additions": 6,
                    "file_deletions": 0,
                    "file_exists": false,
                    "file_name": "src/backend/utils/adt/ruleutils.c",
                    "file_size": 0
                },
                {
                    "file_additions": 11,
                    "file_deletions": 0,
                    "file_exists": false,
                    "file_name": "src/backend/utils/misc/guc.c",
                    "file_size": 0
                }
            ],
            "interesting": {
                "reopen": true,
                "status": false
            },
            "is_parent": false,
            "sha": "f77f8908f00adf49970b0ffc2c98bc0a7d358928"
        }
    ],
    "first_commit": "2015-09-05 17:20:35",
    "last_commit": "2015-09-06 22:01:00",
    "number": 1120,
    "pull_request": "None",
    "score": {
        "accidental_reopen_likely": false,
        "all_labels": [
            "performance",
            "sprint",
            "windowing"
        ],
        "contains_keywords": [],
        "fix_size": 276,
        "has_labels": [],
        "intersecting": {
            "computed_score": 1.0,
            "final_commit_size": 266,
            "intersection_size": 266,
            "previous_commits_size": 276
        },
        "is_makefile_based": true,
        "no_new_files": [],
        "no_other_files": false,
        "num_prohibited_files": 147123,
        "prohibited_files": [
            "kill.h",
            "meminfo.h",
            "kill.h",
            "meminfo.h",
            "kill.h",
            "meminfo.h",
            "testsuite_cli_test.go",
            "testsuite_cli_test.go",
            "common.mk",
            "i3bar/include/draw_util.h"
        ],
        "reopen": false,
        "reopen_events": [
            [
                "2015-09-05 20:37:41",
                "commit"
            ],
            [
                "2015-09-05 20:40:33",
                "closed"
            ],
            [
                "2015-09-05 21:19:50",
                "commit"
            ],
            [
                "2015-09-05 22:08:00",
                "commit"
            ],
            [
                "2015-09-06 21:08:53",
                "commit"
            ],
            [
                "2015-09-06 21:25:05",
                "commit"
            ],
            [
                "2015-09-06 21:47:17",
                "commit"
            ],
            [
                "2015-09-06 21:53:57",
                "commit"
            ],
            [
                "2015-09-06 22:01:05",
                "commit"
            ],
            [
                "2015-09-10 23:48:37",
                "reopened"
            ],
            [
                "2015-09-29 18:22:36",
                "closed"
            ]
        ],
        "status": true,
        "strategy": true,
        "total_changes": 1505
    }
}