{
    "covered_issues": [
        477,
        465,
        454,
        446,
        442,
        437,
        436,
        433,
        431,
        428,
        422,
        420,
        419,
        418,
        416,
        413,
        407,
        402,
        395,
        379,
        377,
        370,
        362,
        360,
        338,
        337,
        334,
        331,
        330,
        327,
        313,
        307,
        298,
        289,
        285,
        283,
        282,
        269,
        264,
        262,
        255,
        253,
        248,
        232,
        231,
        224,
        214,
        213,
        210,
        204,
        185,
        182,
        179,
        171,
        170,
        169,
        167,
        156,
        149,
        137,
        135,
        122,
        90,
        81,
        80,
        79,
        78,
        74,
        71,
        65,
        63,
        62,
        50,
        48,
        41,
        37,
        25,
        23,
        22,
        20,
        19,
        4,
        3
    ],
    "finished": true
}