{
    "all_issues": 633,
    "interesting_issues": 1,
    "last_update": "2023-11-02 03:05:54.437238",
    "license": {
        "download": "https://raw.githubusercontent.com/libtom/libtomcrypt/develop/LICENSE",
        "name": "Other"
    },
    "ratio": 0.001579778830963665,
    "size": 22410,
    "stars": 1416,
    "url": "https://github.com/libtom/libtomcrypt"
}