{
    "commits": [
        {
            "diff": "spring-projects_spring-framework/issue_25811/commit_21cb9e8bffd11442469195dc7e0d5cbe5b6e148f.diff",
            "diff_additions": 19,
            "diff_deletions": 4,
            "diff_file_size": 15367,
            "files": [
                {
                    "file_additions": 4,
                    "file_deletions": 2,
                    "file_exists": true,
                    "file_name": "spring-beans/src/main/java/org/springframework/beans/factory/support/CglibSubclassingInstantiationStrategy.java",
                    "file_size": 10049
                },
                {
                    "file_additions": 15,
                    "file_deletions": 2,
                    "file_exists": true,
                    "file_name": "spring-beans/src/test/java/org/springframework/beans/factory/annotation/LookupAnnotationTests.java",
                    "file_size": 5318
                }
            ],
            "interesting": {
                "reopened": false,
                "status": false
            },
            "sha": "21cb9e8bffd11442469195dc7e0d5cbe5b6e148f"
        },
        {
            "diff": "spring-projects_spring-framework/issue_25811/commit_392ad0999076ed1158ba9139a0a71e5a298474de.diff",
            "diff_additions": 1,
            "diff_deletions": 0,
            "diff_file_size": 5285,
            "files": [
                {
                    "file_additions": 1,
                    "file_deletions": 0,
                    "file_exists": true,
                    "file_name": "spring-jdbc/src/main/java/org/springframework/jdbc/core/metadata/CallMetaDataProviderFactory.java",
                    "file_size": 5285
                }
            ],
            "interesting": {
                "reopened": false,
                "status": false
            },
            "sha": "392ad0999076ed1158ba9139a0a71e5a298474de"
        },
        {
            "diff": "spring-projects_spring-framework/issue_25811/commit_e48292fc077711bff8160a3eb67b9e7cfffcb16b.diff",
            "diff_additions": 2,
            "diff_deletions": 0,
            "diff_file_size": 5285,
            "files": [
                {
                    "file_additions": 2,
                    "file_deletions": 0,
                    "file_exists": true,
                    "file_name": "spring-jdbc/src/main/java/org/springframework/jdbc/core/metadata/CallMetaDataProviderFactory.java",
                    "file_size": 5285
                }
            ],
            "interesting": {
                "reopened": true,
                "status": false
            },
            "sha": "e48292fc077711bff8160a3eb67b9e7cfffcb16b"
        },
        {
            "diff": "spring-projects_spring-framework/issue_25811/commit_e028ef81709ec8d8850e2593fb29436aefc51e0f.diff",
            "diff_additions": 1,
            "diff_deletions": 0,
            "diff_file_size": 5285,
            "files": [
                {
                    "file_additions": 1,
                    "file_deletions": 0,
                    "file_exists": true,
                    "file_name": "spring-jdbc/src/main/java/org/springframework/jdbc/core/metadata/CallMetaDataProviderFactory.java",
                    "file_size": 5285
                }
            ],
            "interesting": {
                "reopened": false,
                "status": false
            },
            "sha": "e028ef81709ec8d8850e2593fb29436aefc51e0f"
        }
    ],
    "first_commit": "2020-09-25 09:24:50",
    "last_commit": "2020-09-25 10:47:31",
    "number": 25811,
    "score": 224.14814814814815
}