{
    "covered_issues": [
        589,
        588,
        585,
        571,
        569,
        567,
        566,
        564,
        560,
        548,
        546,
        543,
        542,
        540,
        539,
        538,
        535,
        532,
        526,
        525,
        523,
        521,
        507,
        505,
        501,
        496,
        493,
        486,
        485,
        484,
        482,
        479,
        478,
        476,
        474,
        473,
        467,
        465,
        464,
        463,
        461,
        460,
        459,
        458,
        457,
        451,
        450,
        448,
        442,
        441,
        437,
        435,
        434,
        433,
        430,
        429,
        424,
        423,
        422,
        421,
        410,
        409,
        408,
        403,
        399,
        398,
        397,
        393,
        392,
        391,
        388,
        385,
        384,
        381,
        378,
        376,
        373,
        372,
        366,
        365,
        364,
        363,
        362,
        359,
        358,
        352,
        351,
        349,
        348,
        347,
        346,
        345,
        344,
        343,
        341,
        339,
        337,
        336,
        335,
        332,
        330,
        329,
        326,
        323,
        322,
        321,
        320,
        312,
        328,
        304,
        303,
        298,
        297,
        296,
        295,
        294,
        292,
        291,
        290,
        288,
        287,
        286,
        285,
        284,
        283,
        282,
        281,
        280,
        279,
        278,
        273,
        272,
        271,
        262,
        258,
        256,
        254,
        253,
        252,
        251,
        250,
        249,
        247,
        244,
        243,
        242,
        241,
        239,
        236,
        233,
        232,
        231,
        230,
        229,
        228,
        227,
        226,
        225,
        224,
        223,
        222,
        220,
        219,
        218,
        217,
        216,
        214,
        213,
        211,
        210,
        209,
        208,
        207,
        206,
        205,
        204,
        202,
        201,
        200,
        198,
        196,
        195,
        194,
        193,
        192,
        190,
        189,
        187,
        186,
        184,
        183,
        182,
        180,
        174,
        172,
        171,
        168,
        167,
        166,
        165,
        162,
        160,
        157,
        155,
        150,
        149,
        148,
        147,
        146,
        144,
        143,
        141,
        139,
        136,
        135,
        134,
        133,
        132,
        131,
        130,
        127,
        126,
        124,
        122,
        120,
        119,
        117,
        116,
        113,
        112,
        108,
        107,
        106,
        104,
        102,
        100,
        98,
        97,
        96,
        95,
        94,
        93,
        92,
        91,
        88,
        87,
        86,
        85,
        82,
        81,
        80,
        79,
        78,
        77,
        76,
        75,
        73,
        71,
        68,
        67,
        66,
        65,
        64,
        62,
        61,
        59,
        58,
        55,
        54,
        52,
        48,
        47,
        46,
        45,
        44,
        40,
        39,
        37,
        35,
        32,
        31,
        30,
        29,
        28,
        26,
        25,
        24,
        23,
        19,
        18,
        15,
        14,
        12,
        11,
        9,
        5,
        3,
        2,
        1
    ],
    "finished": true
}