{
    "covered_issues": [
        3296,
        3294,
        3290,
        3278,
        3267,
        3259,
        3256,
        3255,
        3254,
        3253,
        3248,
        3247,
        3246,
        3233,
        3224,
        3220,
        3217,
        3215,
        3213,
        3212,
        3211,
        3210,
        3206,
        3205,
        3203,
        3202,
        3201,
        3194,
        3192,
        3191,
        3190,
        3187,
        3180,
        3177,
        3171,
        3166,
        3163,
        3159,
        3158,
        3152,
        3151,
        3147,
        3146,
        3145,
        3143,
        3142,
        3141,
        3140,
        3139,
        3138,
        3137,
        3136,
        3130,
        3129,
        3123,
        3118,
        3116,
        3114,
        3112,
        3111,
        3104,
        3101,
        3095,
        3092,
        3084,
        3082,
        3070,
        3063,
        3053,
        3050,
        3048,
        3042,
        3035,
        3031,
        3021,
        3020,
        3018,
        3015,
        3014,
        3006,
        3002,
        3001,
        3000,
        2998,
        2997,
        2996,
        2993,
        2992,
        2989,
        2984,
        2983,
        2980,
        2979,
        2974,
        2962,
        2961,
        2960,
        2957,
        2954,
        2953,
        2945,
        2943,
        2942,
        2941,
        2927,
        2925,
        2921,
        2920,
        2915,
        2908,
        2906,
        2897,
        2896,
        2895,
        2888,
        2887,
        2885,
        2883,
        2881,
        2877,
        2876,
        2875,
        2870,
        2866,
        2864,
        2862,
        2860,
        2858,
        2857,
        2855,
        2852,
        2849,
        2846,
        2841,
        2840,
        2834,
        2827,
        2817,
        2813,
        2812,
        2811,
        2808,
        2805,
        2804,
        2803,
        2798,
        2796,
        2795,
        2794,
        2793,
        2790,
        2786,
        2785,
        2784,
        2779,
        2778,
        2775,
        2767,
        2766,
        2764,
        2755,
        2752,
        2749,
        2746,
        2744,
        2738,
        2737,
        2730,
        2729,
        2725,
        2724,
        2714,
        2712,
        2708,
        2698,
        2697,
        2696,
        2691,
        2689,
        2681,
        2680,
        2675,
        2672,
        2671,
        2670,
        2669,
        2668,
        2667,
        2666,
        2665,
        2664,
        2663,
        2662,
        2616,
        2615,
        2614,
        2613,
        2612,
        2611,
        2610,
        2609,
        2608,
        2577,
        2576,
        2575,
        2574,
        2573,
        2572,
        2571,
        2570,
        2569,
        2568,
        2567,
        2521,
        2520,
        2519,
        2518,
        2517,
        2516,
        2515,
        2514,
        2513,
        2481,
        2480,
        2479,
        2478,
        2477,
        2476,
        2475,
        2474,
        2473,
        2472,
        2471,
        2460,
        2458,
        2456,
        2452,
        2449,
        2445,
        2444,
        2443,
        2442,
        2440,
        2439,
        2437,
        2435,
        2434,
        2432,
        2431,
        2430,
        2429,
        2428,
        2427,
        2426,
        2425,
        2424,
        2423,
        2422,
        2421,
        2420,
        2419,
        2418,
        2417,
        2415,
        2414,
        2412,
        2411,
        2410,
        2408,
        2402,
        2401,
        2400,
        2399,
        2398,
        2397,
        2396,
        2395,
        2394,
        2390,
        2389,
        2388,
        2387,
        2383,
        2381,
        2379,
        2377,
        2376,
        2374,
        2373,
        2372,
        2371,
        2370,
        2369,
        2368,
        2366,
        2365,
        2364,
        2362,
        2361,
        2359,
        2358,
        2357,
        2356,
        2354,
        2353,
        2352,
        2351,
        2350,
        2349,
        2348,
        2347,
        2344,
        2343,
        2342,
        2341,
        2340,
        2338,
        2334,
        2333,
        2324,
        2321,
        2317,
        2316,
        2314,
        2313,
        2312,
        2311,
        2309,
        2307,
        2305,
        2302,
        2301,
        2299,
        2288,
        2286,
        2285,
        2283,
        2281,
        2279,
        2278,
        2273,
        2265,
        2260,
        2259,
        2257,
        2256,
        2254,
        2253,
        2252,
        2250,
        2247,
        2246,
        2243,
        2241,
        2239,
        2235,
        2229,
        2222,
        2213,
        2211,
        2209,
        2208,
        2207,
        2205,
        2204,
        2198,
        2193,
        2189,
        2188,
        2187,
        2183,
        2181,
        2179,
        2178,
        2176,
        2171,
        2169,
        2167,
        2164,
        2163,
        2159,
        2158,
        2157,
        2155,
        2148,
        2141,
        2135,
        2133,
        2129,
        2125,
        2122,
        2121,
        2120,
        2116,
        2115,
        2113,
        2111,
        2110,
        2108,
        2107,
        2105,
        2104,
        2102,
        2101,
        2099,
        2097,
        2092,
        2091,
        2089,
        2088,
        2085,
        2083,
        2080,
        2078,
        2072,
        2071,
        2068,
        2065,
        2063,
        2062,
        2061,
        2060,
        2059,
        2058,
        2057,
        2056,
        2055,
        2054,
        2053,
        2051,
        2050,
        2049,
        2047,
        2046,
        2043,
        2042,
        2041,
        2037,
        2036,
        2033,
        2029,
        2028,
        2027,
        2026,
        2024,
        2023,
        2022,
        2017,
        2012,
        2011,
        2009,
        2008,
        2007,
        2003,
        2001,
        2000,
        1998,
        1989,
        1987,
        1984,
        1983,
        1982,
        1979,
        1978,
        1976,
        1975,
        1972,
        1971,
        1965,
        1964,
        1962,
        1961,
        1959,
        1958,
        1956,
        1955,
        1954,
        1953,
        1949,
        1948,
        1947,
        1943,
        1942,
        1937,
        1935,
        1933,
        1932,
        1931,
        1930,
        1924,
        1923,
        1921,
        1920,
        1919,
        1917,
        1916,
        1915,
        1913,
        1912,
        1910,
        1909,
        1908,
        1901,
        1897,
        1896,
        1895,
        1894,
        1893,
        1892,
        1891,
        1887,
        1886,
        1885,
        1884,
        1883,
        1878,
        1872,
        1871,
        1869,
        1868,
        1867,
        1864,
        1862,
        1861,
        1858,
        1855,
        1854,
        1853,
        1851,
        1849,
        1844,
        1843,
        1842,
        1841,
        1840,
        1838,
        1837,
        1836,
        1835,
        1828,
        1827,
        1823,
        1820,
        1819,
        1817,
        1811,
        1809,
        1808,
        1806,
        1805,
        1803,
        1802,
        1800,
        1793,
        1785,
        1782,
        1781,
        1774,
        1773,
        1770,
        1768,
        1765,
        1760,
        1759,
        1758,
        1757,
        1756,
        1755,
        1749,
        1744,
        1742,
        1740,
        1738,
        1735,
        1730,
        1727,
        1724,
        1722,
        1717,
        1714,
        1712,
        1709,
        1708,
        1706,
        1704,
        1703,
        1698,
        1697,
        1695,
        1694,
        1691,
        1689,
        1687,
        1686,
        1683,
        1679,
        1678,
        1677,
        1676,
        1674,
        1662,
        1661,
        1660,
        1659,
        1658,
        1657,
        1655,
        1652,
        1649,
        1647,
        1641,
        1635,
        1632,
        1631,
        1629,
        1628,
        1623,
        1621,
        1617,
        1614,
        1611,
        1606,
        1605,
        1602,
        1601,
        1599,
        1597,
        1596,
        1592,
        1584,
        1577,
        1571,
        1561,
        1557,
        1556,
        1547,
        1540,
        1539,
        1535,
        1532,
        1530,
        1523,
        1520,
        1519,
        1518,
        1517,
        1510,
        1496,
        1492,
        1490,
        1488,
        1485,
        1482,
        1481,
        1480,
        1478,
        1477,
        1475,
        1472,
        1469,
        1467,
        1463,
        1462,
        1458,
        1457,
        1453,
        1452,
        1450,
        1449,
        1444,
        1442,
        1433,
        1423,
        1420,
        1417,
        1416,
        1415,
        1405,
        1399,
        1398,
        1389,
        1381,
        1380,
        1376,
        1371,
        1368,
        1365,
        1364,
        1359,
        1356,
        1349,
        1348,
        1342,
        1340,
        1339,
        1338,
        1336,
        1327,
        1326,
        1323,
        1321,
        1317,
        1315,
        1313,
        1311,
        1308,
        1307,
        1306,
        1302,
        1297,
        1296,
        1294,
        1291,
        1289,
        1288,
        1287,
        1286,
        1285,
        1283,
        1281,
        1278,
        1272,
        1271,
        1266,
        1264,
        1262,
        1260,
        1259,
        1257,
        1249,
        1247,
        1242,
        1241,
        1238,
        1237,
        1236,
        1233,
        1229,
        1217,
        1216,
        1212,
        1206,
        1202,
        1200,
        1195,
        1194,
        1193,
        1192,
        1191,
        1189,
        1184,
        1183,
        1182,
        1179,
        1178,
        1176,
        1175,
        1174,
        1171,
        1169,
        1168,
        1166,
        1165,
        1163,
        1160,
        1159,
        1158,
        1155,
        1151,
        1150,
        1149,
        1148,
        1147,
        1146,
        1142,
        1139,
        1137,
        1134,
        1129,
        1128,
        1125,
        1123,
        1122,
        1119,
        1118,
        1117,
        1114,
        1113,
        1108,
        1106,
        1099,
        1097,
        1095,
        1093,
        1091,
        1089,
        1087,
        1086,
        1083,
        1082,
        1080,
        1079,
        1073,
        1072,
        1067,
        1064,
        1061,
        1060,
        1057,
        1051,
        1050,
        1049,
        1048,
        1047,
        1045,
        1042,
        1041,
        1040,
        1039,
        1037,
        1036,
        1034,
        1031,
        1025,
        1023,
        1021,
        1019,
        1016,
        1011,
        1005,
        1004,
        999,
        996,
        995,
        993,
        992,
        990,
        988,
        985,
        983,
        976,
        974,
        971,
        967,
        966,
        960,
        957,
        956,
        955,
        951,
        946,
        941,
        934,
        933,
        932,
        929,
        928,
        926,
        925,
        917,
        916,
        915,
        914,
        910,
        909,
        908,
        902,
        901,
        896,
        895,
        892,
        888,
        887,
        886,
        883,
        880,
        877,
        876,
        875,
        874,
        873,
        872,
        870,
        869,
        868,
        867,
        866,
        865,
        864,
        863,
        862,
        861,
        860,
        859,
        858,
        857,
        856,
        855,
        854,
        853,
        852,
        851,
        850,
        849,
        848,
        847,
        846,
        845,
        844,
        843,
        842,
        841,
        840,
        839,
        838,
        837,
        836,
        835,
        834,
        833,
        832,
        831,
        830,
        829,
        828,
        827,
        826,
        825,
        824,
        823,
        822,
        821,
        820,
        819,
        818,
        817,
        816,
        815,
        814,
        813,
        812,
        811,
        810,
        809,
        808,
        807,
        806,
        805,
        804,
        803,
        802,
        801,
        800,
        799,
        798,
        797,
        796,
        795,
        794,
        793,
        792,
        791,
        790,
        789,
        788,
        787,
        786,
        785,
        784,
        783,
        782,
        781,
        778,
        777,
        774,
        771,
        769,
        764,
        760,
        756,
        755,
        753,
        752,
        749,
        745,
        743,
        742,
        741,
        737,
        731,
        730,
        729,
        726,
        719,
        711,
        710,
        709,
        707,
        706,
        705,
        691,
        690,
        687,
        684,
        680,
        670,
        664,
        654,
        648,
        647,
        646,
        642,
        639,
        638,
        637,
        636,
        635,
        634,
        628,
        622,
        621,
        616,
        607,
        606,
        605,
        604,
        603,
        602,
        601,
        589,
        587,
        586,
        583,
        582,
        580,
        561,
        557,
        554,
        551,
        532,
        527,
        525,
        520,
        518,
        515,
        514,
        513,
        512,
        510,
        509,
        508,
        507,
        506,
        505,
        504,
        500,
        495,
        494,
        492,
        489,
        486,
        484,
        483,
        480,
        479,
        469,
        468,
        463,
        462,
        461,
        460,
        450,
        445,
        444,
        441,
        440,
        439,
        438,
        434,
        432,
        425,
        422,
        421,
        407,
        406,
        404,
        402,
        392,
        390,
        388,
        387,
        386,
        383,
        382,
        380,
        378,
        375,
        369,
        368,
        367,
        366,
        364,
        361,
        358,
        351,
        350,
        348,
        335,
        325,
        323,
        321,
        313,
        311,
        308,
        307,
        303,
        297,
        296,
        294,
        292,
        287,
        280,
        277,
        267,
        265,
        262,
        261,
        260,
        258,
        255,
        254,
        253,
        251,
        250,
        249,
        237,
        229,
        228,
        225,
        222,
        220,
        218,
        216,
        214,
        211,
        206,
        203,
        202,
        199,
        197,
        194,
        191,
        189,
        187,
        186,
        185,
        184,
        179,
        178,
        175,
        174,
        173,
        172,
        171,
        170,
        169,
        168,
        167,
        166,
        165,
        164,
        163,
        162,
        161,
        160,
        159,
        158,
        157,
        156,
        155,
        154,
        153,
        152,
        151,
        150,
        149,
        148,
        147,
        146,
        142,
        141,
        140,
        137,
        131,
        126,
        125,
        124,
        122,
        120,
        119,
        118,
        117,
        111,
        106,
        101,
        100,
        98,
        97,
        94,
        93,
        90,
        88,
        87,
        86,
        83,
        81,
        80,
        76,
        72,
        71,
        69,
        67,
        66,
        65,
        64,
        62,
        60,
        58,
        57,
        56,
        55,
        54,
        51,
        49,
        47,
        44,
        43,
        42,
        41,
        37,
        34,
        33,
        31,
        28,
        26,
        23,
        21,
        19,
        18,
        17,
        14,
        13,
        12,
        11,
        8,
        7,
        6,
        5,
        4,
        3,
        2,
        1
    ],
    "finished": true
}