{
    "covered_issues": [
        477,
        474,
        470,
        469,
        461,
        452,
        449,
        438,
        437,
        436,
        435,
        431,
        430,
        428,
        427,
        426,
        424,
        419,
        418,
        417,
        416,
        413,
        411,
        409,
        408,
        407,
        406,
        403,
        402,
        401,
        400,
        399,
        398,
        397,
        396,
        394,
        393,
        392,
        390,
        389,
        388,
        387,
        386,
        384,
        383,
        382,
        381,
        379,
        378,
        377,
        374,
        373,
        372,
        371,
        370,
        369,
        368,
        367,
        366,
        365,
        364,
        363,
        361,
        360,
        359,
        355,
        354,
        351,
        350,
        349,
        348,
        347,
        345,
        336,
        335,
        334,
        333,
        332,
        331,
        330,
        328,
        327,
        326,
        325,
        324,
        323,
        322,
        321,
        320,
        319,
        318,
        314,
        313,
        311,
        310,
        309,
        308,
        307,
        305,
        304,
        303,
        301,
        300,
        299,
        298,
        297,
        295,
        294,
        293,
        291,
        290,
        289,
        288,
        286,
        285,
        283,
        281,
        280,
        279,
        278,
        277,
        276,
        274,
        273,
        272,
        271,
        270,
        269,
        268,
        267,
        266,
        265,
        264,
        262,
        261,
        260,
        259,
        258,
        257,
        255,
        253,
        251,
        250,
        249,
        248,
        245,
        241,
        240,
        239,
        238,
        236,
        235,
        234,
        233,
        232,
        231,
        230,
        228,
        227,
        226,
        225,
        224,
        223,
        221,
        219,
        218,
        217,
        216,
        215,
        214,
        212,
        211,
        210,
        207,
        206,
        204,
        202,
        201,
        200,
        199,
        198,
        197,
        196,
        193,
        191,
        190,
        189,
        187,
        186,
        184,
        183,
        182,
        181,
        180,
        179,
        174,
        173,
        172,
        171,
        170,
        169,
        168,
        166,
        165,
        163,
        162,
        161,
        160,
        157,
        156,
        155,
        152,
        151,
        147,
        146,
        145,
        144,
        142,
        138,
        137,
        136,
        135,
        132,
        130,
        122,
        121,
        120,
        119,
        118,
        115,
        114,
        113,
        111,
        110,
        108,
        107,
        106,
        105,
        104,
        102,
        100,
        98,
        97,
        96,
        94,
        93,
        89,
        85,
        79,
        78,
        74,
        70,
        69,
        68,
        67,
        66,
        64,
        63,
        59,
        56,
        54,
        49,
        44,
        40,
        39,
        38,
        37,
        36,
        34,
        33,
        31,
        28,
        27,
        18,
        17,
        16,
        15,
        14,
        13,
        12,
        9,
        8,
        7,
        5,
        4,
        3,
        2,
        1
    ],
    "finished": true
}