{
    "covered_issues": [
        43,
        41,
        40,
        39,
        38,
        37,
        34,
        33,
        31,
        29,
        27,
        26,
        25,
        24,
        23,
        22,
        21,
        20,
        19,
        18,
        16,
        14,
        13,
        12,
        11,
        10,
        9,
        8,
        7,
        6,
        5,
        4,
        3
    ],
    "finished": true
}