{
    "covered_issues": [
        1737,
        1722,
        1718,
        1713,
        1704,
        1701,
        1697,
        1677,
        1675,
        1674,
        1671,
        1670,
        1658,
        1642,
        1626,
        1625,
        1617,
        1610,
        1607,
        1605,
        1604,
        1601,
        1598,
        1589,
        1586,
        1583,
        1578,
        1569,
        1567,
        1560,
        1555,
        1554,
        1548,
        1545,
        1544,
        1531,
        1529,
        1528,
        1525,
        1524,
        1503,
        1500,
        1498,
        1495,
        1489,
        1473,
        1472,
        1464,
        1463,
        1460,
        1459,
        1456,
        1451,
        1446,
        1440,
        1434,
        1427,
        1425,
        1419,
        1418,
        1416,
        1397,
        1385,
        1364,
        1355,
        1350,
        1347,
        1344,
        1342,
        1324,
        1311,
        1310,
        1308,
        1307,
        1304,
        1290,
        1277,
        1267,
        1265,
        1261,
        1260,
        1253,
        1245,
        1243,
        1241,
        1240,
        1235,
        1227,
        1215,
        1213,
        1211,
        1198,
        1197,
        1194,
        1190,
        1186,
        1185,
        1177,
        1174,
        1166,
        1160,
        1150,
        1145,
        1138,
        1137,
        1119,
        1117,
        1116,
        1109,
        1102,
        1098,
        1091,
        1088,
        1087,
        1086,
        1080,
        1077,
        1063,
        1057,
        1056,
        1054,
        1053,
        1052,
        1046,
        1042,
        1041,
        1034,
        1031,
        1028,
        1026,
        1025,
        1022,
        1013,
        1012,
        1010,
        1007,
        1005,
        994,
        987,
        973,
        964,
        955,
        953,
        952,
        950,
        949,
        948,
        947,
        946,
        944,
        940,
        935,
        932,
        930,
        929,
        926,
        917,
        915,
        913,
        904,
        902,
        894,
        892,
        878,
        873,
        866,
        857,
        854,
        837,
        827,
        824,
        823,
        819,
        817,
        816,
        813,
        807,
        800,
        799,
        797,
        791,
        787,
        785,
        781,
        779,
        772,
        758,
        756,
        752,
        749,
        737,
        736,
        731,
        718,
        716,
        715,
        714,
        699,
        697,
        695,
        694,
        693,
        692,
        691,
        690,
        689,
        684,
        681,
        680,
        679,
        678,
        672,
        671,
        668,
        666,
        664,
        659,
        655,
        653,
        646,
        644,
        643,
        641,
        633,
        629,
        622,
        621,
        618,
        614,
        607,
        596,
        592,
        590,
        585,
        581,
        577,
        574,
        571,
        570,
        561,
        558,
        552,
        548,
        547,
        540,
        529,
        523,
        518,
        512,
        503,
        498,
        497,
        496,
        491,
        488,
        486,
        483,
        479,
        475,
        473,
        466,
        465,
        459,
        457,
        454,
        453,
        452,
        447,
        446,
        445,
        442,
        439,
        438,
        430,
        428,
        427,
        420,
        419,
        418,
        417,
        416,
        413,
        412,
        410,
        407,
        406,
        404,
        400,
        395,
        394,
        392,
        391,
        387,
        385,
        383,
        381,
        375,
        373,
        372,
        369,
        366,
        364,
        361,
        360,
        356,
        354,
        353,
        352,
        350,
        348,
        346,
        345,
        342,
        340,
        339,
        332,
        329,
        327,
        326,
        325,
        323,
        321,
        320,
        317,
        315,
        314,
        313,
        312,
        308,
        306,
        305,
        303,
        302,
        300,
        298,
        295,
        294,
        293,
        292,
        291,
        289,
        288,
        287,
        286,
        285,
        282,
        281,
        279,
        275,
        274,
        273,
        267,
        266,
        265,
        264,
        262,
        261,
        259,
        258,
        256,
        252,
        251,
        250,
        249,
        248,
        245,
        243,
        242,
        241,
        239,
        238,
        237,
        236,
        235,
        233,
        232,
        231,
        230,
        228,
        227,
        226,
        224,
        222,
        221,
        220,
        219,
        218,
        216,
        215,
        214,
        213,
        212,
        211,
        208,
        207,
        204,
        203,
        202,
        201,
        200,
        198,
        197,
        196,
        195,
        194,
        193,
        192,
        191,
        190,
        189,
        187,
        185,
        184,
        183,
        181,
        176,
        173,
        172,
        171,
        170,
        168,
        167,
        166,
        165,
        164,
        161,
        160,
        158,
        157,
        156,
        155,
        154,
        153,
        151,
        145,
        144,
        142,
        140,
        138,
        137,
        136,
        133,
        132,
        131,
        130,
        128,
        127,
        124,
        122,
        121,
        119,
        118,
        115,
        113,
        112,
        111,
        110,
        109,
        107,
        106,
        105,
        103,
        102,
        101,
        100,
        98,
        97,
        96,
        95,
        93,
        92,
        91,
        90,
        89,
        88,
        87,
        86,
        85,
        84,
        83,
        82,
        81,
        80,
        79,
        78,
        77,
        76,
        74,
        73,
        72,
        71,
        70,
        69,
        68,
        66,
        65,
        64,
        62,
        61,
        60,
        59,
        58,
        57,
        56,
        54,
        53,
        52,
        50,
        48,
        47,
        46,
        45,
        44,
        41,
        39,
        38,
        37,
        36,
        35,
        34,
        33,
        32,
        31,
        30,
        29,
        28,
        26,
        25,
        24,
        23,
        22,
        20,
        19,
        18,
        17,
        16,
        15,
        14,
        12,
        11,
        10,
        9,
        8,
        7,
        6,
        5,
        4,
        3,
        2,
        1
    ],
    "finished": true
}