{
    "covered_issues": [
        35,
        34,
        32,
        31,
        30,
        29,
        27,
        25,
        23,
        22,
        21,
        20,
        19,
        18,
        17,
        16,
        14,
        13,
        11,
        10,
        8,
        7,
        6,
        5,
        4
    ],
    "finished": true
}