{
    "commits": [
        {
            "diff": "elastic_elasticsearch/issue_57662/commit_7425edda31ed5301da40cdc99d1732a1ff067dfd.diff",
            "diff_additions": 5,
            "diff_deletions": 73,
            "diff_file_size": 193998,
            "files": [
                {
                    "file_additions": 2,
                    "file_deletions": 71,
                    "file_exists": true,
                    "file_name": "server/src/main/java/org/elasticsearch/cluster/metadata/MetadataCreateIndexService.java",
                    "file_size": 68751
                },
                {
                    "file_additions": 1,
                    "file_deletions": 2,
                    "file_exists": true,
                    "file_name": "server/src/main/java/org/elasticsearch/cluster/metadata/MetadataIndexTemplateService.java",
                    "file_size": 72521
                },
                {
                    "file_additions": 2,
                    "file_deletions": 0,
                    "file_exists": true,
                    "file_name": "server/src/test/java/org/elasticsearch/cluster/metadata/MetadataCreateIndexServiceTests.java",
                    "file_size": 52726
                }
            ],
            "interesting": {
                "reopened": false,
                "status": false
            },
            "sha": "7425edda31ed5301da40cdc99d1732a1ff067dfd"
        },
        {
            "diff": "elastic_elasticsearch/issue_57662/commit_69b9a92dfbe49246330c304105b7d051575957eb.diff",
            "diff_additions": 41,
            "diff_deletions": 6,
            "diff_file_size": 162451,
            "files": [
                {
                    "file_additions": 17,
                    "file_deletions": 6,
                    "file_exists": true,
                    "file_name": "server/src/main/java/org/elasticsearch/cluster/metadata/MetadataIndexTemplateService.java",
                    "file_size": 72521
                },
                {
                    "file_additions": 24,
                    "file_deletions": 0,
                    "file_exists": true,
                    "file_name": "server/src/test/java/org/elasticsearch/cluster/metadata/MetadataIndexTemplateServiceTests.java",
                    "file_size": 89930
                }
            ],
            "interesting": {
                "reopened": false,
                "status": true
            },
            "sha": "69b9a92dfbe49246330c304105b7d051575957eb"
        },
        {
            "diff": "elastic_elasticsearch/issue_57662/commit_08fc2ca96e8290b28090e1f2f84c3a9d67e7789d.diff",
            "diff_additions": 39,
            "diff_deletions": 6,
            "diff_file_size": 162451,
            "files": [
                {
                    "file_additions": 17,
                    "file_deletions": 6,
                    "file_exists": true,
                    "file_name": "server/src/main/java/org/elasticsearch/cluster/metadata/MetadataIndexTemplateService.java",
                    "file_size": 72521
                },
                {
                    "file_additions": 22,
                    "file_deletions": 0,
                    "file_exists": true,
                    "file_name": "server/src/test/java/org/elasticsearch/cluster/metadata/MetadataIndexTemplateServiceTests.java",
                    "file_size": 89930
                }
            ],
            "interesting": {
                "reopened": false,
                "status": false
            },
            "sha": "08fc2ca96e8290b28090e1f2f84c3a9d67e7789d"
        },
        {
            "diff": "elastic_elasticsearch/issue_57662/commit_cc21afc4b17a4a5a5b2052b679cc611f043d430a.diff",
            "diff_additions": 39,
            "diff_deletions": 6,
            "diff_file_size": 162451,
            "files": [
                {
                    "file_additions": 17,
                    "file_deletions": 6,
                    "file_exists": true,
                    "file_name": "server/src/main/java/org/elasticsearch/cluster/metadata/MetadataIndexTemplateService.java",
                    "file_size": 72521
                },
                {
                    "file_additions": 22,
                    "file_deletions": 0,
                    "file_exists": true,
                    "file_name": "server/src/test/java/org/elasticsearch/cluster/metadata/MetadataIndexTemplateServiceTests.java",
                    "file_size": 89930
                }
            ],
            "interesting": {
                "reopened": false,
                "status": true
            },
            "sha": "cc21afc4b17a4a5a5b2052b679cc611f043d430a"
        },
        {
            "diff": "elastic_elasticsearch/issue_57662/commit_552ca0f1336284e5927cf244541eb14cb4732e0a.diff",
            "diff_additions": 39,
            "diff_deletions": 6,
            "diff_file_size": 162451,
            "files": [
                {
                    "file_additions": 17,
                    "file_deletions": 6,
                    "file_exists": true,
                    "file_name": "server/src/main/java/org/elasticsearch/cluster/metadata/MetadataIndexTemplateService.java",
                    "file_size": 72521
                },
                {
                    "file_additions": 22,
                    "file_deletions": 0,
                    "file_exists": true,
                    "file_name": "server/src/test/java/org/elasticsearch/cluster/metadata/MetadataIndexTemplateServiceTests.java",
                    "file_size": 89930
                }
            ],
            "interesting": {
                "reopened": true,
                "status": false
            },
            "sha": "552ca0f1336284e5927cf244541eb14cb4732e0a"
        },
        {
            "diff": "elastic_elasticsearch/issue_57662/commit_afa77e5be9b5a53ab71daba3a7c7ce35c794f267.diff",
            "diff_additions": 27,
            "diff_deletions": 1,
            "diff_file_size": 162451,
            "files": [
                {
                    "file_additions": 5,
                    "file_deletions": 0,
                    "file_exists": true,
                    "file_name": "server/src/main/java/org/elasticsearch/cluster/metadata/MetadataIndexTemplateService.java",
                    "file_size": 72521
                },
                {
                    "file_additions": 22,
                    "file_deletions": 1,
                    "file_exists": true,
                    "file_name": "server/src/test/java/org/elasticsearch/cluster/metadata/MetadataIndexTemplateServiceTests.java",
                    "file_size": 89930
                }
            ],
            "interesting": {
                "reopened": false,
                "status": true
            },
            "sha": "afa77e5be9b5a53ab71daba3a7c7ce35c794f267"
        },
        {
            "diff": "elastic_elasticsearch/issue_57662/commit_b323d4c872195d3e4eac8efd494b7f1e0cef28cb.diff",
            "diff_additions": 30,
            "diff_deletions": 2,
            "diff_file_size": 182448,
            "files": [
                {
                    "file_additions": 3,
                    "file_deletions": 1,
                    "file_exists": true,
                    "file_name": "server/src/main/java/org/elasticsearch/cluster/metadata/IndexTemplateMetadata.java",
                    "file_size": 19997
                },
                {
                    "file_additions": 5,
                    "file_deletions": 0,
                    "file_exists": true,
                    "file_name": "server/src/main/java/org/elasticsearch/cluster/metadata/MetadataIndexTemplateService.java",
                    "file_size": 72521
                },
                {
                    "file_additions": 22,
                    "file_deletions": 1,
                    "file_exists": true,
                    "file_name": "server/src/test/java/org/elasticsearch/cluster/metadata/MetadataIndexTemplateServiceTests.java",
                    "file_size": 89930
                }
            ],
            "interesting": {
                "reopened": false,
                "status": false
            },
            "sha": "b323d4c872195d3e4eac8efd494b7f1e0cef28cb"
        },
        {
            "diff": "elastic_elasticsearch/issue_57662/commit_5539260bbab7df623926fb6a184ff1e44b1ccaa5.diff",
            "diff_additions": 30,
            "diff_deletions": 2,
            "diff_file_size": 182448,
            "files": [
                {
                    "file_additions": 3,
                    "file_deletions": 1,
                    "file_exists": true,
                    "file_name": "server/src/main/java/org/elasticsearch/cluster/metadata/IndexTemplateMetadata.java",
                    "file_size": 19997
                },
                {
                    "file_additions": 5,
                    "file_deletions": 0,
                    "file_exists": true,
                    "file_name": "server/src/main/java/org/elasticsearch/cluster/metadata/MetadataIndexTemplateService.java",
                    "file_size": 72521
                },
                {
                    "file_additions": 22,
                    "file_deletions": 1,
                    "file_exists": true,
                    "file_name": "server/src/test/java/org/elasticsearch/cluster/metadata/MetadataIndexTemplateServiceTests.java",
                    "file_size": 89930
                }
            ],
            "interesting": {
                "reopened": false,
                "status": true
            },
            "sha": "5539260bbab7df623926fb6a184ff1e44b1ccaa5"
        }
    ],
    "first_commit": "2020-06-08 19:43:53",
    "last_commit": "2020-11-02 17:57:09",
    "number": 57662,
    "score": 208.01136363636363
}