{
    "all_issues": 1263,
    "interesting_issues": 4,
    "last_update": "2021-05-17 02:46:15.563482",
    "license": {
        "download": "https://raw.githubusercontent.com/namhyung/uftrace/master/COPYING",
        "name": "GNU General Public License v2.0"
    },
    "ratio": 0.003167062549485352,
    "size": 6803,
    "stars": 1814,
    "url": "https://github.com/namhyung/uftrace"
}