{
    "category": [
        "memory",
        "build/refactor/preprocessing"
    ],
    "commits": [
        {
            "associated_pull_request": [],
            "date": "2015-03-16 01:52:26",
            "diff": "radareorg_radare2/issue_2185/commit_d99176993563ba506b9a7775b070cc32441e5b29.diff",
            "diff_additions": 310,
            "diff_deletions": 196,
            "diff_file_size": 777844,
            "diff_url": "https://github.com/radareorg/radare2/commit/d99176993563ba506b9a7775b070cc32441e5b29.diff",
            "exists": true,
            "files": [
                {
                    "file_additions": 1,
                    "file_deletions": 1,
                    "file_exists": true,
                    "file_name": "libr/anal/anal.c",
                    "file_size": 18309
                },
                {
                    "file_additions": 38,
                    "file_deletions": 16,
                    "file_exists": true,
                    "file_name": "libr/anal/fcn.c",
                    "file_size": 71202
                },
                {
                    "file_additions": 2,
                    "file_deletions": 1,
                    "file_exists": true,
                    "file_name": "libr/anal/var.c",
                    "file_size": 42844
                },
                {
                    "file_additions": 5,
                    "file_deletions": 2,
                    "file_exists": false,
                    "file_name": "libr/core/anal.c",
                    "file_size": 0
                },
                {
                    "file_additions": 13,
                    "file_deletions": 7,
                    "file_exists": true,
                    "file_name": "libr/core/cmd_anal.c",
                    "file_size": 315895
                },
                {
                    "file_additions": 3,
                    "file_deletions": 0,
                    "file_exists": false,
                    "file_name": "libr/core/config.c",
                    "file_size": 0
                },
                {
                    "file_additions": 49,
                    "file_deletions": 0,
                    "file_exists": true,
                    "file_name": "libr/core/core.c",
                    "file_size": 110906
                },
                {
                    "file_additions": 185,
                    "file_deletions": 168,
                    "file_exists": true,
                    "file_name": "libr/core/disasm.c",
                    "file_size": 192557
                },
                {
                    "file_additions": 13,
                    "file_deletions": 0,
                    "file_exists": true,
                    "file_name": "shlr/sdb/src/ls.c",
                    "file_size": 7067
                },
                {
                    "file_additions": 1,
                    "file_deletions": 1,
                    "file_exists": true,
                    "file_name": "shlr/sdb/src/query.c",
                    "file_size": 19064
                }
            ],
            "interesting": {
                "reopen": false,
                "status": false
            },
            "is_parent": true,
            "sha": "d99176993563ba506b9a7775b070cc32441e5b29"
        },
        {
            "associated_pull_request": [],
            "date": "2015-03-16 02:11:39",
            "diff": "radareorg_radare2/issue_2185/commit_ce797309f5d515ff483b4d983e65ff8b6b4f9a24.diff",
            "diff_additions": 3,
            "diff_deletions": 1,
            "diff_file_size": 15144,
            "diff_url": "https://github.com/radareorg/radare2/commit/ce797309f5d515ff483b4d983e65ff8b6b4f9a24.diff",
            "exists": true,
            "files": [
                {
                    "file_additions": 3,
                    "file_deletions": 1,
                    "file_exists": true,
                    "file_name": "libr/io/p/io_debug.c",
                    "file_size": 15144
                }
            ],
            "interesting": {
                "reopen": true,
                "status": false
            },
            "is_parent": false,
            "sha": "ce797309f5d515ff483b4d983e65ff8b6b4f9a24"
        },
        {
            "associated_pull_request": [],
            "date": "2015-03-22 21:41:46",
            "diff": "radareorg_radare2/issue_2185/commit_b14bfc0be280d65437950a74a9b4f2604fea20ff.diff",
            "diff_additions": 25,
            "diff_deletions": 8,
            "diff_file_size": 135450,
            "diff_url": "https://github.com/radareorg/radare2/commit/b14bfc0be280d65437950a74a9b4f2604fea20ff.diff",
            "exists": true,
            "files": [
                {
                    "file_additions": 9,
                    "file_deletions": 1,
                    "file_exists": true,
                    "file_name": "libr/io/p/io_debug.c",
                    "file_size": 15144
                },
                {
                    "file_additions": 11,
                    "file_deletions": 3,
                    "file_exists": true,
                    "file_name": "libr/io/p/io_ptrace.c",
                    "file_size": 8982
                },
                {
                    "file_additions": 3,
                    "file_deletions": 1,
                    "file_exists": true,
                    "file_name": "libr/util/file.c",
                    "file_size": 30029
                },
                {
                    "file_additions": 2,
                    "file_deletions": 3,
                    "file_exists": true,
                    "file_name": "libr/util/str.c",
                    "file_size": 81295
                }
            ],
            "interesting": {
                "reopen": false,
                "status": false
            },
            "is_parent": false,
            "sha": "b14bfc0be280d65437950a74a9b4f2604fea20ff"
        }
    ],
    "first_commit": "2015-03-16 01:52:26",
    "last_commit": "2015-03-22 21:41:46",
    "number": 2185,
    "pull_request": "None",
    "score": {
        "accidental_reopen_likely": false,
        "all_labels": [
            "bug"
        ],
        "contains_keywords": [
            "fail",
            "confirm",
            "bug",
            "crash",
            "fix",
            "fault",
            "debug"
        ],
        "fix_size": 34,
        "has_labels": [
            "bug"
        ],
        "intersecting": {
            "computed_score": 0.03225806451612903,
            "final_commit_size": 31,
            "intersection_size": 1,
            "previous_commits_size": 4
        },
        "is_makefile_based": true,
        "no_new_files": [
            "libr/io/p/io_ptrace.c",
            "libr/util/file.c",
            "libr/util/str.c"
        ],
        "no_other_files": false,
        "num_prohibited_files": 45540,
        "prohibited_files": [
            "hal/inc/pinmap_hal.h",
            "Debug/marvin.bin",
            "Debug/marvin.elf",
            "Debug/marvin.hex",
            "Debug/marvin.bin",
            "Debug/marvin.elf",
            "Debug/marvin.hex",
            "inc/spark_utilities.h",
            "Debug/marvin.bin",
            "Debug/marvin.elf"
        ],
        "reopen": true,
        "reopen_events": [
            [
                "2015-03-16 02:12:12",
                "closed"
            ],
            [
                "2015-03-16 02:12:12",
                "commit"
            ],
            [
                "2015-03-16 11:10:08",
                "reopened"
            ],
            [
                "2015-03-22 21:50:18",
                "closed"
            ],
            [
                "2015-03-22 21:50:18",
                "commit"
            ]
        ],
        "status": false,
        "strategy": true,
        "total_changes": 543
    }
}