{
    "covered_issues": [
        103,
        99,
        98,
        94,
        90,
        89,
        86,
        85,
        84,
        82,
        81,
        80,
        78,
        76,
        75,
        74,
        72,
        70,
        69,
        68,
        67,
        66,
        64,
        63,
        62,
        61,
        59,
        56,
        55,
        54,
        51,
        50,
        48,
        47,
        46,
        45,
        44,
        43,
        42,
        40,
        39,
        36,
        32,
        30,
        27,
        26,
        25,
        24,
        23,
        22,
        21,
        20,
        18,
        17,
        16,
        15,
        14,
        13,
        12,
        11,
        10,
        9,
        8,
        7,
        6,
        5,
        4,
        3,
        2,
        1
    ],
    "finished": true
}