{
    "category": [
        "hardware/OS"
    ],
    "commits": [
        {
            "associated_pull_request": [],
            "date": "2018-12-28 15:21:16",
            "diff": "flatpak_flatpak/issue_2495/commit_66544d28a6d9c247289c0ea6df906b454df9c027.diff",
            "diff_additions": 16,
            "diff_deletions": 10,
            "diff_file_size": 20960,
            "diff_url": "https://github.com/flatpak/flatpak/commit/66544d28a6d9c247289c0ea6df906b454df9c027.diff",
            "exists": true,
            "files": [
                {
                    "file_additions": 16,
                    "file_deletions": 10,
                    "file_exists": true,
                    "file_name": "app/flatpak-builtins-info.c",
                    "file_size": 20960
                }
            ],
            "interesting": {
                "reopen": false,
                "status": false
            },
            "is_parent": true,
            "sha": "66544d28a6d9c247289c0ea6df906b454df9c027"
        },
        {
            "associated_pull_request": [],
            "date": "2018-12-28 15:21:54",
            "diff": "flatpak_flatpak/issue_2495/commit_694ff47c5ba3132eec6a744e19dc5fc97dd70275.diff",
            "diff_additions": 30,
            "diff_deletions": 0,
            "diff_file_size": 18492,
            "diff_url": "https://github.com/flatpak/flatpak/commit/694ff47c5ba3132eec6a744e19dc5fc97dd70275.diff",
            "exists": true,
            "files": [
                {
                    "file_additions": 30,
                    "file_deletions": 0,
                    "file_exists": true,
                    "file_name": "app/flatpak-builtins-remote-info.c",
                    "file_size": 18492
                }
            ],
            "interesting": {
                "reopen": false,
                "status": true
            },
            "is_parent": false,
            "sha": "694ff47c5ba3132eec6a744e19dc5fc97dd70275"
        },
        {
            "associated_pull_request": [],
            "date": "2018-12-28 15:21:54",
            "diff": "flatpak_flatpak/issue_2495/commit_c53eb265d9ada2be5b86c939777078e743956f4a.diff",
            "diff_additions": 30,
            "diff_deletions": 0,
            "diff_file_size": 18492,
            "diff_url": "https://github.com/flatpak/flatpak/commit/c53eb265d9ada2be5b86c939777078e743956f4a.diff",
            "exists": true,
            "files": [
                {
                    "file_additions": 30,
                    "file_deletions": 0,
                    "file_exists": true,
                    "file_name": "app/flatpak-builtins-remote-info.c",
                    "file_size": 18492
                }
            ],
            "interesting": {
                "reopen": false,
                "status": false
            },
            "is_parent": false,
            "sha": "c53eb265d9ada2be5b86c939777078e743956f4a"
        },
        {
            "associated_pull_request": [],
            "date": "2019-01-11 15:41:28",
            "diff": "flatpak_flatpak/issue_2495/commit_43c661d883832e5dd9e62ab42d1596bed043e393.diff",
            "diff_additions": 30,
            "diff_deletions": 0,
            "diff_file_size": 18492,
            "diff_url": "https://github.com/flatpak/flatpak/commit/43c661d883832e5dd9e62ab42d1596bed043e393.diff",
            "exists": true,
            "files": [
                {
                    "file_additions": 30,
                    "file_deletions": 0,
                    "file_exists": true,
                    "file_name": "app/flatpak-builtins-remote-info.c",
                    "file_size": 18492
                }
            ],
            "interesting": {
                "reopen": false,
                "status": false
            },
            "is_parent": false,
            "sha": "43c661d883832e5dd9e62ab42d1596bed043e393"
        },
        {
            "associated_pull_request": [],
            "date": "2019-01-11 15:41:28",
            "diff": "flatpak_flatpak/issue_2495/commit_7639149a6c8ed749880b67b30957c450306c3e51.diff",
            "diff_additions": 30,
            "diff_deletions": 0,
            "diff_file_size": 18492,
            "diff_url": "https://github.com/flatpak/flatpak/commit/7639149a6c8ed749880b67b30957c450306c3e51.diff",
            "exists": true,
            "files": [
                {
                    "file_additions": 30,
                    "file_deletions": 0,
                    "file_exists": true,
                    "file_name": "app/flatpak-builtins-remote-info.c",
                    "file_size": 18492
                }
            ],
            "interesting": {
                "reopen": false,
                "status": false
            },
            "is_parent": false,
            "sha": "7639149a6c8ed749880b67b30957c450306c3e51"
        },
        {
            "associated_pull_request": [],
            "date": "2019-01-11 15:41:28",
            "diff": "flatpak_flatpak/issue_2495/commit_7639149a6c8ed749880b67b30957c450306c3e51.diff",
            "diff_additions": 30,
            "diff_deletions": 0,
            "diff_file_size": 18492,
            "diff_url": "https://github.com/flatpak/flatpak/commit/7639149a6c8ed749880b67b30957c450306c3e51.diff",
            "exists": true,
            "files": [
                {
                    "file_additions": 30,
                    "file_deletions": 0,
                    "file_exists": true,
                    "file_name": "app/flatpak-builtins-remote-info.c",
                    "file_size": 18492
                }
            ],
            "interesting": {
                "reopen": false,
                "status": false
            },
            "is_parent": false,
            "sha": "7639149a6c8ed749880b67b30957c450306c3e51"
        }
    ],
    "first_commit": "2018-12-28 15:21:16",
    "last_commit": "2019-01-11 18:33:52",
    "number": 2495,
    "pull_request": "None",
    "score": {
        "accidental_reopen_likely": false,
        "all_labels": [],
        "contains_keywords": [],
        "fix_size": 45,
        "has_labels": [],
        "intersecting": {
            "computed_score": 1.0,
            "final_commit_size": 31,
            "intersection_size": 31,
            "previous_commits_size": 45
        },
        "is_makefile_based": true,
        "no_new_files": [],
        "no_other_files": true,
        "num_prohibited_files": 107148,
        "prohibited_files": [
            "hal/inc/pinmap_hal.h",
            "Debug/marvin.bin",
            "Debug/marvin.elf",
            "Debug/marvin.hex",
            "Debug/marvin.bin",
            "Debug/marvin.elf",
            "Debug/marvin.hex",
            "inc/spark_utilities.h",
            "Debug/marvin.bin",
            "Debug/marvin.elf"
        ],
        "reopen": false,
        "reopen_events": [
            [
                "2018-12-28 15:22:56",
                "commit"
            ],
            [
                "2019-01-09 05:52:35",
                "commit"
            ],
            [
                "2019-01-11 15:46:33",
                "commit"
            ],
            [
                "2019-01-11 18:33:56",
                "commit"
            ],
            [
                "2019-01-11 18:46:29",
                "closed"
            ],
            [
                "2019-01-11 18:46:29",
                "commit"
            ]
        ],
        "status": true,
        "strategy": true,
        "total_changes": 176
    }
}