{
    "commits": [
        {
            "diff": "elastic_elasticsearch/issue_37928/commit_ed460c28159172b4ea06800dc909ed72a5ace800.diff",
            "diff_additions": 9,
            "diff_deletions": 3,
            "diff_file_size": 0,
            "files": [
                {
                    "file_additions": 9,
                    "file_deletions": 3,
                    "file_exists": false,
                    "file_name": "server/src/test/java/org/elasticsearch/index/shard/IndexShardIT.java",
                    "file_size": 0
                }
            ],
            "interesting": {
                "reopened": false,
                "status": false
            },
            "sha": "ed460c28159172b4ea06800dc909ed72a5ace800"
        },
        {
            "diff": "elastic_elasticsearch/issue_37928/commit_f565d79ceffdf031519be96b972d5c5b9e431fa3.diff",
            "diff_additions": 21,
            "diff_deletions": 13,
            "diff_file_size": 0,
            "files": [
                {
                    "file_additions": 21,
                    "file_deletions": 13,
                    "file_exists": false,
                    "file_name": "server/src/test/java/org/elasticsearch/indices/mapping/SimpleGetFieldMappingsIT.java",
                    "file_size": 0
                }
            ],
            "interesting": {
                "reopened": false,
                "status": true
            },
            "sha": "f565d79ceffdf031519be96b972d5c5b9e431fa3"
        },
        {
            "diff": "elastic_elasticsearch/issue_37928/commit_b8b843476d387f257a50c53db586abe855ea0fb9.diff",
            "diff_additions": 1,
            "diff_deletions": 2,
            "diff_file_size": 0,
            "files": [
                {
                    "file_additions": 1,
                    "file_deletions": 2,
                    "file_exists": false,
                    "file_name": "server/src/test/java/org/elasticsearch/indices/mapping/SimpleGetFieldMappingsIT.java",
                    "file_size": 0
                }
            ],
            "interesting": {
                "reopened": false,
                "status": false
            },
            "sha": "b8b843476d387f257a50c53db586abe855ea0fb9"
        },
        {
            "diff": "elastic_elasticsearch/issue_37928/commit_00f75a401af47755a4b7d58c02b9591cfedfef9c.diff",
            "diff_additions": 1,
            "diff_deletions": 2,
            "diff_file_size": 0,
            "files": [
                {
                    "file_additions": 1,
                    "file_deletions": 2,
                    "file_exists": false,
                    "file_name": "server/src/test/java/org/elasticsearch/indices/mapping/SimpleGetFieldMappingsIT.java",
                    "file_size": 0
                }
            ],
            "interesting": {
                "reopened": false,
                "status": false
            },
            "sha": "00f75a401af47755a4b7d58c02b9591cfedfef9c"
        }
    ],
    "first_commit": "2019-01-30 17:54:31",
    "last_commit": "2019-02-01 07:42:17",
    "number": 37928,
    "score": 304.0769230769231
}