{
    "covered_issues": [
        125,
        123,
        115,
        106,
        92,
        87,
        72,
        69,
        68,
        67,
        60,
        59,
        47,
        17,
        14,
        10,
        9,
        7
    ],
    "finished": true
}