{
    "commits": [
        {
            "associated_pull_request": [
                "https://github.com/netdata/netdata/pull/870"
            ],
            "date": "2016-08-31 21:34:23+00:00",
            "diff": "netdata_netdata/issue_874/commit_bfb55f4810a684f87c70e50cd54330bb619a134f.diff",
            "diff_additions": 57,
            "diff_deletions": 46,
            "diff_file_size": 0,
            "diff_url": "https://github.com/netdata/netdata/commit/bfb55f4810a684f87c70e50cd54330bb619a134f.diff",
            "exists": true,
            "files": [
                {
                    "file_additions": 57,
                    "file_deletions": 46,
                    "file_exists": false,
                    "file_name": "src/health.c",
                    "file_size": 0
                }
            ],
            "interesting": {
                "reopen": false,
                "status": false
            },
            "is_parent": true,
            "sha": "bfb55f4810a684f87c70e50cd54330bb619a134f"
        },
        {
            "associated_pull_request": [
                "https://github.com/netdata/netdata/pull/875"
            ],
            "date": "2016-09-02 19:44:27+00:00",
            "diff": "netdata_netdata/issue_874/commit_1947daff41f55064e2012be1228f2e668fc9f4a9.diff",
            "diff_additions": 16,
            "diff_deletions": 6,
            "diff_file_size": 0,
            "diff_url": "https://github.com/netdata/netdata/commit/1947daff41f55064e2012be1228f2e668fc9f4a9.diff",
            "exists": true,
            "files": [
                {
                    "file_additions": 16,
                    "file_deletions": 6,
                    "file_exists": false,
                    "file_name": "src/sys_fs_cgroup.c",
                    "file_size": 0
                }
            ],
            "interesting": {
                "reopen": true,
                "status": false
            },
            "is_parent": false,
            "sha": "1947daff41f55064e2012be1228f2e668fc9f4a9"
        },
        {
            "associated_pull_request": [
                "https://github.com/netdata/netdata/pull/877"
            ],
            "date": "2016-09-02 21:40:14+00:00",
            "diff": "netdata_netdata/issue_874/commit_c7d97dde89ddb2fc40f077705052762d91c35040.diff",
            "diff_additions": 27,
            "diff_deletions": 13,
            "diff_file_size": 0,
            "diff_url": "https://github.com/netdata/netdata/commit/c7d97dde89ddb2fc40f077705052762d91c35040.diff",
            "exists": true,
            "files": [
                {
                    "file_additions": 27,
                    "file_deletions": 13,
                    "file_exists": false,
                    "file_name": "src/sys_fs_cgroup.c",
                    "file_size": 0
                }
            ],
            "interesting": {
                "reopen": true,
                "status": false
            },
            "is_parent": false,
            "sha": "c7d97dde89ddb2fc40f077705052762d91c35040"
        }
    ],
    "first_commit": "2016-08-31 21:34:23+00:00",
    "last_commit": "2016-09-02 21:40:14+00:00",
    "number": 874,
    "pull_request": "None",
    "score": {
        "accidental_reopen_likely": false,
        "all_labels": [
            "bug",
            "docker"
        ],
        "contains_keywords": [
            "work",
            "chang",
            "fix",
            "issu",
            "debug",
            "test",
            "fault",
            "remov",
            "bug",
            "error",
            "report"
        ],
        "fix_size": 36,
        "has_labels": [
            "bug"
        ],
        "intersecting": {
            "computed_score": 0.48484848484848486,
            "final_commit_size": 33,
            "intersection_size": 16,
            "previous_commits_size": 19
        },
        "is_makefile_based": true,
        "no_new_files": [],
        "no_other_files": false,
        "num_prohibited_files": 255,
        "prohibited_files": [
            "server/src/main/java/com/genymobile/scrcpy/Device.java",
            "server/src/main/java/com/genymobile/scrcpy/wrappers/SurfaceControl.java",
            "server/src/main/java/com/genymobile/scrcpy/Device.java",
            "server/src/main/java/com/genymobile/scrcpy/wrappers/SurfaceControl.java",
            "app/meson.build",
            "app/scrcpy.1",
            "app/src/common.h",
            "app/src/scrcpy.h",
            "app/src/server.h",
            "server/src/main/java/com/genymobile/scrcpy/Workarounds.java"
        ],
        "reopen": true,
        "reopen_events": [
            [
                "2016-09-02 19:44:38+00:00",
                "commit"
            ],
            [
                "2016-09-02 19:48:34+00:00",
                "closed"
            ],
            [
                "2016-09-02 19:48:56+00:00",
                "reopened"
            ],
            [
                "2016-09-02 21:40:25+00:00",
                "commit"
            ],
            [
                "2016-09-02 21:41:02+00:00",
                "closed"
            ],
            [
                "2016-09-02 21:41:25+00:00",
                "reopened"
            ],
            [
                "2016-09-02 21:52:12+00:00",
                "closed"
            ]
        ],
        "status": false,
        "strategy": true,
        "total_changes": 165
    }
}