{
    "category": [
        "build/refactor/preprocessing",
        "network/protocol"
    ],
    "commits": [
        {
            "associated_pull_request": [
                "https://github.com/libsndfile/libsndfile/pull/319"
            ],
            "date": "2017-09-19 07:52:04",
            "diff": "libsndfile_libsndfile/issue_317/commit_71444146aed3e3b12bf8db9c7513e5e3906f2c0a.diff",
            "diff_additions": 4,
            "diff_deletions": 4,
            "diff_file_size": 48457,
            "diff_url": "https://github.com/libsndfile/libsndfile/commit/71444146aed3e3b12bf8db9c7513e5e3906f2c0a.diff",
            "exists": true,
            "files": [
                {
                    "file_additions": 4,
                    "file_deletions": 4,
                    "file_exists": true,
                    "file_name": "src/common.c",
                    "file_size": 48457
                }
            ],
            "interesting": {
                "reopen": false,
                "status": false
            },
            "is_parent": true,
            "sha": "71444146aed3e3b12bf8db9c7513e5e3906f2c0a"
        },
        {
            "associated_pull_request": [],
            "date": "2017-09-27 12:46:17",
            "diff": "libsndfile_libsndfile/issue_317/commit_2d54514a4f6437b67829717c05472d2e3300a258.diff",
            "diff_additions": 21,
            "diff_deletions": 5,
            "diff_file_size": 28010,
            "diff_url": "https://github.com/libsndfile/libsndfile/commit/2d54514a4f6437b67829717c05472d2e3300a258.diff",
            "exists": true,
            "files": [
                {
                    "file_additions": 16,
                    "file_deletions": 4,
                    "file_exists": true,
                    "file_name": "programs/common.c",
                    "file_size": 15297
                },
                {
                    "file_additions": 5,
                    "file_deletions": 1,
                    "file_exists": true,
                    "file_name": "programs/sndfile-convert.c",
                    "file_size": 12713
                }
            ],
            "interesting": {
                "reopen": false,
                "status": true
            },
            "is_parent": false,
            "sha": "2d54514a4f6437b67829717c05472d2e3300a258"
        },
        {
            "associated_pull_request": [],
            "date": "2017-09-27 12:46:17",
            "diff": "libsndfile_libsndfile/issue_317/commit_00a25b9469f825a57dc3558ce10561ef38a3405e.diff",
            "diff_additions": 20,
            "diff_deletions": 5,
            "diff_file_size": 28010,
            "diff_url": "https://github.com/libsndfile/libsndfile/commit/00a25b9469f825a57dc3558ce10561ef38a3405e.diff",
            "exists": true,
            "files": [
                {
                    "file_additions": 15,
                    "file_deletions": 4,
                    "file_exists": true,
                    "file_name": "programs/common.c",
                    "file_size": 15297
                },
                {
                    "file_additions": 5,
                    "file_deletions": 1,
                    "file_exists": true,
                    "file_name": "programs/sndfile-convert.c",
                    "file_size": 12713
                }
            ],
            "interesting": {
                "reopen": false,
                "status": true
            },
            "is_parent": false,
            "sha": "00a25b9469f825a57dc3558ce10561ef38a3405e"
        },
        {
            "associated_pull_request": [
                "https://github.com/libsndfile/libsndfile/pull/529"
            ],
            "date": "2017-09-27 12:46:18",
            "diff": "libsndfile_libsndfile/issue_317/commit_9a7d30d169715caac5ccee6967bc09b58195880b.diff",
            "diff_additions": 20,
            "diff_deletions": 5,
            "diff_file_size": 28010,
            "diff_url": "https://github.com/libsndfile/libsndfile/commit/9a7d30d169715caac5ccee6967bc09b58195880b.diff",
            "exists": true,
            "files": [
                {
                    "file_additions": 15,
                    "file_deletions": 4,
                    "file_exists": true,
                    "file_name": "programs/common.c",
                    "file_size": 15297
                },
                {
                    "file_additions": 5,
                    "file_deletions": 1,
                    "file_exists": true,
                    "file_name": "programs/sndfile-convert.c",
                    "file_size": 12713
                }
            ],
            "interesting": {
                "reopen": false,
                "status": false
            },
            "is_parent": false,
            "sha": "9a7d30d169715caac5ccee6967bc09b58195880b"
        },
        {
            "associated_pull_request": [
                "https://github.com/libsndfile/libsndfile/pull/529"
            ],
            "date": "2017-09-27 12:46:18",
            "diff": "libsndfile_libsndfile/issue_317/commit_2ccb23fe724d1d946b4e0c51b791cc655da6962e.diff",
            "diff_additions": 20,
            "diff_deletions": 5,
            "diff_file_size": 28010,
            "diff_url": "https://github.com/libsndfile/libsndfile/commit/2ccb23fe724d1d946b4e0c51b791cc655da6962e.diff",
            "exists": true,
            "files": [
                {
                    "file_additions": 15,
                    "file_deletions": 4,
                    "file_exists": true,
                    "file_name": "programs/common.c",
                    "file_size": 15297
                },
                {
                    "file_additions": 5,
                    "file_deletions": 1,
                    "file_exists": true,
                    "file_name": "programs/sndfile-convert.c",
                    "file_size": 12713
                }
            ],
            "interesting": {
                "reopen": false,
                "status": false
            },
            "is_parent": false,
            "sha": "2ccb23fe724d1d946b4e0c51b791cc655da6962e"
        }
    ],
    "first_commit": "2017-09-26 09:47:49",
    "last_commit": "2020-06-20 08:18:11",
    "number": 317,
    "pull_request": "None",
    "score": {
        "accidental_reopen_likely": false,
        "all_labels": [
            "Bug"
        ],
        "contains_keywords": [
            "fix",
            "issu"
        ],
        "fix_size": 39,
        "has_labels": [],
        "intersecting": {
            "computed_score": 1.0,
            "final_commit_size": 24,
            "intersection_size": 24,
            "previous_commits_size": 39
        },
        "is_makefile_based": true,
        "no_new_files": [],
        "no_other_files": false,
        "num_prohibited_files": 46360,
        "prohibited_files": [
            "hal/inc/pinmap_hal.h",
            "Debug/marvin.bin",
            "Debug/marvin.elf",
            "Debug/marvin.hex",
            "Debug/marvin.bin",
            "Debug/marvin.elf",
            "Debug/marvin.hex",
            "inc/spark_utilities.h",
            "Debug/marvin.bin",
            "Debug/marvin.elf"
        ],
        "reopen": false,
        "reopen_events": [
            [
                "2017-09-12 02:47:29",
                "closed"
            ],
            [
                "2017-09-12 02:49:03",
                "reopened"
            ],
            [
                "2017-09-27 12:50:04",
                "commit"
            ],
            [
                "2019-03-10 07:43:25",
                "closed"
            ],
            [
                "2020-06-20 07:13:07",
                "commit"
            ],
            [
                "2020-06-20 07:20:56",
                "commit"
            ],
            [
                "2020-06-20 08:18:13",
                "commit"
            ]
        ],
        "status": true,
        "strategy": true,
        "total_changes": 109
    }
}