{
    "category": [
        "hardware/OS",
        "build/refactor/preprocessing"
    ],
    "commits": [
        {
            "associated_pull_request": [],
            "date": "2019-03-11 02:19:15",
            "diff": "espressif_esp-idf/issue_2924/commit_f42ae05d1efd1644aee587244405bff723a3df81.diff",
            "diff_additions": 4,
            "diff_deletions": 4,
            "diff_file_size": 44654,
            "diff_url": "https://github.com/espressif/esp-idf/commit/f42ae05d1efd1644aee587244405bff723a3df81.diff",
            "exists": true,
            "files": [
                {
                    "file_additions": 4,
                    "file_deletions": 4,
                    "file_exists": true,
                    "file_name": "components/driver/test/test_spi_param.c",
                    "file_size": 44654
                }
            ],
            "interesting": {
                "reopen": false,
                "status": false
            },
            "is_parent": true,
            "sha": "f42ae05d1efd1644aee587244405bff723a3df81"
        },
        {
            "associated_pull_request": [],
            "date": "2019-03-11 03:03:48",
            "diff": "espressif_esp-idf/issue_2924/commit_27cc0d1f91e16980698aac1d1448b131a158f2c1.diff",
            "diff_additions": 12,
            "diff_deletions": 0,
            "diff_file_size": 38913,
            "diff_url": "https://github.com/espressif/esp-idf/commit/27cc0d1f91e16980698aac1d1448b131a158f2c1.diff",
            "exists": true,
            "files": [
                {
                    "file_additions": 6,
                    "file_deletions": 0,
                    "file_exists": true,
                    "file_name": "components/lwip/apps/dhcpserver/dhcpserver.c",
                    "file_size": 38913
                },
                {
                    "file_additions": 6,
                    "file_deletions": 0,
                    "file_exists": false,
                    "file_name": "components/tcpip_adapter/tcpip_adapter_lwip.c",
                    "file_size": 0
                }
            ],
            "interesting": {
                "reopen": true,
                "status": false
            },
            "is_parent": false,
            "sha": "27cc0d1f91e16980698aac1d1448b131a158f2c1"
        },
        {
            "associated_pull_request": [],
            "date": "2019-03-14 03:47:21",
            "diff": "espressif_esp-idf/issue_2924/commit_fa2998d70bbacd8af15b0c97f455e0f8062dea19.diff",
            "diff_additions": 6,
            "diff_deletions": 0,
            "diff_file_size": 38913,
            "diff_url": "https://github.com/espressif/esp-idf/commit/fa2998d70bbacd8af15b0c97f455e0f8062dea19.diff",
            "exists": true,
            "files": [
                {
                    "file_additions": 6,
                    "file_deletions": 0,
                    "file_exists": true,
                    "file_name": "components/lwip/apps/dhcpserver/dhcpserver.c",
                    "file_size": 38913
                }
            ],
            "interesting": {
                "reopen": false,
                "status": false
            },
            "is_parent": false,
            "sha": "fa2998d70bbacd8af15b0c97f455e0f8062dea19"
        }
    ],
    "first_commit": "2019-03-11 02:19:15",
    "last_commit": "2019-03-14 06:00:35",
    "number": 2924,
    "pull_request": "None",
    "score": {
        "accidental_reopen_likely": false,
        "all_labels": [],
        "contains_keywords": [
            "fix",
            "CI",
            "reason",
            "bug",
            "test",
            "issu",
            "debug",
            "chang",
            "fail",
            "problem"
        ],
        "fix_size": 20,
        "has_labels": [],
        "intersecting": {
            "computed_score": 0.14285714285714285,
            "final_commit_size": 7,
            "intersection_size": 1,
            "previous_commits_size": 14
        },
        "is_makefile_based": true,
        "no_new_files": [],
        "no_other_files": false,
        "num_prohibited_files": 49655,
        "prohibited_files": [
            "kill.h",
            "meminfo.h",
            "kill.h",
            "meminfo.h",
            "kill.h",
            "meminfo.h",
            "testsuite_cli_test.go",
            "testsuite_cli_test.go",
            "common.mk",
            "i3bar/include/draw_util.h"
        ],
        "reopen": true,
        "reopen_events": [
            [
                "2019-03-13 12:59:32",
                "closed"
            ],
            [
                "2019-03-13 12:59:32",
                "commit"
            ],
            [
                "2019-03-14 03:02:43",
                "reopened"
            ],
            [
                "2019-03-17 09:26:33",
                "closed"
            ],
            [
                "2019-03-17 09:26:33",
                "commit"
            ]
        ],
        "status": false,
        "strategy": true,
        "total_changes": 26
    }
}