{
    "category": [
        "hardware/OS",
        "feature request"
    ],
    "commits": [
        {
            "associated_pull_request": [
                "https://github.com/rsyslog/rsyslog/pull/2237"
            ],
            "date": "2017-12-16 16:38:56",
            "diff": "",
            "diff_additions": 0,
            "diff_deletions": 0,
            "diff_file_size": 0,
            "diff_url": "https://github.com/rsyslog/rsyslog/commit/42228252a277f63342699cf1580ec6d4dbec64b0.diff",
            "exists": true,
            "files": [],
            "interesting": {
                "reopen": false,
                "status": false
            },
            "is_parent": true,
            "sha": "42228252a277f63342699cf1580ec6d4dbec64b0"
        },
        {
            "associated_pull_request": [],
            "date": "2017-12-17 16:10:39",
            "diff": "rsyslog_rsyslog/issue_2224/commit_74401a1e08d153302be6bf5e45be43591c02b111.diff",
            "diff_additions": 25,
            "diff_deletions": 0,
            "diff_file_size": 151646,
            "diff_url": "https://github.com/rsyslog/rsyslog/commit/74401a1e08d153302be6bf5e45be43591c02b111.diff",
            "exists": true,
            "files": [
                {
                    "file_additions": 25,
                    "file_deletions": 0,
                    "file_exists": true,
                    "file_name": "grammar/rainerscript.c",
                    "file_size": 151646
                }
            ],
            "interesting": {
                "reopen": false,
                "status": true
            },
            "is_parent": false,
            "sha": "74401a1e08d153302be6bf5e45be43591c02b111"
        },
        {
            "associated_pull_request": [
                "https://github.com/rsyslog/rsyslog/pull/2242"
            ],
            "date": "2017-12-17 16:10:39",
            "diff": "rsyslog_rsyslog/issue_2224/commit_f5eef34361845b6f630d13af1ef0f7eeaeb4ca00.diff",
            "diff_additions": 25,
            "diff_deletions": 0,
            "diff_file_size": 151646,
            "diff_url": "https://github.com/rsyslog/rsyslog/commit/f5eef34361845b6f630d13af1ef0f7eeaeb4ca00.diff",
            "exists": true,
            "files": [
                {
                    "file_additions": 25,
                    "file_deletions": 0,
                    "file_exists": true,
                    "file_name": "grammar/rainerscript.c",
                    "file_size": 151646
                }
            ],
            "interesting": {
                "reopen": false,
                "status": false
            },
            "is_parent": false,
            "sha": "f5eef34361845b6f630d13af1ef0f7eeaeb4ca00"
        }
    ],
    "first_commit": "2017-12-16 16:38:56",
    "last_commit": "2017-12-24 10:46:57",
    "number": 2224,
    "pull_request": "None",
    "score": {
        "accidental_reopen_likely": false,
        "all_labels": [
            "enhancement"
        ],
        "contains_keywords": [
            "bug",
            "test",
            "fix",
            "issu"
        ],
        "fix_size": 44,
        "has_labels": [],
        "intersecting": {
            "computed_score": 0.3076923076923077,
            "final_commit_size": 26,
            "intersection_size": 8,
            "previous_commits_size": 26
        },
        "is_makefile_based": true,
        "no_new_files": [],
        "no_other_files": false,
        "num_prohibited_files": 12339,
        "prohibited_files": [
            "hal/inc/pinmap_hal.h",
            "Debug/marvin.bin",
            "Debug/marvin.elf",
            "Debug/marvin.hex",
            "Debug/marvin.bin",
            "Debug/marvin.elf",
            "Debug/marvin.hex",
            "inc/spark_utilities.h",
            "Debug/marvin.bin",
            "Debug/marvin.elf"
        ],
        "reopen": false,
        "reopen_events": [
            [
                "2017-12-17 16:12:17",
                "commit"
            ],
            [
                "2017-12-23 16:08:50",
                "commit"
            ],
            [
                "2017-12-24 10:47:17",
                "commit"
            ],
            [
                "2017-12-25 17:39:21",
                "closed"
            ]
        ],
        "status": true,
        "strategy": true,
        "total_changes": 50
    }
}