{
    "all_issues": 4351,
    "interesting_issues": 5,
    "last_update": "2023-10-31 16:17:02.102543",
    "license": {
        "download": "https://raw.githubusercontent.com/rspamd/rspamd/master/LICENSE.md",
        "name": "Other"
    },
    "ratio": 0.0011491611123879567,
    "size": 67698,
    "stars": 1837,
    "url": "https://github.com/rspamd/rspamd"
}