{
    "commits": [
        {
            "associated_pull_request": [
                "https://github.com/confluentinc/librdkafka/pull/4261"
            ],
            "date": "2023-04-18 18:58:44+00:00",
            "diff": "confluentinc_librdkafka/issue_4249/commit_d1d62b6dc679b4bf3db5dbba938c099bffa763c7.diff",
            "diff_additions": 149,
            "diff_deletions": 0,
            "diff_file_size": 277706,
            "diff_url": "https://github.com/confluentinc/librdkafka/commit/d1d62b6dc679b4bf3db5dbba938c099bffa763c7.diff",
            "exists": true,
            "files": [
                {
                    "file_additions": 146,
                    "file_deletions": 0,
                    "file_exists": true,
                    "file_name": "tests/0139-offset_validation_mock.c",
                    "file_size": 17316
                },
                {
                    "file_additions": 3,
                    "file_deletions": 0,
                    "file_exists": true,
                    "file_name": "tests/test.c",
                    "file_size": 260390
                }
            ],
            "interesting": {
                "reopen": false,
                "status": false
            },
            "is_parent": true,
            "sha": "d1d62b6dc679b4bf3db5dbba938c099bffa763c7"
        },
        {
            "associated_pull_request": [],
            "date": "2023-04-18 18:59:30+00:00",
            "diff": "confluentinc_librdkafka/issue_4249/commit_fe111b0d5db90f195d14e025b55e1a838ae65b14.diff",
            "diff_additions": 15,
            "diff_deletions": 0,
            "diff_file_size": 50664,
            "diff_url": "https://github.com/confluentinc/librdkafka/commit/fe111b0d5db90f195d14e025b55e1a838ae65b14.diff",
            "exists": true,
            "files": [
                {
                    "file_additions": 15,
                    "file_deletions": 0,
                    "file_exists": true,
                    "file_name": "src/rdkafka_fetcher.c",
                    "file_size": 50664
                }
            ],
            "interesting": {
                "reopen": false,
                "status": true
            },
            "is_parent": false,
            "sha": "fe111b0d5db90f195d14e025b55e1a838ae65b14"
        },
        {
            "associated_pull_request": [
                "https://github.com/confluentinc/librdkafka/pull/4261"
            ],
            "date": "2023-04-20 08:20:41+00:00",
            "diff": "confluentinc_librdkafka/issue_4249/commit_497b8f211e8b3df6d60bbd545d73f4c518586f1d.diff",
            "diff_additions": 164,
            "diff_deletions": 0,
            "diff_file_size": 328370,
            "diff_url": "https://github.com/confluentinc/librdkafka/commit/497b8f211e8b3df6d60bbd545d73f4c518586f1d.diff",
            "exists": true,
            "files": [
                {
                    "file_additions": 15,
                    "file_deletions": 0,
                    "file_exists": true,
                    "file_name": "src/rdkafka_fetcher.c",
                    "file_size": 50664
                },
                {
                    "file_additions": 146,
                    "file_deletions": 0,
                    "file_exists": true,
                    "file_name": "tests/0139-offset_validation_mock.c",
                    "file_size": 17316
                },
                {
                    "file_additions": 3,
                    "file_deletions": 0,
                    "file_exists": true,
                    "file_name": "tests/test.c",
                    "file_size": 260390
                }
            ],
            "interesting": {
                "reopen": false,
                "status": false
            },
            "is_parent": false,
            "sha": "497b8f211e8b3df6d60bbd545d73f4c518586f1d"
        }
    ],
    "first_commit": "2023-04-18 18:58:44+00:00",
    "last_commit": "2023-04-20 08:20:41+00:00",
    "number": 4249,
    "pull_request": "None",
    "score": {
        "accidental_reopen_likely": false,
        "all_labels": [
            "bug",
            "GREAT REPORT"
        ],
        "contains_keywords": [
            "confirm",
            "work",
            "chang",
            "fix",
            "issu",
            "patch",
            "test",
            "report"
        ],
        "fix_size": 20,
        "has_labels": [
            "bug"
        ],
        "intersecting": {
            "computed_score": 0.8,
            "final_commit_size": 20,
            "intersection_size": 16,
            "previous_commits_size": 16
        },
        "is_makefile_based": true,
        "no_new_files": [
            "tests/test.c"
        ],
        "no_other_files": false,
        "num_prohibited_files": 76905,
        "prohibited_files": [
            "server/src/main/java/com/genymobile/scrcpy/Device.java",
            "server/src/main/java/com/genymobile/scrcpy/wrappers/SurfaceControl.java",
            "server/src/main/java/com/genymobile/scrcpy/Device.java",
            "server/src/main/java/com/genymobile/scrcpy/wrappers/SurfaceControl.java",
            "app/meson.build",
            "app/scrcpy.1",
            "app/src/common.h",
            "app/src/scrcpy.h",
            "app/src/server.h",
            "server/src/main/java/com/genymobile/scrcpy/Workarounds.java"
        ],
        "reopen": false,
        "reopen_events": [
            [
                "2023-04-18 19:17:01+00:00",
                "commit"
            ],
            [
                "2023-04-18 19:19:10+00:00",
                "commit"
            ],
            [
                "2023-04-20 08:20:49+00:00",
                "closed"
            ],
            [
                "2023-04-20 08:20:49+00:00",
                "commit"
            ]
        ],
        "status": true,
        "strategy": true,
        "total_changes": 328
    }
}