{
    "category": [
        "memory",
        "build/refactor/preprocessing"
    ],
    "commits": [
        {
            "associated_pull_request": [
                "https://github.com/openssl/openssl/pull/7177"
            ],
            "date": "2018-09-11 12:49:46",
            "diff": "",
            "diff_additions": 0,
            "diff_deletions": 0,
            "diff_file_size": 0,
            "diff_url": "https://github.com/openssl/openssl/commit/fc4e1ab4708a3eb87a107df7e085d0d8125c5171.diff",
            "exists": true,
            "files": [],
            "interesting": {
                "reopen": false,
                "status": true
            },
            "is_parent": true,
            "sha": "fc4e1ab4708a3eb87a107df7e085d0d8125c5171"
        },
        {
            "associated_pull_request": [],
            "date": "2018-09-12 15:49:19",
            "diff": "openssl_openssl/issue_7204/commit_6f6ac81186d94f75b49979223390d45c413288ba.diff",
            "diff_additions": 2,
            "diff_deletions": 2,
            "diff_file_size": 16078,
            "diff_url": "https://github.com/openssl/openssl/commit/6f6ac81186d94f75b49979223390d45c413288ba.diff",
            "exists": true,
            "files": [
                {
                    "file_additions": 2,
                    "file_deletions": 2,
                    "file_exists": true,
                    "file_name": "test/ct_test.c",
                    "file_size": 16078
                }
            ],
            "interesting": {
                "reopen": false,
                "status": false
            },
            "is_parent": false,
            "sha": "6f6ac81186d94f75b49979223390d45c413288ba"
        },
        {
            "associated_pull_request": [
                "https://github.com/EktapopaT/openssl/pull/1"
            ],
            "date": "2018-09-12 15:49:19",
            "diff": "openssl_openssl/issue_7204/commit_622fc2e051bc3c61a09d08f1fafdb45f6f8499b0.diff",
            "diff_additions": 2,
            "diff_deletions": 2,
            "diff_file_size": 16078,
            "diff_url": "https://github.com/openssl/openssl/commit/622fc2e051bc3c61a09d08f1fafdb45f6f8499b0.diff",
            "exists": true,
            "files": [
                {
                    "file_additions": 2,
                    "file_deletions": 2,
                    "file_exists": true,
                    "file_name": "test/ct_test.c",
                    "file_size": 16078
                }
            ],
            "interesting": {
                "reopen": false,
                "status": false
            },
            "is_parent": false,
            "sha": "622fc2e051bc3c61a09d08f1fafdb45f6f8499b0"
        }
    ],
    "first_commit": "2018-09-11 12:49:46",
    "last_commit": "2018-09-13 14:42:26",
    "number": 7204,
    "pull_request": "None",
    "score": {
        "accidental_reopen_likely": false,
        "all_labels": [],
        "contains_keywords": [
            "fail",
            "error"
        ],
        "fix_size": 5,
        "has_labels": [],
        "intersecting": {
            "computed_score": 0.3333333333333333,
            "final_commit_size": 3,
            "intersection_size": 1,
            "previous_commits_size": 3
        },
        "is_makefile_based": false,
        "no_new_files": [],
        "no_other_files": true,
        "num_prohibited_files": 97668,
        "prohibited_files": [
            "hal/inc/pinmap_hal.h",
            "Debug/marvin.bin",
            "Debug/marvin.elf",
            "Debug/marvin.hex",
            "Debug/marvin.bin",
            "Debug/marvin.elf",
            "Debug/marvin.hex",
            "inc/spark_utilities.h",
            "Debug/marvin.bin",
            "Debug/marvin.elf"
        ],
        "reopen": false,
        "reopen_events": [
            [
                "2018-09-12 15:50:27",
                "commit"
            ],
            [
                "2018-09-13 08:15:18",
                "commit"
            ],
            [
                "2018-09-13 08:15:57",
                "closed"
            ],
            [
                "2018-09-13 08:15:57",
                "commit"
            ],
            [
                "2018-09-13 14:49:40",
                "commit"
            ]
        ],
        "status": true,
        "strategy": true,
        "total_changes": 8
    }
}