{
    "commits": [
        {
            "associated_pull_request": [
                "https://github.com/appneta/tcpreplay/pull/403"
            ],
            "date": "2017-06-07 15:32:44+00:00",
            "diff": "appneta_tcpreplay/issue_430/commit_54da347870f59145f47c8bea0f57df761ff69d03.diff",
            "diff_additions": 1,
            "diff_deletions": 1,
            "diff_file_size": 46131,
            "diff_url": "https://github.com/appneta/tcpreplay/commit/54da347870f59145f47c8bea0f57df761ff69d03.diff",
            "exists": true,
            "files": [
                {
                    "file_additions": 1,
                    "file_deletions": 1,
                    "file_exists": true,
                    "file_name": "src/tcpliveplay.c",
                    "file_size": 46131
                }
            ],
            "interesting": {
                "reopen": false,
                "status": false
            },
            "is_parent": true,
            "sha": "54da347870f59145f47c8bea0f57df761ff69d03"
        },
        {
            "associated_pull_request": [],
            "date": "2018-01-19 23:36:30+00:00",
            "diff": "appneta_tcpreplay/issue_430/commit_ae73c2307160ae78c74cc4f7de84907aecc73f81.diff",
            "diff_additions": 203,
            "diff_deletions": 104,
            "diff_file_size": 210374,
            "diff_url": "https://github.com/appneta/tcpreplay/commit/ae73c2307160ae78c74cc4f7de84907aecc73f81.diff",
            "exists": true,
            "files": [
                {
                    "file_additions": 18,
                    "file_deletions": 2,
                    "file_exists": true,
                    "file_name": "src/common/flows.c",
                    "file_size": 8774
                },
                {
                    "file_additions": 67,
                    "file_deletions": 37,
                    "file_exists": true,
                    "file_name": "src/common/get.c",
                    "file_size": 26895
                },
                {
                    "file_additions": 1,
                    "file_deletions": 1,
                    "file_exists": true,
                    "file_name": "src/common/tcpdump.c",
                    "file_size": 11994
                },
                {
                    "file_additions": 3,
                    "file_deletions": 3,
                    "file_exists": true,
                    "file_name": "src/tcpedit/parse_args.c",
                    "file_size": 7337
                },
                {
                    "file_additions": 12,
                    "file_deletions": 3,
                    "file_exists": true,
                    "file_name": "src/tcpedit/plugins/dlt_en10mb/en10mb.c",
                    "file_size": 31187
                },
                {
                    "file_additions": 10,
                    "file_deletions": 7,
                    "file_exists": true,
                    "file_name": "src/tcpedit/portmap.c",
                    "file_size": 11145
                },
                {
                    "file_additions": 12,
                    "file_deletions": 7,
                    "file_exists": true,
                    "file_name": "src/tcpedit/tcpedit.c",
                    "file_size": 19957
                },
                {
                    "file_additions": 1,
                    "file_deletions": 1,
                    "file_exists": true,
                    "file_name": "src/tcpliveplay.c",
                    "file_size": 46131
                },
                {
                    "file_additions": 18,
                    "file_deletions": 17,
                    "file_exists": true,
                    "file_name": "src/tcpprep.c",
                    "file_size": 20798
                },
                {
                    "file_additions": 61,
                    "file_deletions": 26,
                    "file_exists": true,
                    "file_name": "src/tree.c",
                    "file_size": 26156
                }
            ],
            "interesting": {
                "reopen": true,
                "status": false
            },
            "is_parent": false,
            "sha": "ae73c2307160ae78c74cc4f7de84907aecc73f81"
        },
        {
            "associated_pull_request": [
                "https://github.com/appneta/tcpreplay/pull/518"
            ],
            "date": "2018-10-26 17:04:07+00:00",
            "diff": "appneta_tcpreplay/issue_430/commit_72ae165e0a834dd9fe4a730755c1ec9d149bd442.diff",
            "diff_additions": 636,
            "diff_deletions": 592,
            "diff_file_size": 438034,
            "diff_url": "https://github.com/appneta/tcpreplay/commit/72ae165e0a834dd9fe4a730755c1ec9d149bd442.diff",
            "exists": true,
            "files": [
                {
                    "file_additions": 1,
                    "file_deletions": 1,
                    "file_exists": true,
                    "file_name": "libopts/alias.c",
                    "file_size": 3341
                },
                {
                    "file_additions": 70,
                    "file_deletions": 69,
                    "file_exists": true,
                    "file_name": "libopts/ao-strs.c",
                    "file_size": 14314
                },
                {
                    "file_additions": 4,
                    "file_deletions": 4,
                    "file_exists": true,
                    "file_name": "libopts/autoopts.c",
                    "file_size": 12060
                },
                {
                    "file_additions": 5,
                    "file_deletions": 5,
                    "file_exists": true,
                    "file_name": "libopts/boolean.c",
                    "file_size": 2508
                },
                {
                    "file_additions": 1,
                    "file_deletions": 1,
                    "file_exists": true,
                    "file_name": "libopts/check.c",
                    "file_size": 4954
                },
                {
                    "file_additions": 12,
                    "file_deletions": 12,
                    "file_exists": true,
                    "file_name": "libopts/compat/pathfind.c",
                    "file_size": 7336
                },
                {
                    "file_additions": 65,
                    "file_deletions": 57,
                    "file_exists": true,
                    "file_name": "libopts/configfile.c",
                    "file_size": 35325
                },
                {
                    "file_additions": 34,
                    "file_deletions": 31,
                    "file_exists": true,
                    "file_name": "libopts/cook.c",
                    "file_size": 9176
                },
                {
                    "file_additions": 18,
                    "file_deletions": 17,
                    "file_exists": true,
                    "file_name": "libopts/enum.c",
                    "file_size": 17779
                },
                {
                    "file_additions": 4,
                    "file_deletions": 4,
                    "file_exists": true,
                    "file_name": "libopts/env.c",
                    "file_size": 7163
                },
                {
                    "file_additions": 6,
                    "file_deletions": 6,
                    "file_exists": true,
                    "file_name": "libopts/file.c",
                    "file_size": 5807
                },
                {
                    "file_additions": 8,
                    "file_deletions": 8,
                    "file_exists": true,
                    "file_name": "libopts/find.c",
                    "file_size": 21980
                },
                {
                    "file_additions": 93,
                    "file_deletions": 93,
                    "file_exists": true,
                    "file_name": "libopts/genshell.c",
                    "file_size": 31341
                },
                {
                    "file_additions": 4,
                    "file_deletions": 8,
                    "file_exists": true,
                    "file_name": "libopts/init.c",
                    "file_size": 8543
                },
                {
                    "file_additions": 2,
                    "file_deletions": 0,
                    "file_exists": true,
                    "file_name": "libopts/libopts.c",
                    "file_size": 1112
                },
                {
                    "file_additions": 31,
                    "file_deletions": 21,
                    "file_exists": true,
                    "file_name": "libopts/load.c",
                    "file_size": 16228
                },
                {
                    "file_additions": 19,
                    "file_deletions": 14,
                    "file_exists": true,
                    "file_name": "libopts/makeshell.c",
                    "file_size": 24279
                },
                {
                    "file_additions": 34,
                    "file_deletions": 34,
                    "file_exists": true,
                    "file_name": "libopts/nested.c",
                    "file_size": 23888
                },
                {
                    "file_additions": 12,
                    "file_deletions": 10,
                    "file_exists": true,
                    "file_name": "libopts/numeric.c",
                    "file_size": 5322
                },
                {
                    "file_additions": 1,
                    "file_deletions": 1,
                    "file_exists": true,
                    "file_name": "libopts/option-value-type.c",
                    "file_size": 5619
                },
                {
                    "file_additions": 1,
                    "file_deletions": 1,
                    "file_exists": true,
                    "file_name": "libopts/option-xat-attribute.c",
                    "file_size": 5139
                },
                {
                    "file_additions": 3,
                    "file_deletions": 3,
                    "file_exists": true,
                    "file_name": "libopts/parse-duration.c",
                    "file_size": 12341
                },
                {
                    "file_additions": 5,
                    "file_deletions": 5,
                    "file_exists": true,
                    "file_name": "libopts/pgusage.c",
                    "file_size": 5004
                },
                {
                    "file_additions": 19,
                    "file_deletions": 12,
                    "file_exists": true,
                    "file_name": "libopts/putshell.c",
                    "file_size": 14689
                },
                {
                    "file_additions": 4,
                    "file_deletions": 4,
                    "file_exists": true,
                    "file_name": "libopts/reset.c",
                    "file_size": 3945
                },
                {
                    "file_additions": 17,
                    "file_deletions": 17,
                    "file_exists": true,
                    "file_name": "libopts/restore.c",
                    "file_size": 6988
                },
                {
                    "file_additions": 55,
                    "file_deletions": 54,
                    "file_exists": true,
                    "file_name": "libopts/save.c",
                    "file_size": 25389
                },
                {
                    "file_additions": 5,
                    "file_deletions": 5,
                    "file_exists": true,
                    "file_name": "libopts/sort.c",
                    "file_size": 9627
                },
                {
                    "file_additions": 15,
                    "file_deletions": 15,
                    "file_exists": true,
                    "file_name": "libopts/stack.c",
                    "file_size": 7404
                },
                {
                    "file_additions": 11,
                    "file_deletions": 11,
                    "file_exists": true,
                    "file_name": "libopts/streqvcmp.c",
                    "file_size": 8335
                },
                {
                    "file_additions": 18,
                    "file_deletions": 15,
                    "file_exists": true,
                    "file_name": "libopts/text_mmap.c",
                    "file_size": 11356
                },
                {
                    "file_additions": 9,
                    "file_deletions": 7,
                    "file_exists": true,
                    "file_name": "libopts/time.c",
                    "file_size": 3952
                },
                {
                    "file_additions": 24,
                    "file_deletions": 24,
                    "file_exists": true,
                    "file_name": "libopts/tokenize.c",
                    "file_size": 8841
                },
                {
                    "file_additions": 15,
                    "file_deletions": 12,
                    "file_exists": true,
                    "file_name": "libopts/usage.c",
                    "file_size": 37857
                },
                {
                    "file_additions": 9,
                    "file_deletions": 9,
                    "file_exists": true,
                    "file_name": "libopts/version.c",
                    "file_size": 6362
                },
                {
                    "file_additions": 2,
                    "file_deletions": 2,
                    "file_exists": true,
                    "file_name": "src/common/utils.c",
                    "file_size": 12730
                }
            ],
            "interesting": {
                "reopen": false,
                "status": false
            },
            "is_parent": false,
            "sha": "72ae165e0a834dd9fe4a730755c1ec9d149bd442"
        },
        {
            "associated_pull_request": [
                "https://github.com/appneta/tcpreplay/pull/518"
            ],
            "date": "2018-10-26 17:42:27+00:00",
            "diff": "appneta_tcpreplay/issue_430/commit_1fd4d0944e10cbe6e152629860edd6afa70c7bc7.diff",
            "diff_additions": 636,
            "diff_deletions": 592,
            "diff_file_size": 438034,
            "diff_url": "https://github.com/appneta/tcpreplay/commit/1fd4d0944e10cbe6e152629860edd6afa70c7bc7.diff",
            "exists": true,
            "files": [
                {
                    "file_additions": 1,
                    "file_deletions": 1,
                    "file_exists": true,
                    "file_name": "libopts/alias.c",
                    "file_size": 3341
                },
                {
                    "file_additions": 70,
                    "file_deletions": 69,
                    "file_exists": true,
                    "file_name": "libopts/ao-strs.c",
                    "file_size": 14314
                },
                {
                    "file_additions": 4,
                    "file_deletions": 4,
                    "file_exists": true,
                    "file_name": "libopts/autoopts.c",
                    "file_size": 12060
                },
                {
                    "file_additions": 5,
                    "file_deletions": 5,
                    "file_exists": true,
                    "file_name": "libopts/boolean.c",
                    "file_size": 2508
                },
                {
                    "file_additions": 1,
                    "file_deletions": 1,
                    "file_exists": true,
                    "file_name": "libopts/check.c",
                    "file_size": 4954
                },
                {
                    "file_additions": 12,
                    "file_deletions": 12,
                    "file_exists": true,
                    "file_name": "libopts/compat/pathfind.c",
                    "file_size": 7336
                },
                {
                    "file_additions": 65,
                    "file_deletions": 57,
                    "file_exists": true,
                    "file_name": "libopts/configfile.c",
                    "file_size": 35325
                },
                {
                    "file_additions": 34,
                    "file_deletions": 31,
                    "file_exists": true,
                    "file_name": "libopts/cook.c",
                    "file_size": 9176
                },
                {
                    "file_additions": 18,
                    "file_deletions": 17,
                    "file_exists": true,
                    "file_name": "libopts/enum.c",
                    "file_size": 17779
                },
                {
                    "file_additions": 4,
                    "file_deletions": 4,
                    "file_exists": true,
                    "file_name": "libopts/env.c",
                    "file_size": 7163
                },
                {
                    "file_additions": 6,
                    "file_deletions": 6,
                    "file_exists": true,
                    "file_name": "libopts/file.c",
                    "file_size": 5807
                },
                {
                    "file_additions": 8,
                    "file_deletions": 8,
                    "file_exists": true,
                    "file_name": "libopts/find.c",
                    "file_size": 21980
                },
                {
                    "file_additions": 93,
                    "file_deletions": 93,
                    "file_exists": true,
                    "file_name": "libopts/genshell.c",
                    "file_size": 31341
                },
                {
                    "file_additions": 4,
                    "file_deletions": 8,
                    "file_exists": true,
                    "file_name": "libopts/init.c",
                    "file_size": 8543
                },
                {
                    "file_additions": 2,
                    "file_deletions": 0,
                    "file_exists": true,
                    "file_name": "libopts/libopts.c",
                    "file_size": 1112
                },
                {
                    "file_additions": 31,
                    "file_deletions": 21,
                    "file_exists": true,
                    "file_name": "libopts/load.c",
                    "file_size": 16228
                },
                {
                    "file_additions": 19,
                    "file_deletions": 14,
                    "file_exists": true,
                    "file_name": "libopts/makeshell.c",
                    "file_size": 24279
                },
                {
                    "file_additions": 34,
                    "file_deletions": 34,
                    "file_exists": true,
                    "file_name": "libopts/nested.c",
                    "file_size": 23888
                },
                {
                    "file_additions": 12,
                    "file_deletions": 10,
                    "file_exists": true,
                    "file_name": "libopts/numeric.c",
                    "file_size": 5322
                },
                {
                    "file_additions": 1,
                    "file_deletions": 1,
                    "file_exists": true,
                    "file_name": "libopts/option-value-type.c",
                    "file_size": 5619
                },
                {
                    "file_additions": 1,
                    "file_deletions": 1,
                    "file_exists": true,
                    "file_name": "libopts/option-xat-attribute.c",
                    "file_size": 5139
                },
                {
                    "file_additions": 3,
                    "file_deletions": 3,
                    "file_exists": true,
                    "file_name": "libopts/parse-duration.c",
                    "file_size": 12341
                },
                {
                    "file_additions": 5,
                    "file_deletions": 5,
                    "file_exists": true,
                    "file_name": "libopts/pgusage.c",
                    "file_size": 5004
                },
                {
                    "file_additions": 19,
                    "file_deletions": 12,
                    "file_exists": true,
                    "file_name": "libopts/putshell.c",
                    "file_size": 14689
                },
                {
                    "file_additions": 4,
                    "file_deletions": 4,
                    "file_exists": true,
                    "file_name": "libopts/reset.c",
                    "file_size": 3945
                },
                {
                    "file_additions": 17,
                    "file_deletions": 17,
                    "file_exists": true,
                    "file_name": "libopts/restore.c",
                    "file_size": 6988
                },
                {
                    "file_additions": 55,
                    "file_deletions": 54,
                    "file_exists": true,
                    "file_name": "libopts/save.c",
                    "file_size": 25389
                },
                {
                    "file_additions": 5,
                    "file_deletions": 5,
                    "file_exists": true,
                    "file_name": "libopts/sort.c",
                    "file_size": 9627
                },
                {
                    "file_additions": 15,
                    "file_deletions": 15,
                    "file_exists": true,
                    "file_name": "libopts/stack.c",
                    "file_size": 7404
                },
                {
                    "file_additions": 11,
                    "file_deletions": 11,
                    "file_exists": true,
                    "file_name": "libopts/streqvcmp.c",
                    "file_size": 8335
                },
                {
                    "file_additions": 18,
                    "file_deletions": 15,
                    "file_exists": true,
                    "file_name": "libopts/text_mmap.c",
                    "file_size": 11356
                },
                {
                    "file_additions": 9,
                    "file_deletions": 7,
                    "file_exists": true,
                    "file_name": "libopts/time.c",
                    "file_size": 3952
                },
                {
                    "file_additions": 24,
                    "file_deletions": 24,
                    "file_exists": true,
                    "file_name": "libopts/tokenize.c",
                    "file_size": 8841
                },
                {
                    "file_additions": 15,
                    "file_deletions": 12,
                    "file_exists": true,
                    "file_name": "libopts/usage.c",
                    "file_size": 37857
                },
                {
                    "file_additions": 9,
                    "file_deletions": 9,
                    "file_exists": true,
                    "file_name": "libopts/version.c",
                    "file_size": 6362
                },
                {
                    "file_additions": 2,
                    "file_deletions": 2,
                    "file_exists": true,
                    "file_name": "src/common/utils.c",
                    "file_size": 12730
                }
            ],
            "interesting": {
                "reopen": false,
                "status": false
            },
            "is_parent": false,
            "sha": "1fd4d0944e10cbe6e152629860edd6afa70c7bc7"
        }
    ],
    "first_commit": "2017-06-07 15:32:44+00:00",
    "last_commit": "2018-10-26 17:42:27+00:00",
    "number": 430,
    "pull_request": "None",
    "score": {
        "accidental_reopen_likely": false,
        "all_labels": [
            "bug"
        ],
        "contains_keywords": [
            "work",
            "fail",
            "fix",
            "issu",
            "CI",
            "test",
            "attempt",
            "fault",
            "warn",
            "bug",
            "error",
            "problem",
            "report"
        ],
        "fix_size": 1127,
        "has_labels": [
            "bug"
        ],
        "intersecting": {
            "computed_score": 1.0,
            "final_commit_size": 847,
            "intersection_size": 847,
            "previous_commits_size": 1127
        },
        "is_makefile_based": true,
        "no_new_files": [],
        "no_other_files": false,
        "num_prohibited_files": 219225,
        "prohibited_files": [
            "server/src/main/java/com/genymobile/scrcpy/Device.java",
            "server/src/main/java/com/genymobile/scrcpy/wrappers/SurfaceControl.java",
            "server/src/main/java/com/genymobile/scrcpy/Device.java",
            "server/src/main/java/com/genymobile/scrcpy/wrappers/SurfaceControl.java",
            "app/meson.build",
            "app/scrcpy.1",
            "app/src/common.h",
            "app/src/scrcpy.h",
            "app/src/server.h",
            "server/src/main/java/com/genymobile/scrcpy/Workarounds.java"
        ],
        "reopen": true,
        "reopen_events": [
            [
                "2018-01-07 17:52:44+00:00",
                "commit"
            ],
            [
                "2018-01-07 23:33:20+00:00",
                "commit"
            ],
            [
                "2018-01-07 23:35:10+00:00",
                "closed"
            ],
            [
                "2018-01-19 23:36:45+00:00",
                "commit"
            ],
            [
                "2018-10-26 04:37:32+00:00",
                "reopened"
            ],
            [
                "2018-10-26 17:25:35+00:00",
                "commit"
            ],
            [
                "2018-10-26 17:27:43+00:00",
                "commit"
            ],
            [
                "2018-10-26 17:35:23+00:00",
                "commit"
            ],
            [
                "2018-10-26 17:42:29+00:00",
                "commit"
            ],
            [
                "2018-10-26 17:58:12+00:00",
                "closed"
            ]
        ],
        "status": false,
        "strategy": true,
        "total_changes": 2765
    }
}