{
    "category": [
        "build/refactor/preprocessing"
    ],
    "commits": [
        {
            "associated_pull_request": [
                "https://github.com/zephyrproject-rtos/zephyr/pull/10261"
            ],
            "date": "2018-09-24 17:25:30",
            "diff": "",
            "diff_additions": 0,
            "diff_deletions": 0,
            "diff_file_size": 0,
            "diff_url": "https://github.com/zephyrproject-rtos/zephyr/commit/1ec4b689849e5edd11210232928dd173c6716e2c.diff",
            "exists": true,
            "files": [],
            "interesting": {
                "reopen": false,
                "status": false
            },
            "is_parent": true,
            "sha": "1ec4b689849e5edd11210232928dd173c6716e2c"
        },
        {
            "associated_pull_request": [],
            "date": "2018-09-28 21:15:39",
            "diff": "zephyrproject-rtos_zephyr/issue_10195/commit_5a1ac129d6c29b0a28fedef4f08673e48bd12c9c.diff",
            "diff_additions": 44,
            "diff_deletions": 0,
            "diff_file_size": 0,
            "diff_url": "https://github.com/zephyrproject-rtos/zephyr/commit/5a1ac129d6c29b0a28fedef4f08673e48bd12c9c.diff",
            "exists": true,
            "files": [
                {
                    "file_additions": 44,
                    "file_deletions": 0,
                    "file_exists": false,
                    "file_name": "misc/printk.c",
                    "file_size": 0
                }
            ],
            "interesting": {
                "reopen": false,
                "status": false
            },
            "is_parent": false,
            "sha": "5a1ac129d6c29b0a28fedef4f08673e48bd12c9c"
        },
        {
            "associated_pull_request": [],
            "date": "2018-09-28 21:15:39",
            "diff": "zephyrproject-rtos_zephyr/issue_10195/commit_c433576d12fb21a35acbd168d503875a8906946c.diff",
            "diff_additions": 43,
            "diff_deletions": 0,
            "diff_file_size": 0,
            "diff_url": "https://github.com/zephyrproject-rtos/zephyr/commit/c433576d12fb21a35acbd168d503875a8906946c.diff",
            "exists": true,
            "files": [
                {
                    "file_additions": 43,
                    "file_deletions": 0,
                    "file_exists": false,
                    "file_name": "misc/printk.c",
                    "file_size": 0
                }
            ],
            "interesting": {
                "reopen": false,
                "status": true
            },
            "is_parent": false,
            "sha": "c433576d12fb21a35acbd168d503875a8906946c"
        },
        {
            "associated_pull_request": [],
            "date": "2018-09-28 21:15:39",
            "diff": "zephyrproject-rtos_zephyr/issue_10195/commit_f13272e76817a974ad4646f2b86fe1bf1bf18f54.diff",
            "diff_additions": 43,
            "diff_deletions": 0,
            "diff_file_size": 0,
            "diff_url": "https://github.com/zephyrproject-rtos/zephyr/commit/f13272e76817a974ad4646f2b86fe1bf1bf18f54.diff",
            "exists": true,
            "files": [
                {
                    "file_additions": 43,
                    "file_deletions": 0,
                    "file_exists": false,
                    "file_name": "misc/printk.c",
                    "file_size": 0
                }
            ],
            "interesting": {
                "reopen": false,
                "status": false
            },
            "is_parent": false,
            "sha": "f13272e76817a974ad4646f2b86fe1bf1bf18f54"
        },
        {
            "associated_pull_request": [],
            "date": "2018-09-28 21:15:39",
            "diff": "zephyrproject-rtos_zephyr/issue_10195/commit_a238b7cf77b7a714c7a7a995458505f3feac0cea.diff",
            "diff_additions": 46,
            "diff_deletions": 0,
            "diff_file_size": 0,
            "diff_url": "https://github.com/zephyrproject-rtos/zephyr/commit/a238b7cf77b7a714c7a7a995458505f3feac0cea.diff",
            "exists": true,
            "files": [
                {
                    "file_additions": 46,
                    "file_deletions": 0,
                    "file_exists": false,
                    "file_name": "misc/printk.c",
                    "file_size": 0
                }
            ],
            "interesting": {
                "reopen": false,
                "status": false
            },
            "is_parent": false,
            "sha": "a238b7cf77b7a714c7a7a995458505f3feac0cea"
        },
        {
            "associated_pull_request": [],
            "date": "2018-09-28 21:15:39",
            "diff": "zephyrproject-rtos_zephyr/issue_10195/commit_1d62a95f0f7f72572784a1933d7b5840dce972b1.diff",
            "diff_additions": 46,
            "diff_deletions": 0,
            "diff_file_size": 0,
            "diff_url": "https://github.com/zephyrproject-rtos/zephyr/commit/1d62a95f0f7f72572784a1933d7b5840dce972b1.diff",
            "exists": true,
            "files": [
                {
                    "file_additions": 46,
                    "file_deletions": 0,
                    "file_exists": false,
                    "file_name": "misc/printk.c",
                    "file_size": 0
                }
            ],
            "interesting": {
                "reopen": false,
                "status": false
            },
            "is_parent": false,
            "sha": "1d62a95f0f7f72572784a1933d7b5840dce972b1"
        },
        {
            "associated_pull_request": [],
            "date": "2018-10-01 19:11:28",
            "diff": "zephyrproject-rtos_zephyr/issue_10195/commit_ab6c133624f9ae3aefb4314df311c63a9d855540.diff",
            "diff_additions": 10,
            "diff_deletions": 0,
            "diff_file_size": 41085,
            "diff_url": "https://github.com/zephyrproject-rtos/zephyr/commit/ab6c133624f9ae3aefb4314df311c63a9d855540.diff",
            "exists": true,
            "files": [
                {
                    "file_additions": 10,
                    "file_deletions": 0,
                    "file_exists": true,
                    "file_name": "subsys/shell/shell.c",
                    "file_size": 41085
                }
            ],
            "interesting": {
                "reopen": false,
                "status": true
            },
            "is_parent": false,
            "sha": "ab6c133624f9ae3aefb4314df311c63a9d855540"
        },
        {
            "associated_pull_request": [],
            "date": "2018-10-01 19:11:28",
            "diff": "zephyrproject-rtos_zephyr/issue_10195/commit_b88f90e8426d05c9c72b401b4165f0767452a5e3.diff",
            "diff_additions": 10,
            "diff_deletions": 0,
            "diff_file_size": 41085,
            "diff_url": "https://github.com/zephyrproject-rtos/zephyr/commit/b88f90e8426d05c9c72b401b4165f0767452a5e3.diff",
            "exists": true,
            "files": [
                {
                    "file_additions": 10,
                    "file_deletions": 0,
                    "file_exists": true,
                    "file_name": "subsys/shell/shell.c",
                    "file_size": 41085
                }
            ],
            "interesting": {
                "reopen": false,
                "status": true
            },
            "is_parent": false,
            "sha": "b88f90e8426d05c9c72b401b4165f0767452a5e3"
        },
        {
            "associated_pull_request": [],
            "date": "2018-10-01 19:11:28",
            "diff": "zephyrproject-rtos_zephyr/issue_10195/commit_2c48e3c2a561b10ace310e804eac625379979bff.diff",
            "diff_additions": 11,
            "diff_deletions": 0,
            "diff_file_size": 41085,
            "diff_url": "https://github.com/zephyrproject-rtos/zephyr/commit/2c48e3c2a561b10ace310e804eac625379979bff.diff",
            "exists": true,
            "files": [
                {
                    "file_additions": 11,
                    "file_deletions": 0,
                    "file_exists": true,
                    "file_name": "subsys/shell/shell.c",
                    "file_size": 41085
                }
            ],
            "interesting": {
                "reopen": false,
                "status": false
            },
            "is_parent": false,
            "sha": "2c48e3c2a561b10ace310e804eac625379979bff"
        },
        {
            "associated_pull_request": [],
            "date": "2018-10-01 19:11:28",
            "diff": "zephyrproject-rtos_zephyr/issue_10195/commit_73a16cdd561109395e2c4f2c0bef214d57d541c6.diff",
            "diff_additions": 10,
            "diff_deletions": 0,
            "diff_file_size": 41085,
            "diff_url": "https://github.com/zephyrproject-rtos/zephyr/commit/73a16cdd561109395e2c4f2c0bef214d57d541c6.diff",
            "exists": true,
            "files": [
                {
                    "file_additions": 10,
                    "file_deletions": 0,
                    "file_exists": true,
                    "file_name": "subsys/shell/shell.c",
                    "file_size": 41085
                }
            ],
            "interesting": {
                "reopen": false,
                "status": false
            },
            "is_parent": false,
            "sha": "73a16cdd561109395e2c4f2c0bef214d57d541c6"
        },
        {
            "associated_pull_request": [],
            "date": "2018-10-01 19:11:28",
            "diff": "zephyrproject-rtos_zephyr/issue_10195/commit_1fbd2f31a488c3523b15370ee68418dd8ac71a3c.diff",
            "diff_additions": 10,
            "diff_deletions": 0,
            "diff_file_size": 41085,
            "diff_url": "https://github.com/zephyrproject-rtos/zephyr/commit/1fbd2f31a488c3523b15370ee68418dd8ac71a3c.diff",
            "exists": true,
            "files": [
                {
                    "file_additions": 10,
                    "file_deletions": 0,
                    "file_exists": true,
                    "file_name": "subsys/shell/shell.c",
                    "file_size": 41085
                }
            ],
            "interesting": {
                "reopen": false,
                "status": false
            },
            "is_parent": false,
            "sha": "1fbd2f31a488c3523b15370ee68418dd8ac71a3c"
        },
        {
            "associated_pull_request": [
                "https://github.com/zephyrproject-rtos/zephyr/pull/10321"
            ],
            "date": "2018-10-01 19:11:28",
            "diff": "zephyrproject-rtos_zephyr/issue_10195/commit_e47ed57da7f684c29f01cbed13ac56c7fc019835.diff",
            "diff_additions": 17,
            "diff_deletions": 5,
            "diff_file_size": 41085,
            "diff_url": "https://github.com/zephyrproject-rtos/zephyr/commit/e47ed57da7f684c29f01cbed13ac56c7fc019835.diff",
            "exists": true,
            "files": [
                {
                    "file_additions": 17,
                    "file_deletions": 5,
                    "file_exists": true,
                    "file_name": "subsys/shell/shell.c",
                    "file_size": 41085
                }
            ],
            "interesting": {
                "reopen": false,
                "status": false
            },
            "is_parent": false,
            "sha": "e47ed57da7f684c29f01cbed13ac56c7fc019835"
        },
        {
            "associated_pull_request": [
                "https://github.com/zephyrproject-rtos/zephyr/pull/10321"
            ],
            "date": "2018-10-01 19:11:28",
            "diff": "zephyrproject-rtos_zephyr/issue_10195/commit_0ce966bc28616c6f3f34ba1073ad3e3fef5018ec.diff",
            "diff_additions": 17,
            "diff_deletions": 5,
            "diff_file_size": 41085,
            "diff_url": "https://github.com/zephyrproject-rtos/zephyr/commit/0ce966bc28616c6f3f34ba1073ad3e3fef5018ec.diff",
            "exists": true,
            "files": [
                {
                    "file_additions": 17,
                    "file_deletions": 5,
                    "file_exists": true,
                    "file_name": "subsys/shell/shell.c",
                    "file_size": 41085
                }
            ],
            "interesting": {
                "reopen": false,
                "status": false
            },
            "is_parent": false,
            "sha": "0ce966bc28616c6f3f34ba1073ad3e3fef5018ec"
        }
    ],
    "first_commit": "2018-09-28 16:46:03",
    "last_commit": "2018-10-02 09:23:37",
    "number": 10195,
    "pull_request": "None",
    "score": {
        "accidental_reopen_likely": false,
        "all_labels": [
            "area: Shell",
            "bug",
            "priority: medium"
        ],
        "contains_keywords": [
            "report",
            "warn",
            "chang",
            "error",
            "bug",
            "problem",
            "fix",
            "patch",
            "remov",
            "issu",
            "work",
            "fault",
            "debug"
        ],
        "fix_size": 73,
        "has_labels": [
            "bug"
        ],
        "intersecting": {
            "computed_score": 1.0,
            "final_commit_size": 18,
            "intersection_size": 18,
            "previous_commits_size": 73
        },
        "is_makefile_based": true,
        "no_new_files": [],
        "no_other_files": false,
        "num_prohibited_files": 137761,
        "prohibited_files": [
            "hal/inc/pinmap_hal.h",
            "Debug/marvin.bin",
            "Debug/marvin.elf",
            "Debug/marvin.hex",
            "Debug/marvin.bin",
            "Debug/marvin.elf",
            "Debug/marvin.hex",
            "inc/spark_utilities.h",
            "Debug/marvin.bin",
            "Debug/marvin.elf"
        ],
        "reopen": false,
        "reopen_events": [
            [
                "2018-09-28 11:16:48",
                "closed"
            ],
            [
                "2018-09-28 11:16:51",
                "reopened"
            ],
            [
                "2018-09-28 21:18:50",
                "commit"
            ],
            [
                "2018-09-29 14:32:58",
                "commit"
            ],
            [
                "2018-09-29 14:35:04",
                "commit"
            ],
            [
                "2018-10-01 11:00:25",
                "commit"
            ],
            [
                "2018-10-01 12:00:34",
                "commit"
            ],
            [
                "2018-10-01 19:14:51",
                "commit"
            ],
            [
                "2018-10-01 19:16:22",
                "commit"
            ],
            [
                "2018-10-01 20:10:32",
                "commit"
            ],
            [
                "2018-10-01 21:26:41",
                "commit"
            ],
            [
                "2018-10-02 06:54:53",
                "commit"
            ],
            [
                "2018-10-02 08:45:49",
                "commit"
            ],
            [
                "2018-10-02 09:23:39",
                "closed"
            ],
            [
                "2018-10-02 09:24:26",
                "commit"
            ]
        ],
        "status": true,
        "strategy": true,
        "total_changes": 317
    }
}