{
    "commits": [
        {
            "diff": "spring-projects_spring-boot/issue_13821/commit_7d54eda6f15476d0082796f923e8a0da17e56a22.diff",
            "diff_additions": 54,
            "diff_deletions": 6,
            "diff_file_size": 0,
            "files": [
                {
                    "file_additions": 49,
                    "file_deletions": 0,
                    "file_exists": false,
                    "file_name": "spring-boot-autoconfigure/src/test/java/org/springframework/boot/autoconfigure/amqp/RabbitAutoConfigurationCompatibilityTests.java",
                    "file_size": 0
                },
                {
                    "file_additions": 5,
                    "file_deletions": 6,
                    "file_exists": false,
                    "file_name": "spring-boot-autoconfigure/src/test/java/org/springframework/boot/autoconfigure/amqp/RabbitAutoConfigurationTests.java",
                    "file_size": 0
                }
            ],
            "interesting": {
                "reopened": false,
                "status": false
            },
            "sha": "7d54eda6f15476d0082796f923e8a0da17e56a22"
        },
        {
            "diff": "spring-projects_spring-boot/issue_13821/commit_db903c2176ce32244bedb4f0ff8d10309aa80af0.diff",
            "diff_additions": 203,
            "diff_deletions": 29,
            "diff_file_size": 0,
            "files": [
                {
                    "file_additions": 27,
                    "file_deletions": 21,
                    "file_exists": false,
                    "file_name": "spring-boot-autoconfigure/src/main/java/org/springframework/boot/autoconfigure/web/ServerProperties.java",
                    "file_size": 0
                },
                {
                    "file_additions": 176,
                    "file_deletions": 8,
                    "file_exists": false,
                    "file_name": "spring-boot-autoconfigure/src/test/java/org/springframework/boot/autoconfigure/web/ServerPropertiesTests.java",
                    "file_size": 0
                }
            ],
            "interesting": {
                "reopened": true,
                "status": false
            },
            "sha": "db903c2176ce32244bedb4f0ff8d10309aa80af0"
        },
        {
            "diff": "spring-projects_spring-boot/issue_13821/commit_124705080bf7a5fc47791657baae4036c4685f0a.diff",
            "diff_additions": 6,
            "diff_deletions": 1,
            "diff_file_size": 0,
            "files": [
                {
                    "file_additions": 6,
                    "file_deletions": 1,
                    "file_exists": false,
                    "file_name": "spring-boot-autoconfigure/src/main/java/org/springframework/boot/autoconfigure/web/ServerProperties.java",
                    "file_size": 0
                }
            ],
            "interesting": {
                "reopened": false,
                "status": false
            },
            "sha": "124705080bf7a5fc47791657baae4036c4685f0a"
        }
    ],
    "first_commit": "2018-09-07 08:47:20",
    "last_commit": "2018-09-07 13:04:23",
    "number": 13821,
    "score": 128.0133779264214
}