{
    "covered_issues": [
        67,
        65,
        64,
        63,
        61,
        60,
        59,
        57,
        56,
        55,
        54,
        52,
        50,
        48,
        47,
        45,
        44,
        43,
        42,
        40,
        39,
        38,
        37,
        36,
        35,
        34,
        31,
        28,
        27,
        25,
        24,
        22,
        21,
        19,
        17,
        13,
        12,
        8,
        6,
        5,
        4,
        3,
        2,
        1
    ],
    "finished": true
}