{
    "commits": [
        {
            "diff": "elastic_elasticsearch/issue_50781/commit_eedc02c025d85932dc4cb693eaefcee46aaaafa3.diff",
            "diff_additions": 0,
            "diff_deletions": 1506,
            "diff_file_size": 19468,
            "files": [
                {
                    "file_additions": 0,
                    "file_deletions": 45,
                    "file_exists": true,
                    "file_name": "test/framework/src/main/java/org/elasticsearch/repositories/blobstore/BlobStoreTestUtil.java",
                    "file_size": 19468
                },
                {
                    "file_additions": 0,
                    "file_deletions": 109,
                    "file_exists": false,
                    "file_name": "x-pack/snapshot-tool/qa/google-cloud-storage/src/test/java/org/elasticsearch/snapshots/GCSCleanupTests.java",
                    "file_size": 0
                },
                {
                    "file_additions": 0,
                    "file_deletions": 136,
                    "file_exists": false,
                    "file_name": "x-pack/snapshot-tool/qa/s3/src/test/java/org/elasticsearch/snapshots/S3CleanupTests.java",
                    "file_size": 0
                },
                {
                    "file_additions": 0,
                    "file_deletions": 75,
                    "file_exists": false,
                    "file_name": "x-pack/snapshot-tool/src/main/java/org/elasticsearch/snapshots/AbstractCleanupCommand.java",
                    "file_size": 0
                },
                {
                    "file_additions": 0,
                    "file_deletions": 305,
                    "file_exists": false,
                    "file_name": "x-pack/snapshot-tool/src/main/java/org/elasticsearch/snapshots/AbstractRepository.java",
                    "file_size": 0
                },
                {
                    "file_additions": 0,
                    "file_deletions": 60,
                    "file_exists": false,
                    "file_name": "x-pack/snapshot-tool/src/main/java/org/elasticsearch/snapshots/CleanupGCSRepositoryCommand.java",
                    "file_size": 0
                },
                {
                    "file_additions": 0,
                    "file_deletions": 77,
                    "file_exists": false,
                    "file_name": "x-pack/snapshot-tool/src/main/java/org/elasticsearch/snapshots/CleanupS3RepositoryCommand.java",
                    "file_size": 0
                },
                {
                    "file_additions": 0,
                    "file_deletions": 220,
                    "file_exists": false,
                    "file_name": "x-pack/snapshot-tool/src/main/java/org/elasticsearch/snapshots/GCSRepository.java",
                    "file_size": 0
                },
                {
                    "file_additions": 0,
                    "file_deletions": 179,
                    "file_exists": false,
                    "file_name": "x-pack/snapshot-tool/src/main/java/org/elasticsearch/snapshots/S3Repository.java",
                    "file_size": 0
                },
                {
                    "file_additions": 0,
                    "file_deletions": 25,
                    "file_exists": false,
                    "file_name": "x-pack/snapshot-tool/src/main/java/org/elasticsearch/snapshots/SnapshotToolCli.java",
                    "file_size": 0
                },
                {
                    "file_additions": 0,
                    "file_deletions": 275,
                    "file_exists": false,
                    "file_name": "x-pack/snapshot-tool/src/test/java/org/elasticsearch/snapshots/AbstractCleanupTests.java",
                    "file_size": 0
                }
            ],
            "interesting": {
                "reopened": false,
                "status": false
            },
            "sha": "eedc02c025d85932dc4cb693eaefcee46aaaafa3"
        },
        {
            "diff": "elastic_elasticsearch/issue_50781/commit_170e1001736d99f350e6ed74d154f220131bc3f9.diff",
            "diff_additions": 2,
            "diff_deletions": 1,
            "diff_file_size": 0,
            "files": [
                {
                    "file_additions": 2,
                    "file_deletions": 1,
                    "file_exists": false,
                    "file_name": "x-pack/plugin/ilm/qa/multi-node/src/test/java/org/elasticsearch/xpack/ilm/TimeSeriesLifecycleActionsIT.java",
                    "file_size": 0
                }
            ],
            "interesting": {
                "reopened": false,
                "status": false
            },
            "sha": "170e1001736d99f350e6ed74d154f220131bc3f9"
        },
        {
            "diff": "elastic_elasticsearch/issue_50781/commit_149e129a964e2a4c1177ab55b73de164b011be03.diff",
            "diff_additions": 34,
            "diff_deletions": 19,
            "diff_file_size": 0,
            "files": [
                {
                    "file_additions": 34,
                    "file_deletions": 19,
                    "file_exists": false,
                    "file_name": "x-pack/plugin/ilm/qa/multi-node/src/test/java/org/elasticsearch/xpack/ilm/TimeSeriesLifecycleActionsIT.java",
                    "file_size": 0
                }
            ],
            "interesting": {
                "reopened": false,
                "status": false
            },
            "sha": "149e129a964e2a4c1177ab55b73de164b011be03"
        },
        {
            "diff": "elastic_elasticsearch/issue_50781/commit_ce50e8e18a8cf66b01ac08221dedb30d3551cbf2.diff",
            "diff_additions": 1,
            "diff_deletions": 0,
            "diff_file_size": 0,
            "files": [
                {
                    "file_additions": 1,
                    "file_deletions": 0,
                    "file_exists": false,
                    "file_name": "x-pack/plugin/ilm/qa/multi-node/src/test/java/org/elasticsearch/xpack/ilm/TimeSeriesLifecycleActionsIT.java",
                    "file_size": 0
                }
            ],
            "interesting": {
                "reopened": false,
                "status": false
            },
            "sha": "ce50e8e18a8cf66b01ac08221dedb30d3551cbf2"
        },
        {
            "diff": "elastic_elasticsearch/issue_50781/commit_323bbb835632daae0de6e0de6b0d5121487d290b.diff",
            "diff_additions": 34,
            "diff_deletions": 19,
            "diff_file_size": 0,
            "files": [
                {
                    "file_additions": 34,
                    "file_deletions": 19,
                    "file_exists": false,
                    "file_name": "x-pack/plugin/ilm/qa/multi-node/src/test/java/org/elasticsearch/xpack/ilm/TimeSeriesLifecycleActionsIT.java",
                    "file_size": 0
                }
            ],
            "interesting": {
                "reopened": false,
                "status": false
            },
            "sha": "323bbb835632daae0de6e0de6b0d5121487d290b"
        },
        {
            "diff": "elastic_elasticsearch/issue_50781/commit_36079d4f9af994e1bd0c6e11b60c921801914c9a.diff",
            "diff_additions": 37,
            "diff_deletions": 22,
            "diff_file_size": 0,
            "files": [
                {
                    "file_additions": 37,
                    "file_deletions": 22,
                    "file_exists": false,
                    "file_name": "x-pack/plugin/ilm/qa/multi-node/src/test/java/org/elasticsearch/xpack/ilm/TimeSeriesLifecycleActionsIT.java",
                    "file_size": 0
                }
            ],
            "interesting": {
                "reopened": false,
                "status": false
            },
            "sha": "36079d4f9af994e1bd0c6e11b60c921801914c9a"
        },
        {
            "diff": "elastic_elasticsearch/issue_50781/commit_a18736b46d226bb3cb16efaf63b5c75cc52230d6.diff",
            "diff_additions": 522,
            "diff_deletions": 2,
            "diff_file_size": 193083,
            "files": [
                {
                    "file_additions": 2,
                    "file_deletions": 0,
                    "file_exists": true,
                    "file_name": "x-pack/plugin/core/src/main/java/org/elasticsearch/xpack/core/XPackClientPlugin.java",
                    "file_size": 36002
                },
                {
                    "file_additions": 1,
                    "file_deletions": 1,
                    "file_exists": true,
                    "file_name": "x-pack/plugin/core/src/main/java/org/elasticsearch/xpack/core/ilm/TimeseriesLifecycleType.java",
                    "file_size": 19019
                },
                {
                    "file_additions": 96,
                    "file_deletions": 0,
                    "file_exists": true,
                    "file_name": "x-pack/plugin/core/src/main/java/org/elasticsearch/xpack/core/ilm/WaitForSnapshotAction.java",
                    "file_size": 3158
                },
                {
                    "file_additions": 101,
                    "file_deletions": 0,
                    "file_exists": true,
                    "file_name": "x-pack/plugin/core/src/main/java/org/elasticsearch/xpack/core/ilm/WaitForSnapshotStep.java",
                    "file_size": 4018
                },
                {
                    "file_additions": 3,
                    "file_deletions": 0,
                    "file_exists": true,
                    "file_name": "x-pack/plugin/core/src/test/java/org/elasticsearch/xpack/core/ilm/LifecyclePolicyMetadataTests.java",
                    "file_size": 7123
                },
                {
                    "file_additions": 7,
                    "file_deletions": 0,
                    "file_exists": true,
                    "file_name": "x-pack/plugin/core/src/test/java/org/elasticsearch/xpack/core/ilm/LifecyclePolicyTests.java",
                    "file_size": 23886
                },
                {
                    "file_additions": 3,
                    "file_deletions": 0,
                    "file_exists": true,
                    "file_name": "x-pack/plugin/core/src/test/java/org/elasticsearch/xpack/core/ilm/TimeseriesLifecycleTypeTests.java",
                    "file_size": 52037
                },
                {
                    "file_additions": 56,
                    "file_deletions": 0,
                    "file_exists": true,
                    "file_name": "x-pack/plugin/core/src/test/java/org/elasticsearch/xpack/core/ilm/WaitForSnapshotActionTests.java",
                    "file_size": 1922
                },
                {
                    "file_additions": 149,
                    "file_deletions": 0,
                    "file_exists": true,
                    "file_name": "x-pack/plugin/core/src/test/java/org/elasticsearch/xpack/core/ilm/WaitForSnapshotStepTests.java",
                    "file_size": 8399
                },
                {
                    "file_additions": 4,
                    "file_deletions": 0,
                    "file_exists": true,
                    "file_name": "x-pack/plugin/core/src/test/java/org/elasticsearch/xpack/core/ilm/action/PutLifecycleRequestTests.java",
                    "file_size": 7032
                },
                {
                    "file_additions": 93,
                    "file_deletions": 0,
                    "file_exists": false,
                    "file_name": "x-pack/plugin/ilm/qa/multi-node/src/test/java/org/elasticsearch/xpack/ilm/TimeSeriesLifecycleActionsIT.java",
                    "file_size": 0
                },
                {
                    "file_additions": 3,
                    "file_deletions": 1,
                    "file_exists": true,
                    "file_name": "x-pack/plugin/ilm/src/main/java/org/elasticsearch/xpack/ilm/IndexLifecycle.java",
                    "file_size": 20018
                },
                {
                    "file_additions": 4,
                    "file_deletions": 0,
                    "file_exists": true,
                    "file_name": "x-pack/plugin/ilm/src/test/java/org/elasticsearch/xpack/ilm/IndexLifecycleMetadataTests.java",
                    "file_size": 10469
                }
            ],
            "interesting": {
                "reopened": false,
                "status": false
            },
            "sha": "a18736b46d226bb3cb16efaf63b5c75cc52230d6"
        },
        {
            "diff": "elastic_elasticsearch/issue_50781/commit_780061fbfe037cec65cc4d9be22589f92feff849.diff",
            "diff_additions": 2,
            "diff_deletions": 1,
            "diff_file_size": 0,
            "files": [
                {
                    "file_additions": 2,
                    "file_deletions": 1,
                    "file_exists": false,
                    "file_name": "x-pack/plugin/ilm/qa/multi-node/src/test/java/org/elasticsearch/xpack/ilm/TimeSeriesLifecycleActionsIT.java",
                    "file_size": 0
                }
            ],
            "interesting": {
                "reopened": false,
                "status": false
            },
            "sha": "780061fbfe037cec65cc4d9be22589f92feff849"
        },
        {
            "diff": "elastic_elasticsearch/issue_50781/commit_7c8632f1edcd334bb8e0cbf9bece3f9486249185.diff",
            "diff_additions": 1,
            "diff_deletions": 0,
            "diff_file_size": 0,
            "files": [
                {
                    "file_additions": 1,
                    "file_deletions": 0,
                    "file_exists": false,
                    "file_name": "x-pack/plugin/ilm/qa/multi-node/src/test/java/org/elasticsearch/xpack/ilm/TimeSeriesLifecycleActionsIT.java",
                    "file_size": 0
                }
            ],
            "interesting": {
                "reopened": false,
                "status": false
            },
            "sha": "7c8632f1edcd334bb8e0cbf9bece3f9486249185"
        },
        {
            "diff": "elastic_elasticsearch/issue_50781/commit_8bb6728ccb13a986cf10e6cdc97b9914bc2cecb2.diff",
            "diff_additions": 37,
            "diff_deletions": 22,
            "diff_file_size": 0,
            "files": [
                {
                    "file_additions": 37,
                    "file_deletions": 22,
                    "file_exists": false,
                    "file_name": "x-pack/plugin/ilm/qa/multi-node/src/test/java/org/elasticsearch/xpack/ilm/TimeSeriesLifecycleActionsIT.java",
                    "file_size": 0
                }
            ],
            "interesting": {
                "reopened": true,
                "status": false
            },
            "sha": "8bb6728ccb13a986cf10e6cdc97b9914bc2cecb2"
        },
        {
            "diff": "elastic_elasticsearch/issue_50781/commit_25c422bcb8edbdbf694623db0f7b49de1bcc36e9.diff",
            "diff_additions": 1,
            "diff_deletions": 0,
            "diff_file_size": 0,
            "files": [
                {
                    "file_additions": 1,
                    "file_deletions": 0,
                    "file_exists": false,
                    "file_name": "x-pack/plugin/ilm/qa/multi-node/src/test/java/org/elasticsearch/xpack/ilm/TimeSeriesLifecycleActionsIT.java",
                    "file_size": 0
                }
            ],
            "interesting": {
                "reopened": false,
                "status": false
            },
            "sha": "25c422bcb8edbdbf694623db0f7b49de1bcc36e9"
        },
        {
            "diff": "elastic_elasticsearch/issue_50781/commit_c093f7f623e6b64bf2485e7ead3f95e3eca89aa4.diff",
            "diff_additions": 2,
            "diff_deletions": 1,
            "diff_file_size": 0,
            "files": [
                {
                    "file_additions": 2,
                    "file_deletions": 1,
                    "file_exists": false,
                    "file_name": "x-pack/plugin/ilm/qa/multi-node/src/test/java/org/elasticsearch/xpack/ilm/TimeSeriesLifecycleActionsIT.java",
                    "file_size": 0
                }
            ],
            "interesting": {
                "reopened": false,
                "status": false
            },
            "sha": "c093f7f623e6b64bf2485e7ead3f95e3eca89aa4"
        },
        {
            "diff": "elastic_elasticsearch/issue_50781/commit_331c6c823238440f055753c48b3cb191070cca5b.diff",
            "diff_additions": 1,
            "diff_deletions": 0,
            "diff_file_size": 0,
            "files": [
                {
                    "file_additions": 1,
                    "file_deletions": 0,
                    "file_exists": false,
                    "file_name": "x-pack/plugin/ilm/qa/multi-node/src/test/java/org/elasticsearch/xpack/ilm/TimeSeriesLifecycleActionsIT.java",
                    "file_size": 0
                }
            ],
            "interesting": {
                "reopened": false,
                "status": false
            },
            "sha": "331c6c823238440f055753c48b3cb191070cca5b"
        },
        {
            "diff": "elastic_elasticsearch/issue_50781/commit_80b9d6ab5bc2ab39d54638bf9b16f772d9e7aafc.diff",
            "diff_additions": 37,
            "diff_deletions": 22,
            "diff_file_size": 0,
            "files": [
                {
                    "file_additions": 37,
                    "file_deletions": 22,
                    "file_exists": false,
                    "file_name": "x-pack/plugin/ilm/qa/multi-node/src/test/java/org/elasticsearch/xpack/ilm/TimeSeriesLifecycleActionsIT.java",
                    "file_size": 0
                }
            ],
            "interesting": {
                "reopened": false,
                "status": false
            },
            "sha": "80b9d6ab5bc2ab39d54638bf9b16f772d9e7aafc"
        },
        {
            "diff": "elastic_elasticsearch/issue_50781/commit_76427effd1859ab21196921a75c43c55658722ff.diff",
            "diff_additions": 1,
            "diff_deletions": 0,
            "diff_file_size": 0,
            "files": [
                {
                    "file_additions": 1,
                    "file_deletions": 0,
                    "file_exists": false,
                    "file_name": "x-pack/plugin/ilm/qa/multi-node/src/test/java/org/elasticsearch/xpack/ilm/TimeSeriesLifecycleActionsIT.java",
                    "file_size": 0
                }
            ],
            "interesting": {
                "reopened": false,
                "status": false
            },
            "sha": "76427effd1859ab21196921a75c43c55658722ff"
        },
        {
            "diff": "elastic_elasticsearch/issue_50781/commit_e0e35b7feb3c61faaaab69cfd54b019f8852d9ec.diff",
            "diff_additions": 1,
            "diff_deletions": 0,
            "diff_file_size": 0,
            "files": [
                {
                    "file_additions": 1,
                    "file_deletions": 0,
                    "file_exists": false,
                    "file_name": "x-pack/plugin/ilm/qa/multi-node/src/test/java/org/elasticsearch/xpack/ilm/TimeSeriesLifecycleActionsIT.java",
                    "file_size": 0
                }
            ],
            "interesting": {
                "reopened": true,
                "status": false
            },
            "sha": "e0e35b7feb3c61faaaab69cfd54b019f8852d9ec"
        }
    ],
    "first_commit": "2020-01-09 10:42:02",
    "last_commit": "2020-01-29 12:08:55",
    "number": 50781,
    "score": 144.0017182130584
}