{
    "category": [
        "memory",
        "build/refactor/preprocessing"
    ],
    "commits": [
        {
            "associated_pull_request": [],
            "date": "2017-03-19 09:42:53",
            "diff": "mruby_mruby/issue_3515/commit_4cf38eb9032ab70544f940941703a0c09529539f.diff",
            "diff_additions": 2,
            "diff_deletions": 5,
            "diff_file_size": 77025,
            "diff_url": "https://github.com/mruby/mruby/commit/4cf38eb9032ab70544f940941703a0c09529539f.diff",
            "exists": true,
            "files": [
                {
                    "file_additions": 2,
                    "file_deletions": 5,
                    "file_exists": true,
                    "file_name": "mrbgems/mruby-compiler/core/codegen.c",
                    "file_size": 77025
                }
            ],
            "interesting": {
                "reopen": false,
                "status": false
            },
            "is_parent": true,
            "sha": "4cf38eb9032ab70544f940941703a0c09529539f"
        },
        {
            "associated_pull_request": [],
            "date": "2017-03-19 11:41:51",
            "diff": "mruby_mruby/issue_3515/commit_ef105b5ca41018f30c38f9738d5b54c4aa0fe6e4.diff",
            "diff_additions": 5,
            "diff_deletions": 2,
            "diff_file_size": 22070,
            "diff_url": "https://github.com/mruby/mruby/commit/ef105b5ca41018f30c38f9738d5b54c4aa0fe6e4.diff",
            "exists": true,
            "files": [
                {
                    "file_additions": 4,
                    "file_deletions": 1,
                    "file_exists": true,
                    "file_name": "mrbgems/mruby-proc-ext/src/proc.c",
                    "file_size": 5332
                },
                {
                    "file_additions": 1,
                    "file_deletions": 1,
                    "file_exists": true,
                    "file_name": "src/error.c",
                    "file_size": 16738
                }
            ],
            "interesting": {
                "reopen": false,
                "status": false
            },
            "is_parent": false,
            "sha": "ef105b5ca41018f30c38f9738d5b54c4aa0fe6e4"
        },
        {
            "associated_pull_request": [],
            "date": "2017-03-19 11:58:34",
            "diff": "mruby_mruby/issue_3515/commit_527dcd52478567c30547d10c87c867cc01865a82.diff",
            "diff_additions": 2,
            "diff_deletions": 1,
            "diff_file_size": 76493,
            "diff_url": "https://github.com/mruby/mruby/commit/527dcd52478567c30547d10c87c867cc01865a82.diff",
            "exists": true,
            "files": [
                {
                    "file_additions": 2,
                    "file_deletions": 1,
                    "file_exists": true,
                    "file_name": "src/class.c",
                    "file_size": 76493
                }
            ],
            "interesting": {
                "reopen": false,
                "status": false
            },
            "is_parent": false,
            "sha": "527dcd52478567c30547d10c87c867cc01865a82"
        },
        {
            "associated_pull_request": [],
            "date": "2017-03-19 11:59:30",
            "diff": "mruby_mruby/issue_3515/commit_09574922a987aaa0813a4dfd37ac89ca60ca4281.diff",
            "diff_additions": 11,
            "diff_deletions": 9,
            "diff_file_size": 34121,
            "diff_url": "https://github.com/mruby/mruby/commit/09574922a987aaa0813a4dfd37ac89ca60ca4281.diff",
            "exists": true,
            "files": [
                {
                    "file_additions": 11,
                    "file_deletions": 9,
                    "file_exists": true,
                    "file_name": "src/array.c",
                    "file_size": 34121
                }
            ],
            "interesting": {
                "reopen": false,
                "status": true
            },
            "is_parent": false,
            "sha": "09574922a987aaa0813a4dfd37ac89ca60ca4281"
        },
        {
            "associated_pull_request": [],
            "date": "2017-04-25 01:39:11",
            "diff": "mruby_mruby/issue_3515/commit_88cd807379152ea3fec5f534e5f4d6ebebd53982.diff",
            "diff_additions": 55,
            "diff_deletions": 43,
            "diff_file_size": 142540,
            "diff_url": "https://github.com/mruby/mruby/commit/88cd807379152ea3fec5f534e5f4d6ebebd53982.diff",
            "exists": true,
            "files": [
                {
                    "file_additions": 5,
                    "file_deletions": 5,
                    "file_exists": true,
                    "file_name": "mrbgems/mruby-compiler/core/codegen.c",
                    "file_size": 77025
                },
                {
                    "file_additions": 7,
                    "file_deletions": 4,
                    "file_exists": true,
                    "file_name": "mrbgems/mruby-eval/src/eval.c",
                    "file_size": 6861
                },
                {
                    "file_additions": 1,
                    "file_deletions": 4,
                    "file_exists": true,
                    "file_name": "mrbgems/mruby-proc-ext/src/proc.c",
                    "file_size": 5332
                },
                {
                    "file_additions": 30,
                    "file_deletions": 6,
                    "file_exists": true,
                    "file_name": "mrbgems/mruby-time/src/time.c",
                    "file_size": 30241
                },
                {
                    "file_additions": 4,
                    "file_deletions": 7,
                    "file_exists": true,
                    "file_name": "src/backtrace.c",
                    "file_size": 6343
                },
                {
                    "file_additions": 8,
                    "file_deletions": 17,
                    "file_exists": true,
                    "file_name": "src/error.c",
                    "file_size": 16738
                }
            ],
            "interesting": {
                "reopen": false,
                "status": false
            },
            "is_parent": false,
            "sha": "88cd807379152ea3fec5f534e5f4d6ebebd53982"
        }
    ],
    "first_commit": "2017-03-19 09:42:53",
    "last_commit": "2017-04-25 01:41:50",
    "number": 3515,
    "pull_request": "None",
    "score": {
        "accidental_reopen_likely": false,
        "all_labels": [],
        "contains_keywords": [
            "fix",
            "reason",
            "bug",
            "error",
            "crash"
        ],
        "fix_size": 103,
        "has_labels": [],
        "intersecting": {
            "computed_score": 0.07954545454545454,
            "final_commit_size": 88,
            "intersection_size": 7,
            "previous_commits_size": 22
        },
        "is_makefile_based": true,
        "no_new_files": [
            "mrbgems/mruby-compiler/core/codegen.c",
            "mrbgems/mruby-eval/src/eval.c",
            "mrbgems/mruby-time/src/time.c",
            "src/backtrace.c"
        ],
        "no_other_files": true,
        "num_prohibited_files": 29000,
        "prohibited_files": [
            "kill.h",
            "meminfo.h",
            "kill.h",
            "meminfo.h",
            "kill.h",
            "meminfo.h",
            "testsuite_cli_test.go",
            "testsuite_cli_test.go",
            "common.mk",
            "i3bar/include/draw_util.h"
        ],
        "reopen": false,
        "reopen_events": [
            [
                "2017-03-19 12:01:59",
                "closed"
            ],
            [
                "2017-03-19 12:01:59",
                "commit"
            ],
            [
                "2017-03-19 12:01:59",
                "commit"
            ],
            [
                "2017-03-19 12:01:59",
                "commit"
            ],
            [
                "2017-04-25 01:42:26",
                "commit"
            ]
        ],
        "status": true,
        "strategy": true,
        "total_changes": 135
    }
}