{
    "covered_issues": [
        284,
        277,
        276,
        260,
        259,
        254,
        250,
        247,
        246,
        243,
        240,
        239,
        238,
        237,
        234,
        231,
        226,
        222,
        221,
        219,
        217,
        212,
        211,
        210,
        209,
        206,
        205,
        200,
        197,
        196,
        189,
        187,
        184,
        183,
        177,
        175,
        173,
        170,
        169,
        164,
        162,
        160,
        158,
        155,
        153,
        152,
        151,
        150,
        148,
        147,
        143,
        141,
        140,
        138,
        136,
        131,
        129,
        127,
        126,
        125,
        124,
        119,
        117,
        116,
        115,
        114,
        113,
        112,
        110,
        107,
        106,
        105,
        104,
        102,
        101,
        100,
        99,
        98,
        97,
        96,
        95,
        94,
        93,
        89,
        88,
        87,
        86,
        85,
        84,
        83,
        80,
        78,
        77,
        76,
        75,
        74,
        71,
        70,
        69,
        68,
        66,
        65,
        64,
        63,
        61,
        60,
        59,
        58,
        57,
        55,
        54,
        53,
        51,
        50,
        48,
        47,
        46,
        43,
        41,
        40,
        39,
        38,
        37,
        36,
        35,
        34,
        33,
        32,
        31,
        30,
        28,
        27,
        26,
        25,
        24,
        23,
        22,
        21,
        20,
        19,
        18,
        17,
        16,
        15,
        14,
        13,
        12,
        11,
        10,
        9,
        8,
        7,
        6,
        5,
        4,
        3,
        2,
        1
    ],
    "finished": true
}