{
    "covered_issues": [
        415,
        411,
        405,
        403,
        401,
        396,
        391,
        389,
        388,
        385,
        384,
        383,
        381,
        378,
        377,
        375,
        369,
        368,
        363,
        356,
        355,
        353,
        352,
        351,
        347,
        346,
        343,
        342,
        341,
        340,
        339,
        338,
        334,
        328,
        324,
        323,
        321,
        315,
        313,
        312,
        310,
        307,
        306,
        304,
        303,
        302,
        299,
        296,
        290,
        287,
        285,
        280,
        278,
        277,
        275,
        271,
        270,
        268,
        263,
        259,
        258,
        257,
        256,
        254,
        253,
        251,
        249,
        246,
        245,
        243,
        241,
        240,
        239,
        234,
        232,
        229,
        228,
        226,
        225,
        224,
        223,
        210,
        209,
        201,
        199,
        186,
        178,
        175,
        174,
        173,
        166,
        165,
        164,
        163,
        162,
        161,
        156,
        154,
        153,
        152,
        147,
        145,
        142,
        139,
        138,
        137,
        136,
        134,
        133,
        132,
        130,
        127,
        125,
        114,
        113,
        111,
        109,
        106,
        105,
        102,
        101,
        100,
        99,
        98,
        96,
        94,
        93,
        92,
        91,
        90,
        89,
        87,
        86,
        85,
        82,
        81,
        80,
        74,
        71,
        70,
        68,
        67,
        65,
        62,
        61,
        60,
        57,
        55,
        51,
        50,
        48,
        47,
        46,
        45,
        44,
        43,
        42,
        41,
        39,
        38,
        37,
        36,
        35,
        34,
        33,
        32,
        31,
        30,
        29,
        28,
        27,
        26,
        25,
        24,
        23,
        22,
        21,
        19,
        18,
        17,
        16,
        15,
        14,
        13,
        12,
        10,
        9,
        8,
        7,
        6,
        5,
        4,
        3,
        2,
        1
    ],
    "finished": true
}