{
    "commits": [
        {
            "associated_pull_request": [],
            "date": "2023-03-08 10:36:15+00:00",
            "diff": "gpac_gpac/issue_2381/commit_2dcffa5fbcefce66cb9e359250febe3b4db406f1.diff",
            "diff_additions": 8,
            "diff_deletions": 5,
            "diff_file_size": 293794,
            "diff_url": "https://github.com/gpac/gpac/commit/2dcffa5fbcefce66cb9e359250febe3b4db406f1.diff",
            "exists": true,
            "files": [
                {
                    "file_additions": 8,
                    "file_deletions": 5,
                    "file_exists": true,
                    "file_name": "src/filters/mux_isom.c",
                    "file_size": 293794
                }
            ],
            "interesting": {
                "reopen": false,
                "status": true
            },
            "is_parent": true,
            "sha": "2dcffa5fbcefce66cb9e359250febe3b4db406f1"
        },
        {
            "associated_pull_request": [],
            "date": "2023-03-08 12:12:22+00:00",
            "diff": "gpac_gpac/issue_2381/commit_33f8b3b51d8963dcd65b3851ca55a068be1947f1.diff",
            "diff_additions": 14,
            "diff_deletions": 9,
            "diff_file_size": 19818,
            "diff_url": "https://github.com/gpac/gpac/commit/33f8b3b51d8963dcd65b3851ca55a068be1947f1.diff",
            "exists": true,
            "files": [
                {
                    "file_additions": 14,
                    "file_deletions": 9,
                    "file_exists": true,
                    "file_name": "src/filters/reframe_ac3.c",
                    "file_size": 19818
                }
            ],
            "interesting": {
                "reopen": false,
                "status": true
            },
            "is_parent": false,
            "sha": "33f8b3b51d8963dcd65b3851ca55a068be1947f1"
        },
        {
            "associated_pull_request": [],
            "date": "2023-03-13 09:29:13+00:00",
            "diff": "gpac_gpac/issue_2381/commit_f5aeea95222bf443978d0073f6027a77da99c4d6.diff",
            "diff_additions": 14,
            "diff_deletions": 1,
            "diff_file_size": 293922,
            "diff_url": "https://github.com/gpac/gpac/commit/f5aeea95222bf443978d0073f6027a77da99c4d6.diff",
            "exists": true,
            "files": [
                {
                    "file_additions": 14,
                    "file_deletions": 1,
                    "file_exists": true,
                    "file_name": "src/isomedia/isom_write.c",
                    "file_size": 293922
                }
            ],
            "interesting": {
                "reopen": false,
                "status": false
            },
            "is_parent": false,
            "sha": "f5aeea95222bf443978d0073f6027a77da99c4d6"
        }
    ],
    "first_commit": "2023-03-08 10:36:15+00:00",
    "last_commit": "2023-03-13 09:29:13+00:00",
    "number": 2381,
    "pull_request": "None",
    "score": {
        "accidental_reopen_likely": false,
        "all_labels": [],
        "contains_keywords": [
            "work",
            "chang",
            "fix",
            "issu",
            "patch",
            "test",
            "fault",
            "remov",
            "bug",
            "problem",
            "report"
        ],
        "fix_size": 33,
        "has_labels": [],
        "intersecting": {
            "computed_score": 0.0,
            "final_commit_size": 16,
            "intersection_size": 0,
            "previous_commits_size": 17
        },
        "is_makefile_based": true,
        "no_new_files": [
            "src/isomedia/isom_write.c"
        ],
        "no_other_files": false,
        "num_prohibited_files": 125174,
        "prohibited_files": [
            "server/src/main/java/com/genymobile/scrcpy/Device.java",
            "server/src/main/java/com/genymobile/scrcpy/wrappers/SurfaceControl.java",
            "server/src/main/java/com/genymobile/scrcpy/Device.java",
            "server/src/main/java/com/genymobile/scrcpy/wrappers/SurfaceControl.java",
            "app/meson.build",
            "app/scrcpy.1",
            "app/src/common.h",
            "app/src/scrcpy.h",
            "app/src/server.h",
            "server/src/main/java/com/genymobile/scrcpy/Workarounds.java"
        ],
        "reopen": false,
        "reopen_events": [
            [
                "2023-03-08 12:12:33+00:00",
                "commit"
            ],
            [
                "2023-03-13 09:29:20+00:00",
                "commit"
            ],
            [
                "2023-03-13 09:30:41+00:00",
                "closed"
            ]
        ],
        "status": true,
        "strategy": true,
        "total_changes": 51
    }
}