{
    "category": [
        "network/protocol",
        "control flow"
    ],
    "commits": [
        {
            "associated_pull_request": [
                "https://github.com/jerryscript-project/jerryscript/pull/2984"
            ],
            "date": "2019-07-17 09:29:29",
            "diff": "jerryscript-project_jerryscript/issue_3107/commit_84fdfcd44eebc6266e1652780ec94ac27b67faf7.diff",
            "diff_additions": 181,
            "diff_deletions": 0,
            "diff_file_size": 62761,
            "diff_url": "https://github.com/jerryscript-project/jerryscript/commit/84fdfcd44eebc6266e1652780ec94ac27b67faf7.diff",
            "exists": true,
            "files": [
                {
                    "file_additions": 181,
                    "file_deletions": 0,
                    "file_exists": true,
                    "file_name": "jerry-core/ecma/builtin-objects/typedarray/ecma-builtin-typedarray-prototype.c",
                    "file_size": 62761
                }
            ],
            "interesting": {
                "reopen": false,
                "status": false
            },
            "is_parent": true,
            "sha": "84fdfcd44eebc6266e1652780ec94ac27b67faf7"
        },
        {
            "associated_pull_request": [],
            "date": "2019-09-13 11:12:32",
            "diff": "jerryscript-project_jerryscript/issue_3107/commit_e86ae12ed7deb4d3b8ddd9c1ab77e59e32d20148.diff",
            "diff_additions": 1,
            "diff_deletions": 1,
            "diff_file_size": 62761,
            "diff_url": "https://github.com/jerryscript-project/jerryscript/commit/e86ae12ed7deb4d3b8ddd9c1ab77e59e32d20148.diff",
            "exists": true,
            "files": [
                {
                    "file_additions": 1,
                    "file_deletions": 1,
                    "file_exists": true,
                    "file_name": "jerry-core/ecma/builtin-objects/typedarray/ecma-builtin-typedarray-prototype.c",
                    "file_size": 62761
                }
            ],
            "interesting": {
                "reopen": false,
                "status": true
            },
            "is_parent": false,
            "sha": "e86ae12ed7deb4d3b8ddd9c1ab77e59e32d20148"
        },
        {
            "associated_pull_request": [],
            "date": "2019-09-13 11:12:32",
            "diff": "jerryscript-project_jerryscript/issue_3107/commit_f65961aac2696a834a4be8bf0e7899b87735f852.diff",
            "diff_additions": 1,
            "diff_deletions": 1,
            "diff_file_size": 62761,
            "diff_url": "https://github.com/jerryscript-project/jerryscript/commit/f65961aac2696a834a4be8bf0e7899b87735f852.diff",
            "exists": true,
            "files": [
                {
                    "file_additions": 1,
                    "file_deletions": 1,
                    "file_exists": true,
                    "file_name": "jerry-core/ecma/builtin-objects/typedarray/ecma-builtin-typedarray-prototype.c",
                    "file_size": 62761
                }
            ],
            "interesting": {
                "reopen": false,
                "status": false
            },
            "is_parent": false,
            "sha": "f65961aac2696a834a4be8bf0e7899b87735f852"
        },
        {
            "associated_pull_request": [
                "https://github.com/jerryscript-project/jerryscript/pull/3108"
            ],
            "date": "2019-09-13 11:12:32",
            "diff": "jerryscript-project_jerryscript/issue_3107/commit_877b5fb0623e211334d53c01820ca5edf667c2b0.diff",
            "diff_additions": 1,
            "diff_deletions": 1,
            "diff_file_size": 62761,
            "diff_url": "https://github.com/jerryscript-project/jerryscript/commit/877b5fb0623e211334d53c01820ca5edf667c2b0.diff",
            "exists": true,
            "files": [
                {
                    "file_additions": 1,
                    "file_deletions": 1,
                    "file_exists": true,
                    "file_name": "jerry-core/ecma/builtin-objects/typedarray/ecma-builtin-typedarray-prototype.c",
                    "file_size": 62761
                }
            ],
            "interesting": {
                "reopen": false,
                "status": false
            },
            "is_parent": false,
            "sha": "877b5fb0623e211334d53c01820ca5edf667c2b0"
        },
        {
            "associated_pull_request": [
                "https://github.com/jerryscript-project/jerryscript/pull/3108"
            ],
            "date": "2019-09-17 15:24:47",
            "diff": "jerryscript-project_jerryscript/issue_3107/commit_0eae2f6207122dc1fe097dd2aef0515d8ca8f7e1.diff",
            "diff_additions": 1,
            "diff_deletions": 1,
            "diff_file_size": 62761,
            "diff_url": "https://github.com/jerryscript-project/jerryscript/commit/0eae2f6207122dc1fe097dd2aef0515d8ca8f7e1.diff",
            "exists": true,
            "files": [
                {
                    "file_additions": 1,
                    "file_deletions": 1,
                    "file_exists": true,
                    "file_name": "jerry-core/ecma/builtin-objects/typedarray/ecma-builtin-typedarray-prototype.c",
                    "file_size": 62761
                }
            ],
            "interesting": {
                "reopen": false,
                "status": false
            },
            "is_parent": false,
            "sha": "0eae2f6207122dc1fe097dd2aef0515d8ca8f7e1"
        }
    ],
    "first_commit": "2019-09-04 07:33:44",
    "last_commit": "2019-09-17 15:24:47",
    "number": 3107,
    "pull_request": "None",
    "score": {
        "accidental_reopen_likely": false,
        "all_labels": [
            "ES2015",
            "bug"
        ],
        "contains_keywords": [],
        "fix_size": 2,
        "has_labels": [
            "bug"
        ],
        "intersecting": {
            "computed_score": 1.0,
            "final_commit_size": 2,
            "intersection_size": 2,
            "previous_commits_size": 2
        },
        "is_makefile_based": true,
        "no_new_files": [],
        "no_other_files": false,
        "num_prohibited_files": 128247,
        "prohibited_files": [
            "kill.h",
            "meminfo.h",
            "kill.h",
            "meminfo.h",
            "kill.h",
            "meminfo.h",
            "testsuite_cli_test.go",
            "testsuite_cli_test.go",
            "common.mk",
            "i3bar/include/draw_util.h"
        ],
        "reopen": false,
        "reopen_events": [
            [
                "2019-09-13 11:07:49",
                "commit"
            ],
            [
                "2019-09-13 11:13:49",
                "commit"
            ],
            [
                "2019-09-13 11:44:40",
                "commit"
            ],
            [
                "2019-09-16 09:40:37",
                "commit"
            ],
            [
                "2019-09-17 10:24:40",
                "commit"
            ],
            [
                "2019-09-17 15:24:49",
                "closed"
            ],
            [
                "2019-09-17 15:24:50",
                "commit"
            ]
        ],
        "status": true,
        "strategy": true,
        "total_changes": 189
    }
}