{
    "commits": [
        {
            "associated_pull_request": [],
            "date": "2014-06-30 22:06:44+00:00",
            "diff": "openwall_john/issue_2802/commit_b53935e2956e225ea27f23e61f5e91a2e217d100.diff",
            "diff_additions": 31,
            "diff_deletions": 1,
            "diff_file_size": 15301,
            "diff_url": "https://github.com/openwall/john/commit/b53935e2956e225ea27f23e61f5e91a2e217d100.diff",
            "exists": true,
            "files": [
                {
                    "file_additions": 31,
                    "file_deletions": 1,
                    "file_exists": true,
                    "file_name": "src/rawmd5u_fmt_plug.c",
                    "file_size": 15301
                }
            ],
            "interesting": {
                "reopen": false,
                "status": false
            },
            "is_parent": true,
            "sha": "b53935e2956e225ea27f23e61f5e91a2e217d100"
        },
        {
            "associated_pull_request": [],
            "date": "2014-07-01 05:40:18+00:00",
            "diff": "openwall_john/issue_2802/commit_91bd304258c4edfda84fc89c77d1e586e7bb6e59.diff",
            "diff_additions": 165,
            "diff_deletions": 5,
            "diff_file_size": 106242,
            "diff_url": "https://github.com/openwall/john/commit/91bd304258c4edfda84fc89c77d1e586e7bb6e59.diff",
            "exists": true,
            "files": [
                {
                    "file_additions": 36,
                    "file_deletions": 1,
                    "file_exists": false,
                    "file_name": "src/NT_fmt_plug.c",
                    "file_size": 0
                },
                {
                    "file_additions": 36,
                    "file_deletions": 1,
                    "file_exists": true,
                    "file_name": "src/mscash1_fmt_plug.c",
                    "file_size": 23687
                },
                {
                    "file_additions": 31,
                    "file_deletions": 1,
                    "file_exists": true,
                    "file_name": "src/mssql05_fmt_plug.c",
                    "file_size": 17849
                },
                {
                    "file_additions": 31,
                    "file_deletions": 1,
                    "file_exists": true,
                    "file_name": "src/nt2_fmt_plug.c",
                    "file_size": 20884
                },
                {
                    "file_additions": 31,
                    "file_deletions": 1,
                    "file_exists": true,
                    "file_name": "src/ntlmv1_mschapv2_fmt_plug.c",
                    "file_size": 43822
                }
            ],
            "interesting": {
                "reopen": false,
                "status": false
            },
            "is_parent": false,
            "sha": "91bd304258c4edfda84fc89c77d1e586e7bb6e59"
        },
        {
            "associated_pull_request": [],
            "date": "2017-10-04 10:53:59+00:00",
            "diff": "openwall_john/issue_2802/commit_0ce265dcffff41864143e3bc48de539b4c62649f.diff",
            "diff_additions": 63,
            "diff_deletions": 19,
            "diff_file_size": 158145,
            "diff_url": "https://github.com/openwall/john/commit/0ce265dcffff41864143e3bc48de539b4c62649f.diff",
            "exists": true,
            "files": [
                {
                    "file_additions": 23,
                    "file_deletions": 5,
                    "file_exists": true,
                    "file_name": "src/loader.c",
                    "file_size": 63206
                },
                {
                    "file_additions": 13,
                    "file_deletions": 4,
                    "file_exists": true,
                    "file_name": "src/pp.c",
                    "file_size": 58110
                },
                {
                    "file_additions": 27,
                    "file_deletions": 10,
                    "file_exists": true,
                    "file_name": "src/wordlist.c",
                    "file_size": 36829
                }
            ],
            "interesting": {
                "reopen": true,
                "status": false
            },
            "is_parent": false,
            "sha": "0ce265dcffff41864143e3bc48de539b4c62649f"
        },
        {
            "associated_pull_request": [],
            "date": "2017-10-12 14:51:56+00:00",
            "diff": "openwall_john/issue_2802/commit_01389613a813db1d2372e357235e46b515a3c6ab.diff",
            "diff_additions": 10,
            "diff_deletions": 7,
            "diff_file_size": 94939,
            "diff_url": "https://github.com/openwall/john/commit/01389613a813db1d2372e357235e46b515a3c6ab.diff",
            "exists": true,
            "files": [
                {
                    "file_additions": 5,
                    "file_deletions": 2,
                    "file_exists": true,
                    "file_name": "src/pp.c",
                    "file_size": 58110
                },
                {
                    "file_additions": 5,
                    "file_deletions": 5,
                    "file_exists": true,
                    "file_name": "src/wordlist.c",
                    "file_size": 36829
                }
            ],
            "interesting": {
                "reopen": false,
                "status": false
            },
            "is_parent": false,
            "sha": "01389613a813db1d2372e357235e46b515a3c6ab"
        }
    ],
    "first_commit": "2014-06-30 22:06:44+00:00",
    "last_commit": "2017-10-12 14:51:56+00:00",
    "number": 2802,
    "pull_request": "None",
    "score": {
        "accidental_reopen_likely": true,
        "all_labels": [
            "enhancement"
        ],
        "contains_keywords": [
            "chang",
            "perform",
            "test",
            "fault",
            "warn"
        ],
        "fix_size": 255,
        "has_labels": [],
        "intersecting": {
            "computed_score": 0.7142857142857143,
            "final_commit_size": 14,
            "intersection_size": 10,
            "previous_commits_size": 251
        },
        "is_makefile_based": false,
        "no_new_files": [],
        "no_other_files": true,
        "num_prohibited_files": 54252,
        "prohibited_files": [
            "server/src/main/java/com/genymobile/scrcpy/Device.java",
            "server/src/main/java/com/genymobile/scrcpy/wrappers/SurfaceControl.java",
            "server/src/main/java/com/genymobile/scrcpy/Device.java",
            "server/src/main/java/com/genymobile/scrcpy/wrappers/SurfaceControl.java",
            "app/meson.build",
            "app/scrcpy.1",
            "app/src/common.h",
            "app/src/scrcpy.h",
            "app/src/server.h",
            "server/src/main/java/com/genymobile/scrcpy/Workarounds.java"
        ],
        "reopen": true,
        "reopen_events": [
            [
                "2017-09-30 22:17:12+00:00",
                "commit"
            ],
            [
                "2017-10-04 16:08:09+00:00",
                "closed"
            ],
            [
                "2017-10-04 16:08:09+00:00",
                "commit"
            ],
            [
                "2017-10-12 00:12:22+00:00",
                "reopened"
            ],
            [
                "2017-10-12 00:12:25+00:00",
                "closed"
            ],
            [
                "2017-10-12 16:36:28+00:00",
                "commit"
            ]
        ],
        "status": false,
        "strategy": true,
        "total_changes": 301
    }
}