{
    "covered_issues": [
        332,
        328,
        327,
        321,
        320,
        317,
        315,
        312,
        301,
        287,
        286,
        285,
        283,
        278,
        276,
        272,
        271,
        270,
        269,
        267,
        266,
        265,
        262,
        261,
        260,
        256,
        255,
        254,
        253,
        252,
        250,
        249,
        248,
        246,
        245,
        244,
        242,
        241,
        240,
        239,
        237,
        235,
        233,
        232,
        231,
        230,
        229,
        227,
        226,
        225,
        224,
        223,
        222,
        221,
        220,
        219,
        218,
        213,
        212,
        211,
        210,
        209,
        208,
        207,
        206,
        205,
        204,
        203,
        202,
        200,
        199,
        196,
        195,
        194,
        192,
        190,
        189,
        182,
        181,
        180,
        179,
        177,
        176,
        174,
        173,
        172,
        170,
        168,
        167,
        166,
        165,
        164,
        162,
        161,
        160,
        159,
        158,
        156,
        155,
        154,
        152,
        151,
        150,
        149,
        148,
        147,
        146,
        145,
        143,
        141,
        140,
        139,
        138,
        137,
        135,
        134,
        131,
        130,
        129,
        128,
        127,
        126,
        125,
        124,
        123,
        121,
        120,
        119,
        118,
        117,
        116,
        114,
        111,
        110,
        109,
        108,
        107,
        103,
        102,
        100,
        99,
        98,
        96,
        95,
        94,
        93,
        92,
        91,
        90,
        88,
        87,
        86,
        85,
        82,
        81,
        79,
        76,
        74,
        73,
        69,
        68,
        66,
        63,
        61,
        59,
        58,
        56,
        54,
        53,
        51,
        49,
        48,
        47,
        46,
        39,
        36,
        35,
        34,
        33,
        31,
        30,
        29,
        28,
        27,
        25,
        23,
        22,
        21,
        20,
        19,
        17,
        15,
        11,
        9,
        6,
        5,
        4,
        3,
        2,
        1
    ],
    "finished": true
}