{
    "commits": [
        {
            "diff": "spring-projects_spring-boot/issue_3860/commit_5a287455273270a20742f03e4546acde9e857bee.diff",
            "diff_additions": 54,
            "diff_deletions": 21,
            "diff_file_size": 0,
            "files": [
                {
                    "file_additions": 20,
                    "file_deletions": 11,
                    "file_exists": false,
                    "file_name": "spring-boot/src/main/java/org/springframework/boot/bind/RelaxedDataBinder.java",
                    "file_size": 0
                },
                {
                    "file_additions": 34,
                    "file_deletions": 10,
                    "file_exists": false,
                    "file_name": "spring-boot/src/test/java/org/springframework/boot/bind/RelaxedDataBinderTests.java",
                    "file_size": 0
                }
            ],
            "interesting": {
                "reopened": false,
                "status": false
            },
            "sha": "5a287455273270a20742f03e4546acde9e857bee"
        },
        {
            "diff": "spring-projects_spring-boot/issue_3860/commit_bd942a35fbf90739b19b5d1e292bed63cfc0a865.diff",
            "diff_additions": 2,
            "diff_deletions": 2,
            "diff_file_size": 0,
            "files": [
                {
                    "file_additions": 2,
                    "file_deletions": 2,
                    "file_exists": false,
                    "file_name": "spring-boot-autoconfigure/src/main/java/org/springframework/boot/autoconfigure/hateoas/HypermediaAutoConfiguration.java",
                    "file_size": 0
                }
            ],
            "interesting": {
                "reopened": true,
                "status": false
            },
            "sha": "bd942a35fbf90739b19b5d1e292bed63cfc0a865"
        },
        {
            "diff": "spring-projects_spring-boot/issue_3860/commit_be640965a683135f20559f12f48d1eeb4aa696c2.diff",
            "diff_additions": 7,
            "diff_deletions": 1,
            "diff_file_size": 0,
            "files": [
                {
                    "file_additions": 7,
                    "file_deletions": 1,
                    "file_exists": false,
                    "file_name": "spring-boot-autoconfigure/src/main/java/org/springframework/boot/autoconfigure/hateoas/HypermediaAutoConfiguration.java",
                    "file_size": 0
                }
            ],
            "interesting": {
                "reopened": false,
                "status": false
            },
            "sha": "be640965a683135f20559f12f48d1eeb4aa696c2"
        }
    ],
    "first_commit": "2015-09-01 09:53:58",
    "last_commit": "2015-09-01 14:20:36",
    "number": 3860,
    "score": 384.04597701149424
}