{
    "commits": [
        {
            "associated_pull_request": [
                "https://github.com/varnishcache/varnish-cache/pull/3961"
            ],
            "date": "2023-07-24 10:37:55+00:00",
            "diff": "",
            "diff_additions": 0,
            "diff_deletions": 0,
            "diff_file_size": 0,
            "diff_url": "https://github.com/varnishcache/varnish-cache/commit/1397908648185e6395c14fe6d72f123bd1bcf5cc.diff",
            "exists": true,
            "files": [],
            "interesting": {
                "reopen": false,
                "status": false
            },
            "is_parent": true,
            "sha": "1397908648185e6395c14fe6d72f123bd1bcf5cc"
        },
        {
            "associated_pull_request": [],
            "date": "2023-08-02 08:54:12+00:00",
            "diff": "varnishcache_varnish-cache/issue_3962/commit_48dbbe36da14f58356876c4cbdfb778c8010adeb.diff",
            "diff_additions": 2,
            "diff_deletions": 2,
            "diff_file_size": 10743,
            "diff_url": "https://github.com/varnishcache/varnish-cache/commit/48dbbe36da14f58356876c4cbdfb778c8010adeb.diff",
            "exists": true,
            "files": [
                {
                    "file_additions": 2,
                    "file_deletions": 2,
                    "file_exists": true,
                    "file_name": "bin/varnishd/cache/cache_ban_build.c",
                    "file_size": 10743
                }
            ],
            "interesting": {
                "reopen": false,
                "status": false
            },
            "is_parent": false,
            "sha": "48dbbe36da14f58356876c4cbdfb778c8010adeb"
        },
        {
            "associated_pull_request": [],
            "date": "2023-08-02 08:54:12+00:00",
            "diff": "varnishcache_varnish-cache/issue_3962/commit_ad425309780a88a7c89635437d3da86775f95cd9.diff",
            "diff_additions": 1,
            "diff_deletions": 1,
            "diff_file_size": 10743,
            "diff_url": "https://github.com/varnishcache/varnish-cache/commit/ad425309780a88a7c89635437d3da86775f95cd9.diff",
            "exists": true,
            "files": [
                {
                    "file_additions": 1,
                    "file_deletions": 1,
                    "file_exists": true,
                    "file_name": "bin/varnishd/cache/cache_ban_build.c",
                    "file_size": 10743
                }
            ],
            "interesting": {
                "reopen": false,
                "status": false
            },
            "is_parent": false,
            "sha": "ad425309780a88a7c89635437d3da86775f95cd9"
        },
        {
            "associated_pull_request": [],
            "date": "2023-08-02 08:54:12+00:00",
            "diff": "varnishcache_varnish-cache/issue_3962/commit_9f0b0bf8469479c76ac7d5746c7b69ddcbfe65db.diff",
            "diff_additions": 2,
            "diff_deletions": 1,
            "diff_file_size": 10743,
            "diff_url": "https://github.com/varnishcache/varnish-cache/commit/9f0b0bf8469479c76ac7d5746c7b69ddcbfe65db.diff",
            "exists": true,
            "files": [
                {
                    "file_additions": 2,
                    "file_deletions": 1,
                    "file_exists": true,
                    "file_name": "bin/varnishd/cache/cache_ban_build.c",
                    "file_size": 10743
                }
            ],
            "interesting": {
                "reopen": false,
                "status": false
            },
            "is_parent": false,
            "sha": "9f0b0bf8469479c76ac7d5746c7b69ddcbfe65db"
        },
        {
            "associated_pull_request": [],
            "date": "2023-08-02 08:54:12+00:00",
            "diff": "varnishcache_varnish-cache/issue_3962/commit_6e7725dc9a7e9333f6cdffd108ab7928f5f85163.diff",
            "diff_additions": 5,
            "diff_deletions": 2,
            "diff_file_size": 10743,
            "diff_url": "https://github.com/varnishcache/varnish-cache/commit/6e7725dc9a7e9333f6cdffd108ab7928f5f85163.diff",
            "exists": true,
            "files": [
                {
                    "file_additions": 5,
                    "file_deletions": 2,
                    "file_exists": true,
                    "file_name": "bin/varnishd/cache/cache_ban_build.c",
                    "file_size": 10743
                }
            ],
            "interesting": {
                "reopen": false,
                "status": false
            },
            "is_parent": false,
            "sha": "6e7725dc9a7e9333f6cdffd108ab7928f5f85163"
        },
        {
            "associated_pull_request": [],
            "date": "2023-08-08 12:51:41+00:00",
            "diff": "varnishcache_varnish-cache/issue_3962/commit_2d947ae9136f4f746b7d193ad9a47390a7931a16.diff",
            "diff_additions": 3,
            "diff_deletions": 0,
            "diff_file_size": 10743,
            "diff_url": "https://github.com/varnishcache/varnish-cache/commit/2d947ae9136f4f746b7d193ad9a47390a7931a16.diff",
            "exists": true,
            "files": [
                {
                    "file_additions": 3,
                    "file_deletions": 0,
                    "file_exists": true,
                    "file_name": "bin/varnishd/cache/cache_ban_build.c",
                    "file_size": 10743
                }
            ],
            "interesting": {
                "reopen": false,
                "status": true
            },
            "is_parent": false,
            "sha": "2d947ae9136f4f746b7d193ad9a47390a7931a16"
        },
        {
            "associated_pull_request": [],
            "date": "2023-08-08 12:51:41+00:00",
            "diff": "varnishcache_varnish-cache/issue_3962/commit_3c5f5f17828cc290cceb019a5b231cbc0b22038b.diff",
            "diff_additions": 3,
            "diff_deletions": 0,
            "diff_file_size": 10743,
            "diff_url": "https://github.com/varnishcache/varnish-cache/commit/3c5f5f17828cc290cceb019a5b231cbc0b22038b.diff",
            "exists": true,
            "files": [
                {
                    "file_additions": 3,
                    "file_deletions": 0,
                    "file_exists": true,
                    "file_name": "bin/varnishd/cache/cache_ban_build.c",
                    "file_size": 10743
                }
            ],
            "interesting": {
                "reopen": false,
                "status": false
            },
            "is_parent": false,
            "sha": "3c5f5f17828cc290cceb019a5b231cbc0b22038b"
        },
        {
            "associated_pull_request": [],
            "date": "2023-08-02 08:54:12+00:00",
            "diff": "varnishcache_varnish-cache/issue_3962/commit_b8b327b54890c252e72d759042ac84e652253598.diff",
            "diff_additions": 5,
            "diff_deletions": 2,
            "diff_file_size": 10743,
            "diff_url": "https://github.com/varnishcache/varnish-cache/commit/b8b327b54890c252e72d759042ac84e652253598.diff",
            "exists": true,
            "files": [
                {
                    "file_additions": 5,
                    "file_deletions": 2,
                    "file_exists": true,
                    "file_name": "bin/varnishd/cache/cache_ban_build.c",
                    "file_size": 10743
                }
            ],
            "interesting": {
                "reopen": false,
                "status": false
            },
            "is_parent": false,
            "sha": "b8b327b54890c252e72d759042ac84e652253598"
        },
        {
            "associated_pull_request": [],
            "date": "2023-08-08 12:51:41+00:00",
            "diff": "varnishcache_varnish-cache/issue_3962/commit_3268d1b8bba3aa67fa80f876e697018bf7eea26d.diff",
            "diff_additions": 3,
            "diff_deletions": 0,
            "diff_file_size": 10743,
            "diff_url": "https://github.com/varnishcache/varnish-cache/commit/3268d1b8bba3aa67fa80f876e697018bf7eea26d.diff",
            "exists": true,
            "files": [
                {
                    "file_additions": 3,
                    "file_deletions": 0,
                    "file_exists": true,
                    "file_name": "bin/varnishd/cache/cache_ban_build.c",
                    "file_size": 10743
                }
            ],
            "interesting": {
                "reopen": false,
                "status": false
            },
            "is_parent": false,
            "sha": "3268d1b8bba3aa67fa80f876e697018bf7eea26d"
        },
        {
            "associated_pull_request": [
                "https://github.com/varnishcache/varnish-cache/pull/3964"
            ],
            "date": "2023-08-02 08:54:12+00:00",
            "diff": "varnishcache_varnish-cache/issue_3962/commit_ac41234e1f38383c90c5d309f303c7d4e9dcae28.diff",
            "diff_additions": 5,
            "diff_deletions": 2,
            "diff_file_size": 10743,
            "diff_url": "https://github.com/varnishcache/varnish-cache/commit/ac41234e1f38383c90c5d309f303c7d4e9dcae28.diff",
            "exists": true,
            "files": [
                {
                    "file_additions": 5,
                    "file_deletions": 2,
                    "file_exists": true,
                    "file_name": "bin/varnishd/cache/cache_ban_build.c",
                    "file_size": 10743
                }
            ],
            "interesting": {
                "reopen": false,
                "status": false
            },
            "is_parent": false,
            "sha": "ac41234e1f38383c90c5d309f303c7d4e9dcae28"
        },
        {
            "associated_pull_request": [
                "https://github.com/varnishcache/varnish-cache/pull/3964"
            ],
            "date": "2023-08-08 12:51:41+00:00",
            "diff": "varnishcache_varnish-cache/issue_3962/commit_9b8cfa4d8f8c98379d3d91ca54b00c33838ea196.diff",
            "diff_additions": 3,
            "diff_deletions": 0,
            "diff_file_size": 10743,
            "diff_url": "https://github.com/varnishcache/varnish-cache/commit/9b8cfa4d8f8c98379d3d91ca54b00c33838ea196.diff",
            "exists": true,
            "files": [
                {
                    "file_additions": 3,
                    "file_deletions": 0,
                    "file_exists": true,
                    "file_name": "bin/varnishd/cache/cache_ban_build.c",
                    "file_size": 10743
                }
            ],
            "interesting": {
                "reopen": false,
                "status": false
            },
            "is_parent": false,
            "sha": "9b8cfa4d8f8c98379d3d91ca54b00c33838ea196"
        },
        {
            "associated_pull_request": [
                "https://github.com/varnishcache/varnish-cache/pull/3964"
            ],
            "date": "2023-08-02 08:54:12+00:00",
            "diff": "varnishcache_varnish-cache/issue_3962/commit_a8cde64ad7f6914b46dde6d23a29a05cada3938b.diff",
            "diff_additions": 5,
            "diff_deletions": 2,
            "diff_file_size": 10743,
            "diff_url": "https://github.com/varnishcache/varnish-cache/commit/a8cde64ad7f6914b46dde6d23a29a05cada3938b.diff",
            "exists": true,
            "files": [
                {
                    "file_additions": 5,
                    "file_deletions": 2,
                    "file_exists": true,
                    "file_name": "bin/varnishd/cache/cache_ban_build.c",
                    "file_size": 10743
                }
            ],
            "interesting": {
                "reopen": false,
                "status": false
            },
            "is_parent": false,
            "sha": "a8cde64ad7f6914b46dde6d23a29a05cada3938b"
        },
        {
            "associated_pull_request": [
                "https://github.com/varnishcache/varnish-cache/pull/3964"
            ],
            "date": "2023-08-08 12:51:41+00:00",
            "diff": "varnishcache_varnish-cache/issue_3962/commit_c8bb415047cb6edeb3ba89391c83f77f93809ee1.diff",
            "diff_additions": 3,
            "diff_deletions": 0,
            "diff_file_size": 10743,
            "diff_url": "https://github.com/varnishcache/varnish-cache/commit/c8bb415047cb6edeb3ba89391c83f77f93809ee1.diff",
            "exists": true,
            "files": [
                {
                    "file_additions": 3,
                    "file_deletions": 0,
                    "file_exists": true,
                    "file_name": "bin/varnishd/cache/cache_ban_build.c",
                    "file_size": 10743
                }
            ],
            "interesting": {
                "reopen": false,
                "status": false
            },
            "is_parent": false,
            "sha": "c8bb415047cb6edeb3ba89391c83f77f93809ee1"
        }
    ],
    "first_commit": "2023-07-31 13:12:53+00:00",
    "last_commit": "2023-08-16 15:17:00+00:00",
    "number": 3962,
    "pull_request": "None",
    "score": {
        "accidental_reopen_likely": false,
        "all_labels": [],
        "contains_keywords": [
            "work",
            "chang",
            "fix",
            "test",
            "fault",
            "bug"
        ],
        "fix_size": 11,
        "has_labels": [],
        "intersecting": {
            "computed_score": 1.0,
            "final_commit_size": 4,
            "intersection_size": 4,
            "previous_commits_size": 11
        },
        "is_makefile_based": true,
        "no_new_files": [],
        "no_other_files": false,
        "num_prohibited_files": 401857,
        "prohibited_files": [
            "server/src/main/java/com/genymobile/scrcpy/Device.java",
            "server/src/main/java/com/genymobile/scrcpy/wrappers/SurfaceControl.java",
            "server/src/main/java/com/genymobile/scrcpy/Device.java",
            "server/src/main/java/com/genymobile/scrcpy/wrappers/SurfaceControl.java",
            "app/meson.build",
            "app/scrcpy.1",
            "app/src/common.h",
            "app/src/scrcpy.h",
            "app/src/server.h",
            "server/src/main/java/com/genymobile/scrcpy/Workarounds.java"
        ],
        "reopen": false,
        "reopen_events": [
            [
                "2023-08-02 08:59:09+00:00",
                "commit"
            ],
            [
                "2023-08-02 08:59:09+00:00",
                "commit"
            ],
            [
                "2023-08-02 09:02:21+00:00",
                "commit"
            ],
            [
                "2023-08-02 09:02:21+00:00",
                "commit"
            ],
            [
                "2023-08-02 09:08:31+00:00",
                "commit"
            ],
            [
                "2023-08-08 12:17:16+00:00",
                "commit"
            ],
            [
                "2023-08-08 12:17:17+00:00",
                "commit"
            ],
            [
                "2023-08-16 10:11:24+00:00",
                "commit"
            ],
            [
                "2023-08-16 10:11:24+00:00",
                "commit"
            ],
            [
                "2023-08-16 10:25:30+00:00",
                "commit"
            ],
            [
                "2023-08-16 14:52:59+00:00",
                "commit"
            ],
            [
                "2023-08-16 14:52:59+00:00",
                "commit"
            ],
            [
                "2023-08-16 15:05:22+00:00",
                "commit"
            ],
            [
                "2023-08-16 15:05:22+00:00",
                "commit"
            ],
            [
                "2023-08-16 15:17:02+00:00",
                "closed"
            ],
            [
                "2023-08-16 15:17:03+00:00",
                "commit"
            ],
            [
                "2023-08-16 15:17:03+00:00",
                "commit"
            ]
        ],
        "status": true,
        "strategy": true,
        "total_changes": 52
    }
}