{
    "covered_issues": [
        174,
        172,
        160,
        158,
        157,
        155,
        148,
        141,
        137,
        127,
        126,
        122,
        117,
        115,
        114,
        113,
        110,
        109,
        107,
        101,
        99,
        97,
        95,
        80,
        77,
        76,
        75,
        73,
        71,
        67,
        59,
        39,
        30,
        25,
        17,
        16,
        8,
        7,
        6,
        3,
        2
    ],
    "finished": true
}