{
    "covered_issues": [
        20,
        18,
        17,
        16,
        13,
        10,
        9,
        8,
        7,
        6,
        5,
        3,
        2,
        1
    ],
    "finished": true
}