{
    "covered_issues": [
        88,
        87,
        79,
        77,
        68,
        66,
        65,
        61,
        57,
        56,
        54,
        53,
        48,
        47,
        46,
        44,
        43,
        40,
        38,
        36,
        28,
        27,
        23,
        22,
        18,
        15,
        11,
        8,
        7,
        6,
        5,
        4,
        2
    ],
    "finished": true
}