{
    "covered_issues": [
        76,
        72,
        68,
        53,
        45,
        42,
        36,
        35,
        33,
        28,
        24,
        23,
        20,
        19,
        14,
        13,
        12,
        11
    ],
    "finished": true
}