{
    "all_issues": 1098,
    "interesting_issues": 1,
    "last_update": "2023-10-30 23:07:02.674760",
    "license": {
        "download": "https://raw.githubusercontent.com/simd-everywhere/simde/master/COPYING",
        "name": "MIT License"
    },
    "ratio": 0.0009107468123861566,
    "size": 33103,
    "stars": 1972,
    "url": "https://github.com/simd-everywhere/simde"
}