{
    "commits": [
        {
            "associated_pull_request": [],
            "date": "2019-08-12 14:03:46+00:00",
            "diff": "yugabyte_yugabyte-db/issue_1924/commit_f641413f20a1ba8e10cbcc706d6d36673ee424e5.diff",
            "diff_additions": 181,
            "diff_deletions": 213,
            "diff_file_size": 1713998,
            "diff_url": "https://github.com/yugabyte/yugabyte-db/commit/f641413f20a1ba8e10cbcc706d6d36673ee424e5.diff",
            "exists": true,
            "files": [
                {
                    "file_additions": 5,
                    "file_deletions": 6,
                    "file_exists": false,
                    "file_name": "ent/src/yb/integration-tests/snapshot-test.cc",
                    "file_size": 0
                },
                {
                    "file_additions": 3,
                    "file_deletions": 4,
                    "file_exists": false,
                    "file_name": "ent/src/yb/rpc/secure_stream.cc",
                    "file_size": 0
                },
                {
                    "file_additions": 10,
                    "file_deletions": 11,
                    "file_exists": false,
                    "file_name": "ent/src/yb/tablet/tablet_ent.cc",
                    "file_size": 0
                },
                {
                    "file_additions": 1,
                    "file_deletions": 2,
                    "file_exists": true,
                    "file_name": "src/yb/client/ql-stress-test.cc",
                    "file_size": 43958
                },
                {
                    "file_additions": 7,
                    "file_deletions": 8,
                    "file_exists": true,
                    "file_name": "src/yb/client/ql-transaction-test.cc",
                    "file_size": 61709
                },
                {
                    "file_additions": 6,
                    "file_deletions": 7,
                    "file_exists": true,
                    "file_name": "src/yb/client/snapshot-txn-test.cc",
                    "file_size": 36110
                },
                {
                    "file_additions": 12,
                    "file_deletions": 13,
                    "file_exists": true,
                    "file_name": "src/yb/consensus/consensus_peers-test.cc",
                    "file_size": 16993
                },
                {
                    "file_additions": 1,
                    "file_deletions": 2,
                    "file_exists": true,
                    "file_name": "src/yb/consensus/consensus_queue-test.cc",
                    "file_size": 41277
                },
                {
                    "file_additions": 8,
                    "file_deletions": 7,
                    "file_exists": true,
                    "file_name": "src/yb/consensus/log.cc",
                    "file_size": 80000
                },
                {
                    "file_additions": 2,
                    "file_deletions": 4,
                    "file_exists": true,
                    "file_name": "src/yb/consensus/log_cache-test.cc",
                    "file_size": 18267
                },
                {
                    "file_additions": 3,
                    "file_deletions": 4,
                    "file_exists": true,
                    "file_name": "src/yb/docdb/conflict_resolution.cc",
                    "file_size": 59534
                },
                {
                    "file_additions": 7,
                    "file_deletions": 8,
                    "file_exists": true,
                    "file_name": "src/yb/docdb/docdb_test_util.cc",
                    "file_size": 25596
                },
                {
                    "file_additions": 5,
                    "file_deletions": 5,
                    "file_exists": true,
                    "file_name": "src/yb/docdb/shared_lock_manager.cc",
                    "file_size": 14930
                },
                {
                    "file_additions": 4,
                    "file_deletions": 5,
                    "file_exists": true,
                    "file_name": "src/yb/integration-tests/mini_cluster.cc",
                    "file_size": 54070
                },
                {
                    "file_additions": 3,
                    "file_deletions": 3,
                    "file_exists": true,
                    "file_name": "src/yb/integration-tests/raft_consensus-itest.cc",
                    "file_size": 163232
                },
                {
                    "file_additions": 1,
                    "file_deletions": 2,
                    "file_exists": true,
                    "file_name": "src/yb/rpc/messenger.cc",
                    "file_size": 25099
                },
                {
                    "file_additions": 4,
                    "file_deletions": 5,
                    "file_exists": true,
                    "file_name": "src/yb/rpc/reactor.cc",
                    "file_size": 36873
                },
                {
                    "file_additions": 8,
                    "file_deletions": 8,
                    "file_exists": true,
                    "file_name": "src/yb/rpc/service_pool.cc",
                    "file_size": 18460
                },
                {
                    "file_additions": 4,
                    "file_deletions": 5,
                    "file_exists": true,
                    "file_name": "src/yb/rpc/thread_pool.cc",
                    "file_size": 8303
                },
                {
                    "file_additions": 3,
                    "file_deletions": 4,
                    "file_exists": true,
                    "file_name": "src/yb/server/total_mem_watcher.cc",
                    "file_size": 8560
                },
                {
                    "file_additions": 4,
                    "file_deletions": 5,
                    "file_exists": true,
                    "file_name": "src/yb/tablet/mvcc-test.cc",
                    "file_size": 12231
                },
                {
                    "file_additions": 3,
                    "file_deletions": 3,
                    "file_exists": true,
                    "file_name": "src/yb/tablet/tablet.cc",
                    "file_size": 189486
                },
                {
                    "file_additions": 3,
                    "file_deletions": 4,
                    "file_exists": true,
                    "file_name": "src/yb/tablet/transaction_coordinator.cc",
                    "file_size": 78273
                },
                {
                    "file_additions": 3,
                    "file_deletions": 3,
                    "file_exists": true,
                    "file_name": "src/yb/tablet/transaction_participant.cc",
                    "file_size": 88062
                },
                {
                    "file_additions": 5,
                    "file_deletions": 5,
                    "file_exists": true,
                    "file_name": "src/yb/tserver/mini_tablet_server.cc",
                    "file_size": 11838
                },
                {
                    "file_additions": 4,
                    "file_deletions": 5,
                    "file_exists": true,
                    "file_name": "src/yb/tserver/remote_bootstrap_client.cc",
                    "file_size": 29405
                },
                {
                    "file_additions": 3,
                    "file_deletions": 4,
                    "file_exists": true,
                    "file_name": "src/yb/tserver/tablet_service.cc",
                    "file_size": 122198
                },
                {
                    "file_additions": 4,
                    "file_deletions": 4,
                    "file_exists": true,
                    "file_name": "src/yb/tserver/ts_tablet_manager.cc",
                    "file_size": 128543
                },
                {
                    "file_additions": 3,
                    "file_deletions": 4,
                    "file_exists": true,
                    "file_name": "src/yb/util/debug-util-test.cc",
                    "file_size": 18470
                },
                {
                    "file_additions": 3,
                    "file_deletions": 3,
                    "file_exists": true,
                    "file_name": "src/yb/util/net/net_util.cc",
                    "file_size": 23655
                },
                {
                    "file_additions": 3,
                    "file_deletions": 4,
                    "file_exists": true,
                    "file_name": "src/yb/util/priority_thread_pool-test.cc",
                    "file_size": 21531
                },
                {
                    "file_additions": 3,
                    "file_deletions": 3,
                    "file_exists": true,
                    "file_name": "src/yb/util/priority_thread_pool.cc",
                    "file_size": 39520
                },
                {
                    "file_additions": 6,
                    "file_deletions": 6,
                    "file_exists": true,
                    "file_name": "src/yb/util/shared_mem.cc",
                    "file_size": 8427
                },
                {
                    "file_additions": 2,
                    "file_deletions": 10,
                    "file_exists": true,
                    "file_name": "src/yb/util/taskstream-test.cc",
                    "file_size": 4727
                },
                {
                    "file_additions": 19,
                    "file_deletions": 20,
                    "file_exists": true,
                    "file_name": "src/yb/util/threadpool-test.cc",
                    "file_size": 28101
                },
                {
                    "file_additions": 8,
                    "file_deletions": 8,
                    "file_exists": true,
                    "file_name": "src/yb/yql/pgwrapper/pg_libpq-test.cc",
                    "file_size": 151724
                },
                {
                    "file_additions": 5,
                    "file_deletions": 5,
                    "file_exists": true,
                    "file_name": "src/yb/yql/pgwrapper/pg_wrapper.cc",
                    "file_size": 40019
                },
                {
                    "file_additions": 3,
                    "file_deletions": 4,
                    "file_exists": true,
                    "file_name": "src/yb/yql/redis/redisserver/redis_client.cc",
                    "file_size": 4817
                }
            ],
            "interesting": {
                "reopen": false,
                "status": false
            },
            "is_parent": true,
            "sha": "f641413f20a1ba8e10cbcc706d6d36673ee424e5"
        },
        {
            "associated_pull_request": [],
            "date": "2019-08-09 21:28:09+00:00",
            "diff": "yugabyte_yugabyte-db/issue_1924/commit_e10a60583ce49205e932d888e45494bf059168d9.diff",
            "diff_additions": 16,
            "diff_deletions": 6,
            "diff_file_size": 0,
            "diff_url": "https://github.com/yugabyte/yugabyte-db/commit/e10a60583ce49205e932d888e45494bf059168d9.diff",
            "exists": true,
            "files": [
                {
                    "file_additions": 16,
                    "file_deletions": 6,
                    "file_exists": false,
                    "file_name": "src/postgres/src/backend/catalog/ybctype.c",
                    "file_size": 0
                }
            ],
            "interesting": {
                "reopen": true,
                "status": false
            },
            "is_parent": false,
            "sha": "e10a60583ce49205e932d888e45494bf059168d9"
        },
        {
            "associated_pull_request": [],
            "date": "2019-08-13 16:22:55+00:00",
            "diff": "yugabyte_yugabyte-db/issue_1924/commit_f27a5a1f4a4e59cfc26ecb57a0b96d74e32411f0.diff",
            "diff_additions": 6,
            "diff_deletions": 16,
            "diff_file_size": 0,
            "diff_url": "https://github.com/yugabyte/yugabyte-db/commit/f27a5a1f4a4e59cfc26ecb57a0b96d74e32411f0.diff",
            "exists": true,
            "files": [
                {
                    "file_additions": 6,
                    "file_deletions": 16,
                    "file_exists": false,
                    "file_name": "src/postgres/src/backend/catalog/ybctype.c",
                    "file_size": 0
                }
            ],
            "interesting": {
                "reopen": false,
                "status": false
            },
            "is_parent": false,
            "sha": "f27a5a1f4a4e59cfc26ecb57a0b96d74e32411f0"
        },
        {
            "associated_pull_request": [],
            "date": "2019-08-16 17:08:17+00:00",
            "diff": "yugabyte_yugabyte-db/issue_1924/commit_4d2f2f97fa46da5bd1e4a42e29b92f079d767fb8.diff",
            "diff_additions": 49,
            "diff_deletions": 39,
            "diff_file_size": 53148,
            "diff_url": "https://github.com/yugabyte/yugabyte-db/commit/4d2f2f97fa46da5bd1e4a42e29b92f079d767fb8.diff",
            "exists": true,
            "files": [
                {
                    "file_additions": 16,
                    "file_deletions": 6,
                    "file_exists": false,
                    "file_name": "src/postgres/src/backend/catalog/ybctype.c",
                    "file_size": 0
                },
                {
                    "file_additions": 4,
                    "file_deletions": 12,
                    "file_exists": true,
                    "file_name": "src/yb/yql/pggate/pg_dml.cc",
                    "file_size": 16885
                },
                {
                    "file_additions": 20,
                    "file_deletions": 4,
                    "file_exists": true,
                    "file_name": "src/yb/yql/pggate/pg_expr.cc",
                    "file_size": 32150
                },
                {
                    "file_additions": 9,
                    "file_deletions": 17,
                    "file_exists": true,
                    "file_name": "src/yb/yql/pggate/pg_select.cc",
                    "file_size": 4113
                }
            ],
            "interesting": {
                "reopen": false,
                "status": false
            },
            "is_parent": false,
            "sha": "4d2f2f97fa46da5bd1e4a42e29b92f079d767fb8"
        }
    ],
    "first_commit": "2019-08-12 18:22:41+00:00",
    "last_commit": "2019-08-16 17:12:09+00:00",
    "number": 1924,
    "pull_request": "None",
    "score": {
        "accidental_reopen_likely": false,
        "all_labels": [
            "area/ysql",
            "priority/high",
            "kind/disk-format-change"
        ],
        "contains_keywords": [
            "work",
            "fix"
        ],
        "fix_size": 90,
        "has_labels": [],
        "intersecting": {
            "computed_score": 0.2804878048780488,
            "final_commit_size": 82,
            "intersection_size": 23,
            "previous_commits_size": 31
        },
        "is_makefile_based": true,
        "no_new_files": [
            "src/yb/yql/pggate/pg_dml.cc",
            "src/yb/yql/pggate/pg_expr.cc",
            "src/yb/yql/pggate/pg_select.cc"
        ],
        "no_other_files": false,
        "num_prohibited_files": 66532,
        "prohibited_files": [
            "server/src/main/java/com/genymobile/scrcpy/Device.java",
            "server/src/main/java/com/genymobile/scrcpy/wrappers/SurfaceControl.java",
            "server/src/main/java/com/genymobile/scrcpy/Device.java",
            "server/src/main/java/com/genymobile/scrcpy/wrappers/SurfaceControl.java",
            "app/meson.build",
            "app/scrcpy.1",
            "app/src/common.h",
            "app/src/scrcpy.h",
            "app/src/server.h",
            "server/src/main/java/com/genymobile/scrcpy/Workarounds.java"
        ],
        "reopen": true,
        "reopen_events": [
            [
                "2019-08-12 19:34:08+00:00",
                "commit"
            ],
            [
                "2019-08-12 19:36:38+00:00",
                "closed"
            ],
            [
                "2019-08-13 15:54:32+00:00",
                "reopened"
            ],
            [
                "2019-08-13 16:29:31+00:00",
                "commit"
            ],
            [
                "2019-08-16 17:12:14+00:00",
                "commit"
            ],
            [
                "2019-08-19 18:02:55+00:00",
                "closed"
            ]
        ],
        "status": false,
        "strategy": true,
        "total_changes": 526
    }
}