{
    "category": [
        "memory"
    ],
    "commits": [
        {
            "associated_pull_request": [],
            "date": "2015-06-15 19:39:34",
            "diff": "radareorg_radare2/issue_2764/commit_a38d4190135d9f17d1ef3949f7b77ed65c80df13.diff",
            "diff_additions": 1,
            "diff_deletions": 0,
            "diff_file_size": 0,
            "diff_url": "https://github.com/radareorg/radare2/commit/a38d4190135d9f17d1ef3949f7b77ed65c80df13.diff",
            "exists": true,
            "files": [
                {
                    "file_additions": 1,
                    "file_deletions": 0,
                    "file_exists": false,
                    "file_name": "libr/core/syscmd.c",
                    "file_size": 0
                }
            ],
            "interesting": {
                "reopen": false,
                "status": false
            },
            "is_parent": true,
            "sha": "a38d4190135d9f17d1ef3949f7b77ed65c80df13"
        },
        {
            "associated_pull_request": [],
            "date": "2015-06-15 20:26:01",
            "diff": "radareorg_radare2/issue_2764/commit_d04c94ba72e053e2e56bad657276a41e15fe1603.diff",
            "diff_additions": 1,
            "diff_deletions": 1,
            "diff_file_size": 60137,
            "diff_url": "https://github.com/radareorg/radare2/commit/d04c94ba72e053e2e56bad657276a41e15fe1603.diff",
            "exists": true,
            "files": [
                {
                    "file_additions": 1,
                    "file_deletions": 1,
                    "file_exists": true,
                    "file_name": "libr/core/cmd_write.c",
                    "file_size": 60137
                }
            ],
            "interesting": {
                "reopen": true,
                "status": false
            },
            "is_parent": false,
            "sha": "d04c94ba72e053e2e56bad657276a41e15fe1603"
        },
        {
            "associated_pull_request": [],
            "date": "2015-06-20 21:21:51",
            "diff": "radareorg_radare2/issue_2764/commit_876b14a76aa027b7cae55b7da81e6059103a8b4b.diff",
            "diff_additions": 4,
            "diff_deletions": 0,
            "diff_file_size": 114196,
            "diff_url": "https://github.com/radareorg/radare2/commit/876b14a76aa027b7cae55b7da81e6059103a8b4b.diff",
            "exists": true,
            "files": [
                {
                    "file_additions": 4,
                    "file_deletions": 0,
                    "file_exists": true,
                    "file_name": "libr/core/cmd_search.c",
                    "file_size": 114196
                }
            ],
            "interesting": {
                "reopen": false,
                "status": false
            },
            "is_parent": false,
            "sha": "876b14a76aa027b7cae55b7da81e6059103a8b4b"
        },
        {
            "associated_pull_request": [],
            "date": "2015-06-21 08:02:41",
            "diff": "radareorg_radare2/issue_2764/commit_f38d84fe37408475f6525e310947503c69aa59c5.diff",
            "diff_additions": 10,
            "diff_deletions": 8,
            "diff_file_size": 114196,
            "diff_url": "https://github.com/radareorg/radare2/commit/f38d84fe37408475f6525e310947503c69aa59c5.diff",
            "exists": true,
            "files": [
                {
                    "file_additions": 10,
                    "file_deletions": 8,
                    "file_exists": true,
                    "file_name": "libr/core/cmd_search.c",
                    "file_size": 114196
                }
            ],
            "interesting": {
                "reopen": false,
                "status": false
            },
            "is_parent": false,
            "sha": "f38d84fe37408475f6525e310947503c69aa59c5"
        }
    ],
    "first_commit": "2015-06-15 20:51:18",
    "last_commit": "2015-06-21 08:02:41",
    "number": 2764,
    "pull_request": "None",
    "score": {
        "accidental_reopen_likely": false,
        "all_labels": [
            "bug",
            "good first issue"
        ],
        "contains_keywords": [
            "report",
            "error",
            "bug",
            "test",
            "fix",
            "patch"
        ],
        "fix_size": 13,
        "has_labels": [
            "bug"
        ],
        "intersecting": {
            "computed_score": 0.45454545454545453,
            "final_commit_size": 11,
            "intersection_size": 5,
            "previous_commits_size": 7
        },
        "is_makefile_based": true,
        "no_new_files": [],
        "no_other_files": true,
        "num_prohibited_files": 76075,
        "prohibited_files": [
            "hal/inc/pinmap_hal.h",
            "Debug/marvin.bin",
            "Debug/marvin.elf",
            "Debug/marvin.hex",
            "Debug/marvin.bin",
            "Debug/marvin.elf",
            "Debug/marvin.hex",
            "inc/spark_utilities.h",
            "Debug/marvin.bin",
            "Debug/marvin.elf"
        ],
        "reopen": true,
        "reopen_events": [
            [
                "2015-06-15 20:51:46",
                "commit"
            ],
            [
                "2015-06-16 21:00:00",
                "closed"
            ],
            [
                "2015-06-16 21:00:00",
                "commit"
            ],
            [
                "2015-06-20 16:00:55",
                "reopened"
            ],
            [
                "2015-06-20 22:24:15",
                "commit"
            ],
            [
                "2015-06-21 08:03:03",
                "closed"
            ],
            [
                "2015-06-21 08:03:03",
                "commit"
            ]
        ],
        "status": false,
        "strategy": true,
        "total_changes": 25
    }
}