{
    "covered_issues": [
        382,
        377,
        376,
        375,
        371,
        368,
        362,
        360,
        358,
        357,
        353,
        345,
        344,
        343,
        342,
        340,
        339,
        338,
        336,
        335,
        327,
        321,
        320,
        318,
        316,
        314,
        310,
        309,
        308,
        305,
        300,
        299,
        298,
        297,
        296,
        295,
        294,
        293,
        289,
        288,
        285,
        283,
        282,
        281,
        279,
        278,
        277,
        275,
        274,
        273,
        272,
        270,
        268,
        265,
        264,
        263,
        262,
        260,
        257,
        256,
        255,
        254,
        253,
        251,
        250,
        249,
        248,
        247,
        246,
        245,
        244,
        242,
        241,
        239,
        238,
        236,
        235,
        234,
        233,
        232,
        231,
        230,
        229,
        228,
        225,
        224,
        222,
        220,
        219,
        218,
        217,
        216,
        215,
        214,
        213,
        212,
        210,
        209,
        206,
        205,
        201,
        199,
        197,
        195,
        194,
        193,
        192,
        191,
        190,
        185,
        184,
        183,
        182,
        180,
        179,
        177,
        176,
        175,
        173,
        172,
        166,
        165,
        163,
        161,
        159,
        157,
        154,
        152,
        151,
        150,
        149,
        148,
        147,
        146,
        143,
        142,
        141,
        140,
        139,
        138,
        137,
        136,
        134,
        132,
        131,
        128,
        127,
        123,
        122,
        121,
        120,
        119,
        118,
        116,
        115,
        114,
        113,
        112,
        110,
        109,
        106,
        105,
        104,
        103,
        101,
        99,
        98,
        95,
        93,
        89,
        88,
        87,
        85,
        84,
        83,
        81,
        80,
        79,
        78,
        77,
        76,
        75,
        74,
        73,
        71,
        65,
        63,
        62,
        61,
        60,
        59,
        57,
        56,
        55,
        53,
        52,
        51,
        50,
        49,
        48,
        47,
        46,
        45,
        44,
        42,
        40,
        39,
        37,
        36,
        35,
        34,
        33,
        32,
        30,
        29,
        26,
        24,
        13,
        12,
        9,
        4,
        3,
        1
    ],
    "finished": true
}