{
    "covered_issues": [
        36,
        34,
        33,
        32,
        31,
        30,
        27,
        26,
        25,
        24,
        23,
        19,
        15,
        13,
        12,
        11,
        10,
        9,
        8,
        7,
        5,
        4,
        2,
        1
    ],
    "finished": true
}