{
    "covered_issues": [
        101,
        100,
        98,
        95,
        90,
        88,
        87,
        83,
        82,
        81,
        79,
        78,
        76,
        75,
        71,
        70,
        69,
        68,
        67,
        65,
        63,
        62,
        61,
        60,
        57,
        51,
        49,
        48,
        45,
        44,
        43,
        42,
        41,
        40,
        37,
        33,
        30,
        29,
        28,
        26,
        21,
        18,
        17,
        16,
        15,
        11,
        7,
        5,
        3
    ],
    "finished": true
}