{
    "commits": [
        {
            "associated_pull_request": [
                "https://github.com/jemalloc/jemalloc/pull/780"
            ],
            "date": "2017-04-19 23:14:54+00:00",
            "diff": "jemalloc_jemalloc/issue_580/commit_fed9a880c811fc56f7563efcb0a70c6ffe401c5f.diff",
            "diff_additions": 9,
            "diff_deletions": 3,
            "diff_file_size": 42257,
            "diff_url": "https://github.com/jemalloc/jemalloc/commit/fed9a880c811fc56f7563efcb0a70c6ffe401c5f.diff",
            "exists": true,
            "files": [
                {
                    "file_additions": 6,
                    "file_deletions": 2,
                    "file_exists": true,
                    "file_name": "src/extent.c",
                    "file_size": 41356
                },
                {
                    "file_additions": 3,
                    "file_deletions": 1,
                    "file_exists": true,
                    "file_name": "src/extent_mmap.c",
                    "file_size": 901
                }
            ],
            "interesting": {
                "reopen": false,
                "status": false
            },
            "is_parent": true,
            "sha": "fed9a880c811fc56f7563efcb0a70c6ffe401c5f"
        },
        {
            "associated_pull_request": [],
            "date": "2017-04-21 00:21:37+00:00",
            "diff": "jemalloc_jemalloc/issue_580/commit_a1233ccd041e779dcffb67d6b4dfd6ea00a77d11.diff",
            "diff_additions": 157,
            "diff_deletions": 298,
            "diff_file_size": 496411,
            "diff_url": "https://github.com/jemalloc/jemalloc/commit/a1233ccd041e779dcffb67d6b4dfd6ea00a77d11.diff",
            "exists": true,
            "files": [
                {
                    "file_additions": 24,
                    "file_deletions": 32,
                    "file_exists": true,
                    "file_name": "src/arena.c",
                    "file_size": 59750
                },
                {
                    "file_additions": 19,
                    "file_deletions": 47,
                    "file_exists": true,
                    "file_name": "src/ctl.c",
                    "file_size": 139266
                },
                {
                    "file_additions": 5,
                    "file_deletions": 8,
                    "file_exists": true,
                    "file_name": "src/jemalloc.c",
                    "file_size": 120194
                },
                {
                    "file_additions": 31,
                    "file_deletions": 83,
                    "file_exists": true,
                    "file_name": "src/stats.c",
                    "file_size": 67126
                },
                {
                    "file_additions": 12,
                    "file_deletions": 31,
                    "file_exists": true,
                    "file_name": "src/tcache.c",
                    "file_size": 40184
                },
                {
                    "file_additions": 3,
                    "file_deletions": 22,
                    "file_exists": true,
                    "file_name": "test/integration/thread_tcache_enabled.c",
                    "file_size": 2357
                },
                {
                    "file_additions": 49,
                    "file_deletions": 60,
                    "file_exists": true,
                    "file_name": "test/unit/decay.c",
                    "file_size": 8576
                },
                {
                    "file_additions": 2,
                    "file_deletions": 7,
                    "file_exists": true,
                    "file_name": "test/unit/mallctl.c",
                    "file_size": 43778
                },
                {
                    "file_additions": 12,
                    "file_deletions": 8,
                    "file_exists": true,
                    "file_name": "test/unit/stats.c",
                    "file_size": 15180
                }
            ],
            "interesting": {
                "reopen": false,
                "status": false
            },
            "is_parent": false,
            "sha": "a1233ccd041e779dcffb67d6b4dfd6ea00a77d11"
        },
        {
            "associated_pull_request": [
                "https://github.com/jemalloc/jemalloc/pull/784"
            ],
            "date": "2017-04-21 00:21:37+00:00",
            "diff": "jemalloc_jemalloc/issue_580/commit_f7168e28a0a9b7804a1eaacfbca7ed50159588ae.diff",
            "diff_additions": 157,
            "diff_deletions": 299,
            "diff_file_size": 496411,
            "diff_url": "https://github.com/jemalloc/jemalloc/commit/f7168e28a0a9b7804a1eaacfbca7ed50159588ae.diff",
            "exists": true,
            "files": [
                {
                    "file_additions": 24,
                    "file_deletions": 32,
                    "file_exists": true,
                    "file_name": "src/arena.c",
                    "file_size": 59750
                },
                {
                    "file_additions": 19,
                    "file_deletions": 47,
                    "file_exists": true,
                    "file_name": "src/ctl.c",
                    "file_size": 139266
                },
                {
                    "file_additions": 5,
                    "file_deletions": 8,
                    "file_exists": true,
                    "file_name": "src/jemalloc.c",
                    "file_size": 120194
                },
                {
                    "file_additions": 31,
                    "file_deletions": 83,
                    "file_exists": true,
                    "file_name": "src/stats.c",
                    "file_size": 67126
                },
                {
                    "file_additions": 12,
                    "file_deletions": 32,
                    "file_exists": true,
                    "file_name": "src/tcache.c",
                    "file_size": 40184
                },
                {
                    "file_additions": 3,
                    "file_deletions": 22,
                    "file_exists": true,
                    "file_name": "test/integration/thread_tcache_enabled.c",
                    "file_size": 2357
                },
                {
                    "file_additions": 49,
                    "file_deletions": 60,
                    "file_exists": true,
                    "file_name": "test/unit/decay.c",
                    "file_size": 8576
                },
                {
                    "file_additions": 2,
                    "file_deletions": 7,
                    "file_exists": true,
                    "file_name": "test/unit/mallctl.c",
                    "file_size": 43778
                },
                {
                    "file_additions": 12,
                    "file_deletions": 8,
                    "file_exists": true,
                    "file_name": "test/unit/stats.c",
                    "file_size": 15180
                }
            ],
            "interesting": {
                "reopen": false,
                "status": false
            },
            "is_parent": false,
            "sha": "f7168e28a0a9b7804a1eaacfbca7ed50159588ae"
        },
        {
            "associated_pull_request": [
                "https://github.com/jemalloc/jemalloc/pull/784"
            ],
            "date": "2017-04-21 00:21:37+00:00",
            "diff": "jemalloc_jemalloc/issue_580/commit_4403c9ab441eabb6c55d93b99836f7126e46be75.diff",
            "diff_additions": 157,
            "diff_deletions": 299,
            "diff_file_size": 496411,
            "diff_url": "https://github.com/jemalloc/jemalloc/commit/4403c9ab441eabb6c55d93b99836f7126e46be75.diff",
            "exists": true,
            "files": [
                {
                    "file_additions": 24,
                    "file_deletions": 32,
                    "file_exists": true,
                    "file_name": "src/arena.c",
                    "file_size": 59750
                },
                {
                    "file_additions": 19,
                    "file_deletions": 47,
                    "file_exists": true,
                    "file_name": "src/ctl.c",
                    "file_size": 139266
                },
                {
                    "file_additions": 5,
                    "file_deletions": 8,
                    "file_exists": true,
                    "file_name": "src/jemalloc.c",
                    "file_size": 120194
                },
                {
                    "file_additions": 31,
                    "file_deletions": 83,
                    "file_exists": true,
                    "file_name": "src/stats.c",
                    "file_size": 67126
                },
                {
                    "file_additions": 12,
                    "file_deletions": 32,
                    "file_exists": true,
                    "file_name": "src/tcache.c",
                    "file_size": 40184
                },
                {
                    "file_additions": 3,
                    "file_deletions": 22,
                    "file_exists": true,
                    "file_name": "test/integration/thread_tcache_enabled.c",
                    "file_size": 2357
                },
                {
                    "file_additions": 49,
                    "file_deletions": 60,
                    "file_exists": true,
                    "file_name": "test/unit/decay.c",
                    "file_size": 8576
                },
                {
                    "file_additions": 2,
                    "file_deletions": 7,
                    "file_exists": true,
                    "file_name": "test/unit/mallctl.c",
                    "file_size": 43778
                },
                {
                    "file_additions": 12,
                    "file_deletions": 8,
                    "file_exists": true,
                    "file_name": "test/unit/stats.c",
                    "file_size": 15180
                }
            ],
            "interesting": {
                "reopen": false,
                "status": false
            },
            "is_parent": false,
            "sha": "4403c9ab441eabb6c55d93b99836f7126e46be75"
        },
        {
            "associated_pull_request": [
                "https://github.com/jemalloc/jemalloc/pull/785"
            ],
            "date": "2017-04-21 17:07:01+00:00",
            "diff": "jemalloc_jemalloc/issue_580/commit_8bf518803a49cfbb5f282d209475b83fae77bfce.diff",
            "diff_additions": 0,
            "diff_deletions": 5,
            "diff_file_size": 250170,
            "diff_url": "https://github.com/jemalloc/jemalloc/commit/8bf518803a49cfbb5f282d209475b83fae77bfce.diff",
            "exists": true,
            "files": [
                {
                    "file_additions": 0,
                    "file_deletions": 3,
                    "file_exists": true,
                    "file_name": "src/ctl.c",
                    "file_size": 139266
                },
                {
                    "file_additions": 0,
                    "file_deletions": 1,
                    "file_exists": true,
                    "file_name": "src/stats.c",
                    "file_size": 67126
                },
                {
                    "file_additions": 0,
                    "file_deletions": 1,
                    "file_exists": true,
                    "file_name": "test/unit/mallctl.c",
                    "file_size": 43778
                }
            ],
            "interesting": {
                "reopen": false,
                "status": false
            },
            "is_parent": false,
            "sha": "8bf518803a49cfbb5f282d209475b83fae77bfce"
        },
        {
            "associated_pull_request": [
                "https://github.com/jemalloc/jemalloc/pull/785"
            ],
            "date": "2017-04-21 17:07:01+00:00",
            "diff": "jemalloc_jemalloc/issue_580/commit_b2a8453a3fa653dc71f82ac9df64b012917f6b8c.diff",
            "diff_additions": 0,
            "diff_deletions": 5,
            "diff_file_size": 250170,
            "diff_url": "https://github.com/jemalloc/jemalloc/commit/b2a8453a3fa653dc71f82ac9df64b012917f6b8c.diff",
            "exists": true,
            "files": [
                {
                    "file_additions": 0,
                    "file_deletions": 3,
                    "file_exists": true,
                    "file_name": "src/ctl.c",
                    "file_size": 139266
                },
                {
                    "file_additions": 0,
                    "file_deletions": 1,
                    "file_exists": true,
                    "file_name": "src/stats.c",
                    "file_size": 67126
                },
                {
                    "file_additions": 0,
                    "file_deletions": 1,
                    "file_exists": true,
                    "file_name": "test/unit/mallctl.c",
                    "file_size": 43778
                }
            ],
            "interesting": {
                "reopen": false,
                "status": false
            },
            "is_parent": false,
            "sha": "b2a8453a3fa653dc71f82ac9df64b012917f6b8c"
        },
        {
            "associated_pull_request": [],
            "date": "2017-04-21 18:00:36+00:00",
            "diff": "jemalloc_jemalloc/issue_580/commit_4970bb8663ff8041890e2c82a12b2da040c21a82.diff",
            "diff_additions": 2,
            "diff_deletions": 2,
            "diff_file_size": 120194,
            "diff_url": "https://github.com/jemalloc/jemalloc/commit/4970bb8663ff8041890e2c82a12b2da040c21a82.diff",
            "exists": true,
            "files": [
                {
                    "file_additions": 2,
                    "file_deletions": 2,
                    "file_exists": true,
                    "file_name": "src/jemalloc.c",
                    "file_size": 120194
                }
            ],
            "interesting": {
                "reopen": false,
                "status": false
            },
            "is_parent": false,
            "sha": "4970bb8663ff8041890e2c82a12b2da040c21a82"
        },
        {
            "associated_pull_request": [],
            "date": "2017-04-21 18:00:36+00:00",
            "diff": "jemalloc_jemalloc/issue_580/commit_5cb73e831ae3f6c270394c91e889af4d20c9893e.diff",
            "diff_additions": 11,
            "diff_deletions": 4,
            "diff_file_size": 120194,
            "diff_url": "https://github.com/jemalloc/jemalloc/commit/5cb73e831ae3f6c270394c91e889af4d20c9893e.diff",
            "exists": true,
            "files": [
                {
                    "file_additions": 11,
                    "file_deletions": 4,
                    "file_exists": true,
                    "file_name": "src/jemalloc.c",
                    "file_size": 120194
                }
            ],
            "interesting": {
                "reopen": false,
                "status": false
            },
            "is_parent": false,
            "sha": "5cb73e831ae3f6c270394c91e889af4d20c9893e"
        },
        {
            "associated_pull_request": [
                "https://github.com/jemalloc/jemalloc/pull/786"
            ],
            "date": "2017-04-21 18:00:36+00:00",
            "diff": "jemalloc_jemalloc/issue_580/commit_e9fb446571de5b99249cb66722683ce6a707d1f3.diff",
            "diff_additions": 11,
            "diff_deletions": 4,
            "diff_file_size": 120194,
            "diff_url": "https://github.com/jemalloc/jemalloc/commit/e9fb446571de5b99249cb66722683ce6a707d1f3.diff",
            "exists": true,
            "files": [
                {
                    "file_additions": 11,
                    "file_deletions": 4,
                    "file_exists": true,
                    "file_name": "src/jemalloc.c",
                    "file_size": 120194
                }
            ],
            "interesting": {
                "reopen": false,
                "status": false
            },
            "is_parent": false,
            "sha": "e9fb446571de5b99249cb66722683ce6a707d1f3"
        },
        {
            "associated_pull_request": [
                "https://github.com/jemalloc/jemalloc/pull/786"
            ],
            "date": "2017-04-21 18:00:36+00:00",
            "diff": "jemalloc_jemalloc/issue_580/commit_3823effe126ec602c438b02eb70d4c258a2f0e3f.diff",
            "diff_additions": 11,
            "diff_deletions": 4,
            "diff_file_size": 120194,
            "diff_url": "https://github.com/jemalloc/jemalloc/commit/3823effe126ec602c438b02eb70d4c258a2f0e3f.diff",
            "exists": true,
            "files": [
                {
                    "file_additions": 11,
                    "file_deletions": 4,
                    "file_exists": true,
                    "file_name": "src/jemalloc.c",
                    "file_size": 120194
                }
            ],
            "interesting": {
                "reopen": false,
                "status": false
            },
            "is_parent": false,
            "sha": "3823effe126ec602c438b02eb70d4c258a2f0e3f"
        },
        {
            "associated_pull_request": [
                "https://github.com/jemalloc/jemalloc/pull/795"
            ],
            "date": "2017-04-25 00:28:55+00:00",
            "diff": "jemalloc_jemalloc/issue_580/commit_4e799863593e0a661487163f49e43557e9ff3b7a.diff",
            "diff_additions": 40,
            "diff_deletions": 35,
            "diff_file_size": 491107,
            "diff_url": "https://github.com/jemalloc/jemalloc/commit/4e799863593e0a661487163f49e43557e9ff3b7a.diff",
            "exists": true,
            "files": [
                {
                    "file_additions": 2,
                    "file_deletions": 2,
                    "file_exists": true,
                    "file_name": "src/arena.c",
                    "file_size": 59750
                },
                {
                    "file_additions": 3,
                    "file_deletions": 3,
                    "file_exists": true,
                    "file_name": "src/ctl.c",
                    "file_size": 139266
                },
                {
                    "file_additions": 1,
                    "file_deletions": 1,
                    "file_exists": true,
                    "file_name": "src/extent.c",
                    "file_size": 41356
                },
                {
                    "file_additions": 13,
                    "file_deletions": 2,
                    "file_exists": true,
                    "file_name": "src/extent_mmap.c",
                    "file_size": 901
                },
                {
                    "file_additions": 16,
                    "file_deletions": 22,
                    "file_exists": true,
                    "file_name": "src/jemalloc.c",
                    "file_size": 120194
                },
                {
                    "file_additions": 1,
                    "file_deletions": 1,
                    "file_exists": true,
                    "file_name": "src/large.c",
                    "file_size": 9322
                },
                {
                    "file_additions": 1,
                    "file_deletions": 1,
                    "file_exists": true,
                    "file_name": "src/stats.c",
                    "file_size": 67126
                },
                {
                    "file_additions": 2,
                    "file_deletions": 2,
                    "file_exists": true,
                    "file_name": "test/unit/arena_reset.c",
                    "file_size": 9414
                },
                {
                    "file_additions": 1,
                    "file_deletions": 1,
                    "file_exists": true,
                    "file_name": "test/unit/mallctl.c",
                    "file_size": 43778
                }
            ],
            "interesting": {
                "reopen": false,
                "status": false
            },
            "is_parent": false,
            "sha": "4e799863593e0a661487163f49e43557e9ff3b7a"
        },
        {
            "associated_pull_request": [
                "https://github.com/jemalloc/jemalloc/pull/795"
            ],
            "date": "2017-04-25 00:28:55+00:00",
            "diff": "jemalloc_jemalloc/issue_580/commit_c67c3e4a63277718b9d137a38663c6ae324c99aa.diff",
            "diff_additions": 40,
            "diff_deletions": 35,
            "diff_file_size": 491107,
            "diff_url": "https://github.com/jemalloc/jemalloc/commit/c67c3e4a63277718b9d137a38663c6ae324c99aa.diff",
            "exists": true,
            "files": [
                {
                    "file_additions": 2,
                    "file_deletions": 2,
                    "file_exists": true,
                    "file_name": "src/arena.c",
                    "file_size": 59750
                },
                {
                    "file_additions": 3,
                    "file_deletions": 3,
                    "file_exists": true,
                    "file_name": "src/ctl.c",
                    "file_size": 139266
                },
                {
                    "file_additions": 1,
                    "file_deletions": 1,
                    "file_exists": true,
                    "file_name": "src/extent.c",
                    "file_size": 41356
                },
                {
                    "file_additions": 13,
                    "file_deletions": 2,
                    "file_exists": true,
                    "file_name": "src/extent_mmap.c",
                    "file_size": 901
                },
                {
                    "file_additions": 16,
                    "file_deletions": 22,
                    "file_exists": true,
                    "file_name": "src/jemalloc.c",
                    "file_size": 120194
                },
                {
                    "file_additions": 1,
                    "file_deletions": 1,
                    "file_exists": true,
                    "file_name": "src/large.c",
                    "file_size": 9322
                },
                {
                    "file_additions": 1,
                    "file_deletions": 1,
                    "file_exists": true,
                    "file_name": "src/stats.c",
                    "file_size": 67126
                },
                {
                    "file_additions": 2,
                    "file_deletions": 2,
                    "file_exists": true,
                    "file_name": "test/unit/arena_reset.c",
                    "file_size": 9414
                },
                {
                    "file_additions": 1,
                    "file_deletions": 1,
                    "file_exists": true,
                    "file_name": "test/unit/mallctl.c",
                    "file_size": 43778
                }
            ],
            "interesting": {
                "reopen": false,
                "status": false
            },
            "is_parent": false,
            "sha": "c67c3e4a63277718b9d137a38663c6ae324c99aa"
        }
    ],
    "first_commit": "2017-04-20 04:05:12+00:00",
    "last_commit": "2017-04-25 03:37:16+00:00",
    "number": 580,
    "pull_request": "None",
    "score": {
        "accidental_reopen_likely": false,
        "all_labels": [
            "refactor"
        ],
        "contains_keywords": [
            "work",
            "chang",
            "issu",
            "debug",
            "test",
            "fault",
            "remov",
            "warn",
            "bug"
        ],
        "fix_size": 491,
        "has_labels": [],
        "intersecting": {
            "computed_score": 1.0,
            "final_commit_size": 75,
            "intersection_size": 75,
            "previous_commits_size": 491
        },
        "is_makefile_based": true,
        "no_new_files": [],
        "no_other_files": false,
        "num_prohibited_files": 156662,
        "prohibited_files": [
            "server/src/main/java/com/genymobile/scrcpy/Device.java",
            "server/src/main/java/com/genymobile/scrcpy/wrappers/SurfaceControl.java",
            "server/src/main/java/com/genymobile/scrcpy/Device.java",
            "server/src/main/java/com/genymobile/scrcpy/wrappers/SurfaceControl.java",
            "app/meson.build",
            "app/scrcpy.1",
            "app/src/common.h",
            "app/src/scrcpy.h",
            "app/src/server.h",
            "server/src/main/java/com/genymobile/scrcpy/Workarounds.java"
        ],
        "reopen": true,
        "reopen_events": [
            [
                "2017-04-21 00:47:02+00:00",
                "commit"
            ],
            [
                "2017-04-21 16:33:46+00:00",
                "commit"
            ],
            [
                "2017-04-21 17:06:13+00:00",
                "closed"
            ],
            [
                "2017-04-21 17:06:14+00:00",
                "commit"
            ],
            [
                "2017-04-21 17:08:27+00:00",
                "commit"
            ],
            [
                "2017-04-21 18:12:31+00:00",
                "commit"
            ],
            [
                "2017-04-21 18:13:28+00:00",
                "commit"
            ],
            [
                "2017-04-21 18:40:05+00:00",
                "commit"
            ],
            [
                "2017-04-21 18:51:18+00:00",
                "commit"
            ],
            [
                "2017-04-21 21:34:37+00:00",
                "commit"
            ],
            [
                "2017-04-21 21:51:31+00:00",
                "commit"
            ],
            [
                "2017-04-21 21:53:24+00:00",
                "commit"
            ],
            [
                "2017-04-21 22:37:17+00:00",
                "commit"
            ],
            [
                "2017-04-21 22:37:31+00:00",
                "reopened"
            ],
            [
                "2017-04-24 17:25:21+00:00",
                "commit"
            ],
            [
                "2017-04-24 17:25:21+00:00",
                "commit"
            ],
            [
                "2017-04-24 18:28:50+00:00",
                "closed"
            ],
            [
                "2017-04-24 18:28:51+00:00",
                "commit"
            ],
            [
                "2017-04-24 18:36:08+00:00",
                "commit"
            ],
            [
                "2017-04-24 18:48:30+00:00",
                "commit"
            ],
            [
                "2017-04-24 18:49:35+00:00",
                "commit"
            ],
            [
                "2017-04-24 18:49:47+00:00",
                "reopened"
            ],
            [
                "2017-04-24 22:02:46+00:00",
                "closed"
            ],
            [
                "2017-04-24 22:02:47+00:00",
                "commit"
            ],
            [
                "2017-04-24 22:23:46+00:00",
                "commit"
            ],
            [
                "2017-04-24 22:24:48+00:00",
                "reopened"
            ],
            [
                "2017-04-24 23:33:05+00:00",
                "closed"
            ],
            [
                "2017-04-24 23:33:06+00:00",
                "commit"
            ],
            [
                "2017-04-25 00:31:14+00:00",
                "commit"
            ],
            [
                "2017-04-25 03:37:18+00:00",
                "commit"
            ]
        ],
        "status": false,
        "strategy": true,
        "total_changes": 1588
    }
}