{
    "commits": [
        {
            "associated_pull_request": [
                "https://github.com/LibreDWG/libredwg/pull/815"
            ],
            "date": "2023-08-23 15:44:48+00:00",
            "diff": "libredwg_libredwg/issue_812/commit_8d2925e52114370e66afe002a4c0ea48d3db3dc9.diff",
            "diff_additions": 10,
            "diff_deletions": 10,
            "diff_file_size": 286856,
            "diff_url": "https://github.com/LibreDWG/libredwg/commit/8d2925e52114370e66afe002a4c0ea48d3db3dc9.diff",
            "exists": true,
            "files": [
                {
                    "file_additions": 10,
                    "file_deletions": 10,
                    "file_exists": true,
                    "file_name": "src/encode.c",
                    "file_size": 286856
                }
            ],
            "interesting": {
                "reopen": false,
                "status": false
            },
            "is_parent": true,
            "sha": "8d2925e52114370e66afe002a4c0ea48d3db3dc9"
        },
        {
            "associated_pull_request": [],
            "date": "2023-08-24 05:51:56+00:00",
            "diff": "libredwg_libredwg/issue_812/commit_7277aa3b0be1903ad872289486a22cd2881e771a.diff",
            "diff_additions": 11,
            "diff_deletions": 3,
            "diff_file_size": 11577,
            "diff_url": "https://github.com/LibreDWG/libredwg/commit/7277aa3b0be1903ad872289486a22cd2881e771a.diff",
            "exists": true,
            "files": [
                {
                    "file_additions": 11,
                    "file_deletions": 3,
                    "file_exists": true,
                    "file_name": "programs/dwg2ps.c",
                    "file_size": 11577
                }
            ],
            "interesting": {
                "reopen": false,
                "status": true
            },
            "is_parent": false,
            "sha": "7277aa3b0be1903ad872289486a22cd2881e771a"
        },
        {
            "associated_pull_request": [],
            "date": "2023-08-24 05:51:56+00:00",
            "diff": "libredwg_libredwg/issue_812/commit_2742575631f4fe96fc9fac471f72175ccba569a8.diff",
            "diff_additions": 12,
            "diff_deletions": 4,
            "diff_file_size": 11577,
            "diff_url": "https://github.com/LibreDWG/libredwg/commit/2742575631f4fe96fc9fac471f72175ccba569a8.diff",
            "exists": true,
            "files": [
                {
                    "file_additions": 12,
                    "file_deletions": 4,
                    "file_exists": true,
                    "file_name": "programs/dwg2ps.c",
                    "file_size": 11577
                }
            ],
            "interesting": {
                "reopen": false,
                "status": false
            },
            "is_parent": false,
            "sha": "2742575631f4fe96fc9fac471f72175ccba569a8"
        }
    ],
    "first_commit": "2023-08-24 04:13:57+00:00",
    "last_commit": "2023-08-24 06:02:06+00:00",
    "number": 812,
    "pull_request": "None",
    "score": {
        "accidental_reopen_likely": false,
        "all_labels": [],
        "contains_keywords": [
            "chang",
            "issu",
            "error"
        ],
        "fix_size": 14,
        "has_labels": [],
        "intersecting": {
            "computed_score": 0.8571428571428571,
            "final_commit_size": 14,
            "intersection_size": 12,
            "previous_commits_size": 12
        },
        "is_makefile_based": true,
        "no_new_files": [],
        "no_other_files": true,
        "num_prohibited_files": 184461,
        "prohibited_files": [
            "server/src/main/java/com/genymobile/scrcpy/Device.java",
            "server/src/main/java/com/genymobile/scrcpy/wrappers/SurfaceControl.java",
            "server/src/main/java/com/genymobile/scrcpy/Device.java",
            "server/src/main/java/com/genymobile/scrcpy/wrappers/SurfaceControl.java",
            "app/meson.build",
            "app/scrcpy.1",
            "app/src/common.h",
            "app/src/scrcpy.h",
            "app/src/server.h",
            "server/src/main/java/com/genymobile/scrcpy/Workarounds.java"
        ],
        "reopen": false,
        "reopen_events": [
            [
                "2023-08-24 05:59:43+00:00",
                "commit"
            ],
            [
                "2023-08-24 06:02:14+00:00",
                "commit"
            ],
            [
                "2023-08-24 07:12:58+00:00",
                "closed"
            ]
        ],
        "status": true,
        "strategy": true,
        "total_changes": 50
    }
}