{
    "commits": [
        {
            "associated_pull_request": [],
            "date": "2022-09-16 21:34:56+00:00",
            "diff": "yugabyte_yugabyte-db/issue_8558/commit_5c1941deecedac78ac05384b56a6334a7075afe4.diff",
            "diff_additions": 25,
            "diff_deletions": 12,
            "diff_file_size": 231208,
            "diff_url": "https://github.com/yugabyte/yugabyte-db/commit/5c1941deecedac78ac05384b56a6334a7075afe4.diff",
            "exists": true,
            "files": [
                {
                    "file_additions": 2,
                    "file_deletions": 3,
                    "file_exists": true,
                    "file_name": "src/yb/client/transaction.cc",
                    "file_size": 95403
                },
                {
                    "file_additions": 3,
                    "file_deletions": 0,
                    "file_exists": true,
                    "file_name": "src/yb/common/common_flags.cc",
                    "file_size": 7262
                },
                {
                    "file_additions": 14,
                    "file_deletions": 6,
                    "file_exists": true,
                    "file_name": "src/yb/tserver/ts_tablet_manager.cc",
                    "file_size": 128543
                },
                {
                    "file_additions": 6,
                    "file_deletions": 3,
                    "file_exists": false,
                    "file_name": "src/yb/yql/pgwrapper/pg_pessimistic_locking-test.cc",
                    "file_size": 0
                }
            ],
            "interesting": {
                "reopen": false,
                "status": false
            },
            "is_parent": true,
            "sha": "5c1941deecedac78ac05384b56a6334a7075afe4"
        },
        {
            "associated_pull_request": [],
            "date": "2022-09-15 18:25:52+00:00",
            "diff": "yugabyte_yugabyte-db/issue_8558/commit_dec0805927f6b77f0e6b8918ef69b6efa5a9ba30.diff",
            "diff_additions": 198,
            "diff_deletions": 4,
            "diff_file_size": 87755,
            "diff_url": "https://github.com/yugabyte/yugabyte-db/commit/dec0805927f6b77f0e6b8918ef69b6efa5a9ba30.diff",
            "exists": true,
            "files": [
                {
                    "file_additions": 78,
                    "file_deletions": 4,
                    "file_exists": true,
                    "file_name": "src/yb/tools/ts-cli.cc",
                    "file_size": 33690
                },
                {
                    "file_additions": 120,
                    "file_deletions": 0,
                    "file_exists": true,
                    "file_name": "src/yb/tools/yb-ts-cli-test.cc",
                    "file_size": 54065
                }
            ],
            "interesting": {
                "reopen": true,
                "status": false
            },
            "is_parent": false,
            "sha": "dec0805927f6b77f0e6b8918ef69b6efa5a9ba30"
        },
        {
            "associated_pull_request": [],
            "date": "2022-09-15 18:25:52+00:00",
            "diff": "yugabyte_yugabyte-db/issue_8558/commit_91e834fec7c404bb11e2b6a6b85a77d29cbe5022.diff",
            "diff_additions": 206,
            "diff_deletions": 4,
            "diff_file_size": 87755,
            "diff_url": "https://github.com/yugabyte/yugabyte-db/commit/91e834fec7c404bb11e2b6a6b85a77d29cbe5022.diff",
            "exists": true,
            "files": [
                {
                    "file_additions": 76,
                    "file_deletions": 4,
                    "file_exists": true,
                    "file_name": "src/yb/tools/ts-cli.cc",
                    "file_size": 33690
                },
                {
                    "file_additions": 130,
                    "file_deletions": 0,
                    "file_exists": true,
                    "file_name": "src/yb/tools/yb-ts-cli-test.cc",
                    "file_size": 54065
                }
            ],
            "interesting": {
                "reopen": false,
                "status": false
            },
            "is_parent": false,
            "sha": "91e834fec7c404bb11e2b6a6b85a77d29cbe5022"
        },
        {
            "associated_pull_request": [],
            "date": "2022-09-15 18:25:52+00:00",
            "diff": "yugabyte_yugabyte-db/issue_8558/commit_388a10341834b7b9e29fe036408dccfa5e21e6ee.diff",
            "diff_additions": 205,
            "diff_deletions": 4,
            "diff_file_size": 87755,
            "diff_url": "https://github.com/yugabyte/yugabyte-db/commit/388a10341834b7b9e29fe036408dccfa5e21e6ee.diff",
            "exists": true,
            "files": [
                {
                    "file_additions": 76,
                    "file_deletions": 4,
                    "file_exists": true,
                    "file_name": "src/yb/tools/ts-cli.cc",
                    "file_size": 33690
                },
                {
                    "file_additions": 129,
                    "file_deletions": 0,
                    "file_exists": true,
                    "file_name": "src/yb/tools/yb-ts-cli-test.cc",
                    "file_size": 54065
                }
            ],
            "interesting": {
                "reopen": false,
                "status": false
            },
            "is_parent": false,
            "sha": "388a10341834b7b9e29fe036408dccfa5e21e6ee"
        },
        {
            "associated_pull_request": [],
            "date": "2022-09-15 18:25:52+00:00",
            "diff": "yugabyte_yugabyte-db/issue_8558/commit_e5f711cb72608698d489553572db2e91f0aad770.diff",
            "diff_additions": 207,
            "diff_deletions": 4,
            "diff_file_size": 87755,
            "diff_url": "https://github.com/yugabyte/yugabyte-db/commit/e5f711cb72608698d489553572db2e91f0aad770.diff",
            "exists": true,
            "files": [
                {
                    "file_additions": 78,
                    "file_deletions": 4,
                    "file_exists": true,
                    "file_name": "src/yb/tools/ts-cli.cc",
                    "file_size": 33690
                },
                {
                    "file_additions": 129,
                    "file_deletions": 0,
                    "file_exists": true,
                    "file_name": "src/yb/tools/yb-ts-cli-test.cc",
                    "file_size": 54065
                }
            ],
            "interesting": {
                "reopen": false,
                "status": false
            },
            "is_parent": false,
            "sha": "e5f711cb72608698d489553572db2e91f0aad770"
        }
    ],
    "first_commit": "2022-09-16 21:35:27+00:00",
    "last_commit": "2022-09-20 18:10:30+00:00",
    "number": 8558,
    "pull_request": "None",
    "score": {
        "accidental_reopen_likely": false,
        "all_labels": [
            "kind/enhancement",
            "area/docdb",
            "priority/medium",
            "2.14 Backport Required"
        ],
        "contains_keywords": [
            "work",
            "fail",
            "fix",
            "perform",
            "test",
            "remov"
        ],
        "fix_size": 393,
        "has_labels": [],
        "intersecting": {
            "computed_score": 1.0,
            "final_commit_size": 213,
            "intersection_size": 213,
            "previous_commits_size": 393
        },
        "is_makefile_based": true,
        "no_new_files": [],
        "no_other_files": false,
        "num_prohibited_files": 79890,
        "prohibited_files": [
            "server/src/main/java/com/genymobile/scrcpy/Device.java",
            "server/src/main/java/com/genymobile/scrcpy/wrappers/SurfaceControl.java",
            "server/src/main/java/com/genymobile/scrcpy/Device.java",
            "server/src/main/java/com/genymobile/scrcpy/wrappers/SurfaceControl.java",
            "app/meson.build",
            "app/scrcpy.1",
            "app/src/common.h",
            "app/src/scrcpy.h",
            "app/src/server.h",
            "server/src/main/java/com/genymobile/scrcpy/Workarounds.java"
        ],
        "reopen": true,
        "reopen_events": [
            [
                "2022-09-17 01:40:02+00:00",
                "commit"
            ],
            [
                "2022-09-17 01:40:23+00:00",
                "closed"
            ],
            [
                "2022-09-17 18:56:26+00:00",
                "reopened"
            ],
            [
                "2022-09-20 18:09:23+00:00",
                "commit"
            ],
            [
                "2022-09-20 18:10:10+00:00",
                "commit"
            ],
            [
                "2022-09-20 18:16:17+00:00",
                "commit"
            ],
            [
                "2022-09-20 18:17:57+00:00",
                "closed"
            ]
        ],
        "status": false,
        "strategy": true,
        "total_changes": 869
    }
}