{
    "covered_issues": [
        873,
        867,
        865,
        860,
        859,
        857,
        853,
        850,
        848,
        847,
        844,
        839,
        838,
        836,
        830,
        821,
        820,
        818,
        817,
        814,
        813,
        806,
        802,
        801,
        798,
        797,
        795,
        791,
        789,
        785,
        782,
        781,
        775,
        774,
        772,
        769,
        767,
        761,
        760,
        757,
        755,
        754,
        752,
        751,
        750,
        749,
        744,
        742,
        741,
        740,
        739,
        735,
        734,
        732,
        730,
        726,
        723,
        698,
        696,
        694,
        688,
        684,
        683,
        682,
        681,
        680,
        679,
        677,
        674,
        673,
        672,
        669,
        668,
        666,
        665,
        664,
        663,
        658,
        656,
        655,
        650,
        648,
        646,
        644,
        643,
        641,
        639,
        638,
        636,
        635,
        633,
        631,
        629,
        628,
        626,
        625,
        623,
        619,
        616,
        610,
        609,
        608,
        607,
        604,
        603,
        601,
        599,
        597,
        596,
        595,
        592,
        591,
        590,
        588,
        587,
        586,
        584,
        581,
        580,
        576,
        575,
        570,
        567,
        566,
        565,
        562,
        561,
        560,
        559,
        558,
        557,
        554,
        552,
        550,
        549,
        548,
        545,
        544,
        535,
        534,
        532,
        531,
        529,
        525,
        524,
        523,
        522,
        521,
        518,
        515,
        514,
        513,
        509,
        506,
        503,
        502,
        498,
        497,
        495,
        493,
        491,
        489,
        487,
        486,
        485,
        483,
        482,
        481,
        479,
        478,
        477,
        474,
        471,
        470,
        469,
        468,
        467,
        466,
        465,
        464,
        457,
        456,
        453,
        452,
        448,
        447,
        446,
        445,
        443,
        442,
        441,
        440,
        437,
        430,
        429,
        428,
        426,
        424,
        421,
        418,
        417,
        416,
        413,
        412,
        410,
        407,
        406,
        404,
        401,
        399,
        398,
        395,
        394,
        392,
        390,
        389,
        386,
        385,
        384,
        383,
        382,
        381,
        380,
        379,
        378,
        371,
        368,
        366,
        362,
        361,
        355,
        349,
        347,
        346,
        343,
        342,
        341,
        335,
        333,
        332,
        331,
        329,
        326,
        324,
        323,
        322,
        319,
        318,
        315,
        314,
        313,
        312,
        310,
        304,
        296,
        295,
        294,
        293,
        291,
        289,
        288,
        287,
        286,
        285,
        284,
        283,
        282,
        281,
        280,
        278,
        277,
        274,
        273,
        272,
        271,
        270,
        269,
        268,
        267,
        266,
        265,
        263,
        262,
        260,
        259,
        257,
        256,
        255,
        254,
        253,
        252,
        250,
        248,
        247,
        246,
        243,
        242,
        241,
        240,
        238,
        237,
        236,
        235,
        233,
        232,
        229,
        228,
        227,
        226,
        225,
        223,
        222,
        220,
        218,
        217,
        216,
        214,
        213,
        212,
        211,
        209,
        207,
        206,
        205,
        204,
        203,
        202,
        199,
        198,
        197,
        196,
        195,
        194,
        193,
        192,
        190,
        189,
        188,
        187,
        185,
        184,
        183,
        182,
        181,
        180,
        167,
        164,
        162,
        161,
        160,
        158,
        155,
        154,
        152,
        151,
        150,
        149,
        148,
        147,
        146,
        145,
        143,
        142,
        141,
        140,
        139,
        138,
        137,
        136,
        135,
        134,
        133,
        131,
        122,
        121,
        120,
        119,
        118,
        117,
        116,
        115,
        114,
        113,
        112,
        110,
        106,
        105,
        104,
        103,
        102,
        101,
        100,
        99,
        98,
        96,
        95,
        94,
        91,
        90,
        89,
        88,
        84,
        83,
        81,
        79,
        76,
        75,
        74,
        69,
        67,
        64,
        59,
        58,
        57,
        56,
        54,
        53,
        50,
        49,
        45,
        44,
        43,
        42,
        41,
        40,
        39,
        38,
        37,
        36,
        35,
        34,
        31,
        24,
        21,
        20,
        19,
        14,
        8,
        7,
        6,
        5,
        3,
        2,
        1
    ],
    "finished": true
}