{
    "commits": [
        {
            "associated_pull_request": [],
            "date": "2018-01-05 17:34:52+00:00",
            "diff": "opensc_opensc/issue_1240/commit_bb1219ff63a6a08c2d3a63143fc0a4aa97e1c427.diff",
            "diff_additions": 3,
            "diff_deletions": 3,
            "diff_file_size": 257903,
            "diff_url": "https://github.com/OpenSC/OpenSC/commit/bb1219ff63a6a08c2d3a63143fc0a4aa97e1c427.diff",
            "exists": true,
            "files": [
                {
                    "file_additions": 2,
                    "file_deletions": 2,
                    "file_exists": true,
                    "file_name": "src/libopensc/asn1.c",
                    "file_size": 61968
                },
                {
                    "file_additions": 1,
                    "file_deletions": 1,
                    "file_exists": true,
                    "file_name": "src/libopensc/card-piv.c",
                    "file_size": 195935
                }
            ],
            "interesting": {
                "reopen": false,
                "status": false
            },
            "is_parent": true,
            "sha": "bb1219ff63a6a08c2d3a63143fc0a4aa97e1c427"
        },
        {
            "associated_pull_request": [],
            "date": "2018-01-15 15:07:53+00:00",
            "diff": "opensc_opensc/issue_1240/commit_8a37091e45399614f9ec1bea4061ee7a5369afbb.diff",
            "diff_additions": 1,
            "diff_deletions": 1,
            "diff_file_size": 114184,
            "diff_url": "https://github.com/OpenSC/OpenSC/commit/8a37091e45399614f9ec1bea4061ee7a5369afbb.diff",
            "exists": true,
            "files": [
                {
                    "file_additions": 1,
                    "file_deletions": 1,
                    "file_exists": true,
                    "file_name": "src/libopensc/card-iasecc.c",
                    "file_size": 114184
                }
            ],
            "interesting": {
                "reopen": false,
                "status": false
            },
            "is_parent": false,
            "sha": "8a37091e45399614f9ec1bea4061ee7a5369afbb"
        },
        {
            "associated_pull_request": [
                "https://github.com/OpenSC/OpenSC/pull/1241"
            ],
            "date": "2018-01-15 15:07:53+00:00",
            "diff": "opensc_opensc/issue_1240/commit_59b349c992b625623c5a06d2e0741448c59a21e5.diff",
            "diff_additions": 1,
            "diff_deletions": 1,
            "diff_file_size": 114184,
            "diff_url": "https://github.com/OpenSC/OpenSC/commit/59b349c992b625623c5a06d2e0741448c59a21e5.diff",
            "exists": true,
            "files": [
                {
                    "file_additions": 1,
                    "file_deletions": 1,
                    "file_exists": true,
                    "file_name": "src/libopensc/card-iasecc.c",
                    "file_size": 114184
                }
            ],
            "interesting": {
                "reopen": false,
                "status": false
            },
            "is_parent": false,
            "sha": "59b349c992b625623c5a06d2e0741448c59a21e5"
        },
        {
            "associated_pull_request": [
                "https://github.com/OpenSC/OpenSC/pull/1241"
            ],
            "date": "2018-01-15 15:07:53+00:00",
            "diff": "opensc_opensc/issue_1240/commit_f24b55db4a9ba0fb3827655873793a5c14913f4c.diff",
            "diff_additions": 1,
            "diff_deletions": 1,
            "diff_file_size": 114184,
            "diff_url": "https://github.com/OpenSC/OpenSC/commit/f24b55db4a9ba0fb3827655873793a5c14913f4c.diff",
            "exists": true,
            "files": [
                {
                    "file_additions": 1,
                    "file_deletions": 1,
                    "file_exists": true,
                    "file_name": "src/libopensc/card-iasecc.c",
                    "file_size": 114184
                }
            ],
            "interesting": {
                "reopen": true,
                "status": false
            },
            "is_parent": false,
            "sha": "f24b55db4a9ba0fb3827655873793a5c14913f4c"
        },
        {
            "associated_pull_request": [],
            "date": "2019-03-17 20:09:51+00:00",
            "diff": "opensc_opensc/issue_1240/commit_442fdb7e4209d58de32f7990674aec64b7fd1e74.diff",
            "diff_additions": 148,
            "diff_deletions": 0,
            "diff_file_size": 114184,
            "diff_url": "https://github.com/OpenSC/OpenSC/commit/442fdb7e4209d58de32f7990674aec64b7fd1e74.diff",
            "exists": true,
            "files": [
                {
                    "file_additions": 148,
                    "file_deletions": 0,
                    "file_exists": true,
                    "file_name": "src/libopensc/card-iasecc.c",
                    "file_size": 114184
                }
            ],
            "interesting": {
                "reopen": false,
                "status": false
            },
            "is_parent": false,
            "sha": "442fdb7e4209d58de32f7990674aec64b7fd1e74"
        }
    ],
    "first_commit": "2018-01-08 12:16:25+00:00",
    "last_commit": "2019-03-17 20:09:51+00:00",
    "number": 1240,
    "pull_request": "None",
    "score": {
        "accidental_reopen_likely": false,
        "all_labels": [
            "bug",
            "Input needed",
            "help wanted"
        ],
        "contains_keywords": [
            "work",
            "fail",
            "chang",
            "fix",
            "issu",
            "patch",
            "debug",
            "reason",
            "test",
            "attempt",
            "fault",
            "defect",
            "warn",
            "bug",
            "error",
            "problem",
            "workaround"
        ],
        "fix_size": 150,
        "has_labels": [
            "bug"
        ],
        "intersecting": {
            "computed_score": 0.006711409395973154,
            "final_commit_size": 149,
            "intersection_size": 1,
            "previous_commits_size": 2
        },
        "is_makefile_based": true,
        "no_new_files": [],
        "no_other_files": true,
        "num_prohibited_files": 254880,
        "prohibited_files": [
            "server/src/main/java/com/genymobile/scrcpy/Device.java",
            "server/src/main/java/com/genymobile/scrcpy/wrappers/SurfaceControl.java",
            "server/src/main/java/com/genymobile/scrcpy/Device.java",
            "server/src/main/java/com/genymobile/scrcpy/wrappers/SurfaceControl.java",
            "app/meson.build",
            "app/scrcpy.1",
            "app/src/common.h",
            "app/src/scrcpy.h",
            "app/src/server.h",
            "server/src/main/java/com/genymobile/scrcpy/Workarounds.java"
        ],
        "reopen": true,
        "reopen_events": [
            [
                "2018-01-15 15:08:42+00:00",
                "commit"
            ],
            [
                "2018-01-15 15:09:41+00:00",
                "commit"
            ],
            [
                "2018-01-24 09:44:50+00:00",
                "commit"
            ],
            [
                "2018-01-24 09:45:18+00:00",
                "closed"
            ],
            [
                "2018-01-24 09:45:19+00:00",
                "commit"
            ],
            [
                "2018-01-25 12:23:13+00:00",
                "reopened"
            ],
            [
                "2019-03-18 07:22:14+00:00",
                "commit"
            ],
            [
                "2022-09-29 09:04:35+00:00",
                "closed"
            ]
        ],
        "status": false,
        "strategy": true,
        "total_changes": 160
    }
}