{
    "category": [
        "hardware/OS",
        "control flow"
    ],
    "commits": [
        {
            "associated_pull_request": [
                "https://github.com/lxc/lxc/pull/3472"
            ],
            "date": "2020-07-03 11:40:12",
            "diff": "lxc_lxc/issue_3473/commit_50329f28c3d1bc9536672df124214c6c44a786f3.diff",
            "diff_additions": 3,
            "diff_deletions": 3,
            "diff_file_size": 101414,
            "diff_url": "https://github.com/lxc/lxc/commit/50329f28c3d1bc9536672df124214c6c44a786f3.diff",
            "exists": true,
            "files": [
                {
                    "file_additions": 3,
                    "file_deletions": 3,
                    "file_exists": true,
                    "file_name": "src/lxc/cgroups/cgfsng.c",
                    "file_size": 101414
                }
            ],
            "interesting": {
                "reopen": false,
                "status": false
            },
            "is_parent": true,
            "sha": "50329f28c3d1bc9536672df124214c6c44a786f3"
        },
        {
            "associated_pull_request": [
                "https://github.com/lxc/lxc/pull/3472"
            ],
            "date": "2020-07-03 11:40:28",
            "diff": "lxc_lxc/issue_3473/commit_beafa9874e751077012f3e16650dfd34771a9632.diff",
            "diff_additions": 15,
            "diff_deletions": 9,
            "diff_file_size": 20064,
            "diff_url": "https://github.com/lxc/lxc/commit/beafa9874e751077012f3e16650dfd34771a9632.diff",
            "exists": true,
            "files": [
                {
                    "file_additions": 15,
                    "file_deletions": 9,
                    "file_exists": true,
                    "file_name": "src/lxc/cgroups/cgroup2_devices.c",
                    "file_size": 20064
                }
            ],
            "interesting": {
                "reopen": true,
                "status": false
            },
            "is_parent": false,
            "sha": "beafa9874e751077012f3e16650dfd34771a9632"
        },
        {
            "associated_pull_request": [
                "https://github.com/lxc/lxc/pull/3475"
            ],
            "date": "2020-07-05 08:49:58",
            "diff": "lxc_lxc/issue_3473/commit_ee9d3ef05b1fd13afd47d54166d12d2042f1704f.diff",
            "diff_additions": 44,
            "diff_deletions": 40,
            "diff_file_size": 121478,
            "diff_url": "https://github.com/lxc/lxc/commit/ee9d3ef05b1fd13afd47d54166d12d2042f1704f.diff",
            "exists": true,
            "files": [
                {
                    "file_additions": 7,
                    "file_deletions": 11,
                    "file_exists": true,
                    "file_name": "src/lxc/cgroups/cgfsng.c",
                    "file_size": 101414
                },
                {
                    "file_additions": 37,
                    "file_deletions": 29,
                    "file_exists": true,
                    "file_name": "src/lxc/cgroups/cgroup2_devices.c",
                    "file_size": 20064
                }
            ],
            "interesting": {
                "reopen": false,
                "status": true
            },
            "is_parent": false,
            "sha": "ee9d3ef05b1fd13afd47d54166d12d2042f1704f"
        },
        {
            "associated_pull_request": [],
            "date": "2020-07-05 08:49:58",
            "diff": "lxc_lxc/issue_3473/commit_3b5796aa9525aeec547a7ef2196f3681adc172ad.diff",
            "diff_additions": 44,
            "diff_deletions": 40,
            "diff_file_size": 121478,
            "diff_url": "https://github.com/lxc/lxc/commit/3b5796aa9525aeec547a7ef2196f3681adc172ad.diff",
            "exists": true,
            "files": [
                {
                    "file_additions": 7,
                    "file_deletions": 11,
                    "file_exists": true,
                    "file_name": "src/lxc/cgroups/cgfsng.c",
                    "file_size": 101414
                },
                {
                    "file_additions": 37,
                    "file_deletions": 29,
                    "file_exists": true,
                    "file_name": "src/lxc/cgroups/cgroup2_devices.c",
                    "file_size": 20064
                }
            ],
            "interesting": {
                "reopen": false,
                "status": false
            },
            "is_parent": false,
            "sha": "3b5796aa9525aeec547a7ef2196f3681adc172ad"
        }
    ],
    "first_commit": "2020-07-03 11:40:12",
    "last_commit": "2020-07-18 11:01:21",
    "number": 3473,
    "pull_request": "None",
    "score": {
        "accidental_reopen_likely": false,
        "all_labels": [
            "Bug"
        ],
        "contains_keywords": [
            "report",
            "fix",
            "bug",
            "test",
            "issu",
            "error",
            "chang"
        ],
        "fix_size": 82,
        "has_labels": [],
        "intersecting": {
            "computed_score": 0.971830985915493,
            "final_commit_size": 71,
            "intersection_size": 69,
            "previous_commits_size": 80
        },
        "is_makefile_based": true,
        "no_new_files": [],
        "no_other_files": true,
        "num_prohibited_files": 85735,
        "prohibited_files": [
            "kill.h",
            "meminfo.h",
            "kill.h",
            "meminfo.h",
            "kill.h",
            "meminfo.h",
            "testsuite_cli_test.go",
            "testsuite_cli_test.go",
            "common.mk",
            "i3bar/include/draw_util.h"
        ],
        "reopen": true,
        "reopen_events": [
            [
                "2020-07-03 11:45:22",
                "commit"
            ],
            [
                "2020-07-03 11:56:57",
                "closed"
            ],
            [
                "2020-07-04 10:27:11",
                "reopened"
            ],
            [
                "2020-07-05 09:17:54",
                "commit"
            ],
            [
                "2020-07-05 15:28:48",
                "closed"
            ],
            [
                "2020-07-18 11:06:54",
                "commit"
            ],
            [
                "2020-07-18 11:06:54",
                "commit"
            ]
        ],
        "status": false,
        "strategy": true,
        "total_changes": 198
    }
}