{
    "commits": [
        {
            "associated_pull_request": [
                "https://github.com/surge-synthesizer/surge/pull/2830"
            ],
            "date": "2020-10-11 14:08:56+00:00",
            "diff": "surge-synthesizer_surge/issue_2330/commit_4623dbbcac5a09ecd4f76ee1262866a46f4f13a5.diff",
            "diff_additions": 42,
            "diff_deletions": 4,
            "diff_file_size": 0,
            "diff_url": "https://github.com/surge-synthesizer/surge/commit/4623dbbcac5a09ecd4f76ee1262866a46f4f13a5.diff",
            "exists": true,
            "files": [
                {
                    "file_additions": 21,
                    "file_deletions": 3,
                    "file_exists": false,
                    "file_name": "src/common/dsp/LfoModulationSource.cpp",
                    "file_size": 0
                },
                {
                    "file_additions": 21,
                    "file_deletions": 1,
                    "file_exists": false,
                    "file_name": "src/common/gui/SurgeGUIEditor.cpp",
                    "file_size": 0
                }
            ],
            "interesting": {
                "reopen": false,
                "status": false
            },
            "is_parent": true,
            "sha": "4623dbbcac5a09ecd4f76ee1262866a46f4f13a5"
        },
        {
            "associated_pull_request": [
                "https://github.com/surge-synthesizer/surge/pull/2831"
            ],
            "date": "2020-10-11 14:49:55+00:00",
            "diff": "surge-synthesizer_surge/issue_2330/commit_a097b4dc9f1228dd814098f392726a1295b38379.diff",
            "diff_additions": 33,
            "diff_deletions": 2,
            "diff_file_size": 0,
            "diff_url": "https://github.com/surge-synthesizer/surge/commit/a097b4dc9f1228dd814098f392726a1295b38379.diff",
            "exists": true,
            "files": [
                {
                    "file_additions": 33,
                    "file_deletions": 2,
                    "file_exists": false,
                    "file_name": "src/common/gui/CLFOGui.cpp",
                    "file_size": 0
                }
            ],
            "interesting": {
                "reopen": false,
                "status": false
            },
            "is_parent": false,
            "sha": "a097b4dc9f1228dd814098f392726a1295b38379"
        },
        {
            "associated_pull_request": [
                "https://github.com/surge-synthesizer/surge/pull/3898"
            ],
            "date": "2021-02-16 02:34:22+00:00",
            "diff": "surge-synthesizer_surge/issue_2330/commit_0de31c4e62186a0eb376addb54f88366f73b35c6.diff",
            "diff_additions": 83,
            "diff_deletions": 8,
            "diff_file_size": 23234,
            "diff_url": "https://github.com/surge-synthesizer/surge/commit/0de31c4e62186a0eb376addb54f88366f73b35c6.diff",
            "exists": true,
            "files": [
                {
                    "file_additions": 3,
                    "file_deletions": 1,
                    "file_exists": true,
                    "file_name": "src/common/SkinColors.cpp",
                    "file_size": 23234
                },
                {
                    "file_additions": 80,
                    "file_deletions": 7,
                    "file_exists": false,
                    "file_name": "src/common/gui/COscillatorDisplay.cpp",
                    "file_size": 0
                }
            ],
            "interesting": {
                "reopen": false,
                "status": false
            },
            "is_parent": false,
            "sha": "0de31c4e62186a0eb376addb54f88366f73b35c6"
        },
        {
            "associated_pull_request": [
                "https://github.com/surge-synthesizer/surge/pull/3898"
            ],
            "date": "2021-02-16 04:07:30+00:00",
            "diff": "surge-synthesizer_surge/issue_2330/commit_4997ca76f5f604ee1809f71753ae6e526bd8b88c.diff",
            "diff_additions": 83,
            "diff_deletions": 8,
            "diff_file_size": 23234,
            "diff_url": "https://github.com/surge-synthesizer/surge/commit/4997ca76f5f604ee1809f71753ae6e526bd8b88c.diff",
            "exists": true,
            "files": [
                {
                    "file_additions": 3,
                    "file_deletions": 1,
                    "file_exists": true,
                    "file_name": "src/common/SkinColors.cpp",
                    "file_size": 23234
                },
                {
                    "file_additions": 80,
                    "file_deletions": 7,
                    "file_exists": false,
                    "file_name": "src/common/gui/COscillatorDisplay.cpp",
                    "file_size": 0
                }
            ],
            "interesting": {
                "reopen": true,
                "status": false
            },
            "is_parent": false,
            "sha": "4997ca76f5f604ee1809f71753ae6e526bd8b88c"
        },
        {
            "associated_pull_request": [
                "https://github.com/surge-synthesizer/surge/pull/3906"
            ],
            "date": "2021-02-16 14:03:58+00:00",
            "diff": "surge-synthesizer_surge/issue_2330/commit_bb66a188a8f11b6233af183075a7e93c8a57e5f9.diff",
            "diff_additions": 99,
            "diff_deletions": 47,
            "diff_file_size": 0,
            "diff_url": "https://github.com/surge-synthesizer/surge/commit/bb66a188a8f11b6233af183075a7e93c8a57e5f9.diff",
            "exists": true,
            "files": [
                {
                    "file_additions": 99,
                    "file_deletions": 47,
                    "file_exists": false,
                    "file_name": "src/common/gui/COscillatorDisplay.cpp",
                    "file_size": 0
                }
            ],
            "interesting": {
                "reopen": false,
                "status": false
            },
            "is_parent": false,
            "sha": "bb66a188a8f11b6233af183075a7e93c8a57e5f9"
        },
        {
            "associated_pull_request": [
                "https://github.com/surge-synthesizer/surge/pull/3906"
            ],
            "date": "2021-02-16 15:18:34+00:00",
            "diff": "surge-synthesizer_surge/issue_2330/commit_3fc33c16bbd47dd2fbbbdaf7a3bdf239ed13fa38.diff",
            "diff_additions": 99,
            "diff_deletions": 47,
            "diff_file_size": 0,
            "diff_url": "https://github.com/surge-synthesizer/surge/commit/3fc33c16bbd47dd2fbbbdaf7a3bdf239ed13fa38.diff",
            "exists": true,
            "files": [
                {
                    "file_additions": 99,
                    "file_deletions": 47,
                    "file_exists": false,
                    "file_name": "src/common/gui/COscillatorDisplay.cpp",
                    "file_size": 0
                }
            ],
            "interesting": {
                "reopen": false,
                "status": false
            },
            "is_parent": false,
            "sha": "3fc33c16bbd47dd2fbbbdaf7a3bdf239ed13fa38"
        },
        {
            "associated_pull_request": [
                "https://github.com/surge-synthesizer/surge/pull/3958"
            ],
            "date": "2021-02-23 17:00:54+00:00",
            "diff": "surge-synthesizer_surge/issue_2330/commit_96f9a71c2414dc0a95d19a262a78fa8e2515d191.diff",
            "diff_additions": 294,
            "diff_deletions": 50,
            "diff_file_size": 23234,
            "diff_url": "https://github.com/surge-synthesizer/surge/commit/96f9a71c2414dc0a95d19a262a78fa8e2515d191.diff",
            "exists": true,
            "files": [
                {
                    "file_additions": 41,
                    "file_deletions": 0,
                    "file_exists": true,
                    "file_name": "src/common/SkinColors.cpp",
                    "file_size": 23234
                },
                {
                    "file_additions": 253,
                    "file_deletions": 50,
                    "file_exists": false,
                    "file_name": "src/common/gui/CEffectSettings.cpp",
                    "file_size": 0
                }
            ],
            "interesting": {
                "reopen": false,
                "status": false
            },
            "is_parent": false,
            "sha": "96f9a71c2414dc0a95d19a262a78fa8e2515d191"
        }
    ],
    "first_commit": "2020-10-11 14:08:56+00:00",
    "last_commit": "2021-02-23 17:00:54+00:00",
    "number": 2330,
    "pull_request": "None",
    "score": {
        "accidental_reopen_likely": false,
        "all_labels": [
            "Feature Request",
            "UX",
            "Skinning Engine"
        ],
        "contains_keywords": [
            "work",
            "chang",
            "issu",
            "bug"
        ],
        "fix_size": 511,
        "has_labels": [],
        "intersecting": {
            "computed_score": 0.003236245954692557,
            "final_commit_size": 309,
            "intersection_size": 1,
            "previous_commits_size": 203
        },
        "is_makefile_based": true,
        "no_new_files": [
            "src/common/gui/CEffectSettings.cpp"
        ],
        "no_other_files": false,
        "num_prohibited_files": 317393,
        "prohibited_files": [
            "server/src/main/java/com/genymobile/scrcpy/Device.java",
            "server/src/main/java/com/genymobile/scrcpy/wrappers/SurfaceControl.java",
            "server/src/main/java/com/genymobile/scrcpy/Device.java",
            "server/src/main/java/com/genymobile/scrcpy/wrappers/SurfaceControl.java",
            "app/meson.build",
            "app/scrcpy.1",
            "app/src/common.h",
            "app/src/scrcpy.h",
            "app/src/server.h",
            "server/src/main/java/com/genymobile/scrcpy/Workarounds.java"
        ],
        "reopen": true,
        "reopen_events": [
            [
                "2020-10-11 14:50:07+00:00",
                "commit"
            ],
            [
                "2020-10-11 14:59:58+00:00",
                "commit"
            ],
            [
                "2021-02-16 02:34:46+00:00",
                "commit"
            ],
            [
                "2021-02-16 04:07:30+00:00",
                "closed"
            ],
            [
                "2021-02-16 04:07:31+00:00",
                "commit"
            ],
            [
                "2021-02-16 12:28:17+00:00",
                "reopened"
            ],
            [
                "2021-02-16 14:04:24+00:00",
                "commit"
            ],
            [
                "2021-02-16 15:18:35+00:00",
                "closed"
            ],
            [
                "2021-02-16 15:18:36+00:00",
                "commit"
            ],
            [
                "2021-02-23 17:00:56+00:00",
                "commit"
            ]
        ],
        "status": false,
        "strategy": true,
        "total_changes": 899
    }
}