{
    "commits": [
        {
            "diff": "spring-projects_spring-boot/issue_20117/commit_b4d118e0411375a1ef9caca5d3813dffda70edd3.diff",
            "diff_additions": 30,
            "diff_deletions": 5,
            "diff_file_size": 67876,
            "files": [
                {
                    "file_additions": 4,
                    "file_deletions": 4,
                    "file_exists": true,
                    "file_name": "spring-boot-project/spring-boot-autoconfigure/src/main/java/org/springframework/boot/autoconfigure/condition/OnBeanCondition.java",
                    "file_size": 27765
                },
                {
                    "file_additions": 13,
                    "file_deletions": 0,
                    "file_exists": true,
                    "file_name": "spring-boot-project/spring-boot-autoconfigure/src/test/java/org/springframework/boot/autoconfigure/condition/ConditionalOnBeanTests.java",
                    "file_size": 14982
                },
                {
                    "file_additions": 13,
                    "file_deletions": 1,
                    "file_exists": true,
                    "file_name": "spring-boot-project/spring-boot-autoconfigure/src/test/java/org/springframework/boot/autoconfigure/condition/ConditionalOnMissingBeanTests.java",
                    "file_size": 25129
                }
            ],
            "interesting": {
                "reopened": false,
                "status": true
            },
            "sha": "b4d118e0411375a1ef9caca5d3813dffda70edd3"
        },
        {
            "diff": "spring-projects_spring-boot/issue_20117/commit_4c0c0aeb42bf0d86b49d32f7ffaf301aa1fc8572.diff",
            "diff_additions": 15,
            "diff_deletions": 15,
            "diff_file_size": 31415,
            "files": [
                {
                    "file_additions": 4,
                    "file_deletions": 4,
                    "file_exists": true,
                    "file_name": "spring-boot-project/spring-boot-actuator/src/test/java/org/springframework/boot/actuate/liquibase/LiquibaseEndpointTests.java",
                    "file_size": 6719
                },
                {
                    "file_additions": 2,
                    "file_deletions": 2,
                    "file_exists": true,
                    "file_name": "spring-boot-project/spring-boot-autoconfigure/src/main/java/org/springframework/boot/autoconfigure/liquibase/LiquibaseProperties.java",
                    "file_size": 6389
                },
                {
                    "file_additions": 9,
                    "file_deletions": 9,
                    "file_exists": true,
                    "file_name": "spring-boot-project/spring-boot-autoconfigure/src/test/java/org/springframework/boot/autoconfigure/liquibase/LiquibaseAutoConfigurationTests.java",
                    "file_size": 18307
                }
            ],
            "interesting": {
                "reopened": false,
                "status": true
            },
            "sha": "4c0c0aeb42bf0d86b49d32f7ffaf301aa1fc8572"
        },
        {
            "diff": "spring-projects_spring-boot/issue_20117/commit_a425cc1b466cca6dc61daa0d2119f254e3291ba1.diff",
            "diff_additions": 15,
            "diff_deletions": 15,
            "diff_file_size": 31415,
            "files": [
                {
                    "file_additions": 4,
                    "file_deletions": 4,
                    "file_exists": true,
                    "file_name": "spring-boot-project/spring-boot-actuator/src/test/java/org/springframework/boot/actuate/liquibase/LiquibaseEndpointTests.java",
                    "file_size": 6719
                },
                {
                    "file_additions": 2,
                    "file_deletions": 2,
                    "file_exists": true,
                    "file_name": "spring-boot-project/spring-boot-autoconfigure/src/main/java/org/springframework/boot/autoconfigure/liquibase/LiquibaseProperties.java",
                    "file_size": 6389
                },
                {
                    "file_additions": 9,
                    "file_deletions": 9,
                    "file_exists": true,
                    "file_name": "spring-boot-project/spring-boot-autoconfigure/src/test/java/org/springframework/boot/autoconfigure/liquibase/LiquibaseAutoConfigurationTests.java",
                    "file_size": 18307
                }
            ],
            "interesting": {
                "reopened": true,
                "status": true
            },
            "sha": "a425cc1b466cca6dc61daa0d2119f254e3291ba1"
        },
        {
            "diff": "spring-projects_spring-boot/issue_20117/commit_2ede9e63b9473333be406f103aed15df3121b4b5.diff",
            "diff_additions": 18,
            "diff_deletions": 18,
            "diff_file_size": 34040,
            "files": [
                {
                    "file_additions": 4,
                    "file_deletions": 4,
                    "file_exists": true,
                    "file_name": "spring-boot-project/spring-boot-actuator/src/test/java/org/springframework/boot/actuate/liquibase/LiquibaseEndpointTests.java",
                    "file_size": 6719
                },
                {
                    "file_additions": 2,
                    "file_deletions": 2,
                    "file_exists": true,
                    "file_name": "spring-boot-project/spring-boot-autoconfigure/src/main/java/org/springframework/boot/autoconfigure/liquibase/LiquibaseProperties.java",
                    "file_size": 6389
                },
                {
                    "file_additions": 9,
                    "file_deletions": 9,
                    "file_exists": true,
                    "file_name": "spring-boot-project/spring-boot-autoconfigure/src/test/java/org/springframework/boot/autoconfigure/liquibase/LiquibaseAutoConfigurationTests.java",
                    "file_size": 18307
                },
                {
                    "file_additions": 3,
                    "file_deletions": 3,
                    "file_exists": true,
                    "file_name": "spring-boot-tests/spring-boot-smoke-tests/spring-boot-smoke-test-liquibase/src/test/java/smoketest/liquibase/SampleLiquibaseApplicationTests.java",
                    "file_size": 2625
                }
            ],
            "interesting": {
                "reopened": false,
                "status": true
            },
            "sha": "2ede9e63b9473333be406f103aed15df3121b4b5"
        }
    ],
    "first_commit": "2020-02-11 08:29:54",
    "last_commit": "2020-02-14 09:20:33",
    "number": 20117,
    "score": 192.03053435114504
}