{
    "covered_issues": [
        797,
        794,
        790,
        787,
        785,
        779,
        776,
        773,
        770,
        768,
        763,
        761,
        757,
        756,
        753,
        751,
        737,
        733,
        731,
        728,
        727,
        726,
        725,
        724,
        722,
        720,
        719,
        717,
        716,
        715,
        714,
        713,
        707,
        705,
        701,
        700,
        699,
        695,
        693,
        691,
        686,
        682,
        679,
        676,
        674,
        672,
        670,
        669,
        668,
        665,
        661,
        660,
        653,
        652,
        645,
        643,
        641,
        639,
        638,
        636,
        635,
        634,
        631,
        630,
        628,
        625,
        624,
        623,
        621,
        618,
        617,
        616,
        612,
        611,
        606,
        605,
        603,
        602,
        600,
        595,
        593,
        590,
        585,
        580,
        573,
        569,
        568,
        567,
        566,
        565,
        564,
        559,
        552,
        548,
        545,
        544,
        543,
        541,
        539,
        538,
        537,
        529,
        528,
        526,
        525,
        522,
        521,
        520,
        518,
        517,
        515,
        514,
        512,
        511,
        510,
        509,
        508,
        507,
        506,
        505,
        504,
        502,
        500,
        498,
        497,
        495,
        492,
        490,
        488,
        483,
        479,
        478,
        477,
        476,
        475,
        473,
        462,
        461,
        460,
        459,
        458,
        456,
        451,
        450,
        446,
        443,
        438,
        436,
        433,
        428,
        425,
        424,
        422,
        419,
        416,
        415,
        412,
        405,
        404,
        393,
        392,
        391,
        390,
        389,
        388,
        387,
        382,
        381,
        380,
        379,
        378,
        375,
        371,
        368,
        367,
        366,
        359,
        355,
        354,
        353,
        352,
        351,
        350,
        348,
        346,
        345,
        344,
        343,
        339,
        335,
        334,
        332,
        329,
        325,
        323,
        321,
        320,
        314,
        310,
        309,
        307,
        306,
        294,
        293,
        291,
        290,
        289,
        285,
        281,
        280,
        279,
        277,
        276,
        275,
        273,
        272,
        269,
        266,
        259,
        256,
        255,
        253,
        252,
        250,
        247,
        246,
        245,
        244,
        243,
        242,
        241,
        240,
        235,
        234,
        233,
        232,
        231,
        230,
        228,
        227,
        226,
        225,
        224,
        222,
        221,
        220,
        219,
        218,
        217,
        214,
        212,
        211,
        210,
        207,
        206,
        205,
        203,
        201,
        200,
        199,
        198,
        197,
        196,
        194,
        193,
        192,
        191,
        190,
        189,
        188,
        185,
        184,
        183,
        181,
        176,
        175,
        174,
        173,
        171,
        168,
        166,
        164,
        163,
        162,
        160,
        159,
        156,
        154,
        153,
        152,
        151,
        150,
        148,
        145,
        143,
        142,
        138,
        137,
        136,
        135,
        133,
        132,
        131,
        130,
        129,
        128,
        127,
        124,
        121,
        120,
        119,
        118,
        117,
        115,
        114,
        113,
        112,
        111,
        110,
        109,
        108,
        106,
        105,
        103,
        100,
        99,
        98,
        97,
        96,
        95,
        94,
        92,
        91,
        88,
        87,
        86,
        85,
        83,
        81,
        80,
        79,
        78,
        77,
        76,
        75,
        74,
        72,
        71,
        70,
        69,
        68,
        67,
        66,
        65,
        64,
        63,
        62,
        61,
        60,
        59,
        58,
        56,
        55,
        53,
        52,
        50,
        49,
        48,
        46,
        45,
        44,
        43,
        42,
        41,
        40,
        39,
        38,
        37,
        36,
        35,
        34,
        32,
        31,
        30,
        29,
        28,
        26,
        25,
        24,
        23,
        22,
        21,
        20,
        19,
        18,
        17,
        16,
        15,
        14,
        13,
        12,
        11,
        10,
        9,
        8,
        7,
        6,
        5,
        4,
        3,
        2,
        1
    ],
    "finished": true
}