{
    "commits": [
        {
            "diff": "square_okhttp/issue_1486/commit_a436addd7080edf80a3d34ec6c7a796cd61b31a0.diff",
            "diff_additions": 69,
            "diff_deletions": 7,
            "diff_file_size": 0,
            "files": [
                {
                    "file_additions": 19,
                    "file_deletions": 0,
                    "file_exists": false,
                    "file_name": "okhttp-tests/src/test/java/com/squareup/okhttp/HttpUrlTest.java",
                    "file_size": 0
                },
                {
                    "file_additions": 48,
                    "file_deletions": 3,
                    "file_exists": false,
                    "file_name": "okhttp-tests/src/test/java/com/squareup/okhttp/UrlComponentEncodingTester.java",
                    "file_size": 0
                },
                {
                    "file_additions": 2,
                    "file_deletions": 4,
                    "file_exists": false,
                    "file_name": "okhttp/src/main/java/com/squareup/okhttp/HttpUrl.java",
                    "file_size": 0
                }
            ],
            "interesting": {
                "reopened": false,
                "status": true
            },
            "sha": "a436addd7080edf80a3d34ec6c7a796cd61b31a0"
        },
        {
            "diff": "square_okhttp/issue_1486/commit_b6987d422ab3ebaa4b318cd7e21010e524ffcd93.diff",
            "diff_additions": 49,
            "diff_deletions": 12,
            "diff_file_size": 0,
            "files": [
                {
                    "file_additions": 49,
                    "file_deletions": 12,
                    "file_exists": false,
                    "file_name": "okhttp/src/main/java/com/squareup/okhttp/HttpUrl.java",
                    "file_size": 0
                }
            ],
            "interesting": {
                "reopened": false,
                "status": true
            },
            "sha": "b6987d422ab3ebaa4b318cd7e21010e524ffcd93"
        },
        {
            "diff": "square_okhttp/issue_1486/commit_ebbe554e356d6bf2c61cfa8ba73c6779ef59fb00.diff",
            "diff_additions": 49,
            "diff_deletions": 12,
            "diff_file_size": 0,
            "files": [
                {
                    "file_additions": 49,
                    "file_deletions": 12,
                    "file_exists": false,
                    "file_name": "okhttp/src/main/java/com/squareup/okhttp/HttpUrl.java",
                    "file_size": 0
                }
            ],
            "interesting": {
                "reopened": false,
                "status": false
            },
            "sha": "ebbe554e356d6bf2c61cfa8ba73c6779ef59fb00"
        }
    ],
    "first_commit": "2015-05-13 02:18:56",
    "last_commit": "2015-05-13 03:57:02",
    "number": 1486,
    "score": 352.020202020202
}