{
    "covered_issues": [
        174,
        162,
        160,
        157,
        156,
        154,
        151,
        145,
        143,
        141,
        140,
        138,
        135,
        133,
        132,
        128,
        120,
        118,
        106,
        103,
        90,
        85,
        79,
        75,
        71,
        70,
        65,
        59,
        51,
        50,
        49,
        46,
        37,
        36,
        33,
        27,
        23,
        20,
        17,
        16,
        12,
        10,
        8,
        7,
        6,
        4,
        3,
        2,
        1
    ],
    "finished": true
}