{
    "commits": [
        {
            "associated_pull_request": [],
            "date": "2023-02-08 00:19:00+00:00",
            "diff": "yugabyte_yugabyte-db/issue_15881/commit_cc82ce90e3b5f91c8e7eee6fea95a2dac07fb934.diff",
            "diff_additions": 10,
            "diff_deletions": 2,
            "diff_file_size": 0,
            "diff_url": "https://github.com/yugabyte/yugabyte-db/commit/cc82ce90e3b5f91c8e7eee6fea95a2dac07fb934.diff",
            "exists": true,
            "files": [
                {
                    "file_additions": 10,
                    "file_deletions": 2,
                    "file_exists": false,
                    "file_name": "ent/src/yb/cdc/cdc_producer.cc",
                    "file_size": 0
                }
            ],
            "interesting": {
                "reopen": false,
                "status": false
            },
            "is_parent": true,
            "sha": "cc82ce90e3b5f91c8e7eee6fea95a2dac07fb934"
        },
        {
            "associated_pull_request": [],
            "date": "2023-01-31 21:22:28+00:00",
            "diff": "yugabyte_yugabyte-db/issue_15881/commit_03055c430fa5e5424f8c241c8ba2e9a9c029881d.diff",
            "diff_additions": 24,
            "diff_deletions": 9,
            "diff_file_size": 245821,
            "diff_url": "https://github.com/yugabyte/yugabyte-db/commit/03055c430fa5e5424f8c241c8ba2e9a9c029881d.diff",
            "exists": true,
            "files": [
                {
                    "file_additions": 24,
                    "file_deletions": 9,
                    "file_exists": true,
                    "file_name": "src/postgres/src/backend/optimizer/plan/createplan.c",
                    "file_size": 245821
                }
            ],
            "interesting": {
                "reopen": true,
                "status": false
            },
            "is_parent": false,
            "sha": "03055c430fa5e5424f8c241c8ba2e9a9c029881d"
        },
        {
            "associated_pull_request": [],
            "date": "2023-02-14 21:40:51+00:00",
            "diff": "yugabyte_yugabyte-db/issue_15881/commit_3ceb5e2e385befd6ebf6d6fa67317e32004bfd03.diff",
            "diff_additions": 20,
            "diff_deletions": 5,
            "diff_file_size": 245821,
            "diff_url": "https://github.com/yugabyte/yugabyte-db/commit/3ceb5e2e385befd6ebf6d6fa67317e32004bfd03.diff",
            "exists": true,
            "files": [
                {
                    "file_additions": 20,
                    "file_deletions": 5,
                    "file_exists": true,
                    "file_name": "src/postgres/src/backend/optimizer/plan/createplan.c",
                    "file_size": 245821
                }
            ],
            "interesting": {
                "reopen": false,
                "status": false
            },
            "is_parent": false,
            "sha": "3ceb5e2e385befd6ebf6d6fa67317e32004bfd03"
        },
        {
            "associated_pull_request": [],
            "date": "2023-02-14 21:40:51+00:00",
            "diff": "yugabyte_yugabyte-db/issue_15881/commit_1784f483b9eb697cc6dfff99e869b818a4f617ce.diff",
            "diff_additions": 20,
            "diff_deletions": 5,
            "diff_file_size": 245821,
            "diff_url": "https://github.com/yugabyte/yugabyte-db/commit/1784f483b9eb697cc6dfff99e869b818a4f617ce.diff",
            "exists": true,
            "files": [
                {
                    "file_additions": 20,
                    "file_deletions": 5,
                    "file_exists": true,
                    "file_name": "src/postgres/src/backend/optimizer/plan/createplan.c",
                    "file_size": 245821
                }
            ],
            "interesting": {
                "reopen": false,
                "status": false
            },
            "is_parent": false,
            "sha": "1784f483b9eb697cc6dfff99e869b818a4f617ce"
        },
        {
            "associated_pull_request": [],
            "date": "2023-02-21 22:03:46+00:00",
            "diff": "yugabyte_yugabyte-db/issue_15881/commit_d8bf819fffa58a37c514c65f962950642e1c5bcf.diff",
            "diff_additions": 142,
            "diff_deletions": 81,
            "diff_file_size": 406252,
            "diff_url": "https://github.com/yugabyte/yugabyte-db/commit/d8bf819fffa58a37c514c65f962950642e1c5bcf.diff",
            "exists": true,
            "files": [
                {
                    "file_additions": 2,
                    "file_deletions": 1,
                    "file_exists": true,
                    "file_name": "src/postgres/src/backend/access/yb_access/yb_scan.c",
                    "file_size": 101587
                },
                {
                    "file_additions": 8,
                    "file_deletions": 13,
                    "file_exists": true,
                    "file_name": "src/postgres/src/backend/executor/execUtils.c",
                    "file_size": 32811
                },
                {
                    "file_additions": 37,
                    "file_deletions": 8,
                    "file_exists": true,
                    "file_name": "src/yb/tserver/pg_client_session.cc",
                    "file_size": 72679
                },
                {
                    "file_additions": 12,
                    "file_deletions": 11,
                    "file_exists": true,
                    "file_name": "src/yb/yql/pggate/pg_doc_op.cc",
                    "file_size": 56785
                },
                {
                    "file_additions": 71,
                    "file_deletions": 20,
                    "file_exists": true,
                    "file_name": "src/yb/yql/pggate/pg_session.cc",
                    "file_size": 40747
                },
                {
                    "file_additions": 1,
                    "file_deletions": 15,
                    "file_exists": true,
                    "file_name": "src/yb/yql/pggate/pg_txn_manager.cc",
                    "file_size": 19708
                },
                {
                    "file_additions": 11,
                    "file_deletions": 13,
                    "file_exists": true,
                    "file_name": "src/yb/yql/pggate/pggate.cc",
                    "file_size": 81935
                }
            ],
            "interesting": {
                "reopen": false,
                "status": false
            },
            "is_parent": false,
            "sha": "d8bf819fffa58a37c514c65f962950642e1c5bcf"
        },
        {
            "associated_pull_request": [],
            "date": "2023-02-21 22:03:46+00:00",
            "diff": "yugabyte_yugabyte-db/issue_15881/commit_aabaa0c386e24cfc8630f84f1f36719c231941cf.diff",
            "diff_additions": 288,
            "diff_deletions": 98,
            "diff_file_size": 539852,
            "diff_url": "https://github.com/yugabyte/yugabyte-db/commit/aabaa0c386e24cfc8630f84f1f36719c231941cf.diff",
            "exists": true,
            "files": [
                {
                    "file_additions": 2,
                    "file_deletions": 1,
                    "file_exists": true,
                    "file_name": "src/postgres/src/backend/access/yb_access/yb_scan.c",
                    "file_size": 101587
                },
                {
                    "file_additions": 8,
                    "file_deletions": 13,
                    "file_exists": true,
                    "file_name": "src/postgres/src/backend/executor/execUtils.c",
                    "file_size": 32811
                },
                {
                    "file_additions": 11,
                    "file_deletions": 1,
                    "file_exists": true,
                    "file_name": "src/yb/integration-tests/mini_cluster.cc",
                    "file_size": 54070
                },
                {
                    "file_additions": 75,
                    "file_deletions": 23,
                    "file_exists": true,
                    "file_name": "src/yb/tserver/pg_client_session.cc",
                    "file_size": 72679
                },
                {
                    "file_additions": 12,
                    "file_deletions": 11,
                    "file_exists": true,
                    "file_name": "src/yb/yql/pggate/pg_doc_op.cc",
                    "file_size": 56785
                },
                {
                    "file_additions": 73,
                    "file_deletions": 20,
                    "file_exists": true,
                    "file_name": "src/yb/yql/pggate/pg_session.cc",
                    "file_size": 40747
                },
                {
                    "file_additions": 1,
                    "file_deletions": 15,
                    "file_exists": true,
                    "file_name": "src/yb/yql/pggate/pg_txn_manager.cc",
                    "file_size": 19708
                },
                {
                    "file_additions": 11,
                    "file_deletions": 13,
                    "file_exists": true,
                    "file_name": "src/yb/yql/pggate/pggate.cc",
                    "file_size": 81935
                },
                {
                    "file_additions": 11,
                    "file_deletions": 0,
                    "file_exists": true,
                    "file_name": "src/yb/yql/pggate/ybc_pggate.cc",
                    "file_size": 69076
                },
                {
                    "file_additions": 81,
                    "file_deletions": 0,
                    "file_exists": true,
                    "file_name": "src/yb/yql/pgwrapper/pg_clock_skew-test.cc",
                    "file_size": 3997
                },
                {
                    "file_additions": 3,
                    "file_deletions": 1,
                    "file_exists": true,
                    "file_name": "src/yb/yql/pgwrapper/pg_mini_test_base.cc",
                    "file_size": 6457
                }
            ],
            "interesting": {
                "reopen": false,
                "status": false
            },
            "is_parent": false,
            "sha": "aabaa0c386e24cfc8630f84f1f36719c231941cf"
        }
    ],
    "first_commit": "2023-02-08 22:24:49+00:00",
    "last_commit": "2023-02-23 00:28:54+00:00",
    "number": 15881,
    "pull_request": "None",
    "score": {
        "accidental_reopen_likely": false,
        "all_labels": [
            "kind/enhancement",
            "area/ysql",
            "2.14 Backport Required",
            "2.16 Backport Required",
            "priority/highest"
        ],
        "contains_keywords": [
            "chang",
            "fix",
            "issu",
            "perform",
            "reason",
            "test",
            "fault",
            "bug",
            "error"
        ],
        "fix_size": 390,
        "has_labels": [],
        "intersecting": {
            "computed_score": 0.6060606060606061,
            "final_commit_size": 297,
            "intersection_size": 180,
            "previous_commits_size": 273
        },
        "is_makefile_based": true,
        "no_new_files": [
            "src/yb/integration-tests/mini_cluster.cc",
            "src/yb/yql/pggate/ybc_pggate.cc",
            "src/yb/yql/pgwrapper/pg_mini_test_base.cc"
        ],
        "no_other_files": false,
        "num_prohibited_files": 88050,
        "prohibited_files": [
            "server/src/main/java/com/genymobile/scrcpy/Device.java",
            "server/src/main/java/com/genymobile/scrcpy/wrappers/SurfaceControl.java",
            "server/src/main/java/com/genymobile/scrcpy/Device.java",
            "server/src/main/java/com/genymobile/scrcpy/wrappers/SurfaceControl.java",
            "app/meson.build",
            "app/scrcpy.1",
            "app/src/common.h",
            "app/src/scrcpy.h",
            "app/src/server.h",
            "server/src/main/java/com/genymobile/scrcpy/Workarounds.java"
        ],
        "reopen": true,
        "reopen_events": [
            [
                "2023-02-08 23:26:08+00:00",
                "commit"
            ],
            [
                "2023-02-08 23:28:47+00:00",
                "closed"
            ],
            [
                "2023-02-14 16:30:02+00:00",
                "reopened"
            ],
            [
                "2023-02-15 16:18:16+00:00",
                "commit"
            ],
            [
                "2023-02-16 18:18:48+00:00",
                "commit"
            ],
            [
                "2023-02-16 18:21:31+00:00",
                "closed"
            ],
            [
                "2023-02-21 23:26:59+00:00",
                "commit"
            ],
            [
                "2023-02-23 17:32:09+00:00",
                "commit"
            ]
        ],
        "status": false,
        "strategy": true,
        "total_changes": 704
    }
}