{
    "covered_issues": [
        35,
        30,
        24,
        23,
        18,
        17,
        13,
        11,
        7,
        5,
        4,
        3,
        2
    ],
    "finished": true
}