{
    "commits": [
        {
            "diff": "elastic_elasticsearch/issue_37826/commit_b1735aa93b557f173abf4c2337917cabdfcd30e0.diff",
            "diff_additions": 491,
            "diff_deletions": 132,
            "diff_file_size": 440723,
            "files": [
                {
                    "file_additions": 67,
                    "file_deletions": 11,
                    "file_exists": true,
                    "file_name": "client/rest-high-level/src/main/java/org/elasticsearch/client/IndicesClient.java",
                    "file_size": 87672
                },
                {
                    "file_additions": 19,
                    "file_deletions": 2,
                    "file_exists": true,
                    "file_name": "client/rest-high-level/src/main/java/org/elasticsearch/client/IndicesRequestConverters.java",
                    "file_size": 34907
                },
                {
                    "file_additions": 74,
                    "file_deletions": 0,
                    "file_exists": true,
                    "file_name": "client/rest-high-level/src/main/java/org/elasticsearch/client/indices/GetMappingsRequest.java",
                    "file_size": 1957
                },
                {
                    "file_additions": 71,
                    "file_deletions": 0,
                    "file_exists": true,
                    "file_name": "client/rest-high-level/src/main/java/org/elasticsearch/client/indices/GetMappingsResponse.java",
                    "file_size": 2175
                },
                {
                    "file_additions": 48,
                    "file_deletions": 6,
                    "file_exists": true,
                    "file_name": "client/rest-high-level/src/test/java/org/elasticsearch/client/IndicesClientIT.java",
                    "file_size": 100961
                },
                {
                    "file_additions": 56,
                    "file_deletions": 24,
                    "file_exists": true,
                    "file_name": "client/rest-high-level/src/test/java/org/elasticsearch/client/IndicesRequestConvertersTests.java",
                    "file_size": 50260
                },
                {
                    "file_additions": 9,
                    "file_deletions": 10,
                    "file_exists": true,
                    "file_name": "client/rest-high-level/src/test/java/org/elasticsearch/client/documentation/IndicesClientDocumentationIT.java",
                    "file_size": 140278
                },
                {
                    "file_additions": 3,
                    "file_deletions": 4,
                    "file_exists": true,
                    "file_name": "client/rest-high-level/src/test/java/org/elasticsearch/client/indices/GetFieldMappingsResponseTests.java",
                    "file_size": 3695
                },
                {
                    "file_additions": 120,
                    "file_deletions": 0,
                    "file_exists": true,
                    "file_name": "client/rest-high-level/src/test/java/org/elasticsearch/client/indices/GetMappingsResponseTests.java",
                    "file_size": 3030
                },
                {
                    "file_additions": 11,
                    "file_deletions": 10,
                    "file_exists": true,
                    "file_name": "server/src/main/java/org/elasticsearch/action/admin/indices/mapping/get/GetMappingsResponse.java",
                    "file_size": 3644
                },
                {
                    "file_additions": 2,
                    "file_deletions": 2,
                    "file_exists": true,
                    "file_name": "server/src/main/java/org/elasticsearch/rest/action/admin/indices/RestGetMappingAction.java",
                    "file_size": 4263
                },
                {
                    "file_additions": 2,
                    "file_deletions": 2,
                    "file_exists": true,
                    "file_name": "server/src/test/java/org/elasticsearch/action/admin/indices/mapping/get/GetFieldMappingsResponseTests.java",
                    "file_size": 3473
                },
                {
                    "file_additions": 9,
                    "file_deletions": 61,
                    "file_exists": true,
                    "file_name": "server/src/test/java/org/elasticsearch/action/admin/indices/mapping/get/GetMappingsResponseTests.java",
                    "file_size": 4408
                }
            ],
            "interesting": {
                "reopened": false,
                "status": false
            },
            "sha": "b1735aa93b557f173abf4c2337917cabdfcd30e0"
        },
        {
            "diff": "elastic_elasticsearch/issue_37826/commit_6a997f3d6efe59bbeafa253211f806811187ab57.diff",
            "diff_additions": 234,
            "diff_deletions": 145,
            "diff_file_size": 558966,
            "files": [
                {
                    "file_additions": 53,
                    "file_deletions": 0,
                    "file_exists": false,
                    "file_name": "benchmarks/src/main/java/org/elasticsearch/benchmark/time/DateFormatterToZonedTimeBenchmark.java",
                    "file_size": 0
                },
                {
                    "file_additions": 1,
                    "file_deletions": 1,
                    "file_exists": false,
                    "file_name": "client/rest-high-level/src/main/java/org/elasticsearch/client/ml/job/util/TimeUtil.java",
                    "file_size": 0
                },
                {
                    "file_additions": 30,
                    "file_deletions": 4,
                    "file_exists": true,
                    "file_name": "modules/ingest-common/src/main/java/org/elasticsearch/ingest/common/DateFormat.java",
                    "file_size": 5612
                },
                {
                    "file_additions": 27,
                    "file_deletions": 3,
                    "file_exists": true,
                    "file_name": "modules/ingest-common/src/test/java/org/elasticsearch/ingest/common/DateFormatTests.java",
                    "file_size": 7070
                },
                {
                    "file_additions": 74,
                    "file_deletions": 89,
                    "file_exists": true,
                    "file_name": "server/src/main/java/org/elasticsearch/common/time/DateFormatters.java",
                    "file_size": 100936
                },
                {
                    "file_additions": 2,
                    "file_deletions": 2,
                    "file_exists": true,
                    "file_name": "server/src/main/java/org/elasticsearch/common/time/JavaDateMathParser.java",
                    "file_size": 9037
                },
                {
                    "file_additions": 1,
                    "file_deletions": 1,
                    "file_exists": true,
                    "file_name": "server/src/main/java/org/elasticsearch/index/mapper/DateFieldMapper.java",
                    "file_size": 27861
                },
                {
                    "file_additions": 1,
                    "file_deletions": 1,
                    "file_exists": true,
                    "file_name": "server/src/test/java/org/elasticsearch/common/RoundingTests.java",
                    "file_size": 70550
                },
                {
                    "file_additions": 2,
                    "file_deletions": 1,
                    "file_exists": true,
                    "file_name": "server/src/test/java/org/elasticsearch/common/joda/JavaJodaTimeDuellingTests.java",
                    "file_size": 52714
                },
                {
                    "file_additions": 6,
                    "file_deletions": 6,
                    "file_exists": true,
                    "file_name": "server/src/test/java/org/elasticsearch/common/time/DateFormattersTests.java",
                    "file_size": 21339
                },
                {
                    "file_additions": 2,
                    "file_deletions": 2,
                    "file_exists": true,
                    "file_name": "server/src/test/java/org/elasticsearch/common/time/JavaDateMathParserTests.java",
                    "file_size": 21880
                },
                {
                    "file_additions": 7,
                    "file_deletions": 7,
                    "file_exists": true,
                    "file_name": "server/src/test/java/org/elasticsearch/index/mapper/DateFieldTypeTests.java",
                    "file_size": 17899
                },
                {
                    "file_additions": 5,
                    "file_deletions": 5,
                    "file_exists": false,
                    "file_name": "server/src/test/java/org/elasticsearch/search/aggregations/bucket/DateHistogramIT.java",
                    "file_size": 0
                },
                {
                    "file_additions": 1,
                    "file_deletions": 1,
                    "file_exists": false,
                    "file_name": "server/src/test/java/org/elasticsearch/search/aggregations/bucket/DateHistogramOffsetIT.java",
                    "file_size": 0
                },
                {
                    "file_additions": 1,
                    "file_deletions": 1,
                    "file_exists": true,
                    "file_name": "server/src/test/java/org/elasticsearch/search/aggregations/bucket/composite/CompositeAggregatorTests.java",
                    "file_size": 134692
                },
                {
                    "file_additions": 1,
                    "file_deletions": 1,
                    "file_exists": true,
                    "file_name": "server/src/test/java/org/elasticsearch/search/aggregations/bucket/histogram/DateHistogramAggregatorTests.java",
                    "file_size": 62424
                },
                {
                    "file_additions": 3,
                    "file_deletions": 3,
                    "file_exists": true,
                    "file_name": "server/src/test/java/org/elasticsearch/search/aggregations/bucket/histogram/DateHistogramTests.java",
                    "file_size": 4173
                },
                {
                    "file_additions": 1,
                    "file_deletions": 1,
                    "file_exists": true,
                    "file_name": "server/src/test/java/org/elasticsearch/search/aggregations/pipeline/AvgBucketAggregatorTests.java",
                    "file_size": 6013
                },
                {
                    "file_additions": 1,
                    "file_deletions": 1,
                    "file_exists": true,
                    "file_name": "server/src/test/java/org/elasticsearch/search/aggregations/pipeline/CumulativeSumAggregatorTests.java",
                    "file_size": 14988
                },
                {
                    "file_additions": 12,
                    "file_deletions": 12,
                    "file_exists": false,
                    "file_name": "server/src/test/java/org/elasticsearch/search/aggregations/pipeline/DateDerivativeIT.java",
                    "file_size": 0
                },
                {
                    "file_additions": 1,
                    "file_deletions": 1,
                    "file_exists": false,
                    "file_name": "server/src/test/java/org/elasticsearch/search/aggregations/pipeline/MovFnUnitTests.java",
                    "file_size": 0
                },
                {
                    "file_additions": 2,
                    "file_deletions": 2,
                    "file_exists": true,
                    "file_name": "x-pack/plugin/core/src/main/java/org/elasticsearch/license/DateUtils.java",
                    "file_size": 1778
                }
            ],
            "interesting": {
                "reopened": false,
                "status": true
            },
            "sha": "6a997f3d6efe59bbeafa253211f806811187ab57"
        },
        {
            "diff": "elastic_elasticsearch/issue_37826/commit_b94acb608b58e7918c2ec1296db83dbc17391fe3.diff",
            "diff_additions": 224,
            "diff_deletions": 143,
            "diff_file_size": 560592,
            "files": [
                {
                    "file_additions": 53,
                    "file_deletions": 0,
                    "file_exists": true,
                    "file_name": "benchmarks/src/main/java/org/elasticsearch/benchmark/time/DateFormatterFromBenchmark.java",
                    "file_size": 1626
                },
                {
                    "file_additions": 1,
                    "file_deletions": 1,
                    "file_exists": false,
                    "file_name": "client/rest-high-level/src/main/java/org/elasticsearch/client/ml/job/util/TimeUtil.java",
                    "file_size": 0
                },
                {
                    "file_additions": 30,
                    "file_deletions": 4,
                    "file_exists": true,
                    "file_name": "modules/ingest-common/src/main/java/org/elasticsearch/ingest/common/DateFormat.java",
                    "file_size": 5612
                },
                {
                    "file_additions": 17,
                    "file_deletions": 3,
                    "file_exists": true,
                    "file_name": "modules/ingest-common/src/test/java/org/elasticsearch/ingest/common/DateFormatTests.java",
                    "file_size": 7070
                },
                {
                    "file_additions": 75,
                    "file_deletions": 87,
                    "file_exists": true,
                    "file_name": "server/src/main/java/org/elasticsearch/common/time/DateFormatters.java",
                    "file_size": 100936
                },
                {
                    "file_additions": 2,
                    "file_deletions": 2,
                    "file_exists": true,
                    "file_name": "server/src/main/java/org/elasticsearch/common/time/JavaDateMathParser.java",
                    "file_size": 9037
                },
                {
                    "file_additions": 1,
                    "file_deletions": 1,
                    "file_exists": true,
                    "file_name": "server/src/main/java/org/elasticsearch/index/mapper/DateFieldMapper.java",
                    "file_size": 27861
                },
                {
                    "file_additions": 1,
                    "file_deletions": 1,
                    "file_exists": true,
                    "file_name": "server/src/test/java/org/elasticsearch/common/RoundingTests.java",
                    "file_size": 70550
                },
                {
                    "file_additions": 1,
                    "file_deletions": 1,
                    "file_exists": true,
                    "file_name": "server/src/test/java/org/elasticsearch/common/joda/JavaJodaTimeDuellingTests.java",
                    "file_size": 52714
                },
                {
                    "file_additions": 6,
                    "file_deletions": 6,
                    "file_exists": true,
                    "file_name": "server/src/test/java/org/elasticsearch/common/time/DateFormattersTests.java",
                    "file_size": 21339
                },
                {
                    "file_additions": 2,
                    "file_deletions": 2,
                    "file_exists": true,
                    "file_name": "server/src/test/java/org/elasticsearch/common/time/JavaDateMathParserTests.java",
                    "file_size": 21880
                },
                {
                    "file_additions": 7,
                    "file_deletions": 7,
                    "file_exists": true,
                    "file_name": "server/src/test/java/org/elasticsearch/index/mapper/DateFieldTypeTests.java",
                    "file_size": 17899
                },
                {
                    "file_additions": 5,
                    "file_deletions": 5,
                    "file_exists": false,
                    "file_name": "server/src/test/java/org/elasticsearch/search/aggregations/bucket/DateHistogramIT.java",
                    "file_size": 0
                },
                {
                    "file_additions": 1,
                    "file_deletions": 1,
                    "file_exists": false,
                    "file_name": "server/src/test/java/org/elasticsearch/search/aggregations/bucket/DateHistogramOffsetIT.java",
                    "file_size": 0
                },
                {
                    "file_additions": 1,
                    "file_deletions": 1,
                    "file_exists": true,
                    "file_name": "server/src/test/java/org/elasticsearch/search/aggregations/bucket/composite/CompositeAggregatorTests.java",
                    "file_size": 134692
                },
                {
                    "file_additions": 1,
                    "file_deletions": 1,
                    "file_exists": true,
                    "file_name": "server/src/test/java/org/elasticsearch/search/aggregations/bucket/histogram/DateHistogramAggregatorTests.java",
                    "file_size": 62424
                },
                {
                    "file_additions": 3,
                    "file_deletions": 3,
                    "file_exists": true,
                    "file_name": "server/src/test/java/org/elasticsearch/search/aggregations/bucket/histogram/DateHistogramTests.java",
                    "file_size": 4173
                },
                {
                    "file_additions": 1,
                    "file_deletions": 1,
                    "file_exists": true,
                    "file_name": "server/src/test/java/org/elasticsearch/search/aggregations/pipeline/AvgBucketAggregatorTests.java",
                    "file_size": 6013
                },
                {
                    "file_additions": 1,
                    "file_deletions": 1,
                    "file_exists": true,
                    "file_name": "server/src/test/java/org/elasticsearch/search/aggregations/pipeline/CumulativeSumAggregatorTests.java",
                    "file_size": 14988
                },
                {
                    "file_additions": 12,
                    "file_deletions": 12,
                    "file_exists": false,
                    "file_name": "server/src/test/java/org/elasticsearch/search/aggregations/pipeline/DateDerivativeIT.java",
                    "file_size": 0
                },
                {
                    "file_additions": 1,
                    "file_deletions": 1,
                    "file_exists": false,
                    "file_name": "server/src/test/java/org/elasticsearch/search/aggregations/pipeline/MovFnUnitTests.java",
                    "file_size": 0
                },
                {
                    "file_additions": 2,
                    "file_deletions": 2,
                    "file_exists": true,
                    "file_name": "x-pack/plugin/core/src/main/java/org/elasticsearch/license/DateUtils.java",
                    "file_size": 1778
                }
            ],
            "interesting": {
                "reopened": false,
                "status": false
            },
            "sha": "b94acb608b58e7918c2ec1296db83dbc17391fe3"
        },
        {
            "diff": "elastic_elasticsearch/issue_37826/commit_e00afd20731c7b83fb96a1c1444c13b7199bcb02.diff",
            "diff_additions": 210,
            "diff_deletions": 100,
            "diff_file_size": 224387,
            "files": [
                {
                    "file_additions": 53,
                    "file_deletions": 0,
                    "file_exists": true,
                    "file_name": "benchmarks/src/main/java/org/elasticsearch/benchmark/time/DateFormatterFromBenchmark.java",
                    "file_size": 1626
                },
                {
                    "file_additions": 1,
                    "file_deletions": 1,
                    "file_exists": false,
                    "file_name": "client/rest-high-level/src/main/java/org/elasticsearch/client/ml/job/util/TimeUtil.java",
                    "file_size": 0
                },
                {
                    "file_additions": 27,
                    "file_deletions": 2,
                    "file_exists": true,
                    "file_name": "modules/ingest-common/src/main/java/org/elasticsearch/ingest/common/DateFormat.java",
                    "file_size": 5612
                },
                {
                    "file_additions": 29,
                    "file_deletions": 0,
                    "file_exists": true,
                    "file_name": "modules/ingest-common/src/test/java/org/elasticsearch/ingest/common/DateFormatTests.java",
                    "file_size": 7070
                },
                {
                    "file_additions": 86,
                    "file_deletions": 83,
                    "file_exists": true,
                    "file_name": "server/src/main/java/org/elasticsearch/common/time/DateFormatters.java",
                    "file_size": 100936
                },
                {
                    "file_additions": 2,
                    "file_deletions": 2,
                    "file_exists": true,
                    "file_name": "server/src/main/java/org/elasticsearch/common/time/JavaDateMathParser.java",
                    "file_size": 9037
                },
                {
                    "file_additions": 1,
                    "file_deletions": 1,
                    "file_exists": true,
                    "file_name": "server/src/test/java/org/elasticsearch/common/joda/JavaJodaTimeDuellingTests.java",
                    "file_size": 52714
                },
                {
                    "file_additions": 6,
                    "file_deletions": 6,
                    "file_exists": true,
                    "file_name": "server/src/test/java/org/elasticsearch/common/time/DateFormattersTests.java",
                    "file_size": 21339
                },
                {
                    "file_additions": 2,
                    "file_deletions": 2,
                    "file_exists": true,
                    "file_name": "server/src/test/java/org/elasticsearch/common/time/JavaDateMathParserTests.java",
                    "file_size": 21880
                },
                {
                    "file_additions": 3,
                    "file_deletions": 3,
                    "file_exists": true,
                    "file_name": "server/src/test/java/org/elasticsearch/search/aggregations/bucket/histogram/DateHistogramTests.java",
                    "file_size": 4173
                }
            ],
            "interesting": {
                "reopened": false,
                "status": false
            },
            "sha": "e00afd20731c7b83fb96a1c1444c13b7199bcb02"
        },
        {
            "diff": "elastic_elasticsearch/issue_37826/commit_1094d3b867b9d5daaeebb690ec219987a20908f7.diff",
            "diff_additions": 210,
            "diff_deletions": 100,
            "diff_file_size": 224387,
            "files": [
                {
                    "file_additions": 53,
                    "file_deletions": 0,
                    "file_exists": true,
                    "file_name": "benchmarks/src/main/java/org/elasticsearch/benchmark/time/DateFormatterFromBenchmark.java",
                    "file_size": 1626
                },
                {
                    "file_additions": 1,
                    "file_deletions": 1,
                    "file_exists": false,
                    "file_name": "client/rest-high-level/src/main/java/org/elasticsearch/client/ml/job/util/TimeUtil.java",
                    "file_size": 0
                },
                {
                    "file_additions": 27,
                    "file_deletions": 2,
                    "file_exists": true,
                    "file_name": "modules/ingest-common/src/main/java/org/elasticsearch/ingest/common/DateFormat.java",
                    "file_size": 5612
                },
                {
                    "file_additions": 29,
                    "file_deletions": 0,
                    "file_exists": true,
                    "file_name": "modules/ingest-common/src/test/java/org/elasticsearch/ingest/common/DateFormatTests.java",
                    "file_size": 7070
                },
                {
                    "file_additions": 86,
                    "file_deletions": 83,
                    "file_exists": true,
                    "file_name": "server/src/main/java/org/elasticsearch/common/time/DateFormatters.java",
                    "file_size": 100936
                },
                {
                    "file_additions": 2,
                    "file_deletions": 2,
                    "file_exists": true,
                    "file_name": "server/src/main/java/org/elasticsearch/common/time/JavaDateMathParser.java",
                    "file_size": 9037
                },
                {
                    "file_additions": 1,
                    "file_deletions": 1,
                    "file_exists": true,
                    "file_name": "server/src/test/java/org/elasticsearch/common/joda/JavaJodaTimeDuellingTests.java",
                    "file_size": 52714
                },
                {
                    "file_additions": 6,
                    "file_deletions": 6,
                    "file_exists": true,
                    "file_name": "server/src/test/java/org/elasticsearch/common/time/DateFormattersTests.java",
                    "file_size": 21339
                },
                {
                    "file_additions": 2,
                    "file_deletions": 2,
                    "file_exists": true,
                    "file_name": "server/src/test/java/org/elasticsearch/common/time/JavaDateMathParserTests.java",
                    "file_size": 21880
                },
                {
                    "file_additions": 3,
                    "file_deletions": 3,
                    "file_exists": true,
                    "file_name": "server/src/test/java/org/elasticsearch/search/aggregations/bucket/histogram/DateHistogramTests.java",
                    "file_size": 4173
                }
            ],
            "interesting": {
                "reopened": true,
                "status": false
            },
            "sha": "1094d3b867b9d5daaeebb690ec219987a20908f7"
        },
        {
            "diff": "elastic_elasticsearch/issue_37826/commit_242df6f171b1d6330e68e5cb3f8c3a8ae72235fc.diff",
            "diff_additions": 53,
            "diff_deletions": 14,
            "diff_file_size": 54817,
            "files": [
                {
                    "file_additions": 31,
                    "file_deletions": 13,
                    "file_exists": false,
                    "file_name": "benchmarks/src/main/java/org/elasticsearch/benchmark/time/RoundingBenchmark.java",
                    "file_size": 0
                },
                {
                    "file_additions": 22,
                    "file_deletions": 1,
                    "file_exists": true,
                    "file_name": "server/src/main/java/org/elasticsearch/common/Rounding.java",
                    "file_size": 54817
                }
            ],
            "interesting": {
                "reopened": false,
                "status": true
            },
            "sha": "242df6f171b1d6330e68e5cb3f8c3a8ae72235fc"
        },
        {
            "diff": "elastic_elasticsearch/issue_37826/commit_b9552202c1c5ef77cc1252c4c5b42ac292ed47fc.diff",
            "diff_additions": 607,
            "diff_deletions": 31,
            "diff_file_size": 212337,
            "files": [
                {
                    "file_additions": 80,
                    "file_deletions": 13,
                    "file_exists": false,
                    "file_name": "benchmarks/src/main/java/org/elasticsearch/benchmark/time/RoundingBenchmark.java",
                    "file_size": 0
                },
                {
                    "file_additions": 64,
                    "file_deletions": 17,
                    "file_exists": true,
                    "file_name": "server/src/main/java/org/elasticsearch/common/Rounding.java",
                    "file_size": 54817
                },
                {
                    "file_additions": 78,
                    "file_deletions": 0,
                    "file_exists": true,
                    "file_name": "server/src/main/java/org/elasticsearch/common/time/DateUtils.java",
                    "file_size": 17817
                },
                {
                    "file_additions": 182,
                    "file_deletions": 0,
                    "file_exists": true,
                    "file_name": "server/src/main/java/org/elasticsearch/common/time/DateUtilsRounding.java",
                    "file_size": 8171
                },
                {
                    "file_additions": 25,
                    "file_deletions": 1,
                    "file_exists": true,
                    "file_name": "server/src/test/java/org/elasticsearch/common/RoundingTests.java",
                    "file_size": 70550
                },
                {
                    "file_additions": 21,
                    "file_deletions": 0,
                    "file_exists": true,
                    "file_name": "server/src/test/java/org/elasticsearch/common/rounding/RoundingDuelTests.java",
                    "file_size": 2084
                },
                {
                    "file_additions": 24,
                    "file_deletions": 0,
                    "file_exists": true,
                    "file_name": "server/src/test/java/org/elasticsearch/common/rounding/TimeZoneRoundingTests.java",
                    "file_size": 46008
                },
                {
                    "file_additions": 49,
                    "file_deletions": 0,
                    "file_exists": true,
                    "file_name": "server/src/test/java/org/elasticsearch/common/time/DateUtilsRoundingTests.java",
                    "file_size": 2277
                },
                {
                    "file_additions": 84,
                    "file_deletions": 0,
                    "file_exists": true,
                    "file_name": "server/src/test/java/org/elasticsearch/common/time/DateUtilsTests.java",
                    "file_size": 10613
                }
            ],
            "interesting": {
                "reopened": false,
                "status": false
            },
            "sha": "b9552202c1c5ef77cc1252c4c5b42ac292ed47fc"
        },
        {
            "diff": "elastic_elasticsearch/issue_37826/commit_51589c70a8386ce0f76e85594a999b5c97e6beb1.diff",
            "diff_additions": 621,
            "diff_deletions": 31,
            "diff_file_size": 212337,
            "files": [
                {
                    "file_additions": 80,
                    "file_deletions": 13,
                    "file_exists": false,
                    "file_name": "benchmarks/src/main/java/org/elasticsearch/benchmark/time/RoundingBenchmark.java",
                    "file_size": 0
                },
                {
                    "file_additions": 64,
                    "file_deletions": 17,
                    "file_exists": true,
                    "file_name": "server/src/main/java/org/elasticsearch/common/Rounding.java",
                    "file_size": 54817
                },
                {
                    "file_additions": 92,
                    "file_deletions": 0,
                    "file_exists": true,
                    "file_name": "server/src/main/java/org/elasticsearch/common/time/DateUtils.java",
                    "file_size": 17817
                },
                {
                    "file_additions": 182,
                    "file_deletions": 0,
                    "file_exists": true,
                    "file_name": "server/src/main/java/org/elasticsearch/common/time/DateUtilsRounding.java",
                    "file_size": 8171
                },
                {
                    "file_additions": 25,
                    "file_deletions": 1,
                    "file_exists": true,
                    "file_name": "server/src/test/java/org/elasticsearch/common/RoundingTests.java",
                    "file_size": 70550
                },
                {
                    "file_additions": 21,
                    "file_deletions": 0,
                    "file_exists": true,
                    "file_name": "server/src/test/java/org/elasticsearch/common/rounding/RoundingDuelTests.java",
                    "file_size": 2084
                },
                {
                    "file_additions": 24,
                    "file_deletions": 0,
                    "file_exists": true,
                    "file_name": "server/src/test/java/org/elasticsearch/common/rounding/TimeZoneRoundingTests.java",
                    "file_size": 46008
                },
                {
                    "file_additions": 49,
                    "file_deletions": 0,
                    "file_exists": true,
                    "file_name": "server/src/test/java/org/elasticsearch/common/time/DateUtilsRoundingTests.java",
                    "file_size": 2277
                },
                {
                    "file_additions": 84,
                    "file_deletions": 0,
                    "file_exists": true,
                    "file_name": "server/src/test/java/org/elasticsearch/common/time/DateUtilsTests.java",
                    "file_size": 10613
                }
            ],
            "interesting": {
                "reopened": false,
                "status": false
            },
            "sha": "51589c70a8386ce0f76e85594a999b5c97e6beb1"
        },
        {
            "diff": "elastic_elasticsearch/issue_37826/commit_a453c31cf1073dd09da020d9223d935043744470.diff",
            "diff_additions": 607,
            "diff_deletions": 31,
            "diff_file_size": 212337,
            "files": [
                {
                    "file_additions": 80,
                    "file_deletions": 13,
                    "file_exists": false,
                    "file_name": "benchmarks/src/main/java/org/elasticsearch/benchmark/time/RoundingBenchmark.java",
                    "file_size": 0
                },
                {
                    "file_additions": 64,
                    "file_deletions": 17,
                    "file_exists": true,
                    "file_name": "server/src/main/java/org/elasticsearch/common/Rounding.java",
                    "file_size": 54817
                },
                {
                    "file_additions": 78,
                    "file_deletions": 0,
                    "file_exists": true,
                    "file_name": "server/src/main/java/org/elasticsearch/common/time/DateUtils.java",
                    "file_size": 17817
                },
                {
                    "file_additions": 182,
                    "file_deletions": 0,
                    "file_exists": true,
                    "file_name": "server/src/main/java/org/elasticsearch/common/time/DateUtilsRounding.java",
                    "file_size": 8171
                },
                {
                    "file_additions": 25,
                    "file_deletions": 1,
                    "file_exists": true,
                    "file_name": "server/src/test/java/org/elasticsearch/common/RoundingTests.java",
                    "file_size": 70550
                },
                {
                    "file_additions": 21,
                    "file_deletions": 0,
                    "file_exists": true,
                    "file_name": "server/src/test/java/org/elasticsearch/common/rounding/RoundingDuelTests.java",
                    "file_size": 2084
                },
                {
                    "file_additions": 24,
                    "file_deletions": 0,
                    "file_exists": true,
                    "file_name": "server/src/test/java/org/elasticsearch/common/rounding/TimeZoneRoundingTests.java",
                    "file_size": 46008
                },
                {
                    "file_additions": 49,
                    "file_deletions": 0,
                    "file_exists": true,
                    "file_name": "server/src/test/java/org/elasticsearch/common/time/DateUtilsRoundingTests.java",
                    "file_size": 2277
                },
                {
                    "file_additions": 84,
                    "file_deletions": 0,
                    "file_exists": true,
                    "file_name": "server/src/test/java/org/elasticsearch/common/time/DateUtilsTests.java",
                    "file_size": 10613
                }
            ],
            "interesting": {
                "reopened": false,
                "status": false
            },
            "sha": "a453c31cf1073dd09da020d9223d935043744470"
        },
        {
            "diff": "elastic_elasticsearch/issue_37826/commit_6beb9ced802ef36fcc4e2b5bd471b271dba2f5d6.diff",
            "diff_additions": 607,
            "diff_deletions": 31,
            "diff_file_size": 212337,
            "files": [
                {
                    "file_additions": 80,
                    "file_deletions": 13,
                    "file_exists": false,
                    "file_name": "benchmarks/src/main/java/org/elasticsearch/benchmark/time/RoundingBenchmark.java",
                    "file_size": 0
                },
                {
                    "file_additions": 64,
                    "file_deletions": 17,
                    "file_exists": true,
                    "file_name": "server/src/main/java/org/elasticsearch/common/Rounding.java",
                    "file_size": 54817
                },
                {
                    "file_additions": 78,
                    "file_deletions": 0,
                    "file_exists": true,
                    "file_name": "server/src/main/java/org/elasticsearch/common/time/DateUtils.java",
                    "file_size": 17817
                },
                {
                    "file_additions": 182,
                    "file_deletions": 0,
                    "file_exists": true,
                    "file_name": "server/src/main/java/org/elasticsearch/common/time/DateUtilsRounding.java",
                    "file_size": 8171
                },
                {
                    "file_additions": 25,
                    "file_deletions": 1,
                    "file_exists": true,
                    "file_name": "server/src/test/java/org/elasticsearch/common/RoundingTests.java",
                    "file_size": 70550
                },
                {
                    "file_additions": 21,
                    "file_deletions": 0,
                    "file_exists": true,
                    "file_name": "server/src/test/java/org/elasticsearch/common/rounding/RoundingDuelTests.java",
                    "file_size": 2084
                },
                {
                    "file_additions": 24,
                    "file_deletions": 0,
                    "file_exists": true,
                    "file_name": "server/src/test/java/org/elasticsearch/common/rounding/TimeZoneRoundingTests.java",
                    "file_size": 46008
                },
                {
                    "file_additions": 49,
                    "file_deletions": 0,
                    "file_exists": true,
                    "file_name": "server/src/test/java/org/elasticsearch/common/time/DateUtilsRoundingTests.java",
                    "file_size": 2277
                },
                {
                    "file_additions": 84,
                    "file_deletions": 0,
                    "file_exists": true,
                    "file_name": "server/src/test/java/org/elasticsearch/common/time/DateUtilsTests.java",
                    "file_size": 10613
                }
            ],
            "interesting": {
                "reopened": false,
                "status": false
            },
            "sha": "6beb9ced802ef36fcc4e2b5bd471b271dba2f5d6"
        }
    ],
    "first_commit": "2019-01-28 00:02:22",
    "last_commit": "2019-02-12 17:26:52",
    "number": 37826,
    "score": 192.00086542622242
}