{
    "covered_issues": [
        120,
        118,
        112,
        111,
        110,
        104,
        101,
        96,
        93,
        89,
        85,
        78,
        76,
        75,
        73,
        71,
        68,
        67,
        63,
        59,
        46,
        45,
        42,
        41,
        37,
        36,
        35,
        33,
        29,
        27,
        26,
        20,
        17,
        16,
        13,
        10,
        8,
        4
    ],
    "finished": true
}