{
    "covered_issues": [
        58,
        57,
        56,
        53,
        49,
        46,
        45,
        44,
        43,
        36,
        35,
        34,
        32,
        28,
        27,
        26,
        25,
        24,
        20,
        18,
        17,
        16,
        14,
        13,
        12,
        10,
        9,
        7,
        6,
        5,
        4
    ],
    "finished": true
}