{
    "covered_issues": [
        320,
        305,
        300,
        299,
        291,
        280,
        271,
        270,
        267,
        266,
        262,
        261,
        260,
        256,
        252,
        251,
        249,
        248,
        247,
        246,
        242,
        241,
        240,
        239,
        238,
        236,
        235,
        234,
        233,
        231,
        230,
        226,
        224,
        223,
        218,
        216,
        215,
        214,
        213,
        212,
        211,
        210,
        205,
        201,
        200,
        199,
        198,
        195,
        194,
        193,
        192,
        190,
        189,
        188,
        186,
        185,
        184,
        183,
        181,
        179,
        178,
        175,
        174,
        173,
        172,
        169,
        168,
        166,
        164,
        160,
        159,
        158,
        157,
        156,
        155,
        154,
        152,
        151,
        150,
        149,
        146,
        145,
        143,
        138,
        137,
        135,
        134,
        132,
        130,
        128,
        127,
        123,
        120,
        119,
        118,
        116,
        115,
        114,
        111,
        110,
        105,
        104,
        103,
        102,
        98,
        94,
        89,
        88,
        85,
        82,
        79,
        74,
        73,
        71,
        69,
        68,
        67,
        66,
        65,
        64,
        63,
        62,
        61,
        60,
        57,
        55,
        53,
        48,
        47,
        45,
        44,
        43,
        42,
        41,
        36,
        35,
        34,
        33,
        32,
        31,
        30,
        28,
        27,
        24,
        22,
        21,
        20,
        19,
        17,
        16,
        15,
        13,
        12,
        11,
        10,
        9,
        8,
        1
    ],
    "finished": true
}