{
    "covered_issues": [
        86,
        81,
        76,
        67,
        49,
        44,
        37,
        36,
        34,
        32,
        30,
        28,
        27,
        26,
        25,
        8,
        6
    ],
    "finished": true
}