{
    "covered_issues": [
        55,
        52,
        49,
        47,
        40,
        39,
        38,
        37,
        33,
        30,
        29,
        28,
        27,
        24,
        23,
        21,
        20,
        19,
        18,
        17,
        16,
        15,
        13,
        12,
        11,
        10,
        9,
        4,
        2,
        1
    ],
    "finished": true
}