{
    "category": [
        "memory",
        "build/refactor/preprocessing"
    ],
    "commits": [
        {
            "associated_pull_request": [
                "https://github.com/open62541/open62541/pull/4241"
            ],
            "date": "2021-03-13 17:04:40",
            "diff": "open62541_open62541/issue_4258/commit_7bde5f2b6635d442e610d28aaf5d456783bfc279.diff",
            "diff_additions": 14,
            "diff_deletions": 13,
            "diff_file_size": 7114,
            "diff_url": "https://github.com/open62541/open62541/commit/7bde5f2b6635d442e610d28aaf5d456783bfc279.diff",
            "exists": true,
            "files": [
                {
                    "file_additions": 14,
                    "file_deletions": 13,
                    "file_exists": true,
                    "file_name": "deps/aa_tree.c",
                    "file_size": 7114
                }
            ],
            "interesting": {
                "reopen": false,
                "status": false
            },
            "is_parent": true,
            "sha": "7bde5f2b6635d442e610d28aaf5d456783bfc279"
        },
        {
            "associated_pull_request": [],
            "date": "2021-03-18 20:19:53",
            "diff": "open62541_open62541/issue_4258/commit_46460358490adfc9e9c410fb4ca8bbedc7e3f1a6.diff",
            "diff_additions": 18,
            "diff_deletions": 10,
            "diff_file_size": 29289,
            "diff_url": "https://github.com/open62541/open62541/commit/46460358490adfc9e9c410fb4ca8bbedc7e3f1a6.diff",
            "exists": true,
            "files": [
                {
                    "file_additions": 18,
                    "file_deletions": 10,
                    "file_exists": true,
                    "file_name": "src/server/ua_services_monitoreditem.c",
                    "file_size": 29289
                }
            ],
            "interesting": {
                "reopen": false,
                "status": true
            },
            "is_parent": false,
            "sha": "46460358490adfc9e9c410fb4ca8bbedc7e3f1a6"
        },
        {
            "associated_pull_request": [
                "https://github.com/open62541/open62541/pull/4259"
            ],
            "date": "2021-03-18 20:19:53",
            "diff": "open62541_open62541/issue_4258/commit_9fd22170bc81ec021734957ca6440a3ddf2da46b.diff",
            "diff_additions": 18,
            "diff_deletions": 10,
            "diff_file_size": 29289,
            "diff_url": "https://github.com/open62541/open62541/commit/9fd22170bc81ec021734957ca6440a3ddf2da46b.diff",
            "exists": true,
            "files": [
                {
                    "file_additions": 18,
                    "file_deletions": 10,
                    "file_exists": true,
                    "file_name": "src/server/ua_services_monitoreditem.c",
                    "file_size": 29289
                }
            ],
            "interesting": {
                "reopen": false,
                "status": false
            },
            "is_parent": false,
            "sha": "9fd22170bc81ec021734957ca6440a3ddf2da46b"
        },
        {
            "associated_pull_request": [
                "https://github.com/open62541/open62541/pull/4259"
            ],
            "date": "2021-03-18 20:19:53",
            "diff": "open62541_open62541/issue_4258/commit_1bc9ca725212d3118abe543504e6aa03eb18084f.diff",
            "diff_additions": 18,
            "diff_deletions": 10,
            "diff_file_size": 29289,
            "diff_url": "https://github.com/open62541/open62541/commit/1bc9ca725212d3118abe543504e6aa03eb18084f.diff",
            "exists": true,
            "files": [
                {
                    "file_additions": 18,
                    "file_deletions": 10,
                    "file_exists": true,
                    "file_name": "src/server/ua_services_monitoreditem.c",
                    "file_size": 29289
                }
            ],
            "interesting": {
                "reopen": false,
                "status": false
            },
            "is_parent": false,
            "sha": "1bc9ca725212d3118abe543504e6aa03eb18084f"
        }
    ],
    "first_commit": "2021-03-13 22:26:05",
    "last_commit": "2021-03-18 21:42:51",
    "number": 4258,
    "pull_request": "None",
    "score": {
        "accidental_reopen_likely": false,
        "all_labels": [],
        "contains_keywords": [
            "work",
            "report",
            "fix",
            "patch",
            "bug",
            "test",
            "remov",
            "issu",
            "debug",
            "chang",
            "fail",
            "problem"
        ],
        "fix_size": 21,
        "has_labels": [],
        "intersecting": {
            "computed_score": 1.0,
            "final_commit_size": 21,
            "intersection_size": 21,
            "previous_commits_size": 21
        },
        "is_makefile_based": true,
        "no_new_files": [],
        "no_other_files": true,
        "num_prohibited_files": 40612,
        "prohibited_files": [
            "kill.h",
            "meminfo.h",
            "kill.h",
            "meminfo.h",
            "kill.h",
            "meminfo.h",
            "testsuite_cli_test.go",
            "testsuite_cli_test.go",
            "common.mk",
            "i3bar/include/draw_util.h"
        ],
        "reopen": false,
        "reopen_events": [
            [
                "2021-03-18 20:21:28",
                "commit"
            ],
            [
                "2021-03-18 20:24:08",
                "commit"
            ],
            [
                "2021-03-18 21:42:53",
                "commit"
            ],
            [
                "2021-03-19 08:40:48",
                "closed"
            ]
        ],
        "status": true,
        "strategy": true,
        "total_changes": 111
    }
}