{
    "commits": [
        {
            "associated_pull_request": [],
            "date": "2019-01-16 11:41:42+00:00",
            "diff": "openwall_john/issue_3594/commit_c84fc16d71ca184d51f7d0b947cecce99704203d.diff",
            "diff_additions": 34,
            "diff_deletions": 0,
            "diff_file_size": 16063,
            "diff_url": "https://github.com/openwall/john/commit/c84fc16d71ca184d51f7d0b947cecce99704203d.diff",
            "exists": true,
            "files": [
                {
                    "file_additions": 16,
                    "file_deletions": 0,
                    "file_exists": true,
                    "file_name": "src/opencl_wpapmk_fmt_plug.c",
                    "file_size": 12252
                },
                {
                    "file_additions": 18,
                    "file_deletions": 0,
                    "file_exists": true,
                    "file_name": "src/wpapmk_fmt_plug.c",
                    "file_size": 3811
                }
            ],
            "interesting": {
                "reopen": false,
                "status": false
            },
            "is_parent": true,
            "sha": "c84fc16d71ca184d51f7d0b947cecce99704203d"
        },
        {
            "associated_pull_request": [],
            "date": "2019-01-16 12:11:21+00:00",
            "diff": "openwall_john/issue_3594/commit_cdd6dd03910d03ae0bf7e145dc12168e946ee18e.diff",
            "diff_additions": 27,
            "diff_deletions": 3,
            "diff_file_size": 80588,
            "diff_url": "https://github.com/openwall/john/commit/cdd6dd03910d03ae0bf7e145dc12168e946ee18e.diff",
            "exists": true,
            "files": [
                {
                    "file_additions": 15,
                    "file_deletions": 0,
                    "file_exists": true,
                    "file_name": "src/jumbo.c",
                    "file_size": 10425
                },
                {
                    "file_additions": 4,
                    "file_deletions": 1,
                    "file_exists": true,
                    "file_name": "src/options.c",
                    "file_size": 43796
                },
                {
                    "file_additions": 8,
                    "file_deletions": 2,
                    "file_exists": true,
                    "file_name": "src/single.c",
                    "file_size": 26367
                }
            ],
            "interesting": {
                "reopen": false,
                "status": false
            },
            "is_parent": false,
            "sha": "cdd6dd03910d03ae0bf7e145dc12168e946ee18e"
        },
        {
            "associated_pull_request": [],
            "date": "2019-01-16 12:30:02+00:00",
            "diff": "openwall_john/issue_3594/commit_68a257b8b4dceed937b74ebeb2ab8a7f374b8249.diff",
            "diff_additions": 3,
            "diff_deletions": 1,
            "diff_file_size": 26367,
            "diff_url": "https://github.com/openwall/john/commit/68a257b8b4dceed937b74ebeb2ab8a7f374b8249.diff",
            "exists": true,
            "files": [
                {
                    "file_additions": 3,
                    "file_deletions": 1,
                    "file_exists": true,
                    "file_name": "src/single.c",
                    "file_size": 26367
                }
            ],
            "interesting": {
                "reopen": false,
                "status": false
            },
            "is_parent": false,
            "sha": "68a257b8b4dceed937b74ebeb2ab8a7f374b8249"
        },
        {
            "associated_pull_request": [],
            "date": "2019-01-16 12:35:02+00:00",
            "diff": "openwall_john/issue_3594/commit_e7e3cf6e12c694575d520f3e5ab1688cc1436d1e.diff",
            "diff_additions": 16,
            "diff_deletions": 0,
            "diff_file_size": 26367,
            "diff_url": "https://github.com/openwall/john/commit/e7e3cf6e12c694575d520f3e5ab1688cc1436d1e.diff",
            "exists": true,
            "files": [
                {
                    "file_additions": 16,
                    "file_deletions": 0,
                    "file_exists": true,
                    "file_name": "src/single.c",
                    "file_size": 26367
                }
            ],
            "interesting": {
                "reopen": false,
                "status": false
            },
            "is_parent": false,
            "sha": "e7e3cf6e12c694575d520f3e5ab1688cc1436d1e"
        },
        {
            "associated_pull_request": [
                "https://github.com/openwall/john/pull/3597"
            ],
            "date": "2019-01-16 12:30:02+00:00",
            "diff": "openwall_john/issue_3594/commit_f04735f8777945380730fdba39a1552d15a23d74.diff",
            "diff_additions": 3,
            "diff_deletions": 1,
            "diff_file_size": 26367,
            "diff_url": "https://github.com/openwall/john/commit/f04735f8777945380730fdba39a1552d15a23d74.diff",
            "exists": true,
            "files": [
                {
                    "file_additions": 3,
                    "file_deletions": 1,
                    "file_exists": true,
                    "file_name": "src/single.c",
                    "file_size": 26367
                }
            ],
            "interesting": {
                "reopen": false,
                "status": false
            },
            "is_parent": false,
            "sha": "f04735f8777945380730fdba39a1552d15a23d74"
        },
        {
            "associated_pull_request": [
                "https://github.com/openwall/john/pull/3597"
            ],
            "date": "2019-01-16 12:35:02+00:00",
            "diff": "openwall_john/issue_3594/commit_5c764673e900d1591ccf2e1244875d9547e11e92.diff",
            "diff_additions": 16,
            "diff_deletions": 0,
            "diff_file_size": 26367,
            "diff_url": "https://github.com/openwall/john/commit/5c764673e900d1591ccf2e1244875d9547e11e92.diff",
            "exists": true,
            "files": [
                {
                    "file_additions": 16,
                    "file_deletions": 0,
                    "file_exists": true,
                    "file_name": "src/single.c",
                    "file_size": 26367
                }
            ],
            "interesting": {
                "reopen": false,
                "status": false
            },
            "is_parent": false,
            "sha": "5c764673e900d1591ccf2e1244875d9547e11e92"
        },
        {
            "associated_pull_request": [
                "https://github.com/openwall/john/pull/3597"
            ],
            "date": "2019-01-16 12:30:02+00:00",
            "diff": "openwall_john/issue_3594/commit_7b5b78c690c346f0a2e4fe9c7c8ae1e05f5868ea.diff",
            "diff_additions": 3,
            "diff_deletions": 1,
            "diff_file_size": 26367,
            "diff_url": "https://github.com/openwall/john/commit/7b5b78c690c346f0a2e4fe9c7c8ae1e05f5868ea.diff",
            "exists": true,
            "files": [
                {
                    "file_additions": 3,
                    "file_deletions": 1,
                    "file_exists": true,
                    "file_name": "src/single.c",
                    "file_size": 26367
                }
            ],
            "interesting": {
                "reopen": false,
                "status": false
            },
            "is_parent": false,
            "sha": "7b5b78c690c346f0a2e4fe9c7c8ae1e05f5868ea"
        },
        {
            "associated_pull_request": [
                "https://github.com/openwall/john/pull/3597"
            ],
            "date": "2019-01-16 12:35:02+00:00",
            "diff": "openwall_john/issue_3594/commit_87d1c43a5b6cc8ca047602afdf44c8ee7b120665.diff",
            "diff_additions": 16,
            "diff_deletions": 0,
            "diff_file_size": 26367,
            "diff_url": "https://github.com/openwall/john/commit/87d1c43a5b6cc8ca047602afdf44c8ee7b120665.diff",
            "exists": true,
            "files": [
                {
                    "file_additions": 16,
                    "file_deletions": 0,
                    "file_exists": true,
                    "file_name": "src/single.c",
                    "file_size": 26367
                }
            ],
            "interesting": {
                "reopen": true,
                "status": false
            },
            "is_parent": false,
            "sha": "87d1c43a5b6cc8ca047602afdf44c8ee7b120665"
        },
        {
            "associated_pull_request": [
                "https://github.com/openwall/john/pull/3604"
            ],
            "date": "2019-01-18 09:59:13+00:00",
            "diff": "openwall_john/issue_3594/commit_42733359c3e66a3ff381bc1ec459e30c8f4f088b.diff",
            "diff_additions": 8,
            "diff_deletions": 0,
            "diff_file_size": 85930,
            "diff_url": "https://github.com/openwall/john/commit/42733359c3e66a3ff381bc1ec459e30c8f4f088b.diff",
            "exists": true,
            "files": [
                {
                    "file_additions": 5,
                    "file_deletions": 0,
                    "file_exists": true,
                    "file_name": "src/john.c",
                    "file_size": 59563
                },
                {
                    "file_additions": 3,
                    "file_deletions": 0,
                    "file_exists": true,
                    "file_name": "src/single.c",
                    "file_size": 26367
                }
            ],
            "interesting": {
                "reopen": false,
                "status": false
            },
            "is_parent": false,
            "sha": "42733359c3e66a3ff381bc1ec459e30c8f4f088b"
        },
        {
            "associated_pull_request": [
                "https://github.com/openwall/john/pull/3604"
            ],
            "date": "2019-01-19 00:58:27+00:00",
            "diff": "openwall_john/issue_3594/commit_591fa2dc0707ee46ddb56ef7a75bb9314ad05c0e.diff",
            "diff_additions": 8,
            "diff_deletions": 0,
            "diff_file_size": 85930,
            "diff_url": "https://github.com/openwall/john/commit/591fa2dc0707ee46ddb56ef7a75bb9314ad05c0e.diff",
            "exists": true,
            "files": [
                {
                    "file_additions": 5,
                    "file_deletions": 0,
                    "file_exists": true,
                    "file_name": "src/john.c",
                    "file_size": 59563
                },
                {
                    "file_additions": 3,
                    "file_deletions": 0,
                    "file_exists": true,
                    "file_name": "src/single.c",
                    "file_size": 26367
                }
            ],
            "interesting": {
                "reopen": false,
                "status": false
            },
            "is_parent": false,
            "sha": "591fa2dc0707ee46ddb56ef7a75bb9314ad05c0e"
        }
    ],
    "first_commit": "2019-01-16 17:52:45+00:00",
    "last_commit": "2019-01-19 00:58:27+00:00",
    "number": 3594,
    "pull_request": "None",
    "score": {
        "accidental_reopen_likely": false,
        "all_labels": [
            "enhancement",
            "bug"
        ],
        "contains_keywords": [
            "chang",
            "fix",
            "issu",
            "test",
            "fault",
            "leak",
            "warn"
        ],
        "fix_size": 59,
        "has_labels": [
            "bug"
        ],
        "intersecting": {
            "computed_score": 1.0,
            "final_commit_size": 10,
            "intersection_size": 10,
            "previous_commits_size": 59
        },
        "is_makefile_based": false,
        "no_new_files": [],
        "no_other_files": false,
        "num_prohibited_files": 162321,
        "prohibited_files": [
            "server/src/main/java/com/genymobile/scrcpy/Device.java",
            "server/src/main/java/com/genymobile/scrcpy/wrappers/SurfaceControl.java",
            "server/src/main/java/com/genymobile/scrcpy/Device.java",
            "server/src/main/java/com/genymobile/scrcpy/wrappers/SurfaceControl.java",
            "app/meson.build",
            "app/scrcpy.1",
            "app/src/common.h",
            "app/src/scrcpy.h",
            "app/src/server.h",
            "server/src/main/java/com/genymobile/scrcpy/Workarounds.java"
        ],
        "reopen": true,
        "reopen_events": [
            [
                "2019-01-16 17:58:02+00:00",
                "commit"
            ],
            [
                "2019-01-16 17:58:02+00:00",
                "commit"
            ],
            [
                "2019-01-16 17:58:02+00:00",
                "commit"
            ],
            [
                "2019-01-17 11:35:32+00:00",
                "commit"
            ],
            [
                "2019-01-17 11:35:32+00:00",
                "commit"
            ],
            [
                "2019-01-17 11:35:32+00:00",
                "commit"
            ],
            [
                "2019-01-18 06:52:41+00:00",
                "commit"
            ],
            [
                "2019-01-18 06:52:41+00:00",
                "commit"
            ],
            [
                "2019-01-18 06:52:41+00:00",
                "closed"
            ],
            [
                "2019-01-18 06:52:41+00:00",
                "commit"
            ],
            [
                "2019-01-18 07:14:27+00:00",
                "reopened"
            ],
            [
                "2019-01-18 18:03:10+00:00",
                "commit"
            ],
            [
                "2019-01-19 00:58:28+00:00",
                "closed"
            ],
            [
                "2019-01-19 00:58:30+00:00",
                "commit"
            ]
        ],
        "status": false,
        "strategy": true,
        "total_changes": 140
    }
}