{
    "covered_issues": [
        516,
        515,
        514,
        510,
        481,
        478,
        477,
        476,
        474,
        467,
        451,
        449,
        447,
        437,
        420,
        419,
        418,
        410,
        409,
        403,
        400,
        399,
        398,
        396,
        395,
        393,
        392,
        384,
        371,
        360,
        356,
        355,
        352,
        348,
        346,
        344,
        342,
        340,
        339,
        338,
        330,
        327,
        325,
        316,
        315,
        314,
        312,
        310,
        303,
        301,
        299,
        297,
        296,
        294,
        292,
        291,
        288,
        287,
        286,
        285,
        284,
        282,
        280,
        279,
        278,
        276,
        274,
        271,
        270,
        269,
        266,
        265,
        264,
        261,
        259,
        258,
        257,
        256,
        255,
        253,
        252,
        251,
        250,
        248,
        246,
        243,
        242,
        241,
        240,
        238,
        237,
        235,
        234,
        233,
        231,
        230,
        229,
        228,
        227,
        226,
        225,
        224,
        223,
        222,
        221,
        220,
        219,
        218,
        217,
        214,
        212,
        211,
        210,
        209,
        208,
        207,
        204,
        203,
        202,
        201,
        199,
        198,
        197,
        195,
        194,
        192,
        191,
        190,
        187,
        186,
        185,
        184,
        182,
        181,
        180,
        179,
        178,
        177,
        176,
        175,
        172,
        171,
        170,
        169,
        168,
        166,
        165,
        164,
        162,
        161,
        160,
        159,
        158,
        157,
        156,
        154,
        153,
        152,
        151,
        149,
        148,
        147,
        146,
        145,
        144,
        143,
        142,
        139,
        136,
        135,
        130,
        127,
        126,
        125,
        124,
        123,
        122,
        120,
        119,
        118,
        117,
        116,
        115,
        113,
        111,
        110,
        109,
        108,
        107,
        106,
        105,
        104,
        103,
        102,
        101,
        100,
        99,
        98,
        96,
        94,
        92,
        90,
        88,
        87,
        86,
        85,
        83,
        82,
        81,
        79,
        78,
        77,
        76,
        75,
        74,
        71,
        68,
        67,
        66,
        64,
        63,
        62,
        61,
        60,
        59,
        58,
        57,
        55,
        54,
        53,
        50,
        48,
        46,
        45,
        44,
        43,
        42,
        38,
        35,
        34,
        31,
        29,
        28,
        27,
        26,
        24,
        23,
        22,
        21,
        20,
        18,
        17,
        16,
        15,
        14,
        13,
        11,
        8,
        6,
        5,
        4,
        3,
        2,
        1
    ],
    "finished": true
}