{
    "covered_issues": [
        32,
        26,
        25,
        23,
        22,
        18,
        16,
        15,
        14,
        13,
        12,
        11,
        10,
        9,
        8,
        7,
        6,
        5,
        2,
        1
    ],
    "finished": true
}