{
    "covered_issues": [
        853,
        850,
        846,
        840,
        838,
        836,
        835,
        830,
        828,
        827,
        825,
        818,
        814,
        812,
        809,
        801,
        799,
        790,
        789,
        784,
        777,
        776,
        774,
        773,
        772,
        771,
        767,
        765,
        764,
        758,
        757,
        751,
        749,
        748,
        746,
        741,
        738,
        735,
        731,
        728,
        723,
        721,
        716,
        714,
        712,
        709,
        707,
        703,
        701,
        700,
        698,
        697,
        694,
        693,
        691,
        684,
        683,
        682,
        679,
        677,
        674,
        669,
        667,
        666,
        663,
        660,
        659,
        658,
        657,
        656,
        647,
        640,
        639,
        636,
        635,
        632,
        629,
        627,
        626,
        625,
        623,
        616,
        615,
        612,
        611,
        610,
        609,
        608,
        607,
        603,
        602,
        599,
        598,
        597,
        595,
        593,
        592,
        590,
        588,
        586,
        585,
        583,
        582,
        573,
        569,
        563,
        562,
        558,
        557,
        555,
        554,
        550,
        545,
        544,
        541,
        535,
        529,
        527,
        517,
        515,
        514,
        513,
        509,
        508,
        503,
        502,
        501,
        498,
        496,
        493,
        492,
        491,
        490,
        487,
        486,
        485,
        484,
        483,
        482,
        481,
        480,
        478,
        477,
        475,
        474,
        472,
        470,
        467,
        466,
        465,
        463,
        462,
        456,
        455,
        454,
        451,
        450,
        448,
        444,
        443,
        440,
        438,
        437,
        435,
        432,
        430,
        427,
        425,
        424,
        422,
        420,
        419,
        418,
        417,
        415,
        413,
        411,
        409,
        408,
        407,
        406,
        405,
        403,
        402,
        401,
        396,
        394,
        392,
        390,
        389,
        387,
        385,
        384,
        383,
        381,
        380,
        379,
        378,
        377,
        376,
        375,
        374,
        371,
        370,
        369,
        368,
        367,
        366,
        364,
        363,
        362,
        361,
        360,
        359,
        358,
        357,
        356,
        353,
        352,
        351,
        350,
        348,
        346,
        345,
        344,
        340,
        339,
        338,
        337,
        334,
        333,
        332,
        327,
        326,
        325,
        322,
        321,
        319,
        317,
        316,
        315,
        309,
        307,
        305,
        304,
        303,
        302,
        300,
        299,
        298,
        297,
        296,
        295,
        294,
        292,
        291,
        287,
        286,
        284,
        282,
        280,
        277,
        276,
        275,
        274,
        273,
        272,
        271,
        270,
        267,
        264,
        261,
        260,
        259,
        257,
        256,
        255,
        253,
        252,
        251,
        250,
        249,
        248,
        247,
        246,
        245,
        243,
        242,
        241,
        240,
        239,
        238,
        236,
        233,
        232,
        231,
        229,
        228,
        227,
        226,
        225,
        224,
        223,
        222,
        221,
        219,
        218,
        217,
        216,
        214,
        213,
        210,
        209,
        208,
        207,
        206,
        205,
        204,
        203,
        202,
        200,
        199,
        198,
        197,
        196,
        195,
        193,
        189,
        188,
        187,
        186,
        185,
        184,
        183,
        181,
        179,
        178,
        177,
        175,
        174,
        173,
        171,
        170,
        168,
        167,
        166,
        165,
        164,
        162,
        161,
        160,
        159,
        157,
        156,
        154,
        153,
        152,
        151,
        150,
        149,
        148,
        147,
        146,
        145,
        144,
        143,
        142,
        141,
        140,
        139,
        138,
        137,
        136,
        134,
        132,
        131,
        130,
        129,
        128,
        127,
        126,
        124,
        123,
        122,
        121,
        120,
        119,
        118,
        117,
        116,
        115,
        114,
        111,
        110,
        109,
        108,
        107,
        106,
        105,
        104,
        103,
        102,
        101,
        100,
        99,
        98,
        97,
        96,
        94,
        93,
        92,
        91,
        90,
        89,
        88,
        87,
        86,
        85,
        83,
        82,
        81,
        80,
        77,
        75,
        73,
        71,
        70,
        69,
        66,
        65,
        64,
        63,
        62,
        61,
        60,
        59,
        57,
        56,
        55,
        54,
        53,
        52,
        51,
        50,
        49,
        48,
        47,
        46,
        45,
        44,
        42,
        41,
        40,
        39,
        38,
        37,
        36,
        35,
        34,
        33,
        32,
        31,
        30,
        29,
        28,
        27,
        26,
        25,
        24,
        23,
        22,
        21,
        20,
        19,
        18,
        17,
        16,
        15,
        14,
        12,
        11,
        10,
        9,
        8,
        7,
        6,
        4,
        3,
        2
    ],
    "finished": true
}