{
    "category": [
        "hardware/OS",
        "network/protocols"
    ],
    "commits": [
        {
            "associated_pull_request": [],
            "date": "2019-11-21 10:37:44",
            "diff": "curl_curl/issue_4624/commit_f70da9c17e315f382694d8ca5585191f4e5478d7.diff",
            "diff_additions": 1,
            "diff_deletions": 0,
            "diff_file_size": 26315,
            "diff_url": "https://github.com/curl/curl/commit/f70da9c17e315f382694d8ca5585191f4e5478d7.diff",
            "exists": true,
            "files": [
                {
                    "file_additions": 1,
                    "file_deletions": 0,
                    "file_exists": true,
                    "file_name": "lib/strerror.c",
                    "file_size": 26315
                }
            ],
            "interesting": {
                "reopen": false,
                "status": true
            },
            "is_parent": true,
            "sha": "f70da9c17e315f382694d8ca5585191f4e5478d7"
        },
        {
            "associated_pull_request": [],
            "date": "2019-11-20 23:44:18",
            "diff": "curl_curl/issue_4624/commit_d741f50e10ed996962ca4d345a0fa8ed2792254d.diff",
            "diff_additions": 59,
            "diff_deletions": 13,
            "diff_file_size": 138498,
            "diff_url": "https://github.com/curl/curl/commit/d741f50e10ed996962ca4d345a0fa8ed2792254d.diff",
            "exists": true,
            "files": [
                {
                    "file_additions": 59,
                    "file_deletions": 13,
                    "file_exists": true,
                    "file_name": "lib/vtls/openssl.c",
                    "file_size": 138498
                }
            ],
            "interesting": {
                "reopen": false,
                "status": true
            },
            "is_parent": false,
            "sha": "d741f50e10ed996962ca4d345a0fa8ed2792254d"
        },
        {
            "associated_pull_request": [],
            "date": "2019-11-20 23:44:18",
            "diff": "curl_curl/issue_4624/commit_78cef068479d85f7af29b5ddf21ced5288a50f37.diff",
            "diff_additions": 59,
            "diff_deletions": 13,
            "diff_file_size": 138498,
            "diff_url": "https://github.com/curl/curl/commit/78cef068479d85f7af29b5ddf21ced5288a50f37.diff",
            "exists": true,
            "files": [
                {
                    "file_additions": 59,
                    "file_deletions": 13,
                    "file_exists": true,
                    "file_name": "lib/vtls/openssl.c",
                    "file_size": 138498
                }
            ],
            "interesting": {
                "reopen": true,
                "status": true
            },
            "is_parent": false,
            "sha": "78cef068479d85f7af29b5ddf21ced5288a50f37"
        }
    ],
    "first_commit": "2019-11-21 22:16:29",
    "last_commit": "2019-11-23 03:29:39",
    "number": 4624,
    "pull_request": "None",
    "score": {
        "accidental_reopen_likely": false,
        "all_labels": [
            "SSL/TLS"
        ],
        "contains_keywords": [
            "work",
            "report",
            "fix",
            "bug",
            "issu",
            "error",
            "debug",
            "chang",
            "problem"
        ],
        "fix_size": 97,
        "has_labels": [],
        "intersecting": {
            "computed_score": 0.6712328767123288,
            "final_commit_size": 73,
            "intersection_size": 49,
            "previous_commits_size": 73
        },
        "is_makefile_based": true,
        "no_new_files": [],
        "no_other_files": false,
        "num_prohibited_files": 22023,
        "prohibited_files": [
            "kill.h",
            "meminfo.h",
            "kill.h",
            "meminfo.h",
            "kill.h",
            "meminfo.h",
            "testsuite_cli_test.go",
            "testsuite_cli_test.go",
            "common.mk",
            "i3bar/include/draw_util.h"
        ],
        "reopen": true,
        "reopen_events": [
            [
                "2019-11-22 06:22:13",
                "commit"
            ],
            [
                "2019-11-23 03:56:04",
                "closed"
            ],
            [
                "2019-11-23 03:56:04",
                "commit"
            ],
            [
                "2019-11-23 04:00:03",
                "reopened"
            ],
            [
                "2019-11-28 18:28:10",
                "commit"
            ],
            [
                "2020-01-08 10:08:45",
                "closed"
            ]
        ],
        "status": false,
        "strategy": true,
        "total_changes": 145
    }
}