{
    "covered_issues": [
        87,
        78,
        76,
        73,
        71,
        63,
        62,
        47,
        46,
        38,
        37,
        36,
        35,
        34,
        30,
        29,
        26,
        25,
        24,
        22,
        17,
        14,
        13,
        12,
        11,
        10,
        9,
        8,
        7,
        6,
        5,
        4,
        3,
        2,
        1
    ],
    "finished": true
}