{
    "commits": [
        {
            "diff": "spring-projects_spring-boot/issue_2645/commit_a0c082229382528ba7c9cff7d6d52a24209108fe.diff",
            "diff_additions": 2,
            "diff_deletions": 1,
            "diff_file_size": 0,
            "files": [
                {
                    "file_additions": 2,
                    "file_deletions": 1,
                    "file_exists": false,
                    "file_name": "spring-boot-actuator/src/main/java/org/springframework/boot/actuate/autoconfigure/MetricExportAutoConfiguration.java",
                    "file_size": 0
                }
            ],
            "interesting": {
                "reopened": false,
                "status": false
            },
            "sha": "a0c082229382528ba7c9cff7d6d52a24209108fe"
        },
        {
            "diff": "spring-projects_spring-boot/issue_2645/commit_2bebc61d90ebe2de057937bb7f6d5431d9d4f0e9.diff",
            "diff_additions": 317,
            "diff_deletions": 0,
            "diff_file_size": 0,
            "files": [
                {
                    "file_additions": 101,
                    "file_deletions": 0,
                    "file_exists": false,
                    "file_name": "spring-boot-autoconfigure/src/main/java/org/springframework/boot/autoconfigure/ldap/LdapAutoConfiguration.java",
                    "file_size": 0
                },
                {
                    "file_additions": 100,
                    "file_deletions": 0,
                    "file_exists": false,
                    "file_name": "spring-boot-autoconfigure/src/main/java/org/springframework/boot/autoconfigure/ldap/LdapProperties.java",
                    "file_size": 0
                },
                {
                    "file_additions": 20,
                    "file_deletions": 0,
                    "file_exists": false,
                    "file_name": "spring-boot-autoconfigure/src/main/java/org/springframework/boot/autoconfigure/ldap/package-info.java",
                    "file_size": 0
                },
                {
                    "file_additions": 96,
                    "file_deletions": 0,
                    "file_exists": false,
                    "file_name": "spring-boot-autoconfigure/src/test/java/org/springframework/boot/autoconfigure/ldap/LdapAutoConfigurationTests.java",
                    "file_size": 0
                }
            ],
            "interesting": {
                "reopened": false,
                "status": false
            },
            "sha": "2bebc61d90ebe2de057937bb7f6d5431d9d4f0e9"
        },
        {
            "diff": "spring-projects_spring-boot/issue_2645/commit_d7ace99fa8097c14b315633ed220e7b42a5ccdc3.diff",
            "diff_additions": 1196,
            "diff_deletions": 0,
            "diff_file_size": 0,
            "files": [
                {
                    "file_additions": 50,
                    "file_deletions": 0,
                    "file_exists": false,
                    "file_name": "spring-boot-autoconfigure/src/main/java/org/springframework/boot/autoconfigure/data/ldap/LdapDataAutoConfiguration.java",
                    "file_size": 0
                },
                {
                    "file_additions": 44,
                    "file_deletions": 0,
                    "file_exists": false,
                    "file_name": "spring-boot-autoconfigure/src/main/java/org/springframework/boot/autoconfigure/data/ldap/LdapRepositoriesAutoConfiguration.java",
                    "file_size": 0
                },
                {
                    "file_additions": 56,
                    "file_deletions": 0,
                    "file_exists": false,
                    "file_name": "spring-boot-autoconfigure/src/main/java/org/springframework/boot/autoconfigure/data/ldap/LdapRepositoriesRegistrar.java",
                    "file_size": 0
                },
                {
                    "file_additions": 20,
                    "file_deletions": 0,
                    "file_exists": false,
                    "file_name": "spring-boot-autoconfigure/src/main/java/org/springframework/boot/autoconfigure/data/ldap/package-info.java",
                    "file_size": 0
                },
                {
                    "file_additions": 65,
                    "file_deletions": 0,
                    "file_exists": false,
                    "file_name": "spring-boot-autoconfigure/src/main/java/org/springframework/boot/autoconfigure/ldap/LdapAutoConfiguration.java",
                    "file_size": 0
                },
                {
                    "file_additions": 127,
                    "file_deletions": 0,
                    "file_exists": false,
                    "file_name": "spring-boot-autoconfigure/src/main/java/org/springframework/boot/autoconfigure/ldap/LdapProperties.java",
                    "file_size": 0
                },
                {
                    "file_additions": 192,
                    "file_deletions": 0,
                    "file_exists": false,
                    "file_name": "spring-boot-autoconfigure/src/main/java/org/springframework/boot/autoconfigure/ldap/embedded/EmbeddedLdapAutoConfiguration.java",
                    "file_size": 0
                },
                {
                    "file_additions": 112,
                    "file_deletions": 0,
                    "file_exists": false,
                    "file_name": "spring-boot-autoconfigure/src/main/java/org/springframework/boot/autoconfigure/ldap/embedded/EmbeddedLdapProperties.java",
                    "file_size": 0
                },
                {
                    "file_additions": 20,
                    "file_deletions": 0,
                    "file_exists": false,
                    "file_name": "spring-boot-autoconfigure/src/main/java/org/springframework/boot/autoconfigure/ldap/package-info.java",
                    "file_size": 0
                },
                {
                    "file_additions": 25,
                    "file_deletions": 0,
                    "file_exists": false,
                    "file_name": "spring-boot-autoconfigure/src/test/java/org/springframework/boot/autoconfigure/data/alt/ldap/PersonLdapRepository.java",
                    "file_size": 0
                },
                {
                    "file_additions": 56,
                    "file_deletions": 0,
                    "file_exists": false,
                    "file_name": "spring-boot-autoconfigure/src/test/java/org/springframework/boot/autoconfigure/data/ldap/LdapDataAutoConfigurationTests.java",
                    "file_size": 0
                },
                {
                    "file_additions": 104,
                    "file_deletions": 0,
                    "file_exists": false,
                    "file_name": "spring-boot-autoconfigure/src/test/java/org/springframework/boot/autoconfigure/data/ldap/LdapRepositoriesAutoConfigurationTests.java",
                    "file_size": 0
                },
                {
                    "file_additions": 36,
                    "file_deletions": 0,
                    "file_exists": false,
                    "file_name": "spring-boot-autoconfigure/src/test/java/org/springframework/boot/autoconfigure/data/ldap/person/Person.java",
                    "file_size": 0
                },
                {
                    "file_additions": 25,
                    "file_deletions": 0,
                    "file_exists": false,
                    "file_name": "spring-boot-autoconfigure/src/test/java/org/springframework/boot/autoconfigure/data/ldap/person/PersonRepository.java",
                    "file_size": 0
                },
                {
                    "file_additions": 104,
                    "file_deletions": 0,
                    "file_exists": false,
                    "file_name": "spring-boot-autoconfigure/src/test/java/org/springframework/boot/autoconfigure/ldap/LdapAutoConfigurationTests.java",
                    "file_size": 0
                },
                {
                    "file_additions": 160,
                    "file_deletions": 0,
                    "file_exists": false,
                    "file_name": "spring-boot-autoconfigure/src/test/java/org/springframework/boot/autoconfigure/ldap/embedded/EmbeddedLdapAutoConfigurationTests.java",
                    "file_size": 0
                }
            ],
            "interesting": {
                "reopened": false,
                "status": true
            },
            "sha": "d7ace99fa8097c14b315633ed220e7b42a5ccdc3"
        },
        {
            "diff": "spring-projects_spring-boot/issue_2645/commit_939f47a973e6d73d4c52533fc3142295a389cf99.diff",
            "diff_additions": 1197,
            "diff_deletions": 0,
            "diff_file_size": 0,
            "files": [
                {
                    "file_additions": 50,
                    "file_deletions": 0,
                    "file_exists": false,
                    "file_name": "spring-boot-autoconfigure/src/main/java/org/springframework/boot/autoconfigure/data/ldap/LdapDataAutoConfiguration.java",
                    "file_size": 0
                },
                {
                    "file_additions": 44,
                    "file_deletions": 0,
                    "file_exists": false,
                    "file_name": "spring-boot-autoconfigure/src/main/java/org/springframework/boot/autoconfigure/data/ldap/LdapRepositoriesAutoConfiguration.java",
                    "file_size": 0
                },
                {
                    "file_additions": 57,
                    "file_deletions": 0,
                    "file_exists": false,
                    "file_name": "spring-boot-autoconfigure/src/main/java/org/springframework/boot/autoconfigure/data/ldap/LdapRepositoriesRegistrar.java",
                    "file_size": 0
                },
                {
                    "file_additions": 20,
                    "file_deletions": 0,
                    "file_exists": false,
                    "file_name": "spring-boot-autoconfigure/src/main/java/org/springframework/boot/autoconfigure/data/ldap/package-info.java",
                    "file_size": 0
                },
                {
                    "file_additions": 65,
                    "file_deletions": 0,
                    "file_exists": false,
                    "file_name": "spring-boot-autoconfigure/src/main/java/org/springframework/boot/autoconfigure/ldap/LdapAutoConfiguration.java",
                    "file_size": 0
                },
                {
                    "file_additions": 127,
                    "file_deletions": 0,
                    "file_exists": false,
                    "file_name": "spring-boot-autoconfigure/src/main/java/org/springframework/boot/autoconfigure/ldap/LdapProperties.java",
                    "file_size": 0
                },
                {
                    "file_additions": 192,
                    "file_deletions": 0,
                    "file_exists": false,
                    "file_name": "spring-boot-autoconfigure/src/main/java/org/springframework/boot/autoconfigure/ldap/embedded/EmbeddedLdapAutoConfiguration.java",
                    "file_size": 0
                },
                {
                    "file_additions": 112,
                    "file_deletions": 0,
                    "file_exists": false,
                    "file_name": "spring-boot-autoconfigure/src/main/java/org/springframework/boot/autoconfigure/ldap/embedded/EmbeddedLdapProperties.java",
                    "file_size": 0
                },
                {
                    "file_additions": 20,
                    "file_deletions": 0,
                    "file_exists": false,
                    "file_name": "spring-boot-autoconfigure/src/main/java/org/springframework/boot/autoconfigure/ldap/package-info.java",
                    "file_size": 0
                },
                {
                    "file_additions": 25,
                    "file_deletions": 0,
                    "file_exists": false,
                    "file_name": "spring-boot-autoconfigure/src/test/java/org/springframework/boot/autoconfigure/data/alt/ldap/PersonLdapRepository.java",
                    "file_size": 0
                },
                {
                    "file_additions": 56,
                    "file_deletions": 0,
                    "file_exists": false,
                    "file_name": "spring-boot-autoconfigure/src/test/java/org/springframework/boot/autoconfigure/data/ldap/LdapDataAutoConfigurationTests.java",
                    "file_size": 0
                },
                {
                    "file_additions": 104,
                    "file_deletions": 0,
                    "file_exists": false,
                    "file_name": "spring-boot-autoconfigure/src/test/java/org/springframework/boot/autoconfigure/data/ldap/LdapRepositoriesAutoConfigurationTests.java",
                    "file_size": 0
                },
                {
                    "file_additions": 36,
                    "file_deletions": 0,
                    "file_exists": false,
                    "file_name": "spring-boot-autoconfigure/src/test/java/org/springframework/boot/autoconfigure/data/ldap/person/Person.java",
                    "file_size": 0
                },
                {
                    "file_additions": 25,
                    "file_deletions": 0,
                    "file_exists": false,
                    "file_name": "spring-boot-autoconfigure/src/test/java/org/springframework/boot/autoconfigure/data/ldap/person/PersonRepository.java",
                    "file_size": 0
                },
                {
                    "file_additions": 104,
                    "file_deletions": 0,
                    "file_exists": false,
                    "file_name": "spring-boot-autoconfigure/src/test/java/org/springframework/boot/autoconfigure/ldap/LdapAutoConfigurationTests.java",
                    "file_size": 0
                },
                {
                    "file_additions": 160,
                    "file_deletions": 0,
                    "file_exists": false,
                    "file_name": "spring-boot-autoconfigure/src/test/java/org/springframework/boot/autoconfigure/ldap/embedded/EmbeddedLdapAutoConfigurationTests.java",
                    "file_size": 0
                }
            ],
            "interesting": {
                "reopened": false,
                "status": false
            },
            "sha": "939f47a973e6d73d4c52533fc3142295a389cf99"
        },
        {
            "diff": "spring-projects_spring-boot/issue_2645/commit_6a84c369fd4862b419a18dd8c0da0710901da8b7.diff",
            "diff_additions": 1197,
            "diff_deletions": 0,
            "diff_file_size": 0,
            "files": [
                {
                    "file_additions": 50,
                    "file_deletions": 0,
                    "file_exists": false,
                    "file_name": "spring-boot-autoconfigure/src/main/java/org/springframework/boot/autoconfigure/data/ldap/LdapDataAutoConfiguration.java",
                    "file_size": 0
                },
                {
                    "file_additions": 44,
                    "file_deletions": 0,
                    "file_exists": false,
                    "file_name": "spring-boot-autoconfigure/src/main/java/org/springframework/boot/autoconfigure/data/ldap/LdapRepositoriesAutoConfiguration.java",
                    "file_size": 0
                },
                {
                    "file_additions": 57,
                    "file_deletions": 0,
                    "file_exists": false,
                    "file_name": "spring-boot-autoconfigure/src/main/java/org/springframework/boot/autoconfigure/data/ldap/LdapRepositoriesRegistrar.java",
                    "file_size": 0
                },
                {
                    "file_additions": 20,
                    "file_deletions": 0,
                    "file_exists": false,
                    "file_name": "spring-boot-autoconfigure/src/main/java/org/springframework/boot/autoconfigure/data/ldap/package-info.java",
                    "file_size": 0
                },
                {
                    "file_additions": 65,
                    "file_deletions": 0,
                    "file_exists": false,
                    "file_name": "spring-boot-autoconfigure/src/main/java/org/springframework/boot/autoconfigure/ldap/LdapAutoConfiguration.java",
                    "file_size": 0
                },
                {
                    "file_additions": 127,
                    "file_deletions": 0,
                    "file_exists": false,
                    "file_name": "spring-boot-autoconfigure/src/main/java/org/springframework/boot/autoconfigure/ldap/LdapProperties.java",
                    "file_size": 0
                },
                {
                    "file_additions": 192,
                    "file_deletions": 0,
                    "file_exists": false,
                    "file_name": "spring-boot-autoconfigure/src/main/java/org/springframework/boot/autoconfigure/ldap/embedded/EmbeddedLdapAutoConfiguration.java",
                    "file_size": 0
                },
                {
                    "file_additions": 112,
                    "file_deletions": 0,
                    "file_exists": false,
                    "file_name": "spring-boot-autoconfigure/src/main/java/org/springframework/boot/autoconfigure/ldap/embedded/EmbeddedLdapProperties.java",
                    "file_size": 0
                },
                {
                    "file_additions": 20,
                    "file_deletions": 0,
                    "file_exists": false,
                    "file_name": "spring-boot-autoconfigure/src/main/java/org/springframework/boot/autoconfigure/ldap/package-info.java",
                    "file_size": 0
                },
                {
                    "file_additions": 25,
                    "file_deletions": 0,
                    "file_exists": false,
                    "file_name": "spring-boot-autoconfigure/src/test/java/org/springframework/boot/autoconfigure/data/alt/ldap/PersonLdapRepository.java",
                    "file_size": 0
                },
                {
                    "file_additions": 56,
                    "file_deletions": 0,
                    "file_exists": false,
                    "file_name": "spring-boot-autoconfigure/src/test/java/org/springframework/boot/autoconfigure/data/ldap/LdapDataAutoConfigurationTests.java",
                    "file_size": 0
                },
                {
                    "file_additions": 104,
                    "file_deletions": 0,
                    "file_exists": false,
                    "file_name": "spring-boot-autoconfigure/src/test/java/org/springframework/boot/autoconfigure/data/ldap/LdapRepositoriesAutoConfigurationTests.java",
                    "file_size": 0
                },
                {
                    "file_additions": 36,
                    "file_deletions": 0,
                    "file_exists": false,
                    "file_name": "spring-boot-autoconfigure/src/test/java/org/springframework/boot/autoconfigure/data/ldap/person/Person.java",
                    "file_size": 0
                },
                {
                    "file_additions": 25,
                    "file_deletions": 0,
                    "file_exists": false,
                    "file_name": "spring-boot-autoconfigure/src/test/java/org/springframework/boot/autoconfigure/data/ldap/person/PersonRepository.java",
                    "file_size": 0
                },
                {
                    "file_additions": 104,
                    "file_deletions": 0,
                    "file_exists": false,
                    "file_name": "spring-boot-autoconfigure/src/test/java/org/springframework/boot/autoconfigure/ldap/LdapAutoConfigurationTests.java",
                    "file_size": 0
                },
                {
                    "file_additions": 160,
                    "file_deletions": 0,
                    "file_exists": false,
                    "file_name": "spring-boot-autoconfigure/src/test/java/org/springframework/boot/autoconfigure/ldap/embedded/EmbeddedLdapAutoConfigurationTests.java",
                    "file_size": 0
                }
            ],
            "interesting": {
                "reopened": false,
                "status": false
            },
            "sha": "6a84c369fd4862b419a18dd8c0da0710901da8b7"
        },
        {
            "diff": "spring-projects_spring-boot/issue_2645/commit_e9acc7f15a030e659987275d2a1ac133a90d415d.diff",
            "diff_additions": 1323,
            "diff_deletions": 0,
            "diff_file_size": 0,
            "files": [
                {
                    "file_additions": 50,
                    "file_deletions": 0,
                    "file_exists": false,
                    "file_name": "spring-boot-autoconfigure/src/main/java/org/springframework/boot/autoconfigure/data/ldap/LdapDataAutoConfiguration.java",
                    "file_size": 0
                },
                {
                    "file_additions": 44,
                    "file_deletions": 0,
                    "file_exists": false,
                    "file_name": "spring-boot-autoconfigure/src/main/java/org/springframework/boot/autoconfigure/data/ldap/LdapRepositoriesAutoConfiguration.java",
                    "file_size": 0
                },
                {
                    "file_additions": 56,
                    "file_deletions": 0,
                    "file_exists": false,
                    "file_name": "spring-boot-autoconfigure/src/main/java/org/springframework/boot/autoconfigure/data/ldap/LdapRepositoriesRegistrar.java",
                    "file_size": 0
                },
                {
                    "file_additions": 20,
                    "file_deletions": 0,
                    "file_exists": false,
                    "file_name": "spring-boot-autoconfigure/src/main/java/org/springframework/boot/autoconfigure/data/ldap/package-info.java",
                    "file_size": 0
                },
                {
                    "file_additions": 64,
                    "file_deletions": 0,
                    "file_exists": false,
                    "file_name": "spring-boot-autoconfigure/src/main/java/org/springframework/boot/autoconfigure/ldap/LdapAutoConfiguration.java",
                    "file_size": 0
                },
                {
                    "file_additions": 120,
                    "file_deletions": 0,
                    "file_exists": false,
                    "file_name": "spring-boot-autoconfigure/src/main/java/org/springframework/boot/autoconfigure/ldap/LdapProperties.java",
                    "file_size": 0
                },
                {
                    "file_additions": 175,
                    "file_deletions": 0,
                    "file_exists": false,
                    "file_name": "spring-boot-autoconfigure/src/main/java/org/springframework/boot/autoconfigure/ldap/embedded/EmbeddedLdapAutoConfiguration.java",
                    "file_size": 0
                },
                {
                    "file_additions": 112,
                    "file_deletions": 0,
                    "file_exists": false,
                    "file_name": "spring-boot-autoconfigure/src/main/java/org/springframework/boot/autoconfigure/ldap/embedded/EmbeddedLdapProperties.java",
                    "file_size": 0
                },
                {
                    "file_additions": 20,
                    "file_deletions": 0,
                    "file_exists": false,
                    "file_name": "spring-boot-autoconfigure/src/main/java/org/springframework/boot/autoconfigure/ldap/package-info.java",
                    "file_size": 0
                },
                {
                    "file_additions": 26,
                    "file_deletions": 0,
                    "file_exists": false,
                    "file_name": "spring-boot-autoconfigure/src/test/java/org/springframework/boot/autoconfigure/data/alt/ldap/PersonLdapRepository.java",
                    "file_size": 0
                },
                {
                    "file_additions": 55,
                    "file_deletions": 0,
                    "file_exists": false,
                    "file_name": "spring-boot-autoconfigure/src/test/java/org/springframework/boot/autoconfigure/data/ldap/LdapDataAutoConfigurationTests.java",
                    "file_size": 0
                },
                {
                    "file_additions": 100,
                    "file_deletions": 0,
                    "file_exists": false,
                    "file_name": "spring-boot-autoconfigure/src/test/java/org/springframework/boot/autoconfigure/data/ldap/LdapRepositoriesAutoConfigurationTests.java",
                    "file_size": 0
                },
                {
                    "file_additions": 36,
                    "file_deletions": 0,
                    "file_exists": false,
                    "file_name": "spring-boot-autoconfigure/src/test/java/org/springframework/boot/autoconfigure/data/ldap/person/Person.java",
                    "file_size": 0
                },
                {
                    "file_additions": 25,
                    "file_deletions": 0,
                    "file_exists": false,
                    "file_name": "spring-boot-autoconfigure/src/test/java/org/springframework/boot/autoconfigure/data/ldap/person/PersonRepository.java",
                    "file_size": 0
                },
                {
                    "file_additions": 96,
                    "file_deletions": 0,
                    "file_exists": false,
                    "file_name": "spring-boot-autoconfigure/src/test/java/org/springframework/boot/autoconfigure/ldap/LdapAutoConfigurationTests.java",
                    "file_size": 0
                },
                {
                    "file_additions": 154,
                    "file_deletions": 0,
                    "file_exists": false,
                    "file_name": "spring-boot-autoconfigure/src/test/java/org/springframework/boot/autoconfigure/ldap/embedded/EmbeddedLdapAutoConfigurationTests.java",
                    "file_size": 0
                },
                {
                    "file_additions": 39,
                    "file_deletions": 0,
                    "file_exists": false,
                    "file_name": "spring-boot-samples/spring-boot-sample-data-ldap/src/main/java/sample/data/ldap/Person.java",
                    "file_size": 0
                },
                {
                    "file_additions": 25,
                    "file_deletions": 0,
                    "file_exists": false,
                    "file_name": "spring-boot-samples/spring-boot-sample-data-ldap/src/main/java/sample/data/ldap/PersonRepository.java",
                    "file_size": 0
                },
                {
                    "file_additions": 59,
                    "file_deletions": 0,
                    "file_exists": false,
                    "file_name": "spring-boot-samples/spring-boot-sample-data-ldap/src/main/java/sample/data/ldap/SampleLdapApplication.java",
                    "file_size": 0
                },
                {
                    "file_additions": 47,
                    "file_deletions": 0,
                    "file_exists": false,
                    "file_name": "spring-boot-samples/spring-boot-sample-data-ldap/src/test/java/sample/data/ldap/SampleLdapApplicationTests.java",
                    "file_size": 0
                }
            ],
            "interesting": {
                "reopened": false,
                "status": false
            },
            "sha": "e9acc7f15a030e659987275d2a1ac133a90d415d"
        }
    ],
    "first_commit": "2015-05-18 18:16:50",
    "last_commit": "2017-01-06 07:39:06",
    "number": 2645,
    "score": 336.0007643798968
}