{
    "covered_issues": [
        231,
        229,
        226,
        225,
        199,
        190,
        179,
        177,
        173,
        170,
        169,
        168,
        154,
        153,
        152,
        151,
        149,
        145,
        143,
        141,
        137,
        134,
        132,
        130,
        128,
        125,
        122,
        118,
        115,
        114,
        111,
        109,
        107,
        106,
        104,
        99,
        97,
        96,
        94,
        91,
        90,
        89,
        88,
        87,
        86,
        85,
        84,
        81,
        79,
        76,
        75,
        74,
        73,
        66,
        62,
        59,
        56,
        55,
        53,
        50,
        49,
        42,
        41,
        39,
        38,
        33,
        32,
        30,
        29,
        28,
        27,
        26,
        19,
        16,
        15,
        14,
        13,
        12,
        11,
        9,
        8,
        7,
        5,
        4,
        3,
        2,
        1
    ],
    "finished": true
}