{
    "commits": [
        {
            "associated_pull_request": [],
            "date": "2014-10-10 11:33:48+00:00",
            "diff": "tass-belgium_picotcp/issue_196/commit_67abf3b598352a47f1f844e743c64e57b10036ab.diff",
            "diff_additions": 5,
            "diff_deletions": 3,
            "diff_file_size": 92885,
            "diff_url": "https://github.com/tass-belgium/picotcp/commit/67abf3b598352a47f1f844e743c64e57b10036ab.diff",
            "exists": true,
            "files": [
                {
                    "file_additions": 2,
                    "file_deletions": 2,
                    "file_exists": true,
                    "file_name": "modules/pico_dns_client.c",
                    "file_size": 22600
                },
                {
                    "file_additions": 1,
                    "file_deletions": 0,
                    "file_exists": true,
                    "file_name": "modules/pico_dns_common.c",
                    "file_size": 64078
                },
                {
                    "file_additions": 2,
                    "file_deletions": 1,
                    "file_exists": true,
                    "file_name": "test/units.c",
                    "file_size": 6207
                }
            ],
            "interesting": {
                "reopen": false,
                "status": false
            },
            "is_parent": true,
            "sha": "67abf3b598352a47f1f844e743c64e57b10036ab"
        },
        {
            "associated_pull_request": [],
            "date": "2014-10-15 12:05:54+00:00",
            "diff": "tass-belgium_picotcp/issue_196/commit_29bb2850e842da64c1cd2557964f4d96531c15e1.diff",
            "diff_additions": 33,
            "diff_deletions": 6,
            "diff_file_size": 32202,
            "diff_url": "https://github.com/tass-belgium/picotcp/commit/29bb2850e842da64c1cd2557964f4d96531c15e1.diff",
            "exists": true,
            "files": [
                {
                    "file_additions": 21,
                    "file_deletions": 6,
                    "file_exists": true,
                    "file_name": "modules/pico_dns_client.c",
                    "file_size": 22600
                },
                {
                    "file_additions": 12,
                    "file_deletions": 0,
                    "file_exists": true,
                    "file_name": "test/unit/modunit_pico_dns_client.c",
                    "file_size": 9602
                }
            ],
            "interesting": {
                "reopen": true,
                "status": false
            },
            "is_parent": false,
            "sha": "29bb2850e842da64c1cd2557964f4d96531c15e1"
        },
        {
            "associated_pull_request": [],
            "date": "2014-10-15 14:27:43+00:00",
            "diff": "tass-belgium_picotcp/issue_196/commit_b14f4f15d972a9b08f62e8b343e9336c234b4941.diff",
            "diff_additions": 41,
            "diff_deletions": 3,
            "diff_file_size": 22600,
            "diff_url": "https://github.com/tass-belgium/picotcp/commit/b14f4f15d972a9b08f62e8b343e9336c234b4941.diff",
            "exists": true,
            "files": [
                {
                    "file_additions": 41,
                    "file_deletions": 3,
                    "file_exists": true,
                    "file_name": "modules/pico_dns_client.c",
                    "file_size": 22600
                }
            ],
            "interesting": {
                "reopen": true,
                "status": false
            },
            "is_parent": false,
            "sha": "b14f4f15d972a9b08f62e8b343e9336c234b4941"
        },
        {
            "associated_pull_request": [],
            "date": "2014-10-17 08:39:22+00:00",
            "diff": "tass-belgium_picotcp/issue_196/commit_07156d0c8b217e2a9b8438b805b37c7b027793dd.diff",
            "diff_additions": 9,
            "diff_deletions": 7,
            "diff_file_size": 22600,
            "diff_url": "https://github.com/tass-belgium/picotcp/commit/07156d0c8b217e2a9b8438b805b37c7b027793dd.diff",
            "exists": true,
            "files": [
                {
                    "file_additions": 9,
                    "file_deletions": 7,
                    "file_exists": true,
                    "file_name": "modules/pico_dns_client.c",
                    "file_size": 22600
                }
            ],
            "interesting": {
                "reopen": false,
                "status": false
            },
            "is_parent": false,
            "sha": "07156d0c8b217e2a9b8438b805b37c7b027793dd"
        }
    ],
    "first_commit": "2014-10-10 11:39:35+00:00",
    "last_commit": "2014-10-17 08:39:22+00:00",
    "number": 196,
    "pull_request": "None",
    "score": {
        "accidental_reopen_likely": false,
        "all_labels": [
            "RFC Violation"
        ],
        "contains_keywords": [
            "fix",
            "attempt",
            "bug"
        ],
        "fix_size": 70,
        "has_labels": [],
        "intersecting": {
            "computed_score": 0.1875,
            "final_commit_size": 16,
            "intersection_size": 3,
            "previous_commits_size": 57
        },
        "is_makefile_based": true,
        "no_new_files": [],
        "no_other_files": false,
        "num_prohibited_files": 213212,
        "prohibited_files": [
            "server/src/main/java/com/genymobile/scrcpy/Device.java",
            "server/src/main/java/com/genymobile/scrcpy/wrappers/SurfaceControl.java",
            "server/src/main/java/com/genymobile/scrcpy/Device.java",
            "server/src/main/java/com/genymobile/scrcpy/wrappers/SurfaceControl.java",
            "app/meson.build",
            "app/scrcpy.1",
            "app/src/common.h",
            "app/src/scrcpy.h",
            "app/src/server.h",
            "server/src/main/java/com/genymobile/scrcpy/Workarounds.java"
        ],
        "reopen": true,
        "reopen_events": [
            [
                "2014-10-15 12:06:56+00:00",
                "closed"
            ],
            [
                "2014-10-15 12:06:56+00:00",
                "commit"
            ],
            [
                "2014-10-15 12:07:03+00:00",
                "reopened"
            ],
            [
                "2014-10-15 14:27:58+00:00",
                "closed"
            ],
            [
                "2014-10-15 14:27:58+00:00",
                "commit"
            ],
            [
                "2014-10-16 12:12:01+00:00",
                "reopened"
            ],
            [
                "2014-10-17 08:39:43+00:00",
                "commit"
            ],
            [
                "2014-10-17 14:02:05+00:00",
                "closed"
            ]
        ],
        "status": false,
        "strategy": true,
        "total_changes": 107
    }
}