{
    "covered_issues": [
        404,
        370,
        367,
        345,
        342,
        334,
        332,
        321,
        316,
        315,
        313,
        312,
        311,
        310,
        309,
        308,
        307,
        303,
        301,
        293,
        289,
        288,
        282,
        281,
        279,
        274,
        269,
        268,
        267,
        263,
        260,
        252,
        251,
        250,
        246,
        243,
        236,
        235,
        231,
        222,
        221,
        220,
        212,
        211,
        203,
        196,
        195,
        193,
        191,
        189,
        185,
        184,
        183,
        182,
        177,
        172,
        171,
        165,
        162,
        160,
        157,
        152,
        145,
        144,
        143,
        139,
        136,
        134,
        131,
        123,
        119,
        118,
        116,
        114,
        113,
        112,
        111,
        109,
        108,
        107,
        103,
        102,
        99,
        98,
        96,
        94,
        92,
        91,
        90,
        88,
        83,
        77,
        76,
        72,
        66,
        64,
        62,
        61,
        57,
        56,
        55,
        54,
        43,
        40,
        38,
        36,
        35,
        34,
        33,
        32,
        31,
        29,
        25,
        23,
        22,
        19,
        18,
        17,
        16,
        14,
        13,
        12,
        8,
        6,
        4,
        3,
        2,
        1
    ],
    "finished": true
}