{
    "covered_issues": [
        722,
        721,
        715,
        713,
        698,
        690,
        680,
        677,
        669,
        659,
        658,
        657,
        656,
        655,
        653,
        645,
        644,
        643,
        630,
        613,
        611,
        605,
        602,
        601,
        598,
        591,
        578,
        574,
        569,
        563,
        561,
        559,
        558,
        557,
        555,
        540,
        538,
        535,
        533,
        520,
        492,
        480,
        476,
        473,
        472,
        453,
        447,
        446,
        434,
        424,
        419,
        406,
        404,
        400,
        399,
        398,
        396,
        388,
        386,
        372,
        369,
        368,
        365,
        362,
        361,
        353,
        351,
        343,
        341,
        329,
        323,
        317,
        308,
        307,
        303,
        302,
        301,
        299,
        297,
        293,
        291,
        289,
        281,
        271,
        256,
        255,
        254,
        253,
        251,
        246,
        238,
        237,
        234,
        233,
        222,
        218,
        216,
        211,
        203,
        202,
        198,
        195,
        193,
        191,
        188,
        178,
        171,
        170,
        168,
        165,
        164,
        163,
        162,
        161,
        151,
        150,
        147,
        140,
        138,
        134,
        133,
        132,
        128,
        127,
        126,
        125,
        121,
        115,
        112,
        111,
        109,
        106,
        103,
        101,
        100,
        99,
        98,
        95,
        94,
        93,
        91,
        90,
        73,
        72,
        71,
        68,
        66,
        62,
        59,
        58,
        57,
        54,
        53,
        51,
        50,
        47,
        45,
        44,
        41,
        40,
        38,
        35,
        29,
        27,
        26,
        25,
        23,
        22,
        20,
        19,
        18,
        17,
        16,
        15,
        14,
        13,
        11,
        9,
        8,
        7,
        6,
        5,
        4,
        3,
        2,
        1
    ],
    "finished": true
}