{
    "commits": [
        {
            "diff": "spring-projects_spring-boot/issue_23037/commit_cf9e85ca53a1f9888121e260ac0d03253eea66be.diff",
            "diff_additions": 21,
            "diff_deletions": 2,
            "diff_file_size": 84607,
            "files": [
                {
                    "file_additions": 1,
                    "file_deletions": 0,
                    "file_exists": true,
                    "file_name": "spring-boot-project/spring-boot-autoconfigure/src/main/java/org/springframework/boot/autoconfigure/amqp/RabbitAutoConfiguration.java",
                    "file_size": 10411
                },
                {
                    "file_additions": 14,
                    "file_deletions": 0,
                    "file_exists": true,
                    "file_name": "spring-boot-project/spring-boot-autoconfigure/src/main/java/org/springframework/boot/autoconfigure/amqp/RabbitProperties.java",
                    "file_size": 26262
                },
                {
                    "file_additions": 6,
                    "file_deletions": 2,
                    "file_exists": true,
                    "file_name": "spring-boot-project/spring-boot-autoconfigure/src/test/java/org/springframework/boot/autoconfigure/amqp/RabbitAutoConfigurationTests.java",
                    "file_size": 47934
                }
            ],
            "interesting": {
                "reopened": false,
                "status": false
            },
            "sha": "cf9e85ca53a1f9888121e260ac0d03253eea66be"
        },
        {
            "diff": "spring-projects_spring-boot/issue_23037/commit_414e861ca595f74fa52cc2b4586aaeb5fb4d6dae.diff",
            "diff_additions": 11,
            "diff_deletions": 1,
            "diff_file_size": 10048,
            "files": [
                {
                    "file_additions": 2,
                    "file_deletions": 1,
                    "file_exists": true,
                    "file_name": "spring-boot-project/spring-boot-actuator/src/main/java/org/springframework/boot/actuate/endpoint/Sanitizer.java",
                    "file_size": 4027
                },
                {
                    "file_additions": 9,
                    "file_deletions": 0,
                    "file_exists": true,
                    "file_name": "spring-boot-project/spring-boot-actuator/src/test/java/org/springframework/boot/actuate/endpoint/SanitizerTests.java",
                    "file_size": 6021
                }
            ],
            "interesting": {
                "reopened": false,
                "status": true
            },
            "sha": "414e861ca595f74fa52cc2b4586aaeb5fb4d6dae"
        },
        {
            "diff": "spring-projects_spring-boot/issue_23037/commit_775f0fa8613c5360bac2159f4c45089733049587.diff",
            "diff_additions": 19,
            "diff_deletions": 1,
            "diff_file_size": 10048,
            "files": [
                {
                    "file_additions": 2,
                    "file_deletions": 1,
                    "file_exists": true,
                    "file_name": "spring-boot-project/spring-boot-actuator/src/main/java/org/springframework/boot/actuate/endpoint/Sanitizer.java",
                    "file_size": 4027
                },
                {
                    "file_additions": 17,
                    "file_deletions": 0,
                    "file_exists": true,
                    "file_name": "spring-boot-project/spring-boot-actuator/src/test/java/org/springframework/boot/actuate/endpoint/SanitizerTests.java",
                    "file_size": 6021
                }
            ],
            "interesting": {
                "reopened": false,
                "status": false
            },
            "sha": "775f0fa8613c5360bac2159f4c45089733049587"
        }
    ],
    "first_commit": "2020-08-27 12:38:30",
    "last_commit": "2020-09-11 09:34:38",
    "number": 23037,
    "score": 272.07272727272726
}