{
    "covered_issues": [
        296,
        261,
        259,
        254,
        253,
        252,
        250,
        248,
        244,
        242,
        231,
        228,
        227,
        224,
        221,
        220,
        219,
        218,
        217,
        216,
        215,
        214,
        211,
        208,
        206,
        205,
        204,
        202,
        201,
        200,
        196,
        193,
        191,
        190,
        189,
        188,
        187,
        186,
        185,
        183,
        182,
        181,
        180,
        179,
        177,
        176,
        175,
        173,
        172,
        170,
        160,
        157,
        155,
        154,
        153,
        152,
        151,
        150,
        144,
        142,
        141,
        140,
        139,
        138,
        137,
        136,
        135,
        134,
        133,
        131,
        128,
        127,
        126,
        125,
        121,
        120,
        119,
        118,
        116,
        115,
        113,
        110,
        107,
        106,
        103,
        101,
        100,
        99,
        98,
        97,
        96,
        95,
        94,
        93,
        92,
        90,
        89,
        88,
        85,
        84,
        82,
        81,
        80,
        76,
        74,
        72,
        67,
        66,
        65,
        61,
        60,
        59,
        58,
        57,
        56,
        55,
        53,
        52,
        50,
        48,
        45,
        43,
        40,
        38,
        35,
        33,
        32,
        31,
        29,
        28,
        27,
        26,
        25,
        23,
        21,
        20,
        18,
        17,
        15,
        13,
        8,
        7,
        4,
        3,
        2
    ],
    "finished": true
}