{
    "covered_issues": [
        223,
        222,
        221,
        219,
        216,
        213,
        211,
        209,
        208,
        207,
        206,
        205,
        204,
        201,
        200,
        199,
        197,
        188,
        178,
        176,
        174,
        170,
        167,
        166,
        164,
        162,
        160,
        147,
        145,
        141,
        135,
        132,
        130,
        127,
        124,
        120,
        116,
        113,
        109,
        106,
        104,
        99,
        98,
        94,
        86,
        84,
        83,
        81,
        77,
        76,
        64,
        62,
        59,
        58,
        57,
        46,
        45,
        44,
        42,
        41,
        40,
        36,
        33,
        32,
        30,
        29,
        28,
        27,
        26,
        25,
        24,
        19,
        15,
        14,
        12,
        9,
        7,
        3,
        2
    ],
    "finished": true
}