{
    "commits": [
        {
            "diff": "spring-projects_spring-boot/issue_19599/commit_7f0573df493a2547b77fe5476d5266583b2ebabc.diff",
            "diff_additions": 21,
            "diff_deletions": 3,
            "diff_file_size": 14008,
            "files": [
                {
                    "file_additions": 5,
                    "file_deletions": 2,
                    "file_exists": true,
                    "file_name": "spring-boot-project/spring-boot-actuator/src/main/java/org/springframework/boot/actuate/metrics/web/reactive/server/WebFluxTags.java",
                    "file_size": 6548
                },
                {
                    "file_additions": 16,
                    "file_deletions": 1,
                    "file_exists": true,
                    "file_name": "spring-boot-project/spring-boot-actuator/src/test/java/org/springframework/boot/actuate/metrics/web/reactive/server/WebFluxTagsTests.java",
                    "file_size": 7460
                }
            ],
            "interesting": {
                "reopened": false,
                "status": false
            },
            "sha": "7f0573df493a2547b77fe5476d5266583b2ebabc"
        },
        {
            "diff": "spring-projects_spring-boot/issue_19599/commit_139995469a40aaec556fd920cf8826ea021459bb.diff",
            "diff_additions": 20,
            "diff_deletions": 11,
            "diff_file_size": 21576,
            "files": [
                {
                    "file_additions": 11,
                    "file_deletions": 11,
                    "file_exists": true,
                    "file_name": "spring-boot-project/spring-boot/src/main/java/org/springframework/boot/context/properties/bind/validation/ValidationBindHandler.java",
                    "file_size": 7466
                },
                {
                    "file_additions": 9,
                    "file_deletions": 0,
                    "file_exists": true,
                    "file_name": "spring-boot-project/spring-boot/src/test/java/org/springframework/boot/context/properties/bind/validation/ValidationBindHandlerTests.java",
                    "file_size": 14110
                }
            ],
            "interesting": {
                "reopened": false,
                "status": true
            },
            "sha": "139995469a40aaec556fd920cf8826ea021459bb"
        },
        {
            "diff": "spring-projects_spring-boot/issue_19599/commit_1fa83757cef7fc9dca1c6c2b093450f8ca9fd3bb.diff",
            "diff_additions": 1,
            "diff_deletions": 1,
            "diff_file_size": 14110,
            "files": [
                {
                    "file_additions": 1,
                    "file_deletions": 1,
                    "file_exists": true,
                    "file_name": "spring-boot-project/spring-boot/src/test/java/org/springframework/boot/context/properties/bind/validation/ValidationBindHandlerTests.java",
                    "file_size": 14110
                }
            ],
            "interesting": {
                "reopened": false,
                "status": false
            },
            "sha": "1fa83757cef7fc9dca1c6c2b093450f8ca9fd3bb"
        }
    ],
    "first_commit": "2020-01-10 01:55:35",
    "last_commit": "2020-01-10 21:22:53",
    "number": 19599,
    "score": 288.0701754385965
}