{
    "commits": [
        {
            "diff": "elastic_elasticsearch/issue_36813/commit_eadcb5f0f8f8e27a5719037968bf43ce5c03ccb8.diff",
            "diff_additions": 90,
            "diff_deletions": 4,
            "diff_file_size": 0,
            "files": [
                {
                    "file_additions": 24,
                    "file_deletions": 4,
                    "file_exists": false,
                    "file_name": "server/src/main/java/org/elasticsearch/cluster/coordination/DiscoveryUpgradeService.java",
                    "file_size": 0
                },
                {
                    "file_additions": 66,
                    "file_deletions": 0,
                    "file_exists": false,
                    "file_name": "server/src/test/java/org/elasticsearch/cluster/coordination/Zen1IT.java",
                    "file_size": 0
                }
            ],
            "interesting": {
                "reopened": false,
                "status": false
            },
            "sha": "eadcb5f0f8f8e27a5719037968bf43ce5c03ccb8"
        },
        {
            "diff": "elastic_elasticsearch/issue_36813/commit_ae9f4df361fd4e8848c47593f0e359db860c76c6.diff",
            "diff_additions": 4,
            "diff_deletions": 4,
            "diff_file_size": 0,
            "files": [
                {
                    "file_additions": 4,
                    "file_deletions": 4,
                    "file_exists": false,
                    "file_name": "server/src/test/java/org/elasticsearch/indices/state/RareClusterStateIT.java",
                    "file_size": 0
                }
            ],
            "interesting": {
                "reopened": true,
                "status": false
            },
            "sha": "ae9f4df361fd4e8848c47593f0e359db860c76c6"
        },
        {
            "diff": "elastic_elasticsearch/issue_36813/commit_de52602140aa03966592ec5eaab7679f6649c164.diff",
            "diff_additions": 70,
            "diff_deletions": 65,
            "diff_file_size": 79356,
            "files": [
                {
                    "file_additions": 48,
                    "file_deletions": 47,
                    "file_exists": true,
                    "file_name": "server/src/main/java/org/elasticsearch/action/bulk/TransportShardBulkAction.java",
                    "file_size": 27912
                },
                {
                    "file_additions": 22,
                    "file_deletions": 17,
                    "file_exists": true,
                    "file_name": "server/src/test/java/org/elasticsearch/action/bulk/TransportShardBulkActionTests.java",
                    "file_size": 51444
                },
                {
                    "file_additions": 0,
                    "file_deletions": 1,
                    "file_exists": false,
                    "file_name": "server/src/test/java/org/elasticsearch/cluster/coordination/RareClusterStateIT.java",
                    "file_size": 0
                }
            ],
            "interesting": {
                "reopened": false,
                "status": false
            },
            "sha": "de52602140aa03966592ec5eaab7679f6649c164"
        },
        {
            "diff": "elastic_elasticsearch/issue_36813/commit_90ab4a6f6e23505fe4fd19d8257e85b00ddd91a4.diff",
            "diff_additions": 2,
            "diff_deletions": 2,
            "diff_file_size": 0,
            "files": [
                {
                    "file_additions": 2,
                    "file_deletions": 2,
                    "file_exists": false,
                    "file_name": "server/src/test/java/org/elasticsearch/cluster/coordination/RareClusterStateIT.java",
                    "file_size": 0
                }
            ],
            "interesting": {
                "reopened": false,
                "status": false
            },
            "sha": "90ab4a6f6e23505fe4fd19d8257e85b00ddd91a4"
        },
        {
            "diff": "elastic_elasticsearch/issue_36813/commit_aec2db78eafa3447e86528b65f3fb296fd29e137.diff",
            "diff_additions": 1,
            "diff_deletions": 0,
            "diff_file_size": 0,
            "files": [
                {
                    "file_additions": 1,
                    "file_deletions": 0,
                    "file_exists": false,
                    "file_name": "server/src/test/java/org/elasticsearch/cluster/coordination/RareClusterStateIT.java",
                    "file_size": 0
                }
            ],
            "interesting": {
                "reopened": false,
                "status": false
            },
            "sha": "aec2db78eafa3447e86528b65f3fb296fd29e137"
        },
        {
            "diff": "elastic_elasticsearch/issue_36813/commit_49e27eb53afc27798d7fa1f122a6a1d784543783.diff",
            "diff_additions": 0,
            "diff_deletions": 2,
            "diff_file_size": 0,
            "files": [
                {
                    "file_additions": 0,
                    "file_deletions": 2,
                    "file_exists": false,
                    "file_name": "server/src/test/java/org/elasticsearch/cluster/coordination/RareClusterStateIT.java",
                    "file_size": 0
                }
            ],
            "interesting": {
                "reopened": false,
                "status": false
            },
            "sha": "49e27eb53afc27798d7fa1f122a6a1d784543783"
        },
        {
            "diff": "elastic_elasticsearch/issue_36813/commit_8568eb2fbb2b276e7f7f3afca699932d4981e9c1.diff",
            "diff_additions": 11,
            "diff_deletions": 3,
            "diff_file_size": 79533,
            "files": [
                {
                    "file_additions": 7,
                    "file_deletions": 3,
                    "file_exists": true,
                    "file_name": "server/src/main/java/org/elasticsearch/cluster/coordination/Coordinator.java",
                    "file_size": 79533
                },
                {
                    "file_additions": 4,
                    "file_deletions": 0,
                    "file_exists": false,
                    "file_name": "server/src/test/java/org/elasticsearch/cluster/coordination/RareClusterStateIT.java",
                    "file_size": 0
                }
            ],
            "interesting": {
                "reopened": false,
                "status": false
            },
            "sha": "8568eb2fbb2b276e7f7f3afca699932d4981e9c1"
        },
        {
            "diff": "elastic_elasticsearch/issue_36813/commit_317e3d9d538ef7beda752ce45f709e6e7ce4407f.diff",
            "diff_additions": 0,
            "diff_deletions": 2,
            "diff_file_size": 0,
            "files": [
                {
                    "file_additions": 0,
                    "file_deletions": 2,
                    "file_exists": false,
                    "file_name": "server/src/test/java/org/elasticsearch/cluster/coordination/RareClusterStateIT.java",
                    "file_size": 0
                }
            ],
            "interesting": {
                "reopened": false,
                "status": false
            },
            "sha": "317e3d9d538ef7beda752ce45f709e6e7ce4407f"
        },
        {
            "diff": "elastic_elasticsearch/issue_36813/commit_cdb482eaae0517f202efdfaf445e8847917182f1.diff",
            "diff_additions": 11,
            "diff_deletions": 3,
            "diff_file_size": 79533,
            "files": [
                {
                    "file_additions": 7,
                    "file_deletions": 3,
                    "file_exists": true,
                    "file_name": "server/src/main/java/org/elasticsearch/cluster/coordination/Coordinator.java",
                    "file_size": 79533
                },
                {
                    "file_additions": 4,
                    "file_deletions": 0,
                    "file_exists": false,
                    "file_name": "server/src/test/java/org/elasticsearch/cluster/coordination/RareClusterStateIT.java",
                    "file_size": 0
                }
            ],
            "interesting": {
                "reopened": false,
                "status": false
            },
            "sha": "cdb482eaae0517f202efdfaf445e8847917182f1"
        },
        {
            "diff": "elastic_elasticsearch/issue_36813/commit_a94d24ae5ad2f7a1695cf83c2ad191c456c7dab4.diff",
            "diff_additions": 11,
            "diff_deletions": 3,
            "diff_file_size": 79533,
            "files": [
                {
                    "file_additions": 7,
                    "file_deletions": 3,
                    "file_exists": true,
                    "file_name": "server/src/main/java/org/elasticsearch/cluster/coordination/Coordinator.java",
                    "file_size": 79533
                },
                {
                    "file_additions": 4,
                    "file_deletions": 0,
                    "file_exists": false,
                    "file_name": "server/src/test/java/org/elasticsearch/cluster/coordination/RareClusterStateIT.java",
                    "file_size": 0
                }
            ],
            "interesting": {
                "reopened": false,
                "status": false
            },
            "sha": "a94d24ae5ad2f7a1695cf83c2ad191c456c7dab4"
        },
        {
            "diff": "elastic_elasticsearch/issue_36813/commit_24d3f202b727ea487ce0deb3406d5b8297728e3b.diff",
            "diff_additions": 11,
            "diff_deletions": 3,
            "diff_file_size": 79533,
            "files": [
                {
                    "file_additions": 7,
                    "file_deletions": 3,
                    "file_exists": true,
                    "file_name": "server/src/main/java/org/elasticsearch/cluster/coordination/Coordinator.java",
                    "file_size": 79533
                },
                {
                    "file_additions": 4,
                    "file_deletions": 0,
                    "file_exists": false,
                    "file_name": "server/src/test/java/org/elasticsearch/cluster/coordination/RareClusterStateIT.java",
                    "file_size": 0
                }
            ],
            "interesting": {
                "reopened": false,
                "status": false
            },
            "sha": "24d3f202b727ea487ce0deb3406d5b8297728e3b"
        },
        {
            "diff": "elastic_elasticsearch/issue_36813/commit_ce28f9e36677486bd58b82b3fd287916645f9e09.diff",
            "diff_additions": 13208,
            "diff_deletions": 1821,
            "diff_file_size": 2495159,
            "files": [
                {
                    "file_additions": 3,
                    "file_deletions": 2,
                    "file_exists": true,
                    "file_name": "benchmarks/src/main/java/org/elasticsearch/benchmark/routing/allocation/Allocators.java",
                    "file_size": 3948
                },
                {
                    "file_additions": 27,
                    "file_deletions": 0,
                    "file_exists": true,
                    "file_name": "buildSrc/src/main/java/org/elasticsearch/gradle/AbstractLazyPropertyCollection.java",
                    "file_size": 1055
                },
                {
                    "file_additions": 5,
                    "file_deletions": 2,
                    "file_exists": true,
                    "file_name": "buildSrc/src/main/java/org/elasticsearch/gradle/BwcVersions.java",
                    "file_size": 17019
                },
                {
                    "file_additions": 275,
                    "file_deletions": 0,
                    "file_exists": true,
                    "file_name": "buildSrc/src/main/java/org/elasticsearch/gradle/DistributionDownloadPlugin.java",
                    "file_size": 10295
                },
                {
                    "file_additions": 230,
                    "file_deletions": 0,
                    "file_exists": true,
                    "file_name": "buildSrc/src/main/java/org/elasticsearch/gradle/ElasticsearchDistribution.java",
                    "file_size": 10202
                },
                {
                    "file_additions": 83,
                    "file_deletions": 0,
                    "file_exists": true,
                    "file_name": "buildSrc/src/main/java/org/elasticsearch/gradle/EmptyDirTask.java",
                    "file_size": 1777
                },
                {
                    "file_additions": 7,
                    "file_deletions": 1,
                    "file_exists": true,
                    "file_name": "buildSrc/src/main/java/org/elasticsearch/gradle/JdkDownloadPlugin.java",
                    "file_size": 9394
                },
                {
                    "file_additions": 205,
                    "file_deletions": 0,
                    "file_exists": true,
                    "file_name": "buildSrc/src/main/java/org/elasticsearch/gradle/LazyPropertyList.java",
                    "file_size": 6631
                },
                {
                    "file_additions": 167,
                    "file_deletions": 0,
                    "file_exists": true,
                    "file_name": "buildSrc/src/main/java/org/elasticsearch/gradle/LazyPropertyMap.java",
                    "file_size": 5322
                },
                {
                    "file_additions": 0,
                    "file_deletions": 124,
                    "file_exists": true,
                    "file_name": "buildSrc/src/main/java/org/elasticsearch/gradle/LoggedExec.java",
                    "file_size": 6149
                },
                {
                    "file_additions": 13,
                    "file_deletions": 0,
                    "file_exists": true,
                    "file_name": "buildSrc/src/main/java/org/elasticsearch/gradle/PropertyNormalization.java",
                    "file_size": 632
                },
                {
                    "file_additions": 30,
                    "file_deletions": 0,
                    "file_exists": true,
                    "file_name": "buildSrc/src/main/java/org/elasticsearch/gradle/SystemPropertyCommandLineArgumentProvider.java",
                    "file_size": 1667
                },
                {
                    "file_additions": 8,
                    "file_deletions": 12,
                    "file_exists": true,
                    "file_name": "buildSrc/src/main/java/org/elasticsearch/gradle/http/WaitForHttpResource.java",
                    "file_size": 8446
                },
                {
                    "file_additions": 1,
                    "file_deletions": 1,
                    "file_exists": true,
                    "file_name": "buildSrc/src/main/java/org/elasticsearch/gradle/info/GlobalBuildInfoPlugin.java",
                    "file_size": 21883
                },
                {
                    "file_additions": 141,
                    "file_deletions": 0,
                    "file_exists": true,
                    "file_name": "buildSrc/src/main/java/org/elasticsearch/gradle/plugin/PluginPropertiesExtension.java",
                    "file_size": 4102
                },
                {
                    "file_additions": 328,
                    "file_deletions": 0,
                    "file_exists": false,
                    "file_name": "buildSrc/src/main/java/org/elasticsearch/gradle/precommit/DependencyLicensesTask.java",
                    "file_size": 0
                },
                {
                    "file_additions": 86,
                    "file_deletions": 0,
                    "file_exists": false,
                    "file_name": "buildSrc/src/main/java/org/elasticsearch/gradle/precommit/UpdateShasTask.java",
                    "file_size": 0
                },
                {
                    "file_additions": 37,
                    "file_deletions": 0,
                    "file_exists": false,
                    "file_name": "buildSrc/src/main/java/org/elasticsearch/gradle/test/RestTestRunnerTask.java",
                    "file_size": 0
                },
                {
                    "file_additions": 78,
                    "file_deletions": 15,
                    "file_exists": true,
                    "file_name": "buildSrc/src/main/java/org/elasticsearch/gradle/testclusters/ElasticsearchCluster.java",
                    "file_size": 17386
                },
                {
                    "file_additions": 383,
                    "file_deletions": 117,
                    "file_exists": true,
                    "file_name": "buildSrc/src/main/java/org/elasticsearch/gradle/testclusters/ElasticsearchNode.java",
                    "file_size": 62781
                },
                {
                    "file_additions": 59,
                    "file_deletions": 0,
                    "file_exists": false,
                    "file_name": "buildSrc/src/main/java/org/elasticsearch/gradle/testclusters/TestClusterCleanupOnShutdown.java",
                    "file_size": 0
                },
                {
                    "file_additions": 29,
                    "file_deletions": 8,
                    "file_exists": true,
                    "file_name": "buildSrc/src/main/java/org/elasticsearch/gradle/testclusters/TestClusterConfiguration.java",
                    "file_size": 5821
                },
                {
                    "file_additions": 74,
                    "file_deletions": 0,
                    "file_exists": false,
                    "file_name": "buildSrc/src/main/java/org/elasticsearch/gradle/testclusters/TestClustersCleanupExtension.java",
                    "file_size": 0
                },
                {
                    "file_additions": 69,
                    "file_deletions": 80,
                    "file_exists": true,
                    "file_name": "buildSrc/src/main/java/org/elasticsearch/gradle/testclusters/TestClustersPlugin.java",
                    "file_size": 9043
                },
                {
                    "file_additions": 66,
                    "file_deletions": 55,
                    "file_exists": true,
                    "file_name": "buildSrc/src/main/java/org/elasticsearch/gradle/testfixtures/TestFixturesPlugin.java",
                    "file_size": 10842
                },
                {
                    "file_additions": 23,
                    "file_deletions": 0,
                    "file_exists": false,
                    "file_name": "buildSrc/src/main/java/org/elasticsearch/gradle/tool/ClasspathUtils.java",
                    "file_size": 0
                },
                {
                    "file_additions": 0,
                    "file_deletions": 0,
                    "file_exists": false,
                    "file_name": "buildSrc/src/minimumRuntime/java/org/elasticsearch/gradle/JdkJarHellCheck.java",
                    "file_size": 0
                },
                {
                    "file_additions": 0,
                    "file_deletions": 0,
                    "file_exists": false,
                    "file_name": "buildSrc/src/minimumRuntime/java/org/elasticsearch/gradle/LazyFileOutputStream.java",
                    "file_size": 0
                },
                {
                    "file_additions": 129,
                    "file_deletions": 0,
                    "file_exists": false,
                    "file_name": "buildSrc/src/minimumRuntime/java/org/elasticsearch/gradle/LoggedExec.java",
                    "file_size": 0
                },
                {
                    "file_additions": 0,
                    "file_deletions": 0,
                    "file_exists": false,
                    "file_name": "buildSrc/src/minimumRuntime/java/org/elasticsearch/gradle/Version.java",
                    "file_size": 0
                },
                {
                    "file_additions": 0,
                    "file_deletions": 0,
                    "file_exists": false,
                    "file_name": "buildSrc/src/minimumRuntime/java/org/elasticsearch/gradle/VersionProperties.java",
                    "file_size": 0
                },
                {
                    "file_additions": 136,
                    "file_deletions": 0,
                    "file_exists": false,
                    "file_name": "buildSrc/src/test/java/org/elasticsearch/gradle/DistributionDownloadPluginIT.java",
                    "file_size": 0
                },
                {
                    "file_additions": 260,
                    "file_deletions": 0,
                    "file_exists": true,
                    "file_name": "buildSrc/src/test/java/org/elasticsearch/gradle/DistributionDownloadPluginTests.java",
                    "file_size": 13572
                },
                {
                    "file_additions": 78,
                    "file_deletions": 0,
                    "file_exists": true,
                    "file_name": "buildSrc/src/test/java/org/elasticsearch/gradle/EmptyDirTaskTests.java",
                    "file_size": 2685
                },
                {
                    "file_additions": 58,
                    "file_deletions": 0,
                    "file_exists": true,
                    "file_name": "buildSrc/src/test/java/org/elasticsearch/gradle/plugin/PluginPropertiesExtensionTests.java",
                    "file_size": 1810
                },
                {
                    "file_additions": 268,
                    "file_deletions": 0,
                    "file_exists": false,
                    "file_name": "buildSrc/src/test/java/org/elasticsearch/gradle/precommit/DependencyLicensesTaskTests.java",
                    "file_size": 0
                },
                {
                    "file_additions": 140,
                    "file_deletions": 0,
                    "file_exists": false,
                    "file_name": "buildSrc/src/test/java/org/elasticsearch/gradle/precommit/UpdateShasTaskTests.java",
                    "file_size": 0
                },
                {
                    "file_additions": 0,
                    "file_deletions": 4,
                    "file_exists": true,
                    "file_name": "client/benchmark/src/main/java/org/elasticsearch/client/benchmark/BenchmarkMain.java",
                    "file_size": 1127
                },
                {
                    "file_additions": 0,
                    "file_deletions": 127,
                    "file_exists": false,
                    "file_name": "client/benchmark/src/main/java/org/elasticsearch/client/benchmark/transport/TransportClientBenchmark.java",
                    "file_size": 0
                },
                {
                    "file_additions": 2,
                    "file_deletions": 2,
                    "file_exists": true,
                    "file_name": "client/client-benchmark-noop-api-plugin/src/main/java/org/elasticsearch/plugin/noop/action/bulk/NoopBulkAction.java",
                    "file_size": 780
                },
                {
                    "file_additions": 2,
                    "file_deletions": 7,
                    "file_exists": true,
                    "file_name": "client/client-benchmark-noop-api-plugin/src/main/java/org/elasticsearch/plugin/noop/action/search/NoopSearchAction.java",
                    "file_size": 798
                },
                {
                    "file_additions": 2,
                    "file_deletions": 1,
                    "file_exists": true,
                    "file_name": "client/rest-high-level/src/main/java/org/elasticsearch/client/CcrRequestConverters.java",
                    "file_size": 7077
                },
                {
                    "file_additions": 6,
                    "file_deletions": 6,
                    "file_exists": true,
                    "file_name": "client/rest-high-level/src/main/java/org/elasticsearch/client/ClusterRequestConverters.java",
                    "file_size": 7028
                },
                {
                    "file_additions": 27,
                    "file_deletions": 15,
                    "file_exists": false,
                    "file_name": "client/rest-high-level/src/main/java/org/elasticsearch/client/DataFrameRequestConverters.java",
                    "file_size": 0
                },
                {
                    "file_additions": 18,
                    "file_deletions": 9,
                    "file_exists": true,
                    "file_name": "client/rest-high-level/src/main/java/org/elasticsearch/client/IndexLifecycleRequestConverters.java",
                    "file_size": 14173
                },
                {
                    "file_additions": 28,
                    "file_deletions": 2,
                    "file_exists": true,
                    "file_name": "client/rest-high-level/src/main/java/org/elasticsearch/client/IndicesClient.java",
                    "file_size": 87672
                },
                {
                    "file_additions": 83,
                    "file_deletions": 54,
                    "file_exists": true,
                    "file_name": "client/rest-high-level/src/main/java/org/elasticsearch/client/IndicesRequestConverters.java",
                    "file_size": 34907
                },
                {
                    "file_additions": 8,
                    "file_deletions": 6,
                    "file_exists": true,
                    "file_name": "client/rest-high-level/src/main/java/org/elasticsearch/client/IngestRequestConverters.java",
                    "file_size": 3907
                },
                {
                    "file_additions": 10,
                    "file_deletions": 5,
                    "file_exists": true,
                    "file_name": "client/rest-high-level/src/main/java/org/elasticsearch/client/LicenseRequestConverters.java",
                    "file_size": 4337
                },
                {
                    "file_additions": 141,
                    "file_deletions": 15,
                    "file_exists": true,
                    "file_name": "client/rest-high-level/src/main/java/org/elasticsearch/client/MLRequestConverters.java",
                    "file_size": 45819
                },
                {
                    "file_additions": 294,
                    "file_deletions": 0,
                    "file_exists": true,
                    "file_name": "client/rest-high-level/src/main/java/org/elasticsearch/client/MachineLearningClient.java",
                    "file_size": 137368
                },
                {
                    "file_additions": 68,
                    "file_deletions": 48,
                    "file_exists": true,
                    "file_name": "client/rest-high-level/src/main/java/org/elasticsearch/client/RequestConverters.java",
                    "file_size": 55576
                },
                {
                    "file_additions": 2,
                    "file_deletions": 11,
                    "file_exists": true,
                    "file_name": "client/rest-high-level/src/main/java/org/elasticsearch/client/RollupRequestConverters.java",
                    "file_size": 4627
                },
                {
                    "file_additions": 30,
                    "file_deletions": 0,
                    "file_exists": true,
                    "file_name": "client/rest-high-level/src/main/java/org/elasticsearch/client/SecurityClient.java",
                    "file_size": 68468
                },
                {
                    "file_additions": 25,
                    "file_deletions": 13,
                    "file_exists": true,
                    "file_name": "client/rest-high-level/src/main/java/org/elasticsearch/client/SecurityRequestConverters.java",
                    "file_size": 16892
                },
                {
                    "file_additions": 22,
                    "file_deletions": 13,
                    "file_exists": true,
                    "file_name": "client/rest-high-level/src/main/java/org/elasticsearch/client/SnapshotRequestConverters.java",
                    "file_size": 10996
                },
                {
                    "file_additions": 6,
                    "file_deletions": 3,
                    "file_exists": true,
                    "file_name": "client/rest-high-level/src/main/java/org/elasticsearch/client/TasksRequestConverters.java",
                    "file_size": 3034
                },
                {
                    "file_additions": 6,
                    "file_deletions": 4,
                    "file_exists": true,
                    "file_name": "client/rest-high-level/src/main/java/org/elasticsearch/client/WatcherRequestConverters.java",
                    "file_size": 7123
                },
                {
                    "file_additions": 2,
                    "file_deletions": 2,
                    "file_exists": true,
                    "file_name": "client/rest-high-level/src/main/java/org/elasticsearch/client/XPackClient.java",
                    "file_size": 4379
                },
                {
                    "file_additions": 2,
                    "file_deletions": 1,
                    "file_exists": true,
                    "file_name": "client/rest-high-level/src/main/java/org/elasticsearch/client/XPackRequestConverters.java",
                    "file_size": 1681
                },
                {
                    "file_additions": 45,
                    "file_deletions": 35,
                    "file_exists": true,
                    "file_name": "client/rest-high-level/src/main/java/org/elasticsearch/client/ccr/IndicesFollowStats.java",
                    "file_size": 19857
                },
                {
                    "file_additions": 6,
                    "file_deletions": 2,
                    "file_exists": true,
                    "file_name": "client/rest-high-level/src/main/java/org/elasticsearch/client/core/BroadcastResponse.java",
                    "file_size": 5970
                },
                {
                    "file_additions": 7,
                    "file_deletions": 23,
                    "file_exists": true,
                    "file_name": "client/rest-high-level/src/main/java/org/elasticsearch/client/core/TermVectorsResponse.java",
                    "file_size": 16913
                },
                {
                    "file_additions": 41,
                    "file_deletions": 0,
                    "file_exists": false,
                    "file_name": "client/rest-high-level/src/main/java/org/elasticsearch/client/dataframe/DataFrameNamedXContentProvider.java",
                    "file_size": 0
                },
                {
                    "file_additions": 14,
                    "file_deletions": 2,
                    "file_exists": false,
                    "file_name": "client/rest-high-level/src/main/java/org/elasticsearch/client/dataframe/GetDataFrameTransformRequest.java",
                    "file_size": 0
                },
                {
                    "file_additions": 13,
                    "file_deletions": 2,
                    "file_exists": false,
                    "file_name": "client/rest-high-level/src/main/java/org/elasticsearch/client/dataframe/GetDataFrameTransformStatsRequest.java",
                    "file_size": 0
                },
                {
                    "file_additions": 14,
                    "file_deletions": 5,
                    "file_exists": false,
                    "file_name": "client/rest-high-level/src/main/java/org/elasticsearch/client/dataframe/PreviewDataFrameTransformResponse.java",
                    "file_size": 0
                },
                {
                    "file_additions": 5,
                    "file_deletions": 7,
                    "file_exists": false,
                    "file_name": "client/rest-high-level/src/main/java/org/elasticsearch/client/dataframe/StartDataFrameTransformResponse.java",
                    "file_size": 0
                },
                {
                    "file_additions": 12,
                    "file_deletions": 2,
                    "file_exists": false,
                    "file_name": "client/rest-high-level/src/main/java/org/elasticsearch/client/dataframe/StopDataFrameTransformRequest.java",
                    "file_size": 0
                },
                {
                    "file_additions": 5,
                    "file_deletions": 8,
                    "file_exists": false,
                    "file_name": "client/rest-high-level/src/main/java/org/elasticsearch/client/dataframe/StopDataFrameTransformResponse.java",
                    "file_size": 0
                },
                {
                    "file_additions": 83,
                    "file_deletions": 11,
                    "file_exists": false,
                    "file_name": "client/rest-high-level/src/main/java/org/elasticsearch/client/dataframe/transforms/DataFrameTransformConfig.java",
                    "file_size": 0
                },
                {
                    "file_additions": 15,
                    "file_deletions": 3,
                    "file_exists": false,
                    "file_name": "client/rest-high-level/src/main/java/org/elasticsearch/client/dataframe/transforms/DataFrameTransformState.java",
                    "file_size": 0
                },
                {
                    "file_additions": 50,
                    "file_deletions": 4,
                    "file_exists": false,
                    "file_name": "client/rest-high-level/src/main/java/org/elasticsearch/client/dataframe/transforms/DestConfig.java",
                    "file_size": 0
                },
                {
                    "file_additions": 156,
                    "file_deletions": 0,
                    "file_exists": false,
                    "file_name": "client/rest-high-level/src/main/java/org/elasticsearch/client/dataframe/transforms/NodeAttributes.java",
                    "file_size": 0
                },
                {
                    "file_additions": 30,
                    "file_deletions": 0,
                    "file_exists": false,
                    "file_name": "client/rest-high-level/src/main/java/org/elasticsearch/client/dataframe/transforms/SyncConfig.java",
                    "file_size": 0
                },
                {
                    "file_additions": 108,
                    "file_deletions": 0,
                    "file_exists": false,
                    "file_name": "client/rest-high-level/src/main/java/org/elasticsearch/client/dataframe/transforms/TimeSyncConfig.java",
                    "file_size": 0
                },
                {
                    "file_additions": 5,
                    "file_deletions": 30,
                    "file_exists": false,
                    "file_name": "client/rest-high-level/src/main/java/org/elasticsearch/client/dataframe/transforms/pivot/DateHistogramGroupSource.java",
                    "file_size": 0
                },
                {
                    "file_additions": 59,
                    "file_deletions": 0,
                    "file_exists": false,
                    "file_name": "client/rest-high-level/src/main/java/org/elasticsearch/client/dataframe/transforms/util/TimeUtil.java",
                    "file_size": 0
                },
                {
                    "file_additions": 343,
                    "file_deletions": 0,
                    "file_exists": true,
                    "file_name": "client/rest-high-level/src/main/java/org/elasticsearch/client/indices/AnalyzeRequest.java",
                    "file_size": 10049
                },
                {
                    "file_additions": 183,
                    "file_deletions": 0,
                    "file_exists": true,
                    "file_name": "client/rest-high-level/src/main/java/org/elasticsearch/client/indices/AnalyzeResponse.java",
                    "file_size": 5809
                },
                {
                    "file_additions": 214,
                    "file_deletions": 0,
                    "file_exists": true,
                    "file_name": "client/rest-high-level/src/main/java/org/elasticsearch/client/indices/DetailAnalyzeResponse.java",
                    "file_size": 7493
                },
                {
                    "file_additions": 68,
                    "file_deletions": 0,
                    "file_exists": true,
                    "file_name": "client/rest-high-level/src/main/java/org/elasticsearch/client/indices/ReloadAnalyzersRequest.java",
                    "file_size": 1870
                },
                {
                    "file_additions": 108,
                    "file_deletions": 0,
                    "file_exists": true,
                    "file_name": "client/rest-high-level/src/main/java/org/elasticsearch/client/indices/ReloadAnalyzersResponse.java",
                    "file_size": 3881
                },
                {
                    "file_additions": 64,
                    "file_deletions": 0,
                    "file_exists": true,
                    "file_name": "client/rest-high-level/src/main/java/org/elasticsearch/client/ml/DeleteDataFrameAnalyticsRequest.java",
                    "file_size": 2384
                },
                {
                    "file_additions": 136,
                    "file_deletions": 0,
                    "file_exists": true,
                    "file_name": "client/rest-high-level/src/main/java/org/elasticsearch/client/ml/EvaluateDataFrameRequest.java",
                    "file_size": 5618
                },
                {
                    "file_additions": 117,
                    "file_deletions": 0,
                    "file_exists": true,
                    "file_name": "client/rest-high-level/src/main/java/org/elasticsearch/client/ml/EvaluateDataFrameResponse.java",
                    "file_size": 4466
                },
                {
                    "file_additions": 16,
                    "file_deletions": 2,
                    "file_exists": false,
                    "file_name": "client/rest-high-level/src/main/java/org/elasticsearch/client/ml/FindFileStructureRequest.java",
                    "file_size": 0
                },
                {
                    "file_additions": 104,
                    "file_deletions": 0,
                    "file_exists": true,
                    "file_name": "client/rest-high-level/src/main/java/org/elasticsearch/client/ml/GetDataFrameAnalyticsRequest.java",
                    "file_size": 3693
                },
                {
                    "file_additions": 74,
                    "file_deletions": 0,
                    "file_exists": true,
                    "file_name": "client/rest-high-level/src/main/java/org/elasticsearch/client/ml/GetDataFrameAnalyticsResponse.java",
                    "file_size": 2200
                },
                {
                    "file_additions": 99,
                    "file_deletions": 0,
                    "file_exists": true,
                    "file_name": "client/rest-high-level/src/main/java/org/elasticsearch/client/ml/GetDataFrameAnalyticsStatsRequest.java",
                    "file_size": 2773
                },
                {
                    "file_additions": 102,
                    "file_deletions": 0,
                    "file_exists": true,
                    "file_name": "client/rest-high-level/src/main/java/org/elasticsearch/client/ml/GetDataFrameAnalyticsStatsResponse.java",
                    "file_size": 4026
                },
                {
                    "file_additions": 6,
                    "file_deletions": 0,
                    "file_exists": true,
                    "file_name": "client/rest-high-level/src/main/java/org/elasticsearch/client/ml/NodeAttributes.java",
                    "file_size": 4999
                },
                {
                    "file_additions": 76,
                    "file_deletions": 0,
                    "file_exists": true,
                    "file_name": "client/rest-high-level/src/main/java/org/elasticsearch/client/ml/PutDataFrameAnalyticsRequest.java",
                    "file_size": 2043
                },
                {
                    "file_additions": 57,
                    "file_deletions": 0,
                    "file_exists": true,
                    "file_name": "client/rest-high-level/src/main/java/org/elasticsearch/client/ml/PutDataFrameAnalyticsResponse.java",
                    "file_size": 1461
                },
                {
                    "file_additions": 74,
                    "file_deletions": 0,
                    "file_exists": true,
                    "file_name": "client/rest-high-level/src/main/java/org/elasticsearch/client/ml/StartDataFrameAnalyticsRequest.java",
                    "file_size": 1804
                },
                {
                    "file_additions": 100,
                    "file_deletions": 0,
                    "file_exists": true,
                    "file_name": "client/rest-high-level/src/main/java/org/elasticsearch/client/ml/StopDataFrameAnalyticsRequest.java",
                    "file_size": 2604
                },
                {
                    "file_additions": 87,
                    "file_deletions": 0,
                    "file_exists": true,
                    "file_name": "client/rest-high-level/src/main/java/org/elasticsearch/client/ml/StopDataFrameAnalyticsResponse.java",
                    "file_size": 2501
                },
                {
                    "file_additions": 27,
                    "file_deletions": 0,
                    "file_exists": true,
                    "file_name": "client/rest-high-level/src/main/java/org/elasticsearch/client/ml/dataframe/DataFrameAnalysis.java",
                    "file_size": 550
                },
                {
                    "file_additions": 259,
                    "file_deletions": 0,
                    "file_exists": true,
                    "file_name": "client/rest-high-level/src/main/java/org/elasticsearch/client/ml/dataframe/DataFrameAnalyticsConfig.java",
                    "file_size": 11785
                },
                {
                    "file_additions": 123,
                    "file_deletions": 0,
                    "file_exists": true,
                    "file_name": "client/rest-high-level/src/main/java/org/elasticsearch/client/ml/dataframe/DataFrameAnalyticsDest.java",
                    "file_size": 3401
                },
                {
                    "file_additions": 128,
                    "file_deletions": 0,
                    "file_exists": true,
                    "file_name": "client/rest-high-level/src/main/java/org/elasticsearch/client/ml/dataframe/DataFrameAnalyticsSource.java",
                    "file_size": 5619
                },
                {
                    "file_additions": 34,
                    "file_deletions": 0,
                    "file_exists": true,
                    "file_name": "client/rest-high-level/src/main/java/org/elasticsearch/client/ml/dataframe/DataFrameAnalyticsState.java",
                    "file_size": 762
                },
                {
                    "file_additions": 145,
                    "file_deletions": 0,
                    "file_exists": true,
                    "file_name": "client/rest-high-level/src/main/java/org/elasticsearch/client/ml/dataframe/DataFrameAnalyticsStats.java",
                    "file_size": 7399
                },
                {
                    "file_additions": 37,
                    "file_deletions": 0,
                    "file_exists": true,
                    "file_name": "client/rest-high-level/src/main/java/org/elasticsearch/client/ml/dataframe/MlDataFrameAnalysisNamedXContentProvider.java",
                    "file_size": 1334
                },
                {
                    "file_additions": 175,
                    "file_deletions": 0,
                    "file_exists": true,
                    "file_name": "client/rest-high-level/src/main/java/org/elasticsearch/client/ml/dataframe/OutlierDetection.java",
                    "file_size": 8142
                },
                {
                    "file_additions": 82,
                    "file_deletions": 0,
                    "file_exists": true,
                    "file_name": "client/rest-high-level/src/main/java/org/elasticsearch/client/ml/dataframe/QueryConfig.java",
                    "file_size": 2112
                },
                {
                    "file_additions": 32,
                    "file_deletions": 0,
                    "file_exists": true,
                    "file_name": "client/rest-high-level/src/main/java/org/elasticsearch/client/ml/dataframe/evaluation/Evaluation.java",
                    "file_size": 637
                },
                {
                    "file_additions": 43,
                    "file_deletions": 0,
                    "file_exists": true,
                    "file_name": "client/rest-high-level/src/main/java/org/elasticsearch/client/ml/dataframe/evaluation/EvaluationMetric.java",
                    "file_size": 865
                },
                {
                    "file_additions": 57,
                    "file_deletions": 0,
                    "file_exists": true,
                    "file_name": "client/rest-high-level/src/main/java/org/elasticsearch/client/ml/dataframe/evaluation/MlEvaluationNamedXContentProvider.java",
                    "file_size": 10359
                },
                {
                    "file_additions": 47,
                    "file_deletions": 0,
                    "file_exists": false,
                    "file_name": "client/rest-high-level/src/main/java/org/elasticsearch/client/ml/dataframe/evaluation/softclassification/AbstractConfusionMatrixMetric.java",
                    "file_size": 0
                },
                {
                    "file_additions": 241,
                    "file_deletions": 0,
                    "file_exists": false,
                    "file_name": "client/rest-high-level/src/main/java/org/elasticsearch/client/ml/dataframe/evaluation/softclassification/AucRocMetric.java",
                    "file_size": 0
                },
                {
                    "file_additions": 129,
                    "file_deletions": 0,
                    "file_exists": false,
                    "file_name": "client/rest-high-level/src/main/java/org/elasticsearch/client/ml/dataframe/evaluation/softclassification/BinarySoftClassification.java",
                    "file_size": 0
                },
                {
                    "file_additions": 206,
                    "file_deletions": 0,
                    "file_exists": false,
                    "file_name": "client/rest-high-level/src/main/java/org/elasticsearch/client/ml/dataframe/evaluation/softclassification/ConfusionMatrixMetric.java",
                    "file_size": 0
                },
                {
                    "file_additions": 123,
                    "file_deletions": 0,
                    "file_exists": false,
                    "file_name": "client/rest-high-level/src/main/java/org/elasticsearch/client/ml/dataframe/evaluation/softclassification/PrecisionMetric.java",
                    "file_size": 0
                },
                {
                    "file_additions": 123,
                    "file_deletions": 0,
                    "file_exists": false,
                    "file_name": "client/rest-high-level/src/main/java/org/elasticsearch/client/ml/dataframe/evaluation/softclassification/RecallMetric.java",
                    "file_size": 0
                },
                {
                    "file_additions": 27,
                    "file_deletions": 3,
                    "file_exists": false,
                    "file_name": "client/rest-high-level/src/main/java/org/elasticsearch/client/ml/filestructurefinder/FieldStats.java",
                    "file_size": 0
                },
                {
                    "file_additions": 159,
                    "file_deletions": 0,
                    "file_exists": true,
                    "file_name": "client/rest-high-level/src/main/java/org/elasticsearch/client/ml/job/process/TimingStats.java",
                    "file_size": 9074
                },
                {
                    "file_additions": 19,
                    "file_deletions": 4,
                    "file_exists": true,
                    "file_name": "client/rest-high-level/src/main/java/org/elasticsearch/client/ml/job/stats/JobStats.java",
                    "file_size": 9195
                },
                {
                    "file_additions": 29,
                    "file_deletions": 5,
                    "file_exists": true,
                    "file_name": "client/rest-high-level/src/main/java/org/elasticsearch/client/security/CreateTokenRequest.java",
                    "file_size": 5868
                },
                {
                    "file_additions": 14,
                    "file_deletions": 5,
                    "file_exists": true,
                    "file_name": "client/rest-high-level/src/main/java/org/elasticsearch/client/security/CreateTokenResponse.java",
                    "file_size": 4582
                },
                {
                    "file_additions": 40,
                    "file_deletions": 0,
                    "file_exists": true,
                    "file_name": "client/rest-high-level/src/main/java/org/elasticsearch/client/security/GetBuiltinPrivilegesRequest.java",
                    "file_size": 980
                },
                {
                    "file_additions": 82,
                    "file_deletions": 0,
                    "file_exists": true,
                    "file_name": "client/rest-high-level/src/main/java/org/elasticsearch/client/security/GetBuiltinPrivilegesResponse.java",
                    "file_size": 2487
                },
                {
                    "file_additions": 5,
                    "file_deletions": 2,
                    "file_exists": true,
                    "file_name": "client/rest-high-level/src/main/java/org/elasticsearch/client/security/user/privileges/Role.java",
                    "file_size": 18026
                },
                {
                    "file_additions": 5,
                    "file_deletions": 5,
                    "file_exists": true,
                    "file_name": "client/rest-high-level/src/main/java/org/elasticsearch/client/xpack/XPackInfoResponse.java",
                    "file_size": 14167
                },
                {
                    "file_additions": 70,
                    "file_deletions": 0,
                    "file_exists": false,
                    "file_name": "client/rest-high-level/src/test/java/org/elasticsearch/client/AbstractHlrcWriteableXContentTestCase.java",
                    "file_size": 0
                },
                {
                    "file_additions": 5,
                    "file_deletions": 1,
                    "file_exists": true,
                    "file_name": "client/rest-high-level/src/test/java/org/elasticsearch/client/AbstractResponseTestCase.java",
                    "file_size": 4205
                },
                {
                    "file_additions": 0,
                    "file_deletions": 2,
                    "file_exists": true,
                    "file_name": "client/rest-high-level/src/test/java/org/elasticsearch/client/BulkProcessorIT.java",
                    "file_size": 21405
                },
                {
                    "file_additions": 0,
                    "file_deletions": 5,
                    "file_exists": true,
                    "file_name": "client/rest-high-level/src/test/java/org/elasticsearch/client/BulkRequestWithGlobalParametersIT.java",
                    "file_size": 7227
                },
                {
                    "file_additions": 23,
                    "file_deletions": 3,
                    "file_exists": false,
                    "file_name": "client/rest-high-level/src/test/java/org/elasticsearch/client/DataFrameRequestConvertersTests.java",
                    "file_size": 0
                },
                {
                    "file_additions": 47,
                    "file_deletions": 30,
                    "file_exists": false,
                    "file_name": "client/rest-high-level/src/test/java/org/elasticsearch/client/DataFrameTransformIT.java",
                    "file_size": 0
                },
                {
                    "file_additions": 1,
                    "file_deletions": 1,
                    "file_exists": true,
                    "file_name": "client/rest-high-level/src/test/java/org/elasticsearch/client/ESRestHighLevelClientTestCase.java",
                    "file_size": 15768
                },
                {
                    "file_additions": 16,
                    "file_deletions": 4,
                    "file_exists": true,
                    "file_name": "client/rest-high-level/src/test/java/org/elasticsearch/client/IndicesClientIT.java",
                    "file_size": 100961
                },
                {
                    "file_additions": 22,
                    "file_deletions": 8,
                    "file_exists": true,
                    "file_name": "client/rest-high-level/src/test/java/org/elasticsearch/client/IndicesRequestConvertersTests.java",
                    "file_size": 50260
                },
                {
                    "file_additions": 136,
                    "file_deletions": 1,
                    "file_exists": true,
                    "file_name": "client/rest-high-level/src/test/java/org/elasticsearch/client/MLRequestConvertersTests.java",
                    "file_size": 61204
                },
                {
                    "file_additions": 452,
                    "file_deletions": 65,
                    "file_exists": true,
                    "file_name": "client/rest-high-level/src/test/java/org/elasticsearch/client/MachineLearningIT.java",
                    "file_size": 163196
                },
                {
                    "file_additions": 13,
                    "file_deletions": 0,
                    "file_exists": true,
                    "file_name": "client/rest-high-level/src/test/java/org/elasticsearch/client/MlTestStateCleaner.java",
                    "file_size": 5405
                },
                {
                    "file_additions": 1,
                    "file_deletions": 12,
                    "file_exists": true,
                    "file_name": "client/rest-high-level/src/test/java/org/elasticsearch/client/PingAndInfoIT.java",
                    "file_size": 4045
                },
                {
                    "file_additions": 20,
                    "file_deletions": 45,
                    "file_exists": true,
                    "file_name": "client/rest-high-level/src/test/java/org/elasticsearch/client/RequestConvertersTests.java",
                    "file_size": 104333
                },
                {
                    "file_additions": 24,
                    "file_deletions": 4,
                    "file_exists": true,
                    "file_name": "client/rest-high-level/src/test/java/org/elasticsearch/client/RestHighLevelClientTests.java",
                    "file_size": 70715
                },
                {
                    "file_additions": 4,
                    "file_deletions": 18,
                    "file_exists": true,
                    "file_name": "client/rest-high-level/src/test/java/org/elasticsearch/client/RollupIT.java",
                    "file_size": 24186
                },
                {
                    "file_additions": 2,
                    "file_deletions": 2,
                    "file_exists": true,
                    "file_name": "client/rest-high-level/src/test/java/org/elasticsearch/client/SecurityRequestConvertersTests.java",
                    "file_size": 29761
                },
                {
                    "file_additions": 78,
                    "file_deletions": 31,
                    "file_exists": true,
                    "file_name": "client/rest-high-level/src/test/java/org/elasticsearch/client/SnapshotIT.java",
                    "file_size": 22556
                },
                {
                    "file_additions": 12,
                    "file_deletions": 6,
                    "file_exists": true,
                    "file_name": "client/rest-high-level/src/test/java/org/elasticsearch/client/SnapshotRequestConvertersTests.java",
                    "file_size": 14216
                },
                {
                    "file_additions": 2,
                    "file_deletions": 17,
                    "file_exists": true,
                    "file_name": "client/rest-high-level/src/test/java/org/elasticsearch/client/XPackInfoResponseTests.java",
                    "file_size": 4187
                },
                {
                    "file_additions": 3,
                    "file_deletions": 0,
                    "file_exists": true,
                    "file_name": "client/rest-high-level/src/test/java/org/elasticsearch/client/ccr/CcrStatsResponseTests.java",
                    "file_size": 14019
                },
                {
                    "file_additions": 2,
                    "file_deletions": 0,
                    "file_exists": true,
                    "file_name": "client/rest-high-level/src/test/java/org/elasticsearch/client/ccr/FollowStatsResponseTests.java",
                    "file_size": 8271
                },
                {
                    "file_additions": 3,
                    "file_deletions": 5,
                    "file_exists": true,
                    "file_name": "client/rest-high-level/src/test/java/org/elasticsearch/client/core/TermVectorsResponseTests.java",
                    "file_size": 9490
                },
                {
                    "file_additions": 5,
                    "file_deletions": 2,
                    "file_exists": false,
                    "file_name": "client/rest-high-level/src/test/java/org/elasticsearch/client/dataframe/GetDataFrameTransformResponseTests.java",
                    "file_size": 0
                },
                {
                    "file_additions": 6,
                    "file_deletions": 2,
                    "file_exists": false,
                    "file_name": "client/rest-high-level/src/test/java/org/elasticsearch/client/dataframe/PreviewDataFrameTransformRequestTests.java",
                    "file_size": 0
                },
                {
                    "file_additions": 7,
                    "file_deletions": 1,
                    "file_exists": false,
                    "file_name": "client/rest-high-level/src/test/java/org/elasticsearch/client/dataframe/PreviewDataFrameTransformResponseTests.java",
                    "file_size": 0
                },
                {
                    "file_additions": 6,
                    "file_deletions": 2,
                    "file_exists": false,
                    "file_name": "client/rest-high-level/src/test/java/org/elasticsearch/client/dataframe/PutDataFrameTransformRequestTests.java",
                    "file_size": 0
                },
                {
                    "file_additions": 21,
                    "file_deletions": 4,
                    "file_exists": false,
                    "file_name": "client/rest-high-level/src/test/java/org/elasticsearch/client/dataframe/transforms/DataFrameTransformConfigTests.java",
                    "file_size": 0
                },
                {
                    "file_additions": 9,
                    "file_deletions": 2,
                    "file_exists": false,
                    "file_name": "client/rest-high-level/src/test/java/org/elasticsearch/client/dataframe/transforms/DataFrameTransformStateTests.java",
                    "file_size": 0
                },
                {
                    "file_additions": 2,
                    "file_deletions": 1,
                    "file_exists": false,
                    "file_name": "client/rest-high-level/src/test/java/org/elasticsearch/client/dataframe/transforms/DestConfigTests.java",
                    "file_size": 0
                },
                {
                    "file_additions": 64,
                    "file_deletions": 0,
                    "file_exists": false,
                    "file_name": "client/rest-high-level/src/test/java/org/elasticsearch/client/dataframe/transforms/NodeAttributesTests.java",
                    "file_size": 0
                },
                {
                    "file_additions": 1,
                    "file_deletions": 1,
                    "file_exists": false,
                    "file_name": "client/rest-high-level/src/test/java/org/elasticsearch/client/dataframe/transforms/QueryConfigTests.java",
                    "file_size": 0
                },
                {
                    "file_additions": 1,
                    "file_deletions": 1,
                    "file_exists": false,
                    "file_name": "client/rest-high-level/src/test/java/org/elasticsearch/client/dataframe/transforms/SourceConfigTests.java",
                    "file_size": 0
                },
                {
                    "file_additions": 49,
                    "file_deletions": 0,
                    "file_exists": false,
                    "file_name": "client/rest-high-level/src/test/java/org/elasticsearch/client/dataframe/transforms/TimeSyncConfigTests.java",
                    "file_size": 0
                },
                {
                    "file_additions": 1,
                    "file_deletions": 1,
                    "file_exists": false,
                    "file_name": "client/rest-high-level/src/test/java/org/elasticsearch/client/dataframe/transforms/hlrc/DataFrameTransformStateAndStatsTests.java",
                    "file_size": 0
                },
                {
                    "file_additions": 32,
                    "file_deletions": 4,
                    "file_exists": false,
                    "file_name": "client/rest-high-level/src/test/java/org/elasticsearch/client/dataframe/transforms/hlrc/DataFrameTransformStateTests.java",
                    "file_size": 0
                },
                {
                    "file_additions": 59,
                    "file_deletions": 0,
                    "file_exists": false,
                    "file_name": "client/rest-high-level/src/test/java/org/elasticsearch/client/dataframe/transforms/hlrc/TimeSyncConfigTests.java",
                    "file_size": 0
                },
                {
                    "file_additions": 1,
                    "file_deletions": 1,
                    "file_exists": false,
                    "file_name": "client/rest-high-level/src/test/java/org/elasticsearch/client/dataframe/transforms/pivot/AggregationConfigTests.java",
                    "file_size": 0
                },
                {
                    "file_additions": 0,
                    "file_deletions": 1,
                    "file_exists": false,
                    "file_name": "client/rest-high-level/src/test/java/org/elasticsearch/client/dataframe/transforms/pivot/DateHistogramGroupSourceTests.java",
                    "file_size": 0
                },
                {
                    "file_additions": 1,
                    "file_deletions": 1,
                    "file_exists": false,
                    "file_name": "client/rest-high-level/src/test/java/org/elasticsearch/client/dataframe/transforms/pivot/PivotConfigTests.java",
                    "file_size": 0
                },
                {
                    "file_additions": 0,
                    "file_deletions": 4,
                    "file_exists": false,
                    "file_name": "client/rest-high-level/src/test/java/org/elasticsearch/client/dataframe/transforms/pivot/hlrc/DateHistogramGroupSourceTests.java",
                    "file_size": 0
                },
                {
                    "file_additions": 12,
                    "file_deletions": 13,
                    "file_exists": true,
                    "file_name": "client/rest-high-level/src/test/java/org/elasticsearch/client/documentation/CRUDDocumentationIT.java",
                    "file_size": 90786
                },
                {
                    "file_additions": 30,
                    "file_deletions": 11,
                    "file_exists": false,
                    "file_name": "client/rest-high-level/src/test/java/org/elasticsearch/client/documentation/DataFrameTransformDocumentationIT.java",
                    "file_size": 0
                },
                {
                    "file_additions": 103,
                    "file_deletions": 33,
                    "file_exists": true,
                    "file_name": "client/rest-high-level/src/test/java/org/elasticsearch/client/documentation/IndicesClientDocumentationIT.java",
                    "file_size": 140278
                },
                {
                    "file_additions": 2,
                    "file_deletions": 2,
                    "file_exists": true,
                    "file_name": "client/rest-high-level/src/test/java/org/elasticsearch/client/documentation/LicensingDocumentationIT.java",
                    "file_size": 15916
                },
                {
                    "file_additions": 532,
                    "file_deletions": 38,
                    "file_exists": true,
                    "file_name": "client/rest-high-level/src/test/java/org/elasticsearch/client/documentation/MlClientDocumentationIT.java",
                    "file_size": 213670
                },
                {
                    "file_additions": 0,
                    "file_deletions": 8,
                    "file_exists": false,
                    "file_name": "client/rest-high-level/src/test/java/org/elasticsearch/client/documentation/QueryDSLDocumentationTests.java",
                    "file_size": 0
                },
                {
                    "file_additions": 58,
                    "file_deletions": 3,
                    "file_exists": true,
                    "file_name": "client/rest-high-level/src/test/java/org/elasticsearch/client/documentation/SecurityDocumentationIT.java",
                    "file_size": 125060
                },
                {
                    "file_additions": 3,
                    "file_deletions": 3,
                    "file_exists": true,
                    "file_name": "client/rest-high-level/src/test/java/org/elasticsearch/client/documentation/SnapshotClientDocumentationIT.java",
                    "file_size": 35012
                },
                {
                    "file_additions": 58,
                    "file_deletions": 0,
                    "file_exists": true,
                    "file_name": "client/rest-high-level/src/test/java/org/elasticsearch/client/indices/AnalyzeGlobalRequestTests.java",
                    "file_size": 1975
                },
                {
                    "file_additions": 62,
                    "file_deletions": 0,
                    "file_exists": true,
                    "file_name": "client/rest-high-level/src/test/java/org/elasticsearch/client/indices/AnalyzeIndexRequestTests.java",
                    "file_size": 2240
                },
                {
                    "file_additions": 54,
                    "file_deletions": 0,
                    "file_exists": true,
                    "file_name": "client/rest-high-level/src/test/java/org/elasticsearch/client/indices/AnalyzeRequestTests.java",
                    "file_size": 2525
                },
                {
                    "file_additions": 174,
                    "file_deletions": 0,
                    "file_exists": true,
                    "file_name": "client/rest-high-level/src/test/java/org/elasticsearch/client/indices/AnalyzeResponseTests.java",
                    "file_size": 5878
                },
                {
                    "file_additions": 111,
                    "file_deletions": 0,
                    "file_exists": true,
                    "file_name": "client/rest-high-level/src/test/java/org/elasticsearch/client/indices/ReloadAnalyzersResponseTests.java",
                    "file_size": 5393
                },
                {
                    "file_additions": 6,
                    "file_deletions": 5,
                    "file_exists": true,
                    "file_name": "client/rest-high-level/src/test/java/org/elasticsearch/client/license/PutLicenseResponseTests.java",
                    "file_size": 3428
                },
                {
                    "file_additions": 0,
                    "file_deletions": 0,
                    "file_exists": true,
                    "file_name": "client/rest-high-level/src/test/java/org/elasticsearch/client/license/StartBasicResponseTests.java",
                    "file_size": 3437
                },
                {
                    "file_additions": 47,
                    "file_deletions": 0,
                    "file_exists": false,
                    "file_name": "client/rest-high-level/src/test/java/org/elasticsearch/client/ml/AucRocMetricAucRocPointTests.java",
                    "file_size": 0
                },
                {
                    "file_additions": 63,
                    "file_deletions": 0,
                    "file_exists": false,
                    "file_name": "client/rest-high-level/src/test/java/org/elasticsearch/client/ml/AucRocMetricResultTests.java",
                    "file_size": 0
                },
                {
                    "file_additions": 47,
                    "file_deletions": 0,
                    "file_exists": false,
                    "file_name": "client/rest-high-level/src/test/java/org/elasticsearch/client/ml/ConfusionMatrixMetricConfusionMatrixTests.java",
                    "file_size": 0
                },
                {
                    "file_additions": 62,
                    "file_deletions": 0,
                    "file_exists": false,
                    "file_name": "client/rest-high-level/src/test/java/org/elasticsearch/client/ml/ConfusionMatrixMetricResultTests.java",
                    "file_size": 0
                },
                {
                    "file_additions": 39,
                    "file_deletions": 0,
                    "file_exists": true,
                    "file_name": "client/rest-high-level/src/test/java/org/elasticsearch/client/ml/DeleteDataFrameAnalyticsRequestTests.java",
                    "file_size": 1038
                },
                {
                    "file_additions": 76,
                    "file_deletions": 0,
                    "file_exists": true,
                    "file_name": "client/rest-high-level/src/test/java/org/elasticsearch/client/ml/EvaluateDataFrameResponseTests.java",
                    "file_size": 4603
                },
                {
                    "file_additions": 4,
                    "file_deletions": 0,
                    "file_exists": false,
                    "file_name": "client/rest-high-level/src/test/java/org/elasticsearch/client/ml/FindFileStructureRequestTests.java",
                    "file_size": 0
                },
                {
                    "file_additions": 39,
                    "file_deletions": 0,
                    "file_exists": true,
                    "file_name": "client/rest-high-level/src/test/java/org/elasticsearch/client/ml/GetDataFrameAnalyticsRequestTests.java",
                    "file_size": 1035
                },
                {
                    "file_additions": 39,
                    "file_deletions": 0,
                    "file_exists": true,
                    "file_name": "client/rest-high-level/src/test/java/org/elasticsearch/client/ml/GetDataFrameAnalyticsStatsRequestTests.java",
                    "file_size": 1055
                },
                {
                    "file_additions": 60,
                    "file_deletions": 0,
                    "file_exists": false,
                    "file_name": "client/rest-high-level/src/test/java/org/elasticsearch/client/ml/PrecisionMetricResultTests.java",
                    "file_size": 0
                },
                {
                    "file_additions": 74,
                    "file_deletions": 0,
                    "file_exists": true,
                    "file_name": "client/rest-high-level/src/test/java/org/elasticsearch/client/ml/PutDataFrameAnalyticsRequestTests.java",
                    "file_size": 2617
                },
                {
                    "file_additions": 60,
                    "file_deletions": 0,
                    "file_exists": false,
                    "file_name": "client/rest-high-level/src/test/java/org/elasticsearch/client/ml/RecallMetricResultTests.java",
                    "file_size": 0
                },
                {
                    "file_additions": 43,
                    "file_deletions": 0,
                    "file_exists": true,
                    "file_name": "client/rest-high-level/src/test/java/org/elasticsearch/client/ml/StartDataFrameAnalyticsRequestTests.java",
                    "file_size": 1409
                },
                {
                    "file_additions": 43,
                    "file_deletions": 0,
                    "file_exists": true,
                    "file_name": "client/rest-high-level/src/test/java/org/elasticsearch/client/ml/StopDataFrameAnalyticsRequestTests.java",
                    "file_size": 1403
                },
                {
                    "file_additions": 42,
                    "file_deletions": 0,
                    "file_exists": true,
                    "file_name": "client/rest-high-level/src/test/java/org/elasticsearch/client/ml/StopDataFrameAnalyticsResponseTests.java",
                    "file_size": 1094
                },
                {
                    "file_additions": 96,
                    "file_deletions": 0,
                    "file_exists": true,
                    "file_name": "client/rest-high-level/src/test/java/org/elasticsearch/client/ml/dataframe/DataFrameAnalyticsConfigTests.java",
                    "file_size": 3982
                },
                {
                    "file_additions": 50,
                    "file_deletions": 0,
                    "file_exists": true,
                    "file_name": "client/rest-high-level/src/test/java/org/elasticsearch/client/ml/dataframe/DataFrameAnalyticsDestTests.java",
                    "file_size": 1317
                },
                {
                    "file_additions": 70,
                    "file_deletions": 0,
                    "file_exists": true,
                    "file_name": "client/rest-high-level/src/test/java/org/elasticsearch/client/ml/dataframe/DataFrameAnalyticsSourceTests.java",
                    "file_size": 3013
                },
                {
                    "file_additions": 70,
                    "file_deletions": 0,
                    "file_exists": true,
                    "file_name": "client/rest-high-level/src/test/java/org/elasticsearch/client/ml/dataframe/DataFrameAnalyticsStatsTests.java",
                    "file_size": 5109
                },
                {
                    "file_additions": 73,
                    "file_deletions": 0,
                    "file_exists": true,
                    "file_name": "client/rest-high-level/src/test/java/org/elasticsearch/client/ml/dataframe/OutlierDetectionTests.java",
                    "file_size": 3236
                },
                {
                    "file_additions": 62,
                    "file_deletions": 0,
                    "file_exists": true,
                    "file_name": "client/rest-high-level/src/test/java/org/elasticsearch/client/ml/dataframe/QueryConfigTests.java",
                    "file_size": 1812
                },
                {
                    "file_additions": 9,
                    "file_deletions": 1,
                    "file_exists": false,
                    "file_name": "client/rest-high-level/src/test/java/org/elasticsearch/client/ml/filestructurefinder/FieldStatsTests.java",
                    "file_size": 0
                },
                {
                    "file_additions": 1,
                    "file_deletions": 1,
                    "file_exists": true,
                    "file_name": "client/rest-high-level/src/test/java/org/elasticsearch/client/ml/job/config/AnalysisConfigTests.java",
                    "file_size": 10705
                },
                {
                    "file_additions": 1,
                    "file_deletions": 1,
                    "file_exists": true,
                    "file_name": "client/rest-high-level/src/test/java/org/elasticsearch/client/ml/job/config/JobTests.java",
                    "file_size": 7070
                },
                {
                    "file_additions": 97,
                    "file_deletions": 0,
                    "file_exists": true,
                    "file_name": "client/rest-high-level/src/test/java/org/elasticsearch/client/ml/job/process/TimingStatsTests.java",
                    "file_size": 4207
                },
                {
                    "file_additions": 5,
                    "file_deletions": 1,
                    "file_exists": true,
                    "file_name": "client/rest-high-level/src/test/java/org/elasticsearch/client/ml/job/stats/JobStatsTests.java",
                    "file_size": 2872
                },
                {
                    "file_additions": 37,
                    "file_deletions": 14,
                    "file_exists": true,
                    "file_name": "client/rest-high-level/src/test/java/org/elasticsearch/client/security/CreateTokenRequestTests.java",
                    "file_size": 5797
                },
                {
                    "file_additions": 5,
                    "file_deletions": 0,
                    "file_exists": true,
                    "file_name": "client/rest-high-level/src/test/java/org/elasticsearch/client/security/CreateTokenResponseTests.java",
                    "file_size": 3382
                },
                {
                    "file_additions": 0,
                    "file_deletions": 115,
                    "file_exists": false,
                    "file_name": "client/rest-high-level/src/test/java/org/elasticsearch/client/watcher/ExecuteWatchResponseTests.java",
                    "file_size": 0
                },
                {
                    "file_additions": 51,
                    "file_deletions": 93,
                    "file_exists": true,
                    "file_name": "client/rest-high-level/src/test/java/org/elasticsearch/client/watcher/GetWatchResponseTests.java",
                    "file_size": 9362
                },
                {
                    "file_additions": 11,
                    "file_deletions": 17,
                    "file_exists": true,
                    "file_name": "client/rest-high-level/src/test/java/org/elasticsearch/client/watcher/hlrc/DeleteWatchResponseTests.java",
                    "file_size": 1905
                },
                {
                    "file_additions": 11,
                    "file_deletions": 17,
                    "file_exists": true,
                    "file_name": "client/rest-high-level/src/test/java/org/elasticsearch/client/watcher/hlrc/ExecuteWatchResponseTests.java",
                    "file_size": 2628
                },
                {
                    "file_additions": 14,
                    "file_deletions": 18,
                    "file_exists": true,
                    "file_name": "client/rest-high-level/src/test/java/org/elasticsearch/client/watcher/hlrc/PutWatchResponseTests.java",
                    "file_size": 2188
                },
                {
                    "file_additions": 4,
                    "file_deletions": 0,
                    "file_exists": true,
                    "file_name": "client/rest/src/main/java/org/elasticsearch/client/Request.java",
                    "file_size": 6127
                },
                {
                    "file_additions": 6,
                    "file_deletions": 3,
                    "file_exists": true,
                    "file_name": "client/rest/src/main/java/org/elasticsearch/client/RequestOptions.java",
                    "file_size": 11003
                },
                {
                    "file_additions": 1,
                    "file_deletions": 1,
                    "file_exists": true,
                    "file_name": "client/rest/src/test/java/org/elasticsearch/client/RestClientBuilderIntegTests.java",
                    "file_size": 7509
                },
                {
                    "file_additions": 0,
                    "file_deletions": 144,
                    "file_exists": false,
                    "file_name": "client/transport/src/main/java/org/elasticsearch/transport/client/PreBuiltTransportClient.java",
                    "file_size": 0
                },
                {
                    "file_additions": 0,
                    "file_deletions": 66,
                    "file_exists": false,
                    "file_name": "client/transport/src/test/java/org/elasticsearch/transport/client/PreBuiltTransportClientTests.java",
                    "file_size": 0
                },
                {
                    "file_additions": 23,
                    "file_deletions": 0,
                    "file_exists": true,
                    "file_name": "distribution/tools/keystore-cli/src/test/java/org/elasticsearch/common/settings/KeyStoreWrapperTests.java",
                    "file_size": 26684
                }
            ],
            "interesting": {
                "reopened": false,
                "status": false
            },
            "sha": "ce28f9e36677486bd58b82b3fd287916645f9e09"
        }
    ],
    "first_commit": "2019-01-31 08:00:11",
    "last_commit": "2019-07-05 14:59:45",
    "number": 36813,
    "score": 144.0002609092688
}