{
    "commits": [
        {
            "associated_pull_request": [
                "https://github.com/freebsd/pkg/pull/2163"
            ],
            "date": "2023-07-17 18:33:27+00:00",
            "diff": "",
            "diff_additions": 0,
            "diff_deletions": 0,
            "diff_file_size": 0,
            "diff_url": "https://github.com/freebsd/pkg/commit/c1a699cb3c200bff526a61702353356d8f59a625.diff",
            "exists": true,
            "files": [],
            "interesting": {
                "reopen": false,
                "status": false
            },
            "is_parent": true,
            "sha": "c1a699cb3c200bff526a61702353356d8f59a625"
        },
        {
            "associated_pull_request": [],
            "date": "2023-07-31 07:59:03+00:00",
            "diff": "freebsd_pkg/issue_2164/commit_4dfb0ece47b2e5f688b7a96cec58091650bd11d4.diff",
            "diff_additions": 26,
            "diff_deletions": 40,
            "diff_file_size": 30931,
            "diff_url": "https://github.com/freebsd/pkg/commit/4dfb0ece47b2e5f688b7a96cec58091650bd11d4.diff",
            "exists": true,
            "files": [
                {
                    "file_additions": 26,
                    "file_deletions": 40,
                    "file_exists": true,
                    "file_name": "libpkg/pkgdb_iterator.c",
                    "file_size": 30931
                }
            ],
            "interesting": {
                "reopen": true,
                "status": false
            },
            "is_parent": false,
            "sha": "4dfb0ece47b2e5f688b7a96cec58091650bd11d4"
        },
        {
            "associated_pull_request": [],
            "date": "2023-08-22 12:02:22+00:00",
            "diff": "freebsd_pkg/issue_2164/commit_3938618f4b4a0b563c44c30b069ddc88e6e76547.diff",
            "diff_additions": 5,
            "diff_deletions": 5,
            "diff_file_size": 30789,
            "diff_url": "https://github.com/freebsd/pkg/commit/3938618f4b4a0b563c44c30b069ddc88e6e76547.diff",
            "exists": true,
            "files": [
                {
                    "file_additions": 3,
                    "file_deletions": 3,
                    "file_exists": true,
                    "file_name": "libpkg/pkgdb_query.c",
                    "file_size": 16104
                },
                {
                    "file_additions": 2,
                    "file_deletions": 2,
                    "file_exists": true,
                    "file_name": "libpkg/repo/binary/query.c",
                    "file_size": 14685
                }
            ],
            "interesting": {
                "reopen": false,
                "status": false
            },
            "is_parent": false,
            "sha": "3938618f4b4a0b563c44c30b069ddc88e6e76547"
        },
        {
            "associated_pull_request": [],
            "date": "2023-08-22 12:02:22+00:00",
            "diff": "freebsd_pkg/issue_2164/commit_413ac724ad2cacfa9afad482c999a47a895febd0.diff",
            "diff_additions": 5,
            "diff_deletions": 5,
            "diff_file_size": 30789,
            "diff_url": "https://github.com/freebsd/pkg/commit/413ac724ad2cacfa9afad482c999a47a895febd0.diff",
            "exists": true,
            "files": [
                {
                    "file_additions": 3,
                    "file_deletions": 3,
                    "file_exists": true,
                    "file_name": "libpkg/pkgdb_query.c",
                    "file_size": 16104
                },
                {
                    "file_additions": 2,
                    "file_deletions": 2,
                    "file_exists": true,
                    "file_name": "libpkg/repo/binary/query.c",
                    "file_size": 14685
                }
            ],
            "interesting": {
                "reopen": false,
                "status": false
            },
            "is_parent": false,
            "sha": "413ac724ad2cacfa9afad482c999a47a895febd0"
        }
    ],
    "first_commit": "2023-07-19 12:15:21+00:00",
    "last_commit": "2023-08-23 15:59:22+00:00",
    "number": 2164,
    "pull_request": "None",
    "score": {
        "accidental_reopen_likely": false,
        "all_labels": [
            "regression"
        ],
        "contains_keywords": [
            "work",
            "chang",
            "fix",
            "test",
            "bug",
            "problem",
            "report"
        ],
        "fix_size": 65,
        "has_labels": [],
        "intersecting": {
            "computed_score": 1.0,
            "final_commit_size": 7,
            "intersection_size": 7,
            "previous_commits_size": 65
        },
        "is_makefile_based": true,
        "no_new_files": [],
        "no_other_files": false,
        "num_prohibited_files": 249011,
        "prohibited_files": [
            "server/src/main/java/com/genymobile/scrcpy/Device.java",
            "server/src/main/java/com/genymobile/scrcpy/wrappers/SurfaceControl.java",
            "server/src/main/java/com/genymobile/scrcpy/Device.java",
            "server/src/main/java/com/genymobile/scrcpy/wrappers/SurfaceControl.java",
            "app/meson.build",
            "app/scrcpy.1",
            "app/src/common.h",
            "app/src/scrcpy.h",
            "app/src/server.h",
            "server/src/main/java/com/genymobile/scrcpy/Workarounds.java"
        ],
        "reopen": true,
        "reopen_events": [
            [
                "2023-07-31 08:06:03+00:00",
                "closed"
            ],
            [
                "2023-07-31 08:06:03+00:00",
                "commit"
            ],
            [
                "2023-08-01 08:25:33+00:00",
                "commit"
            ],
            [
                "2023-08-04 14:10:24+00:00",
                "reopened"
            ],
            [
                "2023-08-22 12:03:14+00:00",
                "closed"
            ],
            [
                "2023-08-22 12:03:14+00:00",
                "commit"
            ],
            [
                "2023-08-23 15:59:35+00:00",
                "commit"
            ]
        ],
        "status": false,
        "strategy": true,
        "total_changes": 86
    }
}