{
    "covered_issues": [
        910,
        903,
        901,
        900,
        895,
        894,
        890,
        889,
        886,
        883,
        879,
        877,
        872,
        871,
        870,
        866,
        865,
        863,
        861,
        859,
        858,
        857,
        854,
        852,
        851,
        849,
        842,
        835,
        833,
        832,
        831,
        830,
        829,
        828,
        827,
        826,
        825,
        824,
        823,
        821,
        820,
        817,
        816,
        813,
        812,
        811,
        810,
        804,
        802,
        801,
        800,
        797,
        796,
        795,
        794,
        793,
        792,
        789,
        788,
        787,
        786,
        784,
        783,
        782,
        781,
        780,
        778,
        777,
        774,
        772,
        770,
        769,
        768,
        767,
        766,
        765,
        763,
        762,
        761,
        760,
        759,
        758,
        757,
        755,
        754,
        753,
        752,
        750,
        749,
        748,
        747,
        746,
        745,
        744,
        743,
        742,
        741,
        740,
        738,
        737,
        735,
        734,
        733,
        731,
        729,
        725,
        719,
        717,
        716,
        715,
        714,
        713,
        712,
        711,
        706,
        705,
        704,
        703,
        702,
        701,
        700,
        699,
        698,
        697,
        696,
        695,
        694,
        692,
        690,
        689,
        688,
        687,
        684,
        683,
        682,
        680,
        675,
        673,
        672,
        671,
        670,
        667,
        666,
        665,
        663,
        662,
        661,
        660,
        659,
        658,
        656,
        655,
        653,
        651,
        650,
        649,
        647,
        646,
        644,
        643,
        642,
        641,
        640,
        639,
        638,
        637,
        636,
        635,
        634,
        632,
        631,
        630,
        629,
        628,
        627,
        626,
        624,
        623,
        619,
        618,
        617,
        615,
        611,
        610,
        609,
        608,
        606,
        604,
        603,
        602,
        600,
        599,
        598,
        597,
        594,
        593,
        592,
        591,
        590,
        589,
        588,
        587,
        586,
        583,
        579,
        578,
        576,
        575,
        574,
        570,
        569,
        566,
        565,
        563,
        562,
        560,
        559,
        558,
        557,
        553,
        552,
        551,
        548,
        547,
        546,
        545,
        544,
        542,
        541,
        540,
        533,
        532,
        531,
        530,
        529,
        527,
        526,
        524,
        522,
        521,
        520,
        517,
        514,
        513,
        512,
        511,
        510,
        506,
        505,
        503,
        501,
        495,
        494,
        493,
        491,
        490,
        489,
        488,
        487,
        485,
        483,
        482,
        480,
        478,
        477,
        476,
        475,
        474,
        473,
        472,
        471,
        470,
        469,
        468,
        467,
        466,
        464,
        462,
        461,
        459,
        457,
        456,
        455,
        453,
        449,
        448,
        446,
        445,
        444,
        443,
        442,
        440,
        439,
        437,
        436,
        435,
        434,
        433,
        432,
        431,
        430,
        428,
        426,
        425,
        424,
        423,
        422,
        421,
        420,
        419,
        417,
        415,
        414,
        413,
        412,
        410,
        409,
        408,
        407,
        406,
        405,
        403,
        402,
        401,
        399,
        397,
        395,
        394,
        393,
        392,
        390,
        389,
        388,
        387,
        386,
        385,
        382,
        381,
        380,
        379,
        377,
        376,
        375,
        374,
        373,
        372,
        371,
        369,
        368,
        367,
        364,
        363,
        362,
        361,
        360,
        359,
        357,
        356,
        355,
        354,
        349,
        348,
        347,
        346,
        344,
        343,
        342,
        341,
        339,
        338,
        337,
        336,
        334,
        332,
        331,
        330,
        329,
        327,
        326,
        325,
        324,
        323,
        322,
        318,
        317,
        316,
        308,
        307,
        306,
        303,
        302,
        301,
        300,
        297,
        296,
        295,
        294,
        293,
        292,
        291,
        289,
        288,
        285,
        282,
        281,
        280,
        279,
        278,
        277,
        276,
        275,
        274,
        272,
        271,
        270,
        269,
        268,
        264,
        263,
        262,
        261,
        260,
        259,
        258,
        256,
        255,
        254,
        253,
        249,
        247,
        246,
        244,
        243,
        242,
        240,
        238,
        235,
        234,
        233,
        232,
        229,
        228,
        227,
        225,
        222,
        221,
        220,
        219,
        217,
        214,
        212,
        210,
        207,
        206,
        205,
        203,
        202,
        199,
        198,
        197,
        195,
        192,
        189,
        188,
        184,
        183,
        182,
        180,
        179,
        178,
        177,
        175,
        174,
        172,
        168,
        167,
        166,
        165,
        164,
        163,
        162,
        160,
        159,
        158,
        155,
        154,
        153,
        152,
        151,
        150,
        149,
        148,
        147,
        146,
        145,
        144,
        142,
        141,
        140,
        139,
        138,
        136,
        135,
        134,
        133,
        132,
        131,
        130,
        129,
        128,
        126,
        125,
        124,
        123,
        122,
        121,
        120,
        119,
        118,
        117,
        116,
        115,
        114,
        113,
        112,
        111,
        109,
        108,
        107,
        106,
        105,
        104,
        103,
        102,
        101,
        100,
        99,
        98,
        97,
        96,
        95,
        94,
        93,
        92,
        91,
        90,
        89,
        88,
        87,
        86,
        85,
        84,
        83,
        82,
        80,
        79,
        78,
        77,
        76,
        75,
        74,
        73,
        72,
        71,
        70,
        69,
        68,
        67,
        66,
        65,
        64,
        63,
        62,
        61,
        60,
        59,
        58,
        57,
        56,
        55,
        54,
        53,
        52,
        51,
        50,
        49,
        48,
        47,
        46,
        45,
        44,
        43,
        42,
        41,
        40,
        39,
        38,
        37,
        36,
        35,
        34,
        33,
        32,
        31,
        30,
        29,
        28,
        27,
        26,
        25,
        24,
        23,
        22,
        21,
        20,
        19,
        18,
        17,
        16,
        15,
        14,
        13,
        12,
        11,
        10,
        9,
        8,
        7,
        6,
        5,
        4,
        3,
        2,
        1
    ],
    "finished": true
}