{
    "covered_issues": [
        35,
        24,
        22,
        20,
        18,
        14,
        11,
        10,
        9,
        8,
        7,
        5,
        3,
        1
    ],
    "finished": true
}