{
    "covered_issues": [
        4670,
        4649,
        4646,
        4631,
        4608,
        4581,
        4571,
        4568,
        4565,
        4532,
        4530,
        4518,
        4516,
        4508,
        4501,
        4499,
        4470,
        4469,
        4457,
        4454,
        4439,
        4437,
        4430,
        4407,
        4393,
        4391,
        4387,
        4379,
        4378,
        4372,
        4369,
        4368,
        4360,
        4359,
        4358,
        4357,
        4341,
        4337,
        4330,
        4323,
        4318,
        4306,
        4295,
        4293,
        4292,
        4284,
        4283,
        4279,
        4261,
        4247,
        4241,
        4237,
        4227,
        4215,
        4213,
        4205,
        4201,
        4199,
        4195,
        4192,
        4190,
        4185,
        4180,
        4179,
        4178,
        4176,
        4173,
        4165,
        4141,
        4139,
        4136,
        4133,
        4110,
        4107,
        4101,
        4098,
        4063,
        4061,
        4057,
        4054,
        4037,
        4032,
        4018,
        3968,
        3965,
        3963,
        3948,
        3946,
        3925,
        3900,
        3870,
        3839,
        3838,
        3827,
        3819,
        3806,
        3796,
        3788,
        3787,
        3785,
        3784,
        3766,
        3747,
        3736,
        3722,
        3720,
        3715,
        3707,
        3698,
        3690,
        3677,
        3655,
        3653,
        3642,
        3621,
        3613,
        3612,
        3603,
        3589,
        3585,
        3560,
        3558,
        3554,
        3547,
        3546,
        3540,
        3539,
        3531,
        3521,
        3489,
        3487,
        3486,
        3474,
        3449,
        3445,
        3442,
        3437,
        3434,
        3421,
        3418,
        3416,
        3405,
        3377,
        3364,
        3349,
        3344,
        3342,
        3326,
        3310,
        3286,
        3277,
        3276,
        3252,
        3241,
        3238,
        3227,
        3192,
        3185,
        3184,
        3182,
        3181,
        3160,
        3150,
        3132,
        3126,
        3122,
        3075,
        3070,
        3053,
        3035,
        3033,
        2982,
        2971,
        2968,
        2947,
        2946,
        2944,
        2943,
        2927,
        2920,
        2919,
        2909,
        2904,
        2893,
        2881,
        2877,
        2875,
        2843,
        2831,
        2829,
        2828,
        2814,
        2812,
        2771,
        2769,
        2761,
        2749,
        2715,
        2709,
        2676,
        2668,
        2665,
        2633,
        2607,
        2603,
        2600,
        2584,
        2572,
        2548,
        2544,
        2536,
        2531,
        2473,
        2450,
        2440,
        2435,
        2426,
        2425,
        2419,
        2399,
        2392,
        2391,
        2377,
        2343,
        2342,
        2338,
        2321,
        2304,
        2289,
        2288,
        2231,
        2220,
        2216,
        2200,
        2192,
        2183,
        2182,
        2168,
        2165,
        2153,
        2251,
        2142,
        2138,
        2126,
        2082,
        2068,
        2055,
        2029,
        2007,
        1994,
        1987,
        1964,
        1963,
        1952,
        1950,
        1948,
        1947,
        1942,
        1941,
        1939,
        1937,
        1935,
        1930,
        1920,
        1909,
        1904,
        1891,
        1890,
        1885,
        1883,
        1878,
        1877,
        1868,
        1864,
        1862,
        1834,
        1832,
        1821,
        1817,
        1811,
        1809,
        1804,
        1802,
        1788,
        1784,
        1781,
        1779,
        1777,
        1771,
        1768,
        1761,
        1752,
        1748,
        1747,
        1746,
        1742,
        1741,
        1740,
        1724,
        1718,
        1714,
        1712,
        1707,
        1706,
        1705,
        1701,
        1697,
        1696,
        1692,
        1689,
        1683,
        1677,
        1671,
        1670,
        1667,
        1653,
        1651,
        1644,
        1642,
        1638,
        1634,
        1627,
        1626,
        1615,
        1598,
        1582,
        1575,
        1568,
        1567,
        1557,
        1556,
        1553,
        1542,
        1540,
        1539,
        1537,
        1526,
        1524,
        1523,
        1504,
        1501,
        1495,
        1494,
        1493,
        1490,
        1489,
        1483,
        1476,
        1475,
        1471,
        1470,
        1467,
        1462,
        1457,
        1448,
        1447,
        1446,
        1443,
        1440,
        1435,
        1429,
        1415,
        1410,
        1392,
        1387,
        1386,
        1384,
        1373,
        1370,
        1366,
        1360,
        1359,
        1348,
        1343,
        1342,
        1340,
        1337,
        1334,
        1331,
        1330,
        1325,
        1318,
        1316,
        1308,
        1307,
        1301,
        1300,
        1293,
        1287,
        1281,
        1272,
        1267,
        1266,
        1265,
        1255,
        1254,
        1250,
        1217,
        1216,
        1211,
        1209,
        1201,
        1197,
        1195,
        1183,
        1179,
        1176,
        1172,
        1163,
        1145,
        1132,
        1120,
        1113,
        1096,
        1093,
        1081,
        1068,
        1062,
        1059,
        1058,
        1057,
        1047,
        1023,
        1014,
        1006,
        1005,
        990,
        987,
        982,
        981,
        976,
        966,
        962,
        961,
        957,
        955,
        946,
        944,
        930,
        915,
        910,
        906,
        901,
        898,
        886,
        885,
        884,
        883,
        882,
        878,
        874,
        872,
        864,
        862,
        856,
        855,
        853,
        849,
        844,
        843,
        842,
        826,
        823,
        817,
        815,
        812,
        810,
        809,
        806,
        802,
        801,
        796,
        784,
        780,
        748,
        747,
        745,
        741,
        738,
        737,
        735,
        727,
        726,
        725,
        721,
        720,
        715,
        713,
        687,
        685,
        682,
        673,
        671,
        669,
        653,
        649,
        648,
        639,
        638,
        633,
        630,
        623,
        602,
        599,
        594,
        582,
        575,
        569,
        568,
        565,
        564,
        562,
        559,
        556,
        553,
        551,
        550,
        546,
        540,
        529,
        527,
        526,
        522,
        517,
        515,
        512,
        503,
        492,
        489,
        488,
        487,
        486,
        485,
        484,
        480,
        477,
        468,
        466,
        464,
        463,
        462,
        461,
        458,
        456,
        455,
        454,
        447,
        444,
        443,
        438,
        436,
        435,
        428,
        415,
        413,
        412,
        411,
        406,
        403,
        401,
        399,
        396,
        395,
        392,
        391,
        390,
        389,
        386,
        382,
        379,
        376,
        372,
        369,
        365,
        349,
        347,
        343,
        342,
        341,
        340,
        339,
        334,
        328,
        323,
        317,
        306,
        301,
        300,
        291,
        285,
        280,
        278,
        277,
        275,
        272,
        271,
        267,
        266,
        264,
        261,
        258,
        255,
        251,
        247,
        246,
        242,
        241,
        236,
        232,
        225,
        220,
        218,
        212,
        211,
        210,
        208,
        195,
        194,
        191,
        188,
        180,
        179,
        177,
        176,
        174,
        172,
        167,
        159,
        156,
        155,
        153,
        142,
        138,
        135,
        129,
        128,
        122,
        121,
        119,
        117,
        113,
        111,
        106,
        98,
        92,
        90,
        88,
        85,
        83,
        78,
        75,
        73,
        67,
        65,
        53,
        46,
        44,
        42,
        40,
        36,
        31,
        30,
        29,
        27,
        24,
        22,
        6,
        5,
        4,
        3,
        2
    ],
    "finished": true
}