{
    "category": [
        "memory",
        "network/protocols"
    ],
    "commits": [
        {
            "associated_pull_request": [],
            "date": "2014-04-28 16:12:23",
            "diff": "ettercap_ettercap/issue_539/commit_f8368fb95cb4f016e89fb58107d153b9bb250132.diff",
            "diff_additions": 120,
            "diff_deletions": 97,
            "diff_file_size": 108484,
            "diff_url": "https://github.com/Ettercap/ettercap/commit/f8368fb95cb4f016e89fb58107d153b9bb250132.diff",
            "exists": true,
            "files": [
                {
                    "file_additions": 2,
                    "file_deletions": 0,
                    "file_exists": true,
                    "file_name": "src/ec_capture.c",
                    "file_size": 6686
                },
                {
                    "file_additions": 54,
                    "file_deletions": 3,
                    "file_exists": true,
                    "file_name": "src/ec_network.c",
                    "file_size": 13657
                },
                {
                    "file_additions": 2,
                    "file_deletions": 2,
                    "file_exists": true,
                    "file_name": "src/ec_threads.c",
                    "file_size": 10284
                },
                {
                    "file_additions": 30,
                    "file_deletions": 0,
                    "file_exists": true,
                    "file_name": "src/ec_utils.c",
                    "file_size": 9093
                },
                {
                    "file_additions": 4,
                    "file_deletions": 12,
                    "file_exists": true,
                    "file_name": "src/interfaces/text/ec_text_display.c",
                    "file_size": 3995
                },
                {
                    "file_additions": 20,
                    "file_deletions": 1,
                    "file_exists": true,
                    "file_name": "src/os/ec_mingw.c",
                    "file_size": 28306
                },
                {
                    "file_additions": 2,
                    "file_deletions": 12,
                    "file_exists": true,
                    "file_name": "utils/etterlog/el_display.c",
                    "file_size": 9680
                },
                {
                    "file_additions": 2,
                    "file_deletions": 3,
                    "file_exists": true,
                    "file_name": "utils/etterlog/el_main.c",
                    "file_size": 4253
                },
                {
                    "file_additions": 0,
                    "file_deletions": 60,
                    "file_exists": true,
                    "file_name": "utils/etterlog/el_parser.c",
                    "file_size": 11179
                },
                {
                    "file_additions": 4,
                    "file_deletions": 4,
                    "file_exists": true,
                    "file_name": "utils/etterlog/el_target.c",
                    "file_size": 11351
                }
            ],
            "interesting": {
                "reopen": false,
                "status": false
            },
            "is_parent": true,
            "sha": "f8368fb95cb4f016e89fb58107d153b9bb250132"
        },
        {
            "associated_pull_request": [],
            "date": "2014-04-29 17:53:11",
            "diff": "ettercap_ettercap/issue_539/commit_9828be0660fe4c9c6120228ff05e82da8d644ac2.diff",
            "diff_additions": 37,
            "diff_deletions": 24,
            "diff_file_size": 9681,
            "diff_url": "https://github.com/Ettercap/ettercap/commit/9828be0660fe4c9c6120228ff05e82da8d644ac2.diff",
            "exists": true,
            "files": [
                {
                    "file_additions": 37,
                    "file_deletions": 24,
                    "file_exists": true,
                    "file_name": "src/ec_checksum.c",
                    "file_size": 9681
                }
            ],
            "interesting": {
                "reopen": false,
                "status": true
            },
            "is_parent": false,
            "sha": "9828be0660fe4c9c6120228ff05e82da8d644ac2"
        },
        {
            "associated_pull_request": [],
            "date": "2014-10-15 20:05:04",
            "diff": "ettercap_ettercap/issue_539/commit_44148aa41d6e1a653cae8c9088509c5636a2e2e0.diff",
            "diff_additions": 48,
            "diff_deletions": 24,
            "diff_file_size": 9681,
            "diff_url": "https://github.com/Ettercap/ettercap/commit/44148aa41d6e1a653cae8c9088509c5636a2e2e0.diff",
            "exists": true,
            "files": [
                {
                    "file_additions": 48,
                    "file_deletions": 24,
                    "file_exists": true,
                    "file_name": "src/ec_checksum.c",
                    "file_size": 9681
                }
            ],
            "interesting": {
                "reopen": false,
                "status": false
            },
            "is_parent": false,
            "sha": "44148aa41d6e1a653cae8c9088509c5636a2e2e0"
        }
    ],
    "first_commit": "2014-04-28 16:12:23",
    "last_commit": "2014-10-15 20:05:04",
    "number": 539,
    "pull_request": "None",
    "score": {
        "accidental_reopen_likely": false,
        "all_labels": [],
        "contains_keywords": [
            "fix",
            "patch",
            "test",
            "issu",
            "error",
            "chang",
            "problem"
        ],
        "fix_size": 72,
        "has_labels": [],
        "intersecting": {
            "computed_score": 0.6984126984126984,
            "final_commit_size": 63,
            "intersection_size": 44,
            "previous_commits_size": 53
        },
        "is_makefile_based": true,
        "no_new_files": [],
        "no_other_files": false,
        "num_prohibited_files": 105096,
        "prohibited_files": [
            "kill.h",
            "meminfo.h",
            "kill.h",
            "meminfo.h",
            "kill.h",
            "meminfo.h",
            "testsuite_cli_test.go",
            "testsuite_cli_test.go",
            "common.mk",
            "i3bar/include/draw_util.h"
        ],
        "reopen": false,
        "reopen_events": [
            [
                "2014-04-29 17:56:17",
                "commit"
            ],
            [
                "2014-05-08 08:20:34",
                "commit"
            ],
            [
                "2014-10-04 14:57:35",
                "commit"
            ],
            [
                "2014-10-15 10:23:39",
                "commit"
            ],
            [
                "2014-10-15 20:05:04",
                "commit"
            ],
            [
                "2015-08-08 14:03:37",
                "closed"
            ]
        ],
        "status": true,
        "strategy": true,
        "total_changes": 350
    }
}