{
    "covered_issues": [
        126,
        122,
        116,
        115,
        109,
        107,
        106,
        94,
        93,
        92,
        91,
        84,
        83,
        79,
        78,
        77,
        74,
        73,
        69,
        68,
        67,
        66,
        65,
        63,
        60,
        58,
        57,
        56,
        55,
        54,
        53,
        52,
        51,
        50,
        49,
        47,
        46,
        45,
        44,
        43,
        42,
        41,
        40,
        38,
        37,
        36,
        35,
        33,
        32,
        31,
        30,
        29,
        28,
        26,
        25,
        23,
        22,
        21,
        20,
        19,
        18,
        17,
        16,
        15,
        14,
        13,
        12,
        11,
        10,
        9,
        8,
        7,
        5,
        4
    ],
    "finished": true
}