{
    "commits": [
        {
            "associated_pull_request": [
                "https://github.com/DynamoRIO/dynamorio/pull/4729"
            ],
            "date": "2021-02-11 17:38:53+00:00",
            "diff": "dynamorio_dynamorio/issue_4731/commit_6667641fe60c6d8d60af186cbf00521e4b6066bb.diff",
            "diff_additions": 48,
            "diff_deletions": 43,
            "diff_file_size": 249049,
            "diff_url": "https://github.com/DynamoRIO/dynamorio/commit/6667641fe60c6d8d60af186cbf00521e4b6066bb.diff",
            "exists": true,
            "files": [
                {
                    "file_additions": 14,
                    "file_deletions": 14,
                    "file_exists": true,
                    "file_name": "core/config.c",
                    "file_size": 28744
                },
                {
                    "file_additions": 25,
                    "file_deletions": 20,
                    "file_exists": true,
                    "file_name": "core/dynamo.c",
                    "file_size": 131111
                },
                {
                    "file_additions": 9,
                    "file_deletions": 9,
                    "file_exists": true,
                    "file_name": "core/unix/loader.c",
                    "file_size": 89194
                }
            ],
            "interesting": {
                "reopen": false,
                "status": false
            },
            "is_parent": true,
            "sha": "6667641fe60c6d8d60af186cbf00521e4b6066bb"
        },
        {
            "associated_pull_request": [
                "https://github.com/DynamoRIO/dynamorio/pull/4733"
            ],
            "date": "2021-02-12 00:38:13+00:00",
            "diff": "dynamorio_dynamorio/issue_4731/commit_1a67bdc717ed0398dd6d2f90df0307b2e83c9100.diff",
            "diff_additions": 46,
            "diff_deletions": 27,
            "diff_file_size": 166158,
            "diff_url": "https://github.com/DynamoRIO/dynamorio/commit/1a67bdc717ed0398dd6d2f90df0307b2e83c9100.diff",
            "exists": true,
            "files": [
                {
                    "file_additions": 46,
                    "file_deletions": 27,
                    "file_exists": true,
                    "file_name": "clients/drcachesim/tracer/raw2trace.cpp",
                    "file_size": 166158
                }
            ],
            "interesting": {
                "reopen": false,
                "status": false
            },
            "is_parent": false,
            "sha": "1a67bdc717ed0398dd6d2f90df0307b2e83c9100"
        },
        {
            "associated_pull_request": [
                "https://github.com/DynamoRIO/dynamorio/pull/4733"
            ],
            "date": "2021-02-12 15:21:48+00:00",
            "diff": "dynamorio_dynamorio/issue_4731/commit_0732d709df1b90ccedecd188107a50fd357482d1.diff",
            "diff_additions": 45,
            "diff_deletions": 27,
            "diff_file_size": 166158,
            "diff_url": "https://github.com/DynamoRIO/dynamorio/commit/0732d709df1b90ccedecd188107a50fd357482d1.diff",
            "exists": true,
            "files": [
                {
                    "file_additions": 45,
                    "file_deletions": 27,
                    "file_exists": true,
                    "file_name": "clients/drcachesim/tracer/raw2trace.cpp",
                    "file_size": 166158
                }
            ],
            "interesting": {
                "reopen": true,
                "status": false
            },
            "is_parent": false,
            "sha": "0732d709df1b90ccedecd188107a50fd357482d1"
        },
        {
            "associated_pull_request": [
                "https://github.com/DynamoRIO/dynamorio/pull/4738"
            ],
            "date": "2021-02-17 02:03:59+00:00",
            "diff": "dynamorio_dynamorio/issue_4731/commit_ff4460977aab7fd683cc3a606355c7cdc2cab4d5.diff",
            "diff_additions": 16,
            "diff_deletions": 1,
            "diff_file_size": 22057,
            "diff_url": "https://github.com/DynamoRIO/dynamorio/commit/ff4460977aab7fd683cc3a606355c7cdc2cab4d5.diff",
            "exists": true,
            "files": [
                {
                    "file_additions": 16,
                    "file_deletions": 1,
                    "file_exists": true,
                    "file_name": "core/drlibc/drlibc_module_elf.c",
                    "file_size": 22057
                }
            ],
            "interesting": {
                "reopen": false,
                "status": false
            },
            "is_parent": false,
            "sha": "ff4460977aab7fd683cc3a606355c7cdc2cab4d5"
        },
        {
            "associated_pull_request": [
                "https://github.com/DynamoRIO/dynamorio/pull/4738"
            ],
            "date": "2021-02-17 02:31:56+00:00",
            "diff": "dynamorio_dynamorio/issue_4731/commit_b4fd9ae69d77d2b8b81d6abded6aa9cdac3c371e.diff",
            "diff_additions": 16,
            "diff_deletions": 1,
            "diff_file_size": 22057,
            "diff_url": "https://github.com/DynamoRIO/dynamorio/commit/b4fd9ae69d77d2b8b81d6abded6aa9cdac3c371e.diff",
            "exists": true,
            "files": [
                {
                    "file_additions": 16,
                    "file_deletions": 1,
                    "file_exists": true,
                    "file_name": "core/drlibc/drlibc_module_elf.c",
                    "file_size": 22057
                }
            ],
            "interesting": {
                "reopen": false,
                "status": false
            },
            "is_parent": false,
            "sha": "b4fd9ae69d77d2b8b81d6abded6aa9cdac3c371e"
        }
    ],
    "first_commit": "2021-02-11 17:38:53+00:00",
    "last_commit": "2021-02-17 02:31:56+00:00",
    "number": 4731,
    "pull_request": "None",
    "score": {
        "accidental_reopen_likely": false,
        "all_labels": [
            "Component-DrCacheSim",
            "Bug-ToolCrash"
        ],
        "contains_keywords": [
            "work",
            "fail",
            "fix",
            "issu",
            "test",
            "warn",
            "bug",
            "problem",
            "crash"
        ],
        "fix_size": 80,
        "has_labels": [],
        "intersecting": {
            "computed_score": 1.0,
            "final_commit_size": 18,
            "intersection_size": 18,
            "previous_commits_size": 80
        },
        "is_makefile_based": true,
        "no_new_files": [],
        "no_other_files": false,
        "num_prohibited_files": 206322,
        "prohibited_files": [
            "server/src/main/java/com/genymobile/scrcpy/Device.java",
            "server/src/main/java/com/genymobile/scrcpy/wrappers/SurfaceControl.java",
            "server/src/main/java/com/genymobile/scrcpy/Device.java",
            "server/src/main/java/com/genymobile/scrcpy/wrappers/SurfaceControl.java",
            "app/meson.build",
            "app/scrcpy.1",
            "app/src/common.h",
            "app/src/scrcpy.h",
            "app/src/server.h",
            "server/src/main/java/com/genymobile/scrcpy/Workarounds.java"
        ],
        "reopen": true,
        "reopen_events": [
            [
                "2021-02-12 00:42:34+00:00",
                "commit"
            ],
            [
                "2021-02-12 15:21:49+00:00",
                "closed"
            ],
            [
                "2021-02-12 15:21:51+00:00",
                "commit"
            ],
            [
                "2021-02-16 21:23:35+00:00",
                "reopened"
            ],
            [
                "2021-02-17 02:08:30+00:00",
                "commit"
            ],
            [
                "2021-02-17 02:31:57+00:00",
                "closed"
            ],
            [
                "2021-02-17 02:31:58+00:00",
                "commit"
            ]
        ],
        "status": false,
        "strategy": true,
        "total_changes": 270
    }
}