{
    "covered_issues": [
        496,
        495,
        493,
        490,
        489,
        485,
        476,
        474,
        473,
        472,
        465,
        464,
        463,
        453,
        451,
        447,
        439,
        434,
        433,
        431,
        430,
        423,
        415,
        413,
        407,
        403,
        393,
        391,
        383,
        381,
        378,
        377,
        376,
        375,
        371,
        369,
        367,
        365,
        364,
        363,
        362,
        361,
        360,
        358,
        357,
        355,
        352,
        348,
        347,
        346,
        345,
        344,
        342,
        341,
        340,
        339,
        337,
        336,
        335,
        334,
        333,
        332,
        330,
        329,
        328,
        325,
        323,
        322,
        319,
        318,
        314,
        313,
        312,
        311,
        310,
        309,
        308,
        306,
        305,
        304,
        302,
        301,
        300,
        299,
        298,
        297,
        296,
        294,
        290,
        286,
        285,
        284,
        283,
        282,
        281,
        279,
        278,
        276,
        275,
        274,
        272,
        271,
        268,
        267,
        265,
        263,
        262,
        261,
        259,
        258,
        257,
        256,
        254,
        253,
        251,
        247,
        246,
        245,
        243,
        242,
        241,
        239,
        238,
        237,
        236,
        235,
        234,
        233,
        232,
        231,
        229,
        226,
        225,
        213,
        211,
        210,
        209,
        208,
        207,
        206,
        202,
        200,
        199,
        198,
        197,
        196,
        195,
        194,
        191,
        190,
        189,
        188,
        187,
        186,
        185,
        182,
        181,
        180,
        179,
        178,
        177,
        176,
        173,
        170,
        169,
        168,
        164,
        162,
        161,
        159,
        158,
        157,
        156,
        155,
        154,
        153,
        152,
        150,
        149,
        148,
        146,
        145,
        139,
        138,
        137,
        135,
        134,
        132,
        131,
        130,
        128,
        127,
        125,
        117,
        115,
        113,
        109,
        105,
        95,
        94,
        91,
        90,
        87,
        85,
        83,
        82,
        80,
        77,
        76,
        75,
        68,
        66,
        63,
        62,
        61,
        60,
        59,
        57,
        55,
        24,
        18,
        16,
        11,
        9,
        8,
        6,
        5,
        4,
        3,
        2,
        1
    ],
    "finished": true
}