{
    "commits": [
        {
            "diff": "elastic_elasticsearch/issue_39955/commit_91d8ada4695f8395250eaae625f8ce7dfe57492d.diff",
            "diff_additions": 30,
            "diff_deletions": 18,
            "diff_file_size": 152745,
            "files": [
                {
                    "file_additions": 2,
                    "file_deletions": 2,
                    "file_exists": true,
                    "file_name": "server/src/main/java/org/elasticsearch/ingest/IngestService.java",
                    "file_size": 43435
                },
                {
                    "file_additions": 12,
                    "file_deletions": 8,
                    "file_exists": true,
                    "file_name": "server/src/main/java/org/elasticsearch/ingest/PipelineProcessor.java",
                    "file_size": 2943
                },
                {
                    "file_additions": 2,
                    "file_deletions": 2,
                    "file_exists": true,
                    "file_name": "server/src/main/java/org/elasticsearch/ingest/TrackingResultProcessor.java",
                    "file_size": 8911
                },
                {
                    "file_additions": 1,
                    "file_deletions": 1,
                    "file_exists": true,
                    "file_name": "server/src/test/java/org/elasticsearch/ingest/IngestServiceTests.java",
                    "file_size": 85050
                },
                {
                    "file_additions": 13,
                    "file_deletions": 5,
                    "file_exists": true,
                    "file_name": "server/src/test/java/org/elasticsearch/ingest/PipelineProcessorTests.java",
                    "file_size": 12406
                }
            ],
            "interesting": {
                "reopened": false,
                "status": true
            },
            "sha": "91d8ada4695f8395250eaae625f8ce7dfe57492d"
        },
        {
            "diff": "elastic_elasticsearch/issue_39955/commit_88aea2107dc0591d3954b4696f473b95e128fcf7.diff",
            "diff_additions": 38,
            "diff_deletions": 27,
            "diff_file_size": 186925,
            "files": [
                {
                    "file_additions": 2,
                    "file_deletions": 2,
                    "file_exists": true,
                    "file_name": "server/src/main/java/org/elasticsearch/ingest/IngestService.java",
                    "file_size": 43435
                },
                {
                    "file_additions": 13,
                    "file_deletions": 10,
                    "file_exists": true,
                    "file_name": "server/src/main/java/org/elasticsearch/ingest/PipelineProcessor.java",
                    "file_size": 2943
                },
                {
                    "file_additions": 2,
                    "file_deletions": 2,
                    "file_exists": true,
                    "file_name": "server/src/main/java/org/elasticsearch/ingest/TrackingResultProcessor.java",
                    "file_size": 8911
                },
                {
                    "file_additions": 1,
                    "file_deletions": 1,
                    "file_exists": true,
                    "file_name": "server/src/test/java/org/elasticsearch/ingest/IngestServiceTests.java",
                    "file_size": 85050
                },
                {
                    "file_additions": 13,
                    "file_deletions": 5,
                    "file_exists": true,
                    "file_name": "server/src/test/java/org/elasticsearch/ingest/PipelineProcessorTests.java",
                    "file_size": 12406
                },
                {
                    "file_additions": 7,
                    "file_deletions": 7,
                    "file_exists": true,
                    "file_name": "server/src/test/java/org/elasticsearch/ingest/TrackingResultProcessorTests.java",
                    "file_size": 34180
                }
            ],
            "interesting": {
                "reopened": false,
                "status": false
            },
            "sha": "88aea2107dc0591d3954b4696f473b95e128fcf7"
        },
        {
            "diff": "elastic_elasticsearch/issue_39955/commit_634d6c99d010039972c76fcc390ae35c8e77f90d.diff",
            "diff_additions": 38,
            "diff_deletions": 27,
            "diff_file_size": 186925,
            "files": [
                {
                    "file_additions": 2,
                    "file_deletions": 2,
                    "file_exists": true,
                    "file_name": "server/src/main/java/org/elasticsearch/ingest/IngestService.java",
                    "file_size": 43435
                },
                {
                    "file_additions": 13,
                    "file_deletions": 10,
                    "file_exists": true,
                    "file_name": "server/src/main/java/org/elasticsearch/ingest/PipelineProcessor.java",
                    "file_size": 2943
                },
                {
                    "file_additions": 2,
                    "file_deletions": 2,
                    "file_exists": true,
                    "file_name": "server/src/main/java/org/elasticsearch/ingest/TrackingResultProcessor.java",
                    "file_size": 8911
                },
                {
                    "file_additions": 1,
                    "file_deletions": 1,
                    "file_exists": true,
                    "file_name": "server/src/test/java/org/elasticsearch/ingest/IngestServiceTests.java",
                    "file_size": 85050
                },
                {
                    "file_additions": 13,
                    "file_deletions": 5,
                    "file_exists": true,
                    "file_name": "server/src/test/java/org/elasticsearch/ingest/PipelineProcessorTests.java",
                    "file_size": 12406
                },
                {
                    "file_additions": 7,
                    "file_deletions": 7,
                    "file_exists": true,
                    "file_name": "server/src/test/java/org/elasticsearch/ingest/TrackingResultProcessorTests.java",
                    "file_size": 34180
                }
            ],
            "interesting": {
                "reopened": false,
                "status": true
            },
            "sha": "634d6c99d010039972c76fcc390ae35c8e77f90d"
        },
        {
            "diff": "elastic_elasticsearch/issue_39955/commit_0a42395dfa5a999eb10eb553dc5f467426000c5d.diff",
            "diff_additions": 38,
            "diff_deletions": 27,
            "diff_file_size": 186925,
            "files": [
                {
                    "file_additions": 2,
                    "file_deletions": 2,
                    "file_exists": true,
                    "file_name": "server/src/main/java/org/elasticsearch/ingest/IngestService.java",
                    "file_size": 43435
                },
                {
                    "file_additions": 13,
                    "file_deletions": 10,
                    "file_exists": true,
                    "file_name": "server/src/main/java/org/elasticsearch/ingest/PipelineProcessor.java",
                    "file_size": 2943
                },
                {
                    "file_additions": 2,
                    "file_deletions": 2,
                    "file_exists": true,
                    "file_name": "server/src/main/java/org/elasticsearch/ingest/TrackingResultProcessor.java",
                    "file_size": 8911
                },
                {
                    "file_additions": 1,
                    "file_deletions": 1,
                    "file_exists": true,
                    "file_name": "server/src/test/java/org/elasticsearch/ingest/IngestServiceTests.java",
                    "file_size": 85050
                },
                {
                    "file_additions": 13,
                    "file_deletions": 5,
                    "file_exists": true,
                    "file_name": "server/src/test/java/org/elasticsearch/ingest/PipelineProcessorTests.java",
                    "file_size": 12406
                },
                {
                    "file_additions": 7,
                    "file_deletions": 7,
                    "file_exists": true,
                    "file_name": "server/src/test/java/org/elasticsearch/ingest/TrackingResultProcessorTests.java",
                    "file_size": 34180
                }
            ],
            "interesting": {
                "reopened": false,
                "status": false
            },
            "sha": "0a42395dfa5a999eb10eb553dc5f467426000c5d"
        }
    ],
    "first_commit": "2019-11-13 07:18:56",
    "last_commit": "2019-11-27 14:53:40",
    "number": 39955,
    "score": 320.0164609053498
}