{
    "commits": [
        {
            "associated_pull_request": [],
            "date": "2016-08-29 17:50:13+00:00",
            "diff": "",
            "diff_additions": 0,
            "diff_deletions": 0,
            "diff_file_size": 0,
            "diff_url": "https://github.com/openwall/john/commit/2e189a69fedd850af83ee2794509951b04b21198.diff",
            "exists": true,
            "files": [],
            "interesting": {
                "reopen": false,
                "status": false
            },
            "is_parent": true,
            "sha": "2e189a69fedd850af83ee2794509951b04b21198"
        },
        {
            "associated_pull_request": [],
            "date": "2016-08-29 18:16:32+00:00",
            "diff": "openwall_john/issue_2249/commit_6b6f1eb086d79318b284341d4a9615a8a32b3ea7.diff",
            "diff_additions": 4,
            "diff_deletions": 2,
            "diff_file_size": 8223,
            "diff_url": "https://github.com/openwall/john/commit/6b6f1eb086d79318b284341d4a9615a8a32b3ea7.diff",
            "exists": true,
            "files": [
                {
                    "file_additions": 4,
                    "file_deletions": 2,
                    "file_exists": true,
                    "file_name": "src/keepass_fmt_plug.c",
                    "file_size": 8223
                }
            ],
            "interesting": {
                "reopen": true,
                "status": false
            },
            "is_parent": false,
            "sha": "6b6f1eb086d79318b284341d4a9615a8a32b3ea7"
        },
        {
            "associated_pull_request": [],
            "date": "2016-08-29 20:20:39+00:00",
            "diff": "openwall_john/issue_2249/commit_0b005feadd63e8bcd0eba6c09f0bda9095c6f231.diff",
            "diff_additions": 10,
            "diff_deletions": 18,
            "diff_file_size": 8223,
            "diff_url": "https://github.com/openwall/john/commit/0b005feadd63e8bcd0eba6c09f0bda9095c6f231.diff",
            "exists": true,
            "files": [
                {
                    "file_additions": 10,
                    "file_deletions": 18,
                    "file_exists": true,
                    "file_name": "src/keepass_fmt_plug.c",
                    "file_size": 8223
                }
            ],
            "interesting": {
                "reopen": false,
                "status": false
            },
            "is_parent": false,
            "sha": "0b005feadd63e8bcd0eba6c09f0bda9095c6f231"
        }
    ],
    "first_commit": "2016-08-29 17:50:13+00:00",
    "last_commit": "2016-08-29 20:20:39+00:00",
    "number": 2249,
    "pull_request": "None",
    "score": {
        "accidental_reopen_likely": false,
        "all_labels": [
            "bug",
            "fixed - pending verify"
        ],
        "contains_keywords": [
            "chang",
            "test",
            "remov",
            "error",
            "problem",
            "crash"
        ],
        "fix_size": 26,
        "has_labels": [
            "bug"
        ],
        "intersecting": {
            "computed_score": 0.09090909090909091,
            "final_commit_size": 22,
            "intersection_size": 2,
            "previous_commits_size": 6
        },
        "is_makefile_based": false,
        "no_new_files": [],
        "no_other_files": true,
        "num_prohibited_files": 27132,
        "prohibited_files": [
            "server/src/main/java/com/genymobile/scrcpy/Device.java",
            "server/src/main/java/com/genymobile/scrcpy/wrappers/SurfaceControl.java",
            "server/src/main/java/com/genymobile/scrcpy/Device.java",
            "server/src/main/java/com/genymobile/scrcpy/wrappers/SurfaceControl.java",
            "app/meson.build",
            "app/scrcpy.1",
            "app/src/common.h",
            "app/src/scrcpy.h",
            "app/src/server.h",
            "server/src/main/java/com/genymobile/scrcpy/Workarounds.java"
        ],
        "reopen": true,
        "reopen_events": [
            [
                "2016-08-29 18:16:43+00:00",
                "commit"
            ],
            [
                "2016-08-29 18:28:20+00:00",
                "closed"
            ],
            [
                "2016-08-29 18:58:08+00:00",
                "reopened"
            ],
            [
                "2016-08-29 20:20:53+00:00",
                "commit"
            ],
            [
                "2016-09-16 17:48:50+00:00",
                "closed"
            ]
        ],
        "status": false,
        "strategy": true,
        "total_changes": 34
    }
}