{
    "all_issues": 1296,
    "interesting_issues": 5,
    "last_update": "2023-11-03 22:17:37.337436",
    "license": {
        "download": "https://raw.githubusercontent.com/bitcraze/crazyflie-firmware/master/LICENSE.txt",
        "name": "GNU General Public License v3.0"
    },
    "ratio": 0.0038580246913580245,
    "size": 22347,
    "stars": 1032,
    "url": "https://github.com/bitcraze/crazyflie-firmware"
}