{
    "commits": [
        {
            "associated_pull_request": [
                "https://github.com/DynamoRIO/dynamorio/pull/2432"
            ],
            "date": "2017-05-15 04:27:09+00:00",
            "diff": "dynamorio_dynamorio/issue_2144/commit_ec8c19e58558c882d1c121e317ded836c8e5173f.diff",
            "diff_additions": 1757,
            "diff_deletions": 1103,
            "diff_file_size": 8609800,
            "diff_url": "https://github.com/DynamoRIO/dynamorio/commit/ec8c19e58558c882d1c121e317ded836c8e5173f.diff",
            "exists": true,
            "files": [
                {
                    "file_additions": 2,
                    "file_deletions": 1,
                    "file_exists": true,
                    "file_name": "api/samples/memval_simple.c",
                    "file_size": 21859
                },
                {
                    "file_additions": 3,
                    "file_deletions": 3,
                    "file_exists": true,
                    "file_name": "api/samples/signal.c",
                    "file_size": 3805
                },
                {
                    "file_additions": 3,
                    "file_deletions": 3,
                    "file_exists": true,
                    "file_name": "api/samples/wrap.c",
                    "file_size": 5681
                },
                {
                    "file_additions": 3,
                    "file_deletions": 2,
                    "file_exists": true,
                    "file_name": "clients/drcachesim/simulator/cache_fifo.cpp",
                    "file_size": 4627
                },
                {
                    "file_additions": 2,
                    "file_deletions": 1,
                    "file_exists": true,
                    "file_name": "clients/drcachesim/tests/burst_threads.cpp",
                    "file_size": 8805
                },
                {
                    "file_additions": 9,
                    "file_deletions": 5,
                    "file_exists": true,
                    "file_name": "clients/standalone/winsysnums.c",
                    "file_size": 35051
                },
                {
                    "file_additions": 2,
                    "file_deletions": 1,
                    "file_exists": false,
                    "file_name": "core/arch/aarch64/build_ldstex.c",
                    "file_size": 0
                },
                {
                    "file_additions": 3,
                    "file_deletions": 1,
                    "file_exists": false,
                    "file_name": "core/arch/aarch64/codec.c",
                    "file_size": 0
                },
                {
                    "file_additions": 3,
                    "file_deletions": 1,
                    "file_exists": false,
                    "file_name": "core/arch/aarch64/decode.c",
                    "file_size": 0
                },
                {
                    "file_additions": 3,
                    "file_deletions": 2,
                    "file_exists": true,
                    "file_name": "core/arch/aarch64/emit_utils.c",
                    "file_size": 47769
                },
                {
                    "file_additions": 3,
                    "file_deletions": 1,
                    "file_exists": false,
                    "file_name": "core/arch/aarch64/instr.c",
                    "file_size": 0
                },
                {
                    "file_additions": 9,
                    "file_deletions": 6,
                    "file_exists": true,
                    "file_name": "core/arch/aarchxx/mangle.c",
                    "file_size": 173951
                },
                {
                    "file_additions": 21,
                    "file_deletions": 11,
                    "file_exists": true,
                    "file_name": "core/arch/arch.c",
                    "file_size": 159801
                },
                {
                    "file_additions": 3,
                    "file_deletions": 2,
                    "file_exists": false,
                    "file_name": "core/arch/arm/decode.c",
                    "file_size": 0
                },
                {
                    "file_additions": 3,
                    "file_deletions": 2,
                    "file_exists": false,
                    "file_name": "core/arch/arm/instr.c",
                    "file_size": 0
                },
                {
                    "file_additions": 12,
                    "file_deletions": 7,
                    "file_exists": false,
                    "file_name": "core/arch/disassemble_shared.c",
                    "file_size": 0
                },
                {
                    "file_additions": 60,
                    "file_deletions": 35,
                    "file_exists": true,
                    "file_name": "core/arch/emit_utils_shared.c",
                    "file_size": 248417
                },
                {
                    "file_additions": 9,
                    "file_deletions": 6,
                    "file_exists": false,
                    "file_name": "core/arch/instr_shared.c",
                    "file_size": 0
                },
                {
                    "file_additions": 74,
                    "file_deletions": 55,
                    "file_exists": true,
                    "file_name": "core/arch/interp.c",
                    "file_size": 372678
                },
                {
                    "file_additions": 3,
                    "file_deletions": 2,
                    "file_exists": true,
                    "file_name": "core/arch/mangle_shared.c",
                    "file_size": 89477
                },
                {
                    "file_additions": 17,
                    "file_deletions": 10,
                    "file_exists": false,
                    "file_name": "core/arch/opnd_shared.c",
                    "file_size": 0
                },
                {
                    "file_additions": 7,
                    "file_deletions": 4,
                    "file_exists": true,
                    "file_name": "core/arch/proc_shared.c",
                    "file_size": 8387
                },
                {
                    "file_additions": 1,
                    "file_deletions": 1,
                    "file_exists": true,
                    "file_name": "core/arch/retcheck.c",
                    "file_size": 78603
                },
                {
                    "file_additions": 3,
                    "file_deletions": 2,
                    "file_exists": false,
                    "file_name": "core/arch/x86/decode.c",
                    "file_size": 0
                },
                {
                    "file_additions": 19,
                    "file_deletions": 10,
                    "file_exists": true,
                    "file_name": "core/arch/x86/emit_utils.c",
                    "file_size": 138194
                },
                {
                    "file_additions": 6,
                    "file_deletions": 3,
                    "file_exists": false,
                    "file_name": "core/arch/x86/encode.c",
                    "file_size": 0
                },
                {
                    "file_additions": 10,
                    "file_deletions": 8,
                    "file_exists": false,
                    "file_name": "core/arch/x86/instr.c",
                    "file_size": 0
                },
                {
                    "file_additions": 9,
                    "file_deletions": 5,
                    "file_exists": true,
                    "file_name": "core/arch/x86/mangle.c",
                    "file_size": 178314
                },
                {
                    "file_additions": 3,
                    "file_deletions": 2,
                    "file_exists": true,
                    "file_name": "core/arch/x86/x86_to_x64.c",
                    "file_size": 25022
                },
                {
                    "file_additions": 4,
                    "file_deletions": 2,
                    "file_exists": true,
                    "file_name": "core/config.c",
                    "file_size": 28744
                },
                {
                    "file_additions": 18,
                    "file_deletions": 11,
                    "file_exists": true,
                    "file_name": "core/dispatch.c",
                    "file_size": 106432
                },
                {
                    "file_additions": 20,
                    "file_deletions": 12,
                    "file_exists": true,
                    "file_name": "core/dynamo.c",
                    "file_size": 131111
                },
                {
                    "file_additions": 5,
                    "file_deletions": 4,
                    "file_exists": true,
                    "file_name": "core/emit.c",
                    "file_size": 37375
                },
                {
                    "file_additions": 29,
                    "file_deletions": 17,
                    "file_exists": true,
                    "file_name": "core/fcache.c",
                    "file_size": 197574
                },
                {
                    "file_additions": 49,
                    "file_deletions": 34,
                    "file_exists": true,
                    "file_name": "core/fragment.c",
                    "file_size": 369058
                },
                {
                    "file_additions": 24,
                    "file_deletions": 12,
                    "file_exists": true,
                    "file_name": "core/hashtable.c",
                    "file_size": 22540
                },
                {
                    "file_additions": 46,
                    "file_deletions": 30,
                    "file_exists": true,
                    "file_name": "core/heap.c",
                    "file_size": 248433
                },
                {
                    "file_additions": 13,
                    "file_deletions": 9,
                    "file_exists": true,
                    "file_name": "core/hotpatch.c",
                    "file_size": 277335
                },
                {
                    "file_additions": 9,
                    "file_deletions": 4,
                    "file_exists": true,
                    "file_name": "core/lib/fortran.c",
                    "file_size": 2293
                },
                {
                    "file_additions": 9,
                    "file_deletions": 14,
                    "file_exists": true,
                    "file_name": "core/lib/instrument.c",
                    "file_size": 282723
                },
                {
                    "file_additions": 4,
                    "file_deletions": 2,
                    "file_exists": true,
                    "file_name": "core/link.c",
                    "file_size": 160221
                },
                {
                    "file_additions": 2,
                    "file_deletions": 1,
                    "file_exists": true,
                    "file_name": "core/loader_shared.c",
                    "file_size": 39067
                },
                {
                    "file_additions": 5,
                    "file_deletions": 3,
                    "file_exists": true,
                    "file_name": "core/moduledb.c",
                    "file_size": 27453
                },
                {
                    "file_additions": 11,
                    "file_deletions": 6,
                    "file_exists": true,
                    "file_name": "core/monitor.c",
                    "file_size": 103408
                },
                {
                    "file_additions": 5,
                    "file_deletions": 3,
                    "file_exists": true,
                    "file_name": "core/nudge.c",
                    "file_size": 23441
                },
                {
                    "file_additions": 100,
                    "file_deletions": 51,
                    "file_exists": true,
                    "file_name": "core/options.c",
                    "file_size": 111483
                },
                {
                    "file_additions": 7,
                    "file_deletions": 3,
                    "file_exists": true,
                    "file_name": "core/perfctr.c",
                    "file_size": 6433
                },
                {
                    "file_additions": 5,
                    "file_deletions": 4,
                    "file_exists": true,
                    "file_name": "core/perscache.c",
                    "file_size": 195055
                },
                {
                    "file_additions": 3,
                    "file_deletions": 2,
                    "file_exists": true,
                    "file_name": "core/stats.c",
                    "file_size": 14667
                },
                {
                    "file_additions": 7,
                    "file_deletions": 5,
                    "file_exists": true,
                    "file_name": "core/string.c",
                    "file_size": 11532
                },
                {
                    "file_additions": 4,
                    "file_deletions": 2,
                    "file_exists": true,
                    "file_name": "core/synch.c",
                    "file_size": 103417
                },
                {
                    "file_additions": 3,
                    "file_deletions": 2,
                    "file_exists": true,
                    "file_name": "core/translate.c",
                    "file_size": 93531
                },
                {
                    "file_additions": 19,
                    "file_deletions": 12,
                    "file_exists": true,
                    "file_name": "core/unit-rct.c",
                    "file_size": 15258
                },
                {
                    "file_additions": 2,
                    "file_deletions": 2,
                    "file_exists": true,
                    "file_name": "core/unix/memquery_linux.c",
                    "file_size": 15096
                },
                {
                    "file_additions": 2,
                    "file_deletions": 1,
                    "file_exists": true,
                    "file_name": "core/unix/module_elf.c",
                    "file_size": 64169
                },
                {
                    "file_additions": 30,
                    "file_deletions": 17,
                    "file_exists": true,
                    "file_name": "core/unix/os.c",
                    "file_size": 435916
                },
                {
                    "file_additions": 3,
                    "file_deletions": 2,
                    "file_exists": true,
                    "file_name": "core/unix/pcprofile.c",
                    "file_size": 21976
                },
                {
                    "file_additions": 2,
                    "file_deletions": 2,
                    "file_exists": true,
                    "file_name": "core/unix/preload.c",
                    "file_size": 6486
                },
                {
                    "file_additions": 23,
                    "file_deletions": 14,
                    "file_exists": true,
                    "file_name": "core/unix/signal.c",
                    "file_size": 362791
                },
                {
                    "file_additions": 4,
                    "file_deletions": 2,
                    "file_exists": true,
                    "file_name": "core/unix/signal_macos.c",
                    "file_size": 14496
                },
                {
                    "file_additions": 6,
                    "file_deletions": 5,
                    "file_exists": true,
                    "file_name": "core/unix/stackdump.c",
                    "file_size": 11182
                },
                {
                    "file_additions": 4,
                    "file_deletions": 3,
                    "file_exists": true,
                    "file_name": "core/unix/tls_linux_x86.c",
                    "file_size": 34491
                },
                {
                    "file_additions": 79,
                    "file_deletions": 60,
                    "file_exists": true,
                    "file_name": "core/utils.c",
                    "file_size": 170651
                },
                {
                    "file_additions": 173,
                    "file_deletions": 100,
                    "file_exists": true,
                    "file_name": "core/vmareas.c",
                    "file_size": 524807
                },
                {
                    "file_additions": 73,
                    "file_deletions": 49,
                    "file_exists": true,
                    "file_name": "core/win32/aslr.c",
                    "file_size": 297368
                },
                {
                    "file_additions": 117,
                    "file_deletions": 76,
                    "file_exists": true,
                    "file_name": "core/win32/callback.c",
                    "file_size": 390120
                },
                {
                    "file_additions": 32,
                    "file_deletions": 18,
                    "file_exists": true,
                    "file_name": "core/win32/diagnost.c",
                    "file_size": 63415
                },
                {
                    "file_additions": 4,
                    "file_deletions": 3,
                    "file_exists": true,
                    "file_name": "core/win32/drmarker.c",
                    "file_size": 12136
                },
                {
                    "file_additions": 4,
                    "file_deletions": 8,
                    "file_exists": true,
                    "file_name": "core/win32/drwinapi/kernel32_mem.c",
                    "file_size": 23639
                },
                {
                    "file_additions": 4,
                    "file_deletions": 4,
                    "file_exists": true,
                    "file_name": "core/win32/drwinapi/kernel32_sync.c",
                    "file_size": 7845
                },
                {
                    "file_additions": 2,
                    "file_deletions": 2,
                    "file_exists": true,
                    "file_name": "core/win32/drwinapi/ntdll_redir.c",
                    "file_size": 40462
                },
                {
                    "file_additions": 3,
                    "file_deletions": 6,
                    "file_exists": true,
                    "file_name": "core/win32/drwinapi/rpcrt4_redir.c",
                    "file_size": 4817
                },
                {
                    "file_additions": 27,
                    "file_deletions": 16,
                    "file_exists": true,
                    "file_name": "core/win32/eventlog.c",
                    "file_size": 36736
                },
                {
                    "file_additions": 3,
                    "file_deletions": 2,
                    "file_exists": true,
                    "file_name": "core/win32/inject.c",
                    "file_size": 70962
                },
                {
                    "file_additions": 29,
                    "file_deletions": 14,
                    "file_exists": true,
                    "file_name": "core/win32/inject_shared.c",
                    "file_size": 57731
                },
                {
                    "file_additions": 17,
                    "file_deletions": 9,
                    "file_exists": true,
                    "file_name": "core/win32/injector.c",
                    "file_size": 40958
                },
                {
                    "file_additions": 2,
                    "file_deletions": 1,
                    "file_exists": true,
                    "file_name": "core/win32/loader.c",
                    "file_size": 118838
                },
                {
                    "file_additions": 85,
                    "file_deletions": 51,
                    "file_exists": true,
                    "file_name": "core/win32/module.c",
                    "file_size": 279583
                },
                {
                    "file_additions": 4,
                    "file_deletions": 3,
                    "file_exists": true,
                    "file_name": "core/win32/module_shared.c",
                    "file_size": 61180
                },
                {
                    "file_additions": 52,
                    "file_deletions": 36,
                    "file_exists": true,
                    "file_name": "core/win32/ntdll.c",
                    "file_size": 214549
                },
                {
                    "file_additions": 3,
                    "file_deletions": 3,
                    "file_exists": true,
                    "file_name": "core/win32/ntdll_shared.c",
                    "file_size": 9270
                },
                {
                    "file_additions": 78,
                    "file_deletions": 46,
                    "file_exists": true,
                    "file_name": "core/win32/os.c",
                    "file_size": 388839
                },
                {
                    "file_additions": 13,
                    "file_deletions": 8,
                    "file_exists": true,
                    "file_name": "core/win32/pre_inject.c",
                    "file_size": 17304
                },
                {
                    "file_additions": 52,
                    "file_deletions": 31,
                    "file_exists": true,
                    "file_name": "core/win32/syscall.c",
                    "file_size": 226437
                },
                {
                    "file_additions": 1,
                    "file_deletions": 1,
                    "file_exists": true,
                    "file_name": "ext/drgui/drgui_main_window.cpp",
                    "file_size": 17436
                },
                {
                    "file_additions": 3,
                    "file_deletions": 2,
                    "file_exists": true,
                    "file_name": "ext/drsyms/drsyms_pecoff.c",
                    "file_size": 23164
                },
                {
                    "file_additions": 8,
                    "file_deletions": 6,
                    "file_exists": true,
                    "file_name": "ext/drsyms/drsyms_windows.c",
                    "file_size": 67372
                },
                {
                    "file_additions": 2,
                    "file_deletions": 1,
                    "file_exists": true,
                    "file_name": "ext/drwrap/drwrap.c",
                    "file_size": 111114
                },
                {
                    "file_additions": 13,
                    "file_deletions": 7,
                    "file_exists": true,
                    "file_name": "suite/tests/client-interface/drsyms-test.dll.cpp",
                    "file_size": 50112
                },
                {
                    "file_additions": 5,
                    "file_deletions": 3,
                    "file_exists": true,
                    "file_name": "suite/tests/linux/alarm.c",
                    "file_size": 2132
                },
                {
                    "file_additions": 3,
                    "file_deletions": 2,
                    "file_exists": true,
                    "file_name": "suite/tests/linux/clone.c",
                    "file_size": 13188
                },
                {
                    "file_additions": 3,
                    "file_deletions": 1,
                    "file_exists": true,
                    "file_name": "suite/tests/linux/execve-rec.c",
                    "file_size": 3078
                },
                {
                    "file_additions": 3,
                    "file_deletions": 2,
                    "file_exists": true,
                    "file_name": "suite/tests/linux/fork-sleep.c",
                    "file_size": 3123
                },
                {
                    "file_additions": 4,
                    "file_deletions": 3,
                    "file_exists": true,
                    "file_name": "suite/tests/linux/fork.c",
                    "file_size": 2629
                },
                {
                    "file_additions": 6,
                    "file_deletions": 5,
                    "file_exists": true,
                    "file_name": "suite/tests/linux/infinite.c",
                    "file_size": 3078
                },
                {
                    "file_additions": 5,
                    "file_deletions": 3,
                    "file_exists": true,
                    "file_name": "suite/tests/linux/longjmp.c",
                    "file_size": 2346
                },
                {
                    "file_additions": 3,
                    "file_deletions": 1,
                    "file_exists": true,
                    "file_name": "suite/tests/linux/sigaction_nosignals.c",
                    "file_size": 13307
                },
                {
                    "file_additions": 9,
                    "file_deletions": 4,
                    "file_exists": true,
                    "file_name": "suite/tests/linux/signal_racesys.c",
                    "file_size": 6598
                },
                {
                    "file_additions": 3,
                    "file_deletions": 2,
                    "file_exists": true,
                    "file_name": "suite/tests/linux/signalfd.c",
                    "file_size": 4332
                },
                {
                    "file_additions": 5,
                    "file_deletions": 3,
                    "file_exists": true,
                    "file_name": "suite/tests/linux/thread.c",
                    "file_size": 7630
                },
                {
                    "file_additions": 5,
                    "file_deletions": 3,
                    "file_exists": true,
                    "file_name": "suite/tests/linux/threadexit.c",
                    "file_size": 7680
                },
                {
                    "file_additions": 5,
                    "file_deletions": 3,
                    "file_exists": true,
                    "file_name": "suite/tests/linux/threadexit2.c",
                    "file_size": 8807
                },
                {
                    "file_additions": 16,
                    "file_deletions": 9,
                    "file_exists": true,
                    "file_name": "suite/tests/linux/vfork-fib.c",
                    "file_size": 5647
                },
                {
                    "file_additions": 3,
                    "file_deletions": 2,
                    "file_exists": true,
                    "file_name": "suite/tests/linux/vfork.c",
                    "file_size": 4520
                },
                {
                    "file_additions": 10,
                    "file_deletions": 5,
                    "file_exists": true,
                    "file_name": "suite/tests/runall/detach_test.c",
                    "file_size": 10976
                },
                {
                    "file_additions": 4,
                    "file_deletions": 4,
                    "file_exists": true,
                    "file_name": "suite/tests/runall/earlythread.c",
                    "file_size": 8256
                }
            ],
            "interesting": {
                "reopen": false,
                "status": false
            },
            "is_parent": true,
            "sha": "ec8c19e58558c882d1c121e317ded836c8e5173f"
        },
        {
            "associated_pull_request": [
                "https://github.com/DynamoRIO/dynamorio/pull/2295"
            ],
            "date": "2017-05-16 17:35:16+00:00",
            "diff": "dynamorio_dynamorio/issue_2144/commit_47b56c854bd8d4137dad54e5cc124ab983ecb370.diff",
            "diff_additions": 314,
            "diff_deletions": 3,
            "diff_file_size": 1597304,
            "diff_url": "https://github.com/DynamoRIO/dynamorio/commit/47b56c854bd8d4137dad54e5cc124ab983ecb370.diff",
            "exists": true,
            "files": [
                {
                    "file_additions": 37,
                    "file_deletions": 1,
                    "file_exists": true,
                    "file_name": "core/arch/interp.c",
                    "file_size": 372678
                },
                {
                    "file_additions": 17,
                    "file_deletions": 0,
                    "file_exists": true,
                    "file_name": "core/arch/mangle_shared.c",
                    "file_size": 89477
                },
                {
                    "file_additions": 21,
                    "file_deletions": 1,
                    "file_exists": false,
                    "file_name": "core/arch/x86/decode_fast.c",
                    "file_size": 0
                },
                {
                    "file_additions": 7,
                    "file_deletions": 0,
                    "file_exists": false,
                    "file_name": "core/arch/x86/instr.c",
                    "file_size": 0
                },
                {
                    "file_additions": 45,
                    "file_deletions": 0,
                    "file_exists": true,
                    "file_name": "core/arch/x86/mangle.c",
                    "file_size": 178314
                },
                {
                    "file_additions": 9,
                    "file_deletions": 0,
                    "file_exists": true,
                    "file_name": "core/dispatch.c",
                    "file_size": 106432
                },
                {
                    "file_additions": 4,
                    "file_deletions": 0,
                    "file_exists": true,
                    "file_name": "core/translate.c",
                    "file_size": 93531
                },
                {
                    "file_additions": 1,
                    "file_deletions": 0,
                    "file_exists": true,
                    "file_name": "core/unix/signal.c",
                    "file_size": 362791
                },
                {
                    "file_additions": 68,
                    "file_deletions": 1,
                    "file_exists": true,
                    "file_name": "core/win32/callback.c",
                    "file_size": 390120
                },
                {
                    "file_additions": 105,
                    "file_deletions": 0,
                    "file_exists": true,
                    "file_name": "suite/tests/security-win32/singlestep.c",
                    "file_size": 3961
                }
            ],
            "interesting": {
                "reopen": true,
                "status": false
            },
            "is_parent": false,
            "sha": "47b56c854bd8d4137dad54e5cc124ab983ecb370"
        },
        {
            "associated_pull_request": [
                "https://github.com/DynamoRIO/dynamorio/pull/2435"
            ],
            "date": "2017-05-17 14:56:55+00:00",
            "diff": "dynamorio_dynamorio/issue_2144/commit_d32042d3b7c0ed167fd0bed50dcde4039a611d07.diff",
            "diff_additions": 10,
            "diff_deletions": 7,
            "diff_file_size": 869230,
            "diff_url": "https://github.com/DynamoRIO/dynamorio/commit/d32042d3b7c0ed167fd0bed50dcde4039a611d07.diff",
            "exists": true,
            "files": [
                {
                    "file_additions": 6,
                    "file_deletions": 5,
                    "file_exists": true,
                    "file_name": "core/arch/interp.c",
                    "file_size": 372678
                },
                {
                    "file_additions": 2,
                    "file_deletions": 1,
                    "file_exists": true,
                    "file_name": "core/dispatch.c",
                    "file_size": 106432
                },
                {
                    "file_additions": 2,
                    "file_deletions": 1,
                    "file_exists": true,
                    "file_name": "core/win32/callback.c",
                    "file_size": 390120
                }
            ],
            "interesting": {
                "reopen": false,
                "status": false
            },
            "is_parent": false,
            "sha": "d32042d3b7c0ed167fd0bed50dcde4039a611d07"
        },
        {
            "associated_pull_request": [
                "https://github.com/DynamoRIO/dynamorio/pull/2435"
            ],
            "date": "2017-05-17 16:14:30+00:00",
            "diff": "dynamorio_dynamorio/issue_2144/commit_4a8d9fd2c4f9badb46ff157135ae90acc9259982.diff",
            "diff_additions": 10,
            "diff_deletions": 7,
            "diff_file_size": 869230,
            "diff_url": "https://github.com/DynamoRIO/dynamorio/commit/4a8d9fd2c4f9badb46ff157135ae90acc9259982.diff",
            "exists": true,
            "files": [
                {
                    "file_additions": 6,
                    "file_deletions": 5,
                    "file_exists": true,
                    "file_name": "core/arch/interp.c",
                    "file_size": 372678
                },
                {
                    "file_additions": 2,
                    "file_deletions": 1,
                    "file_exists": true,
                    "file_name": "core/dispatch.c",
                    "file_size": 106432
                },
                {
                    "file_additions": 2,
                    "file_deletions": 1,
                    "file_exists": true,
                    "file_name": "core/win32/callback.c",
                    "file_size": 390120
                }
            ],
            "interesting": {
                "reopen": false,
                "status": false
            },
            "is_parent": false,
            "sha": "4a8d9fd2c4f9badb46ff157135ae90acc9259982"
        },
        {
            "associated_pull_request": [
                "https://github.com/DynamoRIO/dynamorio/pull/2434"
            ],
            "date": "2017-05-17 16:14:30+00:00",
            "diff": "dynamorio_dynamorio/issue_2144/commit_9e245c35aa7eb71e1e8d6aea4cea3a6adeac9ae8.diff",
            "diff_additions": 4,
            "diff_deletions": 4,
            "diff_file_size": 372678,
            "diff_url": "https://github.com/DynamoRIO/dynamorio/commit/9e245c35aa7eb71e1e8d6aea4cea3a6adeac9ae8.diff",
            "exists": true,
            "files": [
                {
                    "file_additions": 4,
                    "file_deletions": 4,
                    "file_exists": true,
                    "file_name": "core/arch/interp.c",
                    "file_size": 372678
                }
            ],
            "interesting": {
                "reopen": false,
                "status": false
            },
            "is_parent": false,
            "sha": "9e245c35aa7eb71e1e8d6aea4cea3a6adeac9ae8"
        }
    ],
    "first_commit": "2017-05-15 04:27:09+00:00",
    "last_commit": "2017-05-29 16:01:12+00:00",
    "number": 2144,
    "pull_request": "None",
    "score": {
        "accidental_reopen_likely": false,
        "all_labels": [
            "OpSys-Windows",
            "Hotlist-Release",
            "Bug-AppCrash"
        ],
        "contains_keywords": [
            "confirm",
            "work",
            "fail",
            "chang",
            "fix",
            "issu",
            "CI",
            "patch",
            "debug",
            "test",
            "fault",
            "bug",
            "error",
            "problem",
            "crash",
            "report"
        ],
        "fix_size": 220,
        "has_labels": [],
        "intersecting": {
            "computed_score": 1.0,
            "final_commit_size": 5,
            "intersection_size": 5,
            "previous_commits_size": 220
        },
        "is_makefile_based": true,
        "no_new_files": [],
        "no_other_files": false,
        "num_prohibited_files": 207774,
        "prohibited_files": [
            "server/src/main/java/com/genymobile/scrcpy/Device.java",
            "server/src/main/java/com/genymobile/scrcpy/wrappers/SurfaceControl.java",
            "server/src/main/java/com/genymobile/scrcpy/Device.java",
            "server/src/main/java/com/genymobile/scrcpy/wrappers/SurfaceControl.java",
            "app/meson.build",
            "app/scrcpy.1",
            "app/src/common.h",
            "app/src/scrcpy.h",
            "app/src/server.h",
            "server/src/main/java/com/genymobile/scrcpy/Workarounds.java"
        ],
        "reopen": true,
        "reopen_events": [
            [
                "2017-05-16 17:35:19+00:00",
                "closed"
            ],
            [
                "2017-05-16 17:35:19+00:00",
                "commit"
            ],
            [
                "2017-05-17 15:01:01+00:00",
                "reopened"
            ],
            [
                "2017-05-17 15:12:55+00:00",
                "commit"
            ],
            [
                "2017-05-17 16:14:30+00:00",
                "closed"
            ],
            [
                "2017-05-17 16:14:33+00:00",
                "commit"
            ],
            [
                "2017-05-29 16:02:01+00:00",
                "commit"
            ]
        ],
        "status": false,
        "strategy": true,
        "total_changes": 3219
    }
}