{
    "category": [
        "memory"
    ],
    "commits": [
        {
            "associated_pull_request": [],
            "date": "2014-09-11 18:20:49",
            "diff": "irssi_irssi/issue_143/commit_6884a74b29dfd1097b4aade39434ed23bb82ad7c.diff",
            "diff_additions": 88,
            "diff_deletions": 88,
            "diff_file_size": 722508,
            "diff_url": "https://github.com/irssi/irssi/commit/6884a74b29dfd1097b4aade39434ed23bb82ad7c.diff",
            "exists": true,
            "files": [
                {
                    "file_additions": 8,
                    "file_deletions": 8,
                    "file_exists": true,
                    "file_name": "src/fe-common/core/chat-completion.c",
                    "file_size": 37093
                },
                {
                    "file_additions": 8,
                    "file_deletions": 8,
                    "file_exists": true,
                    "file_name": "src/fe-common/core/command-history.c",
                    "file_size": 12727
                },
                {
                    "file_additions": 1,
                    "file_deletions": 1,
                    "file_exists": true,
                    "file_name": "src/fe-common/core/fe-channels.c",
                    "file_size": 20970
                },
                {
                    "file_additions": 2,
                    "file_deletions": 2,
                    "file_exists": true,
                    "file_name": "src/fe-common/core/fe-ignore.c",
                    "file_size": 9396
                },
                {
                    "file_additions": 2,
                    "file_deletions": 2,
                    "file_exists": true,
                    "file_name": "src/fe-common/core/fe-messages.c",
                    "file_size": 25890
                },
                {
                    "file_additions": 1,
                    "file_deletions": 1,
                    "file_exists": true,
                    "file_name": "src/fe-common/core/fe-windows.c",
                    "file_size": 21070
                },
                {
                    "file_additions": 2,
                    "file_deletions": 2,
                    "file_exists": true,
                    "file_name": "src/fe-common/core/printtext.c",
                    "file_size": 14540
                },
                {
                    "file_additions": 1,
                    "file_deletions": 1,
                    "file_exists": true,
                    "file_name": "src/fe-common/core/themes.c",
                    "file_size": 38672
                },
                {
                    "file_additions": 1,
                    "file_deletions": 1,
                    "file_exists": false,
                    "file_name": "src/fe-common/core/wcwidth.c",
                    "file_size": 0
                },
                {
                    "file_additions": 1,
                    "file_deletions": 1,
                    "file_exists": true,
                    "file_name": "src/fe-common/core/window-commands.c",
                    "file_size": 27828
                },
                {
                    "file_additions": 1,
                    "file_deletions": 1,
                    "file_exists": true,
                    "file_name": "src/fe-common/core/windows-layout.c",
                    "file_size": 8347
                },
                {
                    "file_additions": 1,
                    "file_deletions": 1,
                    "file_exists": true,
                    "file_name": "src/fe-common/irc/dcc/fe-dcc-chat-messages.c",
                    "file_size": 5281
                },
                {
                    "file_additions": 1,
                    "file_deletions": 1,
                    "file_exists": true,
                    "file_name": "src/fe-common/irc/fe-events-numeric.c",
                    "file_size": 29302
                },
                {
                    "file_additions": 2,
                    "file_deletions": 2,
                    "file_exists": true,
                    "file_name": "src/fe-common/irc/fe-irc-commands.c",
                    "file_size": 12830
                },
                {
                    "file_additions": 3,
                    "file_deletions": 3,
                    "file_exists": true,
                    "file_name": "src/fe-common/irc/fe-irc-messages.c",
                    "file_size": 12359
                },
                {
                    "file_additions": 2,
                    "file_deletions": 2,
                    "file_exists": true,
                    "file_name": "src/fe-common/irc/fe-irc-server.c",
                    "file_size": 7393
                },
                {
                    "file_additions": 1,
                    "file_deletions": 1,
                    "file_exists": true,
                    "file_name": "src/fe-common/irc/fe-whois.c",
                    "file_size": 13158
                },
                {
                    "file_additions": 3,
                    "file_deletions": 3,
                    "file_exists": true,
                    "file_name": "src/fe-text/gui-entry.c",
                    "file_size": 35958
                },
                {
                    "file_additions": 2,
                    "file_deletions": 2,
                    "file_exists": true,
                    "file_name": "src/fe-text/irssi.c",
                    "file_size": 9473
                },
                {
                    "file_additions": 1,
                    "file_deletions": 1,
                    "file_exists": true,
                    "file_name": "src/fe-text/statusbar.c",
                    "file_size": 32075
                },
                {
                    "file_additions": 1,
                    "file_deletions": 1,
                    "file_exists": true,
                    "file_name": "src/fe-text/textbuffer-view.c",
                    "file_size": 40524
                },
                {
                    "file_additions": 1,
                    "file_deletions": 1,
                    "file_exists": true,
                    "file_name": "src/irc/core/bans.c",
                    "file_size": 9789
                },
                {
                    "file_additions": 3,
                    "file_deletions": 3,
                    "file_exists": true,
                    "file_name": "src/irc/core/channel-events.c",
                    "file_size": 11868
                },
                {
                    "file_additions": 1,
                    "file_deletions": 1,
                    "file_exists": true,
                    "file_name": "src/irc/core/channel-rejoin.c",
                    "file_size": 7911
                },
                {
                    "file_additions": 5,
                    "file_deletions": 5,
                    "file_exists": true,
                    "file_name": "src/irc/core/irc-channels.c",
                    "file_size": 7970
                },
                {
                    "file_additions": 3,
                    "file_deletions": 3,
                    "file_exists": true,
                    "file_name": "src/irc/core/irc-commands.c",
                    "file_size": 34673
                },
                {
                    "file_additions": 2,
                    "file_deletions": 2,
                    "file_exists": true,
                    "file_name": "src/irc/core/irc-nicklist.c",
                    "file_size": 19275
                },
                {
                    "file_additions": 1,
                    "file_deletions": 1,
                    "file_exists": true,
                    "file_name": "src/irc/core/irc-servers-reconnect.c",
                    "file_size": 4302
                },
                {
                    "file_additions": 1,
                    "file_deletions": 1,
                    "file_exists": true,
                    "file_name": "src/irc/core/irc-servers.c",
                    "file_size": 36341
                },
                {
                    "file_additions": 1,
                    "file_deletions": 1,
                    "file_exists": true,
                    "file_name": "src/irc/core/irc-session.c",
                    "file_size": 8950
                },
                {
                    "file_additions": 4,
                    "file_deletions": 4,
                    "file_exists": true,
                    "file_name": "src/irc/core/modes.c",
                    "file_size": 24871
                },
                {
                    "file_additions": 5,
                    "file_deletions": 5,
                    "file_exists": true,
                    "file_name": "src/irc/dcc/dcc-chat.c",
                    "file_size": 22420
                },
                {
                    "file_additions": 2,
                    "file_deletions": 2,
                    "file_exists": true,
                    "file_name": "src/irc/dcc/dcc-get.c",
                    "file_size": 16269
                },
                {
                    "file_additions": 1,
                    "file_deletions": 1,
                    "file_exists": true,
                    "file_name": "src/irc/dcc/dcc-resume.c",
                    "file_size": 7329
                },
                {
                    "file_additions": 4,
                    "file_deletions": 4,
                    "file_exists": true,
                    "file_name": "src/irc/dcc/dcc-send.c",
                    "file_size": 12759
                },
                {
                    "file_additions": 4,
                    "file_deletions": 4,
                    "file_exists": true,
                    "file_name": "src/irc/dcc/dcc.c",
                    "file_size": 15658
                },
                {
                    "file_additions": 1,
                    "file_deletions": 1,
                    "file_exists": true,
                    "file_name": "src/irc/flood/autoignore.c",
                    "file_size": 2447
                },
                {
                    "file_additions": 2,
                    "file_deletions": 2,
                    "file_exists": true,
                    "file_name": "src/irc/proxy/listen.c",
                    "file_size": 23779
                },
                {
                    "file_additions": 1,
                    "file_deletions": 1,
                    "file_exists": true,
                    "file_name": "src/perl/perl-common.c",
                    "file_size": 21750
                },
                {
                    "file_additions": 1,
                    "file_deletions": 1,
                    "file_exists": true,
                    "file_name": "src/perl/perl-signals.c",
                    "file_size": 19261
                }
            ],
            "interesting": {
                "reopen": false,
                "status": false
            },
            "is_parent": true,
            "sha": "6884a74b29dfd1097b4aade39434ed23bb82ad7c"
        },
        {
            "associated_pull_request": [],
            "date": "2014-09-28 13:48:48",
            "diff": "irssi_irssi/issue_143/commit_f8d31dea589dc775933bf77fb5eee94800847d87.diff",
            "diff_additions": 39,
            "diff_deletions": 14,
            "diff_file_size": 95714,
            "diff_url": "https://github.com/irssi/irssi/commit/f8d31dea589dc775933bf77fb5eee94800847d87.diff",
            "exists": true,
            "files": [
                {
                    "file_additions": 6,
                    "file_deletions": 2,
                    "file_exists": true,
                    "file_name": "src/core/expandos.c",
                    "file_size": 21555
                },
                {
                    "file_additions": 10,
                    "file_deletions": 6,
                    "file_exists": true,
                    "file_name": "src/core/log.c",
                    "file_size": 14332
                },
                {
                    "file_additions": 11,
                    "file_deletions": 2,
                    "file_exists": true,
                    "file_name": "src/fe-common/core/chat-completion.c",
                    "file_size": 37093
                },
                {
                    "file_additions": 12,
                    "file_deletions": 4,
                    "file_exists": true,
                    "file_name": "src/fe-common/core/fe-log.c",
                    "file_size": 22734
                }
            ],
            "interesting": {
                "reopen": false,
                "status": false
            },
            "is_parent": false,
            "sha": "f8d31dea589dc775933bf77fb5eee94800847d87"
        },
        {
            "associated_pull_request": [],
            "date": "2014-09-28 13:48:48",
            "diff": "irssi_irssi/issue_143/commit_81aeea506beaad48d91a4d79eddf2af236740bfb.diff",
            "diff_additions": 51,
            "diff_deletions": 25,
            "diff_file_size": 95714,
            "diff_url": "https://github.com/irssi/irssi/commit/81aeea506beaad48d91a4d79eddf2af236740bfb.diff",
            "exists": true,
            "files": [
                {
                    "file_additions": 14,
                    "file_deletions": 8,
                    "file_exists": true,
                    "file_name": "src/core/expandos.c",
                    "file_size": 21555
                },
                {
                    "file_additions": 12,
                    "file_deletions": 8,
                    "file_exists": true,
                    "file_name": "src/core/log.c",
                    "file_size": 14332
                },
                {
                    "file_additions": 11,
                    "file_deletions": 3,
                    "file_exists": true,
                    "file_name": "src/fe-common/core/chat-completion.c",
                    "file_size": 37093
                },
                {
                    "file_additions": 14,
                    "file_deletions": 6,
                    "file_exists": true,
                    "file_name": "src/fe-common/core/fe-log.c",
                    "file_size": 22734
                }
            ],
            "interesting": {
                "reopen": false,
                "status": false
            },
            "is_parent": false,
            "sha": "81aeea506beaad48d91a4d79eddf2af236740bfb"
        },
        {
            "associated_pull_request": [
                "https://github.com/irssi/irssi/pull/147"
            ],
            "date": "2014-09-28 13:48:48",
            "diff": "irssi_irssi/issue_143/commit_d9ea224628af1a4394fec20610e136a3c6817f00.diff",
            "diff_additions": 54,
            "diff_deletions": 26,
            "diff_file_size": 95714,
            "diff_url": "https://github.com/irssi/irssi/commit/d9ea224628af1a4394fec20610e136a3c6817f00.diff",
            "exists": true,
            "files": [
                {
                    "file_additions": 14,
                    "file_deletions": 8,
                    "file_exists": true,
                    "file_name": "src/core/expandos.c",
                    "file_size": 21555
                },
                {
                    "file_additions": 12,
                    "file_deletions": 8,
                    "file_exists": true,
                    "file_name": "src/core/log.c",
                    "file_size": 14332
                },
                {
                    "file_additions": 11,
                    "file_deletions": 3,
                    "file_exists": true,
                    "file_name": "src/fe-common/core/chat-completion.c",
                    "file_size": 37093
                },
                {
                    "file_additions": 17,
                    "file_deletions": 7,
                    "file_exists": true,
                    "file_name": "src/fe-common/core/fe-log.c",
                    "file_size": 22734
                }
            ],
            "interesting": {
                "reopen": false,
                "status": false
            },
            "is_parent": false,
            "sha": "d9ea224628af1a4394fec20610e136a3c6817f00"
        }
    ],
    "first_commit": "2014-09-11 18:20:49",
    "last_commit": "2015-06-12 18:44:32",
    "number": 143,
    "pull_request": "None",
    "score": {
        "accidental_reopen_likely": false,
        "all_labels": [],
        "contains_keywords": [
            "fix",
            "patch",
            "bug",
            "test",
            "remov",
            "issu",
            "error"
        ],
        "fix_size": 82,
        "has_labels": [],
        "intersecting": {
            "computed_score": 0.9253731343283582,
            "final_commit_size": 67,
            "intersection_size": 62,
            "previous_commits_size": 77
        },
        "is_makefile_based": true,
        "no_new_files": [],
        "no_other_files": false,
        "num_prohibited_files": 31060,
        "prohibited_files": [
            "kill.h",
            "meminfo.h",
            "kill.h",
            "meminfo.h",
            "kill.h",
            "meminfo.h",
            "testsuite_cli_test.go",
            "testsuite_cli_test.go",
            "common.mk",
            "i3bar/include/draw_util.h"
        ],
        "reopen": false,
        "reopen_events": [
            [
                "2014-09-29 09:30:22",
                "commit"
            ],
            [
                "2014-09-29 20:21:47",
                "commit"
            ],
            [
                "2014-09-30 16:07:25",
                "commit"
            ],
            [
                "2014-10-11 08:45:22",
                "closed"
            ],
            [
                "2015-06-12 17:41:33",
                "commit"
            ],
            [
                "2015-06-12 18:44:37",
                "commit"
            ]
        ],
        "status": true,
        "strategy": true,
        "total_changes": 385
    }
}