{
    "category": [
        "memory",
        "GUI"
    ],
    "commits": [
        {
            "associated_pull_request": [
                "https://github.com/wolfcw/libfaketime/pull/296"
            ],
            "date": "2021-02-23 21:08:43",
            "diff": "wolfcw_libfaketime/issue_297/commit_46dc62564280cbe59d38073bdb0a57219c819213.diff",
            "diff_additions": 23,
            "diff_deletions": 0,
            "diff_file_size": 0,
            "diff_url": "https://github.com/wolfcw/libfaketime/commit/46dc62564280cbe59d38073bdb0a57219c819213.diff",
            "exists": true,
            "files": [
                {
                    "file_additions": 17,
                    "file_deletions": 0,
                    "file_exists": false,
                    "file_name": "test/librandom.c",
                    "file_size": 0
                },
                {
                    "file_additions": 6,
                    "file_deletions": 0,
                    "file_exists": false,
                    "file_name": "test/use_lib_random.c",
                    "file_size": 0
                }
            ],
            "interesting": {
                "reopen": false,
                "status": false
            },
            "is_parent": true,
            "sha": "46dc62564280cbe59d38073bdb0a57219c819213"
        },
        {
            "associated_pull_request": [],
            "date": "2021-02-24 02:42:42",
            "diff": "wolfcw_libfaketime/issue_297/commit_90a1589d18c182d600f2c0e093bea05e5d81cfdf.diff",
            "diff_additions": 19,
            "diff_deletions": 0,
            "diff_file_size": 104961,
            "diff_url": "https://github.com/wolfcw/libfaketime/commit/90a1589d18c182d600f2c0e093bea05e5d81cfdf.diff",
            "exists": true,
            "files": [
                {
                    "file_additions": 19,
                    "file_deletions": 0,
                    "file_exists": true,
                    "file_name": "src/libfaketime.c",
                    "file_size": 104961
                }
            ],
            "interesting": {
                "reopen": false,
                "status": false
            },
            "is_parent": false,
            "sha": "90a1589d18c182d600f2c0e093bea05e5d81cfdf"
        },
        {
            "associated_pull_request": [
                "https://github.com/wolfcw/libfaketime/pull/298"
            ],
            "date": "2021-02-24 02:42:42",
            "diff": "wolfcw_libfaketime/issue_297/commit_004222585e0c0300be491f296f1f6f7713e34fd9.diff",
            "diff_additions": 23,
            "diff_deletions": 0,
            "diff_file_size": 104961,
            "diff_url": "https://github.com/wolfcw/libfaketime/commit/004222585e0c0300be491f296f1f6f7713e34fd9.diff",
            "exists": true,
            "files": [
                {
                    "file_additions": 23,
                    "file_deletions": 0,
                    "file_exists": true,
                    "file_name": "src/libfaketime.c",
                    "file_size": 104961
                }
            ],
            "interesting": {
                "reopen": false,
                "status": false
            },
            "is_parent": false,
            "sha": "004222585e0c0300be491f296f1f6f7713e34fd9"
        },
        {
            "associated_pull_request": [
                "https://github.com/wolfcw/libfaketime/pull/300"
            ],
            "date": "2021-02-24 15:33:43",
            "diff": "wolfcw_libfaketime/issue_297/commit_2ca0b719e38fc83a6c3a3709f671e69e53a0b6be.diff",
            "diff_additions": 25,
            "diff_deletions": 0,
            "diff_file_size": 0,
            "diff_url": "https://github.com/wolfcw/libfaketime/commit/2ca0b719e38fc83a6c3a3709f671e69e53a0b6be.diff",
            "exists": true,
            "files": [
                {
                    "file_additions": 13,
                    "file_deletions": 0,
                    "file_exists": false,
                    "file_name": "test/libgetpid.c",
                    "file_size": 0
                },
                {
                    "file_additions": 12,
                    "file_deletions": 0,
                    "file_exists": false,
                    "file_name": "test/use_lib_getpid.c",
                    "file_size": 0
                }
            ],
            "interesting": {
                "reopen": true,
                "status": false
            },
            "is_parent": false,
            "sha": "2ca0b719e38fc83a6c3a3709f671e69e53a0b6be"
        },
        {
            "associated_pull_request": [
                "https://github.com/wolfcw/libfaketime/pull/305"
            ],
            "date": "2021-02-25 15:38:48",
            "diff": "wolfcw_libfaketime/issue_297/commit_7f4e5c378ae228b08ec4b10042d9de682281b3f9.diff",
            "diff_additions": 8,
            "diff_deletions": 2,
            "diff_file_size": 104961,
            "diff_url": "https://github.com/wolfcw/libfaketime/commit/7f4e5c378ae228b08ec4b10042d9de682281b3f9.diff",
            "exists": true,
            "files": [
                {
                    "file_additions": 8,
                    "file_deletions": 2,
                    "file_exists": true,
                    "file_name": "src/libfaketime.c",
                    "file_size": 104961
                }
            ],
            "interesting": {
                "reopen": false,
                "status": false
            },
            "is_parent": false,
            "sha": "7f4e5c378ae228b08ec4b10042d9de682281b3f9"
        }
    ],
    "first_commit": "2021-02-23 21:08:43",
    "last_commit": "2021-02-25 15:50:57",
    "number": 297,
    "pull_request": "None",
    "score": {
        "accidental_reopen_likely": false,
        "all_labels": [],
        "contains_keywords": [
            "report",
            "warn",
            "chang",
            "reason",
            "confirm",
            "bug",
            "crash",
            "test",
            "fix",
            "attempt",
            "issu"
        ],
        "fix_size": 33,
        "has_labels": [],
        "intersecting": {
            "computed_score": 0.1,
            "final_commit_size": 10,
            "intersection_size": 1,
            "previous_commits_size": 24
        },
        "is_makefile_based": true,
        "no_new_files": [],
        "no_other_files": false,
        "num_prohibited_files": 53702,
        "prohibited_files": [
            "hal/inc/pinmap_hal.h",
            "Debug/marvin.bin",
            "Debug/marvin.elf",
            "Debug/marvin.hex",
            "Debug/marvin.bin",
            "Debug/marvin.elf",
            "Debug/marvin.hex",
            "inc/spark_utilities.h",
            "Debug/marvin.bin",
            "Debug/marvin.elf"
        ],
        "reopen": true,
        "reopen_events": [
            [
                "2021-02-24 02:55:48",
                "commit"
            ],
            [
                "2021-02-24 03:19:50",
                "commit"
            ],
            [
                "2021-02-24 12:53:45",
                "closed"
            ],
            [
                "2021-02-24 16:15:44",
                "commit"
            ],
            [
                "2021-02-24 16:42:14",
                "reopened"
            ],
            [
                "2021-02-25 15:51:13",
                "commit"
            ],
            [
                "2021-02-25 23:53:47",
                "closed"
            ]
        ],
        "status": false,
        "strategy": true,
        "total_changes": 100
    }
}