{
    "category": [
        "GUI",
        "network/protocol"
    ],
    "commits": [
        {
            "associated_pull_request": [],
            "date": "2015-09-05 00:44:31",
            "diff": "pipelinedb_pipelinedb/issue_1058/commit_812de2cf1a09cfec0d38afcca4b666854201da1a.diff",
            "diff_additions": 18,
            "diff_deletions": 7,
            "diff_file_size": 0,
            "diff_url": "https://github.com/pipelinedb/pipelinedb/commit/812de2cf1a09cfec0d38afcca4b666854201da1a.diff",
            "exists": true,
            "files": [
                {
                    "file_additions": 0,
                    "file_deletions": 1,
                    "file_exists": false,
                    "file_name": "src/backend/optimizer/plan/createplan.c",
                    "file_size": 0
                },
                {
                    "file_additions": 18,
                    "file_deletions": 4,
                    "file_exists": false,
                    "file_name": "src/backend/pipeline/cont_plan.c",
                    "file_size": 0
                },
                {
                    "file_additions": 0,
                    "file_deletions": 2,
                    "file_exists": false,
                    "file_name": "src/backend/utils/adt/pipelinefuncs.c",
                    "file_size": 0
                }
            ],
            "interesting": {
                "reopen": false,
                "status": false
            },
            "is_parent": true,
            "sha": "812de2cf1a09cfec0d38afcca4b666854201da1a"
        },
        {
            "associated_pull_request": [],
            "date": "2015-09-05 17:20:35",
            "diff": "pipelinedb_pipelinedb/issue_1058/commit_59b446c9f53e4e855da2cc063eec7455718fffe8.diff",
            "diff_additions": 4,
            "diff_deletions": 0,
            "diff_file_size": 0,
            "diff_url": "https://github.com/pipelinedb/pipelinedb/commit/59b446c9f53e4e855da2cc063eec7455718fffe8.diff",
            "exists": true,
            "files": [
                {
                    "file_additions": 4,
                    "file_deletions": 0,
                    "file_exists": false,
                    "file_name": "src/backend/pipeline/cont_analyze.c",
                    "file_size": 0
                }
            ],
            "interesting": {
                "reopen": false,
                "status": false
            },
            "is_parent": false,
            "sha": "59b446c9f53e4e855da2cc063eec7455718fffe8"
        },
        {
            "associated_pull_request": [],
            "date": "2015-09-06 21:08:44",
            "diff": "pipelinedb_pipelinedb/issue_1058/commit_2a852bcba5a7fcac90472d2bd3b25e7c12613af2.diff",
            "diff_additions": 220,
            "diff_deletions": 49,
            "diff_file_size": 0,
            "diff_url": "https://github.com/pipelinedb/pipelinedb/commit/2a852bcba5a7fcac90472d2bd3b25e7c12613af2.diff",
            "exists": true,
            "files": [
                {
                    "file_additions": 4,
                    "file_deletions": 0,
                    "file_exists": false,
                    "file_name": "src/backend/catalog/dependency.c",
                    "file_size": 0
                },
                {
                    "file_additions": 21,
                    "file_deletions": 0,
                    "file_exists": false,
                    "file_name": "src/backend/catalog/pipeline_query.c",
                    "file_size": 0
                },
                {
                    "file_additions": 38,
                    "file_deletions": 9,
                    "file_exists": false,
                    "file_name": "src/backend/commands/pipelinecmds.c",
                    "file_size": 0
                },
                {
                    "file_additions": 1,
                    "file_deletions": 0,
                    "file_exists": false,
                    "file_name": "src/backend/nodes/makefuncs.c",
                    "file_size": 0
                },
                {
                    "file_additions": 3,
                    "file_deletions": 0,
                    "file_exists": false,
                    "file_name": "src/backend/parser/analyze.c",
                    "file_size": 0
                },
                {
                    "file_additions": 136,
                    "file_deletions": 40,
                    "file_exists": false,
                    "file_name": "src/backend/pipeline/cont_analyze.c",
                    "file_size": 0
                },
                {
                    "file_additions": 6,
                    "file_deletions": 0,
                    "file_exists": false,
                    "file_name": "src/backend/utils/adt/ruleutils.c",
                    "file_size": 0
                },
                {
                    "file_additions": 11,
                    "file_deletions": 0,
                    "file_exists": false,
                    "file_name": "src/backend/utils/misc/guc.c",
                    "file_size": 0
                }
            ],
            "interesting": {
                "reopen": false,
                "status": true
            },
            "is_parent": false,
            "sha": "2a852bcba5a7fcac90472d2bd3b25e7c12613af2"
        },
        {
            "associated_pull_request": [],
            "date": "2015-09-06 21:24:57",
            "diff": "pipelinedb_pipelinedb/issue_1058/commit_66173a047611bd53d23a7a4e4ff8c00d7d4e7db2.diff",
            "diff_additions": 224,
            "diff_deletions": 49,
            "diff_file_size": 0,
            "diff_url": "https://github.com/pipelinedb/pipelinedb/commit/66173a047611bd53d23a7a4e4ff8c00d7d4e7db2.diff",
            "exists": true,
            "files": [
                {
                    "file_additions": 4,
                    "file_deletions": 0,
                    "file_exists": false,
                    "file_name": "src/backend/catalog/dependency.c",
                    "file_size": 0
                },
                {
                    "file_additions": 21,
                    "file_deletions": 0,
                    "file_exists": false,
                    "file_name": "src/backend/catalog/pipeline_query.c",
                    "file_size": 0
                },
                {
                    "file_additions": 38,
                    "file_deletions": 9,
                    "file_exists": false,
                    "file_name": "src/backend/commands/pipelinecmds.c",
                    "file_size": 0
                },
                {
                    "file_additions": 1,
                    "file_deletions": 0,
                    "file_exists": false,
                    "file_name": "src/backend/nodes/makefuncs.c",
                    "file_size": 0
                },
                {
                    "file_additions": 3,
                    "file_deletions": 0,
                    "file_exists": false,
                    "file_name": "src/backend/parser/analyze.c",
                    "file_size": 0
                },
                {
                    "file_additions": 140,
                    "file_deletions": 40,
                    "file_exists": false,
                    "file_name": "src/backend/pipeline/cont_analyze.c",
                    "file_size": 0
                },
                {
                    "file_additions": 6,
                    "file_deletions": 0,
                    "file_exists": false,
                    "file_name": "src/backend/utils/adt/ruleutils.c",
                    "file_size": 0
                },
                {
                    "file_additions": 11,
                    "file_deletions": 0,
                    "file_exists": false,
                    "file_name": "src/backend/utils/misc/guc.c",
                    "file_size": 0
                }
            ],
            "interesting": {
                "reopen": false,
                "status": false
            },
            "is_parent": false,
            "sha": "66173a047611bd53d23a7a4e4ff8c00d7d4e7db2"
        },
        {
            "associated_pull_request": [],
            "date": "2015-09-06 21:47:09",
            "diff": "pipelinedb_pipelinedb/issue_1058/commit_d564a1253ba0ed52e1c282a80b09f350744685e5.diff",
            "diff_additions": 225,
            "diff_deletions": 49,
            "diff_file_size": 0,
            "diff_url": "https://github.com/pipelinedb/pipelinedb/commit/d564a1253ba0ed52e1c282a80b09f350744685e5.diff",
            "exists": true,
            "files": [
                {
                    "file_additions": 4,
                    "file_deletions": 0,
                    "file_exists": false,
                    "file_name": "src/backend/catalog/dependency.c",
                    "file_size": 0
                },
                {
                    "file_additions": 21,
                    "file_deletions": 0,
                    "file_exists": false,
                    "file_name": "src/backend/catalog/pipeline_query.c",
                    "file_size": 0
                },
                {
                    "file_additions": 38,
                    "file_deletions": 9,
                    "file_exists": false,
                    "file_name": "src/backend/commands/pipelinecmds.c",
                    "file_size": 0
                },
                {
                    "file_additions": 1,
                    "file_deletions": 0,
                    "file_exists": false,
                    "file_name": "src/backend/nodes/makefuncs.c",
                    "file_size": 0
                },
                {
                    "file_additions": 3,
                    "file_deletions": 0,
                    "file_exists": false,
                    "file_name": "src/backend/parser/analyze.c",
                    "file_size": 0
                },
                {
                    "file_additions": 141,
                    "file_deletions": 40,
                    "file_exists": false,
                    "file_name": "src/backend/pipeline/cont_analyze.c",
                    "file_size": 0
                },
                {
                    "file_additions": 6,
                    "file_deletions": 0,
                    "file_exists": false,
                    "file_name": "src/backend/utils/adt/ruleutils.c",
                    "file_size": 0
                },
                {
                    "file_additions": 11,
                    "file_deletions": 0,
                    "file_exists": false,
                    "file_name": "src/backend/utils/misc/guc.c",
                    "file_size": 0
                }
            ],
            "interesting": {
                "reopen": false,
                "status": true
            },
            "is_parent": false,
            "sha": "d564a1253ba0ed52e1c282a80b09f350744685e5"
        },
        {
            "associated_pull_request": [],
            "date": "2015-09-06 21:53:48",
            "diff": "pipelinedb_pipelinedb/issue_1058/commit_6e91f1e4aa726d27513b4dbe17ef98cdcb8b0698.diff",
            "diff_additions": 225,
            "diff_deletions": 49,
            "diff_file_size": 0,
            "diff_url": "https://github.com/pipelinedb/pipelinedb/commit/6e91f1e4aa726d27513b4dbe17ef98cdcb8b0698.diff",
            "exists": true,
            "files": [
                {
                    "file_additions": 4,
                    "file_deletions": 0,
                    "file_exists": false,
                    "file_name": "src/backend/catalog/dependency.c",
                    "file_size": 0
                },
                {
                    "file_additions": 21,
                    "file_deletions": 0,
                    "file_exists": false,
                    "file_name": "src/backend/catalog/pipeline_query.c",
                    "file_size": 0
                },
                {
                    "file_additions": 38,
                    "file_deletions": 9,
                    "file_exists": false,
                    "file_name": "src/backend/commands/pipelinecmds.c",
                    "file_size": 0
                },
                {
                    "file_additions": 1,
                    "file_deletions": 0,
                    "file_exists": false,
                    "file_name": "src/backend/nodes/makefuncs.c",
                    "file_size": 0
                },
                {
                    "file_additions": 3,
                    "file_deletions": 0,
                    "file_exists": false,
                    "file_name": "src/backend/parser/analyze.c",
                    "file_size": 0
                },
                {
                    "file_additions": 141,
                    "file_deletions": 40,
                    "file_exists": false,
                    "file_name": "src/backend/pipeline/cont_analyze.c",
                    "file_size": 0
                },
                {
                    "file_additions": 6,
                    "file_deletions": 0,
                    "file_exists": false,
                    "file_name": "src/backend/utils/adt/ruleutils.c",
                    "file_size": 0
                },
                {
                    "file_additions": 11,
                    "file_deletions": 0,
                    "file_exists": false,
                    "file_name": "src/backend/utils/misc/guc.c",
                    "file_size": 0
                }
            ],
            "interesting": {
                "reopen": false,
                "status": false
            },
            "is_parent": false,
            "sha": "6e91f1e4aa726d27513b4dbe17ef98cdcb8b0698"
        },
        {
            "associated_pull_request": [],
            "date": "2015-09-06 22:01:00",
            "diff": "pipelinedb_pipelinedb/issue_1058/commit_f77f8908f00adf49970b0ffc2c98bc0a7d358928.diff",
            "diff_additions": 225,
            "diff_deletions": 49,
            "diff_file_size": 0,
            "diff_url": "https://github.com/pipelinedb/pipelinedb/commit/f77f8908f00adf49970b0ffc2c98bc0a7d358928.diff",
            "exists": true,
            "files": [
                {
                    "file_additions": 4,
                    "file_deletions": 0,
                    "file_exists": false,
                    "file_name": "src/backend/catalog/dependency.c",
                    "file_size": 0
                },
                {
                    "file_additions": 21,
                    "file_deletions": 0,
                    "file_exists": false,
                    "file_name": "src/backend/catalog/pipeline_query.c",
                    "file_size": 0
                },
                {
                    "file_additions": 38,
                    "file_deletions": 9,
                    "file_exists": false,
                    "file_name": "src/backend/commands/pipelinecmds.c",
                    "file_size": 0
                },
                {
                    "file_additions": 1,
                    "file_deletions": 0,
                    "file_exists": false,
                    "file_name": "src/backend/nodes/makefuncs.c",
                    "file_size": 0
                },
                {
                    "file_additions": 3,
                    "file_deletions": 0,
                    "file_exists": false,
                    "file_name": "src/backend/parser/analyze.c",
                    "file_size": 0
                },
                {
                    "file_additions": 141,
                    "file_deletions": 40,
                    "file_exists": false,
                    "file_name": "src/backend/pipeline/cont_analyze.c",
                    "file_size": 0
                },
                {
                    "file_additions": 6,
                    "file_deletions": 0,
                    "file_exists": false,
                    "file_name": "src/backend/utils/adt/ruleutils.c",
                    "file_size": 0
                },
                {
                    "file_additions": 11,
                    "file_deletions": 0,
                    "file_exists": false,
                    "file_name": "src/backend/utils/misc/guc.c",
                    "file_size": 0
                }
            ],
            "interesting": {
                "reopen": false,
                "status": false
            },
            "is_parent": false,
            "sha": "f77f8908f00adf49970b0ffc2c98bc0a7d358928"
        },
        {
            "associated_pull_request": [],
            "date": "2015-09-10 23:50:26",
            "diff": "pipelinedb_pipelinedb/issue_1058/commit_473d69d8ec49e3c7f839b62110c1db0ee67b8865.diff",
            "diff_additions": 160,
            "diff_deletions": 31,
            "diff_file_size": 0,
            "diff_url": "https://github.com/pipelinedb/pipelinedb/commit/473d69d8ec49e3c7f839b62110c1db0ee67b8865.diff",
            "exists": true,
            "files": [
                {
                    "file_additions": 4,
                    "file_deletions": 0,
                    "file_exists": false,
                    "file_name": "src/backend/catalog/dependency.c",
                    "file_size": 0
                },
                {
                    "file_additions": 21,
                    "file_deletions": 0,
                    "file_exists": false,
                    "file_name": "src/backend/catalog/pipeline_query.c",
                    "file_size": 0
                },
                {
                    "file_additions": 10,
                    "file_deletions": 9,
                    "file_exists": false,
                    "file_name": "src/backend/commands/pipelinecmds.c",
                    "file_size": 0
                },
                {
                    "file_additions": 1,
                    "file_deletions": 0,
                    "file_exists": false,
                    "file_name": "src/backend/nodes/makefuncs.c",
                    "file_size": 0
                },
                {
                    "file_additions": 3,
                    "file_deletions": 0,
                    "file_exists": false,
                    "file_name": "src/backend/parser/analyze.c",
                    "file_size": 0
                },
                {
                    "file_additions": 115,
                    "file_deletions": 22,
                    "file_exists": false,
                    "file_name": "src/backend/pipeline/cont_analyze.c",
                    "file_size": 0
                },
                {
                    "file_additions": 6,
                    "file_deletions": 0,
                    "file_exists": false,
                    "file_name": "src/backend/utils/adt/ruleutils.c",
                    "file_size": 0
                }
            ],
            "interesting": {
                "reopen": false,
                "status": false
            },
            "is_parent": false,
            "sha": "473d69d8ec49e3c7f839b62110c1db0ee67b8865"
        },
        {
            "associated_pull_request": [],
            "date": "2015-09-10 23:50:26",
            "diff": "pipelinedb_pipelinedb/issue_1058/commit_0045e9b249112b6837bf9b9acccdff3babeebe36.diff",
            "diff_additions": 160,
            "diff_deletions": 31,
            "diff_file_size": 0,
            "diff_url": "https://github.com/pipelinedb/pipelinedb/commit/0045e9b249112b6837bf9b9acccdff3babeebe36.diff",
            "exists": true,
            "files": [
                {
                    "file_additions": 4,
                    "file_deletions": 0,
                    "file_exists": false,
                    "file_name": "src/backend/catalog/dependency.c",
                    "file_size": 0
                },
                {
                    "file_additions": 21,
                    "file_deletions": 0,
                    "file_exists": false,
                    "file_name": "src/backend/catalog/pipeline_query.c",
                    "file_size": 0
                },
                {
                    "file_additions": 10,
                    "file_deletions": 9,
                    "file_exists": false,
                    "file_name": "src/backend/commands/pipelinecmds.c",
                    "file_size": 0
                },
                {
                    "file_additions": 1,
                    "file_deletions": 0,
                    "file_exists": false,
                    "file_name": "src/backend/nodes/makefuncs.c",
                    "file_size": 0
                },
                {
                    "file_additions": 3,
                    "file_deletions": 0,
                    "file_exists": false,
                    "file_name": "src/backend/parser/analyze.c",
                    "file_size": 0
                },
                {
                    "file_additions": 115,
                    "file_deletions": 22,
                    "file_exists": false,
                    "file_name": "src/backend/pipeline/cont_analyze.c",
                    "file_size": 0
                },
                {
                    "file_additions": 6,
                    "file_deletions": 0,
                    "file_exists": false,
                    "file_name": "src/backend/utils/adt/ruleutils.c",
                    "file_size": 0
                }
            ],
            "interesting": {
                "reopen": false,
                "status": false
            },
            "is_parent": false,
            "sha": "0045e9b249112b6837bf9b9acccdff3babeebe36"
        }
    ],
    "first_commit": "2015-09-05 00:44:31",
    "last_commit": "2015-09-11 00:04:50",
    "number": 1058,
    "pull_request": "None",
    "score": {
        "accidental_reopen_likely": false,
        "all_labels": [
            "performance",
            "windowing"
        ],
        "contains_keywords": [
            "reason",
            "error"
        ],
        "fix_size": 322,
        "has_labels": [],
        "intersecting": {
            "computed_score": 1.0,
            "final_commit_size": 194,
            "intersection_size": 194,
            "previous_commits_size": 322
        },
        "is_makefile_based": true,
        "no_new_files": [],
        "no_other_files": false,
        "num_prohibited_files": 141624,
        "prohibited_files": [
            "kill.h",
            "meminfo.h",
            "kill.h",
            "meminfo.h",
            "kill.h",
            "meminfo.h",
            "testsuite_cli_test.go",
            "testsuite_cli_test.go",
            "common.mk",
            "i3bar/include/draw_util.h"
        ],
        "reopen": false,
        "reopen_events": [
            [
                "2015-09-05 02:01:24",
                "closed"
            ],
            [
                "2015-09-05 16:25:01",
                "reopened"
            ],
            [
                "2015-09-05 17:20:43",
                "commit"
            ],
            [
                "2015-09-05 17:20:47",
                "closed"
            ],
            [
                "2015-09-06 21:08:53",
                "commit"
            ],
            [
                "2015-09-06 21:25:05",
                "commit"
            ],
            [
                "2015-09-06 21:47:17",
                "commit"
            ],
            [
                "2015-09-06 21:53:57",
                "commit"
            ],
            [
                "2015-09-06 22:01:05",
                "commit"
            ],
            [
                "2015-09-10 23:50:34",
                "commit"
            ],
            [
                "2015-09-11 00:04:56",
                "commit"
            ]
        ],
        "status": true,
        "strategy": true,
        "total_changes": 1775
    }
}