{
    "covered_issues": [
        257,
        255,
        254,
        253,
        252,
        249,
        247,
        246,
        245,
        244,
        243,
        242,
        241,
        240,
        239,
        238,
        237,
        236,
        235,
        234,
        233,
        232,
        231,
        230,
        229,
        228,
        227,
        224,
        223,
        221,
        219,
        216,
        215,
        214,
        213,
        212,
        211,
        210,
        209,
        208,
        207,
        206,
        204,
        200,
        199,
        196,
        195,
        193,
        191,
        190,
        189,
        188,
        186,
        185,
        174,
        171,
        170,
        165,
        164,
        163,
        162,
        161,
        160,
        159,
        156,
        153,
        152,
        150,
        149,
        148,
        146,
        144,
        143,
        142,
        141,
        139,
        138,
        137,
        136,
        134,
        133,
        128,
        126,
        125,
        124,
        123,
        122,
        121,
        119,
        117,
        116,
        114,
        112,
        111,
        110,
        108,
        106,
        105,
        103,
        101,
        100,
        98,
        96,
        95,
        94,
        93,
        92,
        91,
        90,
        89,
        88,
        87,
        85,
        84,
        83,
        81,
        78,
        74,
        73,
        71,
        70,
        69,
        68,
        67,
        65,
        60,
        59,
        58,
        55,
        52,
        51,
        50,
        49,
        47,
        46,
        45,
        44,
        43,
        42,
        40,
        39,
        38,
        37,
        36,
        35,
        34,
        33,
        32,
        30,
        29,
        28,
        27,
        24,
        23,
        22,
        21,
        19,
        18,
        17,
        15,
        14,
        8,
        4,
        3
    ],
    "finished": true
}