{
    "covered_issues": [
        158,
        155,
        154,
        153,
        152,
        151,
        149,
        143,
        135,
        134,
        133,
        132,
        130,
        128,
        127,
        120,
        118,
        117,
        112,
        110,
        108,
        107,
        102,
        89,
        86,
        79,
        77,
        75,
        74,
        66,
        63,
        60,
        57,
        56,
        55,
        54,
        45,
        40,
        39,
        38,
        35,
        34,
        33,
        32,
        31,
        30,
        29,
        28,
        27,
        26,
        25,
        23,
        22,
        21,
        20,
        19,
        18,
        17,
        16,
        15,
        14,
        13,
        11,
        10,
        9,
        8,
        6,
        5,
        4,
        3,
        2
    ],
    "finished": true
}