{
    "covered_issues": [
        60,
        58,
        56,
        55,
        53,
        52,
        51,
        47,
        44,
        43,
        42,
        41,
        40,
        39,
        38,
        37,
        34,
        33,
        32,
        31,
        29,
        28,
        27,
        26,
        22,
        20,
        19,
        18,
        17,
        16,
        15,
        14,
        13,
        12,
        11,
        8,
        7,
        5,
        4,
        3,
        2
    ],
    "finished": true
}