{
    "category": [
        "control flow",
        "feature request"
    ],
    "commits": [
        {
            "associated_pull_request": [
                "https://github.com/open62541/open62541/pull/1227"
            ],
            "date": "2017-09-25 21:08:09",
            "diff": "open62541_open62541/issue_1233/commit_957beede9151469d4b427f7a387f4abfab910405.diff",
            "diff_additions": 1,
            "diff_deletions": 1,
            "diff_file_size": 110768,
            "diff_url": "https://github.com/open62541/open62541/commit/957beede9151469d4b427f7a387f4abfab910405.diff",
            "exists": true,
            "files": [
                {
                    "file_additions": 1,
                    "file_deletions": 1,
                    "file_exists": true,
                    "file_name": "src/server/ua_services_nodemanagement.c",
                    "file_size": 110768
                }
            ],
            "interesting": {
                "reopen": false,
                "status": false
            },
            "is_parent": true,
            "sha": "957beede9151469d4b427f7a387f4abfab910405"
        },
        {
            "associated_pull_request": [],
            "date": "2017-10-05 15:59:20",
            "diff": "open62541_open62541/issue_1233/commit_183de36d705aff69671b2d796e795fcbd9c263dd.diff",
            "diff_additions": 44,
            "diff_deletions": 35,
            "diff_file_size": 53356,
            "diff_url": "https://github.com/open62541/open62541/commit/183de36d705aff69671b2d796e795fcbd9c263dd.diff",
            "exists": true,
            "files": [
                {
                    "file_additions": 38,
                    "file_deletions": 28,
                    "file_exists": true,
                    "file_name": "src/server/ua_nodes.c",
                    "file_size": 26062
                },
                {
                    "file_additions": 6,
                    "file_deletions": 7,
                    "file_exists": true,
                    "file_name": "src/server/ua_server.c",
                    "file_size": 27294
                }
            ],
            "interesting": {
                "reopen": true,
                "status": true
            },
            "is_parent": false,
            "sha": "183de36d705aff69671b2d796e795fcbd9c263dd"
        },
        {
            "associated_pull_request": [],
            "date": "2017-10-05 15:59:20",
            "diff": "open62541_open62541/issue_1233/commit_141a6bab439883f954badafd9e0529dbe0c551c9.diff",
            "diff_additions": 44,
            "diff_deletions": 35,
            "diff_file_size": 53356,
            "diff_url": "https://github.com/open62541/open62541/commit/141a6bab439883f954badafd9e0529dbe0c551c9.diff",
            "exists": true,
            "files": [
                {
                    "file_additions": 38,
                    "file_deletions": 28,
                    "file_exists": true,
                    "file_name": "src/server/ua_nodes.c",
                    "file_size": 26062
                },
                {
                    "file_additions": 6,
                    "file_deletions": 7,
                    "file_exists": true,
                    "file_name": "src/server/ua_server.c",
                    "file_size": 27294
                }
            ],
            "interesting": {
                "reopen": false,
                "status": true
            },
            "is_parent": false,
            "sha": "141a6bab439883f954badafd9e0529dbe0c551c9"
        },
        {
            "associated_pull_request": [],
            "date": "2017-10-05 15:59:20",
            "diff": "open62541_open62541/issue_1233/commit_3773bc4f555e68daaadc72966e95c6c3fbf10bd7.diff",
            "diff_additions": 44,
            "diff_deletions": 35,
            "diff_file_size": 53356,
            "diff_url": "https://github.com/open62541/open62541/commit/3773bc4f555e68daaadc72966e95c6c3fbf10bd7.diff",
            "exists": true,
            "files": [
                {
                    "file_additions": 38,
                    "file_deletions": 28,
                    "file_exists": true,
                    "file_name": "src/server/ua_nodes.c",
                    "file_size": 26062
                },
                {
                    "file_additions": 6,
                    "file_deletions": 7,
                    "file_exists": true,
                    "file_name": "src/server/ua_server.c",
                    "file_size": 27294
                }
            ],
            "interesting": {
                "reopen": false,
                "status": true
            },
            "is_parent": false,
            "sha": "3773bc4f555e68daaadc72966e95c6c3fbf10bd7"
        },
        {
            "associated_pull_request": [],
            "date": "2017-10-05 15:59:20",
            "diff": "open62541_open62541/issue_1233/commit_ae03c86dab85a6d8d3093e2d6b12b41ed507d852.diff",
            "diff_additions": 44,
            "diff_deletions": 35,
            "diff_file_size": 53356,
            "diff_url": "https://github.com/open62541/open62541/commit/ae03c86dab85a6d8d3093e2d6b12b41ed507d852.diff",
            "exists": true,
            "files": [
                {
                    "file_additions": 38,
                    "file_deletions": 28,
                    "file_exists": true,
                    "file_name": "src/server/ua_nodes.c",
                    "file_size": 26062
                },
                {
                    "file_additions": 6,
                    "file_deletions": 7,
                    "file_exists": true,
                    "file_name": "src/server/ua_server.c",
                    "file_size": 27294
                }
            ],
            "interesting": {
                "reopen": false,
                "status": true
            },
            "is_parent": false,
            "sha": "ae03c86dab85a6d8d3093e2d6b12b41ed507d852"
        },
        {
            "associated_pull_request": [],
            "date": "2017-10-05 15:59:20",
            "diff": "open62541_open62541/issue_1233/commit_3e3c0adf02d43fc8c26d8fa4d0660117df800571.diff",
            "diff_additions": 44,
            "diff_deletions": 35,
            "diff_file_size": 53356,
            "diff_url": "https://github.com/open62541/open62541/commit/3e3c0adf02d43fc8c26d8fa4d0660117df800571.diff",
            "exists": true,
            "files": [
                {
                    "file_additions": 38,
                    "file_deletions": 28,
                    "file_exists": true,
                    "file_name": "src/server/ua_nodes.c",
                    "file_size": 26062
                },
                {
                    "file_additions": 6,
                    "file_deletions": 7,
                    "file_exists": true,
                    "file_name": "src/server/ua_server.c",
                    "file_size": 27294
                }
            ],
            "interesting": {
                "reopen": false,
                "status": true
            },
            "is_parent": false,
            "sha": "3e3c0adf02d43fc8c26d8fa4d0660117df800571"
        },
        {
            "associated_pull_request": [],
            "date": "2017-10-05 15:59:20",
            "diff": "open62541_open62541/issue_1233/commit_d42bc1609dfa35fa3331770895eb1bb18daff356.diff",
            "diff_additions": 44,
            "diff_deletions": 35,
            "diff_file_size": 53356,
            "diff_url": "https://github.com/open62541/open62541/commit/d42bc1609dfa35fa3331770895eb1bb18daff356.diff",
            "exists": true,
            "files": [
                {
                    "file_additions": 38,
                    "file_deletions": 28,
                    "file_exists": true,
                    "file_name": "src/server/ua_nodes.c",
                    "file_size": 26062
                },
                {
                    "file_additions": 6,
                    "file_deletions": 7,
                    "file_exists": true,
                    "file_name": "src/server/ua_server.c",
                    "file_size": 27294
                }
            ],
            "interesting": {
                "reopen": false,
                "status": true
            },
            "is_parent": false,
            "sha": "d42bc1609dfa35fa3331770895eb1bb18daff356"
        },
        {
            "associated_pull_request": [],
            "date": "2017-11-09 10:12:02",
            "diff": "open62541_open62541/issue_1233/commit_88fead0d6f82b5d09923c6dc4c2dbb9f4db5dc69.diff",
            "diff_additions": 55,
            "diff_deletions": 12,
            "diff_file_size": 53356,
            "diff_url": "https://github.com/open62541/open62541/commit/88fead0d6f82b5d09923c6dc4c2dbb9f4db5dc69.diff",
            "exists": true,
            "files": [
                {
                    "file_additions": 42,
                    "file_deletions": 2,
                    "file_exists": true,
                    "file_name": "src/server/ua_nodes.c",
                    "file_size": 26062
                },
                {
                    "file_additions": 13,
                    "file_deletions": 10,
                    "file_exists": true,
                    "file_name": "src/server/ua_server.c",
                    "file_size": 27294
                }
            ],
            "interesting": {
                "reopen": false,
                "status": true
            },
            "is_parent": false,
            "sha": "88fead0d6f82b5d09923c6dc4c2dbb9f4db5dc69"
        },
        {
            "associated_pull_request": [],
            "date": "2017-11-09 10:12:02",
            "diff": "open62541_open62541/issue_1233/commit_42a4758c70324eecb703e891d265a409cbe03a14.diff",
            "diff_additions": 55,
            "diff_deletions": 12,
            "diff_file_size": 53356,
            "diff_url": "https://github.com/open62541/open62541/commit/42a4758c70324eecb703e891d265a409cbe03a14.diff",
            "exists": true,
            "files": [
                {
                    "file_additions": 42,
                    "file_deletions": 2,
                    "file_exists": true,
                    "file_name": "src/server/ua_nodes.c",
                    "file_size": 26062
                },
                {
                    "file_additions": 13,
                    "file_deletions": 10,
                    "file_exists": true,
                    "file_name": "src/server/ua_server.c",
                    "file_size": 27294
                }
            ],
            "interesting": {
                "reopen": false,
                "status": true
            },
            "is_parent": false,
            "sha": "42a4758c70324eecb703e891d265a409cbe03a14"
        },
        {
            "associated_pull_request": [],
            "date": "2017-11-09 10:12:02",
            "diff": "open62541_open62541/issue_1233/commit_5fca4989df32a043590907b94002e3d973ffd1e9.diff",
            "diff_additions": 58,
            "diff_deletions": 14,
            "diff_file_size": 53356,
            "diff_url": "https://github.com/open62541/open62541/commit/5fca4989df32a043590907b94002e3d973ffd1e9.diff",
            "exists": true,
            "files": [
                {
                    "file_additions": 43,
                    "file_deletions": 2,
                    "file_exists": true,
                    "file_name": "src/server/ua_nodes.c",
                    "file_size": 26062
                },
                {
                    "file_additions": 15,
                    "file_deletions": 12,
                    "file_exists": true,
                    "file_name": "src/server/ua_server.c",
                    "file_size": 27294
                }
            ],
            "interesting": {
                "reopen": false,
                "status": true
            },
            "is_parent": false,
            "sha": "5fca4989df32a043590907b94002e3d973ffd1e9"
        },
        {
            "associated_pull_request": [
                "https://github.com/open62541/open62541/pull/1323"
            ],
            "date": "2017-11-09 10:12:02",
            "diff": "open62541_open62541/issue_1233/commit_a07c11770d344c4376f724a25042de548f909fcd.diff",
            "diff_additions": 58,
            "diff_deletions": 14,
            "diff_file_size": 53356,
            "diff_url": "https://github.com/open62541/open62541/commit/a07c11770d344c4376f724a25042de548f909fcd.diff",
            "exists": true,
            "files": [
                {
                    "file_additions": 43,
                    "file_deletions": 2,
                    "file_exists": true,
                    "file_name": "src/server/ua_nodes.c",
                    "file_size": 26062
                },
                {
                    "file_additions": 15,
                    "file_deletions": 12,
                    "file_exists": true,
                    "file_name": "src/server/ua_server.c",
                    "file_size": 27294
                }
            ],
            "interesting": {
                "reopen": false,
                "status": false
            },
            "is_parent": false,
            "sha": "a07c11770d344c4376f724a25042de548f909fcd"
        },
        {
            "associated_pull_request": [],
            "date": "2017-11-09 10:12:02",
            "diff": "open62541_open62541/issue_1233/commit_20a4497cafe53d5ae71fcd7fabc489a85e9968fd.diff",
            "diff_additions": 58,
            "diff_deletions": 14,
            "diff_file_size": 53356,
            "diff_url": "https://github.com/open62541/open62541/commit/20a4497cafe53d5ae71fcd7fabc489a85e9968fd.diff",
            "exists": true,
            "files": [
                {
                    "file_additions": 43,
                    "file_deletions": 2,
                    "file_exists": true,
                    "file_name": "src/server/ua_nodes.c",
                    "file_size": 26062
                },
                {
                    "file_additions": 15,
                    "file_deletions": 12,
                    "file_exists": true,
                    "file_name": "src/server/ua_server.c",
                    "file_size": 27294
                }
            ],
            "interesting": {
                "reopen": false,
                "status": false
            },
            "is_parent": false,
            "sha": "20a4497cafe53d5ae71fcd7fabc489a85e9968fd"
        }
    ],
    "first_commit": "2017-09-25 21:08:09",
    "last_commit": "2017-11-10 01:18:58",
    "number": 1233,
    "pull_request": "None",
    "score": {
        "accidental_reopen_likely": false,
        "all_labels": [],
        "contains_keywords": [
            "fix",
            "bug",
            "issu"
        ],
        "fix_size": 114,
        "has_labels": [],
        "intersecting": {
            "computed_score": 1.0,
            "final_commit_size": 61,
            "intersection_size": 61,
            "previous_commits_size": 114
        },
        "is_makefile_based": true,
        "no_new_files": [],
        "no_other_files": false,
        "num_prohibited_files": 119298,
        "prohibited_files": [
            "kill.h",
            "meminfo.h",
            "kill.h",
            "meminfo.h",
            "kill.h",
            "meminfo.h",
            "testsuite_cli_test.go",
            "testsuite_cli_test.go",
            "common.mk",
            "i3bar/include/draw_util.h"
        ],
        "reopen": true,
        "reopen_events": [
            [
                "2017-10-05 16:00:28",
                "commit"
            ],
            [
                "2017-11-07 16:15:04",
                "closed"
            ],
            [
                "2017-11-07 16:15:19",
                "reopened"
            ],
            [
                "2017-11-07 16:23:29",
                "commit"
            ],
            [
                "2017-11-08 09:43:06",
                "commit"
            ],
            [
                "2017-11-08 09:44:25",
                "commit"
            ],
            [
                "2017-11-08 09:49:26",
                "commit"
            ],
            [
                "2017-11-08 12:02:35",
                "commit"
            ],
            [
                "2017-11-09 10:23:09",
                "commit"
            ],
            [
                "2017-11-09 10:25:34",
                "commit"
            ],
            [
                "2017-11-09 14:44:14",
                "commit"
            ],
            [
                "2017-11-09 15:28:12",
                "commit"
            ],
            [
                "2017-11-09 18:14:25",
                "closed"
            ],
            [
                "2017-11-10 01:19:13",
                "commit"
            ]
        ],
        "status": false,
        "strategy": true,
        "total_changes": 826
    }
}