{
    "category": [
        "hardware/OS",
        "GUI"
    ],
    "commits": [
        {
            "associated_pull_request": [],
            "date": "2019-01-18 18:49:20",
            "diff": "flatpak_flatpak/issue_2615/commit_43504bcc14658ab2fd955ba544debb56a44d8718.diff",
            "diff_additions": 60,
            "diff_deletions": 0,
            "diff_file_size": 64524,
            "diff_url": "https://github.com/flatpak/flatpak/commit/43504bcc14658ab2fd955ba544debb56a44d8718.diff",
            "exists": true,
            "files": [
                {
                    "file_additions": 60,
                    "file_deletions": 0,
                    "file_exists": true,
                    "file_name": "tests/testcommon.c",
                    "file_size": 64524
                }
            ],
            "interesting": {
                "reopen": false,
                "status": false
            },
            "is_parent": true,
            "sha": "43504bcc14658ab2fd955ba544debb56a44d8718"
        },
        {
            "associated_pull_request": [],
            "date": "2019-01-18 18:52:56",
            "diff": "flatpak_flatpak/issue_2615/commit_31f73cc174a625749009cd07ff645f9032e8d793.diff",
            "diff_additions": 5,
            "diff_deletions": 0,
            "diff_file_size": 64524,
            "diff_url": "https://github.com/flatpak/flatpak/commit/31f73cc174a625749009cd07ff645f9032e8d793.diff",
            "exists": true,
            "files": [
                {
                    "file_additions": 5,
                    "file_deletions": 0,
                    "file_exists": true,
                    "file_name": "tests/testcommon.c",
                    "file_size": 64524
                }
            ],
            "interesting": {
                "reopen": false,
                "status": true
            },
            "is_parent": false,
            "sha": "31f73cc174a625749009cd07ff645f9032e8d793"
        },
        {
            "associated_pull_request": [],
            "date": "2019-01-18 19:09:13",
            "diff": "flatpak_flatpak/issue_2615/commit_140e81231168d3e66d241513fd82c7a9cf1075ab.diff",
            "diff_additions": 3,
            "diff_deletions": 1,
            "diff_file_size": 280054,
            "diff_url": "https://github.com/flatpak/flatpak/commit/140e81231168d3e66d241513fd82c7a9cf1075ab.diff",
            "exists": true,
            "files": [
                {
                    "file_additions": 3,
                    "file_deletions": 1,
                    "file_exists": true,
                    "file_name": "common/flatpak-utils.c",
                    "file_size": 280054
                }
            ],
            "interesting": {
                "reopen": false,
                "status": false
            },
            "is_parent": false,
            "sha": "140e81231168d3e66d241513fd82c7a9cf1075ab"
        },
        {
            "associated_pull_request": [],
            "date": "2019-01-18 19:09:13",
            "diff": "flatpak_flatpak/issue_2615/commit_7b94d827d718788a6f28e70125548ac113a4153f.diff",
            "diff_additions": 3,
            "diff_deletions": 1,
            "diff_file_size": 280054,
            "diff_url": "https://github.com/flatpak/flatpak/commit/7b94d827d718788a6f28e70125548ac113a4153f.diff",
            "exists": true,
            "files": [
                {
                    "file_additions": 3,
                    "file_deletions": 1,
                    "file_exists": true,
                    "file_name": "common/flatpak-utils.c",
                    "file_size": 280054
                }
            ],
            "interesting": {
                "reopen": false,
                "status": false
            },
            "is_parent": false,
            "sha": "7b94d827d718788a6f28e70125548ac113a4153f"
        }
    ],
    "first_commit": "2019-01-18 18:49:20",
    "last_commit": "2019-01-21 08:27:09",
    "number": 2615,
    "pull_request": "None",
    "score": {
        "accidental_reopen_likely": false,
        "all_labels": [],
        "contains_keywords": [
            "test",
            "fix",
            "work"
        ],
        "fix_size": 10,
        "has_labels": [],
        "intersecting": {
            "computed_score": 1.0,
            "final_commit_size": 4,
            "intersection_size": 4,
            "previous_commits_size": 10
        },
        "is_makefile_based": true,
        "no_new_files": [],
        "no_other_files": true,
        "num_prohibited_files": 89285,
        "prohibited_files": [
            "hal/inc/pinmap_hal.h",
            "Debug/marvin.bin",
            "Debug/marvin.elf",
            "Debug/marvin.hex",
            "Debug/marvin.bin",
            "Debug/marvin.elf",
            "Debug/marvin.hex",
            "inc/spark_utilities.h",
            "Debug/marvin.bin",
            "Debug/marvin.elf"
        ],
        "reopen": false,
        "reopen_events": [
            [
                "2019-01-18 18:53:40",
                "commit"
            ],
            [
                "2019-01-18 19:10:34",
                "commit"
            ],
            [
                "2019-01-21 08:27:14",
                "commit"
            ],
            [
                "2019-01-21 08:27:14",
                "closed"
            ],
            [
                "2019-01-21 08:27:14",
                "commit"
            ]
        ],
        "status": true,
        "strategy": true,
        "total_changes": 73
    }
}