{
    "covered_issues": [
        1570,
        1569,
        1563,
        1562,
        1549,
        1537,
        1525,
        1520,
        1516,
        1511,
        1503,
        1502,
        1500,
        1492,
        1490,
        1488,
        1484,
        1483,
        1477,
        1476,
        1472,
        1469,
        1468,
        1467,
        1466,
        1463,
        1462,
        1461,
        1457,
        1453,
        1450,
        1445,
        1437,
        1436,
        1434,
        1421,
        1418,
        1416,
        1413,
        1410,
        1408,
        1407,
        1405,
        1400,
        1389,
        1385,
        1382,
        1380,
        1379,
        1376,
        1369,
        1367,
        1366,
        1365,
        1362,
        1343,
        1340,
        1339,
        1337,
        1336,
        1327,
        1318,
        1309,
        1305,
        1303,
        1302,
        1301,
        1296,
        1294,
        1292,
        1284,
        1281,
        1279,
        1276,
        1275,
        1273,
        1272,
        1266,
        1264,
        1260,
        1259,
        1258,
        1257,
        1255,
        1252,
        1251,
        1250,
        1249,
        1241,
        1240,
        1239,
        1238,
        1234,
        1230,
        1227,
        1225,
        1223,
        1217,
        1188,
        1163,
        1161,
        1159,
        1131,
        1128,
        1125,
        1124,
        1121,
        1120,
        1119,
        1118,
        1117,
        1116,
        1115,
        1114,
        1113,
        1112,
        1111,
        1107,
        1104,
        1103,
        1096,
        1093,
        1091,
        1090,
        1086,
        1084,
        1081,
        1077,
        1076,
        1075,
        1074,
        1072,
        1071,
        1070,
        1069,
        1068,
        1064,
        1055,
        1053,
        1046,
        1044,
        1039,
        1020,
        1013,
        1011,
        1008,
        1006,
        1002,
        1001,
        1000,
        999,
        998,
        995,
        992,
        988,
        986,
        983,
        982,
        981,
        979,
        978,
        977,
        975,
        973,
        972,
        970,
        969,
        968,
        967,
        965,
        964,
        961,
        957,
        956,
        955,
        953,
        952,
        951,
        949,
        945,
        942,
        938,
        937,
        936,
        935,
        933,
        931,
        929,
        928,
        927,
        923,
        922,
        918,
        915,
        912,
        910,
        905,
        901,
        900,
        896,
        892,
        879,
        874,
        869,
        840,
        829,
        812,
        810,
        807,
        806,
        793,
        792,
        785,
        780,
        779,
        778,
        776,
        774,
        767,
        766,
        762,
        757,
        756,
        753,
        752,
        750,
        749,
        748,
        745,
        739,
        737,
        736,
        735,
        733,
        730,
        727,
        726,
        724,
        723,
        720,
        719,
        718,
        713,
        705,
        701,
        699,
        698,
        696,
        695,
        692,
        691,
        690,
        689,
        687,
        684,
        680,
        678,
        677,
        675,
        674,
        669,
        668,
        667,
        664,
        663,
        662,
        661,
        659,
        657,
        656,
        652,
        650,
        648,
        647,
        646,
        644,
        641,
        639,
        632,
        629,
        618,
        615,
        613,
        609,
        608,
        607,
        597,
        593,
        583,
        562,
        555,
        552,
        543,
        536,
        492,
        481,
        477,
        454,
        452,
        448,
        444,
        443,
        442,
        440,
        439,
        438,
        436,
        434,
        433,
        432,
        431,
        430,
        429,
        428,
        427,
        426,
        425,
        424,
        423,
        422,
        421,
        420,
        409,
        401,
        400,
        397,
        395,
        394,
        393,
        392,
        391,
        388,
        385,
        384,
        381,
        380,
        378,
        377,
        376,
        375,
        374,
        371,
        364,
        361,
        359,
        358,
        356,
        355,
        354,
        353,
        349,
        347,
        346,
        345,
        341,
        326,
        315,
        313,
        306,
        304,
        290,
        288,
        287,
        286,
        285,
        284,
        283,
        282,
        281,
        279,
        277,
        274,
        273,
        271,
        270,
        269,
        268,
        260,
        259,
        258,
        257,
        256,
        254,
        253,
        252,
        251,
        250,
        249,
        248,
        247,
        246,
        245,
        244,
        242,
        237,
        236,
        235,
        225,
        221,
        209,
        207,
        205,
        204,
        203,
        199,
        196,
        194,
        190,
        189,
        183,
        178,
        177,
        174,
        172,
        158,
        157,
        153,
        152,
        151,
        147,
        145,
        139,
        136,
        131,
        124,
        122,
        120,
        119,
        102,
        69,
        53,
        50,
        39,
        20,
        19,
        17,
        16,
        15,
        14,
        13,
        12,
        11,
        10,
        9,
        8,
        7,
        6,
        5,
        4,
        3,
        2,
        1
    ],
    "finished": true
}