{
    "covered_issues": [
        2142,
        2140,
        2137,
        2126,
        2122,
        2121,
        2115,
        2109,
        2104,
        2100,
        2092,
        2084,
        2081,
        2080,
        2079,
        2077,
        2075,
        2067,
        2052,
        2046,
        2044,
        2043,
        2040,
        2035,
        2028,
        2025,
        2022,
        2017,
        2015,
        2012,
        2009,
        2007,
        2001,
        1999,
        1997,
        1994,
        1989,
        1980,
        1978,
        1974,
        1972,
        1971,
        1967,
        1966,
        1964,
        1963,
        1961,
        1957,
        1953,
        1951,
        1942,
        1941,
        1929,
        1927,
        1924,
        1923,
        1921,
        1920,
        1917,
        1915,
        1914,
        1908,
        1907,
        1903,
        1902,
        1899,
        1894,
        1892,
        1891,
        1890,
        1883,
        1882,
        1881,
        1879,
        1878,
        1874,
        1872,
        1871,
        1868,
        1863,
        1859,
        1856,
        1853,
        1849,
        1846,
        1844,
        1839,
        1831,
        1827,
        1826,
        1817,
        1815,
        1810,
        1797,
        1796,
        1790,
        1787,
        1782,
        1780,
        1776,
        1767,
        1761,
        1760,
        1759,
        1756,
        1754,
        1753,
        1750,
        1744,
        1741,
        1736,
        1735,
        1733,
        1731,
        1730,
        1728,
        1721,
        1718,
        1714,
        1706,
        1705,
        1699,
        1691,
        1687,
        1681,
        1680,
        1668,
        1644,
        1634,
        1627,
        1626,
        1625,
        1623,
        1618,
        1605,
        1603,
        1598,
        1594,
        1593,
        1590,
        1589,
        1584,
        1583,
        1577,
        1569,
        1568,
        1567,
        1566,
        1564,
        1560,
        1556,
        1554,
        1552,
        1547,
        1539,
        1533,
        1520,
        1513,
        1492,
        1489,
        1488,
        1482,
        1481,
        1478,
        1477,
        1475,
        1474,
        1467,
        1464,
        1462,
        1461,
        1459,
        1458,
        1455,
        1446,
        1444,
        1435,
        1434,
        1433,
        1429,
        1427,
        1423,
        1419,
        1415,
        1413,
        1412,
        1411,
        1410,
        1405,
        1403,
        1392,
        1390,
        1388,
        1385,
        1382,
        1379,
        1378,
        1377,
        1376,
        1375,
        1374,
        1373,
        1371,
        1369,
        1368,
        1366,
        1365,
        1362,
        1360,
        1355,
        1347,
        1344,
        1343,
        1340,
        1338,
        1324,
        1317,
        1314,
        1312,
        1309,
        1297,
        1296,
        1289,
        1288,
        1286,
        1285,
        1281,
        1279,
        1271,
        1270,
        1263,
        1251,
        1238,
        1225,
        1223,
        1222,
        1218,
        1212,
        1208,
        1192,
        1191,
        1190,
        1189,
        1187,
        1178,
        1175,
        1168,
        1167,
        1148,
        1142,
        1141,
        1127,
        1126,
        1125,
        1112,
        1111,
        1108,
        1097,
        1087,
        1086,
        1080,
        1068,
        1057,
        1056,
        1053,
        1049,
        1039,
        1036,
        1035,
        1031,
        1030,
        1029,
        1023,
        1017,
        1014,
        1013,
        1012,
        1004,
        999,
        985,
        983,
        981,
        980,
        977,
        971,
        960,
        959,
        958,
        957,
        952,
        951,
        949,
        948,
        940,
        939,
        935,
        932,
        904,
        900,
        873,
        869,
        867,
        860,
        840,
        835,
        833,
        828,
        827,
        823,
        821,
        819,
        818,
        816,
        812,
        805,
        802,
        798,
        794,
        791,
        786,
        785,
        783,
        781,
        779,
        774,
        773,
        772,
        771,
        770,
        768,
        765,
        763,
        762,
        759,
        756,
        752,
        749,
        748,
        747,
        746,
        744,
        743,
        741,
        737,
        735,
        732,
        731,
        728,
        726,
        724,
        721,
        719,
        718,
        716,
        713,
        710,
        709,
        706,
        703,
        702,
        701,
        699,
        695,
        674,
        658,
        648,
        646,
        641,
        635,
        634,
        633,
        627,
        622,
        620,
        618,
        614,
        605,
        603,
        602,
        601,
        594,
        593,
        589,
        575,
        573,
        571,
        562,
        557,
        556,
        554,
        552,
        550,
        549,
        546,
        542,
        540,
        537,
        535,
        529,
        520,
        510,
        509,
        506,
        505,
        500,
        499,
        484,
        483,
        481,
        478,
        477,
        476,
        475,
        474,
        472,
        463,
        460,
        459,
        453,
        452,
        450,
        449,
        448,
        444,
        442,
        439,
        437,
        436,
        432,
        429,
        424,
        391,
        383,
        382,
        365,
        361,
        356,
        347,
        345,
        344,
        337,
        336,
        335,
        329,
        322,
        317,
        313,
        312,
        311,
        310,
        306,
        300,
        296,
        293,
        292,
        291,
        287,
        269,
        267,
        261,
        260,
        258,
        255,
        254,
        252,
        251,
        249,
        248,
        245,
        241,
        238,
        234,
        233,
        232,
        222,
        208,
        204,
        203,
        202,
        201,
        200,
        198,
        197,
        196,
        195,
        193,
        192,
        190,
        189,
        187,
        186,
        185,
        184,
        180,
        172,
        171,
        166,
        165,
        164,
        163,
        162,
        161,
        155,
        154,
        151,
        150,
        149,
        148,
        145,
        144,
        142,
        141,
        140,
        139,
        138,
        137,
        132,
        131,
        127,
        125,
        118,
        117,
        115,
        113,
        108,
        107,
        104,
        99,
        96,
        93,
        91,
        89,
        84,
        83,
        78,
        74,
        73,
        69,
        48,
        44,
        37,
        30,
        28,
        26,
        25,
        23,
        22,
        16,
        15,
        9,
        4,
        2,
        1
    ],
    "finished": true
}