{
    "covered_issues": [
        112,
        106,
        100,
        99,
        97,
        66,
        56,
        54,
        53,
        52,
        51,
        49,
        47,
        43,
        36,
        32,
        31,
        30,
        29,
        27,
        25,
        24,
        22,
        21,
        19,
        13,
        7
    ],
    "finished": true
}