{
    "category": [
        "hardware/OS",
        "control flow"
    ],
    "commits": [
        {
            "associated_pull_request": [],
            "date": "2019-05-08 17:08:48",
            "diff": "open-mpi_ompi/issue_6575/commit_69f4da311657592fdf27d49c403094be148b6e1a.diff",
            "diff_additions": 81,
            "diff_deletions": 77,
            "diff_file_size": 115921,
            "diff_url": "https://github.com/open-mpi/ompi/commit/69f4da311657592fdf27d49c403094be148b6e1a.diff",
            "exists": true,
            "files": [
                {
                    "file_additions": 9,
                    "file_deletions": 9,
                    "file_exists": true,
                    "file_name": "ompi/datatype/ompi_datatype_module.c",
                    "file_size": 47854
                },
                {
                    "file_additions": 4,
                    "file_deletions": 4,
                    "file_exists": true,
                    "file_name": "opal/datatype/opal_convertor.c",
                    "file_size": 34287
                },
                {
                    "file_additions": 15,
                    "file_deletions": 15,
                    "file_exists": true,
                    "file_name": "opal/datatype/opal_convertor_raw.c",
                    "file_size": 13250
                },
                {
                    "file_additions": 18,
                    "file_deletions": 18,
                    "file_exists": true,
                    "file_name": "opal/datatype/opal_datatype_dump.c",
                    "file_size": 8398
                },
                {
                    "file_additions": 35,
                    "file_deletions": 31,
                    "file_exists": true,
                    "file_name": "test/datatype/ddt_raw.c",
                    "file_size": 12132
                }
            ],
            "interesting": {
                "reopen": false,
                "status": false
            },
            "is_parent": true,
            "sha": "69f4da311657592fdf27d49c403094be148b6e1a"
        },
        {
            "associated_pull_request": [],
            "date": "2019-05-09 20:27:49",
            "diff": "open-mpi_ompi/issue_6575/commit_42e19b25f935c00f3665c3931ef5320742f087d1.diff",
            "diff_additions": 67,
            "diff_deletions": 84,
            "diff_file_size": 15421,
            "diff_url": "https://github.com/open-mpi/ompi/commit/42e19b25f935c00f3665c3931ef5320742f087d1.diff",
            "exists": true,
            "files": [
                {
                    "file_additions": 6,
                    "file_deletions": 7,
                    "file_exists": true,
                    "file_name": "ompi/datatype/ompi_datatype_create_contiguous.c",
                    "file_size": 1589
                },
                {
                    "file_additions": 37,
                    "file_deletions": 42,
                    "file_exists": true,
                    "file_name": "ompi/datatype/ompi_datatype_create_indexed.c",
                    "file_size": 6461
                },
                {
                    "file_additions": 19,
                    "file_deletions": 19,
                    "file_exists": true,
                    "file_name": "ompi/datatype/ompi_datatype_create_struct.c",
                    "file_size": 3889
                },
                {
                    "file_additions": 5,
                    "file_deletions": 16,
                    "file_exists": true,
                    "file_name": "ompi/datatype/ompi_datatype_create_vector.c",
                    "file_size": 3482
                }
            ],
            "interesting": {
                "reopen": false,
                "status": false
            },
            "is_parent": false,
            "sha": "42e19b25f935c00f3665c3931ef5320742f087d1"
        },
        {
            "associated_pull_request": [],
            "date": "2019-05-09 20:27:49",
            "diff": "open-mpi_ompi/issue_6575/commit_9eb4c3f33af5a617f1c124ac0e5c2569e3e1d239.diff",
            "diff_additions": 67,
            "diff_deletions": 84,
            "diff_file_size": 15421,
            "diff_url": "https://github.com/open-mpi/ompi/commit/9eb4c3f33af5a617f1c124ac0e5c2569e3e1d239.diff",
            "exists": true,
            "files": [
                {
                    "file_additions": 6,
                    "file_deletions": 7,
                    "file_exists": true,
                    "file_name": "ompi/datatype/ompi_datatype_create_contiguous.c",
                    "file_size": 1589
                },
                {
                    "file_additions": 37,
                    "file_deletions": 42,
                    "file_exists": true,
                    "file_name": "ompi/datatype/ompi_datatype_create_indexed.c",
                    "file_size": 6461
                },
                {
                    "file_additions": 19,
                    "file_deletions": 19,
                    "file_exists": true,
                    "file_name": "ompi/datatype/ompi_datatype_create_struct.c",
                    "file_size": 3889
                },
                {
                    "file_additions": 5,
                    "file_deletions": 16,
                    "file_exists": true,
                    "file_name": "ompi/datatype/ompi_datatype_create_vector.c",
                    "file_size": 3482
                }
            ],
            "interesting": {
                "reopen": false,
                "status": false
            },
            "is_parent": false,
            "sha": "9eb4c3f33af5a617f1c124ac0e5c2569e3e1d239"
        },
        {
            "associated_pull_request": [],
            "date": "2019-05-09 20:27:49",
            "diff": "open-mpi_ompi/issue_6575/commit_bb9abc83e240e476716abe5e1819654f628c69fe.diff",
            "diff_additions": 68,
            "diff_deletions": 87,
            "diff_file_size": 25711,
            "diff_url": "https://github.com/open-mpi/ompi/commit/bb9abc83e240e476716abe5e1819654f628c69fe.diff",
            "exists": true,
            "files": [
                {
                    "file_additions": 6,
                    "file_deletions": 7,
                    "file_exists": true,
                    "file_name": "ompi/datatype/ompi_datatype_create_contiguous.c",
                    "file_size": 1589
                },
                {
                    "file_additions": 1,
                    "file_deletions": 3,
                    "file_exists": true,
                    "file_name": "ompi/datatype/ompi_datatype_create_darray.c",
                    "file_size": 10290
                },
                {
                    "file_additions": 37,
                    "file_deletions": 42,
                    "file_exists": true,
                    "file_name": "ompi/datatype/ompi_datatype_create_indexed.c",
                    "file_size": 6461
                },
                {
                    "file_additions": 19,
                    "file_deletions": 19,
                    "file_exists": true,
                    "file_name": "ompi/datatype/ompi_datatype_create_struct.c",
                    "file_size": 3889
                },
                {
                    "file_additions": 5,
                    "file_deletions": 16,
                    "file_exists": true,
                    "file_name": "ompi/datatype/ompi_datatype_create_vector.c",
                    "file_size": 3482
                }
            ],
            "interesting": {
                "reopen": false,
                "status": true
            },
            "is_parent": false,
            "sha": "bb9abc83e240e476716abe5e1819654f628c69fe"
        },
        {
            "associated_pull_request": [
                "https://github.com/open-mpi/ompi/pull/6647"
            ],
            "date": "2019-05-09 20:27:49",
            "diff": "open-mpi_ompi/issue_6575/commit_42119254c736b4f6e22b5818f6fae4028c9b1ab3.diff",
            "diff_additions": 68,
            "diff_deletions": 87,
            "diff_file_size": 25711,
            "diff_url": "https://github.com/open-mpi/ompi/commit/42119254c736b4f6e22b5818f6fae4028c9b1ab3.diff",
            "exists": true,
            "files": [
                {
                    "file_additions": 6,
                    "file_deletions": 7,
                    "file_exists": true,
                    "file_name": "ompi/datatype/ompi_datatype_create_contiguous.c",
                    "file_size": 1589
                },
                {
                    "file_additions": 1,
                    "file_deletions": 3,
                    "file_exists": true,
                    "file_name": "ompi/datatype/ompi_datatype_create_darray.c",
                    "file_size": 10290
                },
                {
                    "file_additions": 37,
                    "file_deletions": 42,
                    "file_exists": true,
                    "file_name": "ompi/datatype/ompi_datatype_create_indexed.c",
                    "file_size": 6461
                },
                {
                    "file_additions": 19,
                    "file_deletions": 19,
                    "file_exists": true,
                    "file_name": "ompi/datatype/ompi_datatype_create_struct.c",
                    "file_size": 3889
                },
                {
                    "file_additions": 5,
                    "file_deletions": 16,
                    "file_exists": true,
                    "file_name": "ompi/datatype/ompi_datatype_create_vector.c",
                    "file_size": 3482
                }
            ],
            "interesting": {
                "reopen": false,
                "status": false
            },
            "is_parent": false,
            "sha": "42119254c736b4f6e22b5818f6fae4028c9b1ab3"
        },
        {
            "associated_pull_request": [
                "https://github.com/open-mpi/ompi/pull/6647"
            ],
            "date": "2019-05-09 20:27:49",
            "diff": "open-mpi_ompi/issue_6575/commit_42119254c736b4f6e22b5818f6fae4028c9b1ab3.diff",
            "diff_additions": 68,
            "diff_deletions": 87,
            "diff_file_size": 25711,
            "diff_url": "https://github.com/open-mpi/ompi/commit/42119254c736b4f6e22b5818f6fae4028c9b1ab3.diff",
            "exists": true,
            "files": [
                {
                    "file_additions": 6,
                    "file_deletions": 7,
                    "file_exists": true,
                    "file_name": "ompi/datatype/ompi_datatype_create_contiguous.c",
                    "file_size": 1589
                },
                {
                    "file_additions": 1,
                    "file_deletions": 3,
                    "file_exists": true,
                    "file_name": "ompi/datatype/ompi_datatype_create_darray.c",
                    "file_size": 10290
                },
                {
                    "file_additions": 37,
                    "file_deletions": 42,
                    "file_exists": true,
                    "file_name": "ompi/datatype/ompi_datatype_create_indexed.c",
                    "file_size": 6461
                },
                {
                    "file_additions": 19,
                    "file_deletions": 19,
                    "file_exists": true,
                    "file_name": "ompi/datatype/ompi_datatype_create_struct.c",
                    "file_size": 3889
                },
                {
                    "file_additions": 5,
                    "file_deletions": 16,
                    "file_exists": true,
                    "file_name": "ompi/datatype/ompi_datatype_create_vector.c",
                    "file_size": 3482
                }
            ],
            "interesting": {
                "reopen": false,
                "status": false
            },
            "is_parent": false,
            "sha": "42119254c736b4f6e22b5818f6fae4028c9b1ab3"
        },
        {
            "associated_pull_request": [
                "https://github.com/open-mpi/ompi/pull/6863"
            ],
            "date": "2019-05-09 20:27:49",
            "diff": "open-mpi_ompi/issue_6575/commit_f68b06e9ee01d79469d691019e4aca7535ceb4a2.diff",
            "diff_additions": 68,
            "diff_deletions": 87,
            "diff_file_size": 25711,
            "diff_url": "https://github.com/open-mpi/ompi/commit/f68b06e9ee01d79469d691019e4aca7535ceb4a2.diff",
            "exists": true,
            "files": [
                {
                    "file_additions": 6,
                    "file_deletions": 7,
                    "file_exists": true,
                    "file_name": "ompi/datatype/ompi_datatype_create_contiguous.c",
                    "file_size": 1589
                },
                {
                    "file_additions": 1,
                    "file_deletions": 3,
                    "file_exists": true,
                    "file_name": "ompi/datatype/ompi_datatype_create_darray.c",
                    "file_size": 10290
                },
                {
                    "file_additions": 37,
                    "file_deletions": 42,
                    "file_exists": true,
                    "file_name": "ompi/datatype/ompi_datatype_create_indexed.c",
                    "file_size": 6461
                },
                {
                    "file_additions": 19,
                    "file_deletions": 19,
                    "file_exists": true,
                    "file_name": "ompi/datatype/ompi_datatype_create_struct.c",
                    "file_size": 3889
                },
                {
                    "file_additions": 5,
                    "file_deletions": 16,
                    "file_exists": true,
                    "file_name": "ompi/datatype/ompi_datatype_create_vector.c",
                    "file_size": 3482
                }
            ],
            "interesting": {
                "reopen": false,
                "status": false
            },
            "is_parent": false,
            "sha": "f68b06e9ee01d79469d691019e4aca7535ceb4a2"
        },
        {
            "associated_pull_request": [
                "https://github.com/open-mpi/ompi/pull/7267"
            ],
            "date": "2019-05-09 20:27:49",
            "diff": "open-mpi_ompi/issue_6575/commit_dee147aa96d7d74691b71c3f8da5a858bea6d2e3.diff",
            "diff_additions": 68,
            "diff_deletions": 87,
            "diff_file_size": 25711,
            "diff_url": "https://github.com/open-mpi/ompi/commit/dee147aa96d7d74691b71c3f8da5a858bea6d2e3.diff",
            "exists": true,
            "files": [
                {
                    "file_additions": 6,
                    "file_deletions": 7,
                    "file_exists": true,
                    "file_name": "ompi/datatype/ompi_datatype_create_contiguous.c",
                    "file_size": 1589
                },
                {
                    "file_additions": 1,
                    "file_deletions": 3,
                    "file_exists": true,
                    "file_name": "ompi/datatype/ompi_datatype_create_darray.c",
                    "file_size": 10290
                },
                {
                    "file_additions": 37,
                    "file_deletions": 42,
                    "file_exists": true,
                    "file_name": "ompi/datatype/ompi_datatype_create_indexed.c",
                    "file_size": 6461
                },
                {
                    "file_additions": 19,
                    "file_deletions": 19,
                    "file_exists": true,
                    "file_name": "ompi/datatype/ompi_datatype_create_struct.c",
                    "file_size": 3889
                },
                {
                    "file_additions": 5,
                    "file_deletions": 16,
                    "file_exists": true,
                    "file_name": "ompi/datatype/ompi_datatype_create_vector.c",
                    "file_size": 3482
                }
            ],
            "interesting": {
                "reopen": false,
                "status": false
            },
            "is_parent": false,
            "sha": "dee147aa96d7d74691b71c3f8da5a858bea6d2e3"
        }
    ],
    "first_commit": "2019-05-09 20:28:18",
    "last_commit": "2020-01-02 18:46:49",
    "number": 6575,
    "pull_request": "None",
    "score": {
        "accidental_reopen_likely": false,
        "all_labels": [],
        "contains_keywords": [
            "reason"
        ],
        "fix_size": 119,
        "has_labels": [],
        "intersecting": {
            "computed_score": 1.0,
            "final_commit_size": 119,
            "intersection_size": 119,
            "previous_commits_size": 119
        },
        "is_makefile_based": true,
        "no_new_files": [],
        "no_other_files": true,
        "num_prohibited_files": 102248,
        "prohibited_files": [
            "kill.h",
            "meminfo.h",
            "kill.h",
            "meminfo.h",
            "kill.h",
            "meminfo.h",
            "testsuite_cli_test.go",
            "testsuite_cli_test.go",
            "common.mk",
            "i3bar/include/draw_util.h"
        ],
        "reopen": false,
        "reopen_events": [
            [
                "2019-05-09 20:28:25",
                "commit"
            ],
            [
                "2019-05-09 23:08:47",
                "commit"
            ],
            [
                "2019-05-10 23:08:25",
                "commit"
            ],
            [
                "2019-05-10 23:53:49",
                "commit"
            ],
            [
                "2019-05-14 21:59:26",
                "closed"
            ],
            [
                "2019-05-14 21:59:26",
                "commit"
            ],
            [
                "2019-08-05 13:40:17",
                "commit"
            ],
            [
                "2020-01-02 18:55:52",
                "commit"
            ]
        ],
        "status": true,
        "strategy": true,
        "total_changes": 1235
    }
}