{
    "covered_issues": [
        308,
        304,
        292,
        278,
        266,
        263,
        262,
        254,
        239,
        232,
        227,
        217,
        216,
        210,
        208,
        195,
        181,
        179,
        175,
        172,
        171,
        168,
        164,
        153,
        145,
        138,
        136,
        129,
        119,
        118,
        116,
        109,
        105,
        72,
        64,
        62,
        57,
        55,
        52,
        50,
        48,
        25,
        18,
        15,
        12,
        11,
        5,
        3
    ],
    "finished": true
}