{
    "category": [
        "network/protocols",
        "network/protocol"
    ],
    "commits": [
        {
            "associated_pull_request": [],
            "date": "2018-05-01 02:02:00",
            "diff": "",
            "diff_additions": 0,
            "diff_deletions": 0,
            "diff_file_size": 0,
            "diff_url": "https://github.com/nanomsg/nng/commit/63bdb2c28bc185096e579d1922d57cb71ecaa36b.diff",
            "exists": true,
            "files": [],
            "interesting": {
                "reopen": false,
                "status": true
            },
            "is_parent": true,
            "sha": "63bdb2c28bc185096e579d1922d57cb71ecaa36b"
        },
        {
            "associated_pull_request": [],
            "date": "2018-05-01 04:41:40",
            "diff": "nanomsg_nng/issue_381/commit_ccf1394aafc867f767d8b1f01141b1f724582bc1.diff",
            "diff_additions": 149,
            "diff_deletions": 36,
            "diff_file_size": 53950,
            "diff_url": "https://github.com/nanomsg/nng/commit/ccf1394aafc867f767d8b1f01141b1f724582bc1.diff",
            "exists": true,
            "files": [
                {
                    "file_additions": 10,
                    "file_deletions": 5,
                    "file_exists": true,
                    "file_name": "src/core/pipe.c",
                    "file_size": 9634
                },
                {
                    "file_additions": 102,
                    "file_deletions": 10,
                    "file_exists": true,
                    "file_name": "src/nng.c",
                    "file_size": 36081
                },
                {
                    "file_additions": 5,
                    "file_deletions": 2,
                    "file_exists": true,
                    "file_name": "tests/message.c",
                    "file_size": 8235
                },
                {
                    "file_additions": 22,
                    "file_deletions": 14,
                    "file_exists": false,
                    "file_name": "tests/pair1.c",
                    "file_size": 0
                },
                {
                    "file_additions": 10,
                    "file_deletions": 5,
                    "file_exists": false,
                    "file_name": "tests/sock.c",
                    "file_size": 0
                }
            ],
            "interesting": {
                "reopen": false,
                "status": true
            },
            "is_parent": false,
            "sha": "ccf1394aafc867f767d8b1f01141b1f724582bc1"
        },
        {
            "associated_pull_request": [
                "https://github.com/nanomsg/nng/pull/388"
            ],
            "date": "2018-05-01 04:41:40",
            "diff": "nanomsg_nng/issue_381/commit_4998964a435fe0f02a2d81b01fdb837214674e72.diff",
            "diff_additions": 120,
            "diff_deletions": 58,
            "diff_file_size": 92242,
            "diff_url": "https://github.com/nanomsg/nng/commit/4998964a435fe0f02a2d81b01fdb837214674e72.diff",
            "exists": true,
            "files": [
                {
                    "file_additions": 10,
                    "file_deletions": 5,
                    "file_exists": true,
                    "file_name": "src/core/pipe.c",
                    "file_size": 9634
                },
                {
                    "file_additions": 46,
                    "file_deletions": 16,
                    "file_exists": true,
                    "file_name": "src/nng.c",
                    "file_size": 36081
                },
                {
                    "file_additions": 8,
                    "file_deletions": 4,
                    "file_exists": true,
                    "file_name": "tests/message.c",
                    "file_size": 8235
                },
                {
                    "file_additions": 22,
                    "file_deletions": 14,
                    "file_exists": false,
                    "file_name": "tests/pair1.c",
                    "file_size": 0
                },
                {
                    "file_additions": 1,
                    "file_deletions": 1,
                    "file_exists": false,
                    "file_name": "tests/reconnect.c",
                    "file_size": 0
                },
                {
                    "file_additions": 12,
                    "file_deletions": 5,
                    "file_exists": false,
                    "file_name": "tests/sock.c",
                    "file_size": 0
                },
                {
                    "file_additions": 9,
                    "file_deletions": 1,
                    "file_exists": false,
                    "file_name": "tests/surveyctx.c",
                    "file_size": 0
                },
                {
                    "file_additions": 1,
                    "file_deletions": 1,
                    "file_exists": true,
                    "file_name": "tests/tcp.c",
                    "file_size": 1673
                },
                {
                    "file_additions": 2,
                    "file_deletions": 2,
                    "file_exists": true,
                    "file_name": "tests/tcp6.c",
                    "file_size": 2246
                },
                {
                    "file_additions": 3,
                    "file_deletions": 3,
                    "file_exists": true,
                    "file_name": "tests/tls.c",
                    "file_size": 16793
                },
                {
                    "file_additions": 1,
                    "file_deletions": 1,
                    "file_exists": true,
                    "file_name": "tests/ws.c",
                    "file_size": 2256
                },
                {
                    "file_additions": 1,
                    "file_deletions": 1,
                    "file_exists": true,
                    "file_name": "tests/wss.c",
                    "file_size": 7918
                },
                {
                    "file_additions": 3,
                    "file_deletions": 3,
                    "file_exists": false,
                    "file_name": "tests/wssfile.c",
                    "file_size": 0
                },
                {
                    "file_additions": 1,
                    "file_deletions": 1,
                    "file_exists": true,
                    "file_name": "tests/zt.c",
                    "file_size": 7406
                }
            ],
            "interesting": {
                "reopen": false,
                "status": false
            },
            "is_parent": false,
            "sha": "4998964a435fe0f02a2d81b01fdb837214674e72"
        },
        {
            "associated_pull_request": [
                "https://github.com/nanomsg/nng/pull/388"
            ],
            "date": "2018-05-01 04:41:40",
            "diff": "nanomsg_nng/issue_381/commit_4998964a435fe0f02a2d81b01fdb837214674e72.diff",
            "diff_additions": 120,
            "diff_deletions": 58,
            "diff_file_size": 92242,
            "diff_url": "https://github.com/nanomsg/nng/commit/4998964a435fe0f02a2d81b01fdb837214674e72.diff",
            "exists": true,
            "files": [
                {
                    "file_additions": 10,
                    "file_deletions": 5,
                    "file_exists": true,
                    "file_name": "src/core/pipe.c",
                    "file_size": 9634
                },
                {
                    "file_additions": 46,
                    "file_deletions": 16,
                    "file_exists": true,
                    "file_name": "src/nng.c",
                    "file_size": 36081
                },
                {
                    "file_additions": 8,
                    "file_deletions": 4,
                    "file_exists": true,
                    "file_name": "tests/message.c",
                    "file_size": 8235
                },
                {
                    "file_additions": 22,
                    "file_deletions": 14,
                    "file_exists": false,
                    "file_name": "tests/pair1.c",
                    "file_size": 0
                },
                {
                    "file_additions": 1,
                    "file_deletions": 1,
                    "file_exists": false,
                    "file_name": "tests/reconnect.c",
                    "file_size": 0
                },
                {
                    "file_additions": 12,
                    "file_deletions": 5,
                    "file_exists": false,
                    "file_name": "tests/sock.c",
                    "file_size": 0
                },
                {
                    "file_additions": 9,
                    "file_deletions": 1,
                    "file_exists": false,
                    "file_name": "tests/surveyctx.c",
                    "file_size": 0
                },
                {
                    "file_additions": 1,
                    "file_deletions": 1,
                    "file_exists": true,
                    "file_name": "tests/tcp.c",
                    "file_size": 1673
                },
                {
                    "file_additions": 2,
                    "file_deletions": 2,
                    "file_exists": true,
                    "file_name": "tests/tcp6.c",
                    "file_size": 2246
                },
                {
                    "file_additions": 3,
                    "file_deletions": 3,
                    "file_exists": true,
                    "file_name": "tests/tls.c",
                    "file_size": 16793
                },
                {
                    "file_additions": 1,
                    "file_deletions": 1,
                    "file_exists": true,
                    "file_name": "tests/ws.c",
                    "file_size": 2256
                },
                {
                    "file_additions": 1,
                    "file_deletions": 1,
                    "file_exists": true,
                    "file_name": "tests/wss.c",
                    "file_size": 7918
                },
                {
                    "file_additions": 3,
                    "file_deletions": 3,
                    "file_exists": false,
                    "file_name": "tests/wssfile.c",
                    "file_size": 0
                },
                {
                    "file_additions": 1,
                    "file_deletions": 1,
                    "file_exists": true,
                    "file_name": "tests/zt.c",
                    "file_size": 7406
                }
            ],
            "interesting": {
                "reopen": false,
                "status": false
            },
            "is_parent": false,
            "sha": "4998964a435fe0f02a2d81b01fdb837214674e72"
        }
    ],
    "first_commit": "2018-05-01 02:02:00",
    "last_commit": "2018-05-01 19:27:19",
    "number": 381,
    "pull_request": "None",
    "score": {
        "accidental_reopen_likely": false,
        "all_labels": [],
        "contains_keywords": [
            "bug",
            "fix",
            "debug"
        ],
        "fix_size": 264,
        "has_labels": [],
        "intersecting": {
            "computed_score": 1.0,
            "final_commit_size": 167,
            "intersection_size": 167,
            "previous_commits_size": 264
        },
        "is_makefile_based": true,
        "no_new_files": [],
        "no_other_files": false,
        "num_prohibited_files": 47787,
        "prohibited_files": [
            "hal/inc/pinmap_hal.h",
            "Debug/marvin.bin",
            "Debug/marvin.elf",
            "Debug/marvin.hex",
            "Debug/marvin.bin",
            "Debug/marvin.elf",
            "Debug/marvin.hex",
            "inc/spark_utilities.h",
            "Debug/marvin.bin",
            "Debug/marvin.elf"
        ],
        "reopen": false,
        "reopen_events": [
            [
                "2018-05-01 04:42:12",
                "commit"
            ],
            [
                "2018-05-01 19:27:37",
                "commit"
            ],
            [
                "2018-05-01 19:55:51",
                "closed"
            ],
            [
                "2018-05-01 19:55:51",
                "commit"
            ]
        ],
        "status": true,
        "strategy": true,
        "total_changes": 541
    }
}