{
    "covered_issues": [
        28,
        26,
        24,
        23,
        22,
        18,
        17,
        16,
        14,
        13,
        12,
        11,
        9,
        8,
        7,
        6,
        3,
        1
    ],
    "finished": true
}