{
    "commits": [
        {
            "associated_pull_request": [],
            "date": "2023-06-03 11:06:19+00:00",
            "diff": "",
            "diff_additions": 0,
            "diff_deletions": 0,
            "diff_file_size": 0,
            "diff_url": "https://github.com/aiekick/ImGuiFileDialog/commit/28182e28993ff0524da5e63803ff8870b9f699c3.diff",
            "exists": true,
            "files": [],
            "interesting": {
                "reopen": false,
                "status": false
            },
            "is_parent": true,
            "sha": "28182e28993ff0524da5e63803ff8870b9f699c3"
        },
        {
            "associated_pull_request": [],
            "date": "2023-06-06 21:22:56+00:00",
            "diff": "aiekick_imguifiledialog/issue_118/commit_41ae42a6d5b0c254fe713046c1103812143ec731.diff",
            "diff_additions": 53,
            "diff_deletions": 5,
            "diff_file_size": 196609,
            "diff_url": "https://github.com/aiekick/ImGuiFileDialog/commit/41ae42a6d5b0c254fe713046c1103812143ec731.diff",
            "exists": true,
            "files": [
                {
                    "file_additions": 53,
                    "file_deletions": 5,
                    "file_exists": true,
                    "file_name": "ImGuiFileDialog.cpp",
                    "file_size": 196609
                }
            ],
            "interesting": {
                "reopen": false,
                "status": false
            },
            "is_parent": false,
            "sha": "41ae42a6d5b0c254fe713046c1103812143ec731"
        },
        {
            "associated_pull_request": [],
            "date": "2023-06-06 21:23:50+00:00",
            "diff": "aiekick_imguifiledialog/issue_118/commit_764ae2e5fec804a5e197b8b7961387b77ea44a79.diff",
            "diff_additions": 175,
            "diff_deletions": 1,
            "diff_file_size": 0,
            "diff_url": "https://github.com/aiekick/ImGuiFileDialog/commit/764ae2e5fec804a5e197b8b7961387b77ea44a79.diff",
            "exists": true,
            "files": [
                {
                    "file_additions": 173,
                    "file_deletions": 0,
                    "file_exists": false,
                    "file_name": "tests/ImGuiFileDialog/FilterManager/Test_FilterManager.cpp",
                    "file_size": 0
                },
                {
                    "file_additions": 2,
                    "file_deletions": 1,
                    "file_exists": false,
                    "file_name": "tests/main.cpp",
                    "file_size": 0
                }
            ],
            "interesting": {
                "reopen": true,
                "status": false
            },
            "is_parent": false,
            "sha": "764ae2e5fec804a5e197b8b7961387b77ea44a79"
        },
        {
            "associated_pull_request": [],
            "date": "2023-06-11 12:26:33+00:00",
            "diff": "aiekick_imguifiledialog/issue_118/commit_f67f9efadc2e932cd9ba27fd957bc84522b522d2.diff",
            "diff_additions": 4,
            "diff_deletions": 5,
            "diff_file_size": 196609,
            "diff_url": "https://github.com/aiekick/ImGuiFileDialog/commit/f67f9efadc2e932cd9ba27fd957bc84522b522d2.diff",
            "exists": true,
            "files": [
                {
                    "file_additions": 4,
                    "file_deletions": 5,
                    "file_exists": true,
                    "file_name": "ImGuiFileDialog.cpp",
                    "file_size": 196609
                }
            ],
            "interesting": {
                "reopen": false,
                "status": false
            },
            "is_parent": false,
            "sha": "f67f9efadc2e932cd9ba27fd957bc84522b522d2"
        },
        {
            "associated_pull_request": [],
            "date": "2023-06-11 12:26:40+00:00",
            "diff": "aiekick_imguifiledialog/issue_118/commit_a22b289916c79fe0a1741178a432240fb0fd3773.diff",
            "diff_additions": 92,
            "diff_deletions": 2,
            "diff_file_size": 0,
            "diff_url": "https://github.com/aiekick/ImGuiFileDialog/commit/a22b289916c79fe0a1741178a432240fb0fd3773.diff",
            "exists": true,
            "files": [
                {
                    "file_additions": 84,
                    "file_deletions": 0,
                    "file_exists": false,
                    "file_name": "tests/ImGuiFileDialog/Test_FileStyle.cpp",
                    "file_size": 0
                },
                {
                    "file_additions": 8,
                    "file_deletions": 2,
                    "file_exists": false,
                    "file_name": "tests/ImGuiFileDialog/Test_ImGuiFileDialog.cpp",
                    "file_size": 0
                }
            ],
            "interesting": {
                "reopen": false,
                "status": false
            },
            "is_parent": false,
            "sha": "a22b289916c79fe0a1741178a432240fb0fd3773"
        }
    ],
    "first_commit": "2023-06-03 11:06:19+00:00",
    "last_commit": "2023-06-11 12:26:40+00:00",
    "number": 118,
    "pull_request": "None",
    "score": {
        "accidental_reopen_likely": false,
        "all_labels": [
            "enhancement",
            "filter"
        ],
        "contains_keywords": [
            "confirm",
            "work",
            "fail",
            "chang",
            "fix",
            "issu",
            "test",
            "bug",
            "problem"
        ],
        "fix_size": 250,
        "has_labels": [],
        "intersecting": {
            "computed_score": 0.0,
            "final_commit_size": 10,
            "intersection_size": 0,
            "previous_commits_size": 240
        },
        "is_makefile_based": true,
        "no_new_files": [
            "tests/ImGuiFileDialog/Test_ImGuiFileDialog.cpp"
        ],
        "no_other_files": false,
        "num_prohibited_files": 229763,
        "prohibited_files": [
            "server/src/main/java/com/genymobile/scrcpy/Device.java",
            "server/src/main/java/com/genymobile/scrcpy/wrappers/SurfaceControl.java",
            "server/src/main/java/com/genymobile/scrcpy/Device.java",
            "server/src/main/java/com/genymobile/scrcpy/wrappers/SurfaceControl.java",
            "app/meson.build",
            "app/scrcpy.1",
            "app/src/common.h",
            "app/src/scrcpy.h",
            "app/src/server.h",
            "server/src/main/java/com/genymobile/scrcpy/Workarounds.java"
        ],
        "reopen": true,
        "reopen_events": [
            [
                "2023-06-06 21:23:37+00:00",
                "commit"
            ],
            [
                "2023-06-06 21:23:49+00:00",
                "commit"
            ],
            [
                "2023-06-11 11:30:32+00:00",
                "closed"
            ],
            [
                "2023-06-11 11:49:41+00:00",
                "reopened"
            ],
            [
                "2023-06-11 12:26:34+00:00",
                "commit"
            ],
            [
                "2023-06-11 12:26:41+00:00",
                "commit"
            ],
            [
                "2023-06-11 12:27:16+00:00",
                "closed"
            ]
        ],
        "status": false,
        "strategy": true,
        "total_changes": 337
    }
}