{
    "category": [
        "feature request",
        "wrong API usage"
    ],
    "commits": [
        {
            "associated_pull_request": [
                "https://github.com/zephyrproject-rtos/zephyr/pull/25902"
            ],
            "date": "2020-06-02 12:21:12",
            "diff": "zephyrproject-rtos_zephyr/issue_27457/commit_9df168b53569eb29ca96cc2b8625483c8e3d9833.diff",
            "diff_additions": 78,
            "diff_deletions": 11,
            "diff_file_size": 4635,
            "diff_url": "https://github.com/zephyrproject-rtos/zephyr/commit/9df168b53569eb29ca96cc2b8625483c8e3d9833.diff",
            "exists": true,
            "files": [
                {
                    "file_additions": 78,
                    "file_deletions": 11,
                    "file_exists": true,
                    "file_name": "tests/lib/fdtable/src/main.c",
                    "file_size": 4635
                }
            ],
            "interesting": {
                "reopen": false,
                "status": false
            },
            "is_parent": true,
            "sha": "9df168b53569eb29ca96cc2b8625483c8e3d9833"
        },
        {
            "associated_pull_request": [],
            "date": "2020-08-19 12:40:32",
            "diff": "zephyrproject-rtos_zephyr/issue_27457/commit_abe92d2d10e8b7502a456f4ebb8c19c25bff42b7.diff",
            "diff_additions": 101,
            "diff_deletions": 0,
            "diff_file_size": 0,
            "diff_url": "https://github.com/zephyrproject-rtos/zephyr/commit/abe92d2d10e8b7502a456f4ebb8c19c25bff42b7.diff",
            "exists": true,
            "files": [
                {
                    "file_additions": 101,
                    "file_deletions": 0,
                    "file_exists": false,
                    "file_name": "samples/boards/thingy52_nrf52832/pdm/src/main.c",
                    "file_size": 0
                }
            ],
            "interesting": {
                "reopen": false,
                "status": true
            },
            "is_parent": false,
            "sha": "abe92d2d10e8b7502a456f4ebb8c19c25bff42b7"
        },
        {
            "associated_pull_request": [],
            "date": "2020-08-19 13:22:09",
            "diff": "zephyrproject-rtos_zephyr/issue_27457/commit_800c4aad9ba64d12415aaa3287af81d4117b90a4.diff",
            "diff_additions": 1,
            "diff_deletions": 2,
            "diff_file_size": 0,
            "diff_url": "https://github.com/zephyrproject-rtos/zephyr/commit/800c4aad9ba64d12415aaa3287af81d4117b90a4.diff",
            "exists": true,
            "files": [
                {
                    "file_additions": 1,
                    "file_deletions": 2,
                    "file_exists": false,
                    "file_name": "samples/boards/thingy52_nrf52832/pdm/src/main.c",
                    "file_size": 0
                }
            ],
            "interesting": {
                "reopen": false,
                "status": false
            },
            "is_parent": false,
            "sha": "800c4aad9ba64d12415aaa3287af81d4117b90a4"
        },
        {
            "associated_pull_request": [],
            "date": "2020-08-19 13:22:09",
            "diff": "zephyrproject-rtos_zephyr/issue_27457/commit_9ef880a7f031e2e1e8b6544ef63d4a9fadab5344.diff",
            "diff_additions": 1,
            "diff_deletions": 2,
            "diff_file_size": 0,
            "diff_url": "https://github.com/zephyrproject-rtos/zephyr/commit/9ef880a7f031e2e1e8b6544ef63d4a9fadab5344.diff",
            "exists": true,
            "files": [
                {
                    "file_additions": 1,
                    "file_deletions": 2,
                    "file_exists": false,
                    "file_name": "samples/boards/thingy52_nrf52832/pdm/src/main.c",
                    "file_size": 0
                }
            ],
            "interesting": {
                "reopen": false,
                "status": true
            },
            "is_parent": false,
            "sha": "9ef880a7f031e2e1e8b6544ef63d4a9fadab5344"
        }
    ],
    "first_commit": "2020-08-10 21:56:08",
    "last_commit": "2020-10-15 09:25:57",
    "number": 27457,
    "pull_request": "None",
    "score": {
        "accidental_reopen_likely": false,
        "all_labels": [
            "Hardware Support",
            "Stale",
            "platform: nRF"
        ],
        "contains_keywords": [
            "test",
            "fix",
            "remov",
            "issu",
            "work"
        ],
        "fix_size": 3,
        "has_labels": [],
        "intersecting": {
            "computed_score": 1.0,
            "final_commit_size": 3,
            "intersection_size": 3,
            "previous_commits_size": 3
        },
        "is_makefile_based": true,
        "no_new_files": [],
        "no_other_files": false,
        "num_prohibited_files": 207606,
        "prohibited_files": [
            "hal/inc/pinmap_hal.h",
            "Debug/marvin.bin",
            "Debug/marvin.elf",
            "Debug/marvin.hex",
            "Debug/marvin.bin",
            "Debug/marvin.elf",
            "Debug/marvin.hex",
            "inc/spark_utilities.h",
            "Debug/marvin.bin",
            "Debug/marvin.elf"
        ],
        "reopen": false,
        "reopen_events": [
            [
                "2020-08-19 12:30:34",
                "commit"
            ],
            [
                "2020-08-19 12:33:53",
                "commit"
            ],
            [
                "2020-08-19 12:38:33",
                "commit"
            ],
            [
                "2020-08-19 12:41:56",
                "commit"
            ],
            [
                "2020-08-19 13:28:07",
                "commit"
            ],
            [
                "2020-08-19 18:14:23",
                "commit"
            ],
            [
                "2020-08-19 18:14:23",
                "commit"
            ],
            [
                "2020-08-19 18:14:23",
                "commit"
            ],
            [
                "2020-08-19 18:14:23",
                "commit"
            ],
            [
                "2020-08-19 18:14:23",
                "commit"
            ],
            [
                "2020-08-19 18:24:18",
                "commit"
            ],
            [
                "2020-08-20 12:20:43",
                "commit"
            ],
            [
                "2020-08-20 12:20:43",
                "commit"
            ],
            [
                "2020-08-20 12:20:43",
                "commit"
            ],
            [
                "2020-08-20 12:24:27",
                "commit"
            ],
            [
                "2020-08-20 12:24:27",
                "commit"
            ],
            [
                "2020-08-20 12:39:34",
                "commit"
            ],
            [
                "2020-08-20 12:39:34",
                "commit"
            ],
            [
                "2020-08-20 12:39:35",
                "commit"
            ],
            [
                "2020-08-24 09:34:09",
                "commit"
            ],
            [
                "2020-08-24 09:34:09",
                "commit"
            ],
            [
                "2020-08-24 09:34:09",
                "commit"
            ],
            [
                "2020-09-28 14:11:07",
                "commit"
            ],
            [
                "2020-09-28 14:11:07",
                "commit"
            ],
            [
                "2020-09-28 14:11:07",
                "commit"
            ],
            [
                "2020-10-15 09:26:28",
                "commit"
            ],
            [
                "2020-10-15 09:26:28",
                "commit"
            ],
            [
                "2020-10-15 09:26:28",
                "commit"
            ],
            [
                "2020-11-02 00:48:43",
                "closed"
            ]
        ],
        "status": true,
        "strategy": true,
        "total_changes": 196
    }
}