{
    "covered_issues": [
        150,
        149,
        148,
        147,
        146,
        145,
        144,
        143,
        142,
        141,
        140,
        139,
        137,
        135,
        134,
        133,
        132,
        131,
        130,
        129,
        128,
        127,
        126,
        125,
        124,
        123,
        122,
        121,
        118,
        117,
        116,
        114,
        113,
        112,
        111,
        109,
        107,
        106,
        105,
        103,
        101,
        100,
        99,
        98,
        97,
        96,
        95,
        91,
        89,
        88,
        87,
        86,
        85,
        84,
        82,
        80,
        79,
        78,
        77,
        76,
        75,
        74,
        73,
        72,
        71,
        69,
        67,
        66,
        64,
        63,
        62,
        61,
        60,
        58,
        57,
        56,
        55,
        54,
        53,
        52,
        49,
        47,
        46,
        45,
        44,
        43,
        42,
        39,
        38,
        37,
        36,
        35,
        33,
        32,
        31,
        30,
        29,
        27,
        26,
        25,
        24,
        23,
        22,
        21,
        20,
        19,
        18,
        17,
        16,
        15,
        14,
        13,
        12,
        11,
        10,
        9,
        8,
        7,
        6,
        5,
        3,
        2,
        1
    ],
    "finished": true
}