{
    "category": [
        "memory",
        "feature request"
    ],
    "commits": [
        {
            "associated_pull_request": [],
            "date": "2019-11-06 15:06:51",
            "diff": "",
            "diff_additions": 0,
            "diff_deletions": 0,
            "diff_file_size": 0,
            "diff_url": "https://github.com/rspamd/rspamd/commit/5172bac9ff82d0abc316d40b61cec13b91903a1a.diff",
            "exists": true,
            "files": [],
            "interesting": {
                "reopen": false,
                "status": false
            },
            "is_parent": true,
            "sha": "5172bac9ff82d0abc316d40b61cec13b91903a1a"
        },
        {
            "associated_pull_request": [
                "https://github.com/rspamd/rspamd/pull/3147"
            ],
            "date": "2019-11-07 03:57:53",
            "diff": "rspamd_rspamd/issue_3129/commit_65f99530f454f1dce95ddc0e9dd04a43758274bc.diff",
            "diff_additions": 23,
            "diff_deletions": 38,
            "diff_file_size": 30553,
            "diff_url": "https://github.com/rspamd/rspamd/commit/65f99530f454f1dce95ddc0e9dd04a43758274bc.diff",
            "exists": true,
            "files": [
                {
                    "file_additions": 23,
                    "file_deletions": 38,
                    "file_exists": true,
                    "file_name": "src/libstat/stat_process.c",
                    "file_size": 30553
                }
            ],
            "interesting": {
                "reopen": false,
                "status": false
            },
            "is_parent": false,
            "sha": "65f99530f454f1dce95ddc0e9dd04a43758274bc"
        },
        {
            "associated_pull_request": [
                "https://github.com/rspamd/rspamd/pull/3147"
            ],
            "date": "2019-11-07 10:56:09",
            "diff": "rspamd_rspamd/issue_3129/commit_606c653671216b6575e4966e4c84a2f8da2fe43f.diff",
            "diff_additions": 4,
            "diff_deletions": 7,
            "diff_file_size": 47301,
            "diff_url": "https://github.com/rspamd/rspamd/commit/606c653671216b6575e4966e4c84a2f8da2fe43f.diff",
            "exists": true,
            "files": [
                {
                    "file_additions": 4,
                    "file_deletions": 7,
                    "file_exists": true,
                    "file_name": "src/libstat/backends/redis_backend.c",
                    "file_size": 47301
                }
            ],
            "interesting": {
                "reopen": false,
                "status": false
            },
            "is_parent": false,
            "sha": "606c653671216b6575e4966e4c84a2f8da2fe43f"
        },
        {
            "associated_pull_request": [
                "https://github.com/rspamd/rspamd/pull/3147"
            ],
            "date": "2019-11-07 11:00:03",
            "diff": "rspamd_rspamd/issue_3129/commit_95c85692488911c9c8aa1b44027ed2c6b8b7be9c.diff",
            "diff_additions": 2,
            "diff_deletions": 2,
            "diff_file_size": 77854,
            "diff_url": "https://github.com/rspamd/rspamd/commit/95c85692488911c9c8aa1b44027ed2c6b8b7be9c.diff",
            "exists": true,
            "files": [
                {
                    "file_additions": 1,
                    "file_deletions": 1,
                    "file_exists": true,
                    "file_name": "src/libstat/backends/redis_backend.c",
                    "file_size": 47301
                },
                {
                    "file_additions": 1,
                    "file_deletions": 1,
                    "file_exists": true,
                    "file_name": "src/libstat/stat_process.c",
                    "file_size": 30553
                }
            ],
            "interesting": {
                "reopen": false,
                "status": false
            },
            "is_parent": false,
            "sha": "95c85692488911c9c8aa1b44027ed2c6b8b7be9c"
        },
        {
            "associated_pull_request": [
                "https://github.com/rspamd/rspamd/pull/3147"
            ],
            "date": "2019-11-08 08:05:36",
            "diff": "rspamd_rspamd/issue_3129/commit_14495547dea7e4a0c14cf1507ba7def74b58a4ce.diff",
            "diff_additions": 29,
            "diff_deletions": 3,
            "diff_file_size": 59843,
            "diff_url": "https://github.com/rspamd/rspamd/commit/14495547dea7e4a0c14cf1507ba7def74b58a4ce.diff",
            "exists": true,
            "files": [
                {
                    "file_additions": 18,
                    "file_deletions": 2,
                    "file_exists": true,
                    "file_name": "src/libstat/backends/redis_backend.c",
                    "file_size": 47301
                },
                {
                    "file_additions": 11,
                    "file_deletions": 1,
                    "file_exists": true,
                    "file_name": "src/libstat/learn_cache/redis_cache.c",
                    "file_size": 12542
                }
            ],
            "interesting": {
                "reopen": false,
                "status": true
            },
            "is_parent": false,
            "sha": "14495547dea7e4a0c14cf1507ba7def74b58a4ce"
        },
        {
            "associated_pull_request": [
                "https://github.com/rspamd/rspamd/pull/3147"
            ],
            "date": "2019-11-14 08:04:24",
            "diff": "rspamd_rspamd/issue_3129/commit_901e31e9772fcdf1043ace5536805c3c5e5b90c3.diff",
            "diff_additions": 3,
            "diff_deletions": 29,
            "diff_file_size": 59843,
            "diff_url": "https://github.com/rspamd/rspamd/commit/901e31e9772fcdf1043ace5536805c3c5e5b90c3.diff",
            "exists": true,
            "files": [
                {
                    "file_additions": 2,
                    "file_deletions": 18,
                    "file_exists": true,
                    "file_name": "src/libstat/backends/redis_backend.c",
                    "file_size": 47301
                },
                {
                    "file_additions": 1,
                    "file_deletions": 11,
                    "file_exists": true,
                    "file_name": "src/libstat/learn_cache/redis_cache.c",
                    "file_size": 12542
                }
            ],
            "interesting": {
                "reopen": false,
                "status": false
            },
            "is_parent": false,
            "sha": "901e31e9772fcdf1043ace5536805c3c5e5b90c3"
        }
    ],
    "first_commit": "2019-11-06 15:06:51",
    "last_commit": "2019-11-19 17:31:43",
    "number": 3129,
    "pull_request": "None",
    "score": {
        "accidental_reopen_likely": false,
        "all_labels": [
            "bug"
        ],
        "contains_keywords": [
            "report",
            "warn",
            "error",
            "test",
            "fix",
            "patch",
            "attempt",
            "issu",
            "work",
            "fault"
        ],
        "fix_size": 102,
        "has_labels": [
            "bug"
        ],
        "intersecting": {
            "computed_score": 1.0,
            "final_commit_size": 33,
            "intersection_size": 33,
            "previous_commits_size": 102
        },
        "is_makefile_based": true,
        "no_new_files": [],
        "no_other_files": true,
        "num_prohibited_files": 75815,
        "prohibited_files": [
            "hal/inc/pinmap_hal.h",
            "Debug/marvin.bin",
            "Debug/marvin.elf",
            "Debug/marvin.hex",
            "Debug/marvin.bin",
            "Debug/marvin.elf",
            "Debug/marvin.hex",
            "inc/spark_utilities.h",
            "Debug/marvin.bin",
            "Debug/marvin.elf"
        ],
        "reopen": false,
        "reopen_events": [
            [
                "2019-11-07 03:58:09",
                "commit"
            ],
            [
                "2019-11-07 10:56:22",
                "commit"
            ],
            [
                "2019-11-07 11:02:14",
                "commit"
            ],
            [
                "2019-11-08 08:05:53",
                "commit"
            ],
            [
                "2019-11-14 08:04:44",
                "commit"
            ],
            [
                "2019-11-18 11:45:53",
                "closed"
            ],
            [
                "2019-11-19 17:40:22",
                "commit"
            ]
        ],
        "status": true,
        "strategy": true,
        "total_changes": 140
    }
}