{
    "covered_issues": [
        1051,
        1042,
        1039,
        1013,
        1012,
        1009,
        1008,
        1004,
        1003,
        1002,
        1000,
        998,
        993,
        992,
        991,
        990,
        986,
        985,
        983,
        981,
        980,
        979,
        978,
        975,
        971,
        970,
        969,
        968,
        964,
        960,
        954,
        953,
        952,
        950,
        949,
        947,
        945,
        942,
        941,
        938,
        929,
        927,
        926,
        925,
        924,
        923,
        920,
        918,
        917,
        916,
        914,
        911,
        909,
        908,
        905,
        904,
        895,
        894,
        891,
        888,
        887,
        883,
        882,
        881,
        880,
        879,
        878,
        877,
        876,
        875,
        872,
        869,
        868,
        865,
        863,
        860,
        859,
        858,
        855,
        853,
        851,
        845,
        844,
        842,
        841,
        840,
        835,
        834,
        832,
        831,
        830,
        823,
        822,
        821,
        815,
        813,
        810,
        808,
        807,
        806,
        805,
        804,
        800,
        799,
        785,
        780,
        779,
        778,
        777,
        776,
        775,
        774,
        773,
        770,
        769,
        765,
        764,
        761,
        760,
        752,
        751,
        750,
        748,
        747,
        746,
        745,
        743,
        740,
        738,
        736,
        734,
        732,
        731,
        730,
        728,
        727,
        726,
        724,
        723,
        718,
        715,
        714,
        713,
        707,
        706,
        704,
        703,
        700,
        699,
        698,
        695,
        694,
        691,
        690,
        689,
        688,
        687,
        682,
        680,
        679,
        677,
        676,
        675,
        674,
        669,
        667,
        665,
        661,
        660,
        659,
        642,
        639,
        638,
        637,
        634,
        632,
        629,
        625,
        624,
        622,
        621,
        620,
        619,
        618,
        615,
        614,
        612,
        610,
        605,
        604,
        599,
        595,
        590,
        584,
        583,
        582,
        575,
        574,
        573,
        572,
        571,
        569,
        566,
        565,
        563,
        560,
        559,
        558,
        557,
        556,
        555,
        552,
        550,
        549,
        547,
        546,
        544,
        543,
        541,
        539,
        538,
        537,
        534,
        530,
        528,
        523,
        521,
        520,
        517,
        516,
        514,
        513,
        511,
        510,
        507,
        506,
        503,
        501,
        500,
        496,
        491,
        490,
        482,
        481,
        480,
        478,
        477,
        476,
        475,
        474,
        473,
        470,
        468,
        467,
        463,
        462,
        459,
        458,
        456,
        455,
        453,
        451,
        449,
        448,
        446,
        445,
        441,
        439,
        438,
        437,
        436,
        432,
        430,
        429,
        426,
        425,
        420,
        419,
        418,
        417,
        416,
        415,
        414,
        413,
        408,
        407,
        406,
        404,
        402,
        399,
        396,
        395,
        394,
        393,
        392,
        391,
        390,
        388,
        387,
        386,
        385,
        384,
        382,
        381,
        380,
        379,
        378,
        374,
        367,
        364,
        363,
        361,
        357,
        356,
        354,
        353,
        351,
        349,
        347,
        345,
        343,
        338,
        337,
        336,
        335,
        334,
        333,
        332,
        331,
        330,
        327,
        326,
        325,
        324,
        323,
        320,
        319,
        318,
        317,
        316,
        315,
        314,
        313,
        311,
        310,
        308,
        307,
        306,
        305,
        304,
        303,
        302,
        301,
        300,
        297,
        296,
        293,
        292,
        290,
        289,
        288,
        287,
        286,
        285,
        284,
        283,
        282,
        281,
        280,
        279,
        278,
        277,
        276,
        275,
        273,
        272,
        270,
        269,
        266,
        265,
        264,
        261,
        260,
        258,
        257,
        256,
        254,
        253,
        251,
        250,
        249,
        246,
        245,
        242,
        239,
        238,
        237,
        236,
        235,
        234,
        232,
        231,
        230,
        229,
        228,
        227,
        226,
        225,
        224,
        222,
        220,
        218,
        217,
        216,
        215,
        211,
        210,
        209,
        208,
        207,
        206,
        205,
        204,
        201,
        197,
        196,
        194,
        192,
        190,
        187,
        186,
        184,
        183,
        182,
        178,
        177,
        176,
        175,
        172,
        170,
        169,
        168,
        166,
        165,
        164,
        162,
        161,
        159,
        156,
        155,
        154,
        153,
        151,
        149,
        148,
        147,
        146,
        145,
        144,
        143,
        142,
        141,
        140,
        139,
        138,
        136,
        134,
        133,
        132,
        131,
        129,
        128,
        124,
        121,
        120,
        119,
        118,
        117,
        116,
        115,
        114,
        113,
        112,
        110,
        109,
        107,
        105,
        102,
        101,
        99,
        98,
        97,
        96,
        95,
        94,
        92,
        91,
        89,
        88,
        86,
        85,
        84,
        83,
        81,
        80,
        79,
        77,
        76,
        75,
        74,
        73,
        72,
        71,
        70,
        69,
        68,
        67,
        66,
        65,
        61,
        59,
        58,
        57,
        56,
        55,
        54,
        52,
        50,
        48,
        47,
        46,
        45,
        43,
        42,
        39,
        38,
        37,
        36,
        35,
        34,
        33,
        32,
        31,
        29,
        27,
        26,
        25,
        22,
        21,
        20,
        19,
        18,
        17,
        16,
        15,
        14,
        12,
        11,
        10,
        9,
        8,
        7,
        6,
        3,
        1
    ],
    "finished": true
}