{
    "covered_issues": [
        283,
        282,
        270,
        269,
        258,
        252,
        251,
        249,
        248,
        245,
        244,
        243,
        239,
        237,
        236,
        225,
        222,
        220,
        217,
        208,
        204,
        202,
        201,
        198,
        187,
        176,
        170,
        169,
        167,
        166,
        165,
        153,
        150,
        143,
        138,
        137,
        134,
        123,
        121,
        119,
        109,
        108,
        98,
        97,
        81,
        78,
        70,
        64,
        63,
        61,
        57,
        56,
        53,
        51,
        50,
        49,
        48,
        47,
        46,
        45,
        41,
        39,
        38,
        34,
        29,
        28,
        26,
        25,
        23,
        21,
        20,
        19,
        17,
        16,
        13,
        5,
        2
    ],
    "finished": true
}