{
    "commits": [
        {
            "associated_pull_request": [],
            "date": "2019-06-06 16:22:27+00:00",
            "diff": "zyantific_zydis/issue_118/commit_b3d69c30335dc1fe83c487302ed47dc03cc9655f.diff",
            "diff_additions": 12,
            "diff_deletions": 0,
            "diff_file_size": 2841,
            "diff_url": "https://github.com/zyantific/zydis/commit/b3d69c30335dc1fe83c487302ed47dc03cc9655f.diff",
            "exists": true,
            "files": [
                {
                    "file_additions": 12,
                    "file_deletions": 0,
                    "file_exists": true,
                    "file_name": "src/Zydis.c",
                    "file_size": 2841
                }
            ],
            "interesting": {
                "reopen": false,
                "status": false
            },
            "is_parent": true,
            "sha": "b3d69c30335dc1fe83c487302ed47dc03cc9655f"
        },
        {
            "associated_pull_request": [],
            "date": "2019-06-06 16:58:07+00:00",
            "diff": "zyantific_zydis/issue_118/commit_ea6f40349bc99331b74f0ebe989a61d2b9813790.diff",
            "diff_additions": 15,
            "diff_deletions": 7,
            "diff_file_size": 191354,
            "diff_url": "https://github.com/zyantific/zydis/commit/ea6f40349bc99331b74f0ebe989a61d2b9813790.diff",
            "exists": true,
            "files": [
                {
                    "file_additions": 6,
                    "file_deletions": 6,
                    "file_exists": true,
                    "file_name": "src/Decoder.c",
                    "file_size": 184435
                },
                {
                    "file_additions": 9,
                    "file_deletions": 1,
                    "file_exists": true,
                    "file_name": "src/Utils.c",
                    "file_size": 6919
                }
            ],
            "interesting": {
                "reopen": false,
                "status": false
            },
            "is_parent": false,
            "sha": "ea6f40349bc99331b74f0ebe989a61d2b9813790"
        },
        {
            "associated_pull_request": [],
            "date": "2019-06-07 15:40:08+00:00",
            "diff": "zyantific_zydis/issue_118/commit_d1f2107efe2667905819d69b0a6378580238fc76.diff",
            "diff_additions": 16,
            "diff_deletions": 3,
            "diff_file_size": 191354,
            "diff_url": "https://github.com/zyantific/zydis/commit/d1f2107efe2667905819d69b0a6378580238fc76.diff",
            "exists": true,
            "files": [
                {
                    "file_additions": 15,
                    "file_deletions": 2,
                    "file_exists": true,
                    "file_name": "src/Decoder.c",
                    "file_size": 184435
                },
                {
                    "file_additions": 1,
                    "file_deletions": 1,
                    "file_exists": true,
                    "file_name": "src/Utils.c",
                    "file_size": 6919
                }
            ],
            "interesting": {
                "reopen": true,
                "status": false
            },
            "is_parent": false,
            "sha": "d1f2107efe2667905819d69b0a6378580238fc76"
        },
        {
            "associated_pull_request": [],
            "date": "2019-07-02 11:40:52+00:00",
            "diff": "zyantific_zydis/issue_118/commit_2052dcbe2c679944571b5bb2b9d6c27642340d76.diff",
            "diff_additions": 6,
            "diff_deletions": 0,
            "diff_file_size": 184435,
            "diff_url": "https://github.com/zyantific/zydis/commit/2052dcbe2c679944571b5bb2b9d6c27642340d76.diff",
            "exists": true,
            "files": [
                {
                    "file_additions": 6,
                    "file_deletions": 0,
                    "file_exists": true,
                    "file_name": "src/Decoder.c",
                    "file_size": 184435
                }
            ],
            "interesting": {
                "reopen": false,
                "status": false
            },
            "is_parent": false,
            "sha": "2052dcbe2c679944571b5bb2b9d6c27642340d76"
        }
    ],
    "first_commit": "2019-06-06 16:22:27+00:00",
    "last_commit": "2019-07-02 11:40:52+00:00",
    "number": 118,
    "pull_request": "None",
    "score": {
        "accidental_reopen_likely": false,
        "all_labels": [
            "C-bug",
            "A-decoder",
            "P-medium"
        ],
        "contains_keywords": [
            "confirm",
            "work",
            "chang",
            "fix",
            "issu",
            "perform",
            "test",
            "bug",
            "error",
            "problem",
            "report"
        ],
        "fix_size": 42,
        "has_labels": [],
        "intersecting": {
            "computed_score": 0.14285714285714285,
            "final_commit_size": 7,
            "intersection_size": 1,
            "previous_commits_size": 36
        },
        "is_makefile_based": true,
        "no_new_files": [],
        "no_other_files": false,
        "num_prohibited_files": 139115,
        "prohibited_files": [
            "server/src/main/java/com/genymobile/scrcpy/Device.java",
            "server/src/main/java/com/genymobile/scrcpy/wrappers/SurfaceControl.java",
            "server/src/main/java/com/genymobile/scrcpy/Device.java",
            "server/src/main/java/com/genymobile/scrcpy/wrappers/SurfaceControl.java",
            "app/meson.build",
            "app/scrcpy.1",
            "app/src/common.h",
            "app/src/scrcpy.h",
            "app/src/server.h",
            "server/src/main/java/com/genymobile/scrcpy/Workarounds.java"
        ],
        "reopen": true,
        "reopen_events": [
            [
                "2019-06-06 16:58:25+00:00",
                "commit"
            ],
            [
                "2019-06-07 15:40:18+00:00",
                "commit"
            ],
            [
                "2019-06-07 21:55:38+00:00",
                "closed"
            ],
            [
                "2019-07-01 10:55:50+00:00",
                "reopened"
            ],
            [
                "2019-07-02 11:41:09+00:00",
                "commit"
            ],
            [
                "2019-07-02 13:12:10+00:00",
                "closed"
            ]
        ],
        "status": false,
        "strategy": true,
        "total_changes": 59
    }
}