{
    "covered_issues": [
        607,
        606,
        593,
        591,
        590,
        589,
        587,
        585,
        584,
        583,
        582,
        581,
        578,
        574,
        568,
        565,
        563,
        546,
        544,
        540,
        538,
        537,
        536,
        535,
        534,
        533,
        532,
        531,
        528,
        526,
        525,
        524,
        523,
        521,
        520,
        517,
        515,
        514,
        513,
        512,
        508,
        507,
        504,
        503,
        500,
        499,
        497,
        490,
        485,
        480,
        479,
        478,
        473,
        469,
        467,
        464,
        463,
        461,
        460,
        458,
        454,
        453,
        451,
        450,
        449,
        448,
        442,
        431,
        427,
        424,
        423,
        422,
        420,
        415,
        414,
        398,
        393,
        388,
        387,
        378,
        375,
        373,
        371,
        368,
        365,
        364,
        363,
        362,
        360,
        353,
        350,
        348,
        346,
        343,
        339,
        337,
        336,
        330,
        329,
        328,
        326,
        324,
        319,
        317,
        315,
        314,
        311,
        309,
        308,
        307,
        306,
        304,
        301,
        299,
        297,
        291,
        289,
        282,
        279,
        276,
        274,
        270,
        259,
        257,
        254,
        252,
        249,
        241,
        225,
        216,
        204,
        201,
        200,
        197,
        193,
        191,
        186,
        185,
        184,
        174,
        164,
        155,
        148,
        147,
        142,
        141,
        140,
        138,
        136,
        131,
        130,
        126,
        125,
        112,
        107,
        106,
        102,
        100,
        93,
        91,
        82,
        74,
        69,
        64,
        39,
        36,
        14,
        13,
        11,
        9,
        8,
        5,
        4
    ],
    "finished": true
}