{
    "category": [
        "hardware/OS",
        "multithreading"
    ],
    "commits": [
        {
            "associated_pull_request": [
                "https://github.com/pgbouncer/pgbouncer/pull/356"
            ],
            "date": "2018-12-30 18:35:18",
            "diff": "pgbouncer_pgbouncer/issue_285/commit_dc226613ca023246684efc24b755e00b61ca6d84.diff",
            "diff_additions": 2,
            "diff_deletions": 0,
            "diff_file_size": 28734,
            "diff_url": "https://github.com/pgbouncer/pgbouncer/commit/dc226613ca023246684efc24b755e00b61ca6d84.diff",
            "exists": true,
            "files": [
                {
                    "file_additions": 2,
                    "file_deletions": 0,
                    "file_exists": true,
                    "file_name": "src/client.c",
                    "file_size": 28734
                }
            ],
            "interesting": {
                "reopen": false,
                "status": false
            },
            "is_parent": true,
            "sha": "dc226613ca023246684efc24b755e00b61ca6d84"
        },
        {
            "associated_pull_request": [],
            "date": "2019-01-23 03:45:36",
            "diff": "pgbouncer_pgbouncer/issue_285/commit_5063370c048c341299dbcba30d85f37b63fc941a.diff",
            "diff_additions": 5,
            "diff_deletions": 1,
            "diff_file_size": 45405,
            "diff_url": "https://github.com/pgbouncer/pgbouncer/commit/5063370c048c341299dbcba30d85f37b63fc941a.diff",
            "exists": true,
            "files": [
                {
                    "file_additions": 5,
                    "file_deletions": 1,
                    "file_exists": true,
                    "file_name": "src/objects.c",
                    "file_size": 45405
                }
            ],
            "interesting": {
                "reopen": false,
                "status": true
            },
            "is_parent": false,
            "sha": "5063370c048c341299dbcba30d85f37b63fc941a"
        },
        {
            "associated_pull_request": [],
            "date": "2019-09-10 19:26:41",
            "diff": "pgbouncer_pgbouncer/issue_285/commit_b30b49f16d718339f0f7ffee408c48b376c0eb81.diff",
            "diff_additions": 6,
            "diff_deletions": 3,
            "diff_file_size": 74139,
            "diff_url": "https://github.com/pgbouncer/pgbouncer/commit/b30b49f16d718339f0f7ffee408c48b376c0eb81.diff",
            "exists": true,
            "files": [
                {
                    "file_additions": 4,
                    "file_deletions": 2,
                    "file_exists": true,
                    "file_name": "src/client.c",
                    "file_size": 28734
                },
                {
                    "file_additions": 2,
                    "file_deletions": 1,
                    "file_exists": true,
                    "file_name": "src/objects.c",
                    "file_size": 45405
                }
            ],
            "interesting": {
                "reopen": false,
                "status": false
            },
            "is_parent": false,
            "sha": "b30b49f16d718339f0f7ffee408c48b376c0eb81"
        },
        {
            "associated_pull_request": [],
            "date": "2019-09-10 19:26:41",
            "diff": "pgbouncer_pgbouncer/issue_285/commit_b30b49f16d718339f0f7ffee408c48b376c0eb81.diff",
            "diff_additions": 6,
            "diff_deletions": 3,
            "diff_file_size": 74139,
            "diff_url": "https://github.com/pgbouncer/pgbouncer/commit/b30b49f16d718339f0f7ffee408c48b376c0eb81.diff",
            "exists": true,
            "files": [
                {
                    "file_additions": 4,
                    "file_deletions": 2,
                    "file_exists": true,
                    "file_name": "src/client.c",
                    "file_size": 28734
                },
                {
                    "file_additions": 2,
                    "file_deletions": 1,
                    "file_exists": true,
                    "file_name": "src/objects.c",
                    "file_size": 45405
                }
            ],
            "interesting": {
                "reopen": false,
                "status": false
            },
            "is_parent": false,
            "sha": "b30b49f16d718339f0f7ffee408c48b376c0eb81"
        }
    ],
    "first_commit": "2018-12-30 18:35:18",
    "last_commit": "2019-09-10 19:26:41",
    "number": 285,
    "pull_request": "None",
    "score": {
        "accidental_reopen_likely": false,
        "all_labels": [],
        "contains_keywords": [
            "work",
            "attempt",
            "report",
            "fix",
            "CI",
            "reason",
            "patch",
            "fault",
            "bug",
            "test",
            "issu",
            "perform",
            "error",
            "workaround",
            "debug",
            "chang",
            "fail",
            "problem"
        ],
        "fix_size": 13,
        "has_labels": [],
        "intersecting": {
            "computed_score": 1.0,
            "final_commit_size": 10,
            "intersection_size": 10,
            "previous_commits_size": 13
        },
        "is_makefile_based": true,
        "no_new_files": [],
        "no_other_files": true,
        "num_prohibited_files": 70064,
        "prohibited_files": [
            "kill.h",
            "meminfo.h",
            "kill.h",
            "meminfo.h",
            "kill.h",
            "meminfo.h",
            "testsuite_cli_test.go",
            "testsuite_cli_test.go",
            "common.mk",
            "i3bar/include/draw_util.h"
        ],
        "reopen": false,
        "reopen_events": [
            [
                "2019-01-23 03:46:42",
                "commit"
            ],
            [
                "2019-09-10 19:37:09",
                "commit"
            ],
            [
                "2019-09-10 20:46:04",
                "closed"
            ],
            [
                "2019-09-10 20:46:04",
                "commit"
            ]
        ],
        "status": true,
        "strategy": true,
        "total_changes": 26
    }
}