{
    "commits": [
        {
            "diff": "spring-projects_spring-boot/issue_18301/commit_18396a3dc3329ab883438ab9843085f7567b20fa.diff",
            "diff_additions": 467,
            "diff_deletions": 85,
            "diff_file_size": 54044,
            "files": [
                {
                    "file_additions": 12,
                    "file_deletions": 4,
                    "file_exists": true,
                    "file_name": "spring-boot-project/spring-boot/src/main/java/org/springframework/boot/ImageBanner.java",
                    "file_size": 10019
                },
                {
                    "file_additions": 1,
                    "file_deletions": 0,
                    "file_exists": true,
                    "file_name": "spring-boot-project/spring-boot/src/main/java/org/springframework/boot/ResourceBanner.java",
                    "file_size": 5241
                },
                {
                    "file_additions": 88,
                    "file_deletions": 0,
                    "file_exists": true,
                    "file_name": "spring-boot-project/spring-boot/src/main/java/org/springframework/boot/ansi/Ansi8BitColor.java",
                    "file_size": 2382
                },
                {
                    "file_additions": 110,
                    "file_deletions": 14,
                    "file_exists": true,
                    "file_name": "spring-boot-project/spring-boot/src/main/java/org/springframework/boot/ansi/AnsiColors.java",
                    "file_size": 8516
                },
                {
                    "file_additions": 90,
                    "file_deletions": 31,
                    "file_exists": true,
                    "file_name": "spring-boot-project/spring-boot/src/main/java/org/springframework/boot/ansi/AnsiPropertySource.java",
                    "file_size": 4863
                },
                {
                    "file_additions": 11,
                    "file_deletions": 0,
                    "file_exists": true,
                    "file_name": "spring-boot-project/spring-boot/src/test/java/org/springframework/boot/ImageBannerTests.java",
                    "file_size": 7548
                },
                {
                    "file_additions": 17,
                    "file_deletions": 0,
                    "file_exists": true,
                    "file_name": "spring-boot-project/spring-boot/src/test/java/org/springframework/boot/ResourceBannerTests.java",
                    "file_size": 5780
                },
                {
                    "file_additions": 67,
                    "file_deletions": 0,
                    "file_exists": true,
                    "file_name": "spring-boot-project/spring-boot/src/test/java/org/springframework/boot/ansi/Ansi8BitColorTests.java",
                    "file_size": 2290
                },
                {
                    "file_additions": 64,
                    "file_deletions": 36,
                    "file_exists": true,
                    "file_name": "spring-boot-project/spring-boot/src/test/java/org/springframework/boot/ansi/AnsiColorsTests.java",
                    "file_size": 4619
                },
                {
                    "file_additions": 7,
                    "file_deletions": 0,
                    "file_exists": true,
                    "file_name": "spring-boot-project/spring-boot/src/test/java/org/springframework/boot/ansi/AnsiPropertySourceTests.java",
                    "file_size": 2786
                }
            ],
            "interesting": {
                "reopened": false,
                "status": true
            },
            "sha": "18396a3dc3329ab883438ab9843085f7567b20fa"
        },
        {
            "diff": "spring-projects_spring-boot/issue_18301/commit_303974fde976f833e73b3fd1b552d51a09a4f085.diff",
            "diff_additions": 53,
            "diff_deletions": 14,
            "diff_file_size": 17567,
            "files": [
                {
                    "file_additions": 45,
                    "file_deletions": 14,
                    "file_exists": true,
                    "file_name": "spring-boot-project/spring-boot/src/main/java/org/springframework/boot/ImageBanner.java",
                    "file_size": 10019
                },
                {
                    "file_additions": 8,
                    "file_deletions": 0,
                    "file_exists": true,
                    "file_name": "spring-boot-project/spring-boot/src/test/java/org/springframework/boot/ImageBannerTests.java",
                    "file_size": 7548
                }
            ],
            "interesting": {
                "reopened": true,
                "status": true
            },
            "sha": "303974fde976f833e73b3fd1b552d51a09a4f085"
        },
        {
            "diff": "spring-projects_spring-boot/issue_18301/commit_b3141d8887638dce063e2b8d0b68b2f58f9639a9.diff",
            "diff_additions": 1,
            "diff_deletions": 1,
            "diff_file_size": 7548,
            "files": [
                {
                    "file_additions": 1,
                    "file_deletions": 1,
                    "file_exists": true,
                    "file_name": "spring-boot-project/spring-boot/src/test/java/org/springframework/boot/ImageBannerTests.java",
                    "file_size": 7548
                }
            ],
            "interesting": {
                "reopened": false,
                "status": true
            },
            "sha": "b3141d8887638dce063e2b8d0b68b2f58f9639a9"
        },
        {
            "diff": "spring-projects_spring-boot/issue_18301/commit_e6d60d937e0b94fe630c9e3610a9316bd88ab344.diff",
            "diff_additions": 8,
            "diff_deletions": 2,
            "diff_file_size": 7548,
            "files": [
                {
                    "file_additions": 8,
                    "file_deletions": 2,
                    "file_exists": true,
                    "file_name": "spring-boot-project/spring-boot/src/test/java/org/springframework/boot/ImageBannerTests.java",
                    "file_size": 7548
                }
            ],
            "interesting": {
                "reopened": false,
                "status": false
            },
            "sha": "e6d60d937e0b94fe630c9e3610a9316bd88ab344"
        }
    ],
    "first_commit": "2019-09-22 06:30:59",
    "last_commit": "2019-09-22 19:31:51",
    "number": 18301,
    "score": 400.00633914421553
}