{
    "all_issues": 662,
    "interesting_issues": 1,
    "last_update": "2023-11-05 21:07:58.301713",
    "license": {
        "download": "https://raw.githubusercontent.com/oracle/python-cx_Oracle/main/LICENSE.txt",
        "name": "Other"
    },
    "ratio": 0.0015105740181268882,
    "size": 7469,
    "stars": 863,
    "url": "https://github.com/oracle/python-cx_Oracle"
}