{
    "covered_issues": [
        145,
        136,
        133,
        132,
        124,
        123,
        122,
        118,
        117,
        113,
        111,
        108,
        106,
        105,
        104,
        102,
        101,
        100,
        97,
        96,
        95,
        94,
        92,
        90,
        88,
        87,
        86,
        85,
        84,
        83,
        82,
        81,
        79,
        78,
        76,
        75,
        73,
        71,
        70,
        69,
        68,
        67,
        65,
        64,
        63,
        61,
        59,
        58,
        57,
        53,
        52,
        51,
        50,
        45,
        43,
        42,
        41,
        40,
        39,
        38,
        36,
        35,
        34,
        33,
        31,
        30,
        29,
        28,
        27,
        26,
        22,
        21,
        20,
        18,
        17,
        16,
        14,
        13,
        10,
        8,
        7,
        6,
        5,
        4,
        3,
        2,
        1
    ],
    "finished": true
}