{
    "covered_issues": [
        82,
        80,
        79,
        77,
        76,
        72,
        71,
        69,
        68,
        67,
        66,
        65,
        63,
        62,
        61,
        60,
        58,
        57,
        56,
        55,
        54,
        52,
        51,
        50,
        49,
        48,
        46,
        45,
        44,
        43,
        42,
        41,
        39,
        35,
        23,
        22,
        15,
        13,
        12,
        11,
        10,
        9,
        8,
        7,
        6,
        5,
        3,
        1
    ],
    "finished": true
}