{
    "covered_issues": [
        33,
        30,
        25,
        21,
        20,
        19,
        17,
        15,
        13,
        11,
        8,
        7,
        6,
        5,
        2,
        1
    ],
    "finished": true
}