{
    "commits": [
        {
            "diff": "spring-projects_spring-boot/issue_21291/commit_7afd25fc9a30e4e439791504eb8105acfde1d0cc.diff",
            "diff_additions": 1115,
            "diff_deletions": 519,
            "diff_file_size": 103407,
            "files": [
                {
                    "file_additions": 46,
                    "file_deletions": 0,
                    "file_exists": true,
                    "file_name": "spring-boot-project/spring-boot/src/main/java/org/springframework/boot/context/properties/source/CachingConfigurationPropertySource.java",
                    "file_size": 1524
                },
                {
                    "file_additions": 110,
                    "file_deletions": 0,
                    "file_exists": true,
                    "file_name": "spring-boot-project/spring-boot/src/main/java/org/springframework/boot/context/properties/source/ConfigurationPropertyCaching.java",
                    "file_size": 3580
                },
                {
                    "file_additions": 67,
                    "file_deletions": 0,
                    "file_exists": true,
                    "file_name": "spring-boot-project/spring-boot/src/main/java/org/springframework/boot/context/properties/source/ConfigurationPropertySourcesCaching.java",
                    "file_size": 1896
                },
                {
                    "file_additions": 18,
                    "file_deletions": 15,
                    "file_exists": true,
                    "file_name": "spring-boot-project/spring-boot/src/main/java/org/springframework/boot/context/properties/source/DefaultPropertyMapper.java",
                    "file_size": 3225
                },
                {
                    "file_additions": 5,
                    "file_deletions": 3,
                    "file_exists": true,
                    "file_name": "spring-boot-project/spring-boot/src/main/java/org/springframework/boot/context/properties/source/MapConfigurationPropertySource.java",
                    "file_size": 3149
                },
                {
                    "file_additions": 8,
                    "file_deletions": 8,
                    "file_exists": true,
                    "file_name": "spring-boot-project/spring-boot/src/main/java/org/springframework/boot/context/properties/source/PropertyMapper.java",
                    "file_size": 2815
                },
                {
                    "file_additions": 0,
                    "file_deletions": 73,
                    "file_exists": false,
                    "file_name": "spring-boot-project/spring-boot/src/main/java/org/springframework/boot/context/properties/source/PropertyMapping.java",
                    "file_size": 0
                },
                {
                    "file_additions": 114,
                    "file_deletions": 0,
                    "file_exists": true,
                    "file_name": "spring-boot-project/spring-boot/src/main/java/org/springframework/boot/context/properties/source/SoftReferenceConfigurationPropertyCache.java",
                    "file_size": 2957
                },
                {
                    "file_additions": 45,
                    "file_deletions": 142,
                    "file_exists": true,
                    "file_name": "spring-boot-project/spring-boot/src/main/java/org/springframework/boot/context/properties/source/SpringConfigurationPropertySource.java",
                    "file_size": 6831
                },
                {
                    "file_additions": 1,
                    "file_deletions": 1,
                    "file_exists": true,
                    "file_name": "spring-boot-project/spring-boot/src/main/java/org/springframework/boot/context/properties/source/SpringConfigurationPropertySources.java",
                    "file_size": 4578
                },
                {
                    "file_additions": 139,
                    "file_deletions": 128,
                    "file_exists": true,
                    "file_name": "spring-boot-project/spring-boot/src/main/java/org/springframework/boot/context/properties/source/SpringIterableConfigurationPropertySource.java",
                    "file_size": 12139
                },
                {
                    "file_additions": 47,
                    "file_deletions": 49,
                    "file_exists": true,
                    "file_name": "spring-boot-project/spring-boot/src/main/java/org/springframework/boot/context/properties/source/SystemEnvironmentPropertyMapper.java",
                    "file_size": 4856
                },
                {
                    "file_additions": 6,
                    "file_deletions": 9,
                    "file_exists": true,
                    "file_name": "spring-boot-project/spring-boot/src/test/java/org/springframework/boot/context/properties/source/AbstractPropertyMapperTests.java",
                    "file_size": 1274
                },
                {
                    "file_additions": 54,
                    "file_deletions": 0,
                    "file_exists": true,
                    "file_name": "spring-boot-project/spring-boot/src/test/java/org/springframework/boot/context/properties/source/CachingConfigurationPropertySourceTests.java",
                    "file_size": 1942
                },
                {
                    "file_additions": 96,
                    "file_deletions": 0,
                    "file_exists": true,
                    "file_name": "spring-boot-project/spring-boot/src/test/java/org/springframework/boot/context/properties/source/ConfigurationPropertyCachingTests.java",
                    "file_size": 3681
                },
                {
                    "file_additions": 115,
                    "file_deletions": 0,
                    "file_exists": true,
                    "file_name": "spring-boot-project/spring-boot/src/test/java/org/springframework/boot/context/properties/source/ConfigurationPropertySourcesCachingTests.java",
                    "file_size": 3368
                },
                {
                    "file_additions": 7,
                    "file_deletions": 0,
                    "file_exists": true,
                    "file_name": "spring-boot-project/spring-boot/src/test/java/org/springframework/boot/context/properties/source/ConfigurationPropertySourcesTests.java",
                    "file_size": 8938
                },
                {
                    "file_additions": 20,
                    "file_deletions": 20,
                    "file_exists": true,
                    "file_name": "spring-boot-project/spring-boot/src/test/java/org/springframework/boot/context/properties/source/DefaultPropertyMapperTests.java",
                    "file_size": 2749
                },
                {
                    "file_additions": 169,
                    "file_deletions": 0,
                    "file_exists": true,
                    "file_name": "spring-boot-project/spring-boot/src/test/java/org/springframework/boot/context/properties/source/SoftReferenceConfigurationPropertyCacheTests.java",
                    "file_size": 4473
                },
                {
                    "file_additions": 6,
                    "file_deletions": 13,
                    "file_exists": true,
                    "file_name": "spring-boot-project/spring-boot/src/test/java/org/springframework/boot/context/properties/source/SpringConfigurationPropertySourceTests.java",
                    "file_size": 11120
                },
                {
                    "file_additions": 8,
                    "file_deletions": 14,
                    "file_exists": true,
                    "file_name": "spring-boot-project/spring-boot/src/test/java/org/springframework/boot/context/properties/source/SpringIterableConfigurationPropertySourceTests.java",
                    "file_size": 12067
                },
                {
                    "file_additions": 21,
                    "file_deletions": 29,
                    "file_exists": true,
                    "file_name": "spring-boot-project/spring-boot/src/test/java/org/springframework/boot/context/properties/source/SystemEnvironmentPropertyMapperTests.java",
                    "file_size": 4392
                },
                {
                    "file_additions": 13,
                    "file_deletions": 15,
                    "file_exists": true,
                    "file_name": "spring-boot-project/spring-boot/src/test/java/org/springframework/boot/context/properties/source/TestPropertyMapper.java",
                    "file_size": 1853
                }
            ],
            "interesting": {
                "reopened": false,
                "status": false
            },
            "sha": "7afd25fc9a30e4e439791504eb8105acfde1d0cc"
        },
        {
            "diff": "spring-projects_spring-boot/issue_21291/commit_b04d7b3642f256c96ba21864534c809362b2a9cf.diff",
            "diff_additions": 29,
            "diff_deletions": 3,
            "diff_file_size": 7223,
            "files": [
                {
                    "file_additions": 29,
                    "file_deletions": 3,
                    "file_exists": true,
                    "file_name": "spring-boot-project/spring-boot-autoconfigure/src/main/java/org/springframework/boot/autoconfigure/elasticsearch/ElasticsearchRestClientConfigurations.java",
                    "file_size": 7223
                }
            ],
            "interesting": {
                "reopened": false,
                "status": true
            },
            "sha": "b04d7b3642f256c96ba21864534c809362b2a9cf"
        },
        {
            "diff": "spring-projects_spring-boot/issue_21291/commit_f399b127db4bc0b9130ece6a75c0357a88ea40bf.diff",
            "diff_additions": 28,
            "diff_deletions": 3,
            "diff_file_size": 7223,
            "files": [
                {
                    "file_additions": 28,
                    "file_deletions": 3,
                    "file_exists": true,
                    "file_name": "spring-boot-project/spring-boot-autoconfigure/src/main/java/org/springframework/boot/autoconfigure/elasticsearch/ElasticsearchRestClientConfigurations.java",
                    "file_size": 7223
                }
            ],
            "interesting": {
                "reopened": false,
                "status": false
            },
            "sha": "f399b127db4bc0b9130ece6a75c0357a88ea40bf"
        },
        {
            "diff": "spring-projects_spring-boot/issue_21291/commit_45c6a167aa8f423439a6fcd09207a559d896c347.diff",
            "diff_additions": 77,
            "diff_deletions": 4,
            "diff_file_size": 19971,
            "files": [
                {
                    "file_additions": 36,
                    "file_deletions": 4,
                    "file_exists": true,
                    "file_name": "spring-boot-project/spring-boot-autoconfigure/src/main/java/org/springframework/boot/autoconfigure/elasticsearch/ElasticsearchRestClientConfigurations.java",
                    "file_size": 7223
                },
                {
                    "file_additions": 41,
                    "file_deletions": 0,
                    "file_exists": true,
                    "file_name": "spring-boot-project/spring-boot-autoconfigure/src/test/java/org/springframework/boot/autoconfigure/elasticsearch/ElasticsearchRestClientAutoConfigurationTests.java",
                    "file_size": 12748
                }
            ],
            "interesting": {
                "reopened": false,
                "status": true
            },
            "sha": "45c6a167aa8f423439a6fcd09207a559d896c347"
        },
        {
            "diff": "spring-projects_spring-boot/issue_21291/commit_6da09b1665b4944761acee02cf2957b314a5b232.diff",
            "diff_additions": 113,
            "diff_deletions": 4,
            "diff_file_size": 19971,
            "files": [
                {
                    "file_additions": 36,
                    "file_deletions": 4,
                    "file_exists": true,
                    "file_name": "spring-boot-project/spring-boot-autoconfigure/src/main/java/org/springframework/boot/autoconfigure/elasticsearch/ElasticsearchRestClientConfigurations.java",
                    "file_size": 7223
                },
                {
                    "file_additions": 77,
                    "file_deletions": 0,
                    "file_exists": true,
                    "file_name": "spring-boot-project/spring-boot-autoconfigure/src/test/java/org/springframework/boot/autoconfigure/elasticsearch/ElasticsearchRestClientAutoConfigurationTests.java",
                    "file_size": 12748
                }
            ],
            "interesting": {
                "reopened": false,
                "status": true
            },
            "sha": "6da09b1665b4944761acee02cf2957b314a5b232"
        },
        {
            "diff": "spring-projects_spring-boot/issue_21291/commit_03c7ca3a8fe2d0987a460404b1fa1614fc960ef7.diff",
            "diff_additions": 106,
            "diff_deletions": 4,
            "diff_file_size": 19971,
            "files": [
                {
                    "file_additions": 36,
                    "file_deletions": 4,
                    "file_exists": true,
                    "file_name": "spring-boot-project/spring-boot-autoconfigure/src/main/java/org/springframework/boot/autoconfigure/elasticsearch/ElasticsearchRestClientConfigurations.java",
                    "file_size": 7223
                },
                {
                    "file_additions": 70,
                    "file_deletions": 0,
                    "file_exists": true,
                    "file_name": "spring-boot-project/spring-boot-autoconfigure/src/test/java/org/springframework/boot/autoconfigure/elasticsearch/ElasticsearchRestClientAutoConfigurationTests.java",
                    "file_size": 12748
                }
            ],
            "interesting": {
                "reopened": false,
                "status": false
            },
            "sha": "03c7ca3a8fe2d0987a460404b1fa1614fc960ef7"
        },
        {
            "diff": "spring-projects_spring-boot/issue_21291/commit_964e7125a9cb251d9094b3cd5c6c5e7c09499f51.diff",
            "diff_additions": 99,
            "diff_deletions": 3,
            "diff_file_size": 19971,
            "files": [
                {
                    "file_additions": 28,
                    "file_deletions": 3,
                    "file_exists": true,
                    "file_name": "spring-boot-project/spring-boot-autoconfigure/src/main/java/org/springframework/boot/autoconfigure/elasticsearch/ElasticsearchRestClientConfigurations.java",
                    "file_size": 7223
                },
                {
                    "file_additions": 71,
                    "file_deletions": 0,
                    "file_exists": true,
                    "file_name": "spring-boot-project/spring-boot-autoconfigure/src/test/java/org/springframework/boot/autoconfigure/elasticsearch/ElasticsearchRestClientAutoConfigurationTests.java",
                    "file_size": 12748
                }
            ],
            "interesting": {
                "reopened": false,
                "status": false
            },
            "sha": "964e7125a9cb251d9094b3cd5c6c5e7c09499f51"
        }
    ],
    "first_commit": "2020-05-07 22:22:24",
    "last_commit": "2020-05-13 15:34:26",
    "number": 21291,
    "score": 352.0018984337921
}