{
    "covered_issues": [
        103,
        99,
        98,
        96,
        95,
        92,
        91,
        90,
        89,
        87,
        86,
        84,
        82,
        80,
        78,
        77,
        76,
        75,
        74,
        73,
        69,
        67,
        66,
        65,
        64,
        63,
        62,
        60,
        59,
        58,
        56,
        52,
        51,
        50,
        49,
        46,
        45,
        44,
        43,
        42,
        41,
        39,
        35,
        34,
        33,
        32,
        31,
        30,
        29,
        28,
        27,
        26,
        25,
        24,
        23,
        22,
        21,
        20,
        19,
        18,
        15,
        14,
        12,
        11,
        10,
        9,
        6,
        5
    ],
    "finished": true
}