{
    "category": [
        "network/protocol",
        "feature request"
    ],
    "commits": [
        {
            "associated_pull_request": [
                "https://github.com/jerryscript-project/jerryscript/pull/1721"
            ],
            "date": "2017-04-11 11:28:05",
            "diff": "",
            "diff_additions": 0,
            "diff_deletions": 0,
            "diff_file_size": 0,
            "diff_url": "https://github.com/jerryscript-project/jerryscript/commit/5481fca0608951acc30100dfecd81c1aae3d589e.diff",
            "exists": true,
            "files": [],
            "interesting": {
                "reopen": false,
                "status": false
            },
            "is_parent": true,
            "sha": "5481fca0608951acc30100dfecd81c1aae3d589e"
        },
        {
            "associated_pull_request": [],
            "date": "2017-04-17 06:48:13",
            "diff": "jerryscript-project_jerryscript/issue_1716/commit_0c3e5477a07b7bdee2956fdd125f5cb367472c4f.diff",
            "diff_additions": 746,
            "diff_deletions": 0,
            "diff_file_size": 0,
            "diff_url": "https://github.com/jerryscript-project/jerryscript/commit/0c3e5477a07b7bdee2956fdd125f5cb367472c4f.diff",
            "exists": true,
            "files": [
                {
                    "file_additions": 48,
                    "file_deletions": 0,
                    "file_exists": false,
                    "file_name": "jerry-util/arg-validator/arg-iterator-helper.c",
                    "file_size": 0
                },
                {
                    "file_additions": 444,
                    "file_deletions": 0,
                    "file_exists": false,
                    "file_name": "jerry-util/arg-validator/arg-validator-functions.c",
                    "file_size": 0
                },
                {
                    "file_additions": 98,
                    "file_deletions": 0,
                    "file_exists": false,
                    "file_name": "jerry-util/arg-validator/arg-validator.c",
                    "file_size": 0
                },
                {
                    "file_additions": 156,
                    "file_deletions": 0,
                    "file_exists": false,
                    "file_name": "tests/unit/test-util-arg-validation.c",
                    "file_size": 0
                }
            ],
            "interesting": {
                "reopen": false,
                "status": false
            },
            "is_parent": false,
            "sha": "0c3e5477a07b7bdee2956fdd125f5cb367472c4f"
        },
        {
            "associated_pull_request": [],
            "date": "2017-04-17 06:48:13",
            "diff": "jerryscript-project_jerryscript/issue_1716/commit_d1f6ec6d7ace67c10679097c0455135d83a73c34.diff",
            "diff_additions": 764,
            "diff_deletions": 2,
            "diff_file_size": 74549,
            "diff_url": "https://github.com/jerryscript-project/jerryscript/commit/d1f6ec6d7ace67c10679097c0455135d83a73c34.diff",
            "exists": true,
            "files": [
                {
                    "file_additions": 9,
                    "file_deletions": 2,
                    "file_exists": true,
                    "file_name": "jerry-core/ecma/base/ecma-gc.c",
                    "file_size": 74549
                },
                {
                    "file_additions": 66,
                    "file_deletions": 0,
                    "file_exists": false,
                    "file_name": "jerry-ext/args/arg-iterator-helper.c",
                    "file_size": 0
                },
                {
                    "file_additions": 294,
                    "file_deletions": 0,
                    "file_exists": false,
                    "file_name": "jerry-ext/args/arg-transform-functions.c",
                    "file_size": 0
                },
                {
                    "file_additions": 97,
                    "file_deletions": 0,
                    "file_exists": false,
                    "file_name": "jerry-ext/args/args.c",
                    "file_size": 0
                },
                {
                    "file_additions": 298,
                    "file_deletions": 0,
                    "file_exists": false,
                    "file_name": "tests/unit-ext/test-ext-args.c",
                    "file_size": 0
                }
            ],
            "interesting": {
                "reopen": false,
                "status": false
            },
            "is_parent": false,
            "sha": "d1f6ec6d7ace67c10679097c0455135d83a73c34"
        }
    ],
    "first_commit": "2017-04-11 11:28:05",
    "last_commit": "2017-05-04 10:00:35",
    "number": 1716,
    "pull_request": "None",
    "score": {
        "accidental_reopen_likely": false,
        "all_labels": [],
        "contains_keywords": [
            "work",
            "patch",
            "fault",
            "test",
            "perform",
            "warn",
            "error",
            "problem"
        ],
        "fix_size": 11,
        "has_labels": [],
        "intersecting": {
            "computed_score": 0.0,
            "final_commit_size": 11,
            "intersection_size": 0,
            "previous_commits_size": 0
        },
        "is_makefile_based": true,
        "no_new_files": [
            "jerry-core/ecma/base/ecma-gc.c"
        ],
        "no_other_files": false,
        "num_prohibited_files": 393679,
        "prohibited_files": [
            "kill.h",
            "meminfo.h",
            "kill.h",
            "meminfo.h",
            "kill.h",
            "meminfo.h",
            "testsuite_cli_test.go",
            "testsuite_cli_test.go",
            "common.mk",
            "i3bar/include/draw_util.h"
        ],
        "reopen": false,
        "reopen_events": [
            [
                "2017-04-17 06:40:45",
                "commit"
            ],
            [
                "2017-04-17 06:56:51",
                "commit"
            ],
            [
                "2017-04-18 01:57:35",
                "commit"
            ],
            [
                "2017-04-23 05:57:31",
                "commit"
            ],
            [
                "2017-04-23 06:08:26",
                "commit"
            ],
            [
                "2017-04-24 01:48:29",
                "commit"
            ],
            [
                "2017-04-24 02:58:16",
                "commit"
            ],
            [
                "2017-04-25 10:59:05",
                "commit"
            ],
            [
                "2017-04-26 02:19:49",
                "commit"
            ],
            [
                "2017-04-26 03:35:38",
                "commit"
            ],
            [
                "2017-04-27 04:55:07",
                "commit"
            ],
            [
                "2017-04-28 01:05:14",
                "commit"
            ],
            [
                "2017-04-28 01:06:48",
                "commit"
            ],
            [
                "2017-05-03 08:26:23",
                "commit"
            ],
            [
                "2017-05-03 12:39:01",
                "commit"
            ],
            [
                "2017-05-03 16:02:41",
                "commit"
            ],
            [
                "2017-05-04 00:58:50",
                "commit"
            ],
            [
                "2017-05-04 08:01:53",
                "commit"
            ],
            [
                "2017-05-04 10:00:37",
                "commit"
            ],
            [
                "2017-05-05 05:53:42",
                "closed"
            ]
        ],
        "status": true,
        "strategy": true,
        "total_changes": 1512
    }
}