{
    "all_issues": 679,
    "interesting_issues": 3,
    "last_update": "2021-05-17 01:44:27.765973",
    "license": {
        "download": "undefined",
        "name": "unknown"
    },
    "ratio": 0.004418262150220913,
    "size": 25337,
    "stars": 3342,
    "url": "https://github.com/tmk/tmk_keyboard"
}