{
    "commits": [
        {
            "associated_pull_request": [],
            "date": "2015-06-09 12:27:12+00:00",
            "diff": "radareorg_radare2/issue_1298/commit_e46f183b7c1be5fafad34cbf5830bb4e8fe1d3f2.diff",
            "diff_additions": 9,
            "diff_deletions": 3,
            "diff_file_size": 129484,
            "diff_url": "https://github.com/radareorg/radare2/commit/e46f183b7c1be5fafad34cbf5830bb4e8fe1d3f2.diff",
            "exists": true,
            "files": [
                {
                    "file_additions": 9,
                    "file_deletions": 3,
                    "file_exists": true,
                    "file_name": "libr/core/visual.c",
                    "file_size": 129484
                }
            ],
            "interesting": {
                "reopen": true,
                "status": false
            },
            "is_parent": false,
            "sha": "e46f183b7c1be5fafad34cbf5830bb4e8fe1d3f2"
        },
        {
            "associated_pull_request": [
                "https://github.com/radareorg/radare2/pull/12655"
            ],
            "date": "2019-01-05 05:04:10+00:00",
            "diff": "radareorg_radare2/issue_1298/commit_a09deee73d6c378a218644318d698b64437f43a6.diff",
            "diff_additions": 7,
            "diff_deletions": 1,
            "diff_file_size": 129484,
            "diff_url": "https://github.com/radareorg/radare2/commit/a09deee73d6c378a218644318d698b64437f43a6.diff",
            "exists": true,
            "files": [
                {
                    "file_additions": 7,
                    "file_deletions": 1,
                    "file_exists": true,
                    "file_name": "libr/core/visual.c",
                    "file_size": 129484
                }
            ],
            "interesting": {
                "reopen": false,
                "status": false
            },
            "is_parent": false,
            "sha": "a09deee73d6c378a218644318d698b64437f43a6"
        },
        {
            "associated_pull_request": [
                "https://github.com/radareorg/radare2/pull/12655"
            ],
            "date": "2019-01-05 09:13:59+00:00",
            "diff": "radareorg_radare2/issue_1298/commit_9201685d2521f7d2e4f5bf4a64bc195552f2c68f.diff",
            "diff_additions": 7,
            "diff_deletions": 1,
            "diff_file_size": 129484,
            "diff_url": "https://github.com/radareorg/radare2/commit/9201685d2521f7d2e4f5bf4a64bc195552f2c68f.diff",
            "exists": true,
            "files": [
                {
                    "file_additions": 7,
                    "file_deletions": 1,
                    "file_exists": true,
                    "file_name": "libr/core/visual.c",
                    "file_size": 129484
                }
            ],
            "interesting": {
                "reopen": false,
                "status": false
            },
            "is_parent": false,
            "sha": "9201685d2521f7d2e4f5bf4a64bc195552f2c68f"
        }
    ],
    "first_commit": "2015-06-09 12:27:12+00:00",
    "last_commit": "2019-01-05 09:13:59+00:00",
    "number": 1298,
    "pull_request": "None",
    "score": {
        "accidental_reopen_likely": false,
        "all_labels": [
            "consoleui",
            "good first issue",
            "visual"
        ],
        "contains_keywords": [
            "work",
            "fix",
            "issu"
        ],
        "fix_size": 18,
        "has_labels": [],
        "intersecting": {
            "computed_score": 1.0,
            "final_commit_size": 8,
            "intersection_size": 8,
            "previous_commits_size": 18
        },
        "is_makefile_based": true,
        "no_new_files": [],
        "no_other_files": true,
        "num_prohibited_files": 20296,
        "prohibited_files": [
            "server/src/main/java/com/genymobile/scrcpy/Device.java",
            "server/src/main/java/com/genymobile/scrcpy/wrappers/SurfaceControl.java",
            "server/src/main/java/com/genymobile/scrcpy/Device.java",
            "server/src/main/java/com/genymobile/scrcpy/wrappers/SurfaceControl.java",
            "app/meson.build",
            "app/scrcpy.1",
            "app/src/common.h",
            "app/src/scrcpy.h",
            "app/src/server.h",
            "server/src/main/java/com/genymobile/scrcpy/Workarounds.java"
        ],
        "reopen": true,
        "reopen_events": [
            [
                "2015-06-09 12:18:11+00:00",
                "commit"
            ],
            [
                "2015-06-09 12:26:40+00:00",
                "commit"
            ],
            [
                "2015-06-09 14:03:49+00:00",
                "closed"
            ],
            [
                "2015-06-09 14:03:49+00:00",
                "commit"
            ],
            [
                "2018-12-19 05:19:53+00:00",
                "reopened"
            ],
            [
                "2019-01-05 05:05:36+00:00",
                "commit"
            ],
            [
                "2019-01-05 09:14:04+00:00",
                "closed"
            ],
            [
                "2019-01-05 09:14:04+00:00",
                "commit"
            ]
        ],
        "status": false,
        "strategy": true,
        "total_changes": 28
    }
}