{
    "category": [
        "memory",
        "control flow"
    ],
    "commits": [
        {
            "associated_pull_request": [],
            "date": "2019-12-22 20:57:35",
            "diff": "",
            "diff_additions": 0,
            "diff_deletions": 0,
            "diff_file_size": 0,
            "diff_url": "https://github.com/OpenSIPS/opensips/commit/9a8de335f46d8a8d15ba3f98b851ad3227cfc170.diff",
            "exists": true,
            "files": [],
            "interesting": {
                "reopen": false,
                "status": false
            },
            "is_parent": true,
            "sha": "9a8de335f46d8a8d15ba3f98b851ad3227cfc170"
        },
        {
            "associated_pull_request": [],
            "date": "2019-12-23 09:24:44",
            "diff": "opensips_opensips/issue_1910/commit_e5991e1af5ca6eeb92940334da0a1cc31993ea7d.diff",
            "diff_additions": 37,
            "diff_deletions": 6,
            "diff_file_size": 140410,
            "diff_url": "https://github.com/OpenSIPS/opensips/commit/e5991e1af5ca6eeb92940334da0a1cc31993ea7d.diff",
            "exists": true,
            "files": [
                {
                    "file_additions": 37,
                    "file_deletions": 6,
                    "file_exists": true,
                    "file_name": "modules/drouting/drouting.c",
                    "file_size": 140410
                }
            ],
            "interesting": {
                "reopen": true,
                "status": false
            },
            "is_parent": false,
            "sha": "e5991e1af5ca6eeb92940334da0a1cc31993ea7d"
        },
        {
            "associated_pull_request": [],
            "date": "2020-01-08 17:11:14",
            "diff": "opensips_opensips/issue_1910/commit_dd2071032fc9659bfdde11a14e5533aca4ec06c5.diff",
            "diff_additions": 34,
            "diff_deletions": 6,
            "diff_file_size": 140410,
            "diff_url": "https://github.com/OpenSIPS/opensips/commit/dd2071032fc9659bfdde11a14e5533aca4ec06c5.diff",
            "exists": true,
            "files": [
                {
                    "file_additions": 34,
                    "file_deletions": 6,
                    "file_exists": true,
                    "file_name": "modules/drouting/drouting.c",
                    "file_size": 140410
                }
            ],
            "interesting": {
                "reopen": false,
                "status": false
            },
            "is_parent": false,
            "sha": "dd2071032fc9659bfdde11a14e5533aca4ec06c5"
        },
        {
            "associated_pull_request": [],
            "date": "2019-12-23 09:24:44",
            "diff": "opensips_opensips/issue_1910/commit_a9d07b55fd048a48ac13e283c2fa9d6f3ceb7809.diff",
            "diff_additions": 37,
            "diff_deletions": 6,
            "diff_file_size": 140410,
            "diff_url": "https://github.com/OpenSIPS/opensips/commit/a9d07b55fd048a48ac13e283c2fa9d6f3ceb7809.diff",
            "exists": true,
            "files": [
                {
                    "file_additions": 37,
                    "file_deletions": 6,
                    "file_exists": true,
                    "file_name": "modules/drouting/drouting.c",
                    "file_size": 140410
                }
            ],
            "interesting": {
                "reopen": false,
                "status": false
            },
            "is_parent": false,
            "sha": "a9d07b55fd048a48ac13e283c2fa9d6f3ceb7809"
        }
    ],
    "first_commit": "2019-12-22 20:57:35",
    "last_commit": "2020-01-08 17:13:23",
    "number": 1910,
    "pull_request": "None",
    "score": {
        "accidental_reopen_likely": false,
        "all_labels": [
            "bug",
            "fixed"
        ],
        "contains_keywords": [
            "confirm",
            "crash",
            "test",
            "fix",
            "patch",
            "issu"
        ],
        "fix_size": 108,
        "has_labels": [
            "bug"
        ],
        "intersecting": {
            "computed_score": 0.2857142857142857,
            "final_commit_size": 42,
            "intersection_size": 12,
            "previous_commits_size": 78
        },
        "is_makefile_based": true,
        "no_new_files": [],
        "no_other_files": true,
        "num_prohibited_files": 33672,
        "prohibited_files": [
            "hal/inc/pinmap_hal.h",
            "Debug/marvin.bin",
            "Debug/marvin.elf",
            "Debug/marvin.hex",
            "Debug/marvin.bin",
            "Debug/marvin.elf",
            "Debug/marvin.hex",
            "inc/spark_utilities.h",
            "Debug/marvin.bin",
            "Debug/marvin.elf"
        ],
        "reopen": true,
        "reopen_events": [
            [
                "2019-12-23 09:26:26",
                "closed"
            ],
            [
                "2019-12-23 09:26:26",
                "commit"
            ],
            [
                "2019-12-23 09:27:23",
                "reopened"
            ],
            [
                "2020-01-08 17:12:29",
                "commit"
            ],
            [
                "2020-01-08 17:14:14",
                "commit"
            ],
            [
                "2020-01-08 17:14:24",
                "closed"
            ]
        ],
        "status": false,
        "strategy": true,
        "total_changes": 126
    }
}