{
    "commits": [
        {
            "diff": "spring-projects_spring-boot/issue_12420/commit_252ef3fc5640bd2f3260733f249a4f6ba64bbf0c.diff",
            "diff_additions": 2,
            "diff_deletions": 1,
            "diff_file_size": 1767,
            "files": [
                {
                    "file_additions": 2,
                    "file_deletions": 1,
                    "file_exists": true,
                    "file_name": "spring-boot-project/spring-boot-tools/spring-boot-maven-plugin/src/main/java/org/springframework/boot/maven/RunArguments.java",
                    "file_size": 1767
                }
            ],
            "interesting": {
                "reopened": false,
                "status": false
            },
            "sha": "252ef3fc5640bd2f3260733f249a4f6ba64bbf0c"
        },
        {
            "diff": "spring-projects_spring-boot/issue_12420/commit_87239ba6c9df9b9b5fb802e2f173f2bfbd062f1f.diff",
            "diff_additions": 12,
            "diff_deletions": 9,
            "diff_file_size": 4764,
            "files": [
                {
                    "file_additions": 5,
                    "file_deletions": 5,
                    "file_exists": true,
                    "file_name": "spring-boot-project/spring-boot/src/main/java/org/springframework/boot/info/BuildProperties.java",
                    "file_size": 2574
                },
                {
                    "file_additions": 7,
                    "file_deletions": 4,
                    "file_exists": true,
                    "file_name": "spring-boot-project/spring-boot/src/test/java/org/springframework/boot/info/BuildPropertiesTests.java",
                    "file_size": 2190
                }
            ],
            "interesting": {
                "reopened": true,
                "status": false
            },
            "sha": "87239ba6c9df9b9b5fb802e2f173f2bfbd062f1f"
        },
        {
            "diff": "spring-projects_spring-boot/issue_12420/commit_9b637d4f0df1ca12762e45a38c5909b5b30e596d.diff",
            "diff_additions": 3,
            "diff_deletions": 1,
            "diff_file_size": 2190,
            "files": [
                {
                    "file_additions": 3,
                    "file_deletions": 1,
                    "file_exists": true,
                    "file_name": "spring-boot-project/spring-boot/src/test/java/org/springframework/boot/info/BuildPropertiesTests.java",
                    "file_size": 2190
                }
            ],
            "interesting": {
                "reopened": false,
                "status": false
            },
            "sha": "9b637d4f0df1ca12762e45a38c5909b5b30e596d"
        }
    ],
    "first_commit": "2018-03-09 08:33:17",
    "last_commit": "2018-03-09 13:24:34",
    "number": 12420,
    "score": 176.14285714285714
}