{
    "covered_issues": [
        142,
        138,
        136,
        130,
        129,
        127,
        126,
        42,
        39,
        32,
        26,
        21,
        6,
        3,
        2,
        1
    ],
    "finished": true
}