{
    "all_issues": 4562,
    "interesting_issues": 106,
    "last_update": "2021-05-18 04:58:56.529033",
    "license": {
        "download": "https://raw.githubusercontent.com/surge-synthesizer/surge/main/LICENSE",
        "name": "GNU General Public License v3.0"
    },
    "ratio": 0.023235423060061378,
    "size": 257713,
    "stars": 1484,
    "url": "https://github.com/surge-synthesizer/surge"
}