{
    "covered_issues": [
        84,
        82,
        80,
        77,
        73,
        67,
        64,
        62,
        57,
        52,
        48,
        46,
        43,
        41,
        38,
        37,
        35,
        32,
        30,
        27,
        26,
        22,
        13,
        12,
        9,
        8,
        1
    ],
    "finished": true
}