{
    "category": [
        "network/protocols",
        "control flow"
    ],
    "commits": [
        {
            "associated_pull_request": [],
            "date": "2015-01-04 04:14:38",
            "diff": "tuanpmt_esp_mqtt/issue_12/commit_f837152bde56ca243c9d45e3aa4218b025f4e1ed.diff",
            "diff_additions": 1,
            "diff_deletions": 1,
            "diff_file_size": 4552,
            "diff_url": "https://github.com/tuanpmt/esp_mqtt/commit/f837152bde56ca243c9d45e3aa4218b025f4e1ed.diff",
            "exists": true,
            "files": [
                {
                    "file_additions": 1,
                    "file_deletions": 1,
                    "file_exists": true,
                    "file_name": "user/user_main.c",
                    "file_size": 4552
                }
            ],
            "interesting": {
                "reopen": false,
                "status": false
            },
            "is_parent": true,
            "sha": "f837152bde56ca243c9d45e3aa4218b025f4e1ed"
        },
        {
            "associated_pull_request": [],
            "date": "2015-01-04 09:47:38",
            "diff": "tuanpmt_esp_mqtt/issue_12/commit_34a3ea49b56dfeea728b7f2ba318c7c3be41e9d9.diff",
            "diff_additions": 3,
            "diff_deletions": 2,
            "diff_file_size": 0,
            "diff_url": "https://github.com/tuanpmt/esp_mqtt/commit/34a3ea49b56dfeea728b7f2ba318c7c3be41e9d9.diff",
            "exists": true,
            "files": [
                {
                    "file_additions": 3,
                    "file_deletions": 2,
                    "file_exists": false,
                    "file_name": "user/mqtt.c",
                    "file_size": 0
                }
            ],
            "interesting": {
                "reopen": true,
                "status": false
            },
            "is_parent": false,
            "sha": "34a3ea49b56dfeea728b7f2ba318c7c3be41e9d9"
        },
        {
            "associated_pull_request": [],
            "date": "2015-01-13 11:56:03",
            "diff": "tuanpmt_esp_mqtt/issue_12/commit_1995cb812a54f001362661f30281e31e3e6c9708.diff",
            "diff_additions": 294,
            "diff_deletions": 84,
            "diff_file_size": 4552,
            "diff_url": "https://github.com/tuanpmt/esp_mqtt/commit/1995cb812a54f001362661f30281e31e3e6c9708.diff",
            "exists": true,
            "files": [
                {
                    "file_additions": 1,
                    "file_deletions": 1,
                    "file_exists": false,
                    "file_name": "user/config.c",
                    "file_size": 0
                },
                {
                    "file_additions": 42,
                    "file_deletions": 79,
                    "file_exists": false,
                    "file_name": "user/mqtt.c",
                    "file_size": 0
                },
                {
                    "file_additions": 129,
                    "file_deletions": 0,
                    "file_exists": false,
                    "file_name": "user/proto.c",
                    "file_size": 0
                },
                {
                    "file_additions": 51,
                    "file_deletions": 0,
                    "file_exists": false,
                    "file_name": "user/queue.c",
                    "file_size": 0
                },
                {
                    "file_additions": 67,
                    "file_deletions": 0,
                    "file_exists": false,
                    "file_name": "user/ringbuf.c",
                    "file_size": 0
                },
                {
                    "file_additions": 4,
                    "file_deletions": 4,
                    "file_exists": true,
                    "file_name": "user/user_main.c",
                    "file_size": 4552
                }
            ],
            "interesting": {
                "reopen": false,
                "status": false
            },
            "is_parent": false,
            "sha": "1995cb812a54f001362661f30281e31e3e6c9708"
        }
    ],
    "first_commit": "2015-01-04 04:14:38",
    "last_commit": "2015-01-13 11:56:03",
    "number": 12,
    "pull_request": "None",
    "score": {
        "accidental_reopen_likely": false,
        "all_labels": [],
        "contains_keywords": [
            "test",
            "fix"
        ],
        "fix_size": 124,
        "has_labels": [],
        "intersecting": {
            "computed_score": 0.01652892561983471,
            "final_commit_size": 121,
            "intersection_size": 2,
            "previous_commits_size": 5
        },
        "is_makefile_based": true,
        "no_new_files": [
            "user/config.c",
            "user/user_main.c"
        ],
        "no_other_files": false,
        "num_prohibited_files": 65784,
        "prohibited_files": [
            "hal/inc/pinmap_hal.h",
            "Debug/marvin.bin",
            "Debug/marvin.elf",
            "Debug/marvin.hex",
            "Debug/marvin.bin",
            "Debug/marvin.elf",
            "Debug/marvin.hex",
            "inc/spark_utilities.h",
            "Debug/marvin.bin",
            "Debug/marvin.elf"
        ],
        "reopen": true,
        "reopen_events": [
            [
                "2015-01-04 09:47:50",
                "closed"
            ],
            [
                "2015-01-04 09:47:50",
                "commit"
            ],
            [
                "2015-01-04 17:06:08",
                "reopened"
            ],
            [
                "2015-01-13 11:57:49",
                "closed"
            ],
            [
                "2015-01-13 11:57:49",
                "commit"
            ]
        ],
        "status": false,
        "strategy": true,
        "total_changes": 385
    }
}