{
    "commits": [
        {
            "associated_pull_request": [],
            "date": "2019-07-19 10:59:38+00:00",
            "diff": "libvips_libvips/issue_1370/commit_64a6a2732619569f45bff373024b18c1c5405eaa.diff",
            "diff_additions": 18,
            "diff_deletions": 0,
            "diff_file_size": 25259,
            "diff_url": "https://github.com/libvips/libvips/commit/64a6a2732619569f45bff373024b18c1c5405eaa.diff",
            "exists": true,
            "files": [
                {
                    "file_additions": 18,
                    "file_deletions": 0,
                    "file_exists": true,
                    "file_name": "libvips/foreign/vips2jpeg.c",
                    "file_size": 25259
                }
            ],
            "interesting": {
                "reopen": false,
                "status": false
            },
            "is_parent": true,
            "sha": "64a6a2732619569f45bff373024b18c1c5405eaa"
        },
        {
            "associated_pull_request": [],
            "date": "2019-07-20 15:31:30+00:00",
            "diff": "libvips_libvips/issue_1370/commit_2c654060f95d95f5c5eeb493701ec5aafe539ee3.diff",
            "diff_additions": 48,
            "diff_deletions": 74,
            "diff_file_size": 150874,
            "diff_url": "https://github.com/libvips/libvips/commit/2c654060f95d95f5c5eeb493701ec5aafe539ee3.diff",
            "exists": true,
            "files": [
                {
                    "file_additions": 11,
                    "file_deletions": 6,
                    "file_exists": true,
                    "file_name": "libvips/foreign/jpeg2vips.c",
                    "file_size": 25908
                },
                {
                    "file_additions": 19,
                    "file_deletions": 14,
                    "file_exists": true,
                    "file_name": "libvips/foreign/tiff2vips.c",
                    "file_size": 80007
                },
                {
                    "file_additions": 18,
                    "file_deletions": 20,
                    "file_exists": true,
                    "file_name": "libvips/foreign/vipspng.c",
                    "file_size": 31413
                },
                {
                    "file_additions": 0,
                    "file_deletions": 34,
                    "file_exists": true,
                    "file_name": "libvips/resample/shrinkv.c",
                    "file_size": 13546
                }
            ],
            "interesting": {
                "reopen": false,
                "status": false
            },
            "is_parent": false,
            "sha": "2c654060f95d95f5c5eeb493701ec5aafe539ee3"
        },
        {
            "associated_pull_request": [],
            "date": "2019-07-23 11:06:35+00:00",
            "diff": "libvips_libvips/issue_1370/commit_28090d614ff202f7bc229dd1384e99c00b69c5ad.diff",
            "diff_additions": 4,
            "diff_deletions": 4,
            "diff_file_size": 31413,
            "diff_url": "https://github.com/libvips/libvips/commit/28090d614ff202f7bc229dd1384e99c00b69c5ad.diff",
            "exists": true,
            "files": [
                {
                    "file_additions": 4,
                    "file_deletions": 4,
                    "file_exists": true,
                    "file_name": "libvips/foreign/vipspng.c",
                    "file_size": 31413
                }
            ],
            "interesting": {
                "reopen": false,
                "status": false
            },
            "is_parent": false,
            "sha": "28090d614ff202f7bc229dd1384e99c00b69c5ad"
        },
        {
            "associated_pull_request": [],
            "date": "2019-07-24 16:43:14+00:00",
            "diff": "libvips_libvips/issue_1370/commit_e11811a316baff56b2ed2091aafe686f70709a0c.diff",
            "diff_additions": 30,
            "diff_deletions": 16,
            "diff_file_size": 0,
            "diff_url": "https://github.com/libvips/libvips/commit/e11811a316baff56b2ed2091aafe686f70709a0c.diff",
            "exists": true,
            "files": [
                {
                    "file_additions": 30,
                    "file_deletions": 16,
                    "file_exists": false,
                    "file_name": "libvips/foreign/gifload.c",
                    "file_size": 0
                }
            ],
            "interesting": {
                "reopen": false,
                "status": false
            },
            "is_parent": false,
            "sha": "e11811a316baff56b2ed2091aafe686f70709a0c"
        },
        {
            "associated_pull_request": [],
            "date": "2019-07-25 10:31:21+00:00",
            "diff": "libvips_libvips/issue_1370/commit_53e0bc66984576da844e4bc4586a5afa9ad92c8c.diff",
            "diff_additions": 28,
            "diff_deletions": 15,
            "diff_file_size": 24174,
            "diff_url": "https://github.com/libvips/libvips/commit/53e0bc66984576da844e4bc4586a5afa9ad92c8c.diff",
            "exists": true,
            "files": [
                {
                    "file_additions": 14,
                    "file_deletions": 7,
                    "file_exists": true,
                    "file_name": "libvips/foreign/pdfiumload.c",
                    "file_size": 24174
                },
                {
                    "file_additions": 14,
                    "file_deletions": 8,
                    "file_exists": false,
                    "file_name": "libvips/foreign/pdfload.c",
                    "file_size": 0
                }
            ],
            "interesting": {
                "reopen": false,
                "status": false
            },
            "is_parent": false,
            "sha": "53e0bc66984576da844e4bc4586a5afa9ad92c8c"
        },
        {
            "associated_pull_request": [],
            "date": "2019-09-01 11:54:47+00:00",
            "diff": "libvips_libvips/issue_1370/commit_a1ed6c7f6c53d10b6b934d6b7a25dfadcfebd66f.diff",
            "diff_additions": 91,
            "diff_deletions": 60,
            "diff_file_size": 0,
            "diff_url": "https://github.com/libvips/libvips/commit/a1ed6c7f6c53d10b6b934d6b7a25dfadcfebd66f.diff",
            "exists": true,
            "files": [
                {
                    "file_additions": 91,
                    "file_deletions": 60,
                    "file_exists": false,
                    "file_name": "libvips/foreign/gifload.c",
                    "file_size": 0
                }
            ],
            "interesting": {
                "reopen": true,
                "status": false
            },
            "is_parent": false,
            "sha": "a1ed6c7f6c53d10b6b934d6b7a25dfadcfebd66f"
        },
        {
            "associated_pull_request": [],
            "date": "2019-09-19 16:04:42+00:00",
            "diff": "libvips_libvips/issue_1370/commit_0323b77666769122e937704269dc4c49648ccab9.diff",
            "diff_additions": 107,
            "diff_deletions": 44,
            "diff_file_size": 0,
            "diff_url": "https://github.com/libvips/libvips/commit/0323b77666769122e937704269dc4c49648ccab9.diff",
            "exists": true,
            "files": [
                {
                    "file_additions": 107,
                    "file_deletions": 44,
                    "file_exists": false,
                    "file_name": "libvips/foreign/pdfload.c",
                    "file_size": 0
                }
            ],
            "interesting": {
                "reopen": false,
                "status": false
            },
            "is_parent": false,
            "sha": "0323b77666769122e937704269dc4c49648ccab9"
        },
        {
            "associated_pull_request": [],
            "date": "2019-09-26 17:07:18+00:00",
            "diff": "libvips_libvips/issue_1370/commit_4f1e57c04027a7854ab43c649bddd74b5e53031a.diff",
            "diff_additions": 205,
            "diff_deletions": 112,
            "diff_file_size": 0,
            "diff_url": "https://github.com/libvips/libvips/commit/4f1e57c04027a7854ab43c649bddd74b5e53031a.diff",
            "exists": true,
            "files": [
                {
                    "file_additions": 205,
                    "file_deletions": 112,
                    "file_exists": false,
                    "file_name": "libvips/foreign/gifload.c",
                    "file_size": 0
                }
            ],
            "interesting": {
                "reopen": false,
                "status": false
            },
            "is_parent": false,
            "sha": "4f1e57c04027a7854ab43c649bddd74b5e53031a"
        },
        {
            "associated_pull_request": [],
            "date": "2019-10-03 12:16:37+00:00",
            "diff": "libvips_libvips/issue_1370/commit_08308759170fa66196c4ca07b012bab7bd95ffe9.diff",
            "diff_additions": 92,
            "diff_deletions": 28,
            "diff_file_size": 36236,
            "diff_url": "https://github.com/libvips/libvips/commit/08308759170fa66196c4ca07b012bab7bd95ffe9.diff",
            "exists": true,
            "files": [
                {
                    "file_additions": 92,
                    "file_deletions": 28,
                    "file_exists": true,
                    "file_name": "libvips/foreign/heifload.c",
                    "file_size": 36236
                }
            ],
            "interesting": {
                "reopen": false,
                "status": false
            },
            "is_parent": false,
            "sha": "08308759170fa66196c4ca07b012bab7bd95ffe9"
        },
        {
            "associated_pull_request": [],
            "date": "2019-10-03 15:40:52+00:00",
            "diff": "libvips_libvips/issue_1370/commit_c328b089b138fc5c1954340d914195478208d510.diff",
            "diff_additions": 170,
            "diff_deletions": 155,
            "diff_file_size": 62144,
            "diff_url": "https://github.com/libvips/libvips/commit/c328b089b138fc5c1954340d914195478208d510.diff",
            "exists": true,
            "files": [
                {
                    "file_additions": 2,
                    "file_deletions": 0,
                    "file_exists": true,
                    "file_name": "libvips/foreign/heifload.c",
                    "file_size": 36236
                },
                {
                    "file_additions": 168,
                    "file_deletions": 155,
                    "file_exists": true,
                    "file_name": "libvips/foreign/jpeg2vips.c",
                    "file_size": 25908
                }
            ],
            "interesting": {
                "reopen": false,
                "status": false
            },
            "is_parent": false,
            "sha": "c328b089b138fc5c1954340d914195478208d510"
        },
        {
            "associated_pull_request": [],
            "date": "2019-10-06 06:25:09+00:00",
            "diff": "libvips_libvips/issue_1370/commit_efcd31b498db8bf4c1431de843790af173ab98fb.diff",
            "diff_additions": 10,
            "diff_deletions": 2,
            "diff_file_size": 29753,
            "diff_url": "https://github.com/libvips/libvips/commit/efcd31b498db8bf4c1431de843790af173ab98fb.diff",
            "exists": true,
            "files": [
                {
                    "file_additions": 9,
                    "file_deletions": 1,
                    "file_exists": true,
                    "file_name": "libvips/foreign/jpeg2vips.c",
                    "file_size": 25908
                },
                {
                    "file_additions": 1,
                    "file_deletions": 1,
                    "file_exists": true,
                    "file_name": "test/test_descriptors.c",
                    "file_size": 3845
                }
            ],
            "interesting": {
                "reopen": false,
                "status": false
            },
            "is_parent": false,
            "sha": "efcd31b498db8bf4c1431de843790af173ab98fb"
        }
    ],
    "first_commit": "2019-07-19 10:59:38+00:00",
    "last_commit": "2019-10-06 06:25:09+00:00",
    "number": 1370,
    "pull_request": "None",
    "score": {
        "accidental_reopen_likely": false,
        "all_labels": [
            "enhancement",
            "in development"
        ],
        "contains_keywords": [
            "confirm",
            "work",
            "fail",
            "chang",
            "fix",
            "issu",
            "patch",
            "perform",
            "test",
            "fault",
            "remov",
            "warn",
            "error",
            "problem"
        ],
        "fix_size": 1161,
        "has_labels": [],
        "intersecting": {
            "computed_score": 0.38461538461538464,
            "final_commit_size": 13,
            "intersection_size": 5,
            "previous_commits_size": 1153
        },
        "is_makefile_based": false,
        "no_new_files": [
            "test/test_descriptors.c"
        ],
        "no_other_files": false,
        "num_prohibited_files": 151275,
        "prohibited_files": [
            "server/src/main/java/com/genymobile/scrcpy/Device.java",
            "server/src/main/java/com/genymobile/scrcpy/wrappers/SurfaceControl.java",
            "server/src/main/java/com/genymobile/scrcpy/Device.java",
            "server/src/main/java/com/genymobile/scrcpy/wrappers/SurfaceControl.java",
            "app/meson.build",
            "app/scrcpy.1",
            "app/src/common.h",
            "app/src/scrcpy.h",
            "app/src/server.h",
            "server/src/main/java/com/genymobile/scrcpy/Workarounds.java"
        ],
        "reopen": true,
        "reopen_events": [
            [
                "2019-07-20 15:40:02+00:00",
                "commit"
            ],
            [
                "2019-07-23 11:07:39+00:00",
                "commit"
            ],
            [
                "2019-07-24 16:44:06+00:00",
                "commit"
            ],
            [
                "2019-07-25 10:35:20+00:00",
                "commit"
            ],
            [
                "2019-07-28 16:24:27+00:00",
                "closed"
            ],
            [
                "2019-09-01 12:13:54+00:00",
                "commit"
            ],
            [
                "2019-09-19 14:46:05+00:00",
                "reopened"
            ],
            [
                "2019-09-19 16:09:02+00:00",
                "commit"
            ],
            [
                "2019-09-26 17:08:23+00:00",
                "commit"
            ],
            [
                "2019-10-03 12:17:28+00:00",
                "commit"
            ],
            [
                "2019-10-03 15:58:20+00:00",
                "commit"
            ],
            [
                "2019-10-06 06:26:35+00:00",
                "commit"
            ],
            [
                "2019-10-07 15:51:32+00:00",
                "closed"
            ]
        ],
        "status": false,
        "strategy": true,
        "total_changes": 1313
    }
}