{
    "category": [
        "GUI",
        "feature request"
    ],
    "commits": [
        {
            "associated_pull_request": [
                "https://github.com/jerryscript-project/jerryscript/pull/2296"
            ],
            "date": "2018-04-26 11:51:27",
            "diff": "jerryscript-project_jerryscript/issue_2302/commit_d672d1e71cba94232fedffc93ca314b8ae1f130d.diff",
            "diff_additions": 38,
            "diff_deletions": 73,
            "diff_file_size": 44081,
            "diff_url": "https://github.com/jerryscript-project/jerryscript/commit/d672d1e71cba94232fedffc93ca314b8ae1f130d.diff",
            "exists": true,
            "files": [
                {
                    "file_additions": 38,
                    "file_deletions": 73,
                    "file_exists": true,
                    "file_name": "jerry-core/ecma/builtin-objects/ecma-builtin-object.c",
                    "file_size": 44081
                }
            ],
            "interesting": {
                "reopen": false,
                "status": false
            },
            "is_parent": true,
            "sha": "d672d1e71cba94232fedffc93ca314b8ae1f130d"
        },
        {
            "associated_pull_request": [],
            "date": "2018-04-30 14:31:55",
            "diff": "jerryscript-project_jerryscript/issue_2302/commit_6a8cce939596f3d98fd06e03f4f85a8b040a2996.diff",
            "diff_additions": 80,
            "diff_deletions": 0,
            "diff_file_size": 0,
            "diff_url": "https://github.com/jerryscript-project/jerryscript/commit/6a8cce939596f3d98fd06e03f4f85a8b040a2996.diff",
            "exists": true,
            "files": [
                {
                    "file_additions": 80,
                    "file_deletions": 0,
                    "file_exists": false,
                    "file_name": "tests/unit-ext/test-tmp.c",
                    "file_size": 0
                }
            ],
            "interesting": {
                "reopen": false,
                "status": false
            },
            "is_parent": false,
            "sha": "6a8cce939596f3d98fd06e03f4f85a8b040a2996"
        },
        {
            "associated_pull_request": [],
            "date": "2019-10-22 15:18:22",
            "diff": "jerryscript-project_jerryscript/issue_2302/commit_1400a2e1245a7c91ba9047788d9a476783b2a573.diff",
            "diff_additions": 127,
            "diff_deletions": 38,
            "diff_file_size": 75658,
            "diff_url": "https://github.com/jerryscript-project/jerryscript/commit/1400a2e1245a7c91ba9047788d9a476783b2a573.diff",
            "exists": true,
            "files": [
                {
                    "file_additions": 41,
                    "file_deletions": 38,
                    "file_exists": true,
                    "file_name": "jerry-core/ecma/operations/ecma-function-object.c",
                    "file_size": 73087
                },
                {
                    "file_additions": 86,
                    "file_deletions": 0,
                    "file_exists": true,
                    "file_name": "tests/unit-core/test-native-instanceof.c",
                    "file_size": 2571
                }
            ],
            "interesting": {
                "reopen": false,
                "status": true
            },
            "is_parent": false,
            "sha": "1400a2e1245a7c91ba9047788d9a476783b2a573"
        },
        {
            "associated_pull_request": [],
            "date": "2019-10-22 15:18:22",
            "diff": "jerryscript-project_jerryscript/issue_2302/commit_b70c4a63a36260827afe911c354439f8394b06c2.diff",
            "diff_additions": 125,
            "diff_deletions": 38,
            "diff_file_size": 75658,
            "diff_url": "https://github.com/jerryscript-project/jerryscript/commit/b70c4a63a36260827afe911c354439f8394b06c2.diff",
            "exists": true,
            "files": [
                {
                    "file_additions": 41,
                    "file_deletions": 38,
                    "file_exists": true,
                    "file_name": "jerry-core/ecma/operations/ecma-function-object.c",
                    "file_size": 73087
                },
                {
                    "file_additions": 84,
                    "file_deletions": 0,
                    "file_exists": true,
                    "file_name": "tests/unit-core/test-native-instanceof.c",
                    "file_size": 2571
                }
            ],
            "interesting": {
                "reopen": false,
                "status": false
            },
            "is_parent": false,
            "sha": "b70c4a63a36260827afe911c354439f8394b06c2"
        },
        {
            "associated_pull_request": [
                "https://github.com/jerryscript-project/jerryscript/pull/3246"
            ],
            "date": "2019-10-22 15:18:22",
            "diff": "jerryscript-project_jerryscript/issue_2302/commit_f3d37b33bdca060d96d9508fa2371bb3a70fe230.diff",
            "diff_additions": 127,
            "diff_deletions": 38,
            "diff_file_size": 75658,
            "diff_url": "https://github.com/jerryscript-project/jerryscript/commit/f3d37b33bdca060d96d9508fa2371bb3a70fe230.diff",
            "exists": true,
            "files": [
                {
                    "file_additions": 41,
                    "file_deletions": 38,
                    "file_exists": true,
                    "file_name": "jerry-core/ecma/operations/ecma-function-object.c",
                    "file_size": 73087
                },
                {
                    "file_additions": 86,
                    "file_deletions": 0,
                    "file_exists": true,
                    "file_name": "tests/unit-core/test-native-instanceof.c",
                    "file_size": 2571
                }
            ],
            "interesting": {
                "reopen": false,
                "status": false
            },
            "is_parent": false,
            "sha": "f3d37b33bdca060d96d9508fa2371bb3a70fe230"
        },
        {
            "associated_pull_request": [
                "https://github.com/jerryscript-project/jerryscript/pull/3246"
            ],
            "date": "2019-10-25 13:56:37",
            "diff": "jerryscript-project_jerryscript/issue_2302/commit_b7aa21ebc7b8345a7168834e15b1906c84bede32.diff",
            "diff_additions": 127,
            "diff_deletions": 38,
            "diff_file_size": 75658,
            "diff_url": "https://github.com/jerryscript-project/jerryscript/commit/b7aa21ebc7b8345a7168834e15b1906c84bede32.diff",
            "exists": true,
            "files": [
                {
                    "file_additions": 41,
                    "file_deletions": 38,
                    "file_exists": true,
                    "file_name": "jerry-core/ecma/operations/ecma-function-object.c",
                    "file_size": 73087
                },
                {
                    "file_additions": 86,
                    "file_deletions": 0,
                    "file_exists": true,
                    "file_name": "tests/unit-core/test-native-instanceof.c",
                    "file_size": 2571
                }
            ],
            "interesting": {
                "reopen": false,
                "status": false
            },
            "is_parent": false,
            "sha": "b7aa21ebc7b8345a7168834e15b1906c84bede32"
        }
    ],
    "first_commit": "2018-04-26 11:51:27",
    "last_commit": "2019-10-25 13:56:37",
    "number": 2302,
    "pull_request": "None",
    "score": {
        "accidental_reopen_likely": false,
        "all_labels": [
            "bug",
            "question"
        ],
        "contains_keywords": [
            "work",
            "patch",
            "bug",
            "test",
            "issu",
            "perform",
            "problem"
        ],
        "fix_size": 60,
        "has_labels": [
            "bug"
        ],
        "intersecting": {
            "computed_score": 1.0,
            "final_commit_size": 60,
            "intersection_size": 60,
            "previous_commits_size": 60
        },
        "is_makefile_based": true,
        "no_new_files": [],
        "no_other_files": false,
        "num_prohibited_files": 107292,
        "prohibited_files": [
            "kill.h",
            "meminfo.h",
            "kill.h",
            "meminfo.h",
            "kill.h",
            "meminfo.h",
            "testsuite_cli_test.go",
            "testsuite_cli_test.go",
            "common.mk",
            "i3bar/include/draw_util.h"
        ],
        "reopen": false,
        "reopen_events": [
            [
                "2018-05-03 12:56:39",
                "commit"
            ],
            [
                "2019-10-22 15:21:57",
                "commit"
            ],
            [
                "2019-10-24 09:42:50",
                "commit"
            ],
            [
                "2019-10-25 11:14:43",
                "commit"
            ],
            [
                "2019-10-25 13:56:37",
                "closed"
            ],
            [
                "2019-10-25 13:56:38",
                "commit"
            ]
        ],
        "status": true,
        "strategy": true,
        "total_changes": 849
    }
}