{
    "category": [
        "memory",
        "feature request"
    ],
    "commits": [
        {
            "associated_pull_request": [
                "https://github.com/jerryscript-project/jerryscript/pull/2650"
            ],
            "date": "2019-01-02 09:11:02",
            "diff": "",
            "diff_additions": 0,
            "diff_deletions": 0,
            "diff_file_size": 0,
            "diff_url": "https://github.com/jerryscript-project/jerryscript/commit/aae50c9da089974b2da9bb3df71e0d0dffce467b.diff",
            "exists": true,
            "files": [],
            "interesting": {
                "reopen": false,
                "status": false
            },
            "is_parent": true,
            "sha": "aae50c9da089974b2da9bb3df71e0d0dffce467b"
        },
        {
            "associated_pull_request": [],
            "date": "2019-01-02 13:56:00",
            "diff": "jerryscript-project_jerryscript/issue_2657/commit_5884d5ea25fd22a0f20e3af9d29779bc82c493a2.diff",
            "diff_additions": 9,
            "diff_deletions": 0,
            "diff_file_size": 247678,
            "diff_url": "https://github.com/jerryscript-project/jerryscript/commit/5884d5ea25fd22a0f20e3af9d29779bc82c493a2.diff",
            "exists": true,
            "files": [
                {
                    "file_additions": 5,
                    "file_deletions": 0,
                    "file_exists": true,
                    "file_name": "jerry-core/parser/js/js-parser-expr.c",
                    "file_size": 131886
                },
                {
                    "file_additions": 4,
                    "file_deletions": 0,
                    "file_exists": true,
                    "file_name": "jerry-core/parser/js/js-parser-statm.c",
                    "file_size": 115792
                }
            ],
            "interesting": {
                "reopen": false,
                "status": false
            },
            "is_parent": false,
            "sha": "5884d5ea25fd22a0f20e3af9d29779bc82c493a2"
        },
        {
            "associated_pull_request": [],
            "date": "2019-01-08 11:03:53",
            "diff": "jerryscript-project_jerryscript/issue_2657/commit_c754d958a4c89da3cce4063e69845ec707eedcd5.diff",
            "diff_additions": 2,
            "diff_deletions": 3,
            "diff_file_size": 131886,
            "diff_url": "https://github.com/jerryscript-project/jerryscript/commit/c754d958a4c89da3cce4063e69845ec707eedcd5.diff",
            "exists": true,
            "files": [
                {
                    "file_additions": 2,
                    "file_deletions": 3,
                    "file_exists": true,
                    "file_name": "jerry-core/parser/js/js-parser-expr.c",
                    "file_size": 131886
                }
            ],
            "interesting": {
                "reopen": false,
                "status": false
            },
            "is_parent": false,
            "sha": "c754d958a4c89da3cce4063e69845ec707eedcd5"
        },
        {
            "associated_pull_request": [],
            "date": "2019-01-08 11:03:53",
            "diff": "jerryscript-project_jerryscript/issue_2657/commit_e37b414c17cf8bdff75b4e4033b592a0f62159c2.diff",
            "diff_additions": 2,
            "diff_deletions": 3,
            "diff_file_size": 131886,
            "diff_url": "https://github.com/jerryscript-project/jerryscript/commit/e37b414c17cf8bdff75b4e4033b592a0f62159c2.diff",
            "exists": true,
            "files": [
                {
                    "file_additions": 2,
                    "file_deletions": 3,
                    "file_exists": true,
                    "file_name": "jerry-core/parser/js/js-parser-expr.c",
                    "file_size": 131886
                }
            ],
            "interesting": {
                "reopen": false,
                "status": false
            },
            "is_parent": false,
            "sha": "e37b414c17cf8bdff75b4e4033b592a0f62159c2"
        },
        {
            "associated_pull_request": [],
            "date": "2019-01-08 11:03:53",
            "diff": "jerryscript-project_jerryscript/issue_2657/commit_e94fd6e95d720038fb2c6dc9a8ce4c9d70e199ff.diff",
            "diff_additions": 2,
            "diff_deletions": 5,
            "diff_file_size": 131886,
            "diff_url": "https://github.com/jerryscript-project/jerryscript/commit/e94fd6e95d720038fb2c6dc9a8ce4c9d70e199ff.diff",
            "exists": true,
            "files": [
                {
                    "file_additions": 2,
                    "file_deletions": 5,
                    "file_exists": true,
                    "file_name": "jerry-core/parser/js/js-parser-expr.c",
                    "file_size": 131886
                }
            ],
            "interesting": {
                "reopen": false,
                "status": true
            },
            "is_parent": false,
            "sha": "e94fd6e95d720038fb2c6dc9a8ce4c9d70e199ff"
        },
        {
            "associated_pull_request": [],
            "date": "2019-01-08 11:03:53",
            "diff": "jerryscript-project_jerryscript/issue_2657/commit_90e54e439e23d0b48a408f4fcf600902010e037c.diff",
            "diff_additions": 3,
            "diff_deletions": 4,
            "diff_file_size": 131886,
            "diff_url": "https://github.com/jerryscript-project/jerryscript/commit/90e54e439e23d0b48a408f4fcf600902010e037c.diff",
            "exists": true,
            "files": [
                {
                    "file_additions": 3,
                    "file_deletions": 4,
                    "file_exists": true,
                    "file_name": "jerry-core/parser/js/js-parser-expr.c",
                    "file_size": 131886
                }
            ],
            "interesting": {
                "reopen": false,
                "status": false
            },
            "is_parent": false,
            "sha": "90e54e439e23d0b48a408f4fcf600902010e037c"
        },
        {
            "associated_pull_request": [
                "https://github.com/jerryscript-project/jerryscript/pull/2664"
            ],
            "date": "2019-01-08 11:03:53",
            "diff": "jerryscript-project_jerryscript/issue_2657/commit_78c18af5a2a2b57a4bbbf7b26297cb45b296a269.diff",
            "diff_additions": 3,
            "diff_deletions": 4,
            "diff_file_size": 131886,
            "diff_url": "https://github.com/jerryscript-project/jerryscript/commit/78c18af5a2a2b57a4bbbf7b26297cb45b296a269.diff",
            "exists": true,
            "files": [
                {
                    "file_additions": 3,
                    "file_deletions": 4,
                    "file_exists": true,
                    "file_name": "jerry-core/parser/js/js-parser-expr.c",
                    "file_size": 131886
                }
            ],
            "interesting": {
                "reopen": false,
                "status": false
            },
            "is_parent": false,
            "sha": "78c18af5a2a2b57a4bbbf7b26297cb45b296a269"
        },
        {
            "associated_pull_request": [
                "https://github.com/jerryscript-project/jerryscript/pull/2664"
            ],
            "date": "2019-01-22 08:21:28",
            "diff": "jerryscript-project_jerryscript/issue_2657/commit_a42f239abb1c7a842bfd0cff5a788ec503ed948b.diff",
            "diff_additions": 3,
            "diff_deletions": 4,
            "diff_file_size": 131886,
            "diff_url": "https://github.com/jerryscript-project/jerryscript/commit/a42f239abb1c7a842bfd0cff5a788ec503ed948b.diff",
            "exists": true,
            "files": [
                {
                    "file_additions": 3,
                    "file_deletions": 4,
                    "file_exists": true,
                    "file_name": "jerry-core/parser/js/js-parser-expr.c",
                    "file_size": 131886
                }
            ],
            "interesting": {
                "reopen": false,
                "status": false
            },
            "is_parent": false,
            "sha": "a42f239abb1c7a842bfd0cff5a788ec503ed948b"
        }
    ],
    "first_commit": "2019-01-02 09:11:02",
    "last_commit": "2019-01-22 08:21:28",
    "number": 2657,
    "pull_request": "None",
    "score": {
        "accidental_reopen_likely": false,
        "all_labels": [
            "ES2015",
            "bug"
        ],
        "contains_keywords": [
            "fix",
            "patch",
            "fail"
        ],
        "fix_size": 20,
        "has_labels": [
            "bug"
        ],
        "intersecting": {
            "computed_score": 1.0,
            "final_commit_size": 5,
            "intersection_size": 5,
            "previous_commits_size": 20
        },
        "is_makefile_based": true,
        "no_new_files": [],
        "no_other_files": false,
        "num_prohibited_files": 153287,
        "prohibited_files": [
            "kill.h",
            "meminfo.h",
            "kill.h",
            "meminfo.h",
            "kill.h",
            "meminfo.h",
            "testsuite_cli_test.go",
            "testsuite_cli_test.go",
            "common.mk",
            "i3bar/include/draw_util.h"
        ],
        "reopen": false,
        "reopen_events": [
            [
                "2019-01-02 14:00:47",
                "commit"
            ],
            [
                "2019-01-02 16:19:14",
                "commit"
            ],
            [
                "2019-01-08 11:05:17",
                "commit"
            ],
            [
                "2019-01-09 09:42:00",
                "commit"
            ],
            [
                "2019-01-10 08:06:19",
                "commit"
            ],
            [
                "2019-01-16 13:45:42",
                "commit"
            ],
            [
                "2019-01-21 09:28:30",
                "commit"
            ],
            [
                "2019-01-22 08:21:28",
                "closed"
            ],
            [
                "2019-01-22 08:21:31",
                "commit"
            ]
        ],
        "status": true,
        "strategy": true,
        "total_changes": 47
    }
}