{
    "category": [
        "build/refactor/preprocessing",
        "feature request"
    ],
    "commits": [
        {
            "associated_pull_request": [],
            "date": "2020-09-13 19:57:13",
            "diff": "sandermertens_flecs/issue_244/commit_d6de6812920e66c8cdc105cbaf5b3eae0d471f65.diff",
            "diff_additions": 2,
            "diff_deletions": 2,
            "diff_file_size": 6541,
            "diff_url": "https://github.com/SanderMertens/flecs/commit/d6de6812920e66c8cdc105cbaf5b3eae0d471f65.diff",
            "exists": true,
            "files": [
                {
                    "file_additions": 1,
                    "file_deletions": 1,
                    "file_exists": true,
                    "file_name": "examples/c/10_inheritance/src/main.c",
                    "file_size": 3113
                },
                {
                    "file_additions": 1,
                    "file_deletions": 1,
                    "file_exists": true,
                    "file_name": "examples/c/11_inheritance_api/src/main.c",
                    "file_size": 3428
                }
            ],
            "interesting": {
                "reopen": false,
                "status": false
            },
            "is_parent": true,
            "sha": "d6de6812920e66c8cdc105cbaf5b3eae0d471f65"
        },
        {
            "associated_pull_request": [
                "https://github.com/SanderMertens/flecs/pull/250"
            ],
            "date": "2020-09-14 04:50:05",
            "diff": "sandermertens_flecs/issue_244/commit_46693b5171c12137f6afa62a3de3ba208d1f4784.diff",
            "diff_additions": 588,
            "diff_deletions": 163,
            "diff_file_size": 1395102,
            "diff_url": "https://github.com/SanderMertens/flecs/commit/46693b5171c12137f6afa62a3de3ba208d1f4784.diff",
            "exists": true,
            "files": [
                {
                    "file_additions": 190,
                    "file_deletions": 63,
                    "file_exists": true,
                    "file_name": "flecs.c",
                    "file_size": 773180
                },
                {
                    "file_additions": 5,
                    "file_deletions": 5,
                    "file_exists": true,
                    "file_name": "src/addons/dbg.c",
                    "file_size": 4208
                },
                {
                    "file_additions": 4,
                    "file_deletions": 2,
                    "file_exists": true,
                    "file_name": "src/addons/writer.c",
                    "file_size": 12461
                },
                {
                    "file_additions": 1,
                    "file_deletions": 1,
                    "file_exists": true,
                    "file_name": "src/api_support.c",
                    "file_size": 7058
                },
                {
                    "file_additions": 30,
                    "file_deletions": 11,
                    "file_exists": true,
                    "file_name": "src/entity.c",
                    "file_size": 107949
                },
                {
                    "file_additions": 11,
                    "file_deletions": 11,
                    "file_exists": true,
                    "file_name": "src/query.c",
                    "file_size": 92821
                },
                {
                    "file_additions": 2,
                    "file_deletions": 0,
                    "file_exists": false,
                    "file_name": "src/signature.c",
                    "file_size": 0
                },
                {
                    "file_additions": 112,
                    "file_deletions": 11,
                    "file_exists": true,
                    "file_name": "src/sparse.c",
                    "file_size": 21183
                },
                {
                    "file_additions": 2,
                    "file_deletions": 2,
                    "file_exists": true,
                    "file_name": "src/stage.c",
                    "file_size": 18813
                },
                {
                    "file_additions": 2,
                    "file_deletions": 2,
                    "file_exists": true,
                    "file_name": "src/table.c",
                    "file_size": 67506
                },
                {
                    "file_additions": 11,
                    "file_deletions": 11,
                    "file_exists": true,
                    "file_name": "src/table_graph.c",
                    "file_size": 26449
                },
                {
                    "file_additions": 7,
                    "file_deletions": 7,
                    "file_exists": true,
                    "file_name": "src/type.c",
                    "file_size": 14515
                },
                {
                    "file_additions": 134,
                    "file_deletions": 0,
                    "file_exists": true,
                    "file_name": "test/api/src/Delete.c",
                    "file_size": 12688
                },
                {
                    "file_additions": 10,
                    "file_deletions": 5,
                    "file_exists": true,
                    "file_name": "test/api/src/New.c",
                    "file_size": 8845
                },
                {
                    "file_additions": 31,
                    "file_deletions": 31,
                    "file_exists": false,
                    "file_name": "test/api/src/Traits.c",
                    "file_size": 0
                },
                {
                    "file_additions": 36,
                    "file_deletions": 1,
                    "file_exists": true,
                    "file_name": "test/api/src/main.c",
                    "file_size": 227426
                }
            ],
            "interesting": {
                "reopen": false,
                "status": true
            },
            "is_parent": false,
            "sha": "46693b5171c12137f6afa62a3de3ba208d1f4784"
        },
        {
            "associated_pull_request": [
                "https://github.com/SanderMertens/flecs/pull/250"
            ],
            "date": "2020-09-14 05:10:46",
            "diff": "sandermertens_flecs/issue_244/commit_e75ecfe4dfbfcdeac9240dfcc7d0e6f98d1e0757.diff",
            "diff_additions": 8,
            "diff_deletions": 8,
            "diff_file_size": 806824,
            "diff_url": "https://github.com/SanderMertens/flecs/commit/e75ecfe4dfbfcdeac9240dfcc7d0e6f98d1e0757.diff",
            "exists": true,
            "files": [
                {
                    "file_additions": 4,
                    "file_deletions": 4,
                    "file_exists": true,
                    "file_name": "flecs.c",
                    "file_size": 773180
                },
                {
                    "file_additions": 0,
                    "file_deletions": 2,
                    "file_exists": true,
                    "file_name": "src/addons/writer.c",
                    "file_size": 12461
                },
                {
                    "file_additions": 4,
                    "file_deletions": 2,
                    "file_exists": true,
                    "file_name": "src/sparse.c",
                    "file_size": 21183
                }
            ],
            "interesting": {
                "reopen": false,
                "status": true
            },
            "is_parent": false,
            "sha": "e75ecfe4dfbfcdeac9240dfcc7d0e6f98d1e0757"
        },
        {
            "associated_pull_request": [
                "https://github.com/SanderMertens/flecs/pull/250"
            ],
            "date": "2020-09-14 05:22:07",
            "diff": "sandermertens_flecs/issue_244/commit_de512c1533a6d2c4afffa4c8497a95114bc91b61.diff",
            "diff_additions": 2,
            "diff_deletions": 14,
            "diff_file_size": 794363,
            "diff_url": "https://github.com/SanderMertens/flecs/commit/de512c1533a6d2c4afffa4c8497a95114bc91b61.diff",
            "exists": true,
            "files": [
                {
                    "file_additions": 1,
                    "file_deletions": 7,
                    "file_exists": true,
                    "file_name": "flecs.c",
                    "file_size": 773180
                },
                {
                    "file_additions": 1,
                    "file_deletions": 7,
                    "file_exists": true,
                    "file_name": "src/sparse.c",
                    "file_size": 21183
                }
            ],
            "interesting": {
                "reopen": false,
                "status": false
            },
            "is_parent": false,
            "sha": "de512c1533a6d2c4afffa4c8497a95114bc91b61"
        },
        {
            "associated_pull_request": [
                "https://github.com/SanderMertens/flecs/pull/250"
            ],
            "date": "2020-09-14 05:23:05",
            "diff": "sandermertens_flecs/issue_244/commit_1616f32cab6458e7a5775db51c33fd06c704b599.diff",
            "diff_additions": 2,
            "diff_deletions": 2,
            "diff_file_size": 794363,
            "diff_url": "https://github.com/SanderMertens/flecs/commit/1616f32cab6458e7a5775db51c33fd06c704b599.diff",
            "exists": true,
            "files": [
                {
                    "file_additions": 1,
                    "file_deletions": 1,
                    "file_exists": true,
                    "file_name": "flecs.c",
                    "file_size": 773180
                },
                {
                    "file_additions": 1,
                    "file_deletions": 1,
                    "file_exists": true,
                    "file_name": "src/sparse.c",
                    "file_size": 21183
                }
            ],
            "interesting": {
                "reopen": false,
                "status": false
            },
            "is_parent": false,
            "sha": "1616f32cab6458e7a5775db51c33fd06c704b599"
        }
    ],
    "first_commit": "2020-09-13 19:57:13",
    "last_commit": "2020-09-14 05:23:05",
    "number": 244,
    "pull_request": "None",
    "score": {
        "accidental_reopen_likely": false,
        "all_labels": [
            "enhancement"
        ],
        "contains_keywords": [
            "fix",
            "issu",
            "warn"
        ],
        "fix_size": 700,
        "has_labels": [],
        "intersecting": {
            "computed_score": 1.0,
            "final_commit_size": 4,
            "intersection_size": 4,
            "previous_commits_size": 700
        },
        "is_makefile_based": true,
        "no_new_files": [],
        "no_other_files": false,
        "num_prohibited_files": 29449,
        "prohibited_files": [
            "kill.h",
            "meminfo.h",
            "kill.h",
            "meminfo.h",
            "kill.h",
            "meminfo.h",
            "testsuite_cli_test.go",
            "testsuite_cli_test.go",
            "common.mk",
            "i3bar/include/draw_util.h"
        ],
        "reopen": false,
        "reopen_events": [
            [
                "2020-09-14 04:50:11",
                "commit"
            ],
            [
                "2020-09-14 05:10:53",
                "commit"
            ],
            [
                "2020-09-14 05:22:13",
                "commit"
            ],
            [
                "2020-09-14 05:23:10",
                "commit"
            ],
            [
                "2020-10-17 00:52:48",
                "closed"
            ]
        ],
        "status": true,
        "strategy": true,
        "total_changes": 791
    }
}