{
    "covered_issues": [
        269,
        260,
        253,
        250,
        243,
        240,
        238,
        237,
        234,
        233,
        231,
        230,
        228,
        225,
        223,
        220,
        218,
        216,
        215,
        214,
        212,
        208,
        207,
        206,
        198,
        197,
        196,
        194,
        188,
        183,
        179,
        178,
        177,
        176,
        174,
        171,
        170,
        168,
        164,
        163,
        161,
        158,
        157,
        156,
        155,
        153,
        152,
        148,
        145,
        135,
        133,
        130,
        129,
        127,
        126,
        125,
        124,
        123,
        121,
        115,
        114,
        112,
        105,
        103,
        102,
        90,
        89,
        88,
        85,
        79,
        72,
        71,
        63,
        59,
        53,
        52,
        51,
        47,
        46,
        41,
        39,
        37,
        34,
        32,
        28,
        23,
        22,
        20,
        19,
        17,
        14,
        13,
        12,
        11,
        9,
        4,
        3,
        2,
        1
    ],
    "finished": true
}