{
    "covered_issues": [
        496,
        492,
        490,
        489,
        487,
        486,
        485,
        484,
        483,
        482,
        481,
        474,
        471,
        470,
        469,
        467,
        466,
        464,
        458,
        456,
        453,
        452,
        449,
        448,
        447,
        446,
        444,
        443,
        442,
        440,
        439,
        438,
        437,
        433,
        432,
        431,
        430,
        429,
        428,
        427,
        425,
        424,
        421,
        419,
        418,
        417,
        416,
        415,
        413,
        412,
        411,
        410,
        406,
        405,
        404,
        403,
        402,
        401,
        399,
        398,
        397,
        396,
        395,
        394,
        390,
        389,
        387,
        385,
        384,
        383,
        381,
        380,
        379,
        378,
        377,
        376,
        375,
        374,
        373,
        372,
        371,
        370,
        369,
        368,
        364,
        362,
        360,
        358,
        357,
        356,
        355,
        354,
        353,
        351,
        350,
        349,
        347,
        346,
        345,
        344,
        343,
        342,
        341,
        339,
        338,
        334,
        333,
        330,
        329,
        328,
        326,
        325,
        323,
        318,
        316,
        315,
        314,
        313,
        312,
        310,
        308,
        306,
        303,
        302,
        301,
        300,
        299,
        298,
        297,
        294,
        293,
        289,
        287,
        286,
        285,
        284,
        283,
        282,
        280,
        278,
        275,
        274,
        272,
        271,
        269,
        267,
        266,
        264,
        262,
        261,
        258,
        257,
        256,
        254,
        253,
        251,
        250,
        245,
        244,
        243,
        242,
        241,
        240,
        239,
        238,
        237,
        236,
        235,
        234,
        232,
        231,
        230,
        228,
        227,
        226,
        225,
        224,
        223,
        222,
        221,
        219,
        218,
        217,
        215,
        213,
        212,
        211,
        210,
        209,
        208,
        207,
        206,
        205,
        203,
        202,
        201,
        200,
        196,
        195,
        194,
        190,
        189,
        188,
        180,
        179,
        178,
        176,
        175,
        174,
        173,
        171,
        170,
        168,
        167,
        166,
        165,
        164,
        163,
        162,
        161,
        160,
        159,
        158,
        157,
        156,
        153,
        152,
        151,
        150,
        149,
        148,
        147,
        146,
        145,
        144,
        143,
        142,
        141,
        140,
        139,
        138,
        137,
        133,
        132,
        131,
        129,
        128,
        127,
        126,
        124,
        123,
        122,
        121,
        120,
        119,
        117,
        116,
        115,
        113,
        112,
        111,
        109,
        107,
        103,
        101,
        100,
        99,
        97,
        96,
        95,
        94,
        93,
        92,
        91,
        90,
        89,
        87,
        85,
        83,
        81,
        80,
        79,
        78,
        77,
        76,
        74,
        73,
        72,
        71,
        70,
        69,
        68,
        67,
        66,
        65,
        63,
        62,
        61,
        59,
        58,
        57,
        55,
        54,
        53,
        52,
        51,
        50,
        49,
        48,
        47,
        46,
        45,
        44,
        43,
        42,
        41,
        40,
        39,
        37,
        36,
        35,
        33,
        32,
        31,
        30,
        29,
        28,
        27,
        24,
        23,
        22,
        21,
        20,
        19,
        18,
        17,
        16,
        15,
        14,
        12,
        10,
        9,
        8,
        7,
        6,
        5,
        3,
        2,
        1
    ],
    "finished": true
}