{
    "category": [
        "hardware/OS",
        "multithreading"
    ],
    "commits": [
        {
            "associated_pull_request": [
                "https://github.com/pipelinedb/pipelinedb/pull/1234"
            ],
            "date": "2015-10-25 18:46:11",
            "diff": "",
            "diff_additions": 0,
            "diff_deletions": 0,
            "diff_file_size": 0,
            "diff_url": "https://github.com/pipelinedb/pipelinedb/commit/0eaabff26f9329d3f3f97392b2fad20964382726.diff",
            "exists": true,
            "files": [],
            "interesting": {
                "reopen": false,
                "status": true
            },
            "is_parent": true,
            "sha": "0eaabff26f9329d3f3f97392b2fad20964382726"
        },
        {
            "associated_pull_request": [],
            "date": "2015-10-27 19:44:45",
            "diff": "pipelinedb_pipelinedb/issue_1135/commit_071a746333ff22dc4de74ba1e398c5532d3ec46d.diff",
            "diff_additions": 1653,
            "diff_deletions": 1241,
            "diff_file_size": 0,
            "diff_url": "https://github.com/pipelinedb/pipelinedb/commit/071a746333ff22dc4de74ba1e398c5532d3ec46d.diff",
            "exists": true,
            "files": [
                {
                    "file_additions": 1,
                    "file_deletions": 1,
                    "file_exists": false,
                    "file_name": "contrib/pipeline_kafka/pipeline_kafka.c",
                    "file_size": 0
                },
                {
                    "file_additions": 2,
                    "file_deletions": 2,
                    "file_exists": false,
                    "file_name": "src/backend/catalog/dependency.c",
                    "file_size": 0
                },
                {
                    "file_additions": 1,
                    "file_deletions": 5,
                    "file_exists": false,
                    "file_name": "src/backend/catalog/heap.c",
                    "file_size": 0
                },
                {
                    "file_additions": 12,
                    "file_deletions": 11,
                    "file_exists": false,
                    "file_name": "src/backend/catalog/objectaddress.c",
                    "file_size": 0
                },
                {
                    "file_additions": 3,
                    "file_deletions": 2,
                    "file_exists": false,
                    "file_name": "src/backend/catalog/pg_type.c",
                    "file_size": 0
                },
                {
                    "file_additions": 167,
                    "file_deletions": 14,
                    "file_exists": false,
                    "file_name": "src/backend/catalog/pipeline_stream.c",
                    "file_size": 0
                },
                {
                    "file_additions": 2,
                    "file_deletions": 2,
                    "file_exists": false,
                    "file_name": "src/backend/commands/copy.c",
                    "file_size": 0
                },
                {
                    "file_additions": 0,
                    "file_deletions": 12,
                    "file_exists": false,
                    "file_name": "src/backend/commands/explain.c",
                    "file_size": 0
                },
                {
                    "file_additions": 3,
                    "file_deletions": 8,
                    "file_exists": false,
                    "file_name": "src/backend/commands/pipelinecmds.c",
                    "file_size": 0
                },
                {
                    "file_additions": 2,
                    "file_deletions": 22,
                    "file_exists": false,
                    "file_name": "src/backend/commands/prepare.c",
                    "file_size": 0
                },
                {
                    "file_additions": 1,
                    "file_deletions": 9,
                    "file_exists": false,
                    "file_name": "src/backend/commands/tablecmds.c",
                    "file_size": 0
                },
                {
                    "file_additions": 0,
                    "file_deletions": 5,
                    "file_exists": false,
                    "file_name": "src/backend/executor/execAmi.c",
                    "file_size": 0
                },
                {
                    "file_additions": 0,
                    "file_deletions": 15,
                    "file_exists": false,
                    "file_name": "src/backend/executor/execProcnode.c",
                    "file_size": 0
                },
                {
                    "file_additions": 1,
                    "file_deletions": 1,
                    "file_exists": false,
                    "file_name": "src/backend/executor/execScan.c",
                    "file_size": 0
                },
                {
                    "file_additions": 11,
                    "file_deletions": 1,
                    "file_exists": false,
                    "file_name": "src/backend/executor/execUtils.c",
                    "file_size": 0
                },
                {
                    "file_additions": 1,
                    "file_deletions": 1,
                    "file_exists": false,
                    "file_name": "src/backend/executor/nodeBitmapIndexscan.c",
                    "file_size": 0
                },
                {
                    "file_additions": 1,
                    "file_deletions": 1,
                    "file_exists": false,
                    "file_name": "src/backend/executor/nodeSort.c",
                    "file_size": 0
                },
                {
                    "file_additions": 0,
                    "file_deletions": 363,
                    "file_exists": false,
                    "file_name": "src/backend/executor/nodeStreamscan.c",
                    "file_size": 0
                },
                {
                    "file_additions": 14,
                    "file_deletions": 11,
                    "file_exists": false,
                    "file_name": "src/backend/nodes/copyfuncs.c",
                    "file_size": 0
                },
                {
                    "file_additions": 0,
                    "file_deletions": 2,
                    "file_exists": false,
                    "file_name": "src/backend/nodes/nodeFuncs.c",
                    "file_size": 0
                },
                {
                    "file_additions": 7,
                    "file_deletions": 18,
                    "file_exists": false,
                    "file_name": "src/backend/nodes/outfuncs.c",
                    "file_size": 0
                },
                {
                    "file_additions": 7,
                    "file_deletions": 7,
                    "file_exists": false,
                    "file_name": "src/backend/nodes/readfuncs.c",
                    "file_size": 0
                },
                {
                    "file_additions": 0,
                    "file_deletions": 9,
                    "file_exists": false,
                    "file_name": "src/backend/optimizer/path/allpaths.c",
                    "file_size": 0
                },
                {
                    "file_additions": 0,
                    "file_deletions": 3,
                    "file_exists": false,
                    "file_name": "src/backend/optimizer/path/costsize.c",
                    "file_size": 0
                },
                {
                    "file_additions": 1,
                    "file_deletions": 68,
                    "file_exists": false,
                    "file_name": "src/backend/optimizer/plan/createplan.c",
                    "file_size": 0
                },
                {
                    "file_additions": 0,
                    "file_deletions": 2,
                    "file_exists": false,
                    "file_name": "src/backend/optimizer/plan/setrefs.c",
                    "file_size": 0
                },
                {
                    "file_additions": 0,
                    "file_deletions": 1,
                    "file_exists": false,
                    "file_name": "src/backend/optimizer/plan/subselect.c",
                    "file_size": 0
                },
                {
                    "file_additions": 0,
                    "file_deletions": 2,
                    "file_exists": false,
                    "file_name": "src/backend/optimizer/prep/prepjointree.c",
                    "file_size": 0
                },
                {
                    "file_additions": 0,
                    "file_deletions": 20,
                    "file_exists": false,
                    "file_name": "src/backend/optimizer/util/pathnode.c",
                    "file_size": 0
                },
                {
                    "file_additions": 29,
                    "file_deletions": 1,
                    "file_exists": false,
                    "file_name": "src/backend/optimizer/util/plancat.c",
                    "file_size": 0
                },
                {
                    "file_additions": 10,
                    "file_deletions": 1,
                    "file_exists": false,
                    "file_name": "src/backend/optimizer/util/relnode.c",
                    "file_size": 0
                },
                {
                    "file_additions": 1,
                    "file_deletions": 1,
                    "file_exists": false,
                    "file_name": "src/backend/parser/analyze.c",
                    "file_size": 0
                },
                {
                    "file_additions": 55,
                    "file_deletions": 13,
                    "file_exists": false,
                    "file_name": "src/backend/parser/parse_relation.c",
                    "file_size": 0
                },
                {
                    "file_additions": 0,
                    "file_deletions": 2,
                    "file_exists": false,
                    "file_name": "src/backend/parser/parse_target.c",
                    "file_size": 0
                },
                {
                    "file_additions": 0,
                    "file_deletions": 1,
                    "file_exists": false,
                    "file_name": "src/backend/parser/parse_utilcmd.c",
                    "file_size": 0
                },
                {
                    "file_additions": 5,
                    "file_deletions": 3,
                    "file_exists": false,
                    "file_name": "src/backend/pipeline/cont_adhoc.c",
                    "file_size": 0
                },
                {
                    "file_additions": 9,
                    "file_deletions": 3,
                    "file_exists": false,
                    "file_name": "src/backend/pipeline/cont_analyze.c",
                    "file_size": 0
                },
                {
                    "file_additions": 3,
                    "file_deletions": 1,
                    "file_exists": false,
                    "file_name": "src/backend/pipeline/cont_combiner.c",
                    "file_size": 0
                },
                {
                    "file_additions": 9,
                    "file_deletions": 3,
                    "file_exists": false,
                    "file_name": "src/backend/pipeline/cont_plan.c",
                    "file_size": 0
                },
                {
                    "file_additions": 1,
                    "file_deletions": 1,
                    "file_exists": false,
                    "file_name": "src/backend/pipeline/cont_scheduler.c",
                    "file_size": 0
                },
                {
                    "file_additions": 11,
                    "file_deletions": 4,
                    "file_exists": false,
                    "file_name": "src/backend/pipeline/cont_worker.c",
                    "file_size": 0
                },
                {
                    "file_additions": 634,
                    "file_deletions": 0,
                    "file_exists": false,
                    "file_name": "src/backend/pipeline/dsm_cqueue.c",
                    "file_size": 0
                },
                {
                    "file_additions": 9,
                    "file_deletions": 440,
                    "file_exists": false,
                    "file_name": "src/backend/pipeline/stream.c",
                    "file_size": 0
                },
                {
                    "file_additions": 600,
                    "file_deletions": 0,
                    "file_exists": false,
                    "file_name": "src/backend/pipeline/stream_fdw.c",
                    "file_size": 0
                },
                {
                    "file_additions": 8,
                    "file_deletions": 4,
                    "file_exists": false,
                    "file_name": "src/backend/pipeline/tuplebuf.c",
                    "file_size": 0
                },
                {
                    "file_additions": 8,
                    "file_deletions": 1,
                    "file_exists": false,
                    "file_name": "src/backend/rewrite/rewriteHandler.c",
                    "file_size": 0
                },
                {
                    "file_additions": 5,
                    "file_deletions": 137,
                    "file_exists": false,
                    "file_name": "src/backend/tcop/postgres.c",
                    "file_size": 0
                },
                {
                    "file_additions": 3,
                    "file_deletions": 1,
                    "file_exists": false,
                    "file_name": "src/backend/tcop/utility.c",
                    "file_size": 0
                },
                {
                    "file_additions": 10,
                    "file_deletions": 1,
                    "file_exists": false,
                    "file_name": "src/backend/utils/adt/pipelinefuncs.c",
                    "file_size": 0
                },
                {
                    "file_additions": 1,
                    "file_deletions": 3,
                    "file_exists": false,
                    "file_name": "src/backend/utils/adt/ruleutils.c",
                    "file_size": 0
                },
                {
                    "file_additions": 0,
                    "file_deletions": 2,
                    "file_exists": false,
                    "file_name": "src/backend/utils/cache/typcache.c",
                    "file_size": 0
                },
                {
                    "file_additions": 5,
                    "file_deletions": 0,
                    "file_exists": false,
                    "file_name": "src/bin/initdb/initdb.c",
                    "file_size": 0
                }
            ],
            "interesting": {
                "reopen": false,
                "status": true
            },
            "is_parent": false,
            "sha": "071a746333ff22dc4de74ba1e398c5532d3ec46d"
        },
        {
            "associated_pull_request": [],
            "date": "2015-10-27 19:55:34",
            "diff": "pipelinedb_pipelinedb/issue_1135/commit_f721fe3e9ea607e0cb2d082fd961db7ae132b33a.diff",
            "diff_additions": 1008,
            "diff_deletions": 1239,
            "diff_file_size": 0,
            "diff_url": "https://github.com/pipelinedb/pipelinedb/commit/f721fe3e9ea607e0cb2d082fd961db7ae132b33a.diff",
            "exists": true,
            "files": [
                {
                    "file_additions": 1,
                    "file_deletions": 1,
                    "file_exists": false,
                    "file_name": "contrib/pipeline_kafka/pipeline_kafka.c",
                    "file_size": 0
                },
                {
                    "file_additions": 2,
                    "file_deletions": 2,
                    "file_exists": false,
                    "file_name": "src/backend/catalog/dependency.c",
                    "file_size": 0
                },
                {
                    "file_additions": 1,
                    "file_deletions": 5,
                    "file_exists": false,
                    "file_name": "src/backend/catalog/heap.c",
                    "file_size": 0
                },
                {
                    "file_additions": 12,
                    "file_deletions": 11,
                    "file_exists": false,
                    "file_name": "src/backend/catalog/objectaddress.c",
                    "file_size": 0
                },
                {
                    "file_additions": 3,
                    "file_deletions": 2,
                    "file_exists": false,
                    "file_name": "src/backend/catalog/pg_type.c",
                    "file_size": 0
                },
                {
                    "file_additions": 167,
                    "file_deletions": 14,
                    "file_exists": false,
                    "file_name": "src/backend/catalog/pipeline_stream.c",
                    "file_size": 0
                },
                {
                    "file_additions": 2,
                    "file_deletions": 2,
                    "file_exists": false,
                    "file_name": "src/backend/commands/copy.c",
                    "file_size": 0
                },
                {
                    "file_additions": 0,
                    "file_deletions": 12,
                    "file_exists": false,
                    "file_name": "src/backend/commands/explain.c",
                    "file_size": 0
                },
                {
                    "file_additions": 3,
                    "file_deletions": 8,
                    "file_exists": false,
                    "file_name": "src/backend/commands/pipelinecmds.c",
                    "file_size": 0
                },
                {
                    "file_additions": 2,
                    "file_deletions": 22,
                    "file_exists": false,
                    "file_name": "src/backend/commands/prepare.c",
                    "file_size": 0
                },
                {
                    "file_additions": 1,
                    "file_deletions": 9,
                    "file_exists": false,
                    "file_name": "src/backend/commands/tablecmds.c",
                    "file_size": 0
                },
                {
                    "file_additions": 0,
                    "file_deletions": 5,
                    "file_exists": false,
                    "file_name": "src/backend/executor/execAmi.c",
                    "file_size": 0
                },
                {
                    "file_additions": 0,
                    "file_deletions": 15,
                    "file_exists": false,
                    "file_name": "src/backend/executor/execProcnode.c",
                    "file_size": 0
                },
                {
                    "file_additions": 1,
                    "file_deletions": 1,
                    "file_exists": false,
                    "file_name": "src/backend/executor/execScan.c",
                    "file_size": 0
                },
                {
                    "file_additions": 11,
                    "file_deletions": 1,
                    "file_exists": false,
                    "file_name": "src/backend/executor/execUtils.c",
                    "file_size": 0
                },
                {
                    "file_additions": 1,
                    "file_deletions": 1,
                    "file_exists": false,
                    "file_name": "src/backend/executor/nodeBitmapIndexscan.c",
                    "file_size": 0
                },
                {
                    "file_additions": 1,
                    "file_deletions": 1,
                    "file_exists": false,
                    "file_name": "src/backend/executor/nodeSort.c",
                    "file_size": 0
                },
                {
                    "file_additions": 0,
                    "file_deletions": 363,
                    "file_exists": false,
                    "file_name": "src/backend/executor/nodeStreamscan.c",
                    "file_size": 0
                },
                {
                    "file_additions": 14,
                    "file_deletions": 11,
                    "file_exists": false,
                    "file_name": "src/backend/nodes/copyfuncs.c",
                    "file_size": 0
                },
                {
                    "file_additions": 0,
                    "file_deletions": 2,
                    "file_exists": false,
                    "file_name": "src/backend/nodes/nodeFuncs.c",
                    "file_size": 0
                },
                {
                    "file_additions": 7,
                    "file_deletions": 18,
                    "file_exists": false,
                    "file_name": "src/backend/nodes/outfuncs.c",
                    "file_size": 0
                },
                {
                    "file_additions": 7,
                    "file_deletions": 7,
                    "file_exists": false,
                    "file_name": "src/backend/nodes/readfuncs.c",
                    "file_size": 0
                },
                {
                    "file_additions": 0,
                    "file_deletions": 9,
                    "file_exists": false,
                    "file_name": "src/backend/optimizer/path/allpaths.c",
                    "file_size": 0
                },
                {
                    "file_additions": 0,
                    "file_deletions": 3,
                    "file_exists": false,
                    "file_name": "src/backend/optimizer/path/costsize.c",
                    "file_size": 0
                },
                {
                    "file_additions": 1,
                    "file_deletions": 68,
                    "file_exists": false,
                    "file_name": "src/backend/optimizer/plan/createplan.c",
                    "file_size": 0
                },
                {
                    "file_additions": 0,
                    "file_deletions": 2,
                    "file_exists": false,
                    "file_name": "src/backend/optimizer/plan/setrefs.c",
                    "file_size": 0
                },
                {
                    "file_additions": 0,
                    "file_deletions": 1,
                    "file_exists": false,
                    "file_name": "src/backend/optimizer/plan/subselect.c",
                    "file_size": 0
                },
                {
                    "file_additions": 0,
                    "file_deletions": 2,
                    "file_exists": false,
                    "file_name": "src/backend/optimizer/prep/prepjointree.c",
                    "file_size": 0
                },
                {
                    "file_additions": 0,
                    "file_deletions": 20,
                    "file_exists": false,
                    "file_name": "src/backend/optimizer/util/pathnode.c",
                    "file_size": 0
                },
                {
                    "file_additions": 29,
                    "file_deletions": 1,
                    "file_exists": false,
                    "file_name": "src/backend/optimizer/util/plancat.c",
                    "file_size": 0
                },
                {
                    "file_additions": 10,
                    "file_deletions": 1,
                    "file_exists": false,
                    "file_name": "src/backend/optimizer/util/relnode.c",
                    "file_size": 0
                },
                {
                    "file_additions": 1,
                    "file_deletions": 1,
                    "file_exists": false,
                    "file_name": "src/backend/parser/analyze.c",
                    "file_size": 0
                },
                {
                    "file_additions": 55,
                    "file_deletions": 13,
                    "file_exists": false,
                    "file_name": "src/backend/parser/parse_relation.c",
                    "file_size": 0
                },
                {
                    "file_additions": 0,
                    "file_deletions": 2,
                    "file_exists": false,
                    "file_name": "src/backend/parser/parse_target.c",
                    "file_size": 0
                },
                {
                    "file_additions": 0,
                    "file_deletions": 1,
                    "file_exists": false,
                    "file_name": "src/backend/parser/parse_utilcmd.c",
                    "file_size": 0
                },
                {
                    "file_additions": 5,
                    "file_deletions": 3,
                    "file_exists": false,
                    "file_name": "src/backend/pipeline/cont_adhoc.c",
                    "file_size": 0
                },
                {
                    "file_additions": 9,
                    "file_deletions": 3,
                    "file_exists": false,
                    "file_name": "src/backend/pipeline/cont_analyze.c",
                    "file_size": 0
                },
                {
                    "file_additions": 3,
                    "file_deletions": 1,
                    "file_exists": false,
                    "file_name": "src/backend/pipeline/cont_combiner.c",
                    "file_size": 0
                },
                {
                    "file_additions": 9,
                    "file_deletions": 3,
                    "file_exists": false,
                    "file_name": "src/backend/pipeline/cont_plan.c",
                    "file_size": 0
                },
                {
                    "file_additions": 11,
                    "file_deletions": 4,
                    "file_exists": false,
                    "file_name": "src/backend/pipeline/cont_worker.c",
                    "file_size": 0
                },
                {
                    "file_additions": 9,
                    "file_deletions": 440,
                    "file_exists": false,
                    "file_name": "src/backend/pipeline/stream.c",
                    "file_size": 0
                },
                {
                    "file_additions": 600,
                    "file_deletions": 0,
                    "file_exists": false,
                    "file_name": "src/backend/pipeline/stream_fdw.c",
                    "file_size": 0
                },
                {
                    "file_additions": 8,
                    "file_deletions": 4,
                    "file_exists": false,
                    "file_name": "src/backend/pipeline/tuplebuf.c",
                    "file_size": 0
                },
                {
                    "file_additions": 8,
                    "file_deletions": 1,
                    "file_exists": false,
                    "file_name": "src/backend/rewrite/rewriteHandler.c",
                    "file_size": 0
                },
                {
                    "file_additions": 5,
                    "file_deletions": 137,
                    "file_exists": false,
                    "file_name": "src/backend/tcop/postgres.c",
                    "file_size": 0
                },
                {
                    "file_additions": 3,
                    "file_deletions": 1,
                    "file_exists": false,
                    "file_name": "src/backend/tcop/utility.c",
                    "file_size": 0
                },
                {
                    "file_additions": 1,
                    "file_deletions": 3,
                    "file_exists": false,
                    "file_name": "src/backend/utils/adt/ruleutils.c",
                    "file_size": 0
                },
                {
                    "file_additions": 0,
                    "file_deletions": 2,
                    "file_exists": false,
                    "file_name": "src/backend/utils/cache/typcache.c",
                    "file_size": 0
                },
                {
                    "file_additions": 5,
                    "file_deletions": 0,
                    "file_exists": false,
                    "file_name": "src/bin/initdb/initdb.c",
                    "file_size": 0
                }
            ],
            "interesting": {
                "reopen": false,
                "status": true
            },
            "is_parent": false,
            "sha": "f721fe3e9ea607e0cb2d082fd961db7ae132b33a"
        },
        {
            "associated_pull_request": [],
            "date": "2015-10-27 20:45:55",
            "diff": "pipelinedb_pipelinedb/issue_1135/commit_907e34a377759ffe48bf2e9d4d5f68ccc1079e5c.diff",
            "diff_additions": 1012,
            "diff_deletions": 1242,
            "diff_file_size": 0,
            "diff_url": "https://github.com/pipelinedb/pipelinedb/commit/907e34a377759ffe48bf2e9d4d5f68ccc1079e5c.diff",
            "exists": true,
            "files": [
                {
                    "file_additions": 1,
                    "file_deletions": 1,
                    "file_exists": false,
                    "file_name": "contrib/pipeline_kafka/pipeline_kafka.c",
                    "file_size": 0
                },
                {
                    "file_additions": 2,
                    "file_deletions": 2,
                    "file_exists": false,
                    "file_name": "src/backend/catalog/dependency.c",
                    "file_size": 0
                },
                {
                    "file_additions": 1,
                    "file_deletions": 5,
                    "file_exists": false,
                    "file_name": "src/backend/catalog/heap.c",
                    "file_size": 0
                },
                {
                    "file_additions": 12,
                    "file_deletions": 11,
                    "file_exists": false,
                    "file_name": "src/backend/catalog/objectaddress.c",
                    "file_size": 0
                },
                {
                    "file_additions": 3,
                    "file_deletions": 2,
                    "file_exists": false,
                    "file_name": "src/backend/catalog/pg_type.c",
                    "file_size": 0
                },
                {
                    "file_additions": 167,
                    "file_deletions": 14,
                    "file_exists": false,
                    "file_name": "src/backend/catalog/pipeline_stream.c",
                    "file_size": 0
                },
                {
                    "file_additions": 2,
                    "file_deletions": 2,
                    "file_exists": false,
                    "file_name": "src/backend/commands/copy.c",
                    "file_size": 0
                },
                {
                    "file_additions": 0,
                    "file_deletions": 12,
                    "file_exists": false,
                    "file_name": "src/backend/commands/explain.c",
                    "file_size": 0
                },
                {
                    "file_additions": 3,
                    "file_deletions": 8,
                    "file_exists": false,
                    "file_name": "src/backend/commands/pipelinecmds.c",
                    "file_size": 0
                },
                {
                    "file_additions": 2,
                    "file_deletions": 22,
                    "file_exists": false,
                    "file_name": "src/backend/commands/prepare.c",
                    "file_size": 0
                },
                {
                    "file_additions": 1,
                    "file_deletions": 9,
                    "file_exists": false,
                    "file_name": "src/backend/commands/tablecmds.c",
                    "file_size": 0
                },
                {
                    "file_additions": 0,
                    "file_deletions": 5,
                    "file_exists": false,
                    "file_name": "src/backend/executor/execAmi.c",
                    "file_size": 0
                },
                {
                    "file_additions": 0,
                    "file_deletions": 15,
                    "file_exists": false,
                    "file_name": "src/backend/executor/execProcnode.c",
                    "file_size": 0
                },
                {
                    "file_additions": 1,
                    "file_deletions": 1,
                    "file_exists": false,
                    "file_name": "src/backend/executor/execScan.c",
                    "file_size": 0
                },
                {
                    "file_additions": 11,
                    "file_deletions": 1,
                    "file_exists": false,
                    "file_name": "src/backend/executor/execUtils.c",
                    "file_size": 0
                },
                {
                    "file_additions": 1,
                    "file_deletions": 1,
                    "file_exists": false,
                    "file_name": "src/backend/executor/nodeBitmapIndexscan.c",
                    "file_size": 0
                },
                {
                    "file_additions": 1,
                    "file_deletions": 1,
                    "file_exists": false,
                    "file_name": "src/backend/executor/nodeSort.c",
                    "file_size": 0
                },
                {
                    "file_additions": 0,
                    "file_deletions": 363,
                    "file_exists": false,
                    "file_name": "src/backend/executor/nodeStreamscan.c",
                    "file_size": 0
                },
                {
                    "file_additions": 14,
                    "file_deletions": 11,
                    "file_exists": false,
                    "file_name": "src/backend/nodes/copyfuncs.c",
                    "file_size": 0
                },
                {
                    "file_additions": 0,
                    "file_deletions": 2,
                    "file_exists": false,
                    "file_name": "src/backend/nodes/nodeFuncs.c",
                    "file_size": 0
                },
                {
                    "file_additions": 7,
                    "file_deletions": 18,
                    "file_exists": false,
                    "file_name": "src/backend/nodes/outfuncs.c",
                    "file_size": 0
                },
                {
                    "file_additions": 7,
                    "file_deletions": 7,
                    "file_exists": false,
                    "file_name": "src/backend/nodes/readfuncs.c",
                    "file_size": 0
                },
                {
                    "file_additions": 0,
                    "file_deletions": 9,
                    "file_exists": false,
                    "file_name": "src/backend/optimizer/path/allpaths.c",
                    "file_size": 0
                },
                {
                    "file_additions": 0,
                    "file_deletions": 3,
                    "file_exists": false,
                    "file_name": "src/backend/optimizer/path/costsize.c",
                    "file_size": 0
                },
                {
                    "file_additions": 1,
                    "file_deletions": 68,
                    "file_exists": false,
                    "file_name": "src/backend/optimizer/plan/createplan.c",
                    "file_size": 0
                },
                {
                    "file_additions": 0,
                    "file_deletions": 2,
                    "file_exists": false,
                    "file_name": "src/backend/optimizer/plan/setrefs.c",
                    "file_size": 0
                },
                {
                    "file_additions": 0,
                    "file_deletions": 1,
                    "file_exists": false,
                    "file_name": "src/backend/optimizer/plan/subselect.c",
                    "file_size": 0
                },
                {
                    "file_additions": 0,
                    "file_deletions": 2,
                    "file_exists": false,
                    "file_name": "src/backend/optimizer/prep/prepjointree.c",
                    "file_size": 0
                },
                {
                    "file_additions": 0,
                    "file_deletions": 20,
                    "file_exists": false,
                    "file_name": "src/backend/optimizer/util/pathnode.c",
                    "file_size": 0
                },
                {
                    "file_additions": 29,
                    "file_deletions": 1,
                    "file_exists": false,
                    "file_name": "src/backend/optimizer/util/plancat.c",
                    "file_size": 0
                },
                {
                    "file_additions": 10,
                    "file_deletions": 1,
                    "file_exists": false,
                    "file_name": "src/backend/optimizer/util/relnode.c",
                    "file_size": 0
                },
                {
                    "file_additions": 1,
                    "file_deletions": 1,
                    "file_exists": false,
                    "file_name": "src/backend/parser/analyze.c",
                    "file_size": 0
                },
                {
                    "file_additions": 55,
                    "file_deletions": 13,
                    "file_exists": false,
                    "file_name": "src/backend/parser/parse_relation.c",
                    "file_size": 0
                },
                {
                    "file_additions": 0,
                    "file_deletions": 2,
                    "file_exists": false,
                    "file_name": "src/backend/parser/parse_target.c",
                    "file_size": 0
                },
                {
                    "file_additions": 0,
                    "file_deletions": 1,
                    "file_exists": false,
                    "file_name": "src/backend/parser/parse_utilcmd.c",
                    "file_size": 0
                },
                {
                    "file_additions": 5,
                    "file_deletions": 3,
                    "file_exists": false,
                    "file_name": "src/backend/pipeline/cont_adhoc.c",
                    "file_size": 0
                },
                {
                    "file_additions": 9,
                    "file_deletions": 3,
                    "file_exists": false,
                    "file_name": "src/backend/pipeline/cont_analyze.c",
                    "file_size": 0
                },
                {
                    "file_additions": 3,
                    "file_deletions": 1,
                    "file_exists": false,
                    "file_name": "src/backend/pipeline/cont_combiner.c",
                    "file_size": 0
                },
                {
                    "file_additions": 9,
                    "file_deletions": 3,
                    "file_exists": false,
                    "file_name": "src/backend/pipeline/cont_plan.c",
                    "file_size": 0
                },
                {
                    "file_additions": 2,
                    "file_deletions": 2,
                    "file_exists": false,
                    "file_name": "src/backend/pipeline/cont_scheduler.c",
                    "file_size": 0
                },
                {
                    "file_additions": 11,
                    "file_deletions": 4,
                    "file_exists": false,
                    "file_name": "src/backend/pipeline/cont_worker.c",
                    "file_size": 0
                },
                {
                    "file_additions": 9,
                    "file_deletions": 440,
                    "file_exists": false,
                    "file_name": "src/backend/pipeline/stream.c",
                    "file_size": 0
                },
                {
                    "file_additions": 600,
                    "file_deletions": 0,
                    "file_exists": false,
                    "file_name": "src/backend/pipeline/stream_fdw.c",
                    "file_size": 0
                },
                {
                    "file_additions": 8,
                    "file_deletions": 4,
                    "file_exists": false,
                    "file_name": "src/backend/pipeline/tuplebuf.c",
                    "file_size": 0
                },
                {
                    "file_additions": 2,
                    "file_deletions": 1,
                    "file_exists": false,
                    "file_name": "src/backend/postmaster/postmaster.c",
                    "file_size": 0
                },
                {
                    "file_additions": 8,
                    "file_deletions": 1,
                    "file_exists": false,
                    "file_name": "src/backend/rewrite/rewriteHandler.c",
                    "file_size": 0
                },
                {
                    "file_additions": 5,
                    "file_deletions": 137,
                    "file_exists": false,
                    "file_name": "src/backend/tcop/postgres.c",
                    "file_size": 0
                },
                {
                    "file_additions": 3,
                    "file_deletions": 1,
                    "file_exists": false,
                    "file_name": "src/backend/tcop/utility.c",
                    "file_size": 0
                },
                {
                    "file_additions": 1,
                    "file_deletions": 3,
                    "file_exists": false,
                    "file_name": "src/backend/utils/adt/ruleutils.c",
                    "file_size": 0
                },
                {
                    "file_additions": 0,
                    "file_deletions": 2,
                    "file_exists": false,
                    "file_name": "src/backend/utils/cache/typcache.c",
                    "file_size": 0
                },
                {
                    "file_additions": 5,
                    "file_deletions": 0,
                    "file_exists": false,
                    "file_name": "src/bin/initdb/initdb.c",
                    "file_size": 0
                }
            ],
            "interesting": {
                "reopen": false,
                "status": false
            },
            "is_parent": false,
            "sha": "907e34a377759ffe48bf2e9d4d5f68ccc1079e5c"
        },
        {
            "associated_pull_request": [],
            "date": "2015-10-27 22:39:43",
            "diff": "pipelinedb_pipelinedb/issue_1135/commit_ff38ecc90b3aea178628791a6b4d73e5b0b19cbc.diff",
            "diff_additions": 20,
            "diff_deletions": 4,
            "diff_file_size": 0,
            "diff_url": "https://github.com/pipelinedb/pipelinedb/commit/ff38ecc90b3aea178628791a6b4d73e5b0b19cbc.diff",
            "exists": true,
            "files": [
                {
                    "file_additions": 2,
                    "file_deletions": 0,
                    "file_exists": false,
                    "file_name": "src/backend/catalog/pipeline_stream.c",
                    "file_size": 0
                },
                {
                    "file_additions": 2,
                    "file_deletions": 1,
                    "file_exists": false,
                    "file_name": "src/backend/executor/nodeModifyTable.c",
                    "file_size": 0
                },
                {
                    "file_additions": 16,
                    "file_deletions": 3,
                    "file_exists": false,
                    "file_name": "src/backend/pipeline/stream_fdw.c",
                    "file_size": 0
                }
            ],
            "interesting": {
                "reopen": false,
                "status": true
            },
            "is_parent": false,
            "sha": "ff38ecc90b3aea178628791a6b4d73e5b0b19cbc"
        },
        {
            "associated_pull_request": [],
            "date": "2015-10-27 22:45:19",
            "diff": "pipelinedb_pipelinedb/issue_1135/commit_d78b3d8708bfecfd57336d02e03b1ee89601c7b0.diff",
            "diff_additions": 1029,
            "diff_deletions": 1243,
            "diff_file_size": 0,
            "diff_url": "https://github.com/pipelinedb/pipelinedb/commit/d78b3d8708bfecfd57336d02e03b1ee89601c7b0.diff",
            "exists": true,
            "files": [
                {
                    "file_additions": 1,
                    "file_deletions": 1,
                    "file_exists": false,
                    "file_name": "contrib/pipeline_kafka/pipeline_kafka.c",
                    "file_size": 0
                },
                {
                    "file_additions": 2,
                    "file_deletions": 2,
                    "file_exists": false,
                    "file_name": "src/backend/catalog/dependency.c",
                    "file_size": 0
                },
                {
                    "file_additions": 1,
                    "file_deletions": 5,
                    "file_exists": false,
                    "file_name": "src/backend/catalog/heap.c",
                    "file_size": 0
                },
                {
                    "file_additions": 12,
                    "file_deletions": 11,
                    "file_exists": false,
                    "file_name": "src/backend/catalog/objectaddress.c",
                    "file_size": 0
                },
                {
                    "file_additions": 3,
                    "file_deletions": 2,
                    "file_exists": false,
                    "file_name": "src/backend/catalog/pg_type.c",
                    "file_size": 0
                },
                {
                    "file_additions": 169,
                    "file_deletions": 14,
                    "file_exists": false,
                    "file_name": "src/backend/catalog/pipeline_stream.c",
                    "file_size": 0
                },
                {
                    "file_additions": 2,
                    "file_deletions": 2,
                    "file_exists": false,
                    "file_name": "src/backend/commands/copy.c",
                    "file_size": 0
                },
                {
                    "file_additions": 0,
                    "file_deletions": 12,
                    "file_exists": false,
                    "file_name": "src/backend/commands/explain.c",
                    "file_size": 0
                },
                {
                    "file_additions": 3,
                    "file_deletions": 8,
                    "file_exists": false,
                    "file_name": "src/backend/commands/pipelinecmds.c",
                    "file_size": 0
                },
                {
                    "file_additions": 2,
                    "file_deletions": 22,
                    "file_exists": false,
                    "file_name": "src/backend/commands/prepare.c",
                    "file_size": 0
                },
                {
                    "file_additions": 1,
                    "file_deletions": 9,
                    "file_exists": false,
                    "file_name": "src/backend/commands/tablecmds.c",
                    "file_size": 0
                },
                {
                    "file_additions": 0,
                    "file_deletions": 5,
                    "file_exists": false,
                    "file_name": "src/backend/executor/execAmi.c",
                    "file_size": 0
                },
                {
                    "file_additions": 0,
                    "file_deletions": 15,
                    "file_exists": false,
                    "file_name": "src/backend/executor/execProcnode.c",
                    "file_size": 0
                },
                {
                    "file_additions": 1,
                    "file_deletions": 1,
                    "file_exists": false,
                    "file_name": "src/backend/executor/execScan.c",
                    "file_size": 0
                },
                {
                    "file_additions": 11,
                    "file_deletions": 1,
                    "file_exists": false,
                    "file_name": "src/backend/executor/execUtils.c",
                    "file_size": 0
                },
                {
                    "file_additions": 1,
                    "file_deletions": 1,
                    "file_exists": false,
                    "file_name": "src/backend/executor/nodeBitmapIndexscan.c",
                    "file_size": 0
                },
                {
                    "file_additions": 2,
                    "file_deletions": 1,
                    "file_exists": false,
                    "file_name": "src/backend/executor/nodeModifyTable.c",
                    "file_size": 0
                },
                {
                    "file_additions": 1,
                    "file_deletions": 1,
                    "file_exists": false,
                    "file_name": "src/backend/executor/nodeSort.c",
                    "file_size": 0
                },
                {
                    "file_additions": 0,
                    "file_deletions": 363,
                    "file_exists": false,
                    "file_name": "src/backend/executor/nodeStreamscan.c",
                    "file_size": 0
                },
                {
                    "file_additions": 14,
                    "file_deletions": 11,
                    "file_exists": false,
                    "file_name": "src/backend/nodes/copyfuncs.c",
                    "file_size": 0
                },
                {
                    "file_additions": 0,
                    "file_deletions": 2,
                    "file_exists": false,
                    "file_name": "src/backend/nodes/nodeFuncs.c",
                    "file_size": 0
                },
                {
                    "file_additions": 7,
                    "file_deletions": 18,
                    "file_exists": false,
                    "file_name": "src/backend/nodes/outfuncs.c",
                    "file_size": 0
                },
                {
                    "file_additions": 7,
                    "file_deletions": 7,
                    "file_exists": false,
                    "file_name": "src/backend/nodes/readfuncs.c",
                    "file_size": 0
                },
                {
                    "file_additions": 0,
                    "file_deletions": 9,
                    "file_exists": false,
                    "file_name": "src/backend/optimizer/path/allpaths.c",
                    "file_size": 0
                },
                {
                    "file_additions": 0,
                    "file_deletions": 3,
                    "file_exists": false,
                    "file_name": "src/backend/optimizer/path/costsize.c",
                    "file_size": 0
                },
                {
                    "file_additions": 1,
                    "file_deletions": 68,
                    "file_exists": false,
                    "file_name": "src/backend/optimizer/plan/createplan.c",
                    "file_size": 0
                },
                {
                    "file_additions": 0,
                    "file_deletions": 2,
                    "file_exists": false,
                    "file_name": "src/backend/optimizer/plan/setrefs.c",
                    "file_size": 0
                },
                {
                    "file_additions": 0,
                    "file_deletions": 1,
                    "file_exists": false,
                    "file_name": "src/backend/optimizer/plan/subselect.c",
                    "file_size": 0
                },
                {
                    "file_additions": 0,
                    "file_deletions": 2,
                    "file_exists": false,
                    "file_name": "src/backend/optimizer/prep/prepjointree.c",
                    "file_size": 0
                },
                {
                    "file_additions": 0,
                    "file_deletions": 20,
                    "file_exists": false,
                    "file_name": "src/backend/optimizer/util/pathnode.c",
                    "file_size": 0
                },
                {
                    "file_additions": 29,
                    "file_deletions": 1,
                    "file_exists": false,
                    "file_name": "src/backend/optimizer/util/plancat.c",
                    "file_size": 0
                },
                {
                    "file_additions": 10,
                    "file_deletions": 1,
                    "file_exists": false,
                    "file_name": "src/backend/optimizer/util/relnode.c",
                    "file_size": 0
                },
                {
                    "file_additions": 1,
                    "file_deletions": 1,
                    "file_exists": false,
                    "file_name": "src/backend/parser/analyze.c",
                    "file_size": 0
                },
                {
                    "file_additions": 55,
                    "file_deletions": 13,
                    "file_exists": false,
                    "file_name": "src/backend/parser/parse_relation.c",
                    "file_size": 0
                },
                {
                    "file_additions": 0,
                    "file_deletions": 2,
                    "file_exists": false,
                    "file_name": "src/backend/parser/parse_target.c",
                    "file_size": 0
                },
                {
                    "file_additions": 0,
                    "file_deletions": 1,
                    "file_exists": false,
                    "file_name": "src/backend/parser/parse_utilcmd.c",
                    "file_size": 0
                },
                {
                    "file_additions": 5,
                    "file_deletions": 3,
                    "file_exists": false,
                    "file_name": "src/backend/pipeline/cont_adhoc.c",
                    "file_size": 0
                },
                {
                    "file_additions": 9,
                    "file_deletions": 3,
                    "file_exists": false,
                    "file_name": "src/backend/pipeline/cont_analyze.c",
                    "file_size": 0
                },
                {
                    "file_additions": 3,
                    "file_deletions": 1,
                    "file_exists": false,
                    "file_name": "src/backend/pipeline/cont_combiner.c",
                    "file_size": 0
                },
                {
                    "file_additions": 9,
                    "file_deletions": 3,
                    "file_exists": false,
                    "file_name": "src/backend/pipeline/cont_plan.c",
                    "file_size": 0
                },
                {
                    "file_additions": 2,
                    "file_deletions": 2,
                    "file_exists": false,
                    "file_name": "src/backend/pipeline/cont_scheduler.c",
                    "file_size": 0
                },
                {
                    "file_additions": 11,
                    "file_deletions": 4,
                    "file_exists": false,
                    "file_name": "src/backend/pipeline/cont_worker.c",
                    "file_size": 0
                },
                {
                    "file_additions": 9,
                    "file_deletions": 440,
                    "file_exists": false,
                    "file_name": "src/backend/pipeline/stream.c",
                    "file_size": 0
                },
                {
                    "file_additions": 613,
                    "file_deletions": 0,
                    "file_exists": false,
                    "file_name": "src/backend/pipeline/stream_fdw.c",
                    "file_size": 0
                },
                {
                    "file_additions": 8,
                    "file_deletions": 4,
                    "file_exists": false,
                    "file_name": "src/backend/pipeline/tuplebuf.c",
                    "file_size": 0
                },
                {
                    "file_additions": 2,
                    "file_deletions": 1,
                    "file_exists": false,
                    "file_name": "src/backend/postmaster/postmaster.c",
                    "file_size": 0
                },
                {
                    "file_additions": 8,
                    "file_deletions": 1,
                    "file_exists": false,
                    "file_name": "src/backend/rewrite/rewriteHandler.c",
                    "file_size": 0
                },
                {
                    "file_additions": 5,
                    "file_deletions": 137,
                    "file_exists": false,
                    "file_name": "src/backend/tcop/postgres.c",
                    "file_size": 0
                },
                {
                    "file_additions": 3,
                    "file_deletions": 1,
                    "file_exists": false,
                    "file_name": "src/backend/tcop/utility.c",
                    "file_size": 0
                },
                {
                    "file_additions": 1,
                    "file_deletions": 3,
                    "file_exists": false,
                    "file_name": "src/backend/utils/adt/ruleutils.c",
                    "file_size": 0
                },
                {
                    "file_additions": 0,
                    "file_deletions": 2,
                    "file_exists": false,
                    "file_name": "src/backend/utils/cache/typcache.c",
                    "file_size": 0
                },
                {
                    "file_additions": 5,
                    "file_deletions": 0,
                    "file_exists": false,
                    "file_name": "src/bin/initdb/initdb.c",
                    "file_size": 0
                }
            ],
            "interesting": {
                "reopen": false,
                "status": true
            },
            "is_parent": false,
            "sha": "d78b3d8708bfecfd57336d02e03b1ee89601c7b0"
        },
        {
            "associated_pull_request": [],
            "date": "2015-10-28 00:20:01",
            "diff": "pipelinedb_pipelinedb/issue_1135/commit_b296d391fe229b86b25cb16610ab1b991b7a53ad.diff",
            "diff_additions": 8,
            "diff_deletions": 4,
            "diff_file_size": 0,
            "diff_url": "https://github.com/pipelinedb/pipelinedb/commit/b296d391fe229b86b25cb16610ab1b991b7a53ad.diff",
            "exists": true,
            "files": [
                {
                    "file_additions": 8,
                    "file_deletions": 4,
                    "file_exists": false,
                    "file_name": "src/backend/pipeline/stream_fdw.c",
                    "file_size": 0
                }
            ],
            "interesting": {
                "reopen": false,
                "status": true
            },
            "is_parent": false,
            "sha": "b296d391fe229b86b25cb16610ab1b991b7a53ad"
        },
        {
            "associated_pull_request": [],
            "date": "2015-10-27 22:45:19",
            "diff": "pipelinedb_pipelinedb/issue_1135/commit_5e293019f3fe685e4351d3fd99901d83a0e41836.diff",
            "diff_additions": 1027,
            "diff_deletions": 1242,
            "diff_file_size": 0,
            "diff_url": "https://github.com/pipelinedb/pipelinedb/commit/5e293019f3fe685e4351d3fd99901d83a0e41836.diff",
            "exists": true,
            "files": [
                {
                    "file_additions": 1,
                    "file_deletions": 1,
                    "file_exists": false,
                    "file_name": "contrib/pipeline_kafka/pipeline_kafka.c",
                    "file_size": 0
                },
                {
                    "file_additions": 2,
                    "file_deletions": 2,
                    "file_exists": false,
                    "file_name": "src/backend/catalog/dependency.c",
                    "file_size": 0
                },
                {
                    "file_additions": 1,
                    "file_deletions": 5,
                    "file_exists": false,
                    "file_name": "src/backend/catalog/heap.c",
                    "file_size": 0
                },
                {
                    "file_additions": 12,
                    "file_deletions": 11,
                    "file_exists": false,
                    "file_name": "src/backend/catalog/objectaddress.c",
                    "file_size": 0
                },
                {
                    "file_additions": 3,
                    "file_deletions": 2,
                    "file_exists": false,
                    "file_name": "src/backend/catalog/pg_type.c",
                    "file_size": 0
                },
                {
                    "file_additions": 169,
                    "file_deletions": 14,
                    "file_exists": false,
                    "file_name": "src/backend/catalog/pipeline_stream.c",
                    "file_size": 0
                },
                {
                    "file_additions": 2,
                    "file_deletions": 2,
                    "file_exists": false,
                    "file_name": "src/backend/commands/copy.c",
                    "file_size": 0
                },
                {
                    "file_additions": 0,
                    "file_deletions": 12,
                    "file_exists": false,
                    "file_name": "src/backend/commands/explain.c",
                    "file_size": 0
                },
                {
                    "file_additions": 3,
                    "file_deletions": 8,
                    "file_exists": false,
                    "file_name": "src/backend/commands/pipelinecmds.c",
                    "file_size": 0
                },
                {
                    "file_additions": 2,
                    "file_deletions": 22,
                    "file_exists": false,
                    "file_name": "src/backend/commands/prepare.c",
                    "file_size": 0
                },
                {
                    "file_additions": 1,
                    "file_deletions": 9,
                    "file_exists": false,
                    "file_name": "src/backend/commands/tablecmds.c",
                    "file_size": 0
                },
                {
                    "file_additions": 0,
                    "file_deletions": 5,
                    "file_exists": false,
                    "file_name": "src/backend/executor/execAmi.c",
                    "file_size": 0
                },
                {
                    "file_additions": 0,
                    "file_deletions": 15,
                    "file_exists": false,
                    "file_name": "src/backend/executor/execProcnode.c",
                    "file_size": 0
                },
                {
                    "file_additions": 1,
                    "file_deletions": 1,
                    "file_exists": false,
                    "file_name": "src/backend/executor/execScan.c",
                    "file_size": 0
                },
                {
                    "file_additions": 11,
                    "file_deletions": 1,
                    "file_exists": false,
                    "file_name": "src/backend/executor/execUtils.c",
                    "file_size": 0
                },
                {
                    "file_additions": 1,
                    "file_deletions": 1,
                    "file_exists": false,
                    "file_name": "src/backend/executor/nodeBitmapIndexscan.c",
                    "file_size": 0
                },
                {
                    "file_additions": 2,
                    "file_deletions": 1,
                    "file_exists": false,
                    "file_name": "src/backend/executor/nodeModifyTable.c",
                    "file_size": 0
                },
                {
                    "file_additions": 1,
                    "file_deletions": 1,
                    "file_exists": false,
                    "file_name": "src/backend/executor/nodeSort.c",
                    "file_size": 0
                },
                {
                    "file_additions": 0,
                    "file_deletions": 363,
                    "file_exists": false,
                    "file_name": "src/backend/executor/nodeStreamscan.c",
                    "file_size": 0
                },
                {
                    "file_additions": 14,
                    "file_deletions": 11,
                    "file_exists": false,
                    "file_name": "src/backend/nodes/copyfuncs.c",
                    "file_size": 0
                },
                {
                    "file_additions": 0,
                    "file_deletions": 2,
                    "file_exists": false,
                    "file_name": "src/backend/nodes/nodeFuncs.c",
                    "file_size": 0
                },
                {
                    "file_additions": 7,
                    "file_deletions": 18,
                    "file_exists": false,
                    "file_name": "src/backend/nodes/outfuncs.c",
                    "file_size": 0
                },
                {
                    "file_additions": 7,
                    "file_deletions": 7,
                    "file_exists": false,
                    "file_name": "src/backend/nodes/readfuncs.c",
                    "file_size": 0
                },
                {
                    "file_additions": 0,
                    "file_deletions": 9,
                    "file_exists": false,
                    "file_name": "src/backend/optimizer/path/allpaths.c",
                    "file_size": 0
                },
                {
                    "file_additions": 0,
                    "file_deletions": 3,
                    "file_exists": false,
                    "file_name": "src/backend/optimizer/path/costsize.c",
                    "file_size": 0
                },
                {
                    "file_additions": 1,
                    "file_deletions": 68,
                    "file_exists": false,
                    "file_name": "src/backend/optimizer/plan/createplan.c",
                    "file_size": 0
                },
                {
                    "file_additions": 0,
                    "file_deletions": 2,
                    "file_exists": false,
                    "file_name": "src/backend/optimizer/plan/setrefs.c",
                    "file_size": 0
                },
                {
                    "file_additions": 0,
                    "file_deletions": 1,
                    "file_exists": false,
                    "file_name": "src/backend/optimizer/plan/subselect.c",
                    "file_size": 0
                },
                {
                    "file_additions": 0,
                    "file_deletions": 2,
                    "file_exists": false,
                    "file_name": "src/backend/optimizer/prep/prepjointree.c",
                    "file_size": 0
                },
                {
                    "file_additions": 0,
                    "file_deletions": 20,
                    "file_exists": false,
                    "file_name": "src/backend/optimizer/util/pathnode.c",
                    "file_size": 0
                },
                {
                    "file_additions": 29,
                    "file_deletions": 1,
                    "file_exists": false,
                    "file_name": "src/backend/optimizer/util/plancat.c",
                    "file_size": 0
                },
                {
                    "file_additions": 10,
                    "file_deletions": 1,
                    "file_exists": false,
                    "file_name": "src/backend/optimizer/util/relnode.c",
                    "file_size": 0
                },
                {
                    "file_additions": 1,
                    "file_deletions": 1,
                    "file_exists": false,
                    "file_name": "src/backend/parser/analyze.c",
                    "file_size": 0
                },
                {
                    "file_additions": 55,
                    "file_deletions": 13,
                    "file_exists": false,
                    "file_name": "src/backend/parser/parse_relation.c",
                    "file_size": 0
                },
                {
                    "file_additions": 0,
                    "file_deletions": 2,
                    "file_exists": false,
                    "file_name": "src/backend/parser/parse_target.c",
                    "file_size": 0
                },
                {
                    "file_additions": 0,
                    "file_deletions": 1,
                    "file_exists": false,
                    "file_name": "src/backend/parser/parse_utilcmd.c",
                    "file_size": 0
                },
                {
                    "file_additions": 5,
                    "file_deletions": 3,
                    "file_exists": false,
                    "file_name": "src/backend/pipeline/cont_adhoc.c",
                    "file_size": 0
                },
                {
                    "file_additions": 9,
                    "file_deletions": 3,
                    "file_exists": false,
                    "file_name": "src/backend/pipeline/cont_analyze.c",
                    "file_size": 0
                },
                {
                    "file_additions": 3,
                    "file_deletions": 1,
                    "file_exists": false,
                    "file_name": "src/backend/pipeline/cont_combiner.c",
                    "file_size": 0
                },
                {
                    "file_additions": 9,
                    "file_deletions": 3,
                    "file_exists": false,
                    "file_name": "src/backend/pipeline/cont_plan.c",
                    "file_size": 0
                },
                {
                    "file_additions": 2,
                    "file_deletions": 2,
                    "file_exists": false,
                    "file_name": "src/backend/pipeline/cont_scheduler.c",
                    "file_size": 0
                },
                {
                    "file_additions": 11,
                    "file_deletions": 4,
                    "file_exists": false,
                    "file_name": "src/backend/pipeline/cont_worker.c",
                    "file_size": 0
                },
                {
                    "file_additions": 9,
                    "file_deletions": 440,
                    "file_exists": false,
                    "file_name": "src/backend/pipeline/stream.c",
                    "file_size": 0
                },
                {
                    "file_additions": 613,
                    "file_deletions": 0,
                    "file_exists": false,
                    "file_name": "src/backend/pipeline/stream_fdw.c",
                    "file_size": 0
                },
                {
                    "file_additions": 8,
                    "file_deletions": 4,
                    "file_exists": false,
                    "file_name": "src/backend/pipeline/tuplebuf.c",
                    "file_size": 0
                },
                {
                    "file_additions": 8,
                    "file_deletions": 1,
                    "file_exists": false,
                    "file_name": "src/backend/rewrite/rewriteHandler.c",
                    "file_size": 0
                },
                {
                    "file_additions": 5,
                    "file_deletions": 137,
                    "file_exists": false,
                    "file_name": "src/backend/tcop/postgres.c",
                    "file_size": 0
                },
                {
                    "file_additions": 3,
                    "file_deletions": 1,
                    "file_exists": false,
                    "file_name": "src/backend/tcop/utility.c",
                    "file_size": 0
                },
                {
                    "file_additions": 1,
                    "file_deletions": 3,
                    "file_exists": false,
                    "file_name": "src/backend/utils/adt/ruleutils.c",
                    "file_size": 0
                },
                {
                    "file_additions": 0,
                    "file_deletions": 2,
                    "file_exists": false,
                    "file_name": "src/backend/utils/cache/typcache.c",
                    "file_size": 0
                },
                {
                    "file_additions": 5,
                    "file_deletions": 0,
                    "file_exists": false,
                    "file_name": "src/bin/initdb/initdb.c",
                    "file_size": 0
                }
            ],
            "interesting": {
                "reopen": false,
                "status": false
            },
            "is_parent": false,
            "sha": "5e293019f3fe685e4351d3fd99901d83a0e41836"
        },
        {
            "associated_pull_request": [],
            "date": "2015-10-28 00:20:01",
            "diff": "pipelinedb_pipelinedb/issue_1135/commit_d3bc0390ef5f742dc2dba77eff586182e738941b.diff",
            "diff_additions": 8,
            "diff_deletions": 4,
            "diff_file_size": 0,
            "diff_url": "https://github.com/pipelinedb/pipelinedb/commit/d3bc0390ef5f742dc2dba77eff586182e738941b.diff",
            "exists": true,
            "files": [
                {
                    "file_additions": 8,
                    "file_deletions": 4,
                    "file_exists": false,
                    "file_name": "src/backend/pipeline/stream_fdw.c",
                    "file_size": 0
                }
            ],
            "interesting": {
                "reopen": false,
                "status": false
            },
            "is_parent": false,
            "sha": "d3bc0390ef5f742dc2dba77eff586182e738941b"
        }
    ],
    "first_commit": "2015-10-25 18:46:11",
    "last_commit": "2015-10-28 00:21:53",
    "number": 1135,
    "pull_request": "None",
    "score": {
        "accidental_reopen_likely": false,
        "all_labels": [
            "code quality"
        ],
        "contains_keywords": [
            "fix"
        ],
        "fix_size": 1708,
        "has_labels": [],
        "intersecting": {
            "computed_score": 1.0,
            "final_commit_size": 11,
            "intersection_size": 11,
            "previous_commits_size": 1708
        },
        "is_makefile_based": true,
        "no_new_files": [],
        "no_other_files": false,
        "num_prohibited_files": 124831,
        "prohibited_files": [
            "kill.h",
            "meminfo.h",
            "kill.h",
            "meminfo.h",
            "kill.h",
            "meminfo.h",
            "testsuite_cli_test.go",
            "testsuite_cli_test.go",
            "common.mk",
            "i3bar/include/draw_util.h"
        ],
        "reopen": false,
        "reopen_events": [
            [
                "2015-10-26 21:35:48",
                "closed"
            ],
            [
                "2015-10-27 19:45:00",
                "commit"
            ],
            [
                "2015-10-27 19:58:08",
                "commit"
            ],
            [
                "2015-10-27 20:46:05",
                "commit"
            ],
            [
                "2015-10-27 22:39:51",
                "commit"
            ],
            [
                "2015-10-27 22:45:27",
                "commit"
            ],
            [
                "2015-10-28 00:20:09",
                "commit"
            ],
            [
                "2015-10-28 00:21:58",
                "commit"
            ],
            [
                "2015-10-28 00:21:58",
                "commit"
            ]
        ],
        "status": true,
        "strategy": true,
        "total_changes": 11984
    }
}