{
    "all_issues": 769,
    "interesting_issues": 1,
    "last_update": "2023-10-20 09:45:27.019278",
    "license": {
        "download": "https://raw.githubusercontent.com/DaveGamble/cJSON/master/LICENSE",
        "name": "MIT License"
    },
    "ratio": 0.0013003901170351106,
    "size": 2520,
    "stars": 9336,
    "url": "https://github.com/DaveGamble/cJSON"
}