{
    "all_issues": 326,
    "interesting_issues": 1,
    "last_update": "2021-05-18 07:57:56.114658",
    "license": {
        "download": "https://raw.githubusercontent.com/ninia/jep/master/LICENSE",
        "name": "Other"
    },
    "ratio": 0.003067484662576687,
    "size": 6794,
    "stars": 771,
    "url": "https://github.com/ninia/jep"
}