{
    "category": [
        "control flow",
        "feature request"
    ],
    "commits": [
        {
            "associated_pull_request": [],
            "date": "2015-05-05 04:09:00",
            "diff": "freeradius_freeradius-server/issue_993/commit_8f30ba8b59dc3c78e0eb41fe03f432f60ba73091.diff",
            "diff_additions": 1,
            "diff_deletions": 4,
            "diff_file_size": 45309,
            "diff_url": "https://github.com/FreeRADIUS/freeradius-server/commit/8f30ba8b59dc3c78e0eb41fe03f432f60ba73091.diff",
            "exists": true,
            "files": [
                {
                    "file_additions": 1,
                    "file_deletions": 4,
                    "file_exists": true,
                    "file_name": "src/modules/rlm_sql/rlm_sql.c",
                    "file_size": 45309
                }
            ],
            "interesting": {
                "reopen": false,
                "status": false
            },
            "is_parent": true,
            "sha": "8f30ba8b59dc3c78e0eb41fe03f432f60ba73091"
        },
        {
            "associated_pull_request": [],
            "date": "2015-05-05 14:25:33",
            "diff": "freeradius_freeradius-server/issue_993/commit_2bd0a7d0ccfd074d0bdebce77a99d1fd7a51c08e.diff",
            "diff_additions": 40,
            "diff_deletions": 1,
            "diff_file_size": 8307,
            "diff_url": "https://github.com/FreeRADIUS/freeradius-server/commit/2bd0a7d0ccfd074d0bdebce77a99d1fd7a51c08e.diff",
            "exists": true,
            "files": [
                {
                    "file_additions": 40,
                    "file_deletions": 1,
                    "file_exists": true,
                    "file_name": "src/modules/rlm_sql/drivers/rlm_sql_db2/rlm_sql_db2.c",
                    "file_size": 8307
                }
            ],
            "interesting": {
                "reopen": false,
                "status": false
            },
            "is_parent": false,
            "sha": "2bd0a7d0ccfd074d0bdebce77a99d1fd7a51c08e"
        },
        {
            "associated_pull_request": [],
            "date": "2015-05-05 14:24:43",
            "diff": "freeradius_freeradius-server/issue_993/commit_49ce05dbdf105ae135de9758bcb51d7b9f41ad33.diff",
            "diff_additions": 41,
            "diff_deletions": 1,
            "diff_file_size": 8307,
            "diff_url": "https://github.com/FreeRADIUS/freeradius-server/commit/49ce05dbdf105ae135de9758bcb51d7b9f41ad33.diff",
            "exists": true,
            "files": [
                {
                    "file_additions": 41,
                    "file_deletions": 1,
                    "file_exists": true,
                    "file_name": "src/modules/rlm_sql/drivers/rlm_sql_db2/rlm_sql_db2.c",
                    "file_size": 8307
                }
            ],
            "interesting": {
                "reopen": false,
                "status": false
            },
            "is_parent": false,
            "sha": "49ce05dbdf105ae135de9758bcb51d7b9f41ad33"
        },
        {
            "associated_pull_request": [
                "https://github.com/FreeRADIUS/freeradius-server/pull/995"
            ],
            "date": "2015-05-05 18:18:50",
            "diff": "freeradius_freeradius-server/issue_993/commit_9ca4016a804988ebb324089750a0a373da516231.diff",
            "diff_additions": 24,
            "diff_deletions": 0,
            "diff_file_size": 7844,
            "diff_url": "https://github.com/FreeRADIUS/freeradius-server/commit/9ca4016a804988ebb324089750a0a373da516231.diff",
            "exists": true,
            "files": [
                {
                    "file_additions": 24,
                    "file_deletions": 0,
                    "file_exists": true,
                    "file_name": "src/modules/rlm_sql/drivers/rlm_sql_firebird/rlm_sql_firebird.c",
                    "file_size": 7844
                }
            ],
            "interesting": {
                "reopen": false,
                "status": true
            },
            "is_parent": false,
            "sha": "9ca4016a804988ebb324089750a0a373da516231"
        },
        {
            "associated_pull_request": [],
            "date": "2015-05-05 20:46:00",
            "diff": "freeradius_freeradius-server/issue_993/commit_7ca14c1bfbe6ffe289dd110775fb0d004c43f26e.diff",
            "diff_additions": 24,
            "diff_deletions": 0,
            "diff_file_size": 7844,
            "diff_url": "https://github.com/FreeRADIUS/freeradius-server/commit/7ca14c1bfbe6ffe289dd110775fb0d004c43f26e.diff",
            "exists": true,
            "files": [
                {
                    "file_additions": 24,
                    "file_deletions": 0,
                    "file_exists": true,
                    "file_name": "src/modules/rlm_sql/drivers/rlm_sql_firebird/rlm_sql_firebird.c",
                    "file_size": 7844
                }
            ],
            "interesting": {
                "reopen": false,
                "status": false
            },
            "is_parent": false,
            "sha": "7ca14c1bfbe6ffe289dd110775fb0d004c43f26e"
        },
        {
            "associated_pull_request": [
                "https://github.com/FreeRADIUS/freeradius-server/pull/996"
            ],
            "date": "2015-05-05 21:04:16",
            "diff": "freeradius_freeradius-server/issue_993/commit_a3dbe18eb4a7c9a5192af82b03f79da5121f7ff2.diff",
            "diff_additions": 44,
            "diff_deletions": 0,
            "diff_file_size": 13127,
            "diff_url": "https://github.com/FreeRADIUS/freeradius-server/commit/a3dbe18eb4a7c9a5192af82b03f79da5121f7ff2.diff",
            "exists": true,
            "files": [
                {
                    "file_additions": 44,
                    "file_deletions": 0,
                    "file_exists": true,
                    "file_name": "src/modules/rlm_sql/drivers/rlm_sql_oracle/rlm_sql_oracle.c",
                    "file_size": 13127
                }
            ],
            "interesting": {
                "reopen": false,
                "status": false
            },
            "is_parent": false,
            "sha": "a3dbe18eb4a7c9a5192af82b03f79da5121f7ff2"
        },
        {
            "associated_pull_request": [],
            "date": "2015-05-05 21:15:52",
            "diff": "freeradius_freeradius-server/issue_993/commit_c9e93f0a01e338b4d5002dd491a56755e091ceb3.diff",
            "diff_additions": 44,
            "diff_deletions": 0,
            "diff_file_size": 13127,
            "diff_url": "https://github.com/FreeRADIUS/freeradius-server/commit/c9e93f0a01e338b4d5002dd491a56755e091ceb3.diff",
            "exists": true,
            "files": [
                {
                    "file_additions": 44,
                    "file_deletions": 0,
                    "file_exists": true,
                    "file_name": "src/modules/rlm_sql/drivers/rlm_sql_oracle/rlm_sql_oracle.c",
                    "file_size": 13127
                }
            ],
            "interesting": {
                "reopen": false,
                "status": false
            },
            "is_parent": false,
            "sha": "c9e93f0a01e338b4d5002dd491a56755e091ceb3"
        },
        {
            "associated_pull_request": [],
            "date": "2015-05-05 22:48:49",
            "diff": "freeradius_freeradius-server/issue_993/commit_a749d8e894c520a10c671a11c6fbf746ae506708.diff",
            "diff_additions": 69,
            "diff_deletions": 1,
            "diff_file_size": 0,
            "diff_url": "https://github.com/FreeRADIUS/freeradius-server/commit/a749d8e894c520a10c671a11c6fbf746ae506708.diff",
            "exists": true,
            "files": [
                {
                    "file_additions": 69,
                    "file_deletions": 1,
                    "file_exists": false,
                    "file_name": "src/modules/rlm_sql/drivers/rlm_sql_iodbc/rlm_sql_iodbc.c",
                    "file_size": 0
                }
            ],
            "interesting": {
                "reopen": false,
                "status": false
            },
            "is_parent": false,
            "sha": "a749d8e894c520a10c671a11c6fbf746ae506708"
        },
        {
            "associated_pull_request": [],
            "date": "2015-05-05 22:57:20",
            "diff": "freeradius_freeradius-server/issue_993/commit_b9401810e11e68823cdadbd7f52a3e1f82d37670.diff",
            "diff_additions": 7,
            "diff_deletions": 0,
            "diff_file_size": 3243,
            "diff_url": "https://github.com/FreeRADIUS/freeradius-server/commit/b9401810e11e68823cdadbd7f52a3e1f82d37670.diff",
            "exists": true,
            "files": [
                {
                    "file_additions": 7,
                    "file_deletions": 0,
                    "file_exists": true,
                    "file_name": "src/modules/rlm_sql/drivers/rlm_sql_null/rlm_sql_null.c",
                    "file_size": 3243
                }
            ],
            "interesting": {
                "reopen": false,
                "status": true
            },
            "is_parent": false,
            "sha": "b9401810e11e68823cdadbd7f52a3e1f82d37670"
        },
        {
            "associated_pull_request": [],
            "date": "2015-05-05 18:18:50",
            "diff": "freeradius_freeradius-server/issue_993/commit_8098cb30af735582d1e133445e51281a9d034edd.diff",
            "diff_additions": 24,
            "diff_deletions": 0,
            "diff_file_size": 7844,
            "diff_url": "https://github.com/FreeRADIUS/freeradius-server/commit/8098cb30af735582d1e133445e51281a9d034edd.diff",
            "exists": true,
            "files": [
                {
                    "file_additions": 24,
                    "file_deletions": 0,
                    "file_exists": true,
                    "file_name": "src/modules/rlm_sql/drivers/rlm_sql_firebird/rlm_sql_firebird.c",
                    "file_size": 7844
                }
            ],
            "interesting": {
                "reopen": false,
                "status": false
            },
            "is_parent": false,
            "sha": "8098cb30af735582d1e133445e51281a9d034edd"
        },
        {
            "associated_pull_request": [],
            "date": "2015-05-05 21:04:16",
            "diff": "freeradius_freeradius-server/issue_993/commit_16d4f9319a6de9ca00674b75752a038e79b907d9.diff",
            "diff_additions": 44,
            "diff_deletions": 0,
            "diff_file_size": 13127,
            "diff_url": "https://github.com/FreeRADIUS/freeradius-server/commit/16d4f9319a6de9ca00674b75752a038e79b907d9.diff",
            "exists": true,
            "files": [
                {
                    "file_additions": 44,
                    "file_deletions": 0,
                    "file_exists": true,
                    "file_name": "src/modules/rlm_sql/drivers/rlm_sql_oracle/rlm_sql_oracle.c",
                    "file_size": 13127
                }
            ],
            "interesting": {
                "reopen": false,
                "status": false
            },
            "is_parent": false,
            "sha": "16d4f9319a6de9ca00674b75752a038e79b907d9"
        },
        {
            "associated_pull_request": [],
            "date": "2015-05-05 22:48:49",
            "diff": "freeradius_freeradius-server/issue_993/commit_5a5ed7d7b1ef1ec91baade740d8815d490056abf.diff",
            "diff_additions": 69,
            "diff_deletions": 1,
            "diff_file_size": 0,
            "diff_url": "https://github.com/FreeRADIUS/freeradius-server/commit/5a5ed7d7b1ef1ec91baade740d8815d490056abf.diff",
            "exists": true,
            "files": [
                {
                    "file_additions": 69,
                    "file_deletions": 1,
                    "file_exists": false,
                    "file_name": "src/modules/rlm_sql/drivers/rlm_sql_iodbc/rlm_sql_iodbc.c",
                    "file_size": 0
                }
            ],
            "interesting": {
                "reopen": false,
                "status": false
            },
            "is_parent": false,
            "sha": "5a5ed7d7b1ef1ec91baade740d8815d490056abf"
        },
        {
            "associated_pull_request": [],
            "date": "2015-05-05 22:57:20",
            "diff": "freeradius_freeradius-server/issue_993/commit_d2d3e685f182f6881f24141aaed25213228d44a7.diff",
            "diff_additions": 7,
            "diff_deletions": 0,
            "diff_file_size": 3243,
            "diff_url": "https://github.com/FreeRADIUS/freeradius-server/commit/d2d3e685f182f6881f24141aaed25213228d44a7.diff",
            "exists": true,
            "files": [
                {
                    "file_additions": 7,
                    "file_deletions": 0,
                    "file_exists": true,
                    "file_name": "src/modules/rlm_sql/drivers/rlm_sql_null/rlm_sql_null.c",
                    "file_size": 3243
                }
            ],
            "interesting": {
                "reopen": false,
                "status": false
            },
            "is_parent": false,
            "sha": "d2d3e685f182f6881f24141aaed25213228d44a7"
        },
        {
            "associated_pull_request": [],
            "date": "2015-05-05 23:36:23",
            "diff": "freeradius_freeradius-server/issue_993/commit_4d77cb3e185a5af6ce9fe422682a081ea198dbd5.diff",
            "diff_additions": 48,
            "diff_deletions": 21,
            "diff_file_size": 0,
            "diff_url": "https://github.com/FreeRADIUS/freeradius-server/commit/4d77cb3e185a5af6ce9fe422682a081ea198dbd5.diff",
            "exists": true,
            "files": [
                {
                    "file_additions": 48,
                    "file_deletions": 21,
                    "file_exists": false,
                    "file_name": "src/modules/rlm_sql/drivers/rlm_sql_iodbc/rlm_sql_iodbc.c",
                    "file_size": 0
                }
            ],
            "interesting": {
                "reopen": false,
                "status": false
            },
            "is_parent": false,
            "sha": "4d77cb3e185a5af6ce9fe422682a081ea198dbd5"
        },
        {
            "associated_pull_request": [],
            "date": "2015-05-05 23:36:23",
            "diff": "freeradius_freeradius-server/issue_993/commit_ddaf1201fbc66fdc3ab0d506e8a124a37b46d0d8.diff",
            "diff_additions": 48,
            "diff_deletions": 21,
            "diff_file_size": 0,
            "diff_url": "https://github.com/FreeRADIUS/freeradius-server/commit/ddaf1201fbc66fdc3ab0d506e8a124a37b46d0d8.diff",
            "exists": true,
            "files": [
                {
                    "file_additions": 48,
                    "file_deletions": 21,
                    "file_exists": false,
                    "file_name": "src/modules/rlm_sql/drivers/rlm_sql_iodbc/rlm_sql_iodbc.c",
                    "file_size": 0
                }
            ],
            "interesting": {
                "reopen": false,
                "status": false
            },
            "is_parent": false,
            "sha": "ddaf1201fbc66fdc3ab0d506e8a124a37b46d0d8"
        },
        {
            "associated_pull_request": [],
            "date": "2015-05-05 23:43:20",
            "diff": "freeradius_freeradius-server/issue_993/commit_caedfddbdd422b136740eb47222590f27f891e9b.diff",
            "diff_additions": 39,
            "diff_deletions": 0,
            "diff_file_size": 11543,
            "diff_url": "https://github.com/FreeRADIUS/freeradius-server/commit/caedfddbdd422b136740eb47222590f27f891e9b.diff",
            "exists": true,
            "files": [
                {
                    "file_additions": 39,
                    "file_deletions": 0,
                    "file_exists": true,
                    "file_name": "src/modules/rlm_sql/drivers/rlm_sql_unixodbc/rlm_sql_unixodbc.c",
                    "file_size": 11543
                }
            ],
            "interesting": {
                "reopen": false,
                "status": false
            },
            "is_parent": false,
            "sha": "caedfddbdd422b136740eb47222590f27f891e9b"
        },
        {
            "associated_pull_request": [],
            "date": "2015-05-05 23:43:20",
            "diff": "freeradius_freeradius-server/issue_993/commit_60c7f6c666eaabf0cbbf71578828a5d09150bcc5.diff",
            "diff_additions": 39,
            "diff_deletions": 0,
            "diff_file_size": 11543,
            "diff_url": "https://github.com/FreeRADIUS/freeradius-server/commit/60c7f6c666eaabf0cbbf71578828a5d09150bcc5.diff",
            "exists": true,
            "files": [
                {
                    "file_additions": 39,
                    "file_deletions": 0,
                    "file_exists": true,
                    "file_name": "src/modules/rlm_sql/drivers/rlm_sql_unixodbc/rlm_sql_unixodbc.c",
                    "file_size": 11543
                }
            ],
            "interesting": {
                "reopen": false,
                "status": false
            },
            "is_parent": false,
            "sha": "60c7f6c666eaabf0cbbf71578828a5d09150bcc5"
        },
        {
            "associated_pull_request": [],
            "date": "2015-05-05 23:48:51",
            "diff": "freeradius_freeradius-server/issue_993/commit_772a4646cffee3d3f4f48d4d2e52d697a5d494b0.diff",
            "diff_additions": 20,
            "diff_deletions": 45,
            "diff_file_size": 0,
            "diff_url": "https://github.com/FreeRADIUS/freeradius-server/commit/772a4646cffee3d3f4f48d4d2e52d697a5d494b0.diff",
            "exists": true,
            "files": [
                {
                    "file_additions": 20,
                    "file_deletions": 45,
                    "file_exists": false,
                    "file_name": "src/modules/rlm_sql/drivers/rlm_sql_iodbc/rlm_sql_iodbc.c",
                    "file_size": 0
                }
            ],
            "interesting": {
                "reopen": false,
                "status": false
            },
            "is_parent": false,
            "sha": "772a4646cffee3d3f4f48d4d2e52d697a5d494b0"
        },
        {
            "associated_pull_request": [],
            "date": "2015-05-05 18:18:50",
            "diff": "freeradius_freeradius-server/issue_993/commit_da4079eae269b8fe6edf417383acbe83d4710b7a.diff",
            "diff_additions": 24,
            "diff_deletions": 0,
            "diff_file_size": 7844,
            "diff_url": "https://github.com/FreeRADIUS/freeradius-server/commit/da4079eae269b8fe6edf417383acbe83d4710b7a.diff",
            "exists": true,
            "files": [
                {
                    "file_additions": 24,
                    "file_deletions": 0,
                    "file_exists": true,
                    "file_name": "src/modules/rlm_sql/drivers/rlm_sql_firebird/rlm_sql_firebird.c",
                    "file_size": 7844
                }
            ],
            "interesting": {
                "reopen": false,
                "status": false
            },
            "is_parent": false,
            "sha": "da4079eae269b8fe6edf417383acbe83d4710b7a"
        },
        {
            "associated_pull_request": [],
            "date": "2015-05-05 21:04:16",
            "diff": "freeradius_freeradius-server/issue_993/commit_784738957a8aca239095f0a0206e6ca46e1ea551.diff",
            "diff_additions": 44,
            "diff_deletions": 0,
            "diff_file_size": 13127,
            "diff_url": "https://github.com/FreeRADIUS/freeradius-server/commit/784738957a8aca239095f0a0206e6ca46e1ea551.diff",
            "exists": true,
            "files": [
                {
                    "file_additions": 44,
                    "file_deletions": 0,
                    "file_exists": true,
                    "file_name": "src/modules/rlm_sql/drivers/rlm_sql_oracle/rlm_sql_oracle.c",
                    "file_size": 13127
                }
            ],
            "interesting": {
                "reopen": false,
                "status": false
            },
            "is_parent": false,
            "sha": "784738957a8aca239095f0a0206e6ca46e1ea551"
        },
        {
            "associated_pull_request": [],
            "date": "2015-05-05 23:36:23",
            "diff": "freeradius_freeradius-server/issue_993/commit_3a6e9c80b7758fa3f070cd355142e20f35a7dc76.diff",
            "diff_additions": 48,
            "diff_deletions": 21,
            "diff_file_size": 0,
            "diff_url": "https://github.com/FreeRADIUS/freeradius-server/commit/3a6e9c80b7758fa3f070cd355142e20f35a7dc76.diff",
            "exists": true,
            "files": [
                {
                    "file_additions": 48,
                    "file_deletions": 21,
                    "file_exists": false,
                    "file_name": "src/modules/rlm_sql/drivers/rlm_sql_iodbc/rlm_sql_iodbc.c",
                    "file_size": 0
                }
            ],
            "interesting": {
                "reopen": false,
                "status": false
            },
            "is_parent": false,
            "sha": "3a6e9c80b7758fa3f070cd355142e20f35a7dc76"
        },
        {
            "associated_pull_request": [],
            "date": "2015-05-05 23:43:20",
            "diff": "freeradius_freeradius-server/issue_993/commit_dff283c52a38e3021c08d394dd65c2e11fb932d6.diff",
            "diff_additions": 39,
            "diff_deletions": 0,
            "diff_file_size": 11543,
            "diff_url": "https://github.com/FreeRADIUS/freeradius-server/commit/dff283c52a38e3021c08d394dd65c2e11fb932d6.diff",
            "exists": true,
            "files": [
                {
                    "file_additions": 39,
                    "file_deletions": 0,
                    "file_exists": true,
                    "file_name": "src/modules/rlm_sql/drivers/rlm_sql_unixodbc/rlm_sql_unixodbc.c",
                    "file_size": 11543
                }
            ],
            "interesting": {
                "reopen": false,
                "status": false
            },
            "is_parent": false,
            "sha": "dff283c52a38e3021c08d394dd65c2e11fb932d6"
        },
        {
            "associated_pull_request": [
                "https://github.com/FreeRADIUS/freeradius-server/pull/1001"
            ],
            "date": "2015-05-08 00:35:32",
            "diff": "freeradius_freeradius-server/issue_993/commit_a99b516bfb501c3913359055d7c97e99b294e45c.diff",
            "diff_additions": 52,
            "diff_deletions": 0,
            "diff_file_size": 22790,
            "diff_url": "https://github.com/FreeRADIUS/freeradius-server/commit/a99b516bfb501c3913359055d7c97e99b294e45c.diff",
            "exists": true,
            "files": [
                {
                    "file_additions": 52,
                    "file_deletions": 0,
                    "file_exists": true,
                    "file_name": "src/modules/rlm_sql/drivers/rlm_sql_freetds/rlm_sql_freetds.c",
                    "file_size": 22790
                }
            ],
            "interesting": {
                "reopen": false,
                "status": false
            },
            "is_parent": false,
            "sha": "a99b516bfb501c3913359055d7c97e99b294e45c"
        },
        {
            "associated_pull_request": [],
            "date": "2015-05-08 00:42:32",
            "diff": "freeradius_freeradius-server/issue_993/commit_b6c063633824c09c4ebe7f8732ff8cbd0a69fe1e.diff",
            "diff_additions": 7,
            "diff_deletions": 0,
            "diff_file_size": 3243,
            "diff_url": "https://github.com/FreeRADIUS/freeradius-server/commit/b6c063633824c09c4ebe7f8732ff8cbd0a69fe1e.diff",
            "exists": true,
            "files": [
                {
                    "file_additions": 7,
                    "file_deletions": 0,
                    "file_exists": true,
                    "file_name": "src/modules/rlm_sql/drivers/rlm_sql_null/rlm_sql_null.c",
                    "file_size": 3243
                }
            ],
            "interesting": {
                "reopen": false,
                "status": false
            },
            "is_parent": false,
            "sha": "b6c063633824c09c4ebe7f8732ff8cbd0a69fe1e"
        },
        {
            "associated_pull_request": [],
            "date": "2015-05-08 03:12:47",
            "diff": "freeradius_freeradius-server/issue_993/commit_8f291531883a81984f1c7980de97406f04d3b3f3.diff",
            "diff_additions": 52,
            "diff_deletions": 0,
            "diff_file_size": 22790,
            "diff_url": "https://github.com/FreeRADIUS/freeradius-server/commit/8f291531883a81984f1c7980de97406f04d3b3f3.diff",
            "exists": true,
            "files": [
                {
                    "file_additions": 52,
                    "file_deletions": 0,
                    "file_exists": true,
                    "file_name": "src/modules/rlm_sql/drivers/rlm_sql_freetds/rlm_sql_freetds.c",
                    "file_size": 22790
                }
            ],
            "interesting": {
                "reopen": false,
                "status": false
            },
            "is_parent": false,
            "sha": "8f291531883a81984f1c7980de97406f04d3b3f3"
        },
        {
            "associated_pull_request": [
                "https://github.com/FreeRADIUS/freeradius-server/pull/1133"
            ],
            "date": "2015-05-08 00:35:32",
            "diff": "freeradius_freeradius-server/issue_993/commit_a6e9d4a7e466952b5e895182a94a63cdac0930cf.diff",
            "diff_additions": 52,
            "diff_deletions": 0,
            "diff_file_size": 22790,
            "diff_url": "https://github.com/FreeRADIUS/freeradius-server/commit/a6e9d4a7e466952b5e895182a94a63cdac0930cf.diff",
            "exists": true,
            "files": [
                {
                    "file_additions": 52,
                    "file_deletions": 0,
                    "file_exists": true,
                    "file_name": "src/modules/rlm_sql/drivers/rlm_sql_freetds/rlm_sql_freetds.c",
                    "file_size": 22790
                }
            ],
            "interesting": {
                "reopen": false,
                "status": false
            },
            "is_parent": false,
            "sha": "a6e9d4a7e466952b5e895182a94a63cdac0930cf"
        },
        {
            "associated_pull_request": [],
            "date": "2015-07-15 16:57:58",
            "diff": "freeradius_freeradius-server/issue_993/commit_bdce8901ef7e114a8127efa1c89ceb34e4d7b596.diff",
            "diff_additions": 52,
            "diff_deletions": 0,
            "diff_file_size": 22790,
            "diff_url": "https://github.com/FreeRADIUS/freeradius-server/commit/bdce8901ef7e114a8127efa1c89ceb34e4d7b596.diff",
            "exists": true,
            "files": [
                {
                    "file_additions": 52,
                    "file_deletions": 0,
                    "file_exists": true,
                    "file_name": "src/modules/rlm_sql/drivers/rlm_sql_freetds/rlm_sql_freetds.c",
                    "file_size": 22790
                }
            ],
            "interesting": {
                "reopen": false,
                "status": false
            },
            "is_parent": false,
            "sha": "bdce8901ef7e114a8127efa1c89ceb34e4d7b596"
        }
    ],
    "first_commit": "2015-05-05 04:09:00",
    "last_commit": "2015-07-15 16:57:58",
    "number": 993,
    "pull_request": "None",
    "score": {
        "accidental_reopen_likely": false,
        "all_labels": [
            "feature enhancement",
            "usability",
            "v4.0.x"
        ],
        "contains_keywords": [
            "fix",
            "issu"
        ],
        "fix_size": 318,
        "has_labels": [],
        "intersecting": {
            "computed_score": 1.0,
            "final_commit_size": 53,
            "intersection_size": 53,
            "previous_commits_size": 318
        },
        "is_makefile_based": true,
        "no_new_files": [],
        "no_other_files": true,
        "num_prohibited_files": 74508,
        "prohibited_files": [
            "kill.h",
            "meminfo.h",
            "kill.h",
            "meminfo.h",
            "kill.h",
            "meminfo.h",
            "testsuite_cli_test.go",
            "testsuite_cli_test.go",
            "common.mk",
            "i3bar/include/draw_util.h"
        ],
        "reopen": false,
        "reopen_events": [
            [
                "2015-05-05 14:25:53",
                "commit"
            ],
            [
                "2015-05-05 14:26:13",
                "commit"
            ],
            [
                "2015-05-05 19:47:22",
                "commit"
            ],
            [
                "2015-05-05 20:46:29",
                "commit"
            ],
            [
                "2015-05-05 21:04:26",
                "commit"
            ],
            [
                "2015-05-05 21:22:58",
                "commit"
            ],
            [
                "2015-05-05 22:48:58",
                "commit"
            ],
            [
                "2015-05-05 22:57:27",
                "commit"
            ],
            [
                "2015-05-05 23:18:43",
                "commit"
            ],
            [
                "2015-05-05 23:18:43",
                "commit"
            ],
            [
                "2015-05-05 23:18:43",
                "commit"
            ],
            [
                "2015-05-05 23:18:43",
                "commit"
            ],
            [
                "2015-05-05 23:18:43",
                "commit"
            ],
            [
                "2015-05-05 23:37:36",
                "commit"
            ],
            [
                "2015-05-05 23:37:40",
                "commit"
            ],
            [
                "2015-05-05 23:44:05",
                "commit"
            ],
            [
                "2015-05-05 23:44:11",
                "commit"
            ],
            [
                "2015-05-05 23:49:05",
                "commit"
            ],
            [
                "2015-05-06 00:51:13",
                "commit"
            ],
            [
                "2015-05-06 00:51:13",
                "commit"
            ],
            [
                "2015-05-06 00:51:13",
                "commit"
            ],
            [
                "2015-05-06 00:51:13",
                "commit"
            ],
            [
                "2015-05-08 00:36:33",
                "commit"
            ],
            [
                "2015-05-08 00:43:22",
                "commit"
            ],
            [
                "2015-05-08 03:12:48",
                "commit"
            ],
            [
                "2015-05-08 03:13:28",
                "closed"
            ],
            [
                "2015-07-10 00:34:32",
                "commit"
            ],
            [
                "2015-07-15 16:58:00",
                "commit"
            ]
        ],
        "status": true,
        "strategy": true,
        "total_changes": 1118
    }
}