{
    "covered_issues": [
        688,
        681,
        677,
        672,
        671,
        670,
        667,
        660,
        650,
        646,
        638,
        637,
        635,
        634,
        603,
        602,
        600,
        595,
        594,
        592,
        582,
        576,
        574,
        571,
        570,
        569,
        568,
        567,
        564,
        561,
        547,
        545,
        542,
        539,
        525,
        523,
        522,
        520,
        519,
        513,
        509,
        508,
        504,
        493,
        492,
        488,
        484,
        480,
        479,
        478,
        471,
        469,
        466,
        465,
        463,
        462,
        460,
        459,
        458,
        457,
        453,
        447,
        444,
        443,
        442,
        441,
        437,
        436,
        435,
        434,
        432,
        430,
        429,
        428,
        426,
        418,
        416,
        415,
        414,
        411,
        410,
        408,
        396,
        395,
        390,
        387,
        386,
        382,
        380,
        378,
        376,
        375,
        374,
        372,
        368,
        366,
        362,
        361,
        357,
        355,
        354,
        353,
        352,
        351,
        349,
        346,
        345,
        341,
        337,
        336,
        335,
        333,
        331,
        330,
        327,
        325,
        322,
        316,
        313,
        309,
        307,
        303,
        302,
        301,
        299,
        293,
        292,
        290,
        288,
        287,
        286,
        283,
        281,
        279,
        276,
        269,
        268,
        267,
        261,
        259,
        258,
        256,
        255,
        253,
        246,
        233,
        230,
        227,
        226,
        217,
        214,
        212,
        211,
        207,
        204,
        201,
        198,
        194,
        192,
        191,
        190,
        186,
        182,
        180,
        175,
        165,
        164,
        161,
        157,
        156,
        152,
        151,
        149,
        148,
        145,
        143,
        142,
        141,
        140,
        139,
        138,
        135,
        134,
        132,
        131,
        124,
        123,
        122,
        119,
        115,
        114,
        113,
        111,
        110,
        108,
        107,
        106,
        105,
        103,
        98,
        97,
        96,
        91,
        86,
        84,
        83,
        80,
        78,
        76,
        75,
        74,
        73,
        69,
        67,
        66,
        59,
        57,
        56,
        55,
        53,
        52,
        51,
        50,
        49,
        47,
        46,
        41,
        40,
        37,
        36,
        34,
        33,
        31,
        29,
        28,
        27,
        18,
        15,
        10,
        9,
        7,
        3,
        1
    ],
    "finished": true
}