{
    "covered_issues": [
        5465,
        5462,
        5459,
        5458,
        5457,
        5454,
        5452,
        5449,
        5445,
        5444,
        5441,
        5440,
        5439,
        5438,
        5437,
        5433,
        5432,
        5430,
        5418,
        5414,
        5413,
        5412,
        5411,
        5410,
        5409,
        5407,
        5405,
        5402,
        5400,
        5394,
        5390,
        5389,
        5388,
        5384,
        5380,
        5379,
        5377,
        5375,
        5373,
        5368,
        5367,
        5366,
        5365,
        5364,
        5363,
        5362,
        5360,
        5358,
        5357,
        5356,
        5355,
        5352,
        5350,
        5349,
        5347,
        5346,
        5338,
        5337,
        5331,
        5330,
        5329,
        5328,
        5327,
        5326,
        5324,
        5322,
        5320,
        5316,
        5315,
        5313,
        5310,
        5308,
        5307,
        5302,
        5300,
        5296,
        5294,
        5293,
        5291,
        5290,
        5285,
        5284,
        5282,
        5281,
        5280,
        5279,
        5278,
        5277,
        5274,
        5273,
        5271,
        5268,
        5267,
        5263,
        5260,
        5259,
        5258,
        5256,
        5254,
        5253,
        5252,
        5251,
        5250,
        5248,
        5247,
        5246,
        5244,
        5241,
        5240,
        5239,
        5238,
        5237,
        5235,
        5233,
        5231,
        5229,
        5227,
        5223,
        5222,
        5221,
        5220,
        5219,
        5213,
        5212,
        5211,
        5210,
        5208,
        5207,
        5206,
        5204,
        5203,
        5202,
        5200,
        5199,
        5196,
        5195,
        5193,
        5192,
        5190,
        5187,
        5186,
        5184,
        5181,
        5180,
        5179,
        5178,
        5175,
        5174,
        5173,
        5171,
        5170,
        5169,
        5168,
        5167,
        5166,
        5165,
        5163,
        5161,
        5160,
        5159,
        5158,
        5157,
        5155,
        5154,
        5152,
        5151,
        5148,
        5147,
        5146,
        5145,
        5144,
        5142,
        5141,
        5140,
        5139,
        5137,
        5136,
        5135,
        5133,
        5132,
        5131,
        5130,
        5125,
        5124,
        5123,
        5122,
        5120,
        5119,
        5117,
        5115,
        5113,
        5111,
        5109,
        5105,
        5104,
        5103,
        5102,
        5101,
        5100,
        5098,
        5097,
        5094,
        5093,
        5091,
        5090,
        5089,
        5088,
        5086,
        5085,
        5083,
        5080,
        5078,
        5075,
        5074,
        5071,
        5068,
        5065,
        5061,
        5058,
        5057,
        5056,
        5055,
        5053,
        5050,
        5048,
        5047,
        5046,
        5045,
        5044,
        5042,
        5041,
        5040,
        5038,
        5037,
        5035,
        5034,
        5031,
        5029,
        5025,
        5024,
        5022,
        5018,
        5017,
        5016,
        5013,
        5012,
        5011,
        5010,
        5008,
        5006,
        5005,
        5004,
        5002,
        5000,
        4997,
        4996,
        4994,
        4993,
        4992,
        4991,
        4985,
        4984,
        4983,
        4980,
        4978,
        4977,
        4976,
        4974,
        4972,
        4970,
        4967,
        4966,
        4963,
        4962,
        4960,
        4956,
        4954,
        4951,
        4950,
        4949,
        4948,
        4946,
        4945,
        4943,
        4941,
        4937,
        4936,
        4935,
        4931,
        4928,
        4927,
        4926,
        4925,
        4924,
        4922,
        4921,
        4919,
        4918,
        4917,
        4916,
        4914,
        4911,
        4910,
        4909,
        4908,
        4907,
        4906,
        4905,
        4903,
        4902,
        4901,
        4899,
        4898,
        4896,
        4895,
        4894,
        4893,
        4890,
        4889,
        4888,
        4886,
        4885,
        4884,
        4883,
        4881,
        4879,
        4878,
        4875,
        4874,
        4873,
        4872,
        4871,
        4869,
        4868,
        4867,
        4866,
        4865,
        4863,
        4861,
        4859,
        4858,
        4855,
        4854,
        4852,
        4849,
        4848,
        4846,
        4843,
        4842,
        4841,
        4839,
        4834,
        4833,
        4831,
        4830,
        4826,
        4825,
        4823,
        4820,
        4818,
        4817,
        4816,
        4814,
        4812,
        4811,
        4809,
        4805,
        4804,
        4803,
        4798,
        4797,
        4796,
        4795,
        4792,
        4791,
        4789,
        4788,
        4787,
        4786,
        4785,
        4784,
        4782,
        4781,
        4780,
        4779,
        4778,
        4777,
        4776,
        4775,
        4773,
        4771,
        4770,
        4769,
        4768,
        4767,
        4766,
        4763,
        4762,
        4759,
        4755,
        4754,
        4753,
        4752,
        4749,
        4748,
        4747,
        4742,
        4740,
        4739,
        4735,
        4732,
        4730,
        4729,
        4728,
        4727,
        4726,
        4724,
        4723,
        4718,
        4717,
        4716,
        4715,
        4714,
        4711,
        4710,
        4708,
        4706,
        4705,
        4704,
        4703,
        4701,
        4700,
        4693,
        4692,
        4691,
        4689,
        4683,
        4681,
        4680,
        4679,
        4677,
        4676,
        4675,
        4674,
        4672,
        4670,
        4669,
        4668,
        4667,
        4666,
        4664,
        4661,
        4659,
        4658,
        4657,
        4655,
        4654,
        4653,
        4687,
        4652,
        4649,
        4647,
        4646,
        4645,
        4644,
        4643,
        4642,
        4640,
        4638,
        4637,
        4636,
        4635,
        4634,
        4632,
        4631,
        4630,
        4627,
        4625,
        4624,
        4623,
        4622,
        4621,
        4618,
        4615,
        4614,
        4612,
        4610,
        4609,
        4607,
        4606,
        4605,
        4602,
        4598,
        4597,
        4596,
        4594,
        4593,
        4591,
        4590,
        4587,
        4585,
        4584,
        4581,
        4577,
        4575,
        4572,
        4571,
        4570,
        4568,
        4566,
        4565,
        4564,
        4563,
        4562,
        4558,
        4556,
        4555,
        4554,
        4553,
        4552,
        4550,
        4549,
        4548,
        4547,
        4546,
        4543,
        4542,
        4541,
        4540,
        4539,
        4537,
        4536,
        4534,
        4532,
        4529,
        4528,
        4527,
        4526,
        4525,
        4524,
        4523,
        4522,
        4521,
        4519,
        4518,
        4517,
        4516,
        4513,
        4511,
        4509,
        4506,
        4505,
        4504,
        4503,
        4501,
        4500,
        4499,
        4498,
        4497,
        4496,
        4495,
        4493,
        4491,
        4486,
        4485,
        4484,
        4480,
        4479,
        4478,
        4477,
        4475,
        4474,
        4472,
        4469,
        4468,
        4467,
        4466,
        4464,
        4462,
        4459,
        4458,
        4452,
        4449,
        4448,
        4447,
        4446,
        4444,
        4443,
        4441,
        4440,
        4438,
        4435,
        4434,
        4430,
        4429,
        4427,
        4425,
        4423,
        4422,
        4420,
        4419,
        4418,
        4416,
        4415,
        4412,
        4411,
        4410,
        4407,
        4406,
        4405,
        4404,
        4403,
        4402,
        4401,
        4400,
        4399,
        4398,
        4397,
        4392,
        4389,
        4388,
        4386,
        4385,
        4381,
        4380,
        4376,
        4374,
        4373,
        4372,
        4371,
        4369,
        4368,
        4367,
        4363,
        4361,
        4359,
        4358,
        4356,
        4353,
        4349,
        4348,
        4346,
        4345,
        4342,
        4341,
        4340,
        4338,
        4336,
        4335,
        4334,
        4332,
        4331,
        4330,
        4329,
        4328,
        4327,
        4324,
        4323,
        4321,
        4320,
        4319,
        4318,
        4317,
        4313,
        4312,
        4311,
        4310,
        4307,
        4306,
        4305,
        4304,
        4303,
        4302,
        4301,
        4300,
        4299,
        4298,
        4292,
        4291,
        4289,
        4288,
        4287,
        4286,
        4284,
        4282,
        4281,
        4280,
        4279,
        4278,
        4276,
        4275,
        4274,
        4273,
        4272,
        4270,
        4265,
        4264,
        4263,
        4262,
        4261,
        4260,
        4259,
        4258,
        4257,
        4256,
        4254,
        4253,
        4251,
        4250,
        4248,
        4247,
        4246,
        4245,
        4244,
        4242,
        4241,
        4240,
        4239,
        4238,
        4237,
        4236,
        4235,
        4234,
        4233,
        4230,
        4229,
        4228,
        4227,
        4224,
        4223,
        4222,
        4221,
        4220,
        4219,
        4217,
        4216,
        4213,
        4212,
        4211,
        4210,
        4209,
        4208,
        4207,
        4206,
        4203,
        4202,
        4201,
        4200,
        4198,
        4197,
        4196,
        4195,
        4193,
        4191,
        4189,
        4188,
        4187,
        4186,
        4185,
        4184,
        4183,
        4182,
        4181,
        4179,
        4178,
        4176,
        4173,
        4172,
        4171,
        4165,
        4164,
        4163,
        4162,
        4161,
        4159,
        4157,
        4155,
        4154,
        4153,
        4151,
        4150,
        4149,
        4148,
        4147,
        4145,
        4144,
        4143,
        4142,
        4141,
        4137,
        4136,
        4135,
        4134,
        4133,
        4131,
        4130,
        4128,
        4127,
        4126,
        4125,
        4124,
        4123,
        4122,
        4121,
        4120,
        4119,
        4118,
        4117,
        4116,
        4115,
        4114,
        4113,
        4112,
        4111,
        4110,
        4108,
        4107,
        4105,
        4104,
        4103,
        4102,
        4101,
        4100,
        4099,
        4098,
        4097,
        4096,
        4095,
        4094,
        4091,
        4090,
        4089,
        4088,
        4087,
        4086,
        4085,
        4084,
        4082,
        4081,
        4080,
        4079,
        4078,
        4077,
        4074,
        4072,
        4070,
        4068,
        4066,
        4065,
        4064,
        4062,
        4061,
        4060,
        4058,
        4055,
        4053,
        4052,
        4049,
        4048,
        4047,
        4046,
        4045,
        4044,
        4043,
        4041,
        4040,
        4038,
        4037,
        4036,
        4035,
        4034,
        4032,
        4031,
        4029,
        4028,
        4027,
        4026,
        4025,
        4024,
        4023,
        4022,
        4021,
        4020,
        4019,
        4018,
        4015,
        4014,
        4013,
        4009,
        4007,
        4006,
        4004,
        4003,
        4002,
        4001,
        4000,
        3999,
        3998,
        3997,
        3996,
        3994,
        3993,
        3992,
        3991,
        3990,
        3989,
        3988,
        3986,
        3985,
        3983,
        3982,
        3981,
        3980,
        3979,
        3978,
        3977,
        3976,
        3972,
        3969,
        3968,
        3964,
        3963,
        3962,
        3960,
        3959,
        3957,
        3956,
        3955,
        3954,
        3953,
        3952,
        3951,
        3950,
        3949,
        3948,
        3947,
        3945,
        3944,
        3943,
        3941,
        3939,
        3938,
        3937,
        3936,
        3935,
        3934,
        3933,
        3931,
        3930,
        3929,
        3928,
        3924,
        3921,
        3920,
        3918,
        3917,
        3916,
        3915,
        3914,
        3913,
        3912,
        3911,
        3910,
        3909,
        3908,
        3907,
        3906,
        3904,
        3902,
        3901,
        3900,
        3897,
        3896,
        3895,
        3893,
        3892,
        3891,
        3886,
        3885,
        3884,
        3883,
        3880,
        3879,
        3878,
        3877,
        3876,
        3875,
        3874,
        3873,
        3872,
        3868,
        3867,
        3866,
        3864,
        3863,
        3862,
        3861,
        3860,
        3857,
        3856,
        3855,
        3854,
        3852,
        3851,
        3850,
        3848,
        3847,
        3846,
        3845,
        3844,
        3843,
        3842,
        3841,
        3839,
        3838,
        3837,
        3836,
        3835,
        3834,
        3833,
        3832,
        3831,
        3830,
        3829,
        3828,
        3826,
        3825,
        3824,
        3823,
        3821,
        3820,
        3818,
        3817,
        3816,
        3814,
        3813,
        3812,
        3810,
        3809,
        3808,
        3807,
        3806,
        3805,
        3804,
        3803,
        3802,
        3800,
        3798,
        3797,
        3796,
        3795,
        3794,
        3793,
        3792,
        3791,
        3789,
        3787,
        3786,
        3785,
        3784,
        3783,
        3782,
        3780,
        3779,
        3778,
        3777,
        3776,
        3775,
        3774,
        3772,
        3769,
        3768,
        3767,
        3765,
        3764,
        3763,
        3762,
        3761,
        3760,
        3758,
        3757,
        3756,
        3755,
        3753,
        3752,
        3751,
        3748,
        3747,
        3746,
        3745,
        3744,
        3743,
        3742,
        3741,
        3740,
        3739,
        3737,
        3736,
        3732,
        3731,
        3730,
        3729,
        3728,
        3727,
        3726,
        3725,
        3724,
        3723,
        3721,
        3718,
        3717,
        3716,
        3715,
        3714,
        3713,
        3712,
        3709,
        3707,
        3705,
        3704,
        3703,
        3702,
        3700,
        3699,
        3698,
        3697,
        3696,
        3694,
        3693,
        3691,
        3689,
        3688,
        3687,
        3685,
        3684,
        3683,
        3676,
        3675,
        3674,
        3673,
        3671,
        3670,
        3669,
        3668,
        3667,
        3666,
        3665,
        3664,
        3659,
        3658,
        3656,
        3654,
        3653,
        3652,
        3643,
        3637,
        3636,
        3635,
        3634,
        3632,
        3630,
        3629,
        3627,
        3626,
        3625,
        3624,
        3623,
        3622,
        3621,
        3620,
        3619,
        3618,
        3617,
        3616,
        3614,
        3612,
        3604,
        3596,
        3595,
        3594,
        3593,
        3592,
        3591,
        3590,
        3589,
        3587,
        3583,
        3582,
        3581,
        3577,
        3575,
        3574,
        3572,
        3571,
        3570,
        3568,
        3566,
        3564,
        3563,
        3561,
        3560,
        3559,
        3558,
        3557,
        3553,
        3551,
        3548,
        3547,
        3545,
        3544,
        3543,
        3542,
        3541,
        3540,
        3539,
        3538,
        3534,
        3533,
        3532,
        3531,
        3530,
        3528,
        3527,
        3526,
        3525,
        3523,
        3522,
        3520,
        3519,
        3518,
        3515,
        3513,
        3511,
        3509,
        3506,
        3505,
        3504,
        3503,
        3502,
        3501,
        3500,
        3499,
        3498,
        3496,
        3495,
        3493,
        3491,
        3488,
        3487,
        3486,
        3485,
        3484,
        3480,
        3478,
        3477,
        3476,
        3475,
        3474,
        3472,
        3471,
        3470,
        3469,
        3462,
        3461,
        3460,
        3459,
        3458,
        3457,
        3455,
        3454,
        3453,
        3451,
        3449,
        3447,
        3446,
        3445,
        3442,
        3441,
        3440,
        3439,
        3438,
        3436,
        3435,
        3434,
        3433,
        3432,
        3431,
        3430,
        3425,
        3424,
        3421,
        3419,
        3418,
        3412,
        3411,
        3410,
        3409,
        3408,
        3407,
        3406,
        3405,
        3403,
        3402,
        3401,
        3397,
        3396,
        3392,
        3390,
        3389,
        3388,
        3386,
        3385,
        3383,
        3382,
        3381,
        3377,
        3375,
        3374,
        3371,
        3370,
        3369,
        3367,
        3364,
        3363,
        3362,
        3361,
        3360,
        3359,
        3358,
        3357,
        3356,
        3355,
        3352,
        3351,
        3350,
        3349,
        3347,
        3346,
        3345,
        3344,
        3341,
        3340,
        3339,
        3338,
        3337,
        3336,
        3335,
        3334,
        3331,
        3330,
        3329,
        3328,
        3327,
        3326,
        3325,
        3324,
        3322,
        3321,
        3320,
        3319,
        3318,
        3317,
        3315,
        3314,
        3313,
        3312,
        3311,
        3310,
        3309,
        3308,
        3307,
        3306,
        3304,
        3303,
        3302,
        3301,
        3300,
        3299,
        3297,
        3296,
        3295,
        3294,
        3293,
        3290,
        3289,
        3288,
        3287,
        3286,
        3285,
        3284,
        3283,
        3281,
        3280,
        3278,
        3277,
        3274,
        3273,
        3272,
        3271,
        3270,
        3269,
        3267,
        3266,
        3265,
        3264,
        3263,
        3259,
        3258,
        3257,
        3255,
        3254,
        3253,
        3252,
        3251,
        3248,
        3247,
        3246,
        3245,
        3244,
        3242,
        3240,
        3236,
        3235,
        3234,
        3233,
        3232,
        3231,
        3228,
        3227,
        3225,
        3224,
        3219,
        3218,
        3216,
        3215,
        3214,
        3213,
        3212,
        3211,
        3209,
        3208,
        3207,
        3206,
        3205,
        3204,
        3203,
        3202,
        3201,
        3200,
        3198,
        3197,
        3196,
        3195,
        3193,
        3192,
        3191,
        3190,
        3188,
        3187,
        3186,
        3184,
        3183,
        3182,
        3181,
        3180,
        3179,
        3177,
        3174,
        3173,
        3172,
        3171,
        3169,
        3167,
        3166,
        3165,
        3163,
        3162,
        3161,
        3160,
        3157,
        3156,
        3154,
        3153,
        3152,
        3150,
        3149,
        3148,
        3147,
        3146,
        3145,
        3144,
        3143,
        3142,
        3141,
        3140,
        3138,
        3136,
        3135,
        3134,
        3133,
        3132,
        3130,
        3129,
        3128,
        3127,
        3126,
        3125,
        3124,
        3123,
        3122,
        3121,
        3120,
        3119,
        3118,
        3117,
        3116,
        3115,
        3114,
        3113,
        3112,
        3111,
        3108,
        3106,
        3105,
        3104,
        3103,
        3102,
        3101,
        3100,
        3097,
        3096,
        3095,
        3093,
        3092,
        3089,
        3087,
        3084,
        3083,
        3082,
        3081,
        3080,
        3079,
        3078,
        3077,
        3076,
        3075,
        3074,
        3073,
        3071,
        3070,
        3069,
        3068,
        3067,
        3065,
        3064,
        3063,
        3062,
        3061,
        3060,
        3059,
        3057,
        3056,
        3055,
        3054,
        3053,
        3051,
        3050,
        3049,
        3048,
        3047,
        3046,
        3045,
        3043,
        3042,
        3040,
        3037,
        3035,
        3034,
        3033,
        3032,
        3031,
        3030,
        3028,
        3027,
        3025,
        3022,
        3021,
        3020,
        3019,
        3018,
        3017,
        3016,
        3015,
        3014,
        3013,
        3012,
        3011,
        3010,
        3009,
        3007,
        3006,
        3005,
        3003,
        3002,
        3001,
        3000,
        2999,
        2998,
        2997,
        2996,
        2995,
        2990,
        2988,
        2985,
        2983,
        2982,
        2981,
        2980,
        2979,
        2978,
        2977,
        2976,
        2975,
        2974,
        2973,
        2972,
        2971,
        2968,
        2967,
        2966,
        2965,
        2963,
        2962,
        2961,
        2960,
        2958,
        2957,
        2956,
        2955,
        2954,
        2953,
        2952,
        2951,
        2950,
        2949,
        2948,
        2947,
        2946,
        2944,
        2943,
        2941,
        2940,
        2939,
        2938,
        2937,
        2936,
        2935,
        2934,
        2933,
        2932,
        2931,
        2929,
        2928,
        2927,
        2926,
        2925,
        2924,
        2923,
        2922,
        2921,
        2920,
        2919,
        2918,
        2917,
        2916,
        2915,
        2914,
        2913,
        2912,
        2911,
        2910,
        2909,
        2906,
        2905,
        2904,
        2903,
        2902,
        2900,
        2899,
        2898,
        2897,
        2896,
        2895,
        2894,
        2893,
        2891,
        2890,
        2889,
        2888,
        2886,
        2885,
        2881,
        2880,
        2879,
        2877,
        2876,
        2875,
        2874,
        2871,
        2870,
        2869,
        2868,
        2867,
        2866,
        2865,
        2864,
        2863,
        2861,
        2860,
        2859,
        2858,
        2857,
        2856,
        2855,
        2853,
        2852,
        2851,
        2850,
        2849,
        2846,
        2845,
        2844,
        2843,
        2842,
        2841,
        2840,
        2839,
        2838,
        2837,
        2836,
        2835,
        2834,
        2833,
        2832,
        2830,
        2827,
        2826,
        2825,
        2824,
        2823,
        2822,
        2821,
        2819,
        2818,
        2817,
        2816,
        2815,
        2814,
        2813,
        2812,
        2811,
        2809,
        2808,
        2807,
        2806,
        2805,
        2804,
        2803,
        2802,
        2800,
        2799,
        2798,
        2796,
        2795,
        2794,
        2793,
        2792,
        2790,
        2789,
        2788,
        2787,
        2786,
        2785,
        2783,
        2782,
        2781,
        2780,
        2779,
        2777,
        2776,
        2775,
        2774,
        2773,
        2771,
        2770,
        2769,
        2768,
        2767,
        2766,
        2765,
        2764,
        2763,
        2762,
        2761,
        2760,
        2757,
        2756,
        2755,
        2754,
        2753,
        2751,
        2750,
        2749,
        2748,
        2747,
        2746,
        2745,
        2744,
        2743,
        2742,
        2740,
        2738,
        2737,
        2736,
        2735,
        2734,
        2733,
        2732,
        2731,
        2730,
        2729,
        2728,
        2726,
        2724,
        2723,
        2722,
        2721,
        2719,
        2718,
        2717,
        2714,
        2713,
        2710,
        2708,
        2706,
        2705,
        2704,
        2703,
        2702,
        2701,
        2700,
        2699,
        2698,
        2697,
        2695,
        2694,
        2693,
        2692,
        2691,
        2690,
        2689,
        2687,
        2686,
        2685,
        2684,
        2683,
        2682,
        2681,
        2680,
        2677,
        2676,
        2673,
        2672,
        2671,
        2670,
        2669,
        2668,
        2667,
        2666,
        2665,
        2664,
        2663,
        2662,
        2660,
        2659,
        2657,
        2656,
        2652,
        2651,
        2650,
        2649,
        2648,
        2647,
        2646,
        2645,
        2644,
        2642,
        2641,
        2639,
        2638,
        2637,
        2636,
        2634,
        2633,
        2632,
        2630,
        2628,
        2627,
        2626,
        2625,
        2624,
        2623,
        2620,
        2619,
        2618,
        2617,
        2616,
        2615,
        2614,
        2612,
        2611,
        2610,
        2609,
        2608,
        2606,
        2603,
        2601,
        2598,
        2597,
        2596,
        2595,
        2594,
        2592,
        2591,
        2589,
        2588,
        2587,
        2585,
        2584,
        2583,
        2582,
        2581,
        2580,
        2579,
        2576,
        2575,
        2574,
        2571,
        2570,
        2569,
        2568,
        2567,
        2566,
        2565,
        2564,
        2563,
        2562,
        2561,
        2560,
        2558,
        2557,
        2555,
        2553,
        2552,
        2551,
        2550,
        2549,
        2548,
        2547,
        2546,
        2545,
        2544,
        2543,
        2542,
        2540,
        2539,
        2538,
        2537,
        2536,
        2535,
        2534,
        2532,
        2531,
        2530,
        2529,
        2528,
        2527,
        2525,
        2522,
        2521,
        2520,
        2519,
        2518,
        2517,
        2516,
        2515,
        2513,
        2512,
        2511,
        2510,
        2509,
        2508,
        2507,
        2506,
        2505,
        2504,
        2503,
        2502,
        2501,
        2498,
        2497,
        2496,
        2494,
        2493,
        2492,
        2491,
        2490,
        2489,
        2487,
        2485,
        2484,
        2483,
        2482,
        2481,
        2480,
        2479,
        2478,
        2477,
        2475,
        2473,
        2472,
        2471,
        2470,
        2469,
        2468,
        2467,
        2466,
        2465,
        2463,
        2462,
        2460,
        2459,
        2458,
        2457,
        2456,
        2454,
        2453,
        2452,
        2451,
        2450,
        2449,
        2448,
        2447,
        2446,
        2444,
        2443,
        2442,
        2441,
        2440,
        2439,
        2438,
        2437,
        2436,
        2435,
        2434,
        2433,
        2432,
        2431,
        2430,
        2429,
        2427,
        2426,
        2425,
        2424,
        2423,
        2422,
        2421,
        2420,
        2418,
        2417,
        2416,
        2415,
        2414,
        2413,
        2412,
        2411,
        2410,
        2409,
        2408,
        2407,
        2406,
        2405,
        2404,
        2403,
        2402,
        2401,
        2400,
        2396,
        2395,
        2394,
        2392,
        2391,
        2389,
        2382,
        2381,
        2378,
        2377,
        2374,
        2373,
        2372,
        2371,
        2370,
        2368,
        2365,
        2364,
        2363,
        2362,
        2361,
        2360,
        2359,
        2358,
        2356,
        2355,
        2354,
        2352,
        2350,
        2349,
        2348,
        2347,
        2345,
        2344,
        2343,
        2342,
        2341,
        2340,
        2338,
        2337,
        2336,
        2334,
        2333,
        2332,
        2330,
        2328,
        2327,
        2326,
        2324,
        2323,
        2322,
        2320,
        2319,
        2318,
        2317,
        2316,
        2315,
        2314,
        2313,
        2312,
        2309,
        2308,
        2307,
        2306,
        2301,
        2300,
        2299,
        2298,
        2296,
        2295,
        2294,
        2293,
        2292,
        2290,
        2289,
        2286,
        2285,
        2284,
        2283,
        2282,
        2280,
        2278,
        2277,
        2276,
        2275,
        2274,
        2273,
        2272,
        2271,
        2270,
        2269,
        2268,
        2267,
        2265,
        2260,
        2259,
        2258,
        2257,
        2256,
        2255,
        2254,
        2253,
        2251,
        2250,
        2249,
        2248,
        2247,
        2246,
        2245,
        2244,
        2243,
        2240,
        2239,
        2237,
        2236,
        2235,
        2232,
        2231,
        2230,
        2229,
        2226,
        2225,
        2224,
        2223,
        2221,
        2220,
        2219,
        2218,
        2217,
        2216,
        2214,
        2212,
        2211,
        2210,
        2209,
        2208,
        2207,
        2206,
        2205,
        2204,
        2203,
        2201,
        2200,
        2199,
        2197,
        2196,
        2195,
        2194,
        2193,
        2192,
        2191,
        2188,
        2187,
        2185,
        2184,
        2181,
        2179,
        2178,
        2177,
        2176,
        2175,
        2174,
        2173,
        2172,
        2171,
        2170,
        2169,
        2167,
        2166,
        2165,
        2164,
        2163,
        2162,
        2161,
        2159,
        2157,
        2155,
        2153,
        2152,
        2150,
        2149,
        2148,
        2147,
        2146,
        2145,
        2144,
        2140,
        2138,
        2137,
        2136,
        2135,
        2134,
        2133,
        2132,
        2131,
        2130,
        2128,
        2127,
        2125,
        2124,
        2123,
        2122,
        2121,
        2120,
        2119,
        2118,
        2117,
        2116,
        2115,
        2114,
        2113,
        2111,
        2110,
        2108,
        2107,
        2106,
        2105,
        2104,
        2103,
        2102,
        2101,
        2100,
        2097,
        2096,
        2095,
        2094,
        2092,
        2090,
        2088,
        2087,
        2086,
        2085,
        2084,
        2083,
        2082,
        2081,
        2080,
        2079,
        2078,
        2077,
        2076,
        2075,
        2074,
        2073,
        2072,
        2071,
        2070,
        2067,
        2066,
        2065,
        2064,
        2062,
        2061,
        2060,
        2059,
        2058,
        2057,
        2056,
        2055,
        2054,
        2053,
        2050,
        2049,
        2047,
        2044,
        2042,
        2041,
        2037,
        2035,
        2034,
        2033,
        2032,
        2031,
        2030,
        2029,
        2027,
        2026,
        2025,
        2023,
        2022,
        2020,
        2019,
        2018,
        2017,
        2016,
        2015,
        2014,
        2013,
        2011,
        2009,
        2008,
        2007,
        2006,
        2004,
        2003,
        2002,
        2001,
        2000,
        1999,
        1998,
        1997,
        1996,
        1995,
        1994,
        1991,
        1989,
        1988,
        1987,
        1986,
        1985,
        1984,
        1983,
        1982,
        1981,
        1980,
        1979,
        1978,
        1977,
        1976,
        1975,
        1974,
        1973,
        1972,
        1971,
        1970,
        1968,
        1967,
        1966,
        1965,
        1964,
        1963,
        1962,
        1961,
        1960,
        1959,
        1958,
        1954,
        1953,
        1952,
        1951,
        1950,
        1949,
        1948,
        1947,
        1945,
        1944,
        1943,
        1939,
        1938,
        1936,
        1935,
        1934,
        1933,
        1932,
        1930,
        1929,
        1928,
        1927,
        1925,
        1924,
        1923,
        1921,
        1920,
        1919,
        1917,
        1916,
        1915,
        1914,
        1913,
        1912,
        1911,
        1910,
        1909,
        1908,
        1907,
        1904,
        1903,
        1902,
        1900,
        1898,
        1897,
        1896,
        1895,
        1894,
        1893,
        1892,
        1882,
        1880,
        1878,
        1877,
        1875,
        1874,
        1871,
        1870,
        1869,
        1866,
        1865,
        1863,
        1861,
        1859,
        1858,
        1857,
        1855,
        1854,
        1853,
        1852,
        1851,
        1850,
        1848,
        1847,
        1846,
        1845,
        1844,
        1843,
        1842,
        1840,
        1839,
        1838,
        1837,
        1836,
        1835,
        1834,
        1833,
        1832,
        1831,
        1830,
        1829,
        1828,
        1827,
        1826,
        1823,
        1821,
        1816,
        1815,
        1814,
        1813,
        1811,
        1810,
        1809,
        1808,
        1805,
        1802,
        1800,
        1798,
        1797,
        1796,
        1795,
        1794,
        1792,
        1791,
        1787,
        1786,
        1785,
        1784,
        1782,
        1781,
        1780,
        1778,
        1777,
        1775,
        1774,
        1773,
        1772,
        1771,
        1770,
        1769,
        1768,
        1767,
        1766,
        1765,
        1764,
        1763,
        1762,
        1761,
        1760,
        1759,
        1758,
        1756,
        1755,
        1754,
        1753,
        1752,
        1751,
        1750,
        1748,
        1747,
        1746,
        1744,
        1742,
        1741,
        1740,
        1739,
        1737,
        1736,
        1735,
        1733,
        1732,
        1731,
        1730,
        1729,
        1728,
        1727,
        1726,
        1725,
        1724,
        1723,
        1721,
        1720,
        1719,
        1718,
        1717,
        1716,
        1715,
        1714,
        1713,
        1712,
        1711,
        1709,
        1708,
        1707,
        1706,
        1705,
        1704,
        1701,
        1700,
        1699,
        1698,
        1697,
        1696,
        1695,
        1694,
        1693,
        1692,
        1689,
        1688,
        1686,
        1684,
        1683,
        1682,
        1680,
        1679,
        1677,
        1675,
        1674,
        1673,
        1672,
        1671,
        1670,
        1669,
        1668,
        1667,
        1666,
        1665,
        1664,
        1663,
        1662,
        1661,
        1660,
        1659,
        1658,
        1657,
        1655,
        1654,
        1653,
        1652,
        1651,
        1650,
        1649,
        1648,
        1647,
        1646,
        1645,
        1644,
        1643,
        1642,
        1641,
        1640,
        1639,
        1638,
        1637,
        1636,
        1635,
        1634,
        1633,
        1632,
        1631,
        1630,
        1628,
        1627,
        1626,
        1625,
        1624,
        1623,
        1622,
        1621,
        1620,
        1619,
        1618,
        1617,
        1616,
        1615,
        1614,
        1613,
        1612,
        1611,
        1610,
        1609,
        1608,
        1607,
        1606,
        1605,
        1604,
        1603,
        1602,
        1601,
        1600,
        1599,
        1598,
        1597,
        1596,
        1595,
        1594,
        1593,
        1592,
        1591,
        1590,
        1589,
        1588,
        1587,
        1586,
        1585,
        1584,
        1583,
        1581,
        1580,
        1579,
        1578,
        1577,
        1576,
        1575,
        1574,
        1573,
        1572,
        1571,
        1570,
        1569,
        1567,
        1566,
        1565,
        1564,
        1563,
        1562,
        1561,
        1560,
        1559,
        1558,
        1557,
        1556,
        1555,
        1554,
        1553,
        1551,
        1550,
        1548,
        1547,
        1546,
        1545,
        1544,
        1543,
        1542,
        1541,
        1538,
        1536,
        1533,
        1532,
        1530,
        1529,
        1528,
        1527,
        1526,
        1525,
        1521,
        1520,
        1517,
        1516,
        1514,
        1513,
        1512,
        1511,
        1510,
        1509,
        1508,
        1507,
        1506,
        1504,
        1503,
        1502,
        1501,
        1500,
        1499,
        1498,
        1497,
        1496,
        1495,
        1494,
        1493,
        1491,
        1490,
        1488,
        1487,
        1486,
        1485,
        1484,
        1482,
        1479,
        1476,
        1475,
        1474,
        1473,
        1471,
        1470,
        1469,
        1468,
        1467,
        1466,
        1465,
        1464,
        1463,
        1462,
        1461,
        1460,
        1459,
        1458,
        1456,
        1454,
        1452,
        1451,
        1450,
        1448,
        1447,
        1446,
        1444,
        1443,
        1442,
        1441,
        1440,
        1439,
        1438,
        1436,
        1435,
        1434,
        1433,
        1432,
        1431,
        1428,
        1427,
        1426,
        1425,
        1424,
        1423,
        1420,
        1418,
        1417,
        1416,
        1414,
        1412,
        1409,
        1408,
        1407,
        1406,
        1404,
        1403,
        1402,
        1401,
        1399,
        1398,
        1396,
        1395,
        1394,
        1393,
        1392,
        1390,
        1389,
        1388,
        1387,
        1384,
        1383,
        1382,
        1381,
        1379,
        1377,
        1375,
        1374,
        1373,
        1372,
        1370,
        1369,
        1367,
        1366,
        1365,
        1364,
        1363,
        1362,
        1359,
        1358,
        1357,
        1356,
        1355,
        1354,
        1353,
        1352,
        1351,
        1349,
        1347,
        1346,
        1345,
        1344,
        1343,
        1342,
        1341,
        1340,
        1339,
        1336,
        1335,
        1334,
        1333,
        1332,
        1331,
        1330,
        1329,
        1328,
        1327,
        1325,
        1323,
        1322,
        1321,
        1320,
        1319,
        1318,
        1317,
        1315,
        1314,
        1313,
        1312,
        1311,
        1309,
        1308,
        1307,
        1306,
        1305,
        1304,
        1303,
        1302,
        1301,
        1300,
        1299,
        1298,
        1297,
        1296,
        1295,
        1294,
        1293,
        1292,
        1291,
        1290,
        1289,
        1288,
        1286,
        1284,
        1283,
        1281,
        1280,
        1279,
        1278,
        1277,
        1276,
        1275,
        1274,
        1273,
        1272,
        1271,
        1269,
        1268,
        1267,
        1266,
        1265,
        1264,
        1263,
        1262,
        1261,
        1260,
        1259,
        1257,
        1256,
        1255,
        1254,
        1253,
        1252,
        1251,
        1250,
        1249,
        1248,
        1247,
        1246,
        1245,
        1243,
        1242,
        1241,
        1240,
        1239,
        1238,
        1237,
        1235,
        1233,
        1232,
        1231,
        1230,
        1229,
        1228,
        1227,
        1226,
        1225,
        1222,
        1221,
        1220,
        1219,
        1218,
        1217,
        1216,
        1215,
        1214,
        1213,
        1212,
        1210,
        1209,
        1208,
        1207,
        1206,
        1205,
        1204,
        1203,
        1200,
        1199,
        1198,
        1197,
        1196,
        1195,
        1194,
        1193,
        1192,
        1191,
        1189,
        1187,
        1186,
        1185,
        1184,
        1183,
        1182,
        1181,
        1180,
        1179,
        1178,
        1177,
        1176,
        1175,
        1174,
        1172,
        1171,
        1170,
        1169,
        1168,
        1167,
        1166,
        1165,
        1164,
        1161,
        1160,
        1159,
        1158,
        1157,
        1156,
        1155,
        1154,
        1153,
        1152,
        1151,
        1150,
        1149,
        1148,
        1147,
        1146,
        1143,
        1142,
        1141,
        1140,
        1138,
        1137,
        1135,
        1134,
        1133,
        1132,
        1131,
        1129,
        1128,
        1127,
        1126,
        1124,
        1123,
        1122,
        1121,
        1120,
        1119,
        1118,
        1117,
        1116,
        1115,
        1114,
        1113,
        1110,
        1109,
        1107,
        1105,
        1104,
        1102,
        1101,
        1100,
        1099,
        1098,
        1096,
        1095,
        1094,
        1093,
        1092,
        1091,
        1089,
        1087,
        1086,
        1083,
        1077,
        1075,
        1074,
        1073,
        1072,
        1071,
        1069,
        1068,
        1067,
        1065,
        1064,
        1063,
        1062,
        1061,
        1060,
        1059,
        1058,
        1057,
        1056,
        1054,
        1053,
        1052,
        1051,
        1050,
        1049,
        1048,
        1047,
        1046,
        1045,
        1044,
        1043,
        1042,
        1040,
        1039,
        1038,
        1037,
        1036,
        1035,
        1034,
        1033,
        1032,
        1029,
        1028,
        1027,
        1026,
        1025,
        1023,
        1022,
        1021,
        1020,
        1017,
        1016,
        1015,
        1014,
        1011,
        1010,
        1009,
        1008,
        1005,
        1004,
        1003,
        1002,
        1000,
        999,
        998,
        997,
        995,
        994,
        993,
        992,
        991,
        990,
        987,
        986,
        985,
        984,
        982,
        980,
        979,
        978,
        977,
        976,
        974,
        970,
        969,
        968,
        965,
        963,
        962,
        961,
        960,
        958,
        957,
        956,
        954,
        953,
        952,
        951,
        949,
        948,
        947,
        946,
        945,
        944,
        943,
        942,
        941,
        940,
        937,
        936,
        935,
        934,
        933,
        932,
        931,
        930,
        929,
        928,
        927,
        926,
        923,
        922,
        921,
        920,
        919,
        918,
        917,
        916,
        915,
        914,
        913,
        912,
        911,
        910,
        909,
        908,
        906,
        905,
        904,
        903,
        901,
        900,
        899,
        898,
        897,
        896,
        895,
        894,
        893,
        892,
        891,
        890,
        887,
        886,
        885,
        884,
        882,
        881,
        880,
        879,
        878,
        877,
        876,
        875,
        874,
        873,
        872,
        870,
        869,
        868,
        867,
        866,
        865,
        864,
        863,
        862,
        860,
        859,
        857,
        856,
        855,
        854,
        853,
        852,
        851,
        849,
        848,
        847,
        846,
        845,
        844,
        843,
        842,
        840,
        839,
        838,
        837,
        836,
        835,
        834,
        833,
        832,
        831,
        830,
        829,
        828,
        827,
        824,
        823,
        822,
        821,
        818,
        817,
        815,
        814,
        813,
        812,
        811,
        810,
        809,
        808,
        807,
        805,
        804,
        802,
        801,
        800,
        799,
        798,
        797,
        796,
        795,
        794,
        793,
        790,
        789,
        787,
        786,
        785,
        784,
        783,
        780,
        779,
        778,
        776,
        775,
        773,
        771,
        770,
        769,
        768,
        765,
        762,
        761,
        758,
        756,
        755,
        754,
        752,
        751,
        750,
        749,
        748,
        745,
        744,
        743,
        742,
        741,
        739,
        737,
        736,
        734,
        733,
        732,
        731,
        730,
        729,
        728,
        727,
        725,
        724,
        723,
        722,
        721,
        720,
        718,
        717,
        716,
        715,
        713,
        711,
        709,
        708,
        707,
        706,
        705,
        704,
        703,
        702,
        701,
        700,
        699,
        698,
        697,
        696,
        695,
        694,
        693,
        692,
        691,
        690,
        689,
        688,
        686,
        685,
        684,
        683,
        682,
        681,
        680,
        679,
        678,
        677,
        676,
        675,
        674,
        673,
        672,
        671,
        670,
        669,
        668,
        667,
        666,
        664,
        661,
        660,
        658,
        657,
        656,
        655,
        654,
        651,
        650,
        649,
        647,
        646,
        645,
        644,
        643,
        642,
        641,
        640,
        639,
        638,
        637,
        636,
        635,
        634,
        632,
        631,
        630,
        626,
        625,
        624,
        621,
        620,
        619,
        617,
        616,
        615,
        612,
        607,
        605,
        604,
        603,
        602,
        601,
        600,
        599,
        598,
        597,
        596,
        594,
        592,
        590,
        589,
        587,
        585,
        584,
        583,
        582,
        581,
        580,
        579,
        578,
        576,
        575,
        574,
        572,
        571,
        570,
        569,
        568,
        567,
        566,
        564,
        563,
        559,
        557,
        556,
        555,
        554,
        553,
        550,
        549,
        548,
        547,
        546,
        545,
        544,
        543,
        542,
        541,
        540,
        538,
        537,
        536,
        535,
        534,
        533,
        532,
        530,
        529,
        528,
        527,
        526,
        525,
        524,
        523,
        522,
        520,
        519,
        518,
        517,
        516,
        515,
        514,
        513,
        511,
        510,
        508,
        507,
        505,
        504,
        503,
        502,
        501,
        497,
        496,
        495,
        494,
        492,
        491,
        489,
        486,
        485,
        481,
        480,
        479,
        478,
        477,
        476,
        475,
        474,
        473,
        472,
        471,
        470,
        469,
        468,
        467,
        466,
        465,
        464,
        462,
        461,
        457,
        456,
        455,
        454,
        453,
        452,
        451,
        450,
        449,
        448,
        447,
        446,
        445,
        444,
        443,
        442,
        441,
        439,
        438,
        436,
        435,
        434,
        433,
        432,
        431,
        429,
        428,
        427,
        424,
        423,
        422,
        421,
        420,
        419,
        418,
        415,
        414,
        412,
        411,
        410,
        409,
        408,
        407,
        406,
        405,
        403,
        402,
        400,
        399,
        398,
        397,
        396,
        394,
        393,
        392,
        391,
        390,
        389,
        388,
        387,
        386,
        385,
        382,
        381,
        380,
        379,
        378,
        376,
        375,
        374,
        373,
        372,
        371,
        370,
        369,
        368,
        366,
        365,
        364,
        363,
        362,
        361,
        360,
        359,
        357,
        354,
        353,
        351,
        350,
        348,
        347,
        346,
        344,
        342,
        341,
        340,
        339,
        338,
        337,
        336,
        334,
        333,
        332,
        331,
        328,
        327,
        326,
        325,
        324,
        322,
        319,
        318,
        317,
        316,
        315,
        314,
        313,
        312,
        311,
        309,
        308,
        307,
        306,
        305,
        303,
        302,
        301,
        300,
        299,
        298,
        296,
        294,
        293,
        291,
        290,
        289,
        288,
        287,
        286,
        284,
        283,
        282,
        280,
        278,
        277,
        276,
        275,
        274,
        273,
        272,
        270,
        267,
        266,
        264,
        263,
        262,
        260,
        259,
        258,
        257,
        256,
        255,
        251,
        248,
        247,
        246,
        245,
        243,
        241,
        240,
        238,
        237,
        236,
        235,
        234,
        233,
        230,
        229,
        228,
        227,
        226,
        225,
        224,
        223,
        221,
        219,
        217,
        216,
        215,
        213,
        211,
        210,
        209,
        207,
        205,
        200,
        198,
        197,
        196,
        194,
        193,
        191,
        190,
        188,
        187,
        186,
        185,
        184,
        183,
        182,
        180,
        177,
        173,
        172,
        171,
        170,
        169,
        168,
        167,
        166,
        164,
        163,
        162,
        161,
        159,
        158,
        157,
        156,
        155,
        152,
        151,
        150,
        149,
        148,
        147,
        145,
        143,
        140,
        135,
        134,
        133,
        132,
        131,
        129,
        128,
        127,
        125,
        123,
        122,
        121,
        120,
        119,
        117,
        116,
        115,
        113,
        112,
        111,
        110,
        109,
        108,
        107,
        106,
        105,
        104,
        103,
        102,
        101,
        100,
        99,
        97,
        96,
        95,
        94,
        93,
        92,
        91,
        89,
        87,
        83,
        82,
        81,
        80,
        77,
        76,
        75,
        74,
        73,
        72,
        71,
        69,
        68,
        66,
        65,
        61,
        59,
        58,
        57,
        56,
        55,
        54,
        53,
        52,
        51,
        50,
        49,
        47,
        46
    ],
    "finished": true
}