{
    "category": [
        "network/protocol",
        "control flow"
    ],
    "commits": [
        {
            "associated_pull_request": [],
            "date": "2019-01-24 10:47:59",
            "diff": "",
            "diff_additions": 0,
            "diff_deletions": 0,
            "diff_file_size": 0,
            "diff_url": "https://github.com/varnishcache/varnish-cache/commit/a7bfbde470f4ea42f6d8e891457caf97030d8024.diff",
            "exists": true,
            "files": [],
            "interesting": {
                "reopen": false,
                "status": false
            },
            "is_parent": true,
            "sha": "a7bfbde470f4ea42f6d8e891457caf97030d8024"
        },
        {
            "associated_pull_request": [],
            "date": "2019-01-24 16:18:14",
            "diff": "varnishcache_varnish-cache/issue_2852/commit_1f32c1597a0927e3cd0f728069613e3377572a83.diff",
            "diff_additions": 7,
            "diff_deletions": 2,
            "diff_file_size": 4208,
            "diff_url": "https://github.com/varnishcache/varnish-cache/commit/1f32c1597a0927e3cd0f728069613e3377572a83.diff",
            "exists": true,
            "files": [
                {
                    "file_additions": 7,
                    "file_deletions": 2,
                    "file_exists": true,
                    "file_name": "bin/varnishlog/varnishlog.c",
                    "file_size": 4208
                }
            ],
            "interesting": {
                "reopen": true,
                "status": true
            },
            "is_parent": false,
            "sha": "1f32c1597a0927e3cd0f728069613e3377572a83"
        },
        {
            "associated_pull_request": [],
            "date": "2019-01-25 12:16:58",
            "diff": "varnishcache_varnish-cache/issue_2852/commit_26776d12ff3eafd233b832e2bf228d23bd44457d.diff",
            "diff_additions": 11,
            "diff_deletions": 2,
            "diff_file_size": 4208,
            "diff_url": "https://github.com/varnishcache/varnish-cache/commit/26776d12ff3eafd233b832e2bf228d23bd44457d.diff",
            "exists": true,
            "files": [
                {
                    "file_additions": 11,
                    "file_deletions": 2,
                    "file_exists": true,
                    "file_name": "bin/varnishlog/varnishlog.c",
                    "file_size": 4208
                }
            ],
            "interesting": {
                "reopen": false,
                "status": false
            },
            "is_parent": false,
            "sha": "26776d12ff3eafd233b832e2bf228d23bd44457d"
        }
    ],
    "first_commit": "2019-01-24 10:47:59",
    "last_commit": "2019-02-05 15:00:21",
    "number": 2852,
    "pull_request": "None",
    "score": {
        "accidental_reopen_likely": false,
        "all_labels": [],
        "contains_keywords": [
            "fix",
            "test"
        ],
        "fix_size": 12,
        "has_labels": [],
        "intersecting": {
            "computed_score": 0.6666666666666666,
            "final_commit_size": 12,
            "intersection_size": 8,
            "previous_commits_size": 8
        },
        "is_makefile_based": true,
        "no_new_files": [],
        "no_other_files": true,
        "num_prohibited_files": 51012,
        "prohibited_files": [
            "kill.h",
            "meminfo.h",
            "kill.h",
            "meminfo.h",
            "kill.h",
            "meminfo.h",
            "testsuite_cli_test.go",
            "testsuite_cli_test.go",
            "common.mk",
            "i3bar/include/draw_util.h"
        ],
        "reopen": true,
        "reopen_events": [
            [
                "2019-01-24 16:19:20",
                "commit"
            ],
            [
                "2019-01-24 16:19:31",
                "closed"
            ],
            [
                "2019-01-24 16:19:31",
                "commit"
            ],
            [
                "2019-01-25 11:43:54",
                "reopened"
            ],
            [
                "2019-01-25 12:33:28",
                "closed"
            ],
            [
                "2019-01-25 12:33:28",
                "commit"
            ],
            [
                "2019-02-05 15:01:29",
                "commit"
            ]
        ],
        "status": true,
        "strategy": true,
        "total_changes": 22
    }
}