{
    "commits": [
        {
            "associated_pull_request": [],
            "date": "2017-03-30 20:28:26+00:00",
            "diff": "mintty_mintty/issue_633/commit_fa1ba02f60df4f77eaa4fa3bb301169d03bcf2c5.diff",
            "diff_additions": 1,
            "diff_deletions": 1,
            "diff_file_size": 157007,
            "diff_url": "https://github.com/mintty/mintty/commit/fa1ba02f60df4f77eaa4fa3bb301169d03bcf2c5.diff",
            "exists": true,
            "files": [
                {
                    "file_additions": 1,
                    "file_deletions": 1,
                    "file_exists": true,
                    "file_name": "src/wintext.c",
                    "file_size": 157007
                }
            ],
            "interesting": {
                "reopen": false,
                "status": false
            },
            "is_parent": true,
            "sha": "fa1ba02f60df4f77eaa4fa3bb301169d03bcf2c5"
        },
        {
            "associated_pull_request": [],
            "date": "2017-03-30 20:29:26+00:00",
            "diff": "mintty_mintty/issue_633/commit_e0da54c27e6ffdcf8799ab0f08a4dde70633b13d.diff",
            "diff_additions": 11,
            "diff_deletions": 3,
            "diff_file_size": 152438,
            "diff_url": "https://github.com/mintty/mintty/commit/e0da54c27e6ffdcf8799ab0f08a4dde70633b13d.diff",
            "exists": true,
            "files": [
                {
                    "file_additions": 10,
                    "file_deletions": 2,
                    "file_exists": true,
                    "file_name": "src/child.c",
                    "file_size": 36641
                },
                {
                    "file_additions": 1,
                    "file_deletions": 1,
                    "file_exists": true,
                    "file_name": "src/wininput.c",
                    "file_size": 115797
                }
            ],
            "interesting": {
                "reopen": false,
                "status": false
            },
            "is_parent": false,
            "sha": "e0da54c27e6ffdcf8799ab0f08a4dde70633b13d"
        },
        {
            "associated_pull_request": [],
            "date": "2020-05-27 12:19:00+00:00",
            "diff": "mintty_mintty/issue_633/commit_e2831067fcefbcd5e721becaa85beae5e52d64b1.diff",
            "diff_additions": 11,
            "diff_deletions": 6,
            "diff_file_size": 255606,
            "diff_url": "https://github.com/mintty/mintty/commit/e2831067fcefbcd5e721becaa85beae5e52d64b1.diff",
            "exists": true,
            "files": [
                {
                    "file_additions": 4,
                    "file_deletions": 3,
                    "file_exists": true,
                    "file_name": "src/child.c",
                    "file_size": 36641
                },
                {
                    "file_additions": 7,
                    "file_deletions": 3,
                    "file_exists": true,
                    "file_name": "src/winmain.c",
                    "file_size": 218965
                }
            ],
            "interesting": {
                "reopen": true,
                "status": false
            },
            "is_parent": false,
            "sha": "e2831067fcefbcd5e721becaa85beae5e52d64b1"
        },
        {
            "associated_pull_request": [],
            "date": "2020-08-02 09:23:47+00:00",
            "diff": "mintty_mintty/issue_633/commit_18e41f56d24bda4d1287a4f5bf90bf2819908633.diff",
            "diff_additions": 20,
            "diff_deletions": 19,
            "diff_file_size": 371403,
            "diff_url": "https://github.com/mintty/mintty/commit/18e41f56d24bda4d1287a4f5bf90bf2819908633.diff",
            "exists": true,
            "files": [
                {
                    "file_additions": 15,
                    "file_deletions": 15,
                    "file_exists": true,
                    "file_name": "src/child.c",
                    "file_size": 36641
                },
                {
                    "file_additions": 3,
                    "file_deletions": 1,
                    "file_exists": true,
                    "file_name": "src/wininput.c",
                    "file_size": 115797
                },
                {
                    "file_additions": 2,
                    "file_deletions": 3,
                    "file_exists": true,
                    "file_name": "src/winmain.c",
                    "file_size": 218965
                }
            ],
            "interesting": {
                "reopen": false,
                "status": false
            },
            "is_parent": false,
            "sha": "18e41f56d24bda4d1287a4f5bf90bf2819908633"
        }
    ],
    "first_commit": "2017-03-30 20:28:26+00:00",
    "last_commit": "2020-08-02 09:23:47+00:00",
    "number": 633,
    "pull_request": "None",
    "score": {
        "accidental_reopen_likely": false,
        "all_labels": [],
        "contains_keywords": [
            "work",
            "fix"
        ],
        "fix_size": 54,
        "has_labels": [],
        "intersecting": {
            "computed_score": 0.20588235294117646,
            "final_commit_size": 34,
            "intersection_size": 7,
            "previous_commits_size": 27
        },
        "is_makefile_based": true,
        "no_new_files": [],
        "no_other_files": false,
        "num_prohibited_files": 193029,
        "prohibited_files": [
            "server/src/main/java/com/genymobile/scrcpy/Device.java",
            "server/src/main/java/com/genymobile/scrcpy/wrappers/SurfaceControl.java",
            "server/src/main/java/com/genymobile/scrcpy/Device.java",
            "server/src/main/java/com/genymobile/scrcpy/wrappers/SurfaceControl.java",
            "app/meson.build",
            "app/scrcpy.1",
            "app/src/common.h",
            "app/src/scrcpy.h",
            "app/src/server.h",
            "server/src/main/java/com/genymobile/scrcpy/Workarounds.java"
        ],
        "reopen": true,
        "reopen_events": [
            [
                "2017-03-30 20:55:20+00:00",
                "commit"
            ],
            [
                "2017-04-13 23:27:07+00:00",
                "closed"
            ],
            [
                "2020-05-27 12:19:17+00:00",
                "commit"
            ],
            [
                "2020-06-15 23:23:31+00:00",
                "reopened"
            ],
            [
                "2020-08-02 09:24:08+00:00",
                "commit"
            ],
            [
                "2020-08-06 17:54:20+00:00",
                "closed"
            ]
        ],
        "status": false,
        "strategy": true,
        "total_changes": 72
    }
}