{
    "commits": [
        {
            "diff": "elastic_elasticsearch/issue_43767/commit_c53df627530f87b19ba99276d7f33215e68b9e89.diff",
            "diff_additions": 7,
            "diff_deletions": 1,
            "diff_file_size": 2962,
            "files": [
                {
                    "file_additions": 7,
                    "file_deletions": 1,
                    "file_exists": true,
                    "file_name": "server/src/main/java/org/elasticsearch/transport/InboundMessage.java",
                    "file_size": 2962
                }
            ],
            "interesting": {
                "reopened": false,
                "status": false
            },
            "sha": "c53df627530f87b19ba99276d7f33215e68b9e89"
        },
        {
            "diff": "elastic_elasticsearch/issue_43767/commit_6ad765a9b58f511c98898a671d8fda71f460f97b.diff",
            "diff_additions": 950,
            "diff_deletions": 778,
            "diff_file_size": 0,
            "files": [
                {
                    "file_additions": 6,
                    "file_deletions": 6,
                    "file_exists": false,
                    "file_name": "client/rest-high-level/src/main/java/org/elasticsearch/client/dataframe/GetDataFrameTransformStatsResponse.java",
                    "file_size": 0
                },
                {
                    "file_additions": 57,
                    "file_deletions": 14,
                    "file_exists": false,
                    "file_name": "client/rest-high-level/src/main/java/org/elasticsearch/client/dataframe/transforms/DataFrameTransformCheckpointStats.java",
                    "file_size": 0
                },
                {
                    "file_additions": 16,
                    "file_deletions": 17,
                    "file_exists": false,
                    "file_name": "client/rest-high-level/src/main/java/org/elasticsearch/client/dataframe/transforms/DataFrameTransformCheckpointingInfo.java",
                    "file_size": 0
                },
                {
                    "file_additions": 0,
                    "file_deletions": 169,
                    "file_exists": false,
                    "file_name": "client/rest-high-level/src/main/java/org/elasticsearch/client/dataframe/transforms/DataFrameTransformState.java",
                    "file_size": 0
                },
                {
                    "file_additions": 0,
                    "file_deletions": 104,
                    "file_exists": false,
                    "file_name": "client/rest-high-level/src/main/java/org/elasticsearch/client/dataframe/transforms/DataFrameTransformStateAndStats.java",
                    "file_size": 0
                },
                {
                    "file_additions": 128,
                    "file_deletions": 0,
                    "file_exists": false,
                    "file_name": "client/rest-high-level/src/main/java/org/elasticsearch/client/dataframe/transforms/DataFrameTransformStateAndStatsInfo.java",
                    "file_size": 0
                },
                {
                    "file_additions": 14,
                    "file_deletions": 14,
                    "file_exists": false,
                    "file_name": "client/rest-high-level/src/test/java/org/elasticsearch/client/DataFrameTransformIT.java",
                    "file_size": 0
                },
                {
                    "file_additions": 6,
                    "file_deletions": 6,
                    "file_exists": false,
                    "file_name": "client/rest-high-level/src/test/java/org/elasticsearch/client/dataframe/GetDataFrameTransformStatsResponseTests.java",
                    "file_size": 0
                },
                {
                    "file_additions": 25,
                    "file_deletions": 8,
                    "file_exists": false,
                    "file_name": "client/rest-high-level/src/test/java/org/elasticsearch/client/dataframe/transforms/DataFrameTransformCheckpointStatsTests.java",
                    "file_size": 0
                },
                {
                    "file_additions": 13,
                    "file_deletions": 14,
                    "file_exists": false,
                    "file_name": "client/rest-high-level/src/test/java/org/elasticsearch/client/dataframe/transforms/DataFrameTransformCheckpointingInfoTests.java",
                    "file_size": 0
                },
                {
                    "file_additions": 73,
                    "file_deletions": 0,
                    "file_exists": false,
                    "file_name": "client/rest-high-level/src/test/java/org/elasticsearch/client/dataframe/transforms/DataFrameTransformStateAndStatsInfoTests.java",
                    "file_size": 0
                },
                {
                    "file_additions": 0,
                    "file_deletions": 59,
                    "file_exists": false,
                    "file_name": "client/rest-high-level/src/test/java/org/elasticsearch/client/dataframe/transforms/DataFrameTransformStateAndStatsTests.java",
                    "file_size": 0
                },
                {
                    "file_additions": 0,
                    "file_deletions": 78,
                    "file_exists": false,
                    "file_name": "client/rest-high-level/src/test/java/org/elasticsearch/client/dataframe/transforms/DataFrameTransformStateTests.java",
                    "file_size": 0
                },
                {
                    "file_additions": 5,
                    "file_deletions": 1,
                    "file_exists": false,
                    "file_name": "client/rest-high-level/src/test/java/org/elasticsearch/client/dataframe/transforms/hlrc/DataFrameIndexerPositionTests.java",
                    "file_size": 0
                },
                {
                    "file_additions": 8,
                    "file_deletions": 1,
                    "file_exists": false,
                    "file_name": "client/rest-high-level/src/test/java/org/elasticsearch/client/dataframe/transforms/hlrc/DataFrameIndexerTransformStatsTests.java",
                    "file_size": 0
                },
                {
                    "file_additions": 21,
                    "file_deletions": 2,
                    "file_exists": false,
                    "file_name": "client/rest-high-level/src/test/java/org/elasticsearch/client/dataframe/transforms/hlrc/DataFrameTransformCheckpointStatsTests.java",
                    "file_size": 0
                },
                {
                    "file_additions": 9,
                    "file_deletions": 6,
                    "file_exists": false,
                    "file_name": "client/rest-high-level/src/test/java/org/elasticsearch/client/dataframe/transforms/hlrc/DataFrameTransformCheckpointingInfoTests.java",
                    "file_size": 0
                },
                {
                    "file_additions": 6,
                    "file_deletions": 1,
                    "file_exists": false,
                    "file_name": "client/rest-high-level/src/test/java/org/elasticsearch/client/dataframe/transforms/hlrc/DataFrameTransformProgressTests.java",
                    "file_size": 0
                },
                {
                    "file_additions": 56,
                    "file_deletions": 70,
                    "file_exists": false,
                    "file_name": "client/rest-high-level/src/test/java/org/elasticsearch/client/dataframe/transforms/hlrc/DataFrameTransformStateAndStatsInfoTests.java",
                    "file_size": 0
                },
                {
                    "file_additions": 0,
                    "file_deletions": 73,
                    "file_exists": false,
                    "file_name": "client/rest-high-level/src/test/java/org/elasticsearch/client/dataframe/transforms/hlrc/DataFrameTransformStateAndStatsTests.java",
                    "file_size": 0
                },
                {
                    "file_additions": 10,
                    "file_deletions": 8,
                    "file_exists": false,
                    "file_name": "client/rest-high-level/src/test/java/org/elasticsearch/client/documentation/DataFrameTransformDocumentationIT.java",
                    "file_size": 0
                },
                {
                    "file_additions": 4,
                    "file_deletions": 0,
                    "file_exists": false,
                    "file_name": "x-pack/plugin/core/src/main/java/org/elasticsearch/xpack/core/dataframe/DataFrameField.java",
                    "file_size": 0
                },
                {
                    "file_additions": 18,
                    "file_deletions": 18,
                    "file_exists": false,
                    "file_name": "x-pack/plugin/core/src/main/java/org/elasticsearch/xpack/core/dataframe/action/GetDataFrameTransformsStatsAction.java",
                    "file_size": 0
                },
                {
                    "file_additions": 111,
                    "file_deletions": 14,
                    "file_exists": false,
                    "file_name": "x-pack/plugin/core/src/main/java/org/elasticsearch/xpack/core/dataframe/transforms/DataFrameTransformCheckpointStats.java",
                    "file_size": 0
                },
                {
                    "file_additions": 28,
                    "file_deletions": 28,
                    "file_exists": false,
                    "file_name": "x-pack/plugin/core/src/main/java/org/elasticsearch/xpack/core/dataframe/transforms/DataFrameTransformCheckpointingInfo.java",
                    "file_size": 0
                },
                {
                    "file_additions": 5,
                    "file_deletions": 21,
                    "file_exists": false,
                    "file_name": "x-pack/plugin/core/src/main/java/org/elasticsearch/xpack/core/dataframe/transforms/DataFrameTransformStateAndStats.java",
                    "file_size": 0
                },
                {
                    "file_additions": 227,
                    "file_deletions": 0,
                    "file_exists": false,
                    "file_name": "x-pack/plugin/core/src/main/java/org/elasticsearch/xpack/core/dataframe/transforms/DataFrameTransformStateAndStatsInfo.java",
                    "file_size": 0
                },
                {
                    "file_additions": 4,
                    "file_deletions": 4,
                    "file_exists": false,
                    "file_name": "x-pack/plugin/core/src/test/java/org/elasticsearch/xpack/core/dataframe/action/GetDataFrameTransformsStatsActionResponseTests.java",
                    "file_size": 0
                },
                {
                    "file_additions": 6,
                    "file_deletions": 2,
                    "file_exists": false,
                    "file_name": "x-pack/plugin/core/src/test/java/org/elasticsearch/xpack/core/dataframe/transforms/DataFrameTransformCheckpointStatsTests.java",
                    "file_size": 0
                },
                {
                    "file_additions": 1,
                    "file_deletions": 0,
                    "file_exists": false,
                    "file_name": "x-pack/plugin/core/src/test/java/org/elasticsearch/xpack/core/dataframe/transforms/DataFrameTransformProgressTests.java",
                    "file_size": 0
                },
                {
                    "file_additions": 56,
                    "file_deletions": 0,
                    "file_exists": false,
                    "file_name": "x-pack/plugin/core/src/test/java/org/elasticsearch/xpack/core/dataframe/transforms/DataFrameTransformStateAndStatsInfoTests.java",
                    "file_size": 0
                },
                {
                    "file_additions": 28,
                    "file_deletions": 31,
                    "file_exists": false,
                    "file_name": "x-pack/plugin/data-frame/src/main/java/org/elasticsearch/xpack/dataframe/action/TransportGetDataFrameTransformsStatsAction.java",
                    "file_size": 0
                },
                {
                    "file_additions": 3,
                    "file_deletions": 3,
                    "file_exists": false,
                    "file_name": "x-pack/plugin/data-frame/src/main/java/org/elasticsearch/xpack/dataframe/persistence/DataFrameTransformsConfigManager.java",
                    "file_size": 0
                },
                {
                    "file_additions": 6,
                    "file_deletions": 6,
                    "file_exists": false,
                    "file_name": "x-pack/qa/rolling-upgrade/src/test/java/org/elasticsearch/upgrades/DataFrameSurvivesUpgradeIT.java",
                    "file_size": 0
                }
            ],
            "interesting": {
                "reopened": false,
                "status": true
            },
            "sha": "6ad765a9b58f511c98898a671d8fda71f460f97b"
        },
        {
            "diff": "elastic_elasticsearch/issue_43767/commit_5122bcfcbbcce2d2ad30acb2969e93d85144e67c.diff",
            "diff_additions": 1291,
            "diff_deletions": 1028,
            "diff_file_size": 0,
            "files": [
                {
                    "file_additions": 10,
                    "file_deletions": 10,
                    "file_exists": false,
                    "file_name": "client/rest-high-level/src/main/java/org/elasticsearch/client/dataframe/GetDataFrameTransformStatsResponse.java",
                    "file_size": 0
                },
                {
                    "file_additions": 57,
                    "file_deletions": 14,
                    "file_exists": false,
                    "file_name": "client/rest-high-level/src/main/java/org/elasticsearch/client/dataframe/transforms/DataFrameTransformCheckpointStats.java",
                    "file_size": 0
                },
                {
                    "file_additions": 16,
                    "file_deletions": 17,
                    "file_exists": false,
                    "file_name": "client/rest-high-level/src/main/java/org/elasticsearch/client/dataframe/transforms/DataFrameTransformCheckpointingInfo.java",
                    "file_size": 0
                },
                {
                    "file_additions": 0,
                    "file_deletions": 169,
                    "file_exists": false,
                    "file_name": "client/rest-high-level/src/main/java/org/elasticsearch/client/dataframe/transforms/DataFrameTransformState.java",
                    "file_size": 0
                },
                {
                    "file_additions": 0,
                    "file_deletions": 104,
                    "file_exists": false,
                    "file_name": "client/rest-high-level/src/main/java/org/elasticsearch/client/dataframe/transforms/DataFrameTransformStateAndStats.java",
                    "file_size": 0
                },
                {
                    "file_additions": 128,
                    "file_deletions": 0,
                    "file_exists": false,
                    "file_name": "client/rest-high-level/src/main/java/org/elasticsearch/client/dataframe/transforms/DataFrameTransformStats.java",
                    "file_size": 0
                },
                {
                    "file_additions": 16,
                    "file_deletions": 20,
                    "file_exists": false,
                    "file_name": "client/rest-high-level/src/test/java/org/elasticsearch/client/DataFrameTransformIT.java",
                    "file_size": 0
                },
                {
                    "file_additions": 7,
                    "file_deletions": 7,
                    "file_exists": false,
                    "file_name": "client/rest-high-level/src/test/java/org/elasticsearch/client/dataframe/GetDataFrameTransformStatsResponseTests.java",
                    "file_size": 0
                },
                {
                    "file_additions": 25,
                    "file_deletions": 8,
                    "file_exists": false,
                    "file_name": "client/rest-high-level/src/test/java/org/elasticsearch/client/dataframe/transforms/DataFrameTransformCheckpointStatsTests.java",
                    "file_size": 0
                },
                {
                    "file_additions": 13,
                    "file_deletions": 14,
                    "file_exists": false,
                    "file_name": "client/rest-high-level/src/test/java/org/elasticsearch/client/dataframe/transforms/DataFrameTransformCheckpointingInfoTests.java",
                    "file_size": 0
                },
                {
                    "file_additions": 0,
                    "file_deletions": 59,
                    "file_exists": false,
                    "file_name": "client/rest-high-level/src/test/java/org/elasticsearch/client/dataframe/transforms/DataFrameTransformStateAndStatsTests.java",
                    "file_size": 0
                },
                {
                    "file_additions": 0,
                    "file_deletions": 78,
                    "file_exists": false,
                    "file_name": "client/rest-high-level/src/test/java/org/elasticsearch/client/dataframe/transforms/DataFrameTransformStateTests.java",
                    "file_size": 0
                },
                {
                    "file_additions": 73,
                    "file_deletions": 0,
                    "file_exists": false,
                    "file_name": "client/rest-high-level/src/test/java/org/elasticsearch/client/dataframe/transforms/DataFrameTransformStatsTests.java",
                    "file_size": 0
                },
                {
                    "file_additions": 5,
                    "file_deletions": 1,
                    "file_exists": false,
                    "file_name": "client/rest-high-level/src/test/java/org/elasticsearch/client/dataframe/transforms/hlrc/DataFrameIndexerPositionTests.java",
                    "file_size": 0
                },
                {
                    "file_additions": 8,
                    "file_deletions": 1,
                    "file_exists": false,
                    "file_name": "client/rest-high-level/src/test/java/org/elasticsearch/client/dataframe/transforms/hlrc/DataFrameIndexerTransformStatsTests.java",
                    "file_size": 0
                },
                {
                    "file_additions": 21,
                    "file_deletions": 2,
                    "file_exists": false,
                    "file_name": "client/rest-high-level/src/test/java/org/elasticsearch/client/dataframe/transforms/hlrc/DataFrameTransformCheckpointStatsTests.java",
                    "file_size": 0
                },
                {
                    "file_additions": 14,
                    "file_deletions": 5,
                    "file_exists": false,
                    "file_name": "client/rest-high-level/src/test/java/org/elasticsearch/client/dataframe/transforms/hlrc/DataFrameTransformCheckpointingInfoTests.java",
                    "file_size": 0
                },
                {
                    "file_additions": 6,
                    "file_deletions": 1,
                    "file_exists": false,
                    "file_name": "client/rest-high-level/src/test/java/org/elasticsearch/client/dataframe/transforms/hlrc/DataFrameTransformProgressTests.java",
                    "file_size": 0
                },
                {
                    "file_additions": 0,
                    "file_deletions": 73,
                    "file_exists": false,
                    "file_name": "client/rest-high-level/src/test/java/org/elasticsearch/client/dataframe/transforms/hlrc/DataFrameTransformStateAndStatsTests.java",
                    "file_size": 0
                },
                {
                    "file_additions": 53,
                    "file_deletions": 70,
                    "file_exists": false,
                    "file_name": "client/rest-high-level/src/test/java/org/elasticsearch/client/dataframe/transforms/hlrc/DataFrameTransformStatsTests.java",
                    "file_size": 0
                },
                {
                    "file_additions": 11,
                    "file_deletions": 10,
                    "file_exists": false,
                    "file_name": "client/rest-high-level/src/test/java/org/elasticsearch/client/documentation/DataFrameTransformDocumentationIT.java",
                    "file_size": 0
                },
                {
                    "file_additions": 4,
                    "file_deletions": 0,
                    "file_exists": false,
                    "file_name": "x-pack/plugin/core/src/main/java/org/elasticsearch/xpack/core/dataframe/DataFrameField.java",
                    "file_size": 0
                },
                {
                    "file_additions": 18,
                    "file_deletions": 18,
                    "file_exists": false,
                    "file_name": "x-pack/plugin/core/src/main/java/org/elasticsearch/xpack/core/dataframe/action/GetDataFrameTransformsStatsAction.java",
                    "file_size": 0
                },
                {
                    "file_additions": 0,
                    "file_deletions": 2,
                    "file_exists": false,
                    "file_name": "x-pack/plugin/core/src/main/java/org/elasticsearch/xpack/core/dataframe/transforms/DataFrameIndexerTransformStats.java",
                    "file_size": 0
                },
                {
                    "file_additions": 8,
                    "file_deletions": 8,
                    "file_exists": false,
                    "file_name": "x-pack/plugin/core/src/main/java/org/elasticsearch/xpack/core/dataframe/transforms/DataFrameTransformCheckpoint.java",
                    "file_size": 0
                },
                {
                    "file_additions": 116,
                    "file_deletions": 17,
                    "file_exists": false,
                    "file_name": "x-pack/plugin/core/src/main/java/org/elasticsearch/xpack/core/dataframe/transforms/DataFrameTransformCheckpointStats.java",
                    "file_size": 0
                },
                {
                    "file_additions": 32,
                    "file_deletions": 30,
                    "file_exists": false,
                    "file_name": "x-pack/plugin/core/src/main/java/org/elasticsearch/xpack/core/dataframe/transforms/DataFrameTransformCheckpointingInfo.java",
                    "file_size": 0
                },
                {
                    "file_additions": 236,
                    "file_deletions": 0,
                    "file_exists": false,
                    "file_name": "x-pack/plugin/core/src/main/java/org/elasticsearch/xpack/core/dataframe/transforms/DataFrameTransformStats.java",
                    "file_size": 0
                },
                {
                    "file_additions": 24,
                    "file_deletions": 47,
                    "file_exists": false,
                    "file_name": "x-pack/plugin/core/src/main/java/org/elasticsearch/xpack/core/dataframe/transforms/DataFrameTransformStoredDoc.java",
                    "file_size": 0
                },
                {
                    "file_additions": 4,
                    "file_deletions": 4,
                    "file_exists": false,
                    "file_name": "x-pack/plugin/core/src/test/java/org/elasticsearch/xpack/core/dataframe/action/GetDataFrameTransformsStatsActionResponseTests.java",
                    "file_size": 0
                },
                {
                    "file_additions": 6,
                    "file_deletions": 2,
                    "file_exists": false,
                    "file_name": "x-pack/plugin/core/src/test/java/org/elasticsearch/xpack/core/dataframe/transforms/DataFrameTransformCheckpointStatsTests.java",
                    "file_size": 0
                },
                {
                    "file_additions": 1,
                    "file_deletions": 0,
                    "file_exists": false,
                    "file_name": "x-pack/plugin/core/src/test/java/org/elasticsearch/xpack/core/dataframe/transforms/DataFrameTransformProgressTests.java",
                    "file_size": 0
                },
                {
                    "file_additions": 56,
                    "file_deletions": 0,
                    "file_exists": false,
                    "file_name": "x-pack/plugin/core/src/test/java/org/elasticsearch/xpack/core/dataframe/transforms/DataFrameTransformStatsTests.java",
                    "file_size": 0
                },
                {
                    "file_additions": 12,
                    "file_deletions": 14,
                    "file_exists": false,
                    "file_name": "x-pack/plugin/core/src/test/java/org/elasticsearch/xpack/core/dataframe/transforms/DataFrameTransformStoredDocTests.java",
                    "file_size": 0
                },
                {
                    "file_additions": 3,
                    "file_deletions": 2,
                    "file_exists": false,
                    "file_name": "x-pack/plugin/data-frame/qa/multi-node-tests/src/test/java/org/elasticsearch/xpack/dataframe/integration/DataFrameIntegTestCase.java",
                    "file_size": 0
                },
                {
                    "file_additions": 7,
                    "file_deletions": 8,
                    "file_exists": false,
                    "file_name": "x-pack/plugin/data-frame/qa/multi-node-tests/src/test/java/org/elasticsearch/xpack/dataframe/integration/DataFrameTransformIT.java",
                    "file_size": 0
                },
                {
                    "file_additions": 22,
                    "file_deletions": 13,
                    "file_exists": false,
                    "file_name": "x-pack/plugin/data-frame/qa/single-node-tests/src/test/java/org/elasticsearch/xpack/dataframe/integration/DataFrameGetAndGetStatsIT.java",
                    "file_size": 0
                },
                {
                    "file_additions": 8,
                    "file_deletions": 4,
                    "file_exists": false,
                    "file_name": "x-pack/plugin/data-frame/qa/single-node-tests/src/test/java/org/elasticsearch/xpack/dataframe/integration/DataFrameRestTestCase.java",
                    "file_size": 0
                },
                {
                    "file_additions": 5,
                    "file_deletions": 11,
                    "file_exists": false,
                    "file_name": "x-pack/plugin/data-frame/qa/single-node-tests/src/test/java/org/elasticsearch/xpack/dataframe/integration/DataFrameTaskFailedStateIT.java",
                    "file_size": 0
                },
                {
                    "file_additions": 2,
                    "file_deletions": 2,
                    "file_exists": false,
                    "file_name": "x-pack/plugin/data-frame/qa/single-node-tests/src/test/java/org/elasticsearch/xpack/dataframe/integration/DataFrameUsageIT.java",
                    "file_size": 0
                },
                {
                    "file_additions": 2,
                    "file_deletions": 2,
                    "file_exists": false,
                    "file_name": "x-pack/plugin/data-frame/src/main/java/org/elasticsearch/xpack/dataframe/DataFrameInfoTransportAction.java",
                    "file_size": 0
                },
                {
                    "file_additions": 102,
                    "file_deletions": 54,
                    "file_exists": false,
                    "file_name": "x-pack/plugin/data-frame/src/main/java/org/elasticsearch/xpack/dataframe/action/TransportGetDataFrameTransformsStatsAction.java",
                    "file_size": 0
                },
                {
                    "file_additions": 63,
                    "file_deletions": 41,
                    "file_exists": false,
                    "file_name": "x-pack/plugin/data-frame/src/main/java/org/elasticsearch/xpack/dataframe/checkpoint/DataFrameTransformsCheckpointService.java",
                    "file_size": 0
                },
                {
                    "file_additions": 7,
                    "file_deletions": 5,
                    "file_exists": false,
                    "file_name": "x-pack/plugin/data-frame/src/main/java/org/elasticsearch/xpack/dataframe/persistence/DataFrameInternalIndex.java",
                    "file_size": 0
                },
                {
                    "file_additions": 12,
                    "file_deletions": 12,
                    "file_exists": false,
                    "file_name": "x-pack/plugin/data-frame/src/main/java/org/elasticsearch/xpack/dataframe/persistence/DataFrameTransformsConfigManager.java",
                    "file_size": 0
                },
                {
                    "file_additions": 3,
                    "file_deletions": 3,
                    "file_exists": false,
                    "file_name": "x-pack/plugin/data-frame/src/main/java/org/elasticsearch/xpack/dataframe/transforms/DataFrameTransformPersistentTasksExecutor.java",
                    "file_size": 0
                },
                {
                    "file_additions": 6,
                    "file_deletions": 7,
                    "file_exists": false,
                    "file_name": "x-pack/plugin/data-frame/src/main/java/org/elasticsearch/xpack/dataframe/transforms/DataFrameTransformTask.java",
                    "file_size": 0
                },
                {
                    "file_additions": 23,
                    "file_deletions": 10,
                    "file_exists": false,
                    "file_name": "x-pack/plugin/data-frame/src/test/java/org/elasticsearch/xpack/dataframe/checkpoint/DataFrameTransformCheckpointServiceNodeTests.java",
                    "file_size": 0
                },
                {
                    "file_additions": 3,
                    "file_deletions": 4,
                    "file_exists": false,
                    "file_name": "x-pack/plugin/data-frame/src/test/java/org/elasticsearch/xpack/dataframe/checkpoint/DataFrameTransformsCheckpointServiceTests.java",
                    "file_size": 0
                },
                {
                    "file_additions": 23,
                    "file_deletions": 25,
                    "file_exists": false,
                    "file_name": "x-pack/plugin/data-frame/src/test/java/org/elasticsearch/xpack/dataframe/persistence/DataFrameTransformsConfigManagerTests.java",
                    "file_size": 0
                },
                {
                    "file_additions": 20,
                    "file_deletions": 20,
                    "file_exists": false,
                    "file_name": "x-pack/qa/rolling-upgrade/src/test/java/org/elasticsearch/upgrades/DataFrameSurvivesUpgradeIT.java",
                    "file_size": 0
                }
            ],
            "interesting": {
                "reopened": false,
                "status": false
            },
            "sha": "5122bcfcbbcce2d2ad30acb2969e93d85144e67c"
        }
    ],
    "first_commit": "2019-07-15 06:50:56",
    "last_commit": "2019-07-29 19:44:14",
    "number": 43767,
    "score": 272.0009864364981
}