{
    "all_issues": 955,
    "interesting_issues": 1,
    "last_update": "2023-10-29 13:16:20.389025",
    "license": {
        "download": "https://raw.githubusercontent.com/NLnetLabs/unbound/master/LICENSE",
        "name": "BSD 3-Clause \"New\" or \"Revised\" License"
    },
    "ratio": 0.0010471204188481676,
    "size": 100272,
    "stars": 2487,
    "url": "https://github.com/NLnetLabs/unbound"
}