{
    "all_issues": 3771,
    "interesting_issues": 2,
    "last_update": "2023-10-17 21:09:10.928458",
    "license": {
        "download": "https://raw.githubusercontent.com/facebook/zstd/dev/LICENSE",
        "name": "Other"
    },
    "ratio": 0.0005303632988597189,
    "size": 38227,
    "stars": 21057,
    "url": "https://github.com/facebook/zstd"
}