{
    "covered_issues": [
        1527,
        1524,
        1522,
        1519,
        1518,
        1517,
        1510,
        1508,
        1507,
        1501,
        1497,
        1495,
        1491,
        1488,
        1483,
        1482,
        1479,
        1477,
        1472,
        1459,
        1454,
        1452,
        1447,
        1446,
        1441,
        1440,
        1435,
        1433,
        1432,
        1431,
        1429,
        1424,
        1418,
        1417,
        1412,
        1409,
        1404,
        1403,
        1400,
        1399,
        1397,
        1396,
        1394,
        1393,
        1392,
        1391,
        1390,
        1388,
        1387,
        1378,
        1374,
        1371,
        1369,
        1368,
        1366,
        1364,
        1361,
        1360,
        1358,
        1353,
        1348,
        1347,
        1346,
        1345,
        1340,
        1335,
        1334,
        1331,
        1330,
        1327,
        1324,
        1322,
        1321,
        1317,
        1315,
        1311,
        1309,
        1308,
        1305,
        1304,
        1302,
        1301,
        1299,
        1298,
        1297,
        1296,
        1290,
        1289,
        1284,
        1283,
        1282,
        1279,
        1278,
        1277,
        1276,
        1273,
        1270,
        1269,
        1268,
        1266,
        1260,
        1256,
        1255,
        1253,
        1239,
        1237,
        1235,
        1234,
        1232,
        1231,
        1230,
        1229,
        1228,
        1227,
        1226,
        1225,
        1223,
        1221,
        1219,
        1216,
        1215,
        1209,
        1208,
        1207,
        1205,
        1201,
        1200,
        1198,
        1197,
        1196,
        1195,
        1194,
        1193,
        1192,
        1190,
        1189,
        1186,
        1185,
        1183,
        1181,
        1180,
        1179,
        1176,
        1175,
        1174,
        1173,
        1172,
        1171,
        1170,
        1167,
        1166,
        1165,
        1162,
        1161,
        1160,
        1159,
        1157,
        1154,
        1151,
        1148,
        1147,
        1144,
        1142,
        1140,
        1136,
        1135,
        1133,
        1131,
        1130,
        1129,
        1128,
        1127,
        1125,
        1124,
        1122,
        1119,
        1118,
        1116,
        1115,
        1114,
        1113,
        1111,
        1110,
        1108,
        1107,
        1105,
        1104,
        1100,
        1098,
        1096,
        1095,
        1090,
        1089,
        1088,
        1087,
        1086,
        1085,
        1084,
        1082,
        1080,
        1078,
        1077,
        1075,
        1074,
        1072,
        1070,
        1069,
        1068,
        1065,
        1063,
        1060,
        1059,
        1058,
        1057,
        1056,
        1055,
        1054,
        1051,
        1045,
        1044,
        1043,
        1041,
        1040,
        1039,
        1038,
        1037,
        1036,
        1035,
        1033,
        1032,
        1030,
        1027,
        1025,
        1023,
        1021,
        1017,
        1015,
        1014,
        1013,
        1012,
        1011,
        1010,
        1008,
        1007,
        1006,
        1003,
        1002,
        1001,
        1000,
        999,
        998,
        997,
        996,
        993,
        992,
        991,
        990,
        989,
        987,
        986,
        981,
        980,
        979,
        978,
        977,
        976,
        975,
        973,
        972,
        971,
        970,
        969,
        968,
        967,
        965,
        964,
        962,
        961,
        958,
        957,
        956,
        955,
        954,
        953,
        952,
        951,
        950,
        949,
        948,
        947,
        946,
        945,
        942,
        941,
        940,
        939,
        937,
        936,
        935,
        933,
        932,
        931,
        930,
        929,
        928,
        927,
        925,
        924,
        923,
        922,
        920,
        919,
        918,
        917,
        916,
        914,
        913,
        912,
        911,
        910,
        909,
        908,
        907,
        906,
        905,
        904,
        903,
        901,
        900,
        899,
        898,
        897,
        896,
        895,
        894,
        893,
        892,
        891,
        890,
        889,
        888,
        887,
        886,
        885,
        883,
        882,
        881,
        880,
        879,
        878,
        877,
        876,
        875,
        874,
        873,
        872,
        871,
        870,
        869,
        868,
        867,
        866,
        865,
        860,
        859,
        858,
        857,
        856,
        855,
        853,
        852,
        851,
        850,
        849,
        847,
        846,
        845,
        844,
        843,
        842,
        841,
        837,
        836,
        835,
        834,
        833,
        832,
        831,
        829,
        828,
        826,
        825,
        824,
        822,
        821,
        819,
        816,
        815,
        814,
        813,
        812,
        811,
        810,
        809,
        806,
        805,
        804,
        803,
        802,
        801,
        800,
        799,
        798,
        797,
        796,
        795,
        794,
        793,
        792,
        791,
        790,
        787,
        782,
        781,
        780,
        779,
        778,
        777,
        776,
        774,
        773,
        772,
        771,
        770,
        769,
        768,
        767,
        766,
        765,
        763,
        762,
        761,
        760,
        759,
        758,
        755,
        753,
        752,
        751,
        750,
        749,
        748,
        747,
        745,
        744,
        743,
        742,
        741,
        740,
        739,
        738,
        737,
        736,
        735,
        733,
        732,
        731,
        729,
        728,
        727,
        726,
        723,
        722,
        721,
        720,
        719,
        717,
        716,
        715,
        714,
        713,
        712,
        711,
        710,
        706,
        705,
        704,
        703,
        701,
        698,
        697,
        696,
        695,
        694,
        693,
        691,
        690,
        689,
        686,
        682,
        681,
        680,
        679,
        678,
        677,
        676,
        675,
        674,
        673,
        672,
        671,
        670,
        669,
        668,
        667,
        666,
        665,
        664,
        663,
        662,
        661,
        658,
        657,
        656,
        654,
        653,
        652,
        651,
        650,
        649,
        647,
        645,
        644,
        643,
        642,
        640,
        639,
        638,
        637,
        636,
        635,
        634,
        633,
        632,
        631,
        630,
        629,
        628,
        626,
        625,
        624,
        623,
        622,
        621,
        620,
        619,
        618,
        617,
        616,
        615,
        613,
        612,
        611,
        610,
        609,
        608,
        606,
        605,
        604,
        603,
        600,
        599,
        598,
        597,
        596,
        595,
        594,
        593,
        592,
        591,
        590,
        589,
        588,
        587,
        586,
        585,
        583,
        582,
        581,
        580,
        579,
        578,
        577,
        576,
        575,
        574,
        573,
        572,
        571,
        570,
        568,
        567,
        566,
        565,
        563,
        562,
        561,
        560,
        559,
        558,
        557,
        556,
        555,
        554,
        553,
        552,
        551,
        550,
        548,
        547,
        544,
        543,
        542,
        541,
        540,
        539,
        538,
        537,
        536,
        535,
        534,
        533,
        532,
        531,
        530,
        529,
        528,
        527,
        526,
        524,
        522,
        521,
        520,
        519,
        518,
        517,
        515,
        514,
        513,
        511,
        510,
        509,
        508,
        506,
        504,
        503,
        502,
        501,
        500,
        499,
        498,
        497,
        496,
        495,
        494,
        493,
        492,
        491,
        490,
        489,
        488,
        487,
        486,
        485,
        484,
        483,
        482,
        481,
        480,
        479,
        478,
        477,
        476,
        475,
        474,
        473,
        472,
        471,
        470,
        469,
        468,
        467,
        466,
        465,
        464,
        463,
        462,
        461,
        460,
        459,
        458,
        456,
        454,
        453,
        452,
        451,
        450,
        449,
        448,
        447,
        446,
        445,
        443,
        442,
        441,
        440,
        439,
        438,
        436,
        435,
        434,
        433,
        432,
        431,
        430,
        429,
        428,
        426,
        425,
        424,
        423,
        422,
        421,
        420,
        419,
        418,
        417,
        416,
        415,
        414,
        413,
        411,
        410,
        409,
        408,
        407,
        405,
        404,
        403,
        402,
        401,
        400,
        399,
        398,
        397,
        395,
        394,
        393,
        392,
        390,
        389,
        388,
        387,
        386,
        385,
        384,
        383,
        382,
        381,
        380,
        379,
        378,
        377,
        376,
        375,
        374,
        373,
        372,
        371,
        370,
        369,
        368,
        367,
        365,
        364,
        363,
        362,
        361,
        360,
        359,
        358,
        357,
        355,
        353,
        352,
        351,
        350,
        349,
        348,
        347,
        346,
        345,
        344,
        343,
        342,
        341,
        340,
        339,
        338,
        337,
        336,
        334,
        333,
        332,
        331,
        330,
        329,
        328,
        327,
        326,
        325,
        324,
        322,
        321,
        320,
        319,
        318,
        317,
        316,
        315,
        312,
        311,
        310,
        309,
        308,
        307,
        306,
        305,
        304,
        303,
        302,
        301,
        300,
        299,
        298,
        297,
        296,
        295,
        294,
        293,
        292,
        291,
        290,
        289,
        288,
        287,
        286,
        285,
        284,
        283,
        282,
        281,
        280,
        279,
        277,
        276,
        275,
        274,
        273,
        271,
        270,
        269,
        268,
        267,
        266,
        265,
        264,
        263,
        262,
        261,
        260,
        259,
        258,
        257,
        256,
        254,
        252,
        251,
        250,
        249,
        248,
        247,
        246,
        245,
        244,
        243,
        242,
        241,
        240,
        239,
        238,
        237,
        236,
        235,
        234,
        233,
        232,
        231,
        230,
        229,
        228,
        227,
        226,
        225,
        224,
        223,
        222,
        221,
        220,
        219,
        218,
        217,
        216,
        215,
        214,
        213,
        212,
        211,
        210,
        209,
        208,
        207,
        206,
        205,
        204,
        203,
        202,
        201,
        200,
        199,
        198,
        197,
        196,
        195,
        194,
        193,
        192,
        191,
        190,
        189,
        188,
        187,
        186,
        185,
        184,
        183,
        182,
        181,
        180,
        179,
        178,
        177,
        176,
        175,
        174,
        173,
        172,
        171,
        170,
        169,
        168,
        167,
        166,
        165,
        164,
        163,
        162,
        161,
        160,
        159,
        158,
        157,
        156,
        155,
        154,
        153,
        152,
        151,
        150,
        149,
        148,
        147,
        146,
        145,
        144,
        143,
        142,
        141,
        140,
        139,
        138,
        137,
        136,
        135,
        134,
        133,
        132,
        131,
        130,
        129,
        128,
        127,
        126,
        125,
        124,
        123,
        122,
        121,
        120,
        119,
        118,
        117,
        116,
        115,
        114,
        113,
        112,
        111,
        110,
        109,
        108,
        107,
        106,
        105,
        104,
        103,
        102,
        101,
        100,
        99,
        97,
        94,
        93,
        92,
        91,
        90,
        89,
        88,
        87,
        86,
        85,
        84,
        83,
        82,
        81,
        80,
        79,
        78,
        77,
        76,
        75,
        74,
        73,
        72,
        71,
        70,
        69,
        68,
        67,
        66,
        65,
        64,
        63,
        62,
        61,
        60,
        59,
        58,
        57,
        56,
        55,
        53,
        52,
        51,
        50,
        49,
        48,
        47,
        46,
        45,
        44,
        43,
        42,
        41,
        40,
        39,
        38,
        37,
        36,
        35,
        34,
        33,
        32,
        31,
        30,
        29,
        28,
        27,
        26,
        25,
        24,
        23,
        22,
        21,
        20,
        19,
        18,
        17,
        16,
        15,
        14,
        13,
        12,
        11,
        10,
        9,
        8,
        7,
        6,
        5,
        4,
        3,
        2,
        1
    ],
    "finished": true
}