{
    "covered_issues": [
        86,
        79,
        73,
        72,
        71,
        70,
        67,
        64,
        60,
        58,
        57,
        54,
        51,
        50,
        43,
        42,
        31,
        29,
        25,
        24,
        23,
        22,
        21,
        20,
        18,
        15,
        14,
        13,
        9,
        7,
        6,
        4,
        3,
        2,
        1
    ],
    "finished": true
}