{
    "category": [
        "build/refactor/preprocessing"
    ],
    "commits": [
        {
            "associated_pull_request": [
                "https://github.com/signalwire/freeswitch/pull/281"
            ],
            "date": "2020-01-30 23:26:21",
            "diff": "",
            "diff_additions": 0,
            "diff_deletions": 0,
            "diff_file_size": 0,
            "diff_url": "https://github.com/signalwire/freeswitch/commit/d9bec17d16bcee2a325f62651365421b57c7ac4e.diff",
            "exists": true,
            "files": [],
            "interesting": {
                "reopen": false,
                "status": false
            },
            "is_parent": true,
            "sha": "d9bec17d16bcee2a325f62651365421b57c7ac4e"
        },
        {
            "associated_pull_request": [],
            "date": "2020-01-31 19:05:32",
            "diff": "signalwire_freeswitch/issue_210/commit_3c578c7c3b2c3163b78687312a6e59797979f580.diff",
            "diff_additions": 10,
            "diff_deletions": 9,
            "diff_file_size": 37264,
            "diff_url": "https://github.com/signalwire/freeswitch/commit/3c578c7c3b2c3163b78687312a6e59797979f580.diff",
            "exists": true,
            "files": [
                {
                    "file_additions": 10,
                    "file_deletions": 9,
                    "file_exists": true,
                    "file_name": "src/mod/applications/mod_conference/conference_event.c",
                    "file_size": 37264
                }
            ],
            "interesting": {
                "reopen": false,
                "status": false
            },
            "is_parent": false,
            "sha": "3c578c7c3b2c3163b78687312a6e59797979f580"
        },
        {
            "associated_pull_request": [],
            "date": "2020-01-31 19:05:32",
            "diff": "signalwire_freeswitch/issue_210/commit_e9eb9da57f1430989339e1b5a4eef64fa7e6c228.diff",
            "diff_additions": 1,
            "diff_deletions": 1,
            "diff_file_size": 37264,
            "diff_url": "https://github.com/signalwire/freeswitch/commit/e9eb9da57f1430989339e1b5a4eef64fa7e6c228.diff",
            "exists": true,
            "files": [
                {
                    "file_additions": 1,
                    "file_deletions": 1,
                    "file_exists": true,
                    "file_name": "src/mod/applications/mod_conference/conference_event.c",
                    "file_size": 37264
                }
            ],
            "interesting": {
                "reopen": false,
                "status": false
            },
            "is_parent": false,
            "sha": "e9eb9da57f1430989339e1b5a4eef64fa7e6c228"
        },
        {
            "associated_pull_request": [],
            "date": "2020-01-31 19:29:38",
            "diff": "signalwire_freeswitch/issue_210/commit_7bc210f5c0026268b627c8f961422112817d1f96.diff",
            "diff_additions": 12,
            "diff_deletions": 8,
            "diff_file_size": 37264,
            "diff_url": "https://github.com/signalwire/freeswitch/commit/7bc210f5c0026268b627c8f961422112817d1f96.diff",
            "exists": true,
            "files": [
                {
                    "file_additions": 12,
                    "file_deletions": 8,
                    "file_exists": true,
                    "file_name": "src/mod/applications/mod_conference/conference_event.c",
                    "file_size": 37264
                }
            ],
            "interesting": {
                "reopen": false,
                "status": true
            },
            "is_parent": false,
            "sha": "7bc210f5c0026268b627c8f961422112817d1f96"
        },
        {
            "associated_pull_request": [],
            "date": "2020-01-31 19:35:44",
            "diff": "signalwire_freeswitch/issue_210/commit_52d94ae3ae63d0e1be4d580f370acf50bc13e92a.diff",
            "diff_additions": 0,
            "diff_deletions": 4,
            "diff_file_size": 37264,
            "diff_url": "https://github.com/signalwire/freeswitch/commit/52d94ae3ae63d0e1be4d580f370acf50bc13e92a.diff",
            "exists": true,
            "files": [
                {
                    "file_additions": 0,
                    "file_deletions": 4,
                    "file_exists": true,
                    "file_name": "src/mod/applications/mod_conference/conference_event.c",
                    "file_size": 37264
                }
            ],
            "interesting": {
                "reopen": false,
                "status": false
            },
            "is_parent": false,
            "sha": "52d94ae3ae63d0e1be4d580f370acf50bc13e92a"
        }
    ],
    "first_commit": "2020-01-30 23:26:21",
    "last_commit": "2020-01-31 19:35:44",
    "number": 210,
    "pull_request": "None",
    "score": {
        "accidental_reopen_likely": false,
        "all_labels": [],
        "contains_keywords": [
            "chang",
            "test",
            "issu",
            "work",
            "CI"
        ],
        "fix_size": 28,
        "has_labels": [],
        "intersecting": {
            "computed_score": 1.0,
            "final_commit_size": 5,
            "intersection_size": 5,
            "previous_commits_size": 28
        },
        "is_makefile_based": true,
        "no_new_files": [],
        "no_other_files": true,
        "num_prohibited_files": 49088,
        "prohibited_files": [
            "hal/inc/pinmap_hal.h",
            "Debug/marvin.bin",
            "Debug/marvin.elf",
            "Debug/marvin.hex",
            "Debug/marvin.bin",
            "Debug/marvin.elf",
            "Debug/marvin.hex",
            "inc/spark_utilities.h",
            "Debug/marvin.bin",
            "Debug/marvin.elf"
        ],
        "reopen": false,
        "reopen_events": [
            [
                "2020-01-31 19:06:09",
                "commit"
            ],
            [
                "2020-01-31 19:29:54",
                "commit"
            ],
            [
                "2020-01-31 19:29:54",
                "commit"
            ],
            [
                "2020-01-31 19:35:51",
                "commit"
            ],
            [
                "2021-03-16 13:37:09",
                "closed"
            ]
        ],
        "status": true,
        "strategy": true,
        "total_changes": 45
    }
}