{
    "category": [
        "build/refactor/preprocessing",
        "wrong API usage"
    ],
    "commits": [
        {
            "associated_pull_request": [],
            "date": "2020-05-29 12:35:51",
            "diff": "haproxy_haproxy/issue_676/commit_588b3148d9e49a2c0ba4a12f4c11b6a9c5426d45.diff",
            "diff_additions": 14,
            "diff_deletions": 6,
            "diff_file_size": 784216,
            "diff_url": "https://github.com/haproxy/haproxy/commit/588b3148d9e49a2c0ba4a12f4c11b6a9c5426d45.diff",
            "exists": true,
            "files": [
                {
                    "file_additions": 2,
                    "file_deletions": 0,
                    "file_exists": true,
                    "file_name": "src/acl.c",
                    "file_size": 40190
                },
                {
                    "file_additions": 1,
                    "file_deletions": 1,
                    "file_exists": true,
                    "file_name": "src/check.c",
                    "file_size": 73956
                },
                {
                    "file_additions": 2,
                    "file_deletions": 0,
                    "file_exists": true,
                    "file_name": "src/cli.c",
                    "file_size": 89160
                },
                {
                    "file_additions": 2,
                    "file_deletions": 0,
                    "file_exists": true,
                    "file_name": "src/hlua.c",
                    "file_size": 256549
                },
                {
                    "file_additions": 4,
                    "file_deletions": 4,
                    "file_exists": true,
                    "file_name": "src/peers.c",
                    "file_size": 111291
                },
                {
                    "file_additions": 2,
                    "file_deletions": 0,
                    "file_exists": true,
                    "file_name": "src/stream_interface.c",
                    "file_size": 53070
                },
                {
                    "file_additions": 1,
                    "file_deletions": 1,
                    "file_exists": true,
                    "file_name": "src/tcpcheck.c",
                    "file_size": 160000
                }
            ],
            "interesting": {
                "reopen": false,
                "status": false
            },
            "is_parent": true,
            "sha": "588b3148d9e49a2c0ba4a12f4c11b6a9c5426d45"
        },
        {
            "associated_pull_request": [],
            "date": "2020-06-11 15:34:00",
            "diff": "haproxy_haproxy/issue_676/commit_d0712f3873546a0c24f3204ad75dd7eacd689602.diff",
            "diff_additions": 7,
            "diff_deletions": 1,
            "diff_file_size": 218708,
            "diff_url": "https://github.com/haproxy/haproxy/commit/d0712f3873546a0c24f3204ad75dd7eacd689602.diff",
            "exists": true,
            "files": [
                {
                    "file_additions": 7,
                    "file_deletions": 1,
                    "file_exists": true,
                    "file_name": "src/ssl_sock.c",
                    "file_size": 218708
                }
            ],
            "interesting": {
                "reopen": true,
                "status": false
            },
            "is_parent": false,
            "sha": "d0712f3873546a0c24f3204ad75dd7eacd689602"
        },
        {
            "associated_pull_request": [],
            "date": "2020-06-11 15:34:00",
            "diff": "haproxy_haproxy/issue_676/commit_6dbb9a1b6a667326816da117a11a64d3f9694ede.diff",
            "diff_additions": 7,
            "diff_deletions": 1,
            "diff_file_size": 218708,
            "diff_url": "https://github.com/haproxy/haproxy/commit/6dbb9a1b6a667326816da117a11a64d3f9694ede.diff",
            "exists": true,
            "files": [
                {
                    "file_additions": 7,
                    "file_deletions": 1,
                    "file_exists": true,
                    "file_name": "src/ssl_sock.c",
                    "file_size": 218708
                }
            ],
            "interesting": {
                "reopen": false,
                "status": false
            },
            "is_parent": false,
            "sha": "6dbb9a1b6a667326816da117a11a64d3f9694ede"
        },
        {
            "associated_pull_request": [],
            "date": "2020-06-11 15:34:00",
            "diff": "haproxy_haproxy/issue_676/commit_4356453a4300435a3fea6cbb5bf424e0b6540468.diff",
            "diff_additions": 7,
            "diff_deletions": 1,
            "diff_file_size": 218708,
            "diff_url": "https://github.com/haproxy/haproxy/commit/4356453a4300435a3fea6cbb5bf424e0b6540468.diff",
            "exists": true,
            "files": [
                {
                    "file_additions": 7,
                    "file_deletions": 1,
                    "file_exists": true,
                    "file_name": "src/ssl_sock.c",
                    "file_size": 218708
                }
            ],
            "interesting": {
                "reopen": false,
                "status": false
            },
            "is_parent": false,
            "sha": "4356453a4300435a3fea6cbb5bf424e0b6540468"
        },
        {
            "associated_pull_request": [],
            "date": "2020-06-11 15:34:00",
            "diff": "haproxy_haproxy/issue_676/commit_37f3d1e078e8dc90811b38a80cd7bfe3ca84ea14.diff",
            "diff_additions": 7,
            "diff_deletions": 1,
            "diff_file_size": 218708,
            "diff_url": "https://github.com/haproxy/haproxy/commit/37f3d1e078e8dc90811b38a80cd7bfe3ca84ea14.diff",
            "exists": true,
            "files": [
                {
                    "file_additions": 7,
                    "file_deletions": 1,
                    "file_exists": true,
                    "file_name": "src/ssl_sock.c",
                    "file_size": 218708
                }
            ],
            "interesting": {
                "reopen": false,
                "status": false
            },
            "is_parent": false,
            "sha": "37f3d1e078e8dc90811b38a80cd7bfe3ca84ea14"
        },
        {
            "associated_pull_request": [],
            "date": "2020-06-11 15:34:00",
            "diff": "haproxy_haproxy/issue_676/commit_64ab33cf21f2a72a3d0bfd38a9faedffc294ea28.diff",
            "diff_additions": 7,
            "diff_deletions": 1,
            "diff_file_size": 218708,
            "diff_url": "https://github.com/haproxy/haproxy/commit/64ab33cf21f2a72a3d0bfd38a9faedffc294ea28.diff",
            "exists": true,
            "files": [
                {
                    "file_additions": 7,
                    "file_deletions": 1,
                    "file_exists": true,
                    "file_name": "src/ssl_sock.c",
                    "file_size": 218708
                }
            ],
            "interesting": {
                "reopen": false,
                "status": false
            },
            "is_parent": false,
            "sha": "64ab33cf21f2a72a3d0bfd38a9faedffc294ea28"
        }
    ],
    "first_commit": "2020-06-11 14:49:37",
    "last_commit": "2020-07-31 17:02:14",
    "number": 676,
    "pull_request": "None",
    "score": {
        "accidental_reopen_likely": false,
        "all_labels": [
            "status: fixed",
            "type: bug"
        ],
        "contains_keywords": [
            "report",
            "warn",
            "reason",
            "confirm",
            "bug",
            "problem",
            "test",
            "fix",
            "patch",
            "issu",
            "work",
            "fault"
        ],
        "fix_size": 36,
        "has_labels": [],
        "intersecting": {
            "computed_score": 0.125,
            "final_commit_size": 8,
            "intersection_size": 1,
            "previous_commits_size": 29
        },
        "is_makefile_based": true,
        "no_new_files": [],
        "no_other_files": false,
        "num_prohibited_files": 106164,
        "prohibited_files": [
            "hal/inc/pinmap_hal.h",
            "Debug/marvin.bin",
            "Debug/marvin.elf",
            "Debug/marvin.hex",
            "Debug/marvin.bin",
            "Debug/marvin.elf",
            "Debug/marvin.hex",
            "inc/spark_utilities.h",
            "Debug/marvin.bin",
            "Debug/marvin.elf"
        ],
        "reopen": true,
        "reopen_events": [
            [
                "2020-06-11 09:24:45",
                "closed"
            ],
            [
                "2020-06-11 09:31:52",
                "reopened"
            ],
            [
                "2020-06-11 15:56:05",
                "commit"
            ],
            [
                "2020-06-11 22:02:50",
                "closed"
            ],
            [
                "2020-06-11 22:06:24",
                "reopened"
            ],
            [
                "2020-06-13 05:25:28",
                "commit"
            ],
            [
                "2020-06-13 05:25:29",
                "commit"
            ],
            [
                "2020-07-31 05:25:31",
                "commit"
            ],
            [
                "2020-08-03 14:59:27",
                "closed"
            ],
            [
                "2020-08-04 05:25:25",
                "commit"
            ]
        ],
        "status": false,
        "strategy": true,
        "total_changes": 60
    }
}