{
    "covered_issues": [
        494,
        485,
        474,
        469,
        463,
        458,
        453,
        442,
        438,
        432,
        431,
        417,
        415,
        406,
        398,
        396,
        392,
        387,
        386,
        385,
        381,
        378,
        377,
        370,
        367,
        361,
        360,
        359,
        358,
        357,
        356,
        351,
        347,
        343,
        341,
        338,
        333,
        330,
        329,
        328,
        327,
        320,
        314,
        313,
        309,
        307,
        304,
        303,
        302,
        299,
        298,
        296,
        286,
        283,
        282,
        277,
        275,
        270,
        265,
        264,
        260,
        249,
        238,
        237,
        226,
        224,
        223,
        214,
        213,
        208,
        207,
        205,
        204,
        200,
        196,
        190,
        187,
        184,
        179,
        168,
        164,
        163,
        161,
        160,
        156,
        155,
        154,
        141,
        139,
        137,
        131,
        129,
        128,
        116,
        107,
        106,
        105,
        97,
        95,
        94,
        88,
        83,
        80,
        78,
        76,
        72,
        69,
        67,
        66,
        64,
        62,
        60,
        59,
        47,
        43,
        42,
        40,
        37,
        35,
        29,
        28,
        27,
        21,
        20,
        19,
        17,
        15,
        10,
        8
    ],
    "finished": true
}