{
    "category": [
        "control flow"
    ],
    "commits": [
        {
            "associated_pull_request": [],
            "date": "2015-09-28 00:28:20",
            "diff": "radareorg_radare2/issue_3369/commit_bff8c1d264f3543ea0566cbb8c43697a69033858.diff",
            "diff_additions": 43,
            "diff_deletions": 94,
            "diff_file_size": 471200,
            "diff_url": "https://github.com/radareorg/radare2/commit/bff8c1d264f3543ea0566cbb8c43697a69033858.diff",
            "exists": true,
            "files": [
                {
                    "file_additions": 5,
                    "file_deletions": 80,
                    "file_exists": true,
                    "file_name": "libr/core/cmd_debug.c",
                    "file_size": 159427
                },
                {
                    "file_additions": 4,
                    "file_deletions": 2,
                    "file_exists": true,
                    "file_name": "libr/core/cmd_print.c",
                    "file_size": 200867
                },
                {
                    "file_additions": 25,
                    "file_deletions": 9,
                    "file_exists": true,
                    "file_name": "libr/core/core.c",
                    "file_size": 110906
                },
                {
                    "file_additions": 4,
                    "file_deletions": 1,
                    "file_exists": false,
                    "file_name": "libr/flags/flags.c",
                    "file_size": 0
                },
                {
                    "file_additions": 5,
                    "file_deletions": 2,
                    "file_exists": false,
                    "file_name": "libr/util/ht.c",
                    "file_size": 0
                }
            ],
            "interesting": {
                "reopen": false,
                "status": true
            },
            "is_parent": true,
            "sha": "bff8c1d264f3543ea0566cbb8c43697a69033858"
        },
        {
            "associated_pull_request": [],
            "date": "2015-09-28 00:32:38",
            "diff": "radareorg_radare2/issue_3369/commit_c7c09610717d355d67008a93cbacbb37028ae76f.diff",
            "diff_additions": 4,
            "diff_deletions": 1,
            "diff_file_size": 19384,
            "diff_url": "https://github.com/radareorg/radare2/commit/c7c09610717d355d67008a93cbacbb37028ae76f.diff",
            "exists": true,
            "files": [
                {
                    "file_additions": 4,
                    "file_deletions": 1,
                    "file_exists": true,
                    "file_name": "libr/bin/format/omf/omf.c",
                    "file_size": 19384
                }
            ],
            "interesting": {
                "reopen": true,
                "status": true
            },
            "is_parent": false,
            "sha": "c7c09610717d355d67008a93cbacbb37028ae76f"
        },
        {
            "associated_pull_request": [],
            "date": "2015-09-28 11:06:33",
            "diff": "radareorg_radare2/issue_3369/commit_ce1087999c7785d5ae58e88fcbec898fdf3fcd42.diff",
            "diff_additions": 4,
            "diff_deletions": 1,
            "diff_file_size": 149762,
            "diff_url": "https://github.com/radareorg/radare2/commit/ce1087999c7785d5ae58e88fcbec898fdf3fcd42.diff",
            "exists": true,
            "files": [
                {
                    "file_additions": 4,
                    "file_deletions": 1,
                    "file_exists": true,
                    "file_name": "libr/bin/format/pe/pe.c",
                    "file_size": 149762
                }
            ],
            "interesting": {
                "reopen": false,
                "status": true
            },
            "is_parent": false,
            "sha": "ce1087999c7785d5ae58e88fcbec898fdf3fcd42"
        }
    ],
    "first_commit": "2015-09-28 00:28:20",
    "last_commit": "2015-09-28 11:06:51",
    "number": 3369,
    "pull_request": "None",
    "score": {
        "accidental_reopen_likely": false,
        "all_labels": [
            "bug",
            "fuzzing"
        ],
        "contains_keywords": [
            "fail",
            "crash",
            "test",
            "fix"
        ],
        "fix_size": 11,
        "has_labels": [
            "bug"
        ],
        "intersecting": {
            "computed_score": 0.0,
            "final_commit_size": 5,
            "intersection_size": 0,
            "previous_commits_size": 6
        },
        "is_makefile_based": true,
        "no_new_files": [
            "libr/bin/format/pe/pe.c"
        ],
        "no_other_files": true,
        "num_prohibited_files": 46884,
        "prohibited_files": [
            "hal/inc/pinmap_hal.h",
            "Debug/marvin.bin",
            "Debug/marvin.elf",
            "Debug/marvin.hex",
            "Debug/marvin.bin",
            "Debug/marvin.elf",
            "Debug/marvin.hex",
            "inc/spark_utilities.h",
            "Debug/marvin.bin",
            "Debug/marvin.elf"
        ],
        "reopen": true,
        "reopen_events": [
            [
                "2015-09-28 00:32:42",
                "closed"
            ],
            [
                "2015-09-28 00:32:42",
                "commit"
            ],
            [
                "2015-09-28 10:19:56",
                "reopened"
            ],
            [
                "2015-09-28 11:07:28",
                "commit"
            ],
            [
                "2015-09-28 11:07:37",
                "closed"
            ]
        ],
        "status": false,
        "strategy": true,
        "total_changes": 147
    }
}