{
    "covered_issues": [
        345,
        340,
        339,
        336,
        330,
        328,
        323,
        319,
        315,
        312,
        296,
        294,
        292,
        291,
        290,
        287,
        286,
        284,
        283,
        279,
        278,
        277,
        276,
        275,
        273,
        264,
        260,
        258,
        254,
        252,
        251,
        250,
        248,
        246,
        244,
        243,
        242,
        238,
        237,
        236,
        235,
        233,
        232,
        231,
        230,
        227,
        226,
        225,
        224,
        221,
        216,
        214,
        213,
        211,
        210,
        208,
        206,
        204,
        203,
        201,
        200,
        199,
        194,
        192,
        191,
        176,
        173,
        172,
        171,
        170,
        169,
        168,
        166,
        165,
        158,
        156,
        155,
        150,
        148,
        145,
        137,
        135,
        134,
        130,
        125,
        120,
        118,
        116,
        112,
        107,
        105,
        99,
        93,
        92,
        90,
        87,
        84,
        83,
        78,
        74,
        73,
        69,
        63,
        59,
        57,
        54,
        52,
        50,
        48,
        46,
        43,
        42,
        34,
        29,
        26,
        24,
        22,
        20,
        18,
        16,
        13,
        9,
        8,
        7,
        6,
        3,
        2
    ],
    "finished": true
}