{
    "commits": [
        {
            "associated_pull_request": [],
            "date": "2013-09-25 16:37:28+00:00",
            "diff": "kevinlawler_kona/issue_205/commit_30547b8c22573ed4156f9aeb8ae7bc5f71d650a5.diff",
            "diff_additions": 1,
            "diff_deletions": 1,
            "diff_file_size": 0,
            "diff_url": "https://github.com/kevinlawler/kona/commit/30547b8c22573ed4156f9aeb8ae7bc5f71d650a5.diff",
            "exists": true,
            "files": [
                {
                    "file_additions": 1,
                    "file_deletions": 1,
                    "file_exists": false,
                    "file_name": "k.c",
                    "file_size": 0
                }
            ],
            "interesting": {
                "reopen": false,
                "status": false
            },
            "is_parent": true,
            "sha": "30547b8c22573ed4156f9aeb8ae7bc5f71d650a5"
        },
        {
            "associated_pull_request": [],
            "date": "2013-11-13 21:56:06+00:00",
            "diff": "kevinlawler_kona/issue_205/commit_4eeb5231e5fc751a5f77484e719dd8034dabd206.diff",
            "diff_additions": 128,
            "diff_deletions": 31,
            "diff_file_size": 0,
            "diff_url": "https://github.com/kevinlawler/kona/commit/4eeb5231e5fc751a5f77484e719dd8034dabd206.diff",
            "exists": true,
            "files": [
                {
                    "file_additions": 1,
                    "file_deletions": 2,
                    "file_exists": false,
                    "file_name": "kc.c",
                    "file_size": 0
                },
                {
                    "file_additions": 34,
                    "file_deletions": 14,
                    "file_exists": false,
                    "file_name": "km.c",
                    "file_size": 0
                },
                {
                    "file_additions": 51,
                    "file_deletions": 9,
                    "file_exists": false,
                    "file_name": "kx.c",
                    "file_size": 0
                },
                {
                    "file_additions": 42,
                    "file_deletions": 6,
                    "file_exists": false,
                    "file_name": "tests.c",
                    "file_size": 0
                }
            ],
            "interesting": {
                "reopen": true,
                "status": false
            },
            "is_parent": false,
            "sha": "4eeb5231e5fc751a5f77484e719dd8034dabd206"
        },
        {
            "associated_pull_request": [],
            "date": "2014-01-01 00:14:32+00:00",
            "diff": "kevinlawler_kona/issue_205/commit_9b5ab80cd40d1c198bb1c80e0691de08f1a7fcdc.diff",
            "diff_additions": 11,
            "diff_deletions": 0,
            "diff_file_size": 0,
            "diff_url": "https://github.com/kevinlawler/kona/commit/9b5ab80cd40d1c198bb1c80e0691de08f1a7fcdc.diff",
            "exists": true,
            "files": [
                {
                    "file_additions": 3,
                    "file_deletions": 0,
                    "file_exists": false,
                    "file_name": "tests.c",
                    "file_size": 0
                },
                {
                    "file_additions": 8,
                    "file_deletions": 0,
                    "file_exists": false,
                    "file_name": "vd.c",
                    "file_size": 0
                }
            ],
            "interesting": {
                "reopen": false,
                "status": false
            },
            "is_parent": false,
            "sha": "9b5ab80cd40d1c198bb1c80e0691de08f1a7fcdc"
        },
        {
            "associated_pull_request": [],
            "date": "2014-01-02 06:29:54+00:00",
            "diff": "kevinlawler_kona/issue_205/commit_96e164576bc965b93428fe7595550a1ad51f6156.diff",
            "diff_additions": 9,
            "diff_deletions": 2,
            "diff_file_size": 0,
            "diff_url": "https://github.com/kevinlawler/kona/commit/96e164576bc965b93428fe7595550a1ad51f6156.diff",
            "exists": true,
            "files": [
                {
                    "file_additions": 1,
                    "file_deletions": 0,
                    "file_exists": false,
                    "file_name": "tests.c",
                    "file_size": 0
                },
                {
                    "file_additions": 1,
                    "file_deletions": 1,
                    "file_exists": false,
                    "file_name": "v.c",
                    "file_size": 0
                },
                {
                    "file_additions": 7,
                    "file_deletions": 1,
                    "file_exists": false,
                    "file_name": "vd.c",
                    "file_size": 0
                }
            ],
            "interesting": {
                "reopen": false,
                "status": false
            },
            "is_parent": false,
            "sha": "96e164576bc965b93428fe7595550a1ad51f6156"
        },
        {
            "associated_pull_request": [],
            "date": "2014-01-11 23:23:11+00:00",
            "diff": "kevinlawler_kona/issue_205/commit_fd24410e249e38a95753b0f607c9b0a8037414b9.diff",
            "diff_additions": 34,
            "diff_deletions": 7,
            "diff_file_size": 0,
            "diff_url": "https://github.com/kevinlawler/kona/commit/fd24410e249e38a95753b0f607c9b0a8037414b9.diff",
            "exists": true,
            "files": [
                {
                    "file_additions": 21,
                    "file_deletions": 1,
                    "file_exists": false,
                    "file_name": "kx.c",
                    "file_size": 0
                },
                {
                    "file_additions": 4,
                    "file_deletions": 1,
                    "file_exists": false,
                    "file_name": "tests.c",
                    "file_size": 0
                },
                {
                    "file_additions": 9,
                    "file_deletions": 5,
                    "file_exists": false,
                    "file_name": "vd.c",
                    "file_size": 0
                }
            ],
            "interesting": {
                "reopen": false,
                "status": false
            },
            "is_parent": false,
            "sha": "fd24410e249e38a95753b0f607c9b0a8037414b9"
        }
    ],
    "first_commit": "2013-09-25 16:37:28+00:00",
    "last_commit": "2014-01-11 23:23:11+00:00",
    "number": 205,
    "pull_request": "None",
    "score": {
        "accidental_reopen_likely": false,
        "all_labels": [
            "crash"
        ],
        "contains_keywords": [
            "work",
            "fail",
            "chang",
            "fix",
            "issu",
            "reason",
            "test",
            "attempt",
            "warn",
            "bug",
            "error",
            "problem",
            "crash"
        ],
        "fix_size": 194,
        "has_labels": [
            "crash report",
            "crash"
        ],
        "intersecting": {
            "computed_score": 0.23684210526315788,
            "final_commit_size": 38,
            "intersection_size": 9,
            "previous_commits_size": 165
        },
        "is_makefile_based": true,
        "no_new_files": [],
        "no_other_files": false,
        "num_prohibited_files": 253756,
        "prohibited_files": [
            "server/src/main/java/com/genymobile/scrcpy/Device.java",
            "server/src/main/java/com/genymobile/scrcpy/wrappers/SurfaceControl.java",
            "server/src/main/java/com/genymobile/scrcpy/Device.java",
            "server/src/main/java/com/genymobile/scrcpy/wrappers/SurfaceControl.java",
            "app/meson.build",
            "app/scrcpy.1",
            "app/src/common.h",
            "app/src/scrcpy.h",
            "app/src/server.h",
            "server/src/main/java/com/genymobile/scrcpy/Workarounds.java"
        ],
        "reopen": true,
        "reopen_events": [
            [
                "2013-11-13 21:57:59+00:00",
                "commit"
            ],
            [
                "2013-11-13 22:02:13+00:00",
                "closed"
            ],
            [
                "2013-11-14 16:51:59+00:00",
                "reopened"
            ],
            [
                "2014-01-01 00:14:36+00:00",
                "commit"
            ],
            [
                "2014-01-02 06:29:58+00:00",
                "commit"
            ],
            [
                "2014-01-11 23:04:58+00:00",
                "closed"
            ],
            [
                "2014-01-11 23:04:58+00:00",
                "commit"
            ]
        ],
        "status": false,
        "strategy": true,
        "total_changes": 224
    }
}