{
    "covered_issues": [
        61,
        52,
        51,
        47,
        45,
        41,
        36,
        31,
        30,
        24,
        23,
        21,
        20,
        19,
        18,
        17,
        15,
        14,
        12,
        11,
        10,
        9,
        8,
        7,
        6,
        5,
        4,
        3,
        2,
        1
    ],
    "finished": true
}