{
    "covered_issues": [
        864,
        863,
        859,
        857,
        854,
        851,
        824,
        820,
        819,
        814,
        808,
        800,
        799,
        782,
        769,
        766,
        765,
        763,
        752,
        749,
        744,
        743,
        741,
        724,
        721,
        720,
        718,
        710,
        707,
        704,
        698,
        691,
        690,
        689,
        688,
        684,
        681,
        662,
        661,
        657,
        656,
        654,
        652,
        646,
        645,
        644,
        637,
        635,
        634,
        631,
        624,
        623,
        622,
        619,
        617,
        612,
        611,
        610,
        607,
        604,
        597,
        595,
        594,
        590,
        588,
        584,
        583,
        582,
        580,
        578,
        574,
        573,
        572,
        571,
        564,
        563,
        556,
        554,
        548,
        545,
        534,
        524,
        523,
        519,
        518,
        513,
        512,
        510,
        509,
        507,
        503,
        502,
        501,
        500,
        499,
        496,
        495,
        494,
        490,
        484,
        481,
        475,
        472,
        470,
        464,
        462,
        461,
        451,
        449,
        448,
        438,
        437,
        434,
        432,
        429,
        425,
        424,
        423,
        421,
        408,
        403,
        399,
        396,
        393,
        386,
        383,
        380,
        377,
        368,
        367,
        364,
        362,
        359,
        357,
        356,
        354,
        351,
        348,
        343,
        338,
        336,
        335,
        334,
        331,
        323,
        321,
        320,
        317,
        311,
        309,
        307,
        306,
        305,
        301,
        300,
        299,
        295,
        293,
        290,
        286,
        283,
        282,
        281,
        280,
        279,
        277,
        274,
        272,
        267,
        266,
        265,
        262,
        261,
        258,
        255,
        253,
        247,
        245,
        236,
        234,
        230,
        229,
        228,
        224,
        221,
        220,
        216,
        213,
        212,
        210,
        204,
        202,
        200,
        199,
        189,
        185,
        184,
        176,
        175,
        172,
        162,
        158,
        150,
        145,
        124,
        120,
        119,
        116,
        108,
        99,
        95,
        94,
        92,
        90,
        89,
        86,
        84,
        83,
        80,
        78,
        77,
        73,
        72,
        67,
        63,
        62,
        59,
        58,
        57,
        53,
        52,
        51,
        44,
        41,
        40,
        38,
        37,
        36,
        35,
        34,
        31,
        30,
        27,
        25,
        24,
        23,
        20,
        19,
        18,
        11,
        9,
        6
    ],
    "finished": true
}