{
    "category": [
        "build/refactor/preprocessing",
        "multithreading"
    ],
    "commits": [
        {
            "associated_pull_request": [],
            "date": "2015-03-07 19:33:06",
            "diff": "",
            "diff_additions": 0,
            "diff_deletions": 0,
            "diff_file_size": 0,
            "diff_url": "https://github.com/nodejs/http-parser/commit/137e174829815e23476fc3b56ad7d78c1b85febb.diff",
            "exists": true,
            "files": [],
            "interesting": {
                "reopen": false,
                "status": false
            },
            "is_parent": true,
            "sha": "137e174829815e23476fc3b56ad7d78c1b85febb"
        },
        {
            "associated_pull_request": [],
            "date": "2015-04-18 00:36:02",
            "diff": "nodejs_http-parser/issue_231/commit_29ca079155abf389d2f8a88887f32021572b3b5a.diff",
            "diff_additions": 122,
            "diff_deletions": 6,
            "diff_file_size": 202265,
            "diff_url": "https://github.com/nodejs/http-parser/commit/29ca079155abf389d2f8a88887f32021572b3b5a.diff",
            "exists": true,
            "files": [
                {
                    "file_additions": 7,
                    "file_deletions": 4,
                    "file_exists": true,
                    "file_name": "http_parser.c",
                    "file_size": 75645
                },
                {
                    "file_additions": 115,
                    "file_deletions": 2,
                    "file_exists": true,
                    "file_name": "test.c",
                    "file_size": 126620
                }
            ],
            "interesting": {
                "reopen": false,
                "status": true
            },
            "is_parent": false,
            "sha": "29ca079155abf389d2f8a88887f32021572b3b5a"
        },
        {
            "associated_pull_request": [],
            "date": "2015-04-22 16:21:13",
            "diff": "nodejs_http-parser/issue_231/commit_a2c737fafd003e1e7025fccd77c4d694d52d3cab.diff",
            "diff_additions": 112,
            "diff_deletions": 6,
            "diff_file_size": 202265,
            "diff_url": "https://github.com/nodejs/http-parser/commit/a2c737fafd003e1e7025fccd77c4d694d52d3cab.diff",
            "exists": true,
            "files": [
                {
                    "file_additions": 10,
                    "file_deletions": 5,
                    "file_exists": true,
                    "file_name": "http_parser.c",
                    "file_size": 75645
                },
                {
                    "file_additions": 102,
                    "file_deletions": 1,
                    "file_exists": true,
                    "file_name": "test.c",
                    "file_size": 126620
                }
            ],
            "interesting": {
                "reopen": false,
                "status": false
            },
            "is_parent": false,
            "sha": "a2c737fafd003e1e7025fccd77c4d694d52d3cab"
        },
        {
            "associated_pull_request": [],
            "date": "2015-04-18 00:36:02",
            "diff": "nodejs_http-parser/issue_231/commit_d7675453a6c03180572f084e95eea0d02df39164.diff",
            "diff_additions": 111,
            "diff_deletions": 6,
            "diff_file_size": 202265,
            "diff_url": "https://github.com/nodejs/http-parser/commit/d7675453a6c03180572f084e95eea0d02df39164.diff",
            "exists": true,
            "files": [
                {
                    "file_additions": 9,
                    "file_deletions": 5,
                    "file_exists": true,
                    "file_name": "http_parser.c",
                    "file_size": 75645
                },
                {
                    "file_additions": 102,
                    "file_deletions": 1,
                    "file_exists": true,
                    "file_name": "test.c",
                    "file_size": 126620
                }
            ],
            "interesting": {
                "reopen": false,
                "status": false
            },
            "is_parent": false,
            "sha": "d7675453a6c03180572f084e95eea0d02df39164"
        }
    ],
    "first_commit": "2015-03-16 05:04:25",
    "last_commit": "2015-04-23 09:54:47",
    "number": 231,
    "pull_request": "None",
    "score": {
        "accidental_reopen_likely": false,
        "all_labels": [],
        "contains_keywords": [
            "chang",
            "error",
            "test",
            "fix",
            "remov"
        ],
        "fix_size": 184,
        "has_labels": [],
        "intersecting": {
            "computed_score": 0.9741379310344828,
            "final_commit_size": 116,
            "intersection_size": 113,
            "previous_commits_size": 181
        },
        "is_makefile_based": true,
        "no_new_files": [],
        "no_other_files": false,
        "num_prohibited_files": 57102,
        "prohibited_files": [
            "hal/inc/pinmap_hal.h",
            "Debug/marvin.bin",
            "Debug/marvin.elf",
            "Debug/marvin.hex",
            "Debug/marvin.bin",
            "Debug/marvin.elf",
            "Debug/marvin.hex",
            "inc/spark_utilities.h",
            "Debug/marvin.bin",
            "Debug/marvin.elf"
        ],
        "reopen": false,
        "reopen_events": [
            [
                "2015-04-18 01:35:28",
                "commit"
            ],
            [
                "2015-04-18 05:48:24",
                "commit"
            ],
            [
                "2015-04-22 17:10:13",
                "commit"
            ],
            [
                "2015-04-23 09:58:43",
                "commit"
            ],
            [
                "2015-04-23 10:27:51",
                "closed"
            ]
        ],
        "status": true,
        "strategy": true,
        "total_changes": 363
    }
}