{
    "category": [
        "memory",
        "multithreading"
    ],
    "commits": [
        {
            "associated_pull_request": [],
            "date": "2015-11-25 20:32:14",
            "diff": "",
            "diff_additions": 0,
            "diff_deletions": 0,
            "diff_file_size": 0,
            "diff_url": "https://github.com/dvorka/hstr/commit/447813ce9e3b804b794d3c29a475d7523025cdb9.diff",
            "exists": true,
            "files": [],
            "interesting": {
                "reopen": false,
                "status": false
            },
            "is_parent": true,
            "sha": "447813ce9e3b804b794d3c29a475d7523025cdb9"
        },
        {
            "associated_pull_request": [],
            "date": "2015-11-26 21:10:00",
            "diff": "dvorka_hstr/issue_176/commit_008a4839ed0571a306d1dcaacd76054090c4ac88.diff",
            "diff_additions": 7,
            "diff_deletions": 0,
            "diff_file_size": 11779,
            "diff_url": "https://github.com/dvorka/hstr/commit/008a4839ed0571a306d1dcaacd76054090c4ac88.diff",
            "exists": true,
            "files": [
                {
                    "file_additions": 7,
                    "file_deletions": 0,
                    "file_exists": true,
                    "file_name": "src/hstr_history.c",
                    "file_size": 11779
                }
            ],
            "interesting": {
                "reopen": true,
                "status": false
            },
            "is_parent": false,
            "sha": "008a4839ed0571a306d1dcaacd76054090c4ac88"
        },
        {
            "associated_pull_request": [],
            "date": "2015-12-29 17:32:52",
            "diff": "dvorka_hstr/issue_176/commit_a9a26d2fb331a5308d0a9a3d36023158e48185d4.diff",
            "diff_additions": 12,
            "diff_deletions": 3,
            "diff_file_size": 11779,
            "diff_url": "https://github.com/dvorka/hstr/commit/a9a26d2fb331a5308d0a9a3d36023158e48185d4.diff",
            "exists": true,
            "files": [
                {
                    "file_additions": 12,
                    "file_deletions": 3,
                    "file_exists": true,
                    "file_name": "src/hstr_history.c",
                    "file_size": 11779
                }
            ],
            "interesting": {
                "reopen": false,
                "status": false
            },
            "is_parent": false,
            "sha": "a9a26d2fb331a5308d0a9a3d36023158e48185d4"
        },
        {
            "associated_pull_request": [],
            "date": "2015-12-29 17:32:52",
            "diff": "dvorka_hstr/issue_176/commit_d5c55964793556b105075caf2c3b099a08e4102b.diff",
            "diff_additions": 12,
            "diff_deletions": 3,
            "diff_file_size": 11779,
            "diff_url": "https://github.com/dvorka/hstr/commit/d5c55964793556b105075caf2c3b099a08e4102b.diff",
            "exists": true,
            "files": [
                {
                    "file_additions": 12,
                    "file_deletions": 3,
                    "file_exists": true,
                    "file_name": "src/hstr_history.c",
                    "file_size": 11779
                }
            ],
            "interesting": {
                "reopen": false,
                "status": false
            },
            "is_parent": false,
            "sha": "d5c55964793556b105075caf2c3b099a08e4102b"
        }
    ],
    "first_commit": "2015-11-25 20:32:14",
    "last_commit": "2015-12-29 17:32:52",
    "number": 176,
    "pull_request": "None",
    "score": {
        "accidental_reopen_likely": false,
        "all_labels": [
            ":beetle: bug"
        ],
        "contains_keywords": [
            "work",
            "report",
            "fix",
            "bug",
            "remov",
            "fail"
        ],
        "fix_size": 18,
        "has_labels": [],
        "intersecting": {
            "computed_score": 1.0,
            "final_commit_size": 16,
            "intersection_size": 16,
            "previous_commits_size": 18
        },
        "is_makefile_based": true,
        "no_new_files": [],
        "no_other_files": false,
        "num_prohibited_files": 56624,
        "prohibited_files": [
            "kill.h",
            "meminfo.h",
            "kill.h",
            "meminfo.h",
            "kill.h",
            "meminfo.h",
            "testsuite_cli_test.go",
            "testsuite_cli_test.go",
            "common.mk",
            "i3bar/include/draw_util.h"
        ],
        "reopen": true,
        "reopen_events": [
            [
                "2015-11-26 21:11:43",
                "closed"
            ],
            [
                "2015-11-26 21:11:43",
                "commit"
            ],
            [
                "2015-12-01 17:22:56",
                "reopened"
            ],
            [
                "2015-12-29 17:33:57",
                "closed"
            ],
            [
                "2015-12-29 17:33:57",
                "commit"
            ],
            [
                "2017-04-12 07:40:06",
                "commit"
            ],
            [
                "2017-04-12 07:40:06",
                "commit"
            ]
        ],
        "status": false,
        "strategy": true,
        "total_changes": 37
    }
}