{
    "covered_issues": [
        592,
        591,
        587,
        583,
        578,
        577,
        573,
        571,
        570,
        569,
        568,
        567,
        566,
        565,
        556,
        555,
        554,
        551,
        549,
        546,
        545,
        543,
        538,
        536,
        535,
        534,
        533,
        532,
        531,
        530,
        529,
        528,
        526,
        523,
        518,
        515,
        509,
        508,
        505,
        503,
        501,
        500,
        497,
        494,
        493,
        490,
        489,
        482,
        481,
        479,
        463,
        457,
        453,
        441,
        417,
        403,
        402,
        399,
        371,
        366,
        349,
        348,
        335,
        327,
        317,
        316,
        311,
        281,
        280,
        275,
        271,
        248,
        244,
        217,
        179,
        165,
        143,
        140,
        139,
        138,
        136,
        134,
        133,
        132,
        131,
        130,
        129,
        128,
        127,
        126,
        125,
        124,
        123,
        122,
        121,
        60,
        21,
        12,
        9,
        8,
        7,
        6,
        5,
        4,
        3
    ],
    "finished": true
}