{
    "covered_issues": [
        34,
        33,
        31,
        30,
        29,
        27,
        22,
        21,
        17,
        16,
        15,
        14,
        10,
        7,
        6,
        5,
        4,
        2,
        1
    ],
    "finished": true
}