{
    "category": [
        "hardware/OS",
        "feature request"
    ],
    "commits": [
        {
            "associated_pull_request": [],
            "date": "2015-01-29 01:25:00",
            "diff": "radareorg_radare2/issue_2005/commit_0cb78f973eb644c39683364d409b7e8e9a119599.diff",
            "diff_additions": 16,
            "diff_deletions": 8,
            "diff_file_size": 5237,
            "diff_url": "https://github.com/radareorg/radare2/commit/0cb78f973eb644c39683364d409b7e8e9a119599.diff",
            "exists": true,
            "files": [
                {
                    "file_additions": 2,
                    "file_deletions": 1,
                    "file_exists": true,
                    "file_name": "binr/radare2/radare2.c",
                    "file_size": 2147
                },
                {
                    "file_additions": 1,
                    "file_deletions": 0,
                    "file_exists": false,
                    "file_name": "libr/core/file.c",
                    "file_size": 0
                },
                {
                    "file_additions": 12,
                    "file_deletions": 6,
                    "file_exists": false,
                    "file_name": "libr/debug/map.c",
                    "file_size": 0
                },
                {
                    "file_additions": 1,
                    "file_deletions": 1,
                    "file_exists": true,
                    "file_name": "libr/util/name.c",
                    "file_size": 3090
                }
            ],
            "interesting": {
                "reopen": false,
                "status": false
            },
            "is_parent": true,
            "sha": "0cb78f973eb644c39683364d409b7e8e9a119599"
        },
        {
            "associated_pull_request": [],
            "date": "2015-01-29 01:49:04",
            "diff": "radareorg_radare2/issue_2005/commit_b04d0f257a3495da54ade1de155ff73324365e91.diff",
            "diff_additions": 15,
            "diff_deletions": 11,
            "diff_file_size": 20541,
            "diff_url": "https://github.com/radareorg/radare2/commit/b04d0f257a3495da54ade1de155ff73324365e91.diff",
            "exists": true,
            "files": [
                {
                    "file_additions": 15,
                    "file_deletions": 11,
                    "file_exists": true,
                    "file_name": "libr/core/cmd_seek.c",
                    "file_size": 20541
                }
            ],
            "interesting": {
                "reopen": true,
                "status": false
            },
            "is_parent": false,
            "sha": "b04d0f257a3495da54ade1de155ff73324365e91"
        },
        {
            "associated_pull_request": [],
            "date": "2015-02-03 03:23:27",
            "diff": "radareorg_radare2/issue_2005/commit_197f194ca16ca0349c3c1c4b6e9062f83680565a.diff",
            "diff_additions": 7,
            "diff_deletions": 6,
            "diff_file_size": 20541,
            "diff_url": "https://github.com/radareorg/radare2/commit/197f194ca16ca0349c3c1c4b6e9062f83680565a.diff",
            "exists": true,
            "files": [
                {
                    "file_additions": 7,
                    "file_deletions": 6,
                    "file_exists": true,
                    "file_name": "libr/core/cmd_seek.c",
                    "file_size": 20541
                }
            ],
            "interesting": {
                "reopen": false,
                "status": false
            },
            "is_parent": false,
            "sha": "197f194ca16ca0349c3c1c4b6e9062f83680565a"
        }
    ],
    "first_commit": "2015-01-29 01:25:00",
    "last_commit": "2015-02-03 03:23:27",
    "number": 2005,
    "pull_request": "None",
    "score": {
        "accidental_reopen_likely": false,
        "all_labels": [],
        "contains_keywords": [
            "fix",
            "issu",
            "work"
        ],
        "fix_size": 22,
        "has_labels": [],
        "intersecting": {
            "computed_score": 0.6666666666666666,
            "final_commit_size": 9,
            "intersection_size": 6,
            "previous_commits_size": 19
        },
        "is_makefile_based": true,
        "no_new_files": [],
        "no_other_files": true,
        "num_prohibited_files": 45648,
        "prohibited_files": [
            "hal/inc/pinmap_hal.h",
            "Debug/marvin.bin",
            "Debug/marvin.elf",
            "Debug/marvin.hex",
            "Debug/marvin.bin",
            "Debug/marvin.elf",
            "Debug/marvin.hex",
            "inc/spark_utilities.h",
            "Debug/marvin.bin",
            "Debug/marvin.elf"
        ],
        "reopen": true,
        "reopen_events": [
            [
                "2015-01-29 01:49:54",
                "closed"
            ],
            [
                "2015-01-29 01:49:54",
                "commit"
            ],
            [
                "2015-01-29 02:50:14",
                "reopened"
            ],
            [
                "2015-02-03 03:24:17",
                "closed"
            ],
            [
                "2015-02-03 03:24:17",
                "commit"
            ]
        ],
        "status": false,
        "strategy": true,
        "total_changes": 63
    }
}