{
    "commits": [
        {
            "associated_pull_request": [],
            "date": "2021-06-04 21:28:27+00:00",
            "diff": "opensips_opensips/issue_2541/commit_79422f56d94a22bfa4156937c1a690c74a25a7c6.diff",
            "diff_additions": 13,
            "diff_deletions": 7,
            "diff_file_size": 11585,
            "diff_url": "https://github.com/OpenSIPS/opensips/commit/79422f56d94a22bfa4156937c1a690c74a25a7c6.diff",
            "exists": true,
            "files": [
                {
                    "file_additions": 13,
                    "file_deletions": 7,
                    "file_exists": true,
                    "file_name": "modules/tls_wolfssl/wolfssl_tls_vars.c",
                    "file_size": 11585
                }
            ],
            "interesting": {
                "reopen": false,
                "status": false
            },
            "is_parent": true,
            "sha": "79422f56d94a22bfa4156937c1a690c74a25a7c6"
        },
        {
            "associated_pull_request": [
                "https://github.com/naveenecosmob/opensips/pull/1",
                "https://github.com/naveenecosmob/opensips/pull/5"
            ],
            "date": "2021-06-04 21:46:00+00:00",
            "diff": "opensips_opensips/issue_2541/commit_bc777333c4b43a50d2b83c8bfce20d994503c7d6.diff",
            "diff_additions": 2,
            "diff_deletions": 2,
            "diff_file_size": 9031,
            "diff_url": "https://github.com/OpenSIPS/opensips/commit/bc777333c4b43a50d2b83c8bfce20d994503c7d6.diff",
            "exists": true,
            "files": [
                {
                    "file_additions": 2,
                    "file_deletions": 2,
                    "file_exists": true,
                    "file_name": "modules/tls_wolfssl/wolfssl.c",
                    "file_size": 9031
                }
            ],
            "interesting": {
                "reopen": true,
                "status": false
            },
            "is_parent": false,
            "sha": "bc777333c4b43a50d2b83c8bfce20d994503c7d6"
        },
        {
            "associated_pull_request": [],
            "date": "2021-08-17 10:52:06+00:00",
            "diff": "opensips_opensips/issue_2541/commit_b1c67295c1ae5937df316df3152b8ecf4da6e067.diff",
            "diff_additions": 42,
            "diff_deletions": 4,
            "diff_file_size": 34375,
            "diff_url": "https://github.com/OpenSIPS/opensips/commit/b1c67295c1ae5937df316df3152b8ecf4da6e067.diff",
            "exists": true,
            "files": [
                {
                    "file_additions": 36,
                    "file_deletions": 3,
                    "file_exists": true,
                    "file_name": "modules/tls_wolfssl/wolfssl.c",
                    "file_size": 9031
                },
                {
                    "file_additions": 6,
                    "file_deletions": 1,
                    "file_exists": true,
                    "file_name": "modules/tls_wolfssl/wolfssl_conn_ops.c",
                    "file_size": 25344
                }
            ],
            "interesting": {
                "reopen": false,
                "status": false
            },
            "is_parent": false,
            "sha": "b1c67295c1ae5937df316df3152b8ecf4da6e067"
        },
        {
            "associated_pull_request": [
                "https://github.com/naveenecosmob/opensips/pull/1",
                "https://github.com/naveenecosmob/opensips/pull/5"
            ],
            "date": "2021-08-17 10:52:06+00:00",
            "diff": "opensips_opensips/issue_2541/commit_73c39ec8fd60ee2685536dbdc3928c7a36a08982.diff",
            "diff_additions": 42,
            "diff_deletions": 4,
            "diff_file_size": 34375,
            "diff_url": "https://github.com/OpenSIPS/opensips/commit/73c39ec8fd60ee2685536dbdc3928c7a36a08982.diff",
            "exists": true,
            "files": [
                {
                    "file_additions": 36,
                    "file_deletions": 3,
                    "file_exists": true,
                    "file_name": "modules/tls_wolfssl/wolfssl.c",
                    "file_size": 9031
                },
                {
                    "file_additions": 6,
                    "file_deletions": 1,
                    "file_exists": true,
                    "file_name": "modules/tls_wolfssl/wolfssl_conn_ops.c",
                    "file_size": 25344
                }
            ],
            "interesting": {
                "reopen": true,
                "status": false
            },
            "is_parent": false,
            "sha": "73c39ec8fd60ee2685536dbdc3928c7a36a08982"
        }
    ],
    "first_commit": "2021-06-07 15:33:13+00:00",
    "last_commit": "2021-08-17 11:10:55+00:00",
    "number": 2541,
    "pull_request": "None",
    "score": {
        "accidental_reopen_likely": false,
        "all_labels": [
            "bug",
            "fixed"
        ],
        "contains_keywords": [
            "work",
            "fail",
            "chang",
            "fix",
            "issu",
            "patch",
            "debug",
            "test",
            "bug",
            "error",
            "crash"
        ],
        "fix_size": 48,
        "has_labels": [
            "bug"
        ],
        "intersecting": {
            "computed_score": 1.0,
            "final_commit_size": 47,
            "intersection_size": 47,
            "previous_commits_size": 48
        },
        "is_makefile_based": true,
        "no_new_files": [],
        "no_other_files": true,
        "num_prohibited_files": 259895,
        "prohibited_files": [
            "server/src/main/java/com/genymobile/scrcpy/Device.java",
            "server/src/main/java/com/genymobile/scrcpy/wrappers/SurfaceControl.java",
            "server/src/main/java/com/genymobile/scrcpy/Device.java",
            "server/src/main/java/com/genymobile/scrcpy/wrappers/SurfaceControl.java",
            "app/meson.build",
            "app/scrcpy.1",
            "app/src/common.h",
            "app/src/scrcpy.h",
            "app/src/server.h",
            "server/src/main/java/com/genymobile/scrcpy/Workarounds.java"
        ],
        "reopen": true,
        "reopen_events": [
            [
                "2021-06-07 15:33:44+00:00",
                "closed"
            ],
            [
                "2021-06-07 15:33:44+00:00",
                "commit"
            ],
            [
                "2021-06-07 15:34:39+00:00",
                "commit"
            ],
            [
                "2021-06-07 18:12:42+00:00",
                "reopened"
            ],
            [
                "2021-08-17 11:13:41+00:00",
                "closed"
            ],
            [
                "2021-08-17 11:13:41+00:00",
                "commit"
            ],
            [
                "2021-08-17 11:13:46+00:00",
                "commit"
            ],
            [
                "2021-10-27 03:20:21+00:00",
                "reopened"
            ],
            [
                "2022-01-19 06:55:50+00:00",
                "closed"
            ]
        ],
        "status": false,
        "strategy": true,
        "total_changes": 116
    }
}