{
    "covered_issues": [
        183,
        179,
        172,
        170,
        169,
        163,
        160,
        156,
        154,
        152,
        150,
        145,
        143,
        141,
        140,
        138,
        137,
        134,
        127,
        126,
        125,
        124,
        121,
        120,
        119,
        118,
        113,
        112,
        109,
        107,
        103,
        102,
        101,
        100,
        96,
        95,
        93,
        91,
        86,
        85,
        84,
        81,
        80,
        75,
        67,
        62,
        59,
        58,
        50,
        48,
        46,
        44,
        39,
        38,
        36,
        33,
        30,
        28,
        27,
        23,
        22,
        20,
        19,
        18,
        16,
        15,
        14,
        11,
        7,
        5,
        4,
        2,
        1
    ],
    "finished": true
}