{
    "category": [
        "build/refactor/preprocessing",
        "multithreading"
    ],
    "commits": [
        {
            "associated_pull_request": [],
            "date": "2020-03-19 16:30:18",
            "diff": "opensips_opensips/issue_2049/commit_5ec398183ee58ddbdcdda454b30ac9247b491783.diff",
            "diff_additions": 10,
            "diff_deletions": 1,
            "diff_file_size": 75987,
            "diff_url": "https://github.com/OpenSIPS/opensips/commit/5ec398183ee58ddbdcdda454b30ac9247b491783.diff",
            "exists": true,
            "files": [
                {
                    "file_additions": 10,
                    "file_deletions": 1,
                    "file_exists": true,
                    "file_name": "modules/dialog/dlg_handlers.c",
                    "file_size": 75987
                }
            ],
            "interesting": {
                "reopen": false,
                "status": false
            },
            "is_parent": true,
            "sha": "5ec398183ee58ddbdcdda454b30ac9247b491783"
        },
        {
            "associated_pull_request": [],
            "date": "2020-03-19 19:12:45",
            "diff": "opensips_opensips/issue_2049/commit_90c025cfb613fc1db48044f10af4a9756f554778.diff",
            "diff_additions": 1,
            "diff_deletions": 1,
            "diff_file_size": 33433,
            "diff_url": "https://github.com/OpenSIPS/opensips/commit/90c025cfb613fc1db48044f10af4a9756f554778.diff",
            "exists": true,
            "files": [
                {
                    "file_additions": 1,
                    "file_deletions": 1,
                    "file_exists": true,
                    "file_name": "action.c",
                    "file_size": 33433
                }
            ],
            "interesting": {
                "reopen": false,
                "status": false
            },
            "is_parent": false,
            "sha": "90c025cfb613fc1db48044f10af4a9756f554778"
        },
        {
            "associated_pull_request": [],
            "date": "2020-03-19 19:12:45",
            "diff": "opensips_opensips/issue_2049/commit_3e17ffce580e4eddd9792c548ab14c23ac70e968.diff",
            "diff_additions": 1,
            "diff_deletions": 1,
            "diff_file_size": 33433,
            "diff_url": "https://github.com/OpenSIPS/opensips/commit/3e17ffce580e4eddd9792c548ab14c23ac70e968.diff",
            "exists": true,
            "files": [
                {
                    "file_additions": 1,
                    "file_deletions": 1,
                    "file_exists": true,
                    "file_name": "action.c",
                    "file_size": 33433
                }
            ],
            "interesting": {
                "reopen": true,
                "status": false
            },
            "is_parent": false,
            "sha": "3e17ffce580e4eddd9792c548ab14c23ac70e968"
        }
    ],
    "first_commit": "2020-03-19 16:34:15",
    "last_commit": "2020-04-16 13:24:26",
    "number": 2049,
    "pull_request": "None",
    "score": {
        "accidental_reopen_likely": false,
        "all_labels": [
            "bug",
            "fixed"
        ],
        "contains_keywords": [
            "bug",
            "problem",
            "test",
            "fix"
        ],
        "fix_size": 3,
        "has_labels": [
            "bug"
        ],
        "intersecting": {
            "computed_score": 0.5,
            "final_commit_size": 2,
            "intersection_size": 1,
            "previous_commits_size": 2
        },
        "is_makefile_based": true,
        "no_new_files": [],
        "no_other_files": true,
        "num_prohibited_files": 33663,
        "prohibited_files": [
            "hal/inc/pinmap_hal.h",
            "Debug/marvin.bin",
            "Debug/marvin.elf",
            "Debug/marvin.hex",
            "Debug/marvin.bin",
            "Debug/marvin.elf",
            "Debug/marvin.hex",
            "inc/spark_utilities.h",
            "Debug/marvin.bin",
            "Debug/marvin.elf"
        ],
        "reopen": true,
        "reopen_events": [
            [
                "2020-03-19 19:14:00",
                "closed"
            ],
            [
                "2020-03-19 19:14:00",
                "commit"
            ],
            [
                "2020-03-19 19:18:42",
                "commit"
            ],
            [
                "2020-03-20 08:25:43",
                "reopened"
            ],
            [
                "2020-04-16 13:21:58",
                "commit"
            ],
            [
                "2020-04-16 13:22:39",
                "commit"
            ],
            [
                "2020-04-16 13:24:39",
                "commit"
            ],
            [
                "2020-04-16 13:25:15",
                "closed"
            ]
        ],
        "status": false,
        "strategy": true,
        "total_changes": 15
    }
}