{
    "category": [
        "build/refactor/preprocessing",
        "wrong API usage"
    ],
    "commits": [
        {
            "associated_pull_request": [
                "https://github.com/ponylang/ponyc/pull/2031"
            ],
            "date": "2017-07-12 01:28:55",
            "diff": "ponylang_ponyc/issue_2035/commit_6a50fb2908b1677152f5fbf8dd6c921cfe6af3e7.diff",
            "diff_additions": 3,
            "diff_deletions": 47,
            "diff_file_size": 112594,
            "diff_url": "https://github.com/ponylang/ponyc/commit/6a50fb2908b1677152f5fbf8dd6c921cfe6af3e7.diff",
            "exists": true,
            "files": [
                {
                    "file_additions": 1,
                    "file_deletions": 1,
                    "file_exists": true,
                    "file_name": "src/libponyc/ast/lexer.c",
                    "file_size": 31162
                },
                {
                    "file_additions": 2,
                    "file_deletions": 27,
                    "file_exists": true,
                    "file_name": "src/libponyc/ast/parser.c",
                    "file_size": 33010
                },
                {
                    "file_additions": 0,
                    "file_deletions": 7,
                    "file_exists": true,
                    "file_name": "src/libponyc/pass/syntax.c",
                    "file_size": 35823
                },
                {
                    "file_additions": 0,
                    "file_deletions": 12,
                    "file_exists": true,
                    "file_name": "test/libponyc/lambda.cc",
                    "file_size": 12599
                }
            ],
            "interesting": {
                "reopen": false,
                "status": false
            },
            "is_parent": true,
            "sha": "6a50fb2908b1677152f5fbf8dd6c921cfe6af3e7"
        },
        {
            "associated_pull_request": [],
            "date": "2017-07-13 01:41:16",
            "diff": "ponylang_ponyc/issue_2035/commit_a8764feed7e5b4a2dddd12f3007f089b94566a78.diff",
            "diff_additions": 20,
            "diff_deletions": 0,
            "diff_file_size": 42114,
            "diff_url": "https://github.com/ponylang/ponyc/commit/a8764feed7e5b4a2dddd12f3007f089b94566a78.diff",
            "exists": true,
            "files": [
                {
                    "file_additions": 3,
                    "file_deletions": 0,
                    "file_exists": true,
                    "file_name": "src/libponyc/expr/operator.c",
                    "file_size": 17544
                },
                {
                    "file_additions": 17,
                    "file_deletions": 0,
                    "file_exists": true,
                    "file_name": "test/libponyc/badpony.cc",
                    "file_size": 24570
                }
            ],
            "interesting": {
                "reopen": false,
                "status": true
            },
            "is_parent": false,
            "sha": "a8764feed7e5b4a2dddd12f3007f089b94566a78"
        },
        {
            "associated_pull_request": [
                "https://github.com/ponylang/ponyc/pull/2036"
            ],
            "date": "2017-07-13 01:41:16",
            "diff": "ponylang_ponyc/issue_2035/commit_ac3def8cf1141181adabf2f1731982ff538545d0.diff",
            "diff_additions": 20,
            "diff_deletions": 0,
            "diff_file_size": 42114,
            "diff_url": "https://github.com/ponylang/ponyc/commit/ac3def8cf1141181adabf2f1731982ff538545d0.diff",
            "exists": true,
            "files": [
                {
                    "file_additions": 3,
                    "file_deletions": 0,
                    "file_exists": true,
                    "file_name": "src/libponyc/expr/operator.c",
                    "file_size": 17544
                },
                {
                    "file_additions": 17,
                    "file_deletions": 0,
                    "file_exists": true,
                    "file_name": "test/libponyc/badpony.cc",
                    "file_size": 24570
                }
            ],
            "interesting": {
                "reopen": false,
                "status": false
            },
            "is_parent": false,
            "sha": "ac3def8cf1141181adabf2f1731982ff538545d0"
        },
        {
            "associated_pull_request": [
                "https://github.com/ponylang/ponyc/pull/2036"
            ],
            "date": "2017-07-13 13:23:48",
            "diff": "ponylang_ponyc/issue_2035/commit_2ca91f9ca30454070926124d4d84a23959c497ee.diff",
            "diff_additions": 20,
            "diff_deletions": 0,
            "diff_file_size": 42114,
            "diff_url": "https://github.com/ponylang/ponyc/commit/2ca91f9ca30454070926124d4d84a23959c497ee.diff",
            "exists": true,
            "files": [
                {
                    "file_additions": 3,
                    "file_deletions": 0,
                    "file_exists": true,
                    "file_name": "src/libponyc/expr/operator.c",
                    "file_size": 17544
                },
                {
                    "file_additions": 17,
                    "file_deletions": 0,
                    "file_exists": true,
                    "file_name": "test/libponyc/badpony.cc",
                    "file_size": 24570
                }
            ],
            "interesting": {
                "reopen": false,
                "status": false
            },
            "is_parent": false,
            "sha": "2ca91f9ca30454070926124d4d84a23959c497ee"
        }
    ],
    "first_commit": "2017-07-12 01:28:55",
    "last_commit": "2017-07-13 13:23:48",
    "number": 2035,
    "pull_request": "None",
    "score": {
        "accidental_reopen_likely": false,
        "all_labels": [],
        "contains_keywords": [
            "report",
            "fix",
            "remov",
            "error",
            "crash"
        ],
        "fix_size": 42,
        "has_labels": [],
        "intersecting": {
            "computed_score": 1.0,
            "final_commit_size": 22,
            "intersection_size": 22,
            "previous_commits_size": 42
        },
        "is_makefile_based": true,
        "no_new_files": [],
        "no_other_files": false,
        "num_prohibited_files": 57860,
        "prohibited_files": [
            "kill.h",
            "meminfo.h",
            "kill.h",
            "meminfo.h",
            "kill.h",
            "meminfo.h",
            "testsuite_cli_test.go",
            "testsuite_cli_test.go",
            "common.mk",
            "i3bar/include/draw_util.h"
        ],
        "reopen": false,
        "reopen_events": [
            [
                "2017-07-13 01:42:37",
                "commit"
            ],
            [
                "2017-07-13 01:44:08",
                "commit"
            ],
            [
                "2017-07-13 13:23:49",
                "closed"
            ],
            [
                "2017-07-13 13:23:52",
                "commit"
            ]
        ],
        "status": true,
        "strategy": true,
        "total_changes": 110
    }
}