{
    "commits": [
        {
            "associated_pull_request": [],
            "date": "2016-04-29 06:52:54+00:00",
            "diff": "",
            "diff_additions": 0,
            "diff_deletions": 0,
            "diff_file_size": 0,
            "diff_url": "https://github.com/confluentinc/librdkafka/commit/c9d27503de52dc041cde90d50ba64a07f58acb2c.diff",
            "exists": true,
            "files": [],
            "interesting": {
                "reopen": false,
                "status": false
            },
            "is_parent": true,
            "sha": "c9d27503de52dc041cde90d50ba64a07f58acb2c"
        },
        {
            "associated_pull_request": [],
            "date": "2016-04-29 19:55:22+00:00",
            "diff": "confluentinc_librdkafka/issue_635/commit_c571043a18f656c47f725223ffce3a65eeee261a.diff",
            "diff_additions": 36,
            "diff_deletions": 45,
            "diff_file_size": 17001,
            "diff_url": "https://github.com/confluentinc/librdkafka/commit/c571043a18f656c47f725223ffce3a65eeee261a.diff",
            "exists": true,
            "files": [
                {
                    "file_additions": 36,
                    "file_deletions": 45,
                    "file_exists": true,
                    "file_name": "src/rdkafka_sasl.c",
                    "file_size": 17001
                }
            ],
            "interesting": {
                "reopen": true,
                "status": false
            },
            "is_parent": false,
            "sha": "c571043a18f656c47f725223ffce3a65eeee261a"
        },
        {
            "associated_pull_request": [
                "https://github.com/confluentinc/librdkafka/pull/665"
            ],
            "date": "2016-05-19 18:19:20+00:00",
            "diff": "confluentinc_librdkafka/issue_635/commit_cc69f15acecbac4b3a0ff2f7884b90d39d97b3f5.diff",
            "diff_additions": 251,
            "diff_deletions": 27,
            "diff_file_size": 420142,
            "diff_url": "https://github.com/confluentinc/librdkafka/commit/cc69f15acecbac4b3a0ff2f7884b90d39d97b3f5.diff",
            "exists": true,
            "files": [
                {
                    "file_additions": 13,
                    "file_deletions": 0,
                    "file_exists": true,
                    "file_name": "src/rdkafka.c",
                    "file_size": 193766
                },
                {
                    "file_additions": 8,
                    "file_deletions": 3,
                    "file_exists": true,
                    "file_name": "src/rdkafka_conf.c",
                    "file_size": 188565
                },
                {
                    "file_additions": 90,
                    "file_deletions": 24,
                    "file_exists": true,
                    "file_name": "src/rdkafka_sasl.c",
                    "file_size": 17001
                },
                {
                    "file_additions": 140,
                    "file_deletions": 0,
                    "file_exists": true,
                    "file_name": "src/rdstring.c",
                    "file_size": 20810
                }
            ],
            "interesting": {
                "reopen": false,
                "status": false
            },
            "is_parent": false,
            "sha": "cc69f15acecbac4b3a0ff2f7884b90d39d97b3f5"
        },
        {
            "associated_pull_request": [
                "https://github.com/confluentinc/librdkafka/pull/665"
            ],
            "date": "2016-05-19 18:20:18+00:00",
            "diff": "confluentinc_librdkafka/issue_635/commit_51d7a3e69429f9f97610f35bc08bfecf48bdba42.diff",
            "diff_additions": 8,
            "diff_deletions": 2,
            "diff_file_size": 17001,
            "diff_url": "https://github.com/confluentinc/librdkafka/commit/51d7a3e69429f9f97610f35bc08bfecf48bdba42.diff",
            "exists": true,
            "files": [
                {
                    "file_additions": 8,
                    "file_deletions": 2,
                    "file_exists": true,
                    "file_name": "src/rdkafka_sasl.c",
                    "file_size": 17001
                }
            ],
            "interesting": {
                "reopen": false,
                "status": false
            },
            "is_parent": false,
            "sha": "51d7a3e69429f9f97610f35bc08bfecf48bdba42"
        },
        {
            "associated_pull_request": [
                "https://github.com/confluentinc/librdkafka/pull/665"
            ],
            "date": "2016-05-23 11:46:46+00:00",
            "diff": "confluentinc_librdkafka/issue_635/commit_4a8ffa58c40ed285c30e7d0ed7d989517ca4dd17.diff",
            "diff_additions": 260,
            "diff_deletions": 29,
            "diff_file_size": 420142,
            "diff_url": "https://github.com/confluentinc/librdkafka/commit/4a8ffa58c40ed285c30e7d0ed7d989517ca4dd17.diff",
            "exists": true,
            "files": [
                {
                    "file_additions": 13,
                    "file_deletions": 0,
                    "file_exists": true,
                    "file_name": "src/rdkafka.c",
                    "file_size": 193766
                },
                {
                    "file_additions": 9,
                    "file_deletions": 3,
                    "file_exists": true,
                    "file_name": "src/rdkafka_conf.c",
                    "file_size": 188565
                },
                {
                    "file_additions": 98,
                    "file_deletions": 26,
                    "file_exists": true,
                    "file_name": "src/rdkafka_sasl.c",
                    "file_size": 17001
                },
                {
                    "file_additions": 140,
                    "file_deletions": 0,
                    "file_exists": true,
                    "file_name": "src/rdstring.c",
                    "file_size": 20810
                }
            ],
            "interesting": {
                "reopen": false,
                "status": false
            },
            "is_parent": false,
            "sha": "4a8ffa58c40ed285c30e7d0ed7d989517ca4dd17"
        }
    ],
    "first_commit": "2016-04-29 06:52:54+00:00",
    "last_commit": "2016-05-23 11:46:46+00:00",
    "number": 635,
    "pull_request": "None",
    "score": {
        "accidental_reopen_likely": false,
        "all_labels": [
            "bug"
        ],
        "contains_keywords": [
            "work",
            "fail",
            "chang",
            "fix",
            "issu",
            "perform",
            "debug",
            "reason",
            "test",
            "attempt",
            "fault",
            "remov",
            "bug",
            "error",
            "problem",
            "report",
            "workaround"
        ],
        "fix_size": 153,
        "has_labels": [
            "bug"
        ],
        "intersecting": {
            "computed_score": 0.8968253968253969,
            "final_commit_size": 126,
            "intersection_size": 113,
            "previous_commits_size": 140
        },
        "is_makefile_based": true,
        "no_new_files": [],
        "no_other_files": false,
        "num_prohibited_files": 77164,
        "prohibited_files": [
            "server/src/main/java/com/genymobile/scrcpy/Device.java",
            "server/src/main/java/com/genymobile/scrcpy/wrappers/SurfaceControl.java",
            "server/src/main/java/com/genymobile/scrcpy/Device.java",
            "server/src/main/java/com/genymobile/scrcpy/wrappers/SurfaceControl.java",
            "app/meson.build",
            "app/scrcpy.1",
            "app/src/common.h",
            "app/src/scrcpy.h",
            "app/src/server.h",
            "server/src/main/java/com/genymobile/scrcpy/Workarounds.java"
        ],
        "reopen": true,
        "reopen_events": [
            [
                "2016-04-29 19:55:23+00:00",
                "commit"
            ],
            [
                "2016-04-29 22:20:25+00:00",
                "closed"
            ],
            [
                "2016-05-05 18:24:11+00:00",
                "reopened"
            ],
            [
                "2016-05-19 18:21:24+00:00",
                "commit"
            ],
            [
                "2016-05-19 18:21:24+00:00",
                "commit"
            ],
            [
                "2016-05-23 11:46:47+00:00",
                "commit"
            ],
            [
                "2016-06-09 15:19:30+00:00",
                "closed"
            ]
        ],
        "status": false,
        "strategy": true,
        "total_changes": 658
    }
}