{
    "covered_issues": [
        340,
        337,
        322,
        311,
        301,
        300,
        296,
        292,
        291,
        289,
        288,
        285,
        283,
        276,
        273,
        269,
        261,
        256,
        251,
        245,
        244,
        237,
        234,
        227,
        226,
        225,
        224,
        222,
        219,
        213,
        209,
        207,
        203,
        202,
        200,
        197,
        195,
        182,
        181,
        179,
        177,
        176,
        175,
        174,
        172,
        170,
        169,
        167,
        165,
        164,
        159,
        158,
        155,
        153,
        152,
        150,
        149,
        147,
        145,
        144,
        143,
        142,
        141,
        139,
        137,
        136,
        133,
        132,
        131,
        130,
        129,
        128,
        127,
        125,
        124,
        123,
        122,
        121,
        120,
        119,
        118,
        117,
        116,
        115,
        113,
        112,
        111,
        110,
        109,
        108,
        107,
        105,
        104,
        103,
        102,
        101,
        100,
        99,
        98,
        97,
        95,
        94,
        93,
        92,
        91,
        90,
        89,
        88,
        87,
        86,
        85,
        84,
        83,
        82,
        81,
        80,
        79,
        78,
        77,
        76,
        75,
        73,
        72,
        71,
        70,
        69,
        68,
        67,
        66,
        64,
        63,
        62,
        61,
        60,
        59,
        58,
        57,
        56,
        55,
        54,
        53,
        51,
        50,
        49,
        48,
        47,
        46,
        45,
        44,
        43,
        42,
        41,
        40,
        39,
        38,
        37,
        36,
        35,
        34,
        33,
        32,
        31,
        30,
        29,
        28,
        27,
        26,
        25,
        24,
        23,
        22,
        21,
        20,
        19,
        18,
        17,
        16,
        15,
        14,
        13,
        12,
        11,
        10,
        9,
        8,
        7,
        6,
        5,
        4,
        3,
        2,
        1
    ],
    "finished": true
}