{
    "commits": [
        {
            "associated_pull_request": [
                "https://github.com/openzfs/zfs/pull/11191"
            ],
            "date": "2020-11-18 23:06:59+00:00",
            "diff": "openzfs_zfs/issue_10523/commit_85703f616ddb83bb94192e24fd8519661578aac2.diff",
            "diff_additions": 24,
            "diff_deletions": 18,
            "diff_file_size": 38525,
            "diff_url": "https://github.com/openzfs/zfs/commit/85703f616ddb83bb94192e24fd8519661578aac2.diff",
            "exists": true,
            "files": [
                {
                    "file_additions": 24,
                    "file_deletions": 18,
                    "file_exists": true,
                    "file_name": "module/zfs/zfs_vnops.c",
                    "file_size": 38525
                }
            ],
            "interesting": {
                "reopen": false,
                "status": false
            },
            "is_parent": true,
            "sha": "85703f616ddb83bb94192e24fd8519661578aac2"
        },
        {
            "associated_pull_request": [],
            "date": "2020-11-17 20:51:30+00:00",
            "diff": "openzfs_zfs/issue_10523/commit_782c32391574ee89af9ac8de1cde7e6723f04daf.diff",
            "diff_additions": 6,
            "diff_deletions": 10,
            "diff_file_size": 199528,
            "diff_url": "https://github.com/openzfs/zfs/commit/782c32391574ee89af9ac8de1cde7e6723f04daf.diff",
            "exists": true,
            "files": [
                {
                    "file_additions": 2,
                    "file_deletions": 1,
                    "file_exists": true,
                    "file_name": "module/os/freebsd/zfs/zio_crypt.c",
                    "file_size": 56374
                },
                {
                    "file_additions": 2,
                    "file_deletions": 1,
                    "file_exists": true,
                    "file_name": "module/os/linux/zfs/zio_crypt.c",
                    "file_size": 62454
                },
                {
                    "file_additions": 2,
                    "file_deletions": 8,
                    "file_exists": true,
                    "file_name": "module/zfs/dsl_crypt.c",
                    "file_size": 80700
                }
            ],
            "interesting": {
                "reopen": false,
                "status": false
            },
            "is_parent": false,
            "sha": "782c32391574ee89af9ac8de1cde7e6723f04daf"
        },
        {
            "associated_pull_request": [],
            "date": "2020-11-17 20:51:30+00:00",
            "diff": "openzfs_zfs/issue_10523/commit_63ae183475c0b332b2cec81e7178facef595fe16.diff",
            "diff_additions": 6,
            "diff_deletions": 10,
            "diff_file_size": 199528,
            "diff_url": "https://github.com/openzfs/zfs/commit/63ae183475c0b332b2cec81e7178facef595fe16.diff",
            "exists": true,
            "files": [
                {
                    "file_additions": 2,
                    "file_deletions": 1,
                    "file_exists": true,
                    "file_name": "module/os/freebsd/zfs/zio_crypt.c",
                    "file_size": 56374
                },
                {
                    "file_additions": 2,
                    "file_deletions": 1,
                    "file_exists": true,
                    "file_name": "module/os/linux/zfs/zio_crypt.c",
                    "file_size": 62454
                },
                {
                    "file_additions": 2,
                    "file_deletions": 8,
                    "file_exists": true,
                    "file_name": "module/zfs/dsl_crypt.c",
                    "file_size": 80700
                }
            ],
            "interesting": {
                "reopen": false,
                "status": false
            },
            "is_parent": false,
            "sha": "63ae183475c0b332b2cec81e7178facef595fe16"
        },
        {
            "associated_pull_request": [],
            "date": "2020-11-17 20:51:30+00:00",
            "diff": "openzfs_zfs/issue_10523/commit_bb5884ab8fbefb17b8f84848aab4cb2f6ad8c1d1.diff",
            "diff_additions": 31,
            "diff_deletions": 27,
            "diff_file_size": 199528,
            "diff_url": "https://github.com/openzfs/zfs/commit/bb5884ab8fbefb17b8f84848aab4cb2f6ad8c1d1.diff",
            "exists": true,
            "files": [
                {
                    "file_additions": 15,
                    "file_deletions": 10,
                    "file_exists": true,
                    "file_name": "module/os/freebsd/zfs/zio_crypt.c",
                    "file_size": 56374
                },
                {
                    "file_additions": 14,
                    "file_deletions": 9,
                    "file_exists": true,
                    "file_name": "module/os/linux/zfs/zio_crypt.c",
                    "file_size": 62454
                },
                {
                    "file_additions": 2,
                    "file_deletions": 8,
                    "file_exists": true,
                    "file_name": "module/zfs/dsl_crypt.c",
                    "file_size": 80700
                }
            ],
            "interesting": {
                "reopen": false,
                "status": false
            },
            "is_parent": false,
            "sha": "bb5884ab8fbefb17b8f84848aab4cb2f6ad8c1d1"
        },
        {
            "associated_pull_request": [],
            "date": "2020-11-17 20:51:30+00:00",
            "diff": "openzfs_zfs/issue_10523/commit_45085ade106f714b431d445f1567037b8a99d334.diff",
            "diff_additions": 31,
            "diff_deletions": 27,
            "diff_file_size": 199528,
            "diff_url": "https://github.com/openzfs/zfs/commit/45085ade106f714b431d445f1567037b8a99d334.diff",
            "exists": true,
            "files": [
                {
                    "file_additions": 15,
                    "file_deletions": 10,
                    "file_exists": true,
                    "file_name": "module/os/freebsd/zfs/zio_crypt.c",
                    "file_size": 56374
                },
                {
                    "file_additions": 14,
                    "file_deletions": 9,
                    "file_exists": true,
                    "file_name": "module/os/linux/zfs/zio_crypt.c",
                    "file_size": 62454
                },
                {
                    "file_additions": 2,
                    "file_deletions": 8,
                    "file_exists": true,
                    "file_name": "module/zfs/dsl_crypt.c",
                    "file_size": 80700
                }
            ],
            "interesting": {
                "reopen": false,
                "status": false
            },
            "is_parent": false,
            "sha": "45085ade106f714b431d445f1567037b8a99d334"
        },
        {
            "associated_pull_request": [],
            "date": "2020-11-17 20:51:30+00:00",
            "diff": "openzfs_zfs/issue_10523/commit_955f99b07be2b6ec2c413e88cdf91a8b5753fe80.diff",
            "diff_additions": 29,
            "diff_deletions": 10,
            "diff_file_size": 199528,
            "diff_url": "https://github.com/openzfs/zfs/commit/955f99b07be2b6ec2c413e88cdf91a8b5753fe80.diff",
            "exists": true,
            "files": [
                {
                    "file_additions": 13,
                    "file_deletions": 1,
                    "file_exists": true,
                    "file_name": "module/os/freebsd/zfs/zio_crypt.c",
                    "file_size": 56374
                },
                {
                    "file_additions": 13,
                    "file_deletions": 1,
                    "file_exists": true,
                    "file_name": "module/os/linux/zfs/zio_crypt.c",
                    "file_size": 62454
                },
                {
                    "file_additions": 3,
                    "file_deletions": 8,
                    "file_exists": true,
                    "file_name": "module/zfs/dsl_crypt.c",
                    "file_size": 80700
                }
            ],
            "interesting": {
                "reopen": false,
                "status": false
            },
            "is_parent": false,
            "sha": "955f99b07be2b6ec2c413e88cdf91a8b5753fe80"
        },
        {
            "associated_pull_request": [],
            "date": "2020-11-17 20:51:30+00:00",
            "diff": "openzfs_zfs/issue_10523/commit_fe4436e695fb65399ecad92e6bec942ec0946cfa.diff",
            "diff_additions": 27,
            "diff_deletions": 17,
            "diff_file_size": 118828,
            "diff_url": "https://github.com/openzfs/zfs/commit/fe4436e695fb65399ecad92e6bec942ec0946cfa.diff",
            "exists": true,
            "files": [
                {
                    "file_additions": 14,
                    "file_deletions": 9,
                    "file_exists": true,
                    "file_name": "module/os/freebsd/zfs/zio_crypt.c",
                    "file_size": 56374
                },
                {
                    "file_additions": 13,
                    "file_deletions": 8,
                    "file_exists": true,
                    "file_name": "module/os/linux/zfs/zio_crypt.c",
                    "file_size": 62454
                }
            ],
            "interesting": {
                "reopen": false,
                "status": false
            },
            "is_parent": false,
            "sha": "fe4436e695fb65399ecad92e6bec942ec0946cfa"
        },
        {
            "associated_pull_request": [
                "https://github.com/openzfs/zfs/pull/11221"
            ],
            "date": "2020-11-17 20:51:30+00:00",
            "diff": "openzfs_zfs/issue_10523/commit_4c5efed46bb0373b975e4ac6e3ba3a607de43f4c.diff",
            "diff_additions": 31,
            "diff_deletions": 10,
            "diff_file_size": 199528,
            "diff_url": "https://github.com/openzfs/zfs/commit/4c5efed46bb0373b975e4ac6e3ba3a607de43f4c.diff",
            "exists": true,
            "files": [
                {
                    "file_additions": 14,
                    "file_deletions": 1,
                    "file_exists": true,
                    "file_name": "module/os/freebsd/zfs/zio_crypt.c",
                    "file_size": 56374
                },
                {
                    "file_additions": 14,
                    "file_deletions": 1,
                    "file_exists": true,
                    "file_name": "module/os/linux/zfs/zio_crypt.c",
                    "file_size": 62454
                },
                {
                    "file_additions": 3,
                    "file_deletions": 8,
                    "file_exists": true,
                    "file_name": "module/zfs/dsl_crypt.c",
                    "file_size": 80700
                }
            ],
            "interesting": {
                "reopen": false,
                "status": false
            },
            "is_parent": false,
            "sha": "4c5efed46bb0373b975e4ac6e3ba3a607de43f4c"
        },
        {
            "associated_pull_request": [
                "https://github.com/openzfs/zfs/pull/11221"
            ],
            "date": "2020-12-04 22:34:29+00:00",
            "diff": "openzfs_zfs/issue_10523/commit_d1d47691c256cd7e15af7819ea33024e6693e9c5.diff",
            "diff_additions": 31,
            "diff_deletions": 10,
            "diff_file_size": 199528,
            "diff_url": "https://github.com/openzfs/zfs/commit/d1d47691c256cd7e15af7819ea33024e6693e9c5.diff",
            "exists": true,
            "files": [
                {
                    "file_additions": 14,
                    "file_deletions": 1,
                    "file_exists": true,
                    "file_name": "module/os/freebsd/zfs/zio_crypt.c",
                    "file_size": 56374
                },
                {
                    "file_additions": 14,
                    "file_deletions": 1,
                    "file_exists": true,
                    "file_name": "module/os/linux/zfs/zio_crypt.c",
                    "file_size": 62454
                },
                {
                    "file_additions": 3,
                    "file_deletions": 8,
                    "file_exists": true,
                    "file_name": "module/zfs/dsl_crypt.c",
                    "file_size": 80700
                }
            ],
            "interesting": {
                "reopen": false,
                "status": false
            },
            "is_parent": false,
            "sha": "d1d47691c256cd7e15af7819ea33024e6693e9c5"
        },
        {
            "associated_pull_request": [],
            "date": "2020-12-04 22:34:29+00:00",
            "diff": "openzfs_zfs/issue_10523/commit_6ed6c239912439322f82f06c8ba72b8b39219011.diff",
            "diff_additions": 31,
            "diff_deletions": 10,
            "diff_file_size": 199528,
            "diff_url": "https://github.com/openzfs/zfs/commit/6ed6c239912439322f82f06c8ba72b8b39219011.diff",
            "exists": true,
            "files": [
                {
                    "file_additions": 14,
                    "file_deletions": 1,
                    "file_exists": true,
                    "file_name": "module/os/freebsd/zfs/zio_crypt.c",
                    "file_size": 56374
                },
                {
                    "file_additions": 14,
                    "file_deletions": 1,
                    "file_exists": true,
                    "file_name": "module/os/linux/zfs/zio_crypt.c",
                    "file_size": 62454
                },
                {
                    "file_additions": 3,
                    "file_deletions": 8,
                    "file_exists": true,
                    "file_name": "module/zfs/dsl_crypt.c",
                    "file_size": 80700
                }
            ],
            "interesting": {
                "reopen": false,
                "status": false
            },
            "is_parent": false,
            "sha": "6ed6c239912439322f82f06c8ba72b8b39219011"
        },
        {
            "associated_pull_request": [],
            "date": "2020-12-04 22:34:29+00:00",
            "diff": "openzfs_zfs/issue_10523/commit_6fa621d4cf51e6cb2914598f0e30994bbdc33249.diff",
            "diff_additions": 31,
            "diff_deletions": 10,
            "diff_file_size": 199528,
            "diff_url": "https://github.com/openzfs/zfs/commit/6fa621d4cf51e6cb2914598f0e30994bbdc33249.diff",
            "exists": true,
            "files": [
                {
                    "file_additions": 14,
                    "file_deletions": 1,
                    "file_exists": true,
                    "file_name": "module/os/freebsd/zfs/zio_crypt.c",
                    "file_size": 56374
                },
                {
                    "file_additions": 14,
                    "file_deletions": 1,
                    "file_exists": true,
                    "file_name": "module/os/linux/zfs/zio_crypt.c",
                    "file_size": 62454
                },
                {
                    "file_additions": 3,
                    "file_deletions": 8,
                    "file_exists": true,
                    "file_name": "module/zfs/dsl_crypt.c",
                    "file_size": 80700
                }
            ],
            "interesting": {
                "reopen": false,
                "status": false
            },
            "is_parent": false,
            "sha": "6fa621d4cf51e6cb2914598f0e30994bbdc33249"
        },
        {
            "associated_pull_request": [],
            "date": "2020-12-04 22:34:29+00:00",
            "diff": "openzfs_zfs/issue_10523/commit_d38ad8f21fa01eafac4e1c93eed3c3f84be098fd.diff",
            "diff_additions": 31,
            "diff_deletions": 10,
            "diff_file_size": 199528,
            "diff_url": "https://github.com/openzfs/zfs/commit/d38ad8f21fa01eafac4e1c93eed3c3f84be098fd.diff",
            "exists": true,
            "files": [
                {
                    "file_additions": 14,
                    "file_deletions": 1,
                    "file_exists": true,
                    "file_name": "module/os/freebsd/zfs/zio_crypt.c",
                    "file_size": 56374
                },
                {
                    "file_additions": 14,
                    "file_deletions": 1,
                    "file_exists": true,
                    "file_name": "module/os/linux/zfs/zio_crypt.c",
                    "file_size": 62454
                },
                {
                    "file_additions": 3,
                    "file_deletions": 8,
                    "file_exists": true,
                    "file_name": "module/zfs/dsl_crypt.c",
                    "file_size": 80700
                }
            ],
            "interesting": {
                "reopen": true,
                "status": false
            },
            "is_parent": false,
            "sha": "d38ad8f21fa01eafac4e1c93eed3c3f84be098fd"
        },
        {
            "associated_pull_request": [
                "https://github.com/openzfs/zfs/pull/12981"
            ],
            "date": "2022-01-21 19:41:17+00:00",
            "diff": "openzfs_zfs/issue_10523/commit_63a26454ba43ca3af5020f25d2e59c7ee15bf13d.diff",
            "diff_additions": 40,
            "diff_deletions": 12,
            "diff_file_size": 225636,
            "diff_url": "https://github.com/openzfs/zfs/commit/63a26454ba43ca3af5020f25d2e59c7ee15bf13d.diff",
            "exists": true,
            "files": [
                {
                    "file_additions": 16,
                    "file_deletions": 1,
                    "file_exists": true,
                    "file_name": "module/os/freebsd/zfs/zio_crypt.c",
                    "file_size": 56374
                },
                {
                    "file_additions": 16,
                    "file_deletions": 1,
                    "file_exists": true,
                    "file_name": "module/os/linux/zfs/zio_crypt.c",
                    "file_size": 62454
                },
                {
                    "file_additions": 7,
                    "file_deletions": 2,
                    "file_exists": true,
                    "file_name": "module/zfs/dnode_sync.c",
                    "file_size": 26108
                },
                {
                    "file_additions": 1,
                    "file_deletions": 8,
                    "file_exists": true,
                    "file_name": "module/zfs/dsl_crypt.c",
                    "file_size": 80700
                }
            ],
            "interesting": {
                "reopen": false,
                "status": false
            },
            "is_parent": false,
            "sha": "63a26454ba43ca3af5020f25d2e59c7ee15bf13d"
        },
        {
            "associated_pull_request": [
                "https://github.com/openzfs/zfs/pull/13063"
            ],
            "date": "2022-01-21 19:41:17+00:00",
            "diff": "openzfs_zfs/issue_10523/commit_e257bd481bb77181e475bf35292c1a4b0cb2c57a.diff",
            "diff_additions": 40,
            "diff_deletions": 12,
            "diff_file_size": 225636,
            "diff_url": "https://github.com/openzfs/zfs/commit/e257bd481bb77181e475bf35292c1a4b0cb2c57a.diff",
            "exists": true,
            "files": [
                {
                    "file_additions": 16,
                    "file_deletions": 1,
                    "file_exists": true,
                    "file_name": "module/os/freebsd/zfs/zio_crypt.c",
                    "file_size": 56374
                },
                {
                    "file_additions": 16,
                    "file_deletions": 1,
                    "file_exists": true,
                    "file_name": "module/os/linux/zfs/zio_crypt.c",
                    "file_size": 62454
                },
                {
                    "file_additions": 7,
                    "file_deletions": 2,
                    "file_exists": true,
                    "file_name": "module/zfs/dnode_sync.c",
                    "file_size": 26108
                },
                {
                    "file_additions": 1,
                    "file_deletions": 8,
                    "file_exists": true,
                    "file_name": "module/zfs/dsl_crypt.c",
                    "file_size": 80700
                }
            ],
            "interesting": {
                "reopen": false,
                "status": false
            },
            "is_parent": false,
            "sha": "e257bd481bb77181e475bf35292c1a4b0cb2c57a"
        },
        {
            "associated_pull_request": [],
            "date": "2022-01-21 19:41:17+00:00",
            "diff": "openzfs_zfs/issue_10523/commit_0fd682ff0fc011b682fb34b839927ea024044969.diff",
            "diff_additions": 40,
            "diff_deletions": 12,
            "diff_file_size": 225636,
            "diff_url": "https://github.com/openzfs/zfs/commit/0fd682ff0fc011b682fb34b839927ea024044969.diff",
            "exists": true,
            "files": [
                {
                    "file_additions": 16,
                    "file_deletions": 1,
                    "file_exists": true,
                    "file_name": "module/os/freebsd/zfs/zio_crypt.c",
                    "file_size": 56374
                },
                {
                    "file_additions": 16,
                    "file_deletions": 1,
                    "file_exists": true,
                    "file_name": "module/os/linux/zfs/zio_crypt.c",
                    "file_size": 62454
                },
                {
                    "file_additions": 7,
                    "file_deletions": 2,
                    "file_exists": true,
                    "file_name": "module/zfs/dnode_sync.c",
                    "file_size": 26108
                },
                {
                    "file_additions": 1,
                    "file_deletions": 8,
                    "file_exists": true,
                    "file_name": "module/zfs/dsl_crypt.c",
                    "file_size": 80700
                }
            ],
            "interesting": {
                "reopen": false,
                "status": false
            },
            "is_parent": false,
            "sha": "0fd682ff0fc011b682fb34b839927ea024044969"
        },
        {
            "associated_pull_request": [],
            "date": "2022-01-21 19:41:17+00:00",
            "diff": "openzfs_zfs/issue_10523/commit_51954a4b46c2f15d7d3de2c2672d78372a495161.diff",
            "diff_additions": 40,
            "diff_deletions": 12,
            "diff_file_size": 225636,
            "diff_url": "https://github.com/openzfs/zfs/commit/51954a4b46c2f15d7d3de2c2672d78372a495161.diff",
            "exists": true,
            "files": [
                {
                    "file_additions": 16,
                    "file_deletions": 1,
                    "file_exists": true,
                    "file_name": "module/os/freebsd/zfs/zio_crypt.c",
                    "file_size": 56374
                },
                {
                    "file_additions": 16,
                    "file_deletions": 1,
                    "file_exists": true,
                    "file_name": "module/os/linux/zfs/zio_crypt.c",
                    "file_size": 62454
                },
                {
                    "file_additions": 7,
                    "file_deletions": 2,
                    "file_exists": true,
                    "file_name": "module/zfs/dnode_sync.c",
                    "file_size": 26108
                },
                {
                    "file_additions": 1,
                    "file_deletions": 8,
                    "file_exists": true,
                    "file_name": "module/zfs/dsl_crypt.c",
                    "file_size": 80700
                }
            ],
            "interesting": {
                "reopen": false,
                "status": false
            },
            "is_parent": false,
            "sha": "51954a4b46c2f15d7d3de2c2672d78372a495161"
        }
    ],
    "first_commit": "2020-11-18 23:06:59+00:00",
    "last_commit": "2022-08-22 15:40:41+00:00",
    "number": 10523,
    "pull_request": "None",
    "score": {
        "accidental_reopen_likely": false,
        "all_labels": [
            "Type: Defect",
            "Component: Send/Recv",
            "Component: Encryption"
        ],
        "contains_keywords": [
            "work",
            "fail",
            "fix",
            "issu",
            "patch",
            "debug",
            "test",
            "attempt",
            "fault",
            "defect",
            "remov",
            "bug",
            "error",
            "problem",
            "report"
        ],
        "fix_size": 87,
        "has_labels": [],
        "intersecting": {
            "computed_score": 1.0,
            "final_commit_size": 52,
            "intersection_size": 52,
            "previous_commits_size": 87
        },
        "is_makefile_based": true,
        "no_new_files": [],
        "no_other_files": false,
        "num_prohibited_files": 127410,
        "prohibited_files": [
            "server/src/main/java/com/genymobile/scrcpy/Device.java",
            "server/src/main/java/com/genymobile/scrcpy/wrappers/SurfaceControl.java",
            "server/src/main/java/com/genymobile/scrcpy/Device.java",
            "server/src/main/java/com/genymobile/scrcpy/wrappers/SurfaceControl.java",
            "app/meson.build",
            "app/scrcpy.1",
            "app/src/common.h",
            "app/src/scrcpy.h",
            "app/src/server.h",
            "server/src/main/java/com/genymobile/scrcpy/Workarounds.java"
        ],
        "reopen": true,
        "reopen_events": [
            [
                "2020-11-19 19:08:29+00:00",
                "commit"
            ],
            [
                "2020-11-19 19:09:44+00:00",
                "commit"
            ],
            [
                "2020-11-19 19:19:43+00:00",
                "commit"
            ],
            [
                "2020-11-20 20:43:03+00:00",
                "commit"
            ],
            [
                "2020-11-21 13:24:50+00:00",
                "commit"
            ],
            [
                "2020-11-25 09:37:44+00:00",
                "commit"
            ],
            [
                "2020-11-25 11:31:46+00:00",
                "commit"
            ],
            [
                "2020-12-04 22:34:30+00:00",
                "closed"
            ],
            [
                "2020-12-04 22:34:31+00:00",
                "commit"
            ],
            [
                "2020-12-23 21:02:15+00:00",
                "commit"
            ],
            [
                "2021-03-30 05:26:10+00:00",
                "commit"
            ],
            [
                "2021-05-31 15:34:08+00:00",
                "commit"
            ],
            [
                "2021-10-06 17:47:28+00:00",
                "reopened"
            ],
            [
                "2022-01-21 19:41:18+00:00",
                "closed"
            ],
            [
                "2022-01-21 19:41:20+00:00",
                "commit"
            ],
            [
                "2022-02-05 00:21:37+00:00",
                "commit"
            ],
            [
                "2022-08-22 14:34:02+00:00",
                "commit"
            ],
            [
                "2022-08-22 18:08:13+00:00",
                "commit"
            ]
        ],
        "status": false,
        "strategy": true,
        "total_changes": 686
    }
}