{
    "all_issues": 547,
    "interesting_issues": 1,
    "last_update": "2021-05-16 16:04:43.582364",
    "license": {
        "download": "https://raw.githubusercontent.com/nginx/unit/master/LICENSE",
        "name": "Apache License 2.0"
    },
    "ratio": 0.0018281535648994515,
    "size": 10950,
    "stars": 2325,
    "url": "https://github.com/nginx/unit"
}