{
    "commits": [
        {
            "associated_pull_request": [],
            "date": "2022-06-09 08:19:44+00:00",
            "diff": "yugabyte_yugabyte-db/issue_12730/commit_f5ce6bc596af5185d9cccb89ed7af1ec2f9abda2.diff",
            "diff_additions": 1601,
            "diff_deletions": 274,
            "diff_file_size": 226069,
            "diff_url": "https://github.com/yugabyte/yugabyte-db/commit/f5ce6bc596af5185d9cccb89ed7af1ec2f9abda2.diff",
            "exists": true,
            "files": [
                {
                    "file_additions": 213,
                    "file_deletions": 52,
                    "file_exists": false,
                    "file_name": "ent/src/yb/cdc/cdc_service.cc",
                    "file_size": 0
                },
                {
                    "file_additions": 4,
                    "file_deletions": 1,
                    "file_exists": false,
                    "file_name": "ent/src/yb/cdc/cdcsdk_producer.cc",
                    "file_size": 0
                },
                {
                    "file_additions": 1289,
                    "file_deletions": 192,
                    "file_exists": false,
                    "file_name": "ent/src/yb/integration-tests/cdcsdk_ysql-test.cc",
                    "file_size": 0
                },
                {
                    "file_additions": 35,
                    "file_deletions": 11,
                    "file_exists": false,
                    "file_name": "ent/src/yb/master/catalog_manager_ent.cc",
                    "file_size": 0
                },
                {
                    "file_additions": 8,
                    "file_deletions": 6,
                    "file_exists": true,
                    "file_name": "src/yb/consensus/consensus_queue.cc",
                    "file_size": 71010
                },
                {
                    "file_additions": 44,
                    "file_deletions": 1,
                    "file_exists": true,
                    "file_name": "src/yb/tablet/tablet_peer.cc",
                    "file_size": 66997
                },
                {
                    "file_additions": 8,
                    "file_deletions": 11,
                    "file_exists": true,
                    "file_name": "src/yb/tablet/transaction_participant.cc",
                    "file_size": 88062
                }
            ],
            "interesting": {
                "reopen": false,
                "status": false
            },
            "is_parent": true,
            "sha": "f5ce6bc596af5185d9cccb89ed7af1ec2f9abda2"
        },
        {
            "associated_pull_request": [],
            "date": "2022-06-14 13:49:40+00:00",
            "diff": "yugabyte_yugabyte-db/issue_12730/commit_1777ba7454cc0fb5a274ee741af5c65af1d133af.diff",
            "diff_additions": 488,
            "diff_deletions": 85,
            "diff_file_size": 629687,
            "diff_url": "https://github.com/yugabyte/yugabyte-db/commit/1777ba7454cc0fb5a274ee741af5c65af1d133af.diff",
            "exists": true,
            "files": [
                {
                    "file_additions": 335,
                    "file_deletions": 6,
                    "file_exists": false,
                    "file_name": "ent/src/yb/integration-tests/cdcsdk_ysql-test.cc",
                    "file_size": 0
                },
                {
                    "file_additions": 1,
                    "file_deletions": 1,
                    "file_exists": true,
                    "file_name": "src/yb/tablet/operations/update_txn_operation.cc",
                    "file_size": 3025
                },
                {
                    "file_additions": 6,
                    "file_deletions": 6,
                    "file_exists": true,
                    "file_name": "src/yb/tablet/running_transaction.cc",
                    "file_size": 27908
                },
                {
                    "file_additions": 18,
                    "file_deletions": 10,
                    "file_exists": true,
                    "file_name": "src/yb/tablet/tablet.cc",
                    "file_size": 189486
                },
                {
                    "file_additions": 12,
                    "file_deletions": 2,
                    "file_exists": true,
                    "file_name": "src/yb/tablet/tablet_bootstrap-test.cc",
                    "file_size": 39170
                },
                {
                    "file_additions": 47,
                    "file_deletions": 34,
                    "file_exists": true,
                    "file_name": "src/yb/tablet/tablet_bootstrap.cc",
                    "file_size": 86496
                },
                {
                    "file_additions": 0,
                    "file_deletions": 5,
                    "file_exists": true,
                    "file_name": "src/yb/tablet/tablet_peer.cc",
                    "file_size": 66997
                },
                {
                    "file_additions": 69,
                    "file_deletions": 20,
                    "file_exists": true,
                    "file_name": "src/yb/tablet/transaction_participant.cc",
                    "file_size": 88062
                },
                {
                    "file_additions": 0,
                    "file_deletions": 1,
                    "file_exists": true,
                    "file_name": "src/yb/tserver/ts_tablet_manager.cc",
                    "file_size": 128543
                }
            ],
            "interesting": {
                "reopen": false,
                "status": false
            },
            "is_parent": false,
            "sha": "1777ba7454cc0fb5a274ee741af5c65af1d133af"
        },
        {
            "associated_pull_request": [],
            "date": "2022-06-16 03:36:07+00:00",
            "diff": "yugabyte_yugabyte-db/issue_12730/commit_ec5118b362e10ca3177a63b08469a0424c3785ab.diff",
            "diff_additions": 394,
            "diff_deletions": 42,
            "diff_file_size": 626662,
            "diff_url": "https://github.com/yugabyte/yugabyte-db/commit/ec5118b362e10ca3177a63b08469a0424c3785ab.diff",
            "exists": true,
            "files": [
                {
                    "file_additions": 337,
                    "file_deletions": 9,
                    "file_exists": false,
                    "file_name": "ent/src/yb/integration-tests/cdcsdk_ysql-test.cc",
                    "file_size": 0
                },
                {
                    "file_additions": 2,
                    "file_deletions": 3,
                    "file_exists": true,
                    "file_name": "src/yb/tablet/running_transaction.cc",
                    "file_size": 27908
                },
                {
                    "file_additions": 6,
                    "file_deletions": 0,
                    "file_exists": true,
                    "file_name": "src/yb/tablet/tablet.cc",
                    "file_size": 189486
                },
                {
                    "file_additions": 11,
                    "file_deletions": 0,
                    "file_exists": true,
                    "file_name": "src/yb/tablet/tablet_bootstrap-test.cc",
                    "file_size": 39170
                },
                {
                    "file_additions": 26,
                    "file_deletions": 15,
                    "file_exists": true,
                    "file_name": "src/yb/tablet/tablet_bootstrap.cc",
                    "file_size": 86496
                },
                {
                    "file_additions": 0,
                    "file_deletions": 5,
                    "file_exists": true,
                    "file_name": "src/yb/tablet/tablet_peer.cc",
                    "file_size": 66997
                },
                {
                    "file_additions": 12,
                    "file_deletions": 9,
                    "file_exists": true,
                    "file_name": "src/yb/tablet/transaction_participant.cc",
                    "file_size": 88062
                },
                {
                    "file_additions": 0,
                    "file_deletions": 1,
                    "file_exists": true,
                    "file_name": "src/yb/tserver/ts_tablet_manager.cc",
                    "file_size": 128543
                }
            ],
            "interesting": {
                "reopen": false,
                "status": false
            },
            "is_parent": false,
            "sha": "ec5118b362e10ca3177a63b08469a0424c3785ab"
        },
        {
            "associated_pull_request": [],
            "date": "2022-06-16 03:36:07+00:00",
            "diff": "yugabyte_yugabyte-db/issue_12730/commit_3546682fa84eb2f30ab0ddcbce4815e68888dc08.diff",
            "diff_additions": 394,
            "diff_deletions": 42,
            "diff_file_size": 626662,
            "diff_url": "https://github.com/yugabyte/yugabyte-db/commit/3546682fa84eb2f30ab0ddcbce4815e68888dc08.diff",
            "exists": true,
            "files": [
                {
                    "file_additions": 337,
                    "file_deletions": 9,
                    "file_exists": false,
                    "file_name": "ent/src/yb/integration-tests/cdcsdk_ysql-test.cc",
                    "file_size": 0
                },
                {
                    "file_additions": 2,
                    "file_deletions": 3,
                    "file_exists": true,
                    "file_name": "src/yb/tablet/running_transaction.cc",
                    "file_size": 27908
                },
                {
                    "file_additions": 6,
                    "file_deletions": 0,
                    "file_exists": true,
                    "file_name": "src/yb/tablet/tablet.cc",
                    "file_size": 189486
                },
                {
                    "file_additions": 11,
                    "file_deletions": 0,
                    "file_exists": true,
                    "file_name": "src/yb/tablet/tablet_bootstrap-test.cc",
                    "file_size": 39170
                },
                {
                    "file_additions": 26,
                    "file_deletions": 15,
                    "file_exists": true,
                    "file_name": "src/yb/tablet/tablet_bootstrap.cc",
                    "file_size": 86496
                },
                {
                    "file_additions": 0,
                    "file_deletions": 5,
                    "file_exists": true,
                    "file_name": "src/yb/tablet/tablet_peer.cc",
                    "file_size": 66997
                },
                {
                    "file_additions": 12,
                    "file_deletions": 9,
                    "file_exists": true,
                    "file_name": "src/yb/tablet/transaction_participant.cc",
                    "file_size": 88062
                },
                {
                    "file_additions": 0,
                    "file_deletions": 1,
                    "file_exists": true,
                    "file_name": "src/yb/tserver/ts_tablet_manager.cc",
                    "file_size": 128543
                }
            ],
            "interesting": {
                "reopen": false,
                "status": false
            },
            "is_parent": false,
            "sha": "3546682fa84eb2f30ab0ddcbce4815e68888dc08"
        },
        {
            "associated_pull_request": [],
            "date": "2022-06-16 03:36:07+00:00",
            "diff": "yugabyte_yugabyte-db/issue_12730/commit_5e2a9079f750424ebd49eb23827b818cf021187f.diff",
            "diff_additions": 394,
            "diff_deletions": 42,
            "diff_file_size": 626662,
            "diff_url": "https://github.com/yugabyte/yugabyte-db/commit/5e2a9079f750424ebd49eb23827b818cf021187f.diff",
            "exists": true,
            "files": [
                {
                    "file_additions": 337,
                    "file_deletions": 9,
                    "file_exists": false,
                    "file_name": "ent/src/yb/integration-tests/cdcsdk_ysql-test.cc",
                    "file_size": 0
                },
                {
                    "file_additions": 2,
                    "file_deletions": 3,
                    "file_exists": true,
                    "file_name": "src/yb/tablet/running_transaction.cc",
                    "file_size": 27908
                },
                {
                    "file_additions": 6,
                    "file_deletions": 0,
                    "file_exists": true,
                    "file_name": "src/yb/tablet/tablet.cc",
                    "file_size": 189486
                },
                {
                    "file_additions": 11,
                    "file_deletions": 0,
                    "file_exists": true,
                    "file_name": "src/yb/tablet/tablet_bootstrap-test.cc",
                    "file_size": 39170
                },
                {
                    "file_additions": 26,
                    "file_deletions": 15,
                    "file_exists": true,
                    "file_name": "src/yb/tablet/tablet_bootstrap.cc",
                    "file_size": 86496
                },
                {
                    "file_additions": 0,
                    "file_deletions": 5,
                    "file_exists": true,
                    "file_name": "src/yb/tablet/tablet_peer.cc",
                    "file_size": 66997
                },
                {
                    "file_additions": 12,
                    "file_deletions": 9,
                    "file_exists": true,
                    "file_name": "src/yb/tablet/transaction_participant.cc",
                    "file_size": 88062
                },
                {
                    "file_additions": 0,
                    "file_deletions": 1,
                    "file_exists": true,
                    "file_name": "src/yb/tserver/ts_tablet_manager.cc",
                    "file_size": 128543
                }
            ],
            "interesting": {
                "reopen": false,
                "status": false
            },
            "is_parent": false,
            "sha": "5e2a9079f750424ebd49eb23827b818cf021187f"
        },
        {
            "associated_pull_request": [],
            "date": "2022-06-16 03:36:07+00:00",
            "diff": "yugabyte_yugabyte-db/issue_12730/commit_a0268b4e3f4c05bbc943e626a2c82cdc01a0bef7.diff",
            "diff_additions": 394,
            "diff_deletions": 42,
            "diff_file_size": 626662,
            "diff_url": "https://github.com/yugabyte/yugabyte-db/commit/a0268b4e3f4c05bbc943e626a2c82cdc01a0bef7.diff",
            "exists": true,
            "files": [
                {
                    "file_additions": 337,
                    "file_deletions": 9,
                    "file_exists": false,
                    "file_name": "ent/src/yb/integration-tests/cdcsdk_ysql-test.cc",
                    "file_size": 0
                },
                {
                    "file_additions": 2,
                    "file_deletions": 3,
                    "file_exists": true,
                    "file_name": "src/yb/tablet/running_transaction.cc",
                    "file_size": 27908
                },
                {
                    "file_additions": 6,
                    "file_deletions": 0,
                    "file_exists": true,
                    "file_name": "src/yb/tablet/tablet.cc",
                    "file_size": 189486
                },
                {
                    "file_additions": 11,
                    "file_deletions": 0,
                    "file_exists": true,
                    "file_name": "src/yb/tablet/tablet_bootstrap-test.cc",
                    "file_size": 39170
                },
                {
                    "file_additions": 26,
                    "file_deletions": 15,
                    "file_exists": true,
                    "file_name": "src/yb/tablet/tablet_bootstrap.cc",
                    "file_size": 86496
                },
                {
                    "file_additions": 0,
                    "file_deletions": 5,
                    "file_exists": true,
                    "file_name": "src/yb/tablet/tablet_peer.cc",
                    "file_size": 66997
                },
                {
                    "file_additions": 12,
                    "file_deletions": 9,
                    "file_exists": true,
                    "file_name": "src/yb/tablet/transaction_participant.cc",
                    "file_size": 88062
                },
                {
                    "file_additions": 0,
                    "file_deletions": 1,
                    "file_exists": true,
                    "file_name": "src/yb/tserver/ts_tablet_manager.cc",
                    "file_size": 128543
                }
            ],
            "interesting": {
                "reopen": false,
                "status": false
            },
            "is_parent": false,
            "sha": "a0268b4e3f4c05bbc943e626a2c82cdc01a0bef7"
        },
        {
            "associated_pull_request": [],
            "date": "2022-06-16 03:36:07+00:00",
            "diff": "yugabyte_yugabyte-db/issue_12730/commit_68330b6bfdf9c61bbe12ba1a90a3230c60e890df.diff",
            "diff_additions": 394,
            "diff_deletions": 42,
            "diff_file_size": 626662,
            "diff_url": "https://github.com/yugabyte/yugabyte-db/commit/68330b6bfdf9c61bbe12ba1a90a3230c60e890df.diff",
            "exists": true,
            "files": [
                {
                    "file_additions": 337,
                    "file_deletions": 9,
                    "file_exists": false,
                    "file_name": "ent/src/yb/integration-tests/cdcsdk_ysql-test.cc",
                    "file_size": 0
                },
                {
                    "file_additions": 2,
                    "file_deletions": 3,
                    "file_exists": true,
                    "file_name": "src/yb/tablet/running_transaction.cc",
                    "file_size": 27908
                },
                {
                    "file_additions": 6,
                    "file_deletions": 0,
                    "file_exists": true,
                    "file_name": "src/yb/tablet/tablet.cc",
                    "file_size": 189486
                },
                {
                    "file_additions": 11,
                    "file_deletions": 0,
                    "file_exists": true,
                    "file_name": "src/yb/tablet/tablet_bootstrap-test.cc",
                    "file_size": 39170
                },
                {
                    "file_additions": 26,
                    "file_deletions": 15,
                    "file_exists": true,
                    "file_name": "src/yb/tablet/tablet_bootstrap.cc",
                    "file_size": 86496
                },
                {
                    "file_additions": 0,
                    "file_deletions": 5,
                    "file_exists": true,
                    "file_name": "src/yb/tablet/tablet_peer.cc",
                    "file_size": 66997
                },
                {
                    "file_additions": 12,
                    "file_deletions": 9,
                    "file_exists": true,
                    "file_name": "src/yb/tablet/transaction_participant.cc",
                    "file_size": 88062
                },
                {
                    "file_additions": 0,
                    "file_deletions": 1,
                    "file_exists": true,
                    "file_name": "src/yb/tserver/ts_tablet_manager.cc",
                    "file_size": 128543
                }
            ],
            "interesting": {
                "reopen": true,
                "status": false
            },
            "is_parent": false,
            "sha": "68330b6bfdf9c61bbe12ba1a90a3230c60e890df"
        },
        {
            "associated_pull_request": [],
            "date": "2022-06-30 05:11:55+00:00",
            "diff": "yugabyte_yugabyte-db/issue_12730/commit_a64015b645f2e25a6a7d04cfdeded7b1cb399192.diff",
            "diff_additions": 15,
            "diff_deletions": 1,
            "diff_file_size": 88062,
            "diff_url": "https://github.com/yugabyte/yugabyte-db/commit/a64015b645f2e25a6a7d04cfdeded7b1cb399192.diff",
            "exists": true,
            "files": [
                {
                    "file_additions": 1,
                    "file_deletions": 0,
                    "file_exists": false,
                    "file_name": "ent/src/yb/cdc/cdc_service.cc",
                    "file_size": 0
                },
                {
                    "file_additions": 5,
                    "file_deletions": 0,
                    "file_exists": false,
                    "file_name": "ent/src/yb/cdc/cdcsdk_producer.cc",
                    "file_size": 0
                },
                {
                    "file_additions": 9,
                    "file_deletions": 1,
                    "file_exists": true,
                    "file_name": "src/yb/tablet/transaction_participant.cc",
                    "file_size": 88062
                }
            ],
            "interesting": {
                "reopen": true,
                "status": false
            },
            "is_parent": false,
            "sha": "a64015b645f2e25a6a7d04cfdeded7b1cb399192"
        }
    ],
    "first_commit": "2022-06-13 13:10:50+00:00",
    "last_commit": "2022-06-30 07:40:43+00:00",
    "number": 12730,
    "pull_request": "None",
    "score": {
        "accidental_reopen_likely": true,
        "all_labels": [
            "kind/bug",
            "priority/medium",
            "area/cdcsdk"
        ],
        "contains_keywords": [
            "fail",
            "chang",
            "issu",
            "debug",
            "reason",
            "test",
            "fault",
            "remov",
            "bug",
            "error",
            "problem"
        ],
        "fix_size": 677,
        "has_labels": [],
        "intersecting": {
            "computed_score": 0.05263157894736842,
            "final_commit_size": 19,
            "intersection_size": 1,
            "previous_commits_size": 659
        },
        "is_makefile_based": true,
        "no_new_files": [
            "ent/src/yb/cdc/cdc_service.cc",
            "ent/src/yb/cdc/cdcsdk_producer.cc"
        ],
        "no_other_files": false,
        "num_prohibited_files": 122966,
        "prohibited_files": [
            "server/src/main/java/com/genymobile/scrcpy/Device.java",
            "server/src/main/java/com/genymobile/scrcpy/wrappers/SurfaceControl.java",
            "server/src/main/java/com/genymobile/scrcpy/Device.java",
            "server/src/main/java/com/genymobile/scrcpy/wrappers/SurfaceControl.java",
            "app/meson.build",
            "app/scrcpy.1",
            "app/src/common.h",
            "app/src/scrcpy.h",
            "app/src/server.h",
            "server/src/main/java/com/genymobile/scrcpy/Workarounds.java"
        ],
        "reopen": true,
        "reopen_events": [
            [
                "2022-06-14 14:31:38+00:00",
                "commit"
            ],
            [
                "2022-06-16 03:43:26+00:00",
                "commit"
            ],
            [
                "2022-06-16 14:06:01+00:00",
                "commit"
            ],
            [
                "2022-06-16 14:07:50+00:00",
                "commit"
            ],
            [
                "2022-06-16 14:08:44+00:00",
                "commit"
            ],
            [
                "2022-06-16 14:48:53+00:00",
                "commit"
            ],
            [
                "2022-06-29 14:29:16+00:00",
                "closed"
            ],
            [
                "2022-06-30 05:15:08+00:00",
                "reopened"
            ],
            [
                "2022-06-30 07:40:49+00:00",
                "commit"
            ],
            [
                "2022-07-04 16:43:03+00:00",
                "closed"
            ],
            [
                "2022-07-20 06:27:58+00:00",
                "reopened"
            ],
            [
                "2022-07-20 06:28:03+00:00",
                "closed"
            ]
        ],
        "status": false,
        "strategy": true,
        "total_changes": 4644
    }
}