{
    "covered_issues": [
        486,
        483,
        482,
        478,
        473,
        465,
        457,
        454,
        452,
        449,
        447,
        442,
        441,
        440,
        437,
        435,
        434,
        432,
        431,
        430,
        428,
        426,
        422,
        420,
        418,
        416,
        414,
        409,
        408,
        402,
        401,
        400,
        397,
        396,
        394,
        393,
        391,
        382,
        377,
        376,
        375,
        372,
        370,
        364,
        358,
        357,
        348,
        346,
        343,
        341,
        338,
        337,
        333,
        330,
        329,
        326,
        322,
        321,
        318,
        314,
        312,
        305,
        304,
        300,
        299,
        298,
        293,
        291,
        290,
        284,
        281,
        277,
        269,
        248,
        245,
        241,
        237,
        231,
        229,
        224,
        218,
        213,
        208,
        202,
        199,
        195,
        189,
        181,
        175,
        173,
        166,
        165,
        163,
        159,
        156,
        153,
        151,
        142,
        140,
        139,
        138,
        137,
        135,
        133,
        132,
        130,
        128,
        127,
        122,
        120,
        119,
        118,
        117,
        114,
        113,
        112,
        109,
        108,
        105,
        104,
        103,
        102,
        101,
        100,
        99,
        98,
        97,
        96,
        94,
        93,
        92,
        91,
        89,
        87,
        85,
        84,
        83,
        82,
        81,
        80,
        77,
        75,
        70,
        69,
        68,
        66,
        61,
        60,
        58,
        57,
        56,
        55,
        51,
        50,
        49,
        46,
        45,
        44,
        43,
        42,
        39,
        38,
        36,
        35,
        34,
        33,
        32,
        31,
        30,
        29,
        28,
        27,
        26,
        25,
        23,
        22,
        21,
        20,
        19,
        15,
        14,
        13,
        12,
        11,
        10,
        9,
        8,
        7,
        5,
        4,
        3,
        2,
        1
    ],
    "finished": true
}