{
    "commits": [
        {
            "associated_pull_request": [
                "https://github.com/netdata/netdata/pull/1005"
            ],
            "date": "2016-09-21 18:03:26+00:00",
            "diff": "",
            "diff_additions": 0,
            "diff_deletions": 0,
            "diff_file_size": 0,
            "diff_url": "https://github.com/netdata/netdata/commit/ab4c57f75fd4e248fb7a0475a0e016edc3f9625a.diff",
            "exists": true,
            "files": [],
            "interesting": {
                "reopen": false,
                "status": false
            },
            "is_parent": true,
            "sha": "ab4c57f75fd4e248fb7a0475a0e016edc3f9625a"
        },
        {
            "associated_pull_request": [
                "https://github.com/netdata/netdata/pull/1005"
            ],
            "date": "2016-09-21 23:17:14+00:00",
            "diff": "netdata_netdata/issue_981/commit_784ed60500457e249ed3893398430ce2246eb488.diff",
            "diff_additions": 155,
            "diff_deletions": 59,
            "diff_file_size": 0,
            "diff_url": "https://github.com/netdata/netdata/commit/784ed60500457e249ed3893398430ce2246eb488.diff",
            "exists": true,
            "files": [
                {
                    "file_additions": 62,
                    "file_deletions": 55,
                    "file_exists": false,
                    "file_name": "src/rrd.c",
                    "file_size": 0
                },
                {
                    "file_additions": 93,
                    "file_deletions": 4,
                    "file_exists": false,
                    "file_name": "src/unit_test.c",
                    "file_size": 0
                }
            ],
            "interesting": {
                "reopen": true,
                "status": false
            },
            "is_parent": false,
            "sha": "784ed60500457e249ed3893398430ce2246eb488"
        },
        {
            "associated_pull_request": [
                "https://github.com/netdata/netdata/pull/1011"
            ],
            "date": "2016-09-22 19:50:42+00:00",
            "diff": "netdata_netdata/issue_981/commit_1d97faadc071ac64173951517d53504d2fb6260a.diff",
            "diff_additions": 88,
            "diff_deletions": 20,
            "diff_file_size": 0,
            "diff_url": "https://github.com/netdata/netdata/commit/1d97faadc071ac64173951517d53504d2fb6260a.diff",
            "exists": true,
            "files": [
                {
                    "file_additions": 47,
                    "file_deletions": 15,
                    "file_exists": false,
                    "file_name": "src/rrd.c",
                    "file_size": 0
                },
                {
                    "file_additions": 41,
                    "file_deletions": 5,
                    "file_exists": false,
                    "file_name": "src/unit_test.c",
                    "file_size": 0
                }
            ],
            "interesting": {
                "reopen": false,
                "status": false
            },
            "is_parent": false,
            "sha": "1d97faadc071ac64173951517d53504d2fb6260a"
        }
    ],
    "first_commit": "2016-09-21 18:03:26+00:00",
    "last_commit": "2016-09-22 19:50:42+00:00",
    "number": 981,
    "pull_request": "None",
    "score": {
        "accidental_reopen_likely": false,
        "all_labels": [
            "bug"
        ],
        "contains_keywords": [
            "work",
            "fail",
            "chang",
            "fix",
            "issu",
            "CI",
            "debug",
            "reason",
            "test",
            "attempt",
            "remov",
            "bug",
            "problem",
            "report"
        ],
        "fix_size": 263,
        "has_labels": [
            "bug"
        ],
        "intersecting": {
            "computed_score": 0.21782178217821782,
            "final_commit_size": 101,
            "intersection_size": 22,
            "previous_commits_size": 184
        },
        "is_makefile_based": true,
        "no_new_files": [],
        "no_other_files": true,
        "num_prohibited_files": 168,
        "prohibited_files": [
            "server/src/main/java/com/genymobile/scrcpy/Device.java",
            "server/src/main/java/com/genymobile/scrcpy/wrappers/SurfaceControl.java",
            "server/src/main/java/com/genymobile/scrcpy/Device.java",
            "server/src/main/java/com/genymobile/scrcpy/wrappers/SurfaceControl.java",
            "app/meson.build",
            "app/scrcpy.1",
            "app/src/common.h",
            "app/src/scrcpy.h",
            "app/src/server.h",
            "server/src/main/java/com/genymobile/scrcpy/Workarounds.java"
        ],
        "reopen": true,
        "reopen_events": [
            [
                "2016-09-21 23:17:26+00:00",
                "commit"
            ],
            [
                "2016-09-22 08:58:18+00:00",
                "closed"
            ],
            [
                "2016-09-22 08:58:21+00:00",
                "reopened"
            ],
            [
                "2016-09-22 09:20:48+00:00",
                "closed"
            ],
            [
                "2016-09-22 09:20:55+00:00",
                "reopened"
            ],
            [
                "2016-09-22 19:50:51+00:00",
                "commit"
            ],
            [
                "2016-09-22 22:14:53+00:00",
                "closed"
            ]
        ],
        "status": false,
        "strategy": true,
        "total_changes": 322
    }
}