{
    "commits": [
        {
            "diff": "iluwatar_java-design-patterns/issue_348/commit_092d48d15091cb950232c44d76c0243fa8de53a2.diff",
            "diff_additions": 371,
            "diff_deletions": 122,
            "diff_file_size": 34757,
            "files": [
                {
                    "file_additions": 7,
                    "file_deletions": 9,
                    "file_exists": true,
                    "file_name": "adapter/src/main/java/com/iluwatar/adapter/App.java",
                    "file_size": 2770
                },
                {
                    "file_additions": 9,
                    "file_deletions": 3,
                    "file_exists": false,
                    "file_name": "adapter/src/main/java/com/iluwatar/adapter/GnomeEngineeringManager.java",
                    "file_size": 0
                },
                {
                    "file_additions": 68,
                    "file_deletions": 0,
                    "file_exists": true,
                    "file_name": "adapter/src/test/java/com/iluwatar/adapter/AdapterPatternTest.java",
                    "file_size": 2658
                },
                {
                    "file_additions": 0,
                    "file_deletions": 19,
                    "file_exists": true,
                    "file_name": "adapter/src/test/java/com/iluwatar/adapter/AppTest.java",
                    "file_size": 1679
                },
                {
                    "file_additions": 11,
                    "file_deletions": 8,
                    "file_exists": true,
                    "file_name": "business-delegate/src/main/java/com/iluwatar/business/delegate/App.java",
                    "file_size": 2629
                },
                {
                    "file_additions": 14,
                    "file_deletions": 12,
                    "file_exists": true,
                    "file_name": "business-delegate/src/main/java/com/iluwatar/business/delegate/BusinessDelegate.java",
                    "file_size": 1755
                },
                {
                    "file_additions": 19,
                    "file_deletions": 5,
                    "file_exists": true,
                    "file_name": "business-delegate/src/main/java/com/iluwatar/business/delegate/BusinessLookup.java",
                    "file_size": 1873
                },
                {
                    "file_additions": 0,
                    "file_deletions": 19,
                    "file_exists": true,
                    "file_name": "business-delegate/src/test/java/com/iluwatar/business/delegate/AppTest.java",
                    "file_size": 1728
                },
                {
                    "file_additions": 78,
                    "file_deletions": 0,
                    "file_exists": true,
                    "file_name": "business-delegate/src/test/java/com/iluwatar/business/delegate/BusinessDelegateTest.java",
                    "file_size": 3646
                },
                {
                    "file_additions": 0,
                    "file_deletions": 19,
                    "file_exists": true,
                    "file_name": "command/src/test/java/com/iluwatar/command/AppTest.java",
                    "file_size": 1692
                },
                {
                    "file_additions": 71,
                    "file_deletions": 0,
                    "file_exists": true,
                    "file_name": "command/src/test/java/com/iluwatar/command/CommandTest.java",
                    "file_size": 4370
                },
                {
                    "file_additions": 6,
                    "file_deletions": 3,
                    "file_exists": true,
                    "file_name": "factory-method/src/main/java/com/iluwatar/factory/method/ElfWeapon.java",
                    "file_size": 1530
                },
                {
                    "file_additions": 6,
                    "file_deletions": 3,
                    "file_exists": true,
                    "file_name": "factory-method/src/main/java/com/iluwatar/factory/method/OrcWeapon.java",
                    "file_size": 1531
                },
                {
                    "file_additions": 3,
                    "file_deletions": 3,
                    "file_exists": true,
                    "file_name": "factory-method/src/main/java/com/iluwatar/factory/method/Weapon.java",
                    "file_size": 1271
                },
                {
                    "file_additions": 0,
                    "file_deletions": 19,
                    "file_exists": true,
                    "file_name": "factory-method/src/test/java/com/iluwatar/factory/method/AppTest.java",
                    "file_size": 1480
                },
                {
                    "file_additions": 79,
                    "file_deletions": 0,
                    "file_exists": true,
                    "file_name": "factory-method/src/test/java/com/iluwatar/factory/method/FactoryMethodTest.java",
                    "file_size": 4145
                }
            ],
            "interesting": {
                "reopened": false,
                "status": false
            },
            "sha": "092d48d15091cb950232c44d76c0243fa8de53a2"
        },
        {
            "diff": "iluwatar_java-design-patterns/issue_348/commit_1e096cb226765aea93b664817e894c7557a0420f.diff",
            "diff_additions": 153,
            "diff_deletions": 0,
            "diff_file_size": 0,
            "files": [
                {
                    "file_additions": 46,
                    "file_deletions": 0,
                    "file_exists": false,
                    "file_name": "data-transfer-object-pattern/transfer-object-pattern/src/Client.java",
                    "file_size": 0
                },
                {
                    "file_additions": 69,
                    "file_deletions": 0,
                    "file_exists": false,
                    "file_name": "data-transfer-object-pattern/transfer-object-pattern/src/EmployeeBO.java",
                    "file_size": 0
                },
                {
                    "file_additions": 38,
                    "file_deletions": 0,
                    "file_exists": false,
                    "file_name": "data-transfer-object-pattern/transfer-object-pattern/src/EmployeeTO.java",
                    "file_size": 0
                }
            ],
            "interesting": {
                "reopened": false,
                "status": false
            },
            "sha": "1e096cb226765aea93b664817e894c7557a0420f"
        },
        {
            "diff": "iluwatar_java-design-patterns/issue_348/commit_a1070bb9665be8ad6ba5d7ceccd491afda16bc71.diff",
            "diff_additions": 12,
            "diff_deletions": 5,
            "diff_file_size": 0,
            "files": [
                {
                    "file_additions": 6,
                    "file_deletions": 3,
                    "file_exists": false,
                    "file_name": "data-transfer-object-pattern/src/com/data/transfer/object/Client.java",
                    "file_size": 0
                },
                {
                    "file_additions": 3,
                    "file_deletions": 0,
                    "file_exists": false,
                    "file_name": "data-transfer-object-pattern/src/com/data/transfer/object/EmployeeBO.java",
                    "file_size": 0
                },
                {
                    "file_additions": 3,
                    "file_deletions": 2,
                    "file_exists": false,
                    "file_name": "data-transfer-object-pattern/src/com/data/transfer/object/EmployeeTO.java",
                    "file_size": 0
                }
            ],
            "interesting": {
                "reopened": false,
                "status": false
            },
            "sha": "a1070bb9665be8ad6ba5d7ceccd491afda16bc71"
        },
        {
            "diff": "iluwatar_java-design-patterns/issue_348/commit_1b45b3e45c5f3e2bb301455b9c6b2cdf02c6a17d.diff",
            "diff_additions": 243,
            "diff_deletions": 0,
            "diff_file_size": 0,
            "files": [
                {
                    "file_additions": 27,
                    "file_deletions": 0,
                    "file_exists": false,
                    "file_name": "dto/src/main/java/com/squla/DtoApplication.java",
                    "file_size": 0
                },
                {
                    "file_additions": 25,
                    "file_deletions": 0,
                    "file_exists": false,
                    "file_name": "dto/src/main/java/com/squla/api/AlbumAPI.java",
                    "file_size": 0
                },
                {
                    "file_additions": 35,
                    "file_deletions": 0,
                    "file_exists": false,
                    "file_name": "dto/src/main/java/com/squla/dto/AlbumDTO.java",
                    "file_size": 0
                },
                {
                    "file_additions": 45,
                    "file_deletions": 0,
                    "file_exists": false,
                    "file_name": "dto/src/main/java/com/squla/model/Album.java",
                    "file_size": 0
                },
                {
                    "file_additions": 35,
                    "file_deletions": 0,
                    "file_exists": false,
                    "file_name": "dto/src/main/java/com/squla/model/Artist.java",
                    "file_size": 0
                },
                {
                    "file_additions": 10,
                    "file_deletions": 0,
                    "file_exists": false,
                    "file_name": "dto/src/main/java/com/squla/repository/AlbumRepository.java",
                    "file_size": 0
                },
                {
                    "file_additions": 15,
                    "file_deletions": 0,
                    "file_exists": false,
                    "file_name": "dto/src/main/java/com/squla/service/AlbumService.java",
                    "file_size": 0
                },
                {
                    "file_additions": 37,
                    "file_deletions": 0,
                    "file_exists": false,
                    "file_name": "dto/src/main/java/com/squla/service/AlbumServiceIMPL.java",
                    "file_size": 0
                },
                {
                    "file_additions": 14,
                    "file_deletions": 0,
                    "file_exists": false,
                    "file_name": "dto/src/test/java/com/squla/DtoApplicationTests.java",
                    "file_size": 0
                }
            ],
            "interesting": {
                "reopened": false,
                "status": false
            },
            "sha": "1b45b3e45c5f3e2bb301455b9c6b2cdf02c6a17d"
        },
        {
            "diff": "iluwatar_java-design-patterns/issue_348/commit_4b213976ec019ac2847d44380fdd5f7c47afc9c4.diff",
            "diff_additions": 164,
            "diff_deletions": 155,
            "diff_file_size": 0,
            "files": [
                {
                    "file_additions": 17,
                    "file_deletions": 14,
                    "file_exists": false,
                    "file_name": "dto/src/main/java/com/squla/DtoApplication.java",
                    "file_size": 0
                },
                {
                    "file_additions": 8,
                    "file_deletions": 8,
                    "file_exists": false,
                    "file_name": "dto/src/main/java/com/squla/api/AlbumApi.java",
                    "file_size": 0
                },
                {
                    "file_additions": 0,
                    "file_deletions": 35,
                    "file_exists": false,
                    "file_name": "dto/src/main/java/com/squla/dto/AlbumDTO.java",
                    "file_size": 0
                },
                {
                    "file_additions": 35,
                    "file_deletions": 0,
                    "file_exists": false,
                    "file_name": "dto/src/main/java/com/squla/dto/AlbumDto.java",
                    "file_size": 0
                },
                {
                    "file_additions": 35,
                    "file_deletions": 35,
                    "file_exists": false,
                    "file_name": "dto/src/main/java/com/squla/model/Album.java",
                    "file_size": 0
                },
                {
                    "file_additions": 18,
                    "file_deletions": 18,
                    "file_exists": false,
                    "file_name": "dto/src/main/java/com/squla/model/Artist.java",
                    "file_size": 0
                },
                {
                    "file_additions": 3,
                    "file_deletions": 3,
                    "file_exists": false,
                    "file_name": "dto/src/main/java/com/squla/service/AlbumService.java",
                    "file_size": 0
                },
                {
                    "file_additions": 0,
                    "file_deletions": 37,
                    "file_exists": false,
                    "file_name": "dto/src/main/java/com/squla/service/AlbumServiceIMPL.java",
                    "file_size": 0
                },
                {
                    "file_additions": 44,
                    "file_deletions": 0,
                    "file_exists": false,
                    "file_name": "dto/src/main/java/com/squla/service/AlbumServiceImpl.java",
                    "file_size": 0
                },
                {
                    "file_additions": 4,
                    "file_deletions": 5,
                    "file_exists": false,
                    "file_name": "dto/src/test/java/com/squla/DtoApplicationTests.java",
                    "file_size": 0
                }
            ],
            "interesting": {
                "reopened": false,
                "status": false
            },
            "sha": "4b213976ec019ac2847d44380fdd5f7c47afc9c4"
        },
        {
            "diff": "iluwatar_java-design-patterns/issue_348/commit_148de06bb1f07efc91f745198762444ef7cf55ba.diff",
            "diff_additions": 204,
            "diff_deletions": 0,
            "diff_file_size": 0,
            "files": [
                {
                    "file_additions": 60,
                    "file_deletions": 0,
                    "file_exists": false,
                    "file_name": "data-transfer-object/src/main/java/com/iluwatar/datatransfer/CustomerDto.java",
                    "file_size": 0
                },
                {
                    "file_additions": 63,
                    "file_deletions": 0,
                    "file_exists": false,
                    "file_name": "data-transfer-object/src/main/java/com/iluwatar/datatransfer/CustomerResource.java",
                    "file_size": 0
                },
                {
                    "file_additions": 81,
                    "file_deletions": 0,
                    "file_exists": false,
                    "file_name": "data-transfer-object/src/test/java/com/iluwatar/datatransfer/CustomerResourceTest.java",
                    "file_size": 0
                }
            ],
            "interesting": {
                "reopened": false,
                "status": false
            },
            "sha": "148de06bb1f07efc91f745198762444ef7cf55ba"
        },
        {
            "diff": "iluwatar_java-design-patterns/issue_348/commit_df9be7850490558e7e506961a24c4816765c37d4.diff",
            "diff_additions": 85,
            "diff_deletions": 7,
            "diff_file_size": 0,
            "files": [
                {
                    "file_additions": 78,
                    "file_deletions": 0,
                    "file_exists": false,
                    "file_name": "data-transfer-object/src/main/java/com/iluwatar/datatransfer/CustomerClientApp.java",
                    "file_size": 0
                },
                {
                    "file_additions": 7,
                    "file_deletions": 7,
                    "file_exists": false,
                    "file_name": "data-transfer-object/src/test/java/com/iluwatar/datatransfer/CustomerResourceTest.java",
                    "file_size": 0
                }
            ],
            "interesting": {
                "reopened": false,
                "status": false
            },
            "sha": "df9be7850490558e7e506961a24c4816765c37d4"
        },
        {
            "diff": "iluwatar_java-design-patterns/issue_348/commit_b62d431d62e22b54131a479221c7321097af7b40.diff",
            "diff_additions": 12,
            "diff_deletions": 6,
            "diff_file_size": 0,
            "files": [
                {
                    "file_additions": 12,
                    "file_deletions": 6,
                    "file_exists": false,
                    "file_name": "data-transfer-object/src/main/java/com/iluwatar/datatransfer/CustomerClientApp.java",
                    "file_size": 0
                }
            ],
            "interesting": {
                "reopened": false,
                "status": false
            },
            "sha": "b62d431d62e22b54131a479221c7321097af7b40"
        },
        {
            "diff": "iluwatar_java-design-patterns/issue_348/commit_4a81453da403fd76744d05e72b36ca84155ffea0.diff",
            "diff_additions": 3,
            "diff_deletions": 3,
            "diff_file_size": 0,
            "files": [
                {
                    "file_additions": 3,
                    "file_deletions": 3,
                    "file_exists": false,
                    "file_name": "data-transfer-object/src/main/java/com/iluwatar/datatransfer/CustomerDto.java",
                    "file_size": 0
                }
            ],
            "interesting": {
                "reopened": false,
                "status": false
            },
            "sha": "4a81453da403fd76744d05e72b36ca84155ffea0"
        },
        {
            "diff": "iluwatar_java-design-patterns/issue_348/commit_e367e48ec226733339651655345da6547e5fcc8b.diff",
            "diff_additions": 288,
            "diff_deletions": 0,
            "diff_file_size": 0,
            "files": [
                {
                    "file_additions": 84,
                    "file_deletions": 0,
                    "file_exists": false,
                    "file_name": "data-transfer-object/src/main/java/com/iluwatar/datatransfer/CustomerClientApp.java",
                    "file_size": 0
                },
                {
                    "file_additions": 60,
                    "file_deletions": 0,
                    "file_exists": false,
                    "file_name": "data-transfer-object/src/main/java/com/iluwatar/datatransfer/CustomerDto.java",
                    "file_size": 0
                },
                {
                    "file_additions": 63,
                    "file_deletions": 0,
                    "file_exists": false,
                    "file_name": "data-transfer-object/src/main/java/com/iluwatar/datatransfer/CustomerResource.java",
                    "file_size": 0
                },
                {
                    "file_additions": 81,
                    "file_deletions": 0,
                    "file_exists": false,
                    "file_name": "data-transfer-object/src/test/java/com/iluwatar/datatransfer/CustomerResourceTest.java",
                    "file_size": 0
                }
            ],
            "interesting": {
                "reopened": true,
                "status": false
            },
            "sha": "e367e48ec226733339651655345da6547e5fcc8b"
        },
        {
            "diff": "iluwatar_java-design-patterns/issue_348/commit_366664223bb4ca3b0b921abc66662e4f79f19a7c.diff",
            "diff_additions": 204,
            "diff_deletions": 0,
            "diff_file_size": 0,
            "files": [
                {
                    "file_additions": 60,
                    "file_deletions": 0,
                    "file_exists": false,
                    "file_name": "data-transfer-object/src/main/java/com/iluwatar/datatransfer/CustomerDto.java",
                    "file_size": 0
                },
                {
                    "file_additions": 63,
                    "file_deletions": 0,
                    "file_exists": false,
                    "file_name": "data-transfer-object/src/main/java/com/iluwatar/datatransfer/CustomerResource.java",
                    "file_size": 0
                },
                {
                    "file_additions": 81,
                    "file_deletions": 0,
                    "file_exists": false,
                    "file_name": "data-transfer-object/src/test/java/com/iluwatar/datatransfer/CustomerResourceTest.java",
                    "file_size": 0
                }
            ],
            "interesting": {
                "reopened": false,
                "status": false
            },
            "sha": "366664223bb4ca3b0b921abc66662e4f79f19a7c"
        },
        {
            "diff": "iluwatar_java-design-patterns/issue_348/commit_f7231f74623ee3a1058251e166681a4a5568e6f3.diff",
            "diff_additions": 85,
            "diff_deletions": 7,
            "diff_file_size": 0,
            "files": [
                {
                    "file_additions": 78,
                    "file_deletions": 0,
                    "file_exists": false,
                    "file_name": "data-transfer-object/src/main/java/com/iluwatar/datatransfer/CustomerClientApp.java",
                    "file_size": 0
                },
                {
                    "file_additions": 7,
                    "file_deletions": 7,
                    "file_exists": false,
                    "file_name": "data-transfer-object/src/test/java/com/iluwatar/datatransfer/CustomerResourceTest.java",
                    "file_size": 0
                }
            ],
            "interesting": {
                "reopened": false,
                "status": false
            },
            "sha": "f7231f74623ee3a1058251e166681a4a5568e6f3"
        },
        {
            "diff": "iluwatar_java-design-patterns/issue_348/commit_3722bb89b674554cb9b364d9af29957d07258298.diff",
            "diff_additions": 12,
            "diff_deletions": 6,
            "diff_file_size": 0,
            "files": [
                {
                    "file_additions": 12,
                    "file_deletions": 6,
                    "file_exists": false,
                    "file_name": "data-transfer-object/src/main/java/com/iluwatar/datatransfer/CustomerClientApp.java",
                    "file_size": 0
                }
            ],
            "interesting": {
                "reopened": false,
                "status": false
            },
            "sha": "3722bb89b674554cb9b364d9af29957d07258298"
        },
        {
            "diff": "iluwatar_java-design-patterns/issue_348/commit_4c713f5425564ee33f63f8765eee8594b9ce216e.diff",
            "diff_additions": 3,
            "diff_deletions": 3,
            "diff_file_size": 0,
            "files": [
                {
                    "file_additions": 3,
                    "file_deletions": 3,
                    "file_exists": false,
                    "file_name": "data-transfer-object/src/main/java/com/iluwatar/datatransfer/CustomerDto.java",
                    "file_size": 0
                }
            ],
            "interesting": {
                "reopened": false,
                "status": false
            },
            "sha": "4c713f5425564ee33f63f8765eee8594b9ce216e"
        },
        {
            "diff": "iluwatar_java-design-patterns/issue_348/commit_ba099c176b12914fb56ed99bc52d9116920e5e8f.diff",
            "diff_additions": 288,
            "diff_deletions": 0,
            "diff_file_size": 0,
            "files": [
                {
                    "file_additions": 84,
                    "file_deletions": 0,
                    "file_exists": false,
                    "file_name": "data-transfer-object/src/main/java/com/iluwatar/datatransfer/CustomerClientApp.java",
                    "file_size": 0
                },
                {
                    "file_additions": 60,
                    "file_deletions": 0,
                    "file_exists": false,
                    "file_name": "data-transfer-object/src/main/java/com/iluwatar/datatransfer/CustomerDto.java",
                    "file_size": 0
                },
                {
                    "file_additions": 63,
                    "file_deletions": 0,
                    "file_exists": false,
                    "file_name": "data-transfer-object/src/main/java/com/iluwatar/datatransfer/CustomerResource.java",
                    "file_size": 0
                },
                {
                    "file_additions": 81,
                    "file_deletions": 0,
                    "file_exists": false,
                    "file_name": "data-transfer-object/src/test/java/com/iluwatar/datatransfer/CustomerResourceTest.java",
                    "file_size": 0
                }
            ],
            "interesting": {
                "reopened": false,
                "status": false
            },
            "sha": "ba099c176b12914fb56ed99bc52d9116920e5e8f"
        }
    ],
    "first_commit": "2015-11-22 06:44:13",
    "last_commit": "2017-08-30 04:29:35",
    "number": 348,
    "score": 192.00163867267514
}