{
    "covered_issues": [
        46,
        32,
        29,
        26,
        24,
        23,
        22,
        18,
        17,
        16,
        14,
        3,
        2
    ],
    "finished": true
}