{
    "covered_issues": [
        871,
        861,
        858,
        857,
        845,
        838,
        837,
        836,
        832,
        825,
        822,
        820,
        809,
        808,
        804,
        802,
        800,
        796,
        794,
        793,
        791,
        790,
        788,
        786,
        782,
        781,
        778,
        777,
        776,
        773,
        772,
        771,
        769,
        768,
        767,
        766,
        764,
        763,
        762,
        761,
        759,
        758,
        757,
        755,
        754,
        753,
        750,
        749,
        748,
        747,
        743,
        742,
        741,
        740,
        739,
        738,
        737,
        735,
        734,
        733,
        732,
        731,
        730,
        729,
        727,
        726,
        725,
        724,
        723,
        722,
        721,
        720,
        719,
        718,
        716,
        715,
        714,
        713,
        712,
        711,
        710,
        708,
        707,
        706,
        705,
        704,
        703,
        702,
        700,
        699,
        698,
        697,
        696,
        695,
        694,
        693,
        692,
        691,
        690,
        689,
        688,
        687,
        685,
        684,
        683,
        682,
        680,
        679,
        678,
        677,
        675,
        673,
        671,
        670,
        669,
        668,
        667,
        666,
        664,
        663,
        662,
        661,
        660,
        659,
        658,
        657,
        656,
        655,
        654,
        653,
        652,
        651,
        650,
        649,
        648,
        647,
        646,
        645,
        644,
        643,
        642,
        640,
        639,
        638,
        637,
        636,
        635,
        634,
        633,
        632,
        631,
        630,
        629,
        628,
        627,
        626,
        623,
        622,
        621,
        620,
        618,
        617,
        614,
        613,
        612,
        611,
        610,
        609,
        608,
        607,
        606,
        605,
        604,
        603,
        602,
        601,
        600,
        599,
        596,
        595,
        594,
        593,
        591,
        590,
        589,
        588,
        587,
        586,
        581,
        580,
        579,
        578,
        577,
        576,
        575,
        574,
        573,
        572,
        571,
        570,
        569,
        567,
        566,
        565,
        564,
        563,
        562,
        561,
        560,
        559,
        558,
        556,
        553,
        552,
        550,
        547,
        546,
        545,
        544,
        543,
        542,
        535,
        532,
        531,
        530,
        529,
        528,
        526,
        525,
        524,
        520,
        519,
        517,
        516,
        515,
        513,
        510,
        509,
        508,
        505,
        504,
        503,
        502,
        501,
        500,
        499,
        498,
        497,
        496,
        495,
        494,
        492,
        488,
        487,
        486,
        485,
        484,
        483,
        482,
        481,
        480,
        479,
        475,
        474,
        473,
        472,
        471,
        470,
        469,
        468,
        467,
        465,
        462,
        461,
        460,
        454,
        453,
        452,
        451,
        449,
        448,
        447,
        446,
        445,
        443,
        442,
        441,
        440,
        439,
        438,
        437,
        436,
        434,
        432,
        430,
        429,
        428,
        426,
        425,
        422,
        421,
        420,
        419,
        418,
        417,
        416,
        415,
        414,
        413,
        412,
        411,
        410,
        409,
        408,
        407,
        406,
        405,
        404,
        403,
        402,
        401,
        400,
        399,
        397,
        395,
        394,
        392,
        390,
        389,
        388,
        387,
        385,
        384,
        383,
        382,
        381,
        380,
        379,
        378,
        376,
        375,
        374,
        373,
        372,
        371,
        370,
        369,
        368,
        367,
        366,
        365,
        364,
        363,
        362,
        361,
        360,
        359,
        358,
        357,
        356,
        355,
        354,
        353,
        352,
        351,
        350,
        348,
        344,
        343,
        340,
        338,
        337,
        336,
        335,
        334,
        333,
        332,
        331,
        330,
        329,
        328,
        327,
        325,
        324,
        323,
        322,
        321,
        320,
        319,
        318,
        316,
        315,
        313,
        311,
        310,
        305,
        304,
        303,
        302,
        301,
        300,
        299,
        298,
        297,
        292,
        291,
        290,
        288,
        287,
        286,
        285,
        284,
        283,
        282,
        281,
        280,
        279,
        277,
        276,
        272,
        271,
        270,
        269,
        266,
        264,
        263,
        262,
        261,
        258,
        257,
        256,
        255,
        254,
        252,
        250,
        249,
        247,
        246,
        245,
        244,
        243,
        242,
        241,
        240,
        237,
        228,
        227,
        226,
        225,
        224,
        223,
        221,
        220,
        219,
        218,
        217,
        216,
        215,
        214,
        213,
        212,
        210,
        209,
        206,
        205,
        204,
        203,
        202,
        201,
        200,
        199,
        198,
        197,
        196,
        193,
        192,
        191,
        190,
        189,
        187,
        186,
        185,
        184,
        183,
        178,
        177,
        176,
        175,
        174,
        173,
        171,
        170,
        168,
        167,
        165,
        164,
        163,
        162,
        160,
        159,
        158,
        156,
        155,
        154,
        153,
        152,
        151,
        150,
        149,
        148,
        147,
        146,
        145,
        144,
        143,
        142,
        141,
        140,
        139,
        138,
        137,
        134,
        133,
        132,
        131,
        130,
        129,
        128,
        127,
        125,
        124,
        123,
        122,
        121,
        120,
        119,
        117,
        116,
        115,
        114,
        113,
        112,
        111,
        110,
        108,
        107,
        106,
        105,
        104,
        103,
        102,
        101,
        100,
        99,
        98,
        97,
        96,
        95,
        94,
        93,
        92,
        91,
        90,
        89,
        88,
        87,
        86,
        85,
        84,
        83,
        82,
        81,
        80,
        79,
        78,
        77,
        76,
        75,
        74,
        73,
        72,
        71,
        70,
        69,
        68,
        67,
        66,
        65,
        64,
        63,
        62,
        61,
        60,
        59,
        58,
        57,
        56,
        55,
        54,
        53,
        52,
        48,
        47,
        45,
        44,
        43,
        42,
        40,
        39,
        38,
        37,
        36,
        35,
        34,
        33,
        32,
        31,
        30,
        29,
        28,
        27,
        26,
        25,
        24,
        23,
        22,
        21,
        20,
        19,
        18,
        17,
        16,
        15,
        14,
        13,
        12,
        11,
        10,
        6,
        5,
        3,
        2,
        1
    ],
    "finished": true
}