{
    "category": [
        "memory",
        "build/refactor/preprocessing"
    ],
    "commits": [
        {
            "associated_pull_request": [],
            "date": "2018-09-17 11:09:28",
            "diff": "",
            "diff_additions": 0,
            "diff_deletions": 0,
            "diff_file_size": 0,
            "diff_url": "https://github.com/zlib-ng/zlib-ng/commit/407f37589d959dff703446f04b56580f1dcf925c.diff",
            "exists": true,
            "files": [],
            "interesting": {
                "reopen": false,
                "status": false
            },
            "is_parent": true,
            "sha": "407f37589d959dff703446f04b56580f1dcf925c"
        },
        {
            "associated_pull_request": [],
            "date": "2018-08-09 18:05:08",
            "diff": "zlib-ng_zlib-ng/issue_204/commit_2678d7c52c411c33d26eb6a8e49ce8c4519cc037.diff",
            "diff_additions": 691,
            "diff_deletions": 3,
            "diff_file_size": 54138,
            "diff_url": "https://github.com/zlib-ng/zlib-ng/commit/2678d7c52c411c33d26eb6a8e49ce8c4519cc037.diff",
            "exists": true,
            "files": [
                {
                    "file_additions": 6,
                    "file_deletions": 3,
                    "file_exists": true,
                    "file_name": "test/example.c",
                    "file_size": 34271
                },
                {
                    "file_additions": 87,
                    "file_deletions": 0,
                    "file_exists": true,
                    "file_name": "test/fuzz/compress_fuzzer.c",
                    "file_size": 2696
                },
                {
                    "file_additions": 170,
                    "file_deletions": 0,
                    "file_exists": true,
                    "file_name": "test/fuzz/example_dict_fuzzer.c",
                    "file_size": 5221
                },
                {
                    "file_additions": 126,
                    "file_deletions": 0,
                    "file_exists": true,
                    "file_name": "test/fuzz/example_flush_fuzzer.c",
                    "file_size": 3428
                },
                {
                    "file_additions": 143,
                    "file_deletions": 0,
                    "file_exists": true,
                    "file_name": "test/fuzz/example_large_fuzzer.c",
                    "file_size": 4129
                },
                {
                    "file_additions": 124,
                    "file_deletions": 0,
                    "file_exists": true,
                    "file_name": "test/fuzz/example_small_fuzzer.c",
                    "file_size": 3329
                },
                {
                    "file_additions": 35,
                    "file_deletions": 0,
                    "file_exists": true,
                    "file_name": "test/fuzz/standalone_fuzz_target_runner.c",
                    "file_size": 1064
                }
            ],
            "interesting": {
                "reopen": false,
                "status": true
            },
            "is_parent": false,
            "sha": "2678d7c52c411c33d26eb6a8e49ce8c4519cc037"
        },
        {
            "associated_pull_request": [],
            "date": "2018-08-09 18:05:08",
            "diff": "zlib-ng_zlib-ng/issue_204/commit_bf019288961d1fc744c5cc8f2928bdec4339498e.diff",
            "diff_additions": 1259,
            "diff_deletions": 0,
            "diff_file_size": 31234,
            "diff_url": "https://github.com/zlib-ng/zlib-ng/commit/bf019288961d1fc744c5cc8f2928bdec4339498e.diff",
            "exists": true,
            "files": [
                {
                    "file_additions": 58,
                    "file_deletions": 0,
                    "file_exists": true,
                    "file_name": "test/fuzz/checksum_fuzzer.c",
                    "file_size": 2735
                },
                {
                    "file_additions": 87,
                    "file_deletions": 0,
                    "file_exists": true,
                    "file_name": "test/fuzz/compress_fuzzer.c",
                    "file_size": 2696
                },
                {
                    "file_additions": 170,
                    "file_deletions": 0,
                    "file_exists": true,
                    "file_name": "test/fuzz/example_dict_fuzzer.c",
                    "file_size": 5221
                },
                {
                    "file_additions": 126,
                    "file_deletions": 0,
                    "file_exists": true,
                    "file_name": "test/fuzz/example_flush_fuzzer.c",
                    "file_size": 3428
                },
                {
                    "file_additions": 143,
                    "file_deletions": 0,
                    "file_exists": true,
                    "file_name": "test/fuzz/example_large_fuzzer.c",
                    "file_size": 4129
                },
                {
                    "file_additions": 124,
                    "file_deletions": 0,
                    "file_exists": true,
                    "file_name": "test/fuzz/example_small_fuzzer.c",
                    "file_size": 3329
                },
                {
                    "file_additions": 516,
                    "file_deletions": 0,
                    "file_exists": true,
                    "file_name": "test/fuzz/minigzip_fuzzer.c",
                    "file_size": 8632
                },
                {
                    "file_additions": 35,
                    "file_deletions": 0,
                    "file_exists": true,
                    "file_name": "test/fuzz/standalone_fuzz_target_runner.c",
                    "file_size": 1064
                }
            ],
            "interesting": {
                "reopen": false,
                "status": true
            },
            "is_parent": false,
            "sha": "bf019288961d1fc744c5cc8f2928bdec4339498e"
        },
        {
            "associated_pull_request": [],
            "date": "2018-08-09 18:05:08",
            "diff": "zlib-ng_zlib-ng/issue_204/commit_c6f35a2b19acc34405320fa5cb436928824518b9.diff",
            "diff_additions": 1261,
            "diff_deletions": 0,
            "diff_file_size": 31234,
            "diff_url": "https://github.com/zlib-ng/zlib-ng/commit/c6f35a2b19acc34405320fa5cb436928824518b9.diff",
            "exists": true,
            "files": [
                {
                    "file_additions": 58,
                    "file_deletions": 0,
                    "file_exists": true,
                    "file_name": "test/fuzz/checksum_fuzzer.c",
                    "file_size": 2735
                },
                {
                    "file_additions": 87,
                    "file_deletions": 0,
                    "file_exists": true,
                    "file_name": "test/fuzz/compress_fuzzer.c",
                    "file_size": 2696
                },
                {
                    "file_additions": 170,
                    "file_deletions": 0,
                    "file_exists": true,
                    "file_name": "test/fuzz/example_dict_fuzzer.c",
                    "file_size": 5221
                },
                {
                    "file_additions": 126,
                    "file_deletions": 0,
                    "file_exists": true,
                    "file_name": "test/fuzz/example_flush_fuzzer.c",
                    "file_size": 3428
                },
                {
                    "file_additions": 143,
                    "file_deletions": 0,
                    "file_exists": true,
                    "file_name": "test/fuzz/example_large_fuzzer.c",
                    "file_size": 4129
                },
                {
                    "file_additions": 124,
                    "file_deletions": 0,
                    "file_exists": true,
                    "file_name": "test/fuzz/example_small_fuzzer.c",
                    "file_size": 3329
                },
                {
                    "file_additions": 518,
                    "file_deletions": 0,
                    "file_exists": true,
                    "file_name": "test/fuzz/minigzip_fuzzer.c",
                    "file_size": 8632
                },
                {
                    "file_additions": 35,
                    "file_deletions": 0,
                    "file_exists": true,
                    "file_name": "test/fuzz/standalone_fuzz_target_runner.c",
                    "file_size": 1064
                }
            ],
            "interesting": {
                "reopen": false,
                "status": true
            },
            "is_parent": false,
            "sha": "c6f35a2b19acc34405320fa5cb436928824518b9"
        },
        {
            "associated_pull_request": [],
            "date": "2018-08-09 18:05:08",
            "diff": "zlib-ng_zlib-ng/issue_204/commit_968bed15e323fe684f011d269f3370470e8e6da8.diff",
            "diff_additions": 1261,
            "diff_deletions": 0,
            "diff_file_size": 31234,
            "diff_url": "https://github.com/zlib-ng/zlib-ng/commit/968bed15e323fe684f011d269f3370470e8e6da8.diff",
            "exists": true,
            "files": [
                {
                    "file_additions": 58,
                    "file_deletions": 0,
                    "file_exists": true,
                    "file_name": "test/fuzz/checksum_fuzzer.c",
                    "file_size": 2735
                },
                {
                    "file_additions": 87,
                    "file_deletions": 0,
                    "file_exists": true,
                    "file_name": "test/fuzz/compress_fuzzer.c",
                    "file_size": 2696
                },
                {
                    "file_additions": 170,
                    "file_deletions": 0,
                    "file_exists": true,
                    "file_name": "test/fuzz/example_dict_fuzzer.c",
                    "file_size": 5221
                },
                {
                    "file_additions": 126,
                    "file_deletions": 0,
                    "file_exists": true,
                    "file_name": "test/fuzz/example_flush_fuzzer.c",
                    "file_size": 3428
                },
                {
                    "file_additions": 143,
                    "file_deletions": 0,
                    "file_exists": true,
                    "file_name": "test/fuzz/example_large_fuzzer.c",
                    "file_size": 4129
                },
                {
                    "file_additions": 124,
                    "file_deletions": 0,
                    "file_exists": true,
                    "file_name": "test/fuzz/example_small_fuzzer.c",
                    "file_size": 3329
                },
                {
                    "file_additions": 518,
                    "file_deletions": 0,
                    "file_exists": true,
                    "file_name": "test/fuzz/minigzip_fuzzer.c",
                    "file_size": 8632
                },
                {
                    "file_additions": 35,
                    "file_deletions": 0,
                    "file_exists": true,
                    "file_name": "test/fuzz/standalone_fuzz_target_runner.c",
                    "file_size": 1064
                }
            ],
            "interesting": {
                "reopen": false,
                "status": false
            },
            "is_parent": false,
            "sha": "968bed15e323fe684f011d269f3370470e8e6da8"
        },
        {
            "associated_pull_request": [],
            "date": "2018-08-09 18:05:08",
            "diff": "zlib-ng_zlib-ng/issue_204/commit_3294f0fa0da08d233f243eecf9efe92859e32402.diff",
            "diff_additions": 1261,
            "diff_deletions": 0,
            "diff_file_size": 31234,
            "diff_url": "https://github.com/zlib-ng/zlib-ng/commit/3294f0fa0da08d233f243eecf9efe92859e32402.diff",
            "exists": true,
            "files": [
                {
                    "file_additions": 58,
                    "file_deletions": 0,
                    "file_exists": true,
                    "file_name": "test/fuzz/checksum_fuzzer.c",
                    "file_size": 2735
                },
                {
                    "file_additions": 87,
                    "file_deletions": 0,
                    "file_exists": true,
                    "file_name": "test/fuzz/compress_fuzzer.c",
                    "file_size": 2696
                },
                {
                    "file_additions": 170,
                    "file_deletions": 0,
                    "file_exists": true,
                    "file_name": "test/fuzz/example_dict_fuzzer.c",
                    "file_size": 5221
                },
                {
                    "file_additions": 126,
                    "file_deletions": 0,
                    "file_exists": true,
                    "file_name": "test/fuzz/example_flush_fuzzer.c",
                    "file_size": 3428
                },
                {
                    "file_additions": 143,
                    "file_deletions": 0,
                    "file_exists": true,
                    "file_name": "test/fuzz/example_large_fuzzer.c",
                    "file_size": 4129
                },
                {
                    "file_additions": 124,
                    "file_deletions": 0,
                    "file_exists": true,
                    "file_name": "test/fuzz/example_small_fuzzer.c",
                    "file_size": 3329
                },
                {
                    "file_additions": 518,
                    "file_deletions": 0,
                    "file_exists": true,
                    "file_name": "test/fuzz/minigzip_fuzzer.c",
                    "file_size": 8632
                },
                {
                    "file_additions": 35,
                    "file_deletions": 0,
                    "file_exists": true,
                    "file_name": "test/fuzz/standalone_fuzz_target_runner.c",
                    "file_size": 1064
                }
            ],
            "interesting": {
                "reopen": false,
                "status": false
            },
            "is_parent": false,
            "sha": "3294f0fa0da08d233f243eecf9efe92859e32402"
        },
        {
            "associated_pull_request": [],
            "date": "2018-08-09 18:05:08",
            "diff": "zlib-ng_zlib-ng/issue_204/commit_53ec4bbe01682b806ffd9d8f85ac36c408869a68.diff",
            "diff_additions": 1261,
            "diff_deletions": 0,
            "diff_file_size": 31234,
            "diff_url": "https://github.com/zlib-ng/zlib-ng/commit/53ec4bbe01682b806ffd9d8f85ac36c408869a68.diff",
            "exists": true,
            "files": [
                {
                    "file_additions": 58,
                    "file_deletions": 0,
                    "file_exists": true,
                    "file_name": "test/fuzz/checksum_fuzzer.c",
                    "file_size": 2735
                },
                {
                    "file_additions": 87,
                    "file_deletions": 0,
                    "file_exists": true,
                    "file_name": "test/fuzz/compress_fuzzer.c",
                    "file_size": 2696
                },
                {
                    "file_additions": 170,
                    "file_deletions": 0,
                    "file_exists": true,
                    "file_name": "test/fuzz/example_dict_fuzzer.c",
                    "file_size": 5221
                },
                {
                    "file_additions": 126,
                    "file_deletions": 0,
                    "file_exists": true,
                    "file_name": "test/fuzz/example_flush_fuzzer.c",
                    "file_size": 3428
                },
                {
                    "file_additions": 143,
                    "file_deletions": 0,
                    "file_exists": true,
                    "file_name": "test/fuzz/example_large_fuzzer.c",
                    "file_size": 4129
                },
                {
                    "file_additions": 124,
                    "file_deletions": 0,
                    "file_exists": true,
                    "file_name": "test/fuzz/example_small_fuzzer.c",
                    "file_size": 3329
                },
                {
                    "file_additions": 518,
                    "file_deletions": 0,
                    "file_exists": true,
                    "file_name": "test/fuzz/minigzip_fuzzer.c",
                    "file_size": 8632
                },
                {
                    "file_additions": 35,
                    "file_deletions": 0,
                    "file_exists": true,
                    "file_name": "test/fuzz/standalone_fuzz_target_runner.c",
                    "file_size": 1064
                }
            ],
            "interesting": {
                "reopen": false,
                "status": false
            },
            "is_parent": false,
            "sha": "53ec4bbe01682b806ffd9d8f85ac36c408869a68"
        },
        {
            "associated_pull_request": [
                "https://github.com/zlib-ng/zlib-ng/pull/206"
            ],
            "date": "2018-08-09 18:05:08",
            "diff": "zlib-ng_zlib-ng/issue_204/commit_3695d0d2effe4c58c01b2600b2badc7d0e356fd5.diff",
            "diff_additions": 1261,
            "diff_deletions": 0,
            "diff_file_size": 31234,
            "diff_url": "https://github.com/zlib-ng/zlib-ng/commit/3695d0d2effe4c58c01b2600b2badc7d0e356fd5.diff",
            "exists": true,
            "files": [
                {
                    "file_additions": 58,
                    "file_deletions": 0,
                    "file_exists": true,
                    "file_name": "test/fuzz/checksum_fuzzer.c",
                    "file_size": 2735
                },
                {
                    "file_additions": 87,
                    "file_deletions": 0,
                    "file_exists": true,
                    "file_name": "test/fuzz/compress_fuzzer.c",
                    "file_size": 2696
                },
                {
                    "file_additions": 170,
                    "file_deletions": 0,
                    "file_exists": true,
                    "file_name": "test/fuzz/example_dict_fuzzer.c",
                    "file_size": 5221
                },
                {
                    "file_additions": 126,
                    "file_deletions": 0,
                    "file_exists": true,
                    "file_name": "test/fuzz/example_flush_fuzzer.c",
                    "file_size": 3428
                },
                {
                    "file_additions": 143,
                    "file_deletions": 0,
                    "file_exists": true,
                    "file_name": "test/fuzz/example_large_fuzzer.c",
                    "file_size": 4129
                },
                {
                    "file_additions": 124,
                    "file_deletions": 0,
                    "file_exists": true,
                    "file_name": "test/fuzz/example_small_fuzzer.c",
                    "file_size": 3329
                },
                {
                    "file_additions": 518,
                    "file_deletions": 0,
                    "file_exists": true,
                    "file_name": "test/fuzz/minigzip_fuzzer.c",
                    "file_size": 8632
                },
                {
                    "file_additions": 35,
                    "file_deletions": 0,
                    "file_exists": true,
                    "file_name": "test/fuzz/standalone_fuzz_target_runner.c",
                    "file_size": 1064
                }
            ],
            "interesting": {
                "reopen": false,
                "status": false
            },
            "is_parent": false,
            "sha": "3695d0d2effe4c58c01b2600b2badc7d0e356fd5"
        },
        {
            "associated_pull_request": [
                "https://github.com/zlib-ng/zlib-ng/pull/206"
            ],
            "date": "2018-11-07 09:05:20",
            "diff": "zlib-ng_zlib-ng/issue_204/commit_4999e84a04f62bb2f3f0c8cf0fd869f9dcdf29e4.diff",
            "diff_additions": 1261,
            "diff_deletions": 0,
            "diff_file_size": 31234,
            "diff_url": "https://github.com/zlib-ng/zlib-ng/commit/4999e84a04f62bb2f3f0c8cf0fd869f9dcdf29e4.diff",
            "exists": true,
            "files": [
                {
                    "file_additions": 58,
                    "file_deletions": 0,
                    "file_exists": true,
                    "file_name": "test/fuzz/checksum_fuzzer.c",
                    "file_size": 2735
                },
                {
                    "file_additions": 87,
                    "file_deletions": 0,
                    "file_exists": true,
                    "file_name": "test/fuzz/compress_fuzzer.c",
                    "file_size": 2696
                },
                {
                    "file_additions": 170,
                    "file_deletions": 0,
                    "file_exists": true,
                    "file_name": "test/fuzz/example_dict_fuzzer.c",
                    "file_size": 5221
                },
                {
                    "file_additions": 126,
                    "file_deletions": 0,
                    "file_exists": true,
                    "file_name": "test/fuzz/example_flush_fuzzer.c",
                    "file_size": 3428
                },
                {
                    "file_additions": 143,
                    "file_deletions": 0,
                    "file_exists": true,
                    "file_name": "test/fuzz/example_large_fuzzer.c",
                    "file_size": 4129
                },
                {
                    "file_additions": 124,
                    "file_deletions": 0,
                    "file_exists": true,
                    "file_name": "test/fuzz/example_small_fuzzer.c",
                    "file_size": 3329
                },
                {
                    "file_additions": 518,
                    "file_deletions": 0,
                    "file_exists": true,
                    "file_name": "test/fuzz/minigzip_fuzzer.c",
                    "file_size": 8632
                },
                {
                    "file_additions": 35,
                    "file_deletions": 0,
                    "file_exists": true,
                    "file_name": "test/fuzz/standalone_fuzz_target_runner.c",
                    "file_size": 1064
                }
            ],
            "interesting": {
                "reopen": false,
                "status": false
            },
            "is_parent": false,
            "sha": "4999e84a04f62bb2f3f0c8cf0fd869f9dcdf29e4"
        }
    ],
    "first_commit": "2018-09-17 11:09:28",
    "last_commit": "2018-11-07 09:05:20",
    "number": 204,
    "pull_request": "None",
    "score": {
        "accidental_reopen_likely": false,
        "all_labels": [],
        "contains_keywords": [
            "fix",
            "patch",
            "bug",
            "test"
        ],
        "fix_size": 10,
        "has_labels": [],
        "intersecting": {
            "computed_score": 0,
            "final_commit_size": 0,
            "intersection_size": 0,
            "previous_commits_size": 10
        },
        "is_makefile_based": true,
        "no_new_files": [],
        "no_other_files": false,
        "num_prohibited_files": 120366,
        "prohibited_files": [
            "kill.h",
            "meminfo.h",
            "kill.h",
            "meminfo.h",
            "kill.h",
            "meminfo.h",
            "testsuite_cli_test.go",
            "testsuite_cli_test.go",
            "common.mk",
            "i3bar/include/draw_util.h"
        ],
        "reopen": false,
        "reopen_events": [
            [
                "2018-09-18 20:57:37",
                "commit"
            ],
            [
                "2018-09-19 19:54:49",
                "commit"
            ],
            [
                "2018-09-19 20:58:11",
                "commit"
            ],
            [
                "2018-09-20 13:41:14",
                "commit"
            ],
            [
                "2018-09-20 14:59:24",
                "commit"
            ],
            [
                "2018-10-02 17:42:09",
                "commit"
            ],
            [
                "2018-10-24 18:08:28",
                "commit"
            ],
            [
                "2018-10-24 18:34:09",
                "commit"
            ],
            [
                "2018-11-07 09:05:22",
                "commit"
            ],
            [
                "2018-11-07 16:37:18",
                "closed"
            ]
        ],
        "status": true,
        "strategy": true,
        "total_changes": 9519
    }
}