{
    "category": [
        "build/refactor/preprocessing",
        "wrong API usage"
    ],
    "commits": [
        {
            "associated_pull_request": [],
            "date": "2020-05-13 16:23:23",
            "diff": "gluster_glusterfs/issue_1221/commit_dc1d549d0e776ecd4c8381577eeed990250a7f6a.diff",
            "diff_additions": 18,
            "diff_deletions": 0,
            "diff_file_size": 93170,
            "diff_url": "https://github.com/gluster/glusterfs/commit/dc1d549d0e776ecd4c8381577eeed990250a7f6a.diff",
            "exists": true,
            "files": [
                {
                    "file_additions": 18,
                    "file_deletions": 0,
                    "file_exists": true,
                    "file_name": "xlators/mgmt/glusterd/src/glusterd-brick-ops.c",
                    "file_size": 93170
                }
            ],
            "interesting": {
                "reopen": false,
                "status": false
            },
            "is_parent": true,
            "sha": "dc1d549d0e776ecd4c8381577eeed990250a7f6a"
        },
        {
            "associated_pull_request": [],
            "date": "2020-05-06 05:29:48",
            "diff": "gluster_glusterfs/issue_1221/commit_8e550380f7098275452fc26c46489739aa8bdae6.diff",
            "diff_additions": 2,
            "diff_deletions": 2,
            "diff_file_size": 56764,
            "diff_url": "https://github.com/gluster/glusterfs/commit/8e550380f7098275452fc26c46489739aa8bdae6.diff",
            "exists": true,
            "files": [
                {
                    "file_additions": 2,
                    "file_deletions": 2,
                    "file_exists": true,
                    "file_name": "xlators/features/bit-rot/src/bitd/bit-rot-scrub.c",
                    "file_size": 56764
                }
            ],
            "interesting": {
                "reopen": true,
                "status": false
            },
            "is_parent": false,
            "sha": "8e550380f7098275452fc26c46489739aa8bdae6"
        },
        {
            "associated_pull_request": [],
            "date": "2020-05-06 05:29:48",
            "diff": "gluster_glusterfs/issue_1221/commit_12020998c285157e3c4ee6f17e709d35349e3e12.diff",
            "diff_additions": 2,
            "diff_deletions": 2,
            "diff_file_size": 56764,
            "diff_url": "https://github.com/gluster/glusterfs/commit/12020998c285157e3c4ee6f17e709d35349e3e12.diff",
            "exists": true,
            "files": [
                {
                    "file_additions": 2,
                    "file_deletions": 2,
                    "file_exists": true,
                    "file_name": "xlators/features/bit-rot/src/bitd/bit-rot-scrub.c",
                    "file_size": 56764
                }
            ],
            "interesting": {
                "reopen": false,
                "status": false
            },
            "is_parent": false,
            "sha": "12020998c285157e3c4ee6f17e709d35349e3e12"
        }
    ],
    "first_commit": "2020-05-16 11:22:09",
    "last_commit": "2020-09-29 12:52:44",
    "number": 1221,
    "pull_request": "None",
    "score": {
        "accidental_reopen_likely": false,
        "all_labels": [
            "Type:Bug",
            "release 7",
            "release 8"
        ],
        "contains_keywords": [
            "warn",
            "patch",
            "issu",
            "perform"
        ],
        "fix_size": 3,
        "has_labels": [],
        "intersecting": {
            "computed_score": 1.0,
            "final_commit_size": 3,
            "intersection_size": 3,
            "previous_commits_size": 3
        },
        "is_makefile_based": true,
        "no_new_files": [],
        "no_other_files": false,
        "num_prohibited_files": 72944,
        "prohibited_files": [
            "hal/inc/pinmap_hal.h",
            "Debug/marvin.bin",
            "Debug/marvin.elf",
            "Debug/marvin.hex",
            "Debug/marvin.bin",
            "Debug/marvin.elf",
            "Debug/marvin.hex",
            "inc/spark_utilities.h",
            "Debug/marvin.bin",
            "Debug/marvin.elf"
        ],
        "reopen": true,
        "reopen_events": [
            [
                "2020-05-18 07:18:01",
                "closed"
            ],
            [
                "2020-05-18 07:18:01",
                "commit"
            ],
            [
                "2020-09-29 12:56:23",
                "reopened"
            ],
            [
                "2020-10-05 11:18:11",
                "commit"
            ],
            [
                "2020-10-05 11:18:30",
                "commit"
            ],
            [
                "2020-10-05 12:21:29",
                "closed"
            ]
        ],
        "status": false,
        "strategy": true,
        "total_changes": 26
    }
}