Fix #9197 - aarch64 `ldur` instruction was missing
Fix #9197 - aarch64 `ldur` instruction was missing (#9372)
Fix #9197, wrong esil for aarch64 ldr
Fix #9197, wrong esil for aarch64 ldr (#9442)
Fix #9197 - aarch64 `ldur` instruction was missing (#9372)
Fix #9197, wrong esil for aarch64 ldr (#9442)
