{
    "category": [
        "build/refactor/preprocessing",
        "control flow"
    ],
    "commits": [
        {
            "associated_pull_request": [
                "https://github.com/pipelinedb/pipelinedb/pull/1722"
            ],
            "date": "2016-12-16 00:15:12",
            "diff": "pipelinedb_pipelinedb/issue_1724/commit_6afd7a56fcbd65e4f8cee196e64919ff576a8b3f.diff",
            "diff_additions": 11,
            "diff_deletions": 3,
            "diff_file_size": 0,
            "diff_url": "https://github.com/pipelinedb/pipelinedb/commit/6afd7a56fcbd65e4f8cee196e64919ff576a8b3f.diff",
            "exists": true,
            "files": [
                {
                    "file_additions": 1,
                    "file_deletions": 1,
                    "file_exists": false,
                    "file_name": "src/backend/pipeline/ipc/microbatch.c",
                    "file_size": 0
                },
                {
                    "file_additions": 8,
                    "file_deletions": 0,
                    "file_exists": false,
                    "file_name": "src/backend/pipeline/transformReceiver.c",
                    "file_size": 0
                },
                {
                    "file_additions": 2,
                    "file_deletions": 2,
                    "file_exists": false,
                    "file_name": "src/backend/utils/misc/guc.c",
                    "file_size": 0
                }
            ],
            "interesting": {
                "reopen": false,
                "status": false
            },
            "is_parent": true,
            "sha": "6afd7a56fcbd65e4f8cee196e64919ff576a8b3f"
        },
        {
            "associated_pull_request": [],
            "date": "2016-12-20 23:30:45",
            "diff": "pipelinedb_pipelinedb/issue_1724/commit_4a593db43d761cde4a31e39ee5d0092d595ecf9b.diff",
            "diff_additions": 28,
            "diff_deletions": 6,
            "diff_file_size": 0,
            "diff_url": "https://github.com/pipelinedb/pipelinedb/commit/4a593db43d761cde4a31e39ee5d0092d595ecf9b.diff",
            "exists": true,
            "files": [
                {
                    "file_additions": 8,
                    "file_deletions": 0,
                    "file_exists": false,
                    "file_name": "src/backend/pipeline/cont_combiner.c",
                    "file_size": 0
                },
                {
                    "file_additions": 8,
                    "file_deletions": 0,
                    "file_exists": false,
                    "file_name": "src/backend/pipeline/cont_worker.c",
                    "file_size": 0
                },
                {
                    "file_additions": 2,
                    "file_deletions": 0,
                    "file_exists": false,
                    "file_name": "src/backend/postmaster/pgstat.c",
                    "file_size": 0
                },
                {
                    "file_additions": 10,
                    "file_deletions": 6,
                    "file_exists": false,
                    "file_name": "src/backend/utils/adt/pipelinefuncs.c",
                    "file_size": 0
                }
            ],
            "interesting": {
                "reopen": false,
                "status": true
            },
            "is_parent": false,
            "sha": "4a593db43d761cde4a31e39ee5d0092d595ecf9b"
        },
        {
            "associated_pull_request": [
                "https://github.com/pipelinedb/pipelinedb/pull/1725"
            ],
            "date": "2016-12-20 23:42:12",
            "diff": "pipelinedb_pipelinedb/issue_1724/commit_d91e63d2cbd4b1c870618ac3349f282d74a147dc.diff",
            "diff_additions": 35,
            "diff_deletions": 6,
            "diff_file_size": 0,
            "diff_url": "https://github.com/pipelinedb/pipelinedb/commit/d91e63d2cbd4b1c870618ac3349f282d74a147dc.diff",
            "exists": true,
            "files": [
                {
                    "file_additions": 15,
                    "file_deletions": 0,
                    "file_exists": false,
                    "file_name": "src/backend/pipeline/cont_combiner.c",
                    "file_size": 0
                },
                {
                    "file_additions": 8,
                    "file_deletions": 0,
                    "file_exists": false,
                    "file_name": "src/backend/pipeline/cont_worker.c",
                    "file_size": 0
                },
                {
                    "file_additions": 2,
                    "file_deletions": 0,
                    "file_exists": false,
                    "file_name": "src/backend/postmaster/pgstat.c",
                    "file_size": 0
                },
                {
                    "file_additions": 10,
                    "file_deletions": 6,
                    "file_exists": false,
                    "file_name": "src/backend/utils/adt/pipelinefuncs.c",
                    "file_size": 0
                }
            ],
            "interesting": {
                "reopen": false,
                "status": false
            },
            "is_parent": false,
            "sha": "d91e63d2cbd4b1c870618ac3349f282d74a147dc"
        },
        {
            "associated_pull_request": [
                "https://github.com/pipelinedb/pipelinedb/pull/1725"
            ],
            "date": "2016-12-20 23:43:45",
            "diff": "pipelinedb_pipelinedb/issue_1724/commit_6ba386c4077bfd358471872e3b8199d7d4e32df1.diff",
            "diff_additions": 35,
            "diff_deletions": 6,
            "diff_file_size": 0,
            "diff_url": "https://github.com/pipelinedb/pipelinedb/commit/6ba386c4077bfd358471872e3b8199d7d4e32df1.diff",
            "exists": true,
            "files": [
                {
                    "file_additions": 15,
                    "file_deletions": 0,
                    "file_exists": false,
                    "file_name": "src/backend/pipeline/cont_combiner.c",
                    "file_size": 0
                },
                {
                    "file_additions": 8,
                    "file_deletions": 0,
                    "file_exists": false,
                    "file_name": "src/backend/pipeline/cont_worker.c",
                    "file_size": 0
                },
                {
                    "file_additions": 2,
                    "file_deletions": 0,
                    "file_exists": false,
                    "file_name": "src/backend/postmaster/pgstat.c",
                    "file_size": 0
                },
                {
                    "file_additions": 10,
                    "file_deletions": 6,
                    "file_exists": false,
                    "file_name": "src/backend/utils/adt/pipelinefuncs.c",
                    "file_size": 0
                }
            ],
            "interesting": {
                "reopen": false,
                "status": false
            },
            "is_parent": false,
            "sha": "6ba386c4077bfd358471872e3b8199d7d4e32df1"
        },
        {
            "associated_pull_request": [],
            "date": "2016-12-20 23:45:42",
            "diff": "pipelinedb_pipelinedb/issue_1724/commit_e283a28dedd086fcc03d151499f4d4a2c82fd9a7.diff",
            "diff_additions": 35,
            "diff_deletions": 6,
            "diff_file_size": 0,
            "diff_url": "https://github.com/pipelinedb/pipelinedb/commit/e283a28dedd086fcc03d151499f4d4a2c82fd9a7.diff",
            "exists": true,
            "files": [
                {
                    "file_additions": 15,
                    "file_deletions": 0,
                    "file_exists": false,
                    "file_name": "src/backend/pipeline/cont_combiner.c",
                    "file_size": 0
                },
                {
                    "file_additions": 8,
                    "file_deletions": 0,
                    "file_exists": false,
                    "file_name": "src/backend/pipeline/cont_worker.c",
                    "file_size": 0
                },
                {
                    "file_additions": 2,
                    "file_deletions": 0,
                    "file_exists": false,
                    "file_name": "src/backend/postmaster/pgstat.c",
                    "file_size": 0
                },
                {
                    "file_additions": 10,
                    "file_deletions": 6,
                    "file_exists": false,
                    "file_name": "src/backend/utils/adt/pipelinefuncs.c",
                    "file_size": 0
                }
            ],
            "interesting": {
                "reopen": false,
                "status": false
            },
            "is_parent": false,
            "sha": "e283a28dedd086fcc03d151499f4d4a2c82fd9a7"
        },
        {
            "associated_pull_request": [
                "https://github.com/pipelinedb/pipelinedb/pull/1726"
            ],
            "date": "2016-12-21 20:47:44",
            "diff": "pipelinedb_pipelinedb/issue_1724/commit_ae6335afaa693157074f38d12dcf6321a001aa76.diff",
            "diff_additions": 55,
            "diff_deletions": 2,
            "diff_file_size": 0,
            "diff_url": "https://github.com/pipelinedb/pipelinedb/commit/ae6335afaa693157074f38d12dcf6321a001aa76.diff",
            "exists": true,
            "files": [
                {
                    "file_additions": 2,
                    "file_deletions": 0,
                    "file_exists": false,
                    "file_name": "src/backend/pipeline/cont_combiner.c",
                    "file_size": 0
                },
                {
                    "file_additions": 53,
                    "file_deletions": 2,
                    "file_exists": false,
                    "file_name": "src/backend/pipeline/cqmatrel.c",
                    "file_size": 0
                }
            ],
            "interesting": {
                "reopen": false,
                "status": false
            },
            "is_parent": false,
            "sha": "ae6335afaa693157074f38d12dcf6321a001aa76"
        },
        {
            "associated_pull_request": [
                "https://github.com/pipelinedb/pipelinedb/pull/1726"
            ],
            "date": "2016-12-21 20:50:52",
            "diff": "pipelinedb_pipelinedb/issue_1724/commit_184bff04547aad286cfccdad6f7c48b2769cc128.diff",
            "diff_additions": 55,
            "diff_deletions": 2,
            "diff_file_size": 0,
            "diff_url": "https://github.com/pipelinedb/pipelinedb/commit/184bff04547aad286cfccdad6f7c48b2769cc128.diff",
            "exists": true,
            "files": [
                {
                    "file_additions": 2,
                    "file_deletions": 0,
                    "file_exists": false,
                    "file_name": "src/backend/pipeline/cont_combiner.c",
                    "file_size": 0
                },
                {
                    "file_additions": 53,
                    "file_deletions": 2,
                    "file_exists": false,
                    "file_name": "src/backend/pipeline/cqmatrel.c",
                    "file_size": 0
                }
            ],
            "interesting": {
                "reopen": false,
                "status": false
            },
            "is_parent": false,
            "sha": "184bff04547aad286cfccdad6f7c48b2769cc128"
        }
    ],
    "first_commit": "2016-12-16 00:15:12",
    "last_commit": "2016-12-21 20:50:52",
    "number": 1724,
    "pull_request": "None",
    "score": {
        "accidental_reopen_likely": false,
        "all_labels": [
            "monitoring"
        ],
        "contains_keywords": [],
        "fix_size": 106,
        "has_labels": [],
        "intersecting": {
            "computed_score": 1.0,
            "final_commit_size": 57,
            "intersection_size": 57,
            "previous_commits_size": 106
        },
        "is_makefile_based": true,
        "no_new_files": [],
        "no_other_files": false,
        "num_prohibited_files": 127769,
        "prohibited_files": [
            "kill.h",
            "meminfo.h",
            "kill.h",
            "meminfo.h",
            "kill.h",
            "meminfo.h",
            "testsuite_cli_test.go",
            "testsuite_cli_test.go",
            "common.mk",
            "i3bar/include/draw_util.h"
        ],
        "reopen": false,
        "reopen_events": [
            [
                "2016-12-20 23:30:55",
                "commit"
            ],
            [
                "2016-12-20 23:31:50",
                "commit"
            ],
            [
                "2016-12-20 23:33:19",
                "closed"
            ],
            [
                "2016-12-20 23:42:22",
                "commit"
            ],
            [
                "2016-12-20 23:43:46",
                "commit"
            ],
            [
                "2016-12-20 23:45:52",
                "commit"
            ],
            [
                "2016-12-21 20:47:53",
                "commit"
            ],
            [
                "2016-12-21 20:50:54",
                "commit"
            ]
        ],
        "status": true,
        "strategy": true,
        "total_changes": 285
    }
}