{
    "covered_issues": [
        2707,
        2689,
        2685,
        2684,
        2679,
        2678,
        2676,
        2675,
        2658,
        2656,
        2655,
        2652,
        2651,
        2650,
        2648,
        2641,
        2634,
        2631,
        2626,
        2621,
        2615,
        2609,
        2607,
        2605,
        2601,
        2597,
        2596,
        2593,
        2590,
        2589,
        2588,
        2585,
        2583,
        2575,
        2573,
        2570,
        2568,
        2567,
        2563,
        2558,
        2556,
        2553,
        2552,
        2550,
        2549,
        2541,
        2540,
        2538,
        2534,
        2533,
        2532,
        2531,
        2530,
        2529,
        2524,
        2582,
        2522,
        2519,
        2518,
        2517,
        2516,
        2507,
        2506,
        2502,
        2501,
        2500,
        2498,
        2497,
        2496,
        2495,
        2494,
        2493,
        2492,
        2491,
        2489,
        2488,
        2486,
        2483,
        2482,
        2481,
        2478,
        2476,
        2475,
        2474,
        2472,
        2469,
        2467,
        2466,
        2465,
        2464,
        2463,
        2462,
        2459,
        2458,
        2457,
        2456,
        2455,
        2454,
        2446,
        2443,
        2442,
        2438,
        2437,
        2435,
        2433,
        2432,
        2431,
        2430,
        2429,
        2428,
        2425,
        2424,
        2423,
        2420,
        2419,
        2416,
        2411,
        2408,
        2405,
        2404,
        2403,
        2401,
        2396,
        2393,
        2392,
        2389,
        2387,
        2384,
        2380,
        2379,
        2377,
        2376,
        2374,
        2372,
        2370,
        2368,
        2362,
        2361,
        2359,
        2357,
        2355,
        2352,
        2351,
        2350,
        2348,
        2347,
        2346,
        2344,
        2337,
        2336,
        2335,
        2333,
        2332,
        2331,
        2329,
        2328,
        2322,
        2321,
        2320,
        2319,
        2318,
        2316,
        2312,
        2311,
        2310,
        2302,
        2296,
        2294,
        2293,
        2292,
        2290,
        2285,
        2284,
        2281,
        2280,
        2279,
        2268,
        2265,
        2261,
        2260,
        2259,
        2257,
        2253,
        2251,
        2250,
        2243,
        2241,
        2237,
        2234,
        2225,
        2224,
        2220,
        2218,
        2217,
        2215,
        2214,
        2211,
        2210,
        2207,
        2206,
        2203,
        2198,
        2197,
        2196,
        2192,
        2191,
        2189,
        2186,
        2182,
        2175,
        2172,
        2167,
        2166,
        2164,
        2157,
        2154,
        2153,
        2151,
        2150,
        2149,
        2148,
        2145,
        2144,
        2141,
        2140,
        2136,
        2135,
        2134,
        2128,
        2126,
        2125,
        2124,
        2121,
        2117,
        2111,
        2108,
        2107,
        2105,
        2104,
        2103,
        2102,
        2101,
        2098,
        2091,
        2090,
        2083,
        2082,
        2081,
        2079,
        2078,
        2077,
        2076,
        2075,
        2074,
        2072,
        2068,
        2064,
        2063,
        2061,
        2060,
        2057,
        2056,
        2055,
        2051,
        2047,
        2046,
        2045,
        2042,
        2039,
        2036,
        2031,
        2030,
        2028,
        2026,
        2025,
        2024,
        2022,
        2015,
        2014,
        2013,
        2010,
        2009,
        2008,
        2007,
        2002,
        2001,
        2000,
        1999,
        1998,
        1996,
        1993,
        1992,
        1990,
        1986,
        1985,
        1984,
        1983,
        1981,
        1977,
        1976,
        1975,
        1974,
        1973,
        1971,
        1969,
        1964,
        1961,
        1959,
        1957,
        1948,
        1943,
        1937,
        1935,
        1931,
        1930,
        1927,
        1926,
        1923,
        1922,
        1920,
        1918,
        1915,
        1912,
        1911,
        1910,
        1909,
        1908,
        1907,
        1906,
        1905,
        1903,
        1901,
        1900,
        1897,
        1896,
        1894,
        1892,
        1888,
        1887,
        1885,
        1884,
        1883,
        1881,
        1879,
        1878,
        1876,
        1871,
        1865,
        1857,
        1855,
        1854,
        1853,
        1852,
        1844,
        1843,
        1842,
        1840,
        1839,
        1838,
        1837,
        1836,
        1835,
        1834,
        1830,
        1829,
        1828,
        1827,
        1824,
        1818,
        1815,
        1810,
        1808,
        1806,
        1802,
        1801,
        1798,
        1797,
        1794,
        1781,
        1774,
        1771,
        1766,
        1765,
        1764,
        1758,
        1756,
        1750,
        1749,
        1748,
        1745,
        1744,
        1742,
        1741,
        1739,
        1738,
        1732,
        1730,
        1725,
        1724,
        1723,
        1722,
        1721,
        1719,
        1717,
        1713,
        1710,
        1707,
        1706,
        1704,
        1702,
        1701,
        1700,
        1699,
        1698,
        1694,
        1693,
        1691,
        1690,
        1689,
        1686,
        1685,
        1684,
        1679,
        1677,
        1675,
        1674,
        1671,
        1670,
        1667,
        1665,
        1657,
        1656,
        1655,
        1654,
        1653,
        1650,
        1648,
        1647,
        1646,
        1645,
        1644,
        1643,
        1642,
        1637,
        1630,
        1629,
        1627,
        1625,
        1623,
        1622,
        1621,
        1608,
        1606,
        1605,
        1603,
        1597,
        1596,
        1593,
        1592,
        1586,
        1585,
        1583,
        1581,
        1570,
        1569,
        1566,
        1565,
        1563,
        1562,
        1561,
        1560,
        1558,
        1554,
        1553,
        1552,
        1547,
        1545,
        1544,
        1543,
        1540,
        1537,
        1536,
        1523,
        1521,
        1520,
        1513,
        1512,
        1511,
        1509,
        1507,
        1503,
        1501,
        1500,
        1495,
        1493,
        1491,
        1490,
        1488,
        1486,
        1478,
        1472,
        1470,
        1466,
        1442,
        1441,
        1436,
        1435,
        1434,
        1432,
        1430,
        1429,
        1428,
        1427,
        1426,
        1423,
        1416,
        1414,
        1412,
        1411,
        1408,
        1405,
        1403,
        1400,
        1399,
        1396,
        1392,
        1391,
        1385,
        1384,
        1382,
        1380,
        1379,
        1375,
        1373,
        1371,
        1370,
        1369,
        1368,
        1366,
        1365,
        1361,
        1360,
        1358,
        1357,
        1356,
        1354,
        1352,
        1351,
        1348,
        1347,
        1345,
        1342,
        1339,
        1337,
        1333,
        1330,
        1328,
        1327,
        1325,
        1324,
        1323,
        1322,
        1320,
        1319,
        1308,
        1307,
        1305,
        1304,
        1303,
        1302,
        1301,
        1298,
        1295,
        1294,
        1293,
        1292,
        1287,
        1286,
        1285,
        1284,
        1275,
        1274,
        1273,
        1268,
        1267,
        1266,
        1265,
        1259,
        1257,
        1255,
        1253,
        1250,
        1246,
        1239,
        1233,
        1231,
        1230,
        1229,
        1228,
        1227,
        1223,
        1222,
        1221,
        1219,
        1211,
        1206,
        1203,
        1199,
        1198,
        1197,
        1196,
        1192,
        1191,
        1189,
        1187,
        1184,
        1183,
        1180,
        1177,
        1176,
        1174,
        1171,
        1170,
        1169,
        1167,
        1160,
        1159,
        1157,
        1156,
        1153,
        1151,
        1149,
        1147,
        1146,
        1143,
        1142,
        1138,
        1137,
        1133,
        1131,
        1129,
        1128,
        1127,
        1120,
        1118,
        1117,
        1114,
        1113,
        1112,
        1110,
        1109,
        1108,
        1106,
        1104,
        1103,
        1102,
        1099,
        1098,
        1096,
        1094,
        1093,
        1092,
        1090,
        1086,
        1084,
        1077,
        1065,
        1061,
        1058,
        1057,
        1056,
        1053,
        1052,
        1049,
        1047,
        1042,
        1040,
        1039,
        1038,
        1037,
        1033,
        1030,
        1026,
        1020,
        1017,
        1015,
        1012,
        1006,
        1004,
        1003,
        1000,
        996,
        995,
        992,
        984,
        982,
        981,
        978,
        968,
        966,
        965,
        955,
        949,
        948,
        947,
        946,
        942,
        936,
        935,
        934,
        933,
        929,
        927,
        926,
        922,
        909,
        902,
        898,
        895,
        890,
        889,
        888,
        887,
        883,
        878,
        868,
        866,
        865,
        863,
        862,
        861,
        845,
        844,
        834,
        833,
        831,
        830,
        829,
        826,
        823,
        817,
        807,
        805,
        804,
        803,
        801,
        789,
        787,
        781,
        773,
        772,
        768,
        766,
        765,
        753,
        750,
        746,
        741,
        734,
        732,
        731,
        730,
        727,
        726,
        725,
        717,
        714,
        710,
        708,
        704,
        703,
        700,
        698,
        693,
        2065,
        685,
        684,
        680,
        679,
        674,
        666,
        639,
        638,
        637,
        636,
        632,
        631,
        623,
        618,
        617,
        616,
        615,
        614,
        608,
        604,
        596,
        591,
        589,
        581,
        577,
        576,
        575,
        573,
        569,
        566,
        563,
        561,
        560,
        559,
        556,
        554,
        551,
        541,
        538,
        537,
        533,
        532,
        531,
        530,
        525,
        523,
        519,
        516,
        508,
        498,
        494,
        487,
        485,
        481,
        476,
        475,
        474,
        473,
        472,
        467,
        465,
        463,
        461,
        455,
        449,
        442,
        439,
        438,
        431,
        426,
        417,
        413,
        407,
        398,
        397,
        396,
        384,
        381,
        379,
        376,
        375,
        374,
        364,
        363,
        358,
        345,
        340,
        331,
        327,
        326,
        325,
        318,
        317,
        313,
        308,
        303,
        301,
        299,
        293,
        288,
        286,
        284,
        283,
        276,
        275,
        274,
        273,
        271,
        269,
        266,
        259,
        258,
        255,
        254,
        252,
        249,
        245,
        242,
        239,
        238,
        237,
        236,
        235,
        234,
        229,
        227,
        225,
        224,
        221,
        220,
        219,
        218,
        217,
        216,
        214,
        212,
        210,
        209,
        208,
        207,
        206,
        204,
        203,
        202,
        201,
        199,
        197,
        193,
        189,
        185,
        184,
        183,
        182,
        181,
        179,
        178,
        177,
        176,
        173,
        172,
        171,
        170,
        168,
        166,
        164,
        161,
        160,
        159,
        158,
        157,
        156,
        155,
        154,
        153,
        148,
        145,
        143,
        142,
        141,
        140,
        137,
        133,
        132,
        131,
        130,
        129,
        128,
        127,
        124,
        122,
        120,
        119,
        117,
        114,
        113,
        111,
        110,
        108,
        103,
        102,
        98,
        97,
        95,
        93,
        86,
        84,
        81,
        80,
        78,
        76,
        70,
        67,
        66,
        62,
        60,
        59,
        58,
        57,
        56,
        54,
        52,
        51,
        50,
        47,
        45,
        44,
        43,
        41,
        40,
        39,
        37,
        36,
        35,
        33,
        30,
        29,
        27,
        26,
        25,
        24,
        22,
        21,
        20,
        19,
        17,
        15,
        14,
        13,
        11,
        10,
        8,
        6,
        4,
        3,
        1
    ],
    "finished": true
}