{
    "commits": [
        {
            "associated_pull_request": [],
            "date": "2021-11-06 10:53:03+00:00",
            "diff": "igraph_igraph/issue_1834/commit_5858ad351fb3ad35b3e7e5bdf9cf8bcbc0cbe289.diff",
            "diff_additions": 2,
            "diff_deletions": 1,
            "diff_file_size": 20180,
            "diff_url": "https://github.com/igraph/igraph/commit/5858ad351fb3ad35b3e7e5bdf9cf8bcbc0cbe289.diff",
            "exists": true,
            "files": [
                {
                    "file_additions": 2,
                    "file_deletions": 1,
                    "file_exists": true,
                    "file_name": "src/cliques/maximal_cliques.c",
                    "file_size": 20180
                }
            ],
            "interesting": {
                "reopen": false,
                "status": false
            },
            "is_parent": true,
            "sha": "5858ad351fb3ad35b3e7e5bdf9cf8bcbc0cbe289"
        },
        {
            "associated_pull_request": [],
            "date": "2021-11-06 19:49:32+00:00",
            "diff": "igraph_igraph/issue_1834/commit_5dc3b0033f2ad9ed8973fef0f60cb8efdd1bdb5e.diff",
            "diff_additions": 5,
            "diff_deletions": 1,
            "diff_file_size": 38220,
            "diff_url": "https://github.com/igraph/igraph/commit/5dc3b0033f2ad9ed8973fef0f60cb8efdd1bdb5e.diff",
            "exists": true,
            "files": [
                {
                    "file_additions": 5,
                    "file_deletions": 1,
                    "file_exists": true,
                    "file_name": "src/misc/conversion.c",
                    "file_size": 38220
                }
            ],
            "interesting": {
                "reopen": true,
                "status": false
            },
            "is_parent": false,
            "sha": "5dc3b0033f2ad9ed8973fef0f60cb8efdd1bdb5e"
        },
        {
            "associated_pull_request": [],
            "date": "2021-11-06 21:28:33+00:00",
            "diff": "igraph_igraph/issue_1834/commit_c96c1bea98351c528d4447ca59f9247c9883d1ec.diff",
            "diff_additions": 8,
            "diff_deletions": 4,
            "diff_file_size": 12511,
            "diff_url": "https://github.com/igraph/igraph/commit/c96c1bea98351c528d4447ca59f9247c9883d1ec.diff",
            "exists": true,
            "files": [
                {
                    "file_additions": 4,
                    "file_deletions": 2,
                    "file_exists": true,
                    "file_name": "src/operators/contract.c",
                    "file_size": 5245
                },
                {
                    "file_additions": 4,
                    "file_deletions": 2,
                    "file_exists": true,
                    "file_name": "src/operators/simplify.c",
                    "file_size": 7266
                }
            ],
            "interesting": {
                "reopen": false,
                "status": false
            },
            "is_parent": false,
            "sha": "c96c1bea98351c528d4447ca59f9247c9883d1ec"
        }
    ],
    "first_commit": "2021-11-06 10:56:13+00:00",
    "last_commit": "2021-11-06 21:28:33+00:00",
    "number": 1834,
    "pull_request": "None",
    "score": {
        "accidental_reopen_likely": false,
        "all_labels": [],
        "contains_keywords": [
            "chang",
            "fix",
            "issu",
            "fault"
        ],
        "fix_size": 17,
        "has_labels": [],
        "intersecting": {
            "computed_score": 0.0,
            "final_commit_size": 10,
            "intersection_size": 0,
            "previous_commits_size": 7
        },
        "is_makefile_based": true,
        "no_new_files": [
            "src/operators/contract.c",
            "src/operators/simplify.c"
        ],
        "no_other_files": true,
        "num_prohibited_files": 144015,
        "prohibited_files": [
            "server/src/main/java/com/genymobile/scrcpy/Device.java",
            "server/src/main/java/com/genymobile/scrcpy/wrappers/SurfaceControl.java",
            "server/src/main/java/com/genymobile/scrcpy/Device.java",
            "server/src/main/java/com/genymobile/scrcpy/wrappers/SurfaceControl.java",
            "app/meson.build",
            "app/scrcpy.1",
            "app/src/common.h",
            "app/src/scrcpy.h",
            "app/src/server.h",
            "server/src/main/java/com/genymobile/scrcpy/Workarounds.java"
        ],
        "reopen": true,
        "reopen_events": [
            [
                "2021-11-06 19:49:48+00:00",
                "commit"
            ],
            [
                "2021-11-06 19:52:10+00:00",
                "closed"
            ],
            [
                "2021-11-06 20:27:18+00:00",
                "reopened"
            ],
            [
                "2021-11-06 21:28:41+00:00",
                "commit"
            ],
            [
                "2021-11-06 21:29:03+00:00",
                "closed"
            ]
        ],
        "status": false,
        "strategy": true,
        "total_changes": 21
    }
}