{
    "covered_issues": [
        59,
        58,
        55,
        54,
        53,
        52,
        51,
        50,
        49,
        48,
        47,
        46,
        45,
        43,
        42,
        41,
        39,
        38,
        37,
        36,
        35,
        34,
        33,
        32,
        31,
        29,
        27,
        26,
        25,
        24,
        23,
        21,
        19,
        18,
        16,
        15,
        13,
        12,
        11,
        10,
        9,
        8,
        7,
        6,
        5,
        4,
        3,
        2,
        1
    ],
    "finished": true
}