{
    "category": [
        "hardware/OS",
        "multithreading",
        "feature request"
    ],
    "commits": [
        {
            "associated_pull_request": [
                "https://github.com/edenhill/librdkafka/pull/836"
            ],
            "date": "2016-10-13 13:26:50",
            "diff": "edenhill_librdkafka/issue_826/commit_617be08a61176d3521a78842ce11771c431c21cd.diff",
            "diff_additions": 12,
            "diff_deletions": 7,
            "diff_file_size": 174558,
            "diff_url": "https://github.com/edenhill/librdkafka/commit/617be08a61176d3521a78842ce11771c431c21cd.diff",
            "exists": true,
            "files": [
                {
                    "file_additions": 12,
                    "file_deletions": 7,
                    "file_exists": true,
                    "file_name": "src/rdkafka.c",
                    "file_size": 174558
                }
            ],
            "interesting": {
                "reopen": false,
                "status": false
            },
            "is_parent": true,
            "sha": "617be08a61176d3521a78842ce11771c431c21cd"
        },
        {
            "associated_pull_request": [],
            "date": "2016-10-18 21:59:46",
            "diff": "edenhill_librdkafka/issue_826/commit_60371afbeff45f6fe8bda25f1ee60d081c6ee1a7.diff",
            "diff_additions": 46,
            "diff_deletions": 8,
            "diff_file_size": 186177,
            "diff_url": "https://github.com/edenhill/librdkafka/commit/60371afbeff45f6fe8bda25f1ee60d081c6ee1a7.diff",
            "exists": true,
            "files": [
                {
                    "file_additions": 30,
                    "file_deletions": 0,
                    "file_exists": true,
                    "file_name": "src/rdkafka_offset.c",
                    "file_size": 36348
                },
                {
                    "file_additions": 16,
                    "file_deletions": 8,
                    "file_exists": true,
                    "file_name": "src/rdkafka_partition.c",
                    "file_size": 149829
                }
            ],
            "interesting": {
                "reopen": true,
                "status": true
            },
            "is_parent": false,
            "sha": "60371afbeff45f6fe8bda25f1ee60d081c6ee1a7"
        },
        {
            "associated_pull_request": [],
            "date": "2017-02-22 13:27:12",
            "diff": "edenhill_librdkafka/issue_826/commit_715c49bfbf9f3fe41934989cf92408966949954e.diff",
            "diff_additions": 30,
            "diff_deletions": 0,
            "diff_file_size": 36348,
            "diff_url": "https://github.com/edenhill/librdkafka/commit/715c49bfbf9f3fe41934989cf92408966949954e.diff",
            "exists": true,
            "files": [
                {
                    "file_additions": 30,
                    "file_deletions": 0,
                    "file_exists": true,
                    "file_name": "src/rdkafka_offset.c",
                    "file_size": 36348
                }
            ],
            "interesting": {
                "reopen": false,
                "status": false
            },
            "is_parent": false,
            "sha": "715c49bfbf9f3fe41934989cf92408966949954e"
        }
    ],
    "first_commit": "2016-10-13 13:26:50",
    "last_commit": "2017-03-08 21:13:42",
    "number": 826,
    "pull_request": "None",
    "score": {
        "accidental_reopen_likely": false,
        "all_labels": [
            "consumer",
            "enhancement"
        ],
        "contains_keywords": [
            "work",
            "fix",
            "reason",
            "bug",
            "issu",
            "workaround",
            "debug",
            "fail",
            "problem"
        ],
        "fix_size": 72,
        "has_labels": [],
        "intersecting": {
            "computed_score": 0.3548387096774194,
            "final_commit_size": 31,
            "intersection_size": 11,
            "previous_commits_size": 52
        },
        "is_makefile_based": true,
        "no_new_files": [],
        "no_other_files": false,
        "num_prohibited_files": 67034,
        "prohibited_files": [
            "kill.h",
            "meminfo.h",
            "kill.h",
            "meminfo.h",
            "kill.h",
            "meminfo.h",
            "testsuite_cli_test.go",
            "testsuite_cli_test.go",
            "common.mk",
            "i3bar/include/draw_util.h"
        ],
        "reopen": true,
        "reopen_events": [
            [
                "2016-10-18 21:59:53",
                "commit"
            ],
            [
                "2017-01-03 12:52:39",
                "closed"
            ],
            [
                "2017-02-22 13:13:35",
                "reopened"
            ],
            [
                "2017-03-08 22:15:08",
                "closed"
            ],
            [
                "2017-03-08 22:15:08",
                "commit"
            ]
        ],
        "status": false,
        "strategy": true,
        "total_changes": 103
    }
}