less output quality for transparent images in 2.7.2
2.7.3 should look like this: ![smooth](https://cloud.githubusercontent.com/assets/72159/17419551/e4667508-5a95-11e6-9a97-4aea075957fa.png)

Works fine, thx!
