{
    "category": [
        "hardware/OS",
        "GUI"
    ],
    "commits": [
        {
            "associated_pull_request": [
                "https://github.com/greenplum-db/gpdb/pull/8953"
            ],
            "date": "2019-10-30 07:17:16",
            "diff": "greenplum-db_gpdb/issue_8590/commit_7248c0454f06982b534c4ee288fc04e61d555298.diff",
            "diff_additions": 20,
            "diff_deletions": 1,
            "diff_file_size": 281176,
            "diff_url": "https://github.com/greenplum-db/gpdb/commit/7248c0454f06982b534c4ee288fc04e61d555298.diff",
            "exists": true,
            "files": [
                {
                    "file_additions": 20,
                    "file_deletions": 1,
                    "file_exists": true,
                    "file_name": "src/backend/optimizer/plan/planner.c",
                    "file_size": 281176
                }
            ],
            "interesting": {
                "reopen": false,
                "status": true
            },
            "is_parent": false,
            "sha": "7248c0454f06982b534c4ee288fc04e61d555298"
        },
        {
            "associated_pull_request": [
                "https://github.com/greenplum-db/gpdb/pull/8970"
            ],
            "date": "2019-10-30 07:17:16",
            "diff": "greenplum-db_gpdb/issue_8590/commit_5ea66dffb4df77368951b884a3f2acdf999c98c0.diff",
            "diff_additions": 20,
            "diff_deletions": 1,
            "diff_file_size": 281176,
            "diff_url": "https://github.com/greenplum-db/gpdb/commit/5ea66dffb4df77368951b884a3f2acdf999c98c0.diff",
            "exists": true,
            "files": [
                {
                    "file_additions": 20,
                    "file_deletions": 1,
                    "file_exists": true,
                    "file_name": "src/backend/optimizer/plan/planner.c",
                    "file_size": 281176
                }
            ],
            "interesting": {
                "reopen": false,
                "status": false
            },
            "is_parent": false,
            "sha": "5ea66dffb4df77368951b884a3f2acdf999c98c0"
        },
        {
            "associated_pull_request": [
                "https://github.com/greenplum-db/gpdb/pull/11736",
                "https://github.com/greenplum-db/gpdb/pull/8970"
            ],
            "date": "2019-11-01 05:39:20",
            "diff": "greenplum-db_gpdb/issue_8590/commit_453c3662e74179c3af3bdf6201e9455410552893.diff",
            "diff_additions": 20,
            "diff_deletions": 1,
            "diff_file_size": 281176,
            "diff_url": "https://github.com/greenplum-db/gpdb/commit/453c3662e74179c3af3bdf6201e9455410552893.diff",
            "exists": true,
            "files": [
                {
                    "file_additions": 20,
                    "file_deletions": 1,
                    "file_exists": true,
                    "file_name": "src/backend/optimizer/plan/planner.c",
                    "file_size": 281176
                }
            ],
            "interesting": {
                "reopen": true,
                "status": false
            },
            "is_parent": false,
            "sha": "453c3662e74179c3af3bdf6201e9455410552893"
        },
        {
            "associated_pull_request": [
                "https://github.com/greenplum-db/gpdb/pull/9006"
            ],
            "date": "2019-11-07 09:27:32",
            "diff": "greenplum-db_gpdb/issue_8590/commit_70ff44fe27b476d19d5c79b8041247d13c39971d.diff",
            "diff_additions": 21,
            "diff_deletions": 2,
            "diff_file_size": 281176,
            "diff_url": "https://github.com/greenplum-db/gpdb/commit/70ff44fe27b476d19d5c79b8041247d13c39971d.diff",
            "exists": true,
            "files": [
                {
                    "file_additions": 21,
                    "file_deletions": 2,
                    "file_exists": true,
                    "file_name": "src/backend/optimizer/plan/planner.c",
                    "file_size": 281176
                }
            ],
            "interesting": {
                "reopen": false,
                "status": false
            },
            "is_parent": false,
            "sha": "70ff44fe27b476d19d5c79b8041247d13c39971d"
        },
        {
            "associated_pull_request": [
                "https://github.com/greenplum-db/gpdb/pull/9006"
            ],
            "date": "2019-11-08 02:36:32",
            "diff": "greenplum-db_gpdb/issue_8590/commit_7f0722ef4a415014916b4e33f270141a18e9e3ce.diff",
            "diff_additions": 21,
            "diff_deletions": 2,
            "diff_file_size": 281176,
            "diff_url": "https://github.com/greenplum-db/gpdb/commit/7f0722ef4a415014916b4e33f270141a18e9e3ce.diff",
            "exists": true,
            "files": [
                {
                    "file_additions": 21,
                    "file_deletions": 2,
                    "file_exists": true,
                    "file_name": "src/backend/optimizer/plan/planner.c",
                    "file_size": 281176
                }
            ],
            "interesting": {
                "reopen": false,
                "status": false
            },
            "is_parent": false,
            "sha": "7f0722ef4a415014916b4e33f270141a18e9e3ce"
        }
    ],
    "first_commit": "2019-11-01 03:35:48",
    "last_commit": "2019-11-08 02:36:32",
    "number": 8590,
    "pull_request": "None",
    "score": {
        "accidental_reopen_likely": false,
        "all_labels": [
            "area: gporca",
            "topic: planner"
        ],
        "contains_keywords": [
            "report",
            "fix",
            "test",
            "issu"
        ],
        "fix_size": 64,
        "has_labels": [],
        "intersecting": {
            "computed_score": 1.0,
            "final_commit_size": 24,
            "intersection_size": 24,
            "previous_commits_size": 64
        },
        "is_makefile_based": true,
        "no_new_files": [],
        "no_other_files": false,
        "num_prohibited_files": 83889,
        "prohibited_files": [
            "kill.h",
            "meminfo.h",
            "kill.h",
            "meminfo.h",
            "kill.h",
            "meminfo.h",
            "testsuite_cli_test.go",
            "testsuite_cli_test.go",
            "common.mk",
            "i3bar/include/draw_util.h"
        ],
        "reopen": true,
        "reopen_events": [
            [
                "2019-10-30 07:20:19",
                "commit"
            ],
            [
                "2019-10-31 06:00:17",
                "commit"
            ],
            [
                "2019-10-31 06:07:18",
                "commit"
            ],
            [
                "2019-10-31 06:08:46",
                "commit"
            ],
            [
                "2019-10-31 08:07:28",
                "commit"
            ],
            [
                "2019-10-31 08:26:13",
                "commit"
            ],
            [
                "2019-11-01 03:36:08",
                "commit"
            ],
            [
                "2019-11-01 03:36:57",
                "commit"
            ],
            [
                "2019-11-01 03:44:22",
                "commit"
            ],
            [
                "2019-11-01 05:39:22",
                "commit"
            ],
            [
                "2019-11-01 05:39:36",
                "closed"
            ],
            [
                "2019-11-06 08:05:14",
                "reopened"
            ],
            [
                "2019-11-07 09:29:35",
                "commit"
            ],
            [
                "2019-11-08 02:36:35",
                "commit"
            ],
            [
                "2019-11-08 02:37:09",
                "closed"
            ]
        ],
        "status": true,
        "strategy": true,
        "total_changes": 109
    }
}