{
    "category": [
        "memory",
        "GUI"
    ],
    "commits": [
        {
            "associated_pull_request": [],
            "date": "2020-01-19 10:46:41",
            "diff": "bvschaik_julius/issue_249/commit_fc9eeb5fcc6726f84db20e2d5229e6f7b6ad0fc4.diff",
            "diff_additions": 1,
            "diff_deletions": 1,
            "diff_file_size": 4993,
            "diff_url": "https://github.com/bvschaik/julius/commit/fc9eeb5fcc6726f84db20e2d5229e6f7b6ad0fc4.diff",
            "exists": true,
            "files": [
                {
                    "file_additions": 1,
                    "file_deletions": 1,
                    "file_exists": true,
                    "file_name": "src/window/editor/allowed_buildings.c",
                    "file_size": 4993
                }
            ],
            "interesting": {
                "reopen": false,
                "status": false
            },
            "is_parent": true,
            "sha": "fc9eeb5fcc6726f84db20e2d5229e6f7b6ad0fc4"
        },
        {
            "associated_pull_request": [],
            "date": "2020-01-19 13:30:51",
            "diff": "bvschaik_julius/issue_249/commit_5aeadb9b89f7493e7f43512931547f4aa3d55d85.diff",
            "diff_additions": 10,
            "diff_deletions": 1,
            "diff_file_size": 17317,
            "diff_url": "https://github.com/bvschaik/julius/commit/5aeadb9b89f7493e7f43512931547f4aa3d55d85.diff",
            "exists": true,
            "files": [
                {
                    "file_additions": 5,
                    "file_deletions": 0,
                    "file_exists": true,
                    "file_name": "src/game/settings.c",
                    "file_size": 10352
                },
                {
                    "file_additions": 5,
                    "file_deletions": 1,
                    "file_exists": true,
                    "file_name": "src/window/sound_options.c",
                    "file_size": 6965
                }
            ],
            "interesting": {
                "reopen": false,
                "status": false
            },
            "is_parent": false,
            "sha": "5aeadb9b89f7493e7f43512931547f4aa3d55d85"
        },
        {
            "associated_pull_request": [],
            "date": "2020-01-19 13:30:51",
            "diff": "bvschaik_julius/issue_249/commit_4254f00979dd5779f8788c7fc85a56c0322d9440.diff",
            "diff_additions": 11,
            "diff_deletions": 1,
            "diff_file_size": 17317,
            "diff_url": "https://github.com/bvschaik/julius/commit/4254f00979dd5779f8788c7fc85a56c0322d9440.diff",
            "exists": true,
            "files": [
                {
                    "file_additions": 6,
                    "file_deletions": 0,
                    "file_exists": true,
                    "file_name": "src/game/settings.c",
                    "file_size": 10352
                },
                {
                    "file_additions": 5,
                    "file_deletions": 1,
                    "file_exists": true,
                    "file_name": "src/window/sound_options.c",
                    "file_size": 6965
                }
            ],
            "interesting": {
                "reopen": false,
                "status": false
            },
            "is_parent": false,
            "sha": "4254f00979dd5779f8788c7fc85a56c0322d9440"
        },
        {
            "associated_pull_request": [],
            "date": "2020-01-19 13:30:51",
            "diff": "bvschaik_julius/issue_249/commit_3b8f1ee9f1a076b3fec8ae25bc45dcb44468d193.diff",
            "diff_additions": 9,
            "diff_deletions": 2,
            "diff_file_size": 17317,
            "diff_url": "https://github.com/bvschaik/julius/commit/3b8f1ee9f1a076b3fec8ae25bc45dcb44468d193.diff",
            "exists": true,
            "files": [
                {
                    "file_additions": 5,
                    "file_deletions": 0,
                    "file_exists": true,
                    "file_name": "src/game/settings.c",
                    "file_size": 10352
                },
                {
                    "file_additions": 4,
                    "file_deletions": 2,
                    "file_exists": true,
                    "file_name": "src/window/sound_options.c",
                    "file_size": 6965
                }
            ],
            "interesting": {
                "reopen": false,
                "status": false
            },
            "is_parent": false,
            "sha": "3b8f1ee9f1a076b3fec8ae25bc45dcb44468d193"
        },
        {
            "associated_pull_request": [],
            "date": "2020-01-19 13:30:51",
            "diff": "bvschaik_julius/issue_249/commit_25e824089e2715c51ce2cfde7ae8a869f2292402.diff",
            "diff_additions": 9,
            "diff_deletions": 2,
            "diff_file_size": 17317,
            "diff_url": "https://github.com/bvschaik/julius/commit/25e824089e2715c51ce2cfde7ae8a869f2292402.diff",
            "exists": true,
            "files": [
                {
                    "file_additions": 5,
                    "file_deletions": 0,
                    "file_exists": true,
                    "file_name": "src/game/settings.c",
                    "file_size": 10352
                },
                {
                    "file_additions": 4,
                    "file_deletions": 2,
                    "file_exists": true,
                    "file_name": "src/window/sound_options.c",
                    "file_size": 6965
                }
            ],
            "interesting": {
                "reopen": false,
                "status": false
            },
            "is_parent": false,
            "sha": "25e824089e2715c51ce2cfde7ae8a869f2292402"
        },
        {
            "associated_pull_request": [
                "https://github.com/bvschaik/julius/pull/250"
            ],
            "date": "2020-01-19 13:30:51",
            "diff": "bvschaik_julius/issue_249/commit_1973688c38358005de29d1db14c5f0b9ea03d6d9.diff",
            "diff_additions": 9,
            "diff_deletions": 2,
            "diff_file_size": 17317,
            "diff_url": "https://github.com/bvschaik/julius/commit/1973688c38358005de29d1db14c5f0b9ea03d6d9.diff",
            "exists": true,
            "files": [
                {
                    "file_additions": 5,
                    "file_deletions": 0,
                    "file_exists": true,
                    "file_name": "src/game/settings.c",
                    "file_size": 10352
                },
                {
                    "file_additions": 4,
                    "file_deletions": 2,
                    "file_exists": true,
                    "file_name": "src/window/sound_options.c",
                    "file_size": 6965
                }
            ],
            "interesting": {
                "reopen": false,
                "status": true
            },
            "is_parent": false,
            "sha": "1973688c38358005de29d1db14c5f0b9ea03d6d9"
        },
        {
            "associated_pull_request": [
                "https://github.com/bvschaik/julius/pull/250"
            ],
            "date": "2020-01-20 12:51:07",
            "diff": "bvschaik_julius/issue_249/commit_981e375d452726bbad6b4b87f9ae86ae81059efd.diff",
            "diff_additions": 9,
            "diff_deletions": 2,
            "diff_file_size": 17317,
            "diff_url": "https://github.com/bvschaik/julius/commit/981e375d452726bbad6b4b87f9ae86ae81059efd.diff",
            "exists": true,
            "files": [
                {
                    "file_additions": 5,
                    "file_deletions": 0,
                    "file_exists": true,
                    "file_name": "src/game/settings.c",
                    "file_size": 10352
                },
                {
                    "file_additions": 4,
                    "file_deletions": 2,
                    "file_exists": true,
                    "file_name": "src/window/sound_options.c",
                    "file_size": 6965
                }
            ],
            "interesting": {
                "reopen": false,
                "status": false
            },
            "is_parent": false,
            "sha": "981e375d452726bbad6b4b87f9ae86ae81059efd"
        }
    ],
    "first_commit": "2020-01-19 10:47:21",
    "last_commit": "2020-01-20 12:51:07",
    "number": 249,
    "pull_request": "None",
    "score": {
        "accidental_reopen_likely": false,
        "all_labels": [
            "bug"
        ],
        "contains_keywords": [
            "report",
            "fix",
            "reason",
            "bug",
            "issu",
            "problem"
        ],
        "fix_size": 15,
        "has_labels": [
            "bug"
        ],
        "intersecting": {
            "computed_score": 1.0,
            "final_commit_size": 11,
            "intersection_size": 11,
            "previous_commits_size": 15
        },
        "is_makefile_based": true,
        "no_new_files": [],
        "no_other_files": false,
        "num_prohibited_files": 164661,
        "prohibited_files": [
            "kill.h",
            "meminfo.h",
            "kill.h",
            "meminfo.h",
            "kill.h",
            "meminfo.h",
            "testsuite_cli_test.go",
            "testsuite_cli_test.go",
            "common.mk",
            "i3bar/include/draw_util.h"
        ],
        "reopen": false,
        "reopen_events": [
            [
                "2020-01-19 13:33:39",
                "commit"
            ],
            [
                "2020-01-19 13:44:51",
                "commit"
            ],
            [
                "2020-01-20 12:00:27",
                "commit"
            ],
            [
                "2020-01-20 12:01:36",
                "commit"
            ],
            [
                "2020-01-20 12:49:48",
                "commit"
            ],
            [
                "2020-01-20 12:51:09",
                "closed"
            ],
            [
                "2020-01-20 12:51:09",
                "commit"
            ]
        ],
        "status": true,
        "strategy": true,
        "total_changes": 69
    }
}