{
    "all_issues": 682,
    "interesting_issues": 4,
    "last_update": "2023-11-03 04:53:56.060443",
    "license": {
        "download": "https://raw.githubusercontent.com/keirf/flashfloppy/master/COPYING",
        "name": "Other"
    },
    "ratio": 0.005865102639296188,
    "size": 4335,
    "stars": 1163,
    "url": "https://github.com/keirf/flashfloppy"
}