{
    "covered_issues": [
        967,
        949,
        946,
        938,
        934,
        895,
        893,
        892,
        888,
        886,
        881,
        872,
        871,
        868,
        860,
        859,
        853,
        848,
        843,
        842,
        840,
        825,
        824,
        822,
        821,
        815,
        814,
        811,
        805,
        803,
        802,
        797,
        796,
        793,
        791,
        782,
        779,
        777,
        774,
        768,
        765,
        755,
        751,
        748,
        743,
        741,
        740,
        739,
        738,
        733,
        732,
        731,
        730,
        728,
        724,
        722,
        716,
        715,
        714,
        711,
        710,
        708,
        701,
        696,
        694,
        693,
        685,
        684,
        682,
        681,
        679,
        676,
        674,
        671,
        669,
        668,
        664,
        663,
        658,
        657,
        656,
        654,
        653,
        649,
        642,
        641,
        640,
        639,
        635,
        627,
        626,
        622,
        620,
        618,
        616,
        611,
        610,
        609,
        607,
        605,
        604,
        603,
        598,
        597,
        591,
        582,
        581,
        577,
        575,
        571,
        569,
        568,
        567,
        566,
        565,
        556,
        555,
        551,
        547,
        545,
        544,
        543,
        537,
        536,
        526,
        525,
        522,
        521,
        517,
        516,
        515,
        514,
        513,
        512,
        510,
        509,
        506,
        503,
        502,
        497,
        495,
        494,
        490,
        489,
        485,
        484,
        483,
        482,
        481,
        480,
        479,
        477,
        475,
        474,
        473,
        472,
        471,
        469,
        467,
        465,
        464,
        463,
        462,
        460,
        459,
        458,
        456,
        455,
        454,
        453,
        451,
        450,
        449,
        447,
        443,
        442,
        440,
        439,
        438,
        437,
        436,
        435,
        433,
        431,
        428,
        427,
        424,
        423,
        422,
        421,
        420,
        419,
        418,
        417,
        416,
        415,
        414,
        410,
        409,
        408,
        401,
        395,
        394,
        384,
        382,
        377,
        376,
        374,
        373,
        369,
        368,
        366,
        364,
        362,
        351,
        350,
        348,
        347,
        345,
        344,
        343,
        342,
        341,
        339,
        338,
        337,
        336,
        334,
        333,
        332,
        331,
        330,
        329,
        328,
        327,
        325,
        324,
        323,
        322,
        321,
        320,
        319,
        317,
        316,
        313,
        312,
        309,
        308,
        306,
        302,
        301,
        299,
        297,
        295,
        293,
        291,
        290,
        289,
        287,
        286,
        285,
        283,
        281,
        280,
        279,
        278,
        275,
        274,
        273,
        271,
        270,
        269,
        268,
        267,
        266,
        264,
        263,
        261,
        259,
        258,
        257,
        256,
        254,
        252,
        251,
        248,
        247,
        246,
        245,
        244,
        243,
        240,
        235,
        233,
        231,
        230,
        228,
        225,
        223,
        222,
        215,
        214,
        213,
        212,
        211,
        210,
        209,
        208,
        206,
        205,
        204,
        203,
        202,
        201,
        200,
        199,
        198,
        194,
        191,
        189,
        188,
        187,
        182,
        181,
        180,
        171,
        168,
        167,
        159,
        158,
        155,
        154,
        153,
        152,
        150,
        149,
        148,
        146,
        145,
        144,
        142,
        140,
        139,
        137,
        135,
        134,
        133,
        132,
        130,
        129,
        128,
        125,
        124,
        123,
        118,
        117,
        116,
        115,
        114,
        113,
        112,
        111,
        110,
        109,
        108,
        107,
        106,
        105,
        104,
        103,
        102,
        99,
        97,
        96,
        95,
        94,
        93,
        91,
        90,
        89,
        88,
        87,
        86,
        85,
        83,
        82,
        81,
        80,
        79,
        77,
        76,
        75,
        74,
        73,
        72,
        71,
        70,
        69,
        68,
        67,
        66,
        65,
        64,
        63,
        62,
        61,
        60,
        59,
        58,
        56,
        54,
        53,
        52,
        51,
        50,
        46,
        45,
        44,
        43,
        42,
        41,
        39,
        38,
        37,
        36,
        35,
        34,
        31,
        30,
        29,
        28,
        27,
        26,
        23,
        22,
        21,
        20,
        19,
        18,
        17,
        16,
        15,
        14,
        13,
        12,
        10,
        9,
        7,
        6,
        5,
        4,
        3,
        2
    ],
    "finished": true
}