{
    "covered_issues": [
        24,
        21,
        19,
        17,
        16,
        13,
        12,
        11,
        10,
        9,
        8,
        7,
        1
    ],
    "finished": true
}