{
    "category": [
        "build/refactor/preprocessing",
        "control flow"
    ],
    "commits": [
        {
            "associated_pull_request": [],
            "date": "2015-11-08 20:26:26",
            "diff": "collectd_collectd/issue_1265/commit_9b39918bdadabb12ec040f0f191c0d21cb6ddd53.diff",
            "diff_additions": 3,
            "diff_deletions": 4,
            "diff_file_size": 146008,
            "diff_url": "https://github.com/collectd/collectd/commit/9b39918bdadabb12ec040f0f191c0d21cb6ddd53.diff",
            "exists": true,
            "files": [
                {
                    "file_additions": 2,
                    "file_deletions": 2,
                    "file_exists": true,
                    "file_name": "src/daemon/plugin.c",
                    "file_size": 73836
                },
                {
                    "file_additions": 0,
                    "file_deletions": 0,
                    "file_exists": false,
                    "file_name": "src/daemon/utils_ignorelist.c",
                    "file_size": 0
                },
                {
                    "file_additions": 1,
                    "file_deletions": 2,
                    "file_exists": true,
                    "file_name": "src/snmp.c",
                    "file_size": 72172
                }
            ],
            "interesting": {
                "reopen": false,
                "status": false
            },
            "is_parent": true,
            "sha": "9b39918bdadabb12ec040f0f191c0d21cb6ddd53"
        },
        {
            "associated_pull_request": [],
            "date": "2015-11-17 13:44:20",
            "diff": "collectd_collectd/issue_1265/commit_b4db5b8da081cb5bb64feda53ec86ea60f69c3b1.diff",
            "diff_additions": 41,
            "diff_deletions": 0,
            "diff_file_size": 22779,
            "diff_url": "https://github.com/collectd/collectd/commit/b4db5b8da081cb5bb64feda53ec86ea60f69c3b1.diff",
            "exists": true,
            "files": [
                {
                    "file_additions": 41,
                    "file_deletions": 0,
                    "file_exists": true,
                    "file_name": "src/mqtt.c",
                    "file_size": 22779
                }
            ],
            "interesting": {
                "reopen": false,
                "status": true
            },
            "is_parent": false,
            "sha": "b4db5b8da081cb5bb64feda53ec86ea60f69c3b1"
        },
        {
            "associated_pull_request": [
                "https://github.com/collectd/collectd/pull/1345"
            ],
            "date": "2015-11-17 13:44:20",
            "diff": "collectd_collectd/issue_1265/commit_69b0d4948ca934d22e6e88f1eca02678f0d45355.diff",
            "diff_additions": 52,
            "diff_deletions": 0,
            "diff_file_size": 22779,
            "diff_url": "https://github.com/collectd/collectd/commit/69b0d4948ca934d22e6e88f1eca02678f0d45355.diff",
            "exists": true,
            "files": [
                {
                    "file_additions": 52,
                    "file_deletions": 0,
                    "file_exists": true,
                    "file_name": "src/mqtt.c",
                    "file_size": 22779
                }
            ],
            "interesting": {
                "reopen": false,
                "status": false
            },
            "is_parent": false,
            "sha": "69b0d4948ca934d22e6e88f1eca02678f0d45355"
        }
    ],
    "first_commit": "2015-11-08 20:26:26",
    "last_commit": "2015-11-18 18:12:59",
    "number": 1265,
    "pull_request": "None",
    "score": {
        "accidental_reopen_likely": false,
        "all_labels": [
            "Feature request"
        ],
        "contains_keywords": [],
        "fix_size": 67,
        "has_labels": [],
        "intersecting": {
            "computed_score": 0.5283018867924528,
            "final_commit_size": 53,
            "intersection_size": 28,
            "previous_commits_size": 42
        },
        "is_makefile_based": true,
        "no_new_files": [],
        "no_other_files": false,
        "num_prohibited_files": 45388,
        "prohibited_files": [
            "hal/inc/pinmap_hal.h",
            "Debug/marvin.bin",
            "Debug/marvin.elf",
            "Debug/marvin.hex",
            "Debug/marvin.bin",
            "Debug/marvin.elf",
            "Debug/marvin.hex",
            "inc/spark_utilities.h",
            "Debug/marvin.bin",
            "Debug/marvin.elf"
        ],
        "reopen": false,
        "reopen_events": [
            [
                "2015-11-17 13:45:01",
                "commit"
            ],
            [
                "2015-11-18 18:13:28",
                "commit"
            ],
            [
                "2015-11-28 11:17:17",
                "closed"
            ]
        ],
        "status": true,
        "strategy": true,
        "total_changes": 100
    }
}