{
    "covered_issues": [
        313,
        286,
        246,
        243,
        201,
        197,
        166,
        163,
        161,
        156,
        150,
        146,
        139,
        137,
        132,
        127,
        121,
        81,
        63,
        48,
        42,
        28,
        22,
        20,
        14,
        13,
        12,
        11,
        10,
        7,
        6,
        5,
        4,
        3,
        2
    ],
    "finished": true
}