{
    "covered_issues": [
        132,
        104,
        102,
        101,
        99,
        98,
        95,
        93,
        92,
        90,
        89,
        86,
        84,
        83,
        82,
        81,
        80,
        79,
        78,
        77,
        76,
        75,
        73,
        72,
        71,
        70,
        69,
        68,
        67,
        66,
        65,
        64,
        63,
        62,
        61,
        60,
        56,
        55,
        54,
        50,
        49,
        47,
        46,
        45,
        44,
        43,
        41,
        37,
        36,
        35,
        34,
        33,
        32,
        31,
        26,
        25,
        24,
        23,
        22,
        20,
        19,
        16,
        15,
        14,
        13,
        11,
        10,
        8,
        5,
        4,
        3,
        2
    ],
    "finished": true
}