{
    "commits": [
        {
            "associated_pull_request": [],
            "date": "2021-04-18 03:49:01+00:00",
            "diff": "dankamongmen_notcurses/issue_1546/commit_2d73ba79e4ec0669e4f94c248aac7dfb67234c96.diff",
            "diff_additions": 14,
            "diff_deletions": 37,
            "diff_file_size": 101831,
            "diff_url": "https://github.com/dankamongmen/notcurses/commit/2d73ba79e4ec0669e4f94c248aac7dfb67234c96.diff",
            "exists": true,
            "files": [
                {
                    "file_additions": 1,
                    "file_deletions": 1,
                    "file_exists": true,
                    "file_name": "src/lib/direct.c",
                    "file_size": 45428
                },
                {
                    "file_additions": 5,
                    "file_deletions": 14,
                    "file_exists": true,
                    "file_name": "src/lib/sprite.c",
                    "file_size": 8075
                },
                {
                    "file_additions": 8,
                    "file_deletions": 22,
                    "file_exists": true,
                    "file_name": "src/lib/visual.c",
                    "file_size": 48328
                }
            ],
            "interesting": {
                "reopen": false,
                "status": false
            },
            "is_parent": true,
            "sha": "2d73ba79e4ec0669e4f94c248aac7dfb67234c96"
        },
        {
            "associated_pull_request": [
                "https://github.com/dankamongmen/notcurses/pull/1551"
            ],
            "date": "2021-04-18 04:56:36+00:00",
            "diff": "dankamongmen_notcurses/issue_1546/commit_88927991a9060ef19b2d91b49643b6b80502213e.diff",
            "diff_additions": 65,
            "diff_deletions": 0,
            "diff_file_size": 81671,
            "diff_url": "https://github.com/dankamongmen/notcurses/commit/88927991a9060ef19b2d91b49643b6b80502213e.diff",
            "exists": true,
            "files": [
                {
                    "file_additions": 37,
                    "file_deletions": 0,
                    "file_exists": true,
                    "file_name": "src/lib/visual.c",
                    "file_size": 48328
                },
                {
                    "file_additions": 28,
                    "file_deletions": 0,
                    "file_exists": true,
                    "file_name": "src/tests/visual.cpp",
                    "file_size": 33343
                }
            ],
            "interesting": {
                "reopen": false,
                "status": false
            },
            "is_parent": false,
            "sha": "88927991a9060ef19b2d91b49643b6b80502213e"
        },
        {
            "associated_pull_request": [],
            "date": "2021-04-18 10:52:08+00:00",
            "diff": "dankamongmen_notcurses/issue_1546/commit_7d61457b37b9c1ad9499d140a2954a991ce98a6c.diff",
            "diff_additions": 29,
            "diff_deletions": 19,
            "diff_file_size": 107877,
            "diff_url": "https://github.com/dankamongmen/notcurses/commit/7d61457b37b9c1ad9499d140a2954a991ce98a6c.diff",
            "exists": true,
            "files": [
                {
                    "file_additions": 2,
                    "file_deletions": 1,
                    "file_exists": true,
                    "file_name": "src/lib/visual.c",
                    "file_size": 48328
                },
                {
                    "file_additions": 1,
                    "file_deletions": 1,
                    "file_exists": true,
                    "file_name": "src/media/ffmpeg.c",
                    "file_size": 26206
                },
                {
                    "file_additions": 26,
                    "file_deletions": 17,
                    "file_exists": true,
                    "file_name": "src/tests/visual.cpp",
                    "file_size": 33343
                }
            ],
            "interesting": {
                "reopen": false,
                "status": false
            },
            "is_parent": false,
            "sha": "7d61457b37b9c1ad9499d140a2954a991ce98a6c"
        }
    ],
    "first_commit": "2021-04-18 03:49:01+00:00",
    "last_commit": "2021-04-18 11:56:49+00:00",
    "number": 1546,
    "pull_request": "None",
    "score": {
        "accidental_reopen_likely": false,
        "all_labels": [
            "documentation",
            "enhancement"
        ],
        "contains_keywords": [
            "confirm",
            "work",
            "fail",
            "chang",
            "fix",
            "issu",
            "perform",
            "reason",
            "test",
            "problem"
        ],
        "fix_size": 96,
        "has_labels": [],
        "intersecting": {
            "computed_score": 0.3958333333333333,
            "final_commit_size": 48,
            "intersection_size": 19,
            "previous_commits_size": 67
        },
        "is_makefile_based": true,
        "no_new_files": [
            "src/media/ffmpeg.c"
        ],
        "no_other_files": false,
        "num_prohibited_files": 140970,
        "prohibited_files": [
            "server/src/main/java/com/genymobile/scrcpy/Device.java",
            "server/src/main/java/com/genymobile/scrcpy/wrappers/SurfaceControl.java",
            "server/src/main/java/com/genymobile/scrcpy/Device.java",
            "server/src/main/java/com/genymobile/scrcpy/wrappers/SurfaceControl.java",
            "app/meson.build",
            "app/scrcpy.1",
            "app/src/common.h",
            "app/src/scrcpy.h",
            "app/src/server.h",
            "server/src/main/java/com/genymobile/scrcpy/Workarounds.java"
        ],
        "reopen": true,
        "reopen_events": [
            [
                "2021-04-18 04:16:52+00:00",
                "commit"
            ],
            [
                "2021-04-18 05:12:14+00:00",
                "commit"
            ],
            [
                "2021-04-18 05:12:29+00:00",
                "commit"
            ],
            [
                "2021-04-18 05:12:29+00:00",
                "commit"
            ],
            [
                "2021-04-18 05:15:38+00:00",
                "closed"
            ],
            [
                "2021-04-18 09:34:11+00:00",
                "commit"
            ],
            [
                "2021-04-18 09:35:42+00:00",
                "reopened"
            ],
            [
                "2021-04-18 10:52:26+00:00",
                "commit"
            ],
            [
                "2021-04-18 10:52:29+00:00",
                "closed"
            ],
            [
                "2021-04-18 11:57:00+00:00",
                "commit"
            ]
        ],
        "status": false,
        "strategy": true,
        "total_changes": 164
    }
}