{
    "category": [
        "build/refactor/preprocessing",
        "control flow",
        "feature request"
    ],
    "commits": [
        {
            "associated_pull_request": [],
            "date": "2018-06-18 13:37:10",
            "diff": "radareorg_radare2/issue_1361/commit_373699a28dc682820545eb602938a69cb2a3cd7e.diff",
            "diff_additions": 4,
            "diff_deletions": 4,
            "diff_file_size": 44161,
            "diff_url": "https://github.com/radareorg/radare2/commit/373699a28dc682820545eb602938a69cb2a3cd7e.diff",
            "exists": true,
            "files": [
                {
                    "file_additions": 4,
                    "file_deletions": 4,
                    "file_exists": true,
                    "file_name": "libr/debug/debug.c",
                    "file_size": 44161
                }
            ],
            "interesting": {
                "reopen": false,
                "status": false
            },
            "is_parent": true,
            "sha": "373699a28dc682820545eb602938a69cb2a3cd7e"
        },
        {
            "associated_pull_request": [
                "https://github.com/radareorg/radare2/pull/10391"
            ],
            "date": "2018-06-18 17:56:45",
            "diff": "radareorg_radare2/issue_1361/commit_febc008eb90a7683068a0b4c46ab13fedb8de5b7.diff",
            "diff_additions": 5,
            "diff_deletions": 1,
            "diff_file_size": 44161,
            "diff_url": "https://github.com/radareorg/radare2/commit/febc008eb90a7683068a0b4c46ab13fedb8de5b7.diff",
            "exists": true,
            "files": [
                {
                    "file_additions": 5,
                    "file_deletions": 1,
                    "file_exists": true,
                    "file_name": "libr/debug/debug.c",
                    "file_size": 44161
                }
            ],
            "interesting": {
                "reopen": true,
                "status": true
            },
            "is_parent": false,
            "sha": "febc008eb90a7683068a0b4c46ab13fedb8de5b7"
        },
        {
            "associated_pull_request": [
                "https://github.com/radareorg/radare2/pull/10889"
            ],
            "date": "2018-08-01 19:48:03",
            "diff": "radareorg_radare2/issue_1361/commit_7bdb7c53fc08dcfae966b6217bd6dc287d8402e2.diff",
            "diff_additions": 14,
            "diff_deletions": 1,
            "diff_file_size": 154,
            "diff_url": "https://github.com/radareorg/radare2/commit/7bdb7c53fc08dcfae966b6217bd6dc287d8402e2.diff",
            "exists": true,
            "files": [
                {
                    "file_additions": 14,
                    "file_deletions": 1,
                    "file_exists": true,
                    "file_name": "binr/rafind2/rafind2.c",
                    "file_size": 154
                }
            ],
            "interesting": {
                "reopen": false,
                "status": false
            },
            "is_parent": false,
            "sha": "7bdb7c53fc08dcfae966b6217bd6dc287d8402e2"
        },
        {
            "associated_pull_request": [
                "https://github.com/radareorg/radare2/pull/10889"
            ],
            "date": "2018-08-01 20:27:19",
            "diff": "radareorg_radare2/issue_1361/commit_6eda76e0f85d0c0e095b186c7366c9555f7ff934.diff",
            "diff_additions": 14,
            "diff_deletions": 1,
            "diff_file_size": 154,
            "diff_url": "https://github.com/radareorg/radare2/commit/6eda76e0f85d0c0e095b186c7366c9555f7ff934.diff",
            "exists": true,
            "files": [
                {
                    "file_additions": 14,
                    "file_deletions": 1,
                    "file_exists": true,
                    "file_name": "binr/rafind2/rafind2.c",
                    "file_size": 154
                }
            ],
            "interesting": {
                "reopen": false,
                "status": false
            },
            "is_parent": false,
            "sha": "6eda76e0f85d0c0e095b186c7366c9555f7ff934"
        },
        {
            "associated_pull_request": [],
            "date": "2019-03-23 05:15:03",
            "diff": "radareorg_radare2/issue_1361/commit_1422013d9962473b7348080dc91ab1bcd86ca6bb.diff",
            "diff_additions": 1,
            "diff_deletions": 1,
            "diff_file_size": 0,
            "diff_url": "https://github.com/radareorg/radare2/commit/1422013d9962473b7348080dc91ab1bcd86ca6bb.diff",
            "exists": true,
            "files": [
                {
                    "file_additions": 1,
                    "file_deletions": 1,
                    "file_exists": false,
                    "file_name": "src/core/Cutter.cpp",
                    "file_size": 0
                }
            ],
            "interesting": {
                "reopen": false,
                "status": false
            },
            "is_parent": false,
            "sha": "1422013d9962473b7348080dc91ab1bcd86ca6bb"
        }
    ],
    "first_commit": "2018-06-18 13:37:10",
    "last_commit": "2019-03-23 05:15:03",
    "number": 1361,
    "pull_request": "None",
    "score": {
        "accidental_reopen_likely": false,
        "all_labels": [
            "ESIL",
            "RSearch",
            "RSoC",
            "enhancement",
            "good first issue",
            "rafind2"
        ],
        "contains_keywords": [
            "bug",
            "crash",
            "fix",
            "issu",
            "debug"
        ],
        "fix_size": 24,
        "has_labels": [],
        "intersecting": {
            "computed_score": 0.0,
            "final_commit_size": 2,
            "intersection_size": 0,
            "previous_commits_size": 22
        },
        "is_makefile_based": true,
        "no_new_files": [
            "src/core/Cutter.cpp"
        ],
        "no_other_files": false,
        "num_prohibited_files": 91301,
        "prohibited_files": [
            "hal/inc/pinmap_hal.h",
            "Debug/marvin.bin",
            "Debug/marvin.elf",
            "Debug/marvin.hex",
            "Debug/marvin.bin",
            "Debug/marvin.elf",
            "Debug/marvin.hex",
            "inc/spark_utilities.h",
            "Debug/marvin.bin",
            "Debug/marvin.elf"
        ],
        "reopen": true,
        "reopen_events": [
            [
                "2018-06-18 15:03:43",
                "commit"
            ],
            [
                "2018-06-18 17:56:49",
                "closed"
            ],
            [
                "2018-06-18 17:56:49",
                "commit"
            ],
            [
                "2018-06-19 09:15:15",
                "reopened"
            ],
            [
                "2018-08-01 19:48:08",
                "commit"
            ],
            [
                "2018-08-01 20:27:20",
                "closed"
            ],
            [
                "2018-08-01 20:27:23",
                "commit"
            ],
            [
                "2019-12-30 09:54:49",
                "commit"
            ]
        ],
        "status": false,
        "strategy": true,
        "total_changes": 46
    }
}