{
    "covered_issues": [
        1508,
        1499,
        1494,
        1486,
        1483,
        1468,
        1449,
        1445,
        1442,
        1437,
        1436,
        1432,
        1427,
        1426,
        1425,
        1421,
        1419,
        1413,
        1409,
        1407,
        1396,
        1395,
        1394,
        1390,
        1389,
        1388,
        1381,
        1347,
        1346,
        1345,
        1344,
        1342,
        1341,
        1340,
        1339,
        1337,
        1327,
        1318,
        1316,
        1314,
        1311,
        1304,
        1290,
        1289,
        1288,
        1282,
        1281,
        1280,
        1278,
        1272,
        1264,
        1260,
        1258,
        1243,
        1237,
        1236,
        1232,
        1229,
        1227,
        1226,
        1214,
        1211,
        1210,
        1209,
        1208,
        1201,
        1193,
        1192,
        1188,
        1187,
        1180,
        1179,
        1178,
        1174,
        1167,
        1166,
        1165,
        1164,
        1163,
        1161,
        1160,
        1156,
        1155,
        1152,
        1151,
        1150,
        1148,
        1146,
        1132,
        1130,
        1128,
        1127,
        1126,
        1125,
        1124,
        1121,
        1120,
        1119,
        1118,
        1117,
        1116,
        1115,
        1114,
        1113,
        1111,
        1110,
        1109,
        1107,
        1106,
        1105,
        1104,
        1103,
        1102,
        1101,
        1100,
        1099,
        1096,
        1095,
        1094,
        1093,
        1092,
        1091,
        1090,
        1089,
        1088,
        1087,
        1085,
        1084,
        1082,
        1081,
        1080,
        1079,
        1077,
        1076,
        1075,
        1072,
        1071,
        1069,
        1068,
        1067,
        1066,
        1062,
        1060,
        1055,
        1054,
        1053,
        1050,
        1049,
        1048,
        1047,
        1046,
        1044,
        1039,
        1038,
        1037,
        1036,
        1034,
        1033,
        1032,
        1031,
        1030,
        1029,
        1026,
        1025,
        1024,
        1023,
        1022,
        1019,
        1016,
        1014,
        1013,
        1012,
        1010,
        1009,
        1008,
        1006,
        1001,
        996,
        995,
        994,
        993,
        992,
        990,
        988,
        986,
        985,
        984,
        982,
        981,
        979,
        977,
        976,
        975,
        974,
        973,
        972,
        971,
        970,
        967,
        966,
        965,
        963,
        961,
        960,
        958,
        957,
        956,
        955,
        954,
        953,
        951,
        950,
        949,
        948,
        947,
        946,
        944,
        943,
        941,
        940,
        939,
        938,
        937,
        936,
        935,
        934,
        930,
        929,
        928,
        927,
        926,
        925,
        922,
        921,
        920,
        919,
        918,
        917,
        916,
        915,
        912,
        911,
        910,
        907,
        903,
        901,
        900,
        893,
        891,
        889,
        887,
        886,
        884,
        883,
        881,
        880,
        879,
        878,
        875,
        874,
        870,
        867,
        866,
        865,
        864,
        861,
        860,
        859,
        858,
        856,
        855,
        853,
        851,
        850,
        849,
        848,
        847,
        846,
        838,
        835,
        834,
        833,
        831,
        830,
        829,
        828,
        826,
        822,
        819,
        817,
        816,
        814,
        812,
        811,
        809,
        807,
        806,
        805,
        804,
        803,
        802,
        801,
        800,
        799,
        797,
        796,
        795,
        794,
        793,
        792,
        790,
        788,
        787,
        783,
        781,
        780,
        779,
        778,
        776,
        775,
        774,
        773,
        771,
        770,
        769,
        766,
        765,
        764,
        763,
        762,
        761,
        759,
        758,
        756,
        752,
        749,
        748,
        745,
        740,
        737,
        735,
        734,
        733,
        732,
        731,
        730,
        729,
        727,
        726,
        719,
        717,
        712,
        711,
        710,
        706,
        704,
        703,
        702,
        699,
        698,
        697,
        696,
        690,
        688,
        684,
        683,
        682,
        681,
        678,
        676,
        675,
        674,
        673,
        671,
        669,
        668,
        666,
        665,
        664,
        663,
        662,
        661,
        660,
        658,
        657,
        656,
        655,
        654,
        653,
        652,
        650,
        649,
        648,
        646,
        644,
        643,
        642,
        640,
        638,
        637,
        635,
        634,
        633,
        630,
        626,
        624,
        623,
        622,
        621,
        620,
        619,
        618,
        617,
        616,
        615,
        611,
        610,
        607,
        606,
        605,
        603,
        602,
        601,
        600,
        599,
        598,
        597,
        596,
        593,
        592,
        591,
        590,
        588,
        587,
        586,
        585,
        584,
        583,
        580,
        578,
        577,
        576,
        575,
        574,
        573,
        572,
        571,
        570,
        568,
        567,
        565,
        562,
        560,
        559,
        558,
        553,
        550,
        549,
        548,
        547,
        546,
        545,
        544,
        542,
        541,
        540,
        537,
        534,
        533,
        532,
        530,
        529,
        528,
        526,
        525,
        524,
        523,
        522,
        521,
        520,
        519,
        518,
        516,
        515,
        513,
        512,
        510,
        509,
        507,
        506,
        505,
        502,
        501,
        500,
        499,
        498,
        496,
        495,
        489,
        488,
        486,
        482,
        481,
        480,
        477,
        476,
        474,
        473,
        472,
        471,
        470,
        468,
        467,
        465,
        464,
        463,
        462,
        461,
        460,
        458,
        455,
        451,
        450,
        449,
        448,
        446,
        444,
        442,
        439,
        435,
        434,
        432,
        431,
        430,
        429,
        428,
        427,
        425,
        424,
        423,
        422,
        418,
        417,
        412,
        410,
        407,
        406,
        404,
        403,
        401,
        400,
        399,
        398,
        397,
        392,
        390,
        389,
        388,
        387,
        386,
        385,
        384,
        383,
        381,
        379,
        378,
        375,
        374,
        373,
        372,
        371,
        370,
        369,
        368,
        367,
        366,
        363,
        362,
        361,
        359,
        357,
        356,
        354,
        353,
        352,
        351,
        350,
        347,
        346,
        345,
        344,
        343,
        342,
        341,
        339,
        334,
        331,
        330,
        329,
        326,
        324,
        323,
        322,
        321,
        320,
        317,
        315,
        312,
        311,
        310,
        309,
        308,
        307,
        306,
        305,
        304,
        299,
        297,
        296,
        295,
        294,
        293,
        292,
        291,
        290,
        289,
        288,
        287,
        286,
        284,
        283,
        282,
        281,
        279,
        278,
        277,
        275,
        274,
        273,
        272,
        271,
        270,
        269,
        267,
        266,
        265,
        264,
        263,
        262,
        261,
        260,
        258,
        257,
        256,
        255,
        253,
        251,
        250,
        249,
        248,
        247,
        246,
        245,
        244,
        241,
        240,
        238,
        237,
        236,
        235,
        234,
        233,
        232,
        230,
        229,
        228,
        227,
        226,
        225,
        224,
        223,
        222,
        221,
        220,
        219,
        217,
        216,
        215,
        213,
        212,
        209,
        208,
        207,
        206,
        205,
        204,
        203,
        202,
        200,
        198,
        197,
        196,
        195,
        194,
        193,
        192,
        191,
        190,
        189,
        188,
        187,
        186,
        185,
        184,
        181,
        180,
        179,
        178,
        177,
        176,
        175,
        174,
        173,
        172,
        170,
        169,
        168,
        167,
        166,
        165,
        164,
        163,
        161,
        160,
        159,
        157,
        156,
        154,
        153,
        152,
        151,
        150,
        149,
        147,
        145,
        144,
        143,
        142,
        141,
        140,
        138,
        137,
        134,
        133,
        132,
        131,
        130,
        128,
        126,
        125,
        124,
        123,
        122,
        121,
        120,
        119,
        118,
        117,
        116,
        115,
        114,
        113,
        111,
        110,
        109,
        108,
        107,
        106,
        105,
        104,
        102,
        101,
        100,
        99,
        98,
        97,
        96,
        95,
        94,
        92,
        91,
        90,
        89,
        88,
        86,
        84,
        83,
        80,
        79,
        75,
        74,
        73,
        72,
        71,
        70,
        68,
        67,
        66,
        65,
        64,
        63,
        62,
        61,
        58,
        57,
        54,
        53,
        52,
        51,
        49,
        48,
        46,
        45,
        44,
        43,
        42,
        40,
        39,
        38,
        37,
        36,
        35,
        34,
        33,
        32,
        31,
        30,
        29,
        28,
        27,
        26,
        24,
        23,
        21,
        20,
        19,
        18,
        17,
        16,
        15,
        14,
        13,
        12,
        10,
        9,
        8,
        7,
        6,
        5,
        4,
        3,
        2
    ],
    "finished": true
}