{
    "covered_issues": [
        277,
        276,
        264,
        263,
        247,
        242,
        237,
        232,
        228,
        227,
        213,
        209,
        206,
        205,
        204,
        201,
        200,
        199,
        188,
        187,
        186,
        185,
        182,
        180,
        179,
        178,
        177,
        174,
        169,
        167,
        164,
        158,
        153,
        152,
        149,
        148,
        145,
        144,
        140,
        139,
        138,
        137,
        136,
        135,
        133,
        132,
        131,
        130,
        128,
        127,
        123,
        122,
        121,
        120,
        117,
        115,
        112,
        109,
        108,
        107,
        105,
        104,
        103,
        102,
        98,
        86,
        85,
        83,
        79,
        77,
        76,
        74,
        73,
        72,
        67,
        66,
        65,
        63,
        58,
        56,
        53,
        52,
        49,
        47,
        44,
        41,
        39,
        38,
        37,
        36,
        33,
        32,
        27,
        25,
        24,
        22,
        18,
        17,
        16,
        15,
        13,
        11,
        8,
        6,
        4
    ],
    "finished": true
}