{
    "covered_issues": [
        6211,
        6184,
        6175,
        6170,
        6161,
        6147,
        6141,
        6127,
        6125,
        6124,
        6122,
        6108,
        6097,
        6076,
        6069,
        6059,
        6055,
        6051,
        6049,
        6037,
        6028,
        6024,
        6019,
        6014,
        5985,
        5984,
        5981,
        5969,
        5967,
        5966,
        5964,
        5949,
        5946,
        5941,
        5934,
        5932,
        5927,
        5917,
        5913,
        5911,
        5910,
        5908,
        5907,
        5905,
        5900,
        5898,
        5895,
        5892,
        5891,
        5887,
        5883,
        5876,
        5864,
        5853,
        5829,
        5826,
        5825,
        5799,
        5797,
        5794,
        5770,
        5769,
        5765,
        5763,
        5762,
        5755,
        5747,
        5745,
        5739,
        5738,
        5734,
        5729,
        5728,
        5724,
        5711,
        5697,
        5693,
        5691,
        5689,
        5687,
        5686,
        5682,
        5681,
        5674,
        5669,
        5665,
        5662,
        5658,
        5646,
        5645,
        5641,
        5640,
        5633,
        5632,
        5631,
        5624,
        5620,
        5612,
        5610,
        5605,
        5601,
        5592,
        5590,
        5585,
        5582,
        5579,
        5577,
        5574,
        5557,
        5555,
        5554,
        5553,
        5550,
        5537,
        5534,
        5529,
        5521,
        5520,
        5513,
        5512,
        5511,
        5509,
        5504,
        5500,
        5492,
        5491,
        5489,
        5487,
        5486,
        5480,
        5479,
        5477,
        5474,
        5471,
        5464,
        5463,
        5458,
        5456,
        5455,
        5452,
        5450,
        5447,
        5438,
        5437,
        5436,
        5434,
        5433,
        5432,
        5431,
        5419,
        5414,
        5412,
        5411,
        5394,
        5389,
        5383,
        5382,
        5376,
        5365,
        5357,
        5356,
        5353,
        5348,
        5341,
        5338,
        5332,
        5331,
        5326,
        5325,
        5323,
        5315,
        5312,
        5311,
        5307,
        5306,
        5298,
        5288,
        5287,
        5286,
        5277,
        5260,
        5233,
        5231,
        5224,
        5222,
        5217,
        5216,
        5209,
        5207,
        5204,
        5203,
        5200,
        5197,
        5194,
        5192,
        5185,
        5178,
        5177,
        5174,
        5171,
        5168,
        5167,
        5161,
        5160,
        5158,
        5157,
        5154,
        5153,
        5151,
        5142,
        5139,
        5138,
        5134,
        5131,
        5129,
        5128,
        5127,
        5126,
        5125,
        5122,
        5107,
        5105,
        5104,
        5100,
        5098,
        5095,
        5092,
        5090,
        5088,
        5085,
        5084,
        5077,
        5076,
        5075,
        5073,
        5071,
        5069,
        5068,
        5064,
        5057,
        5056,
        5055,
        5053,
        5051,
        5039,
        5037,
        5036,
        5034,
        5032,
        5029,
        5025,
        5016,
        4987,
        4983,
        4982,
        4981,
        4979,
        4978,
        4976,
        4972,
        4963,
        4956,
        4952,
        4950,
        4949,
        4936,
        4930,
        4929,
        4922,
        4917,
        4913,
        4909,
        4903,
        4900,
        4885,
        4884,
        4878,
        4877,
        4872,
        4863,
        4859,
        4858,
        4857,
        4848,
        4847,
        4846,
        4839,
        4838,
        4837,
        4836,
        4835,
        4834,
        4833,
        4832,
        4828,
        4823,
        4819,
        4818,
        4816,
        4815,
        4811,
        4800,
        4795,
        4782,
        4778,
        4776,
        4775,
        4769,
        4761,
        4755,
        4753,
        4750,
        4749,
        4735,
        4730,
        4728,
        4727,
        4723,
        4719,
        4710,
        4709,
        4708,
        4707,
        4703,
        4699,
        4697,
        4695,
        4684,
        4683,
        4682,
        4674,
        4657,
        4655,
        4640,
        4632,
        4617,
        4610,
        4608,
        4605,
        4599,
        4598,
        4592,
        4585,
        4581,
        4578,
        4576,
        4575,
        4574,
        4571,
        4569,
        4562,
        4560,
        4555,
        4551,
        4550,
        4547,
        4531,
        4524,
        4523,
        4518,
        4515,
        4514,
        4513,
        4509,
        4508,
        4507,
        4498,
        4491,
        4490,
        4489,
        4486,
        4485,
        4480,
        4479,
        4474,
        4473,
        4468,
        4467,
        4465,
        4458,
        4456,
        4455,
        4445,
        4444,
        4435,
        4433,
        4432,
        4431,
        4427,
        4424,
        4423,
        4422,
        4418,
        4414,
        4410,
        4409,
        4398,
        4394,
        4392,
        4383,
        4382,
        4379,
        4377,
        4376,
        4366,
        4362,
        4361,
        4355,
        4351,
        4339,
        4338,
        4335,
        4334,
        4331,
        4328,
        4314,
        4306,
        4305,
        4302,
        4296,
        4293,
        4292,
        4291,
        4283,
        4279,
        4276,
        4274,
        4272,
        4271,
        4267,
        4266,
        4256,
        4254,
        4252,
        4251,
        4249,
        4248,
        4239,
        4238,
        4233,
        4226,
        4223,
        4222,
        4220,
        4217,
        4216,
        4215,
        4203,
        4202,
        4200,
        4196,
        4195,
        4194,
        4191,
        4187,
        4183,
        4180,
        4179,
        4177,
        4175,
        4170,
        4166,
        4163,
        4157,
        4156,
        4154,
        4153,
        4149,
        4148,
        4147,
        4145,
        4140,
        4133,
        4132,
        4130,
        4128,
        4127,
        4117,
        4116,
        4115,
        4114,
        4113,
        4107,
        4106,
        4118,
        4101,
        4100,
        4097,
        4096,
        4092,
        4087,
        4080,
        4079,
        4061,
        4059,
        4058,
        4050,
        4047,
        4044,
        4031,
        4030,
        4028,
        4023,
        4022,
        4018,
        4017,
        4014,
        4011,
        4010,
        4009,
        4005,
        4004,
        4002,
        4001,
        4000,
        3998,
        3996,
        3989,
        3982,
        3976,
        3974,
        3972,
        3971,
        3969,
        3968,
        3967,
        3966,
        3965,
        3964,
        3960,
        3957,
        3956,
        3955,
        3953,
        3951,
        3950,
        3935,
        3932,
        3931,
        3927,
        3924,
        3922,
        3920,
        3915,
        3910,
        3909,
        3907,
        3906,
        3904,
        3901,
        3898,
        3895,
        3877,
        3876,
        3874,
        3870,
        3860,
        3858,
        3856,
        3854,
        3851,
        3848,
        3847,
        3846,
        3844,
        3843,
        3838,
        3835,
        3834,
        3833,
        3825,
        3822,
        3817,
        3816,
        3814,
        3810,
        3806,
        3798,
        3796,
        3794,
        3793,
        3791,
        3790,
        3786,
        3785,
        3784,
        3782,
        3781,
        3780,
        3774,
        3773,
        3772,
        3770,
        3765,
        3760,
        3758,
        3742,
        3740,
        3738,
        3736,
        3735,
        3733,
        3729,
        3725,
        3721,
        3720,
        3719,
        3718,
        3714,
        3713,
        3705,
        3700,
        3699,
        3698,
        3696,
        3691,
        3690,
        3686,
        3685,
        3684,
        3683,
        3680,
        3679,
        3676,
        3674,
        3672,
        3669,
        3668,
        3666,
        3665,
        3664,
        3663,
        3662,
        3660,
        3659,
        3658,
        3656,
        3653,
        3651,
        3650,
        3647,
        3643,
        3641,
        3640,
        3639,
        3629,
        3628,
        3623,
        3622,
        3621,
        3620,
        3619,
        3617,
        3614,
        3611,
        3609,
        3608,
        3606,
        3605,
        3604,
        3601,
        3598,
        3595,
        3594,
        3593,
        3591,
        3589,
        3584,
        3583,
        3582,
        3581,
        3580,
        3578,
        3573,
        3572,
        3571,
        3564,
        3563,
        3561,
        3554,
        3552,
        3550,
        3548,
        3547,
        3545,
        3543,
        3539,
        3538,
        3535,
        3522,
        3518,
        3514,
        3513,
        3508,
        3507,
        3506,
        3502,
        3498,
        3496,
        3495,
        3493,
        3492,
        3488,
        3486,
        3484,
        3483,
        3482,
        3481,
        3479,
        3478,
        3476,
        3475,
        3469,
        3467,
        3465,
        3464,
        3459,
        3455,
        3454,
        3453,
        3452,
        3449,
        3448,
        3447,
        3444,
        3442,
        3439,
        3438,
        3435,
        3433,
        3431,
        3429,
        3428,
        3425,
        3423,
        3419,
        3415,
        3414,
        3410,
        3409,
        3406,
        3405,
        3400,
        3399,
        3397,
        3391,
        3390,
        3389,
        3386,
        3383,
        3382,
        3379,
        3378,
        3376,
        3375,
        3374,
        3365,
        3361,
        3359,
        3358,
        3354,
        3353,
        3351,
        3347,
        3343,
        3331,
        3330,
        3328,
        3326,
        3325,
        3323,
        3321,
        3319,
        3318,
        3316,
        3315,
        3312,
        3289,
        3286,
        3281,
        3280,
        3276,
        3263,
        3254,
        3248,
        3247,
        3245,
        3242,
        3241,
        3238,
        3235,
        3234,
        3232,
        3224,
        3223,
        3219,
        3218,
        3216,
        3215,
        3209,
        3208,
        3206,
        3202,
        3201,
        3198,
        3197,
        3190,
        3189,
        3188,
        3184,
        3182,
        3180,
        3177,
        3172,
        3163,
        3161,
        3158,
        3154,
        3145,
        3136,
        3134,
        3132,
        3131,
        3129,
        3128,
        3124,
        3122,
        3120,
        3119,
        3117,
        3114,
        3099,
        3098,
        3095,
        3093,
        3092,
        3090,
        3089,
        3088,
        3084,
        3080,
        3079,
        3078,
        3073,
        3069,
        3066,
        3057,
        3056,
        3055,
        3054,
        3051,
        3049,
        3048,
        3046,
        3040,
        3038,
        3037,
        3036,
        3035,
        3034,
        3033,
        3030,
        3026,
        3025,
        3023,
        3021,
        3019,
        3018,
        3017,
        3016,
        3015,
        3012,
        3011,
        3009,
        3008,
        3006,
        3003,
        2999,
        2997,
        2994,
        2993,
        2991,
        2985,
        2984,
        2983,
        2982,
        2980,
        2976,
        2970,
        2968,
        2967,
        2966,
        2964,
        2952,
        2951,
        2944,
        2937,
        2936,
        2930,
        2929,
        2925,
        2923,
        2921,
        2917,
        2916,
        2913,
        2912,
        2911,
        2910,
        2906,
        2905,
        2904,
        2903,
        2902,
        2901,
        2897,
        2896,
        2895,
        2894,
        2892,
        2889,
        2888,
        2887,
        2886,
        2882,
        2881,
        2877,
        2873,
        2871,
        2867,
        2864,
        2863,
        2859,
        2858,
        2857,
        2856,
        2855,
        2852,
        2849,
        2848,
        2847,
        2846,
        2844,
        2840,
        2839,
        2831,
        2830,
        2826,
        2825,
        2824,
        2823,
        2821,
        2820,
        2819,
        2818,
        2817,
        2816,
        2815,
        2807,
        2799,
        2795,
        2794,
        2793,
        2791,
        2790,
        2789,
        2784,
        2782,
        2781,
        2779,
        2778,
        2777,
        2775,
        2774,
        2773,
        2771,
        2770,
        2759,
        2758,
        2757,
        2750,
        2745,
        2744,
        2743,
        2740,
        2733,
        2731,
        2725,
        2724,
        2722,
        2721,
        2717,
        2716,
        2715,
        2712,
        2710,
        2706,
        2704,
        2694,
        2693,
        2690,
        2687,
        2685,
        2684,
        2680,
        2677,
        2676,
        2673,
        2671,
        2670,
        2669,
        2667,
        2663,
        2661,
        2660,
        2659,
        2656,
        2655,
        2654,
        2653,
        2652,
        2650,
        2649,
        2648,
        2646,
        2645,
        2642,
        2638,
        2636,
        2630,
        2629,
        2623,
        2616,
        2614,
        2611,
        2609,
        2608,
        2607,
        2605,
        2602,
        2598,
        2597,
        2596,
        2592,
        2590,
        2587,
        2585,
        2581,
        2580,
        2579,
        2576,
        2575,
        2570,
        2568,
        2567,
        2566,
        2565,
        2557,
        2556,
        2551,
        2550,
        2549,
        2546,
        2542,
        2540,
        2537,
        2536,
        2530,
        2528,
        2524,
        2523,
        2522,
        2521,
        2513,
        2512,
        2511,
        2509,
        2508,
        2506,
        2504,
        2503,
        2500,
        2488,
        2486,
        2480,
        2479,
        2474,
        2462,
        2459,
        2457,
        2455,
        2454,
        2452,
        2450,
        2448,
        2444,
        2442,
        2434,
        2432,
        2431,
        2430,
        2427,
        2424,
        2422,
        2421,
        2414,
        2413,
        2409,
        2408,
        2406,
        2402,
        2398,
        2397,
        2396,
        2395,
        2394,
        2393,
        2386,
        2385,
        2383,
        2374,
        2373,
        2371,
        2367,
        2366,
        2364,
        2361,
        2359,
        2358,
        2353,
        2350,
        2346,
        2345,
        2344,
        2342,
        2341,
        2339,
        2333,
        2330,
        2328,
        2327,
        2324,
        2323,
        2322,
        2321,
        2320,
        2316,
        2314,
        2308,
        2302,
        2299,
        2297,
        2296,
        2293,
        2292,
        2291,
        2286,
        2285,
        2283,
        2282,
        2279,
        2278,
        2277,
        2274,
        2272,
        2271,
        2268,
        2260,
        2252,
        2247,
        2246,
        2244,
        2242,
        2239,
        2238,
        2237,
        2236,
        2233,
        2230,
        2229,
        2226,
        2224,
        2217,
        2216,
        2215,
        2213,
        2212,
        2211,
        2200,
        2199,
        2198,
        2193,
        2188,
        2185,
        2181,
        2179,
        2178,
        2177,
        2175,
        2174,
        2173,
        2168,
        2167,
        2165,
        2162,
        2161,
        2149,
        2147,
        2146,
        2145,
        2143,
        2140,
        2139,
        2138,
        2137,
        2133,
        2130,
        2129,
        2128,
        2127,
        2124,
        2123,
        2122,
        2121,
        2120,
        2119,
        2118,
        2117,
        2115,
        2114,
        2112,
        2109,
        2104,
        2101,
        2099,
        2093,
        2091,
        2086,
        2081,
        2079,
        2076,
        2075,
        2072,
        2070,
        2068,
        2067,
        2057,
        2044,
        2042,
        2040,
        2037,
        2023,
        2016,
        2013,
        2008,
        2001,
        2000,
        1999,
        1987,
        1986,
        1985,
        1981,
        1973,
        1971,
        1963,
        1956,
        1953,
        1951,
        1950,
        1945,
        1940,
        1937,
        1935,
        1934,
        1928,
        1927,
        1926,
        1925,
        1924,
        1921,
        1919,
        1917,
        1916,
        1912,
        1909,
        1907,
        1903,
        1902,
        1901,
        1900,
        1895,
        1894,
        1892,
        1891,
        1889,
        1885,
        1883,
        1882,
        1879,
        1870,
        1866,
        1865,
        1864,
        1863,
        1862,
        1860,
        1859,
        1858,
        1857,
        1855,
        1853,
        1852,
        1849,
        1847,
        1845,
        1844,
        1842,
        1841,
        1840,
        1837,
        1836,
        1835,
        1833,
        1832,
        1825,
        1822,
        1821,
        1819,
        1818,
        1817,
        1813,
        1810,
        1809,
        1806,
        1802,
        1800,
        1798,
        1797,
        1796,
        1793,
        1790,
        1789,
        1788,
        1783,
        1782,
        1781,
        1779,
        1776,
        1772,
        1768,
        1766,
        1763,
        1762,
        1760,
        1755,
        1754,
        1752,
        1742,
        1741,
        1738,
        1736,
        1733,
        1732,
        1731,
        1729,
        1726,
        1723,
        1722,
        1721,
        1712,
        1708,
        1707,
        1706,
        1703,
        1702,
        1701,
        1700,
        1699,
        1695,
        1692,
        1691,
        1690,
        1689,
        1684,
        1683,
        1682,
        1681,
        1678,
        1676,
        1675,
        1670,
        1669,
        1667,
        1664,
        1663,
        1662,
        1661,
        1660,
        1659,
        1655,
        1653,
        1652,
        1651,
        1650,
        1645,
        1644,
        1642,
        1641,
        1639,
        1638,
        1636,
        1635,
        1634,
        1629,
        1627,
        1626,
        1625,
        1623,
        1622,
        1621,
        1619,
        1618,
        1617,
        1616,
        1615,
        1614,
        1613,
        1612,
        1611,
        1610,
        1605,
        1602,
        1600,
        1599,
        1598,
        1597,
        1595,
        1593,
        1590,
        1588,
        1587,
        1586,
        1585,
        1584,
        1583,
        1582,
        1580,
        1578,
        1577,
        1574,
        1572,
        1570,
        1569,
        1567,
        1563,
        1562,
        1561,
        1559,
        1558,
        1555,
        1548,
        1546,
        1545,
        1543,
        1541,
        1540,
        1536,
        1535,
        1534,
        1533,
        1528,
        1527,
        1522,
        1521,
        1520,
        1519,
        1515,
        1511,
        1508,
        1506,
        1497,
        1496,
        1495,
        1494,
        1492,
        1491,
        1490,
        1489,
        1488,
        1486,
        1478,
        1475,
        1466,
        1463,
        1462,
        1461,
        1458,
        1457,
        1456,
        1452,
        1448,
        1445,
        1443,
        1442,
        1440,
        1437,
        1432,
        1431,
        1428,
        1427,
        1426,
        1425,
        1419,
        1417,
        1415,
        1414,
        1413,
        1410,
        1409,
        1406,
        1404,
        1403,
        1401,
        1400,
        1399,
        1398,
        1397,
        1396,
        1395,
        1394,
        1391,
        1389,
        1386,
        1384,
        1381,
        1379,
        1377,
        1375,
        1374,
        1372,
        1371,
        1370,
        1368,
        1367,
        1366,
        1364,
        1361,
        1360,
        1359,
        1358,
        1357,
        1355,
        1353,
        1351,
        1347,
        1345,
        1343,
        1341,
        1337,
        1335,
        1334,
        1333,
        1329,
        1328,
        1318,
        1307,
        1302,
        1301,
        1298,
        1294,
        1292,
        1291,
        1282,
        1277,
        1276,
        1274,
        1272,
        1271,
        1269,
        1268,
        1266,
        1265,
        1262,
        1259,
        1256,
        1251,
        1250,
        1249,
        1248,
        1242,
        1241,
        1240,
        1238,
        1237,
        1234,
        1231,
        1229,
        1227,
        1226,
        1225,
        1224,
        1219,
        1218,
        1217,
        1216,
        1214,
        1213,
        1210,
        1209,
        1202,
        1187,
        1185,
        1180,
        1179,
        1168,
        1166,
        1165,
        1164,
        1163,
        1162,
        1161,
        1158,
        1143,
        1140,
        1137,
        1136,
        1131,
        1126,
        1124,
        1120,
        1118,
        1114,
        1110,
        1104,
        1103,
        1102,
        1099,
        1098,
        1094,
        1093,
        1092,
        1090,
        1087,
        1086,
        1085,
        1083,
        1080,
        1078,
        1077,
        1073,
        1072,
        1071,
        1070,
        1069,
        1068,
        1065,
        1063,
        1061,
        1046,
        1035,
        1034,
        1032,
        1031,
        1027,
        1024,
        1016,
        1009,
        1003,
        987,
        982,
        970,
        963,
        954,
        935,
        934,
        932,
        930,
        922,
        913,
        910,
        908,
        903,
        898,
        895,
        893,
        884,
        883,
        880,
        877,
        868,
        867,
        865,
        864,
        858,
        851,
        848,
        843,
        841,
        840,
        837,
        835,
        834,
        833,
        830,
        829,
        826,
        822,
        820,
        819,
        818,
        815,
        812,
        805,
        799,
        796,
        795,
        794,
        789,
        783,
        782,
        779,
        768,
        765,
        763,
        761,
        759,
        757,
        752,
        750,
        748,
        747,
        742,
        739,
        738,
        733,
        732,
        728,
        727,
        722,
        721,
        720,
        718,
        707,
        702,
        701,
        700,
        699,
        686,
        681,
        673,
        668,
        664,
        663,
        661,
        656,
        648,
        644,
        643,
        638,
        632,
        628,
        627,
        620,
        613,
        612,
        606,
        605,
        602,
        596,
        593,
        592,
        586,
        585,
        583,
        581,
        579,
        574,
        573,
        572,
        562,
        561,
        559,
        558,
        557,
        555,
        554,
        551,
        550,
        549,
        548,
        547,
        546,
        545,
        543,
        542,
        540,
        538,
        537,
        536,
        535,
        534,
        533,
        532,
        531,
        530,
        529,
        528,
        526,
        525,
        522,
        517,
        515,
        512,
        511,
        510,
        508,
        507,
        506,
        505,
        503,
        501,
        499,
        497,
        496,
        495,
        494,
        493,
        490,
        489,
        487,
        485,
        483,
        482,
        481,
        480,
        479,
        475,
        473,
        470,
        468,
        466,
        464,
        463,
        457,
        453,
        452,
        451,
        448,
        447,
        442,
        440,
        439,
        432,
        429,
        425,
        424,
        422,
        421,
        419,
        415,
        414,
        408,
        406,
        401,
        400,
        395,
        394,
        393,
        392,
        390,
        389,
        384,
        382,
        381,
        377,
        376,
        374,
        373,
        362,
        353,
        351,
        350,
        349,
        347,
        344,
        342,
        341,
        340,
        339,
        338,
        336,
        331,
        330,
        327,
        320,
        317,
        315,
        314,
        313,
        312,
        306,
        301,
        300,
        298,
        297,
        294,
        285,
        284,
        278,
        277,
        276,
        275,
        272,
        270,
        265,
        263,
        260,
        255,
        252,
        249,
        245,
        244,
        242,
        241,
        235,
        226,
        225,
        224,
        222,
        209,
        206,
        189,
        187,
        186,
        185,
        184,
        180,
        177,
        174,
        169,
        163,
        161,
        158,
        156,
        155,
        154,
        153,
        150,
        147,
        146,
        138,
        134,
        132,
        130,
        129,
        128,
        122,
        119,
        118,
        116,
        114,
        113,
        112,
        111,
        109,
        102,
        100,
        91,
        89,
        88,
        87,
        82,
        79,
        78,
        77,
        73,
        72,
        70,
        66,
        65,
        64,
        44,
        42,
        41,
        40,
        37,
        31,
        30,
        29,
        28,
        24,
        23,
        22,
        21,
        20,
        18,
        16,
        14,
        13,
        12,
        11,
        10,
        9,
        8,
        7,
        6,
        5,
        4,
        2,
        1
    ],
    "finished": true
}