{
    "all_issues": 1105,
    "interesting_issues": 1,
    "last_update": "2023-11-01 15:13:15.213008",
    "license": {
        "download": "https://raw.githubusercontent.com/lh3/minimap2/master/LICENSE.txt",
        "name": "Other"
    },
    "ratio": 0.0009049773755656109,
    "size": 1646,
    "stars": 1552,
    "url": "https://github.com/lh3/minimap2"
}