{
    "covered_issues": [
        225,
        222,
        216,
        208,
        205,
        197,
        195,
        194,
        193,
        188,
        186,
        185,
        179,
        176,
        174,
        171,
        166,
        165,
        159,
        156,
        151,
        149,
        147,
        146,
        144,
        140,
        139,
        122,
        121,
        113,
        108,
        92,
        84,
        78,
        77,
        76,
        69,
        66,
        63,
        61,
        57,
        56,
        48,
        47,
        43,
        35,
        32,
        19,
        18
    ],
    "finished": true
}