{
    "commits": [
        {
            "associated_pull_request": [],
            "date": "2017-03-09 15:16:01+00:00",
            "diff": "radareorg_radare2/issue_6937/commit_1ee05fac79bda59d9540189837b171d4b5278b5a.diff",
            "diff_additions": 1,
            "diff_deletions": 1,
            "diff_file_size": 19195,
            "diff_url": "https://github.com/radareorg/radare2/commit/1ee05fac79bda59d9540189837b171d4b5278b5a.diff",
            "exists": true,
            "files": [
                {
                    "file_additions": 1,
                    "file_deletions": 1,
                    "file_exists": true,
                    "file_name": "libr/core/pseudo.c",
                    "file_size": 19195
                }
            ],
            "interesting": {
                "reopen": false,
                "status": false
            },
            "is_parent": true,
            "sha": "1ee05fac79bda59d9540189837b171d4b5278b5a"
        },
        {
            "associated_pull_request": [],
            "date": "2017-03-09 15:54:31+00:00",
            "diff": "radareorg_radare2/issue_6937/commit_36ade4b7e77c21033fab41386dc74657b8e34845.diff",
            "diff_additions": 3,
            "diff_deletions": 12,
            "diff_file_size": 218265,
            "diff_url": "https://github.com/radareorg/radare2/commit/36ade4b7e77c21033fab41386dc74657b8e34845.diff",
            "exists": true,
            "files": [
                {
                    "file_additions": 3,
                    "file_deletions": 12,
                    "file_exists": true,
                    "file_name": "libr/core/disasm.c",
                    "file_size": 218265
                }
            ],
            "interesting": {
                "reopen": true,
                "status": false
            },
            "is_parent": false,
            "sha": "36ade4b7e77c21033fab41386dc74657b8e34845"
        },
        {
            "associated_pull_request": [],
            "date": "2017-03-10 00:03:58+00:00",
            "diff": "radareorg_radare2/issue_6937/commit_cbb5bc9f5efe8c73c2f83519eb8fd8a0ef09ed37.diff",
            "diff_additions": 5,
            "diff_deletions": 1,
            "diff_file_size": 183387,
            "diff_url": "https://github.com/radareorg/radare2/commit/cbb5bc9f5efe8c73c2f83519eb8fd8a0ef09ed37.diff",
            "exists": true,
            "files": [
                {
                    "file_additions": 5,
                    "file_deletions": 1,
                    "file_exists": true,
                    "file_name": "libr/core/canal.c",
                    "file_size": 183387
                }
            ],
            "interesting": {
                "reopen": false,
                "status": false
            },
            "is_parent": false,
            "sha": "cbb5bc9f5efe8c73c2f83519eb8fd8a0ef09ed37"
        },
        {
            "associated_pull_request": [],
            "date": "2017-03-10 00:03:58+00:00",
            "diff": "radareorg_radare2/issue_6937/commit_c9df405a8f43ef0f8628d605dd5f703126e8207e.diff",
            "diff_additions": 5,
            "diff_deletions": 1,
            "diff_file_size": 183387,
            "diff_url": "https://github.com/radareorg/radare2/commit/c9df405a8f43ef0f8628d605dd5f703126e8207e.diff",
            "exists": true,
            "files": [
                {
                    "file_additions": 5,
                    "file_deletions": 1,
                    "file_exists": true,
                    "file_name": "libr/core/canal.c",
                    "file_size": 183387
                }
            ],
            "interesting": {
                "reopen": false,
                "status": false
            },
            "is_parent": false,
            "sha": "c9df405a8f43ef0f8628d605dd5f703126e8207e"
        }
    ],
    "first_commit": "2017-03-09 15:16:01+00:00",
    "last_commit": "2017-03-10 09:27:59+00:00",
    "number": 6937,
    "pull_request": "None",
    "score": {
        "accidental_reopen_likely": false,
        "all_labels": [],
        "contains_keywords": [
            "confirm",
            "work",
            "chang",
            "fix",
            "issu",
            "test",
            "fault",
            "bug",
            "error",
            "problem",
            "crash",
            "report"
        ],
        "fix_size": 19,
        "has_labels": [],
        "intersecting": {
            "computed_score": 1.0,
            "final_commit_size": 6,
            "intersection_size": 6,
            "previous_commits_size": 19
        },
        "is_makefile_based": true,
        "no_new_files": [],
        "no_other_files": true,
        "num_prohibited_files": 20116,
        "prohibited_files": [
            "server/src/main/java/com/genymobile/scrcpy/Device.java",
            "server/src/main/java/com/genymobile/scrcpy/wrappers/SurfaceControl.java",
            "server/src/main/java/com/genymobile/scrcpy/Device.java",
            "server/src/main/java/com/genymobile/scrcpy/wrappers/SurfaceControl.java",
            "app/meson.build",
            "app/scrcpy.1",
            "app/src/common.h",
            "app/src/scrcpy.h",
            "app/src/server.h",
            "server/src/main/java/com/genymobile/scrcpy/Workarounds.java"
        ],
        "reopen": true,
        "reopen_events": [
            [
                "2017-03-09 15:55:11+00:00",
                "closed"
            ],
            [
                "2017-03-09 15:55:11+00:00",
                "commit"
            ],
            [
                "2017-03-09 18:29:25+00:00",
                "reopened"
            ],
            [
                "2017-03-10 00:04:05+00:00",
                "closed"
            ],
            [
                "2017-03-10 00:04:05+00:00",
                "commit"
            ],
            [
                "2017-03-10 09:28:24+00:00",
                "commit"
            ]
        ],
        "status": false,
        "strategy": true,
        "total_changes": 29
    }
}