{
    "all_issues": 528,
    "interesting_issues": 1,
    "last_update": "2023-10-27 00:57:42.632870",
    "license": {
        "download": "https://raw.githubusercontent.com/karlstav/cava/master/LICENSE",
        "name": "MIT License"
    },
    "ratio": 0.001893939393939394,
    "size": 1292,
    "stars": 3442,
    "url": "https://github.com/karlstav/cava"
}