{
    "commits": [
        {
            "associated_pull_request": [],
            "date": "2021-08-16 08:08:17+00:00",
            "diff": "opensips_opensips/issue_2584/commit_b9f68a4dee97df3a42a4f86f82bf6c03b2e053dc.diff",
            "diff_additions": 83,
            "diff_deletions": 21,
            "diff_file_size": 62170,
            "diff_url": "https://github.com/OpenSIPS/opensips/commit/b9f68a4dee97df3a42a4f86f82bf6c03b2e053dc.diff",
            "exists": true,
            "files": [
                {
                    "file_additions": 83,
                    "file_deletions": 21,
                    "file_exists": true,
                    "file_name": "modules/stir_shaken/stir_shaken.c",
                    "file_size": 62170
                }
            ],
            "interesting": {
                "reopen": false,
                "status": false
            },
            "is_parent": true,
            "sha": "b9f68a4dee97df3a42a4f86f82bf6c03b2e053dc"
        },
        {
            "associated_pull_request": [],
            "date": "2021-08-16 10:52:13+00:00",
            "diff": "opensips_opensips/issue_2584/commit_4c3150e461c31c29908a7ddd20e550bbfcbb69e3.diff",
            "diff_additions": 30,
            "diff_deletions": 4,
            "diff_file_size": 13369,
            "diff_url": "https://github.com/OpenSIPS/opensips/commit/4c3150e461c31c29908a7ddd20e550bbfcbb69e3.diff",
            "exists": true,
            "files": [
                {
                    "file_additions": 30,
                    "file_deletions": 4,
                    "file_exists": true,
                    "file_name": "cfg_reload.c",
                    "file_size": 13369
                }
            ],
            "interesting": {
                "reopen": true,
                "status": false
            },
            "is_parent": false,
            "sha": "4c3150e461c31c29908a7ddd20e550bbfcbb69e3"
        },
        {
            "associated_pull_request": [],
            "date": "2022-01-04 12:12:20+00:00",
            "diff": "opensips_opensips/issue_2584/commit_e85072cd6e9f54d0a593449b87e492c488393301.diff",
            "diff_additions": 3,
            "diff_deletions": 2,
            "diff_file_size": 13369,
            "diff_url": "https://github.com/OpenSIPS/opensips/commit/e85072cd6e9f54d0a593449b87e492c488393301.diff",
            "exists": true,
            "files": [
                {
                    "file_additions": 3,
                    "file_deletions": 2,
                    "file_exists": true,
                    "file_name": "cfg_reload.c",
                    "file_size": 13369
                }
            ],
            "interesting": {
                "reopen": false,
                "status": false
            },
            "is_parent": false,
            "sha": "e85072cd6e9f54d0a593449b87e492c488393301"
        },
        {
            "associated_pull_request": [],
            "date": "2022-01-04 12:12:20+00:00",
            "diff": "opensips_opensips/issue_2584/commit_cb813ba24e54cd0ed309fe158acb5a0f4a7f318a.diff",
            "diff_additions": 10,
            "diff_deletions": 4,
            "diff_file_size": 13369,
            "diff_url": "https://github.com/OpenSIPS/opensips/commit/cb813ba24e54cd0ed309fe158acb5a0f4a7f318a.diff",
            "exists": true,
            "files": [
                {
                    "file_additions": 10,
                    "file_deletions": 4,
                    "file_exists": true,
                    "file_name": "cfg_reload.c",
                    "file_size": 13369
                }
            ],
            "interesting": {
                "reopen": true,
                "status": false
            },
            "is_parent": false,
            "sha": "cb813ba24e54cd0ed309fe158acb5a0f4a7f318a"
        },
        {
            "associated_pull_request": [
                "https://github.com/naveenecosmob/opensips/pull/1",
                "https://github.com/naveenecosmob/opensips/pull/5"
            ],
            "date": "2022-01-04 12:12:20+00:00",
            "diff": "opensips_opensips/issue_2584/commit_3b9112a8b993548ed5c1fefb138b20aa054c90cb.diff",
            "diff_additions": 3,
            "diff_deletions": 2,
            "diff_file_size": 13369,
            "diff_url": "https://github.com/OpenSIPS/opensips/commit/3b9112a8b993548ed5c1fefb138b20aa054c90cb.diff",
            "exists": true,
            "files": [
                {
                    "file_additions": 3,
                    "file_deletions": 2,
                    "file_exists": true,
                    "file_name": "cfg_reload.c",
                    "file_size": 13369
                }
            ],
            "interesting": {
                "reopen": false,
                "status": false
            },
            "is_parent": false,
            "sha": "3b9112a8b993548ed5c1fefb138b20aa054c90cb"
        }
    ],
    "first_commit": "2021-08-16 08:08:17+00:00",
    "last_commit": "2022-01-04 12:16:17+00:00",
    "number": 2584,
    "pull_request": "None",
    "score": {
        "accidental_reopen_likely": false,
        "all_labels": [
            "bug",
            "fixed"
        ],
        "contains_keywords": [
            "confirm",
            "work",
            "fail",
            "chang",
            "fix",
            "issu",
            "patch",
            "debug",
            "test",
            "bug",
            "error",
            "report"
        ],
        "fix_size": 32,
        "has_labels": [
            "bug"
        ],
        "intersecting": {
            "computed_score": 1.0,
            "final_commit_size": 6,
            "intersection_size": 6,
            "previous_commits_size": 32
        },
        "is_makefile_based": true,
        "no_new_files": [],
        "no_other_files": false,
        "num_prohibited_files": 311874,
        "prohibited_files": [
            "server/src/main/java/com/genymobile/scrcpy/Device.java",
            "server/src/main/java/com/genymobile/scrcpy/wrappers/SurfaceControl.java",
            "server/src/main/java/com/genymobile/scrcpy/Device.java",
            "server/src/main/java/com/genymobile/scrcpy/wrappers/SurfaceControl.java",
            "app/meson.build",
            "app/scrcpy.1",
            "app/src/common.h",
            "app/src/scrcpy.h",
            "app/src/server.h",
            "server/src/main/java/com/genymobile/scrcpy/Workarounds.java"
        ],
        "reopen": true,
        "reopen_events": [
            [
                "2021-08-16 10:55:52+00:00",
                "closed"
            ],
            [
                "2021-08-16 10:55:52+00:00",
                "commit"
            ],
            [
                "2021-08-16 11:00:49+00:00",
                "reopened"
            ],
            [
                "2021-08-16 11:29:27+00:00",
                "commit"
            ],
            [
                "2022-01-04 12:14:57+00:00",
                "closed"
            ],
            [
                "2022-01-04 12:14:57+00:00",
                "commit"
            ],
            [
                "2022-01-04 12:21:32+00:00",
                "commit"
            ],
            [
                "2022-01-04 12:22:28+00:00",
                "reopened"
            ],
            [
                "2022-01-04 12:30:50+00:00",
                "commit"
            ],
            [
                "2022-01-19 08:35:40+00:00",
                "closed"
            ]
        ],
        "status": false,
        "strategy": true,
        "total_changes": 162
    }
}