{
    "commits": [
        {
            "associated_pull_request": [],
            "date": "2017-09-27 01:35:09+00:00",
            "diff": "",
            "diff_additions": 0,
            "diff_deletions": 0,
            "diff_file_size": 0,
            "diff_url": "https://github.com/radareorg/radare2/commit/c70800d12f76c905989c0ee82dac62c25a658f3f.diff",
            "exists": true,
            "files": [],
            "interesting": {
                "reopen": false,
                "status": false
            },
            "is_parent": true,
            "sha": "c70800d12f76c905989c0ee82dac62c25a658f3f"
        },
        {
            "associated_pull_request": [],
            "date": "2017-09-27 01:39:22+00:00",
            "diff": "radareorg_radare2/issue_8590/commit_3326b933ddbc922904e44078d342607e8448125a.diff",
            "diff_additions": 2,
            "diff_deletions": 2,
            "diff_file_size": 0,
            "diff_url": "https://github.com/radareorg/radare2/commit/3326b933ddbc922904e44078d342607e8448125a.diff",
            "exists": true,
            "files": [
                {
                    "file_additions": 2,
                    "file_deletions": 2,
                    "file_exists": false,
                    "file_name": "libr/asm/p/asm_dalvik.c",
                    "file_size": 0
                }
            ],
            "interesting": {
                "reopen": true,
                "status": false
            },
            "is_parent": false,
            "sha": "3326b933ddbc922904e44078d342607e8448125a"
        },
        {
            "associated_pull_request": [],
            "date": "2017-09-29 10:51:09+00:00",
            "diff": "radareorg_radare2/issue_8590/commit_aa7989de888b98fc7577713b12a9b0056dec24f4.diff",
            "diff_additions": 1,
            "diff_deletions": 1,
            "diff_file_size": 0,
            "diff_url": "https://github.com/radareorg/radare2/commit/aa7989de888b98fc7577713b12a9b0056dec24f4.diff",
            "exists": true,
            "files": [
                {
                    "file_additions": 1,
                    "file_deletions": 1,
                    "file_exists": false,
                    "file_name": "libr/asm/p/asm_dalvik.c",
                    "file_size": 0
                }
            ],
            "interesting": {
                "reopen": false,
                "status": false
            },
            "is_parent": false,
            "sha": "aa7989de888b98fc7577713b12a9b0056dec24f4"
        }
    ],
    "first_commit": "2017-09-27 01:35:09+00:00",
    "last_commit": "2017-09-29 10:51:09+00:00",
    "number": 8590,
    "pull_request": "None",
    "score": {
        "accidental_reopen_likely": false,
        "all_labels": [
            "RAsm-Disassembler",
            "Android"
        ],
        "contains_keywords": [
            "confirm",
            "work",
            "fix",
            "issu",
            "test",
            "error",
            "problem"
        ],
        "fix_size": 3,
        "has_labels": [],
        "intersecting": {
            "computed_score": 1.0,
            "final_commit_size": 2,
            "intersection_size": 2,
            "previous_commits_size": 3
        },
        "is_makefile_based": true,
        "no_new_files": [],
        "no_other_files": true,
        "num_prohibited_files": 10046,
        "prohibited_files": [
            "server/src/main/java/com/genymobile/scrcpy/Device.java",
            "server/src/main/java/com/genymobile/scrcpy/wrappers/SurfaceControl.java",
            "server/src/main/java/com/genymobile/scrcpy/Device.java",
            "server/src/main/java/com/genymobile/scrcpy/wrappers/SurfaceControl.java",
            "app/meson.build",
            "app/scrcpy.1",
            "app/src/common.h",
            "app/src/scrcpy.h",
            "app/src/server.h",
            "server/src/main/java/com/genymobile/scrcpy/Workarounds.java"
        ],
        "reopen": true,
        "reopen_events": [
            [
                "2017-09-27 01:49:22+00:00",
                "closed"
            ],
            [
                "2017-09-27 01:49:22+00:00",
                "commit"
            ],
            [
                "2017-09-28 08:07:20+00:00",
                "reopened"
            ],
            [
                "2017-09-29 10:51:28+00:00",
                "commit"
            ],
            [
                "2017-09-29 11:08:08+00:00",
                "closed"
            ]
        ],
        "status": false,
        "strategy": true,
        "total_changes": 6
    }
}