{
    "category": [
        "memory",
        "GUI"
    ],
    "commits": [
        {
            "associated_pull_request": [
                "https://github.com/radareorg/radare2/pull/9504"
            ],
            "date": "2018-02-25 09:31:33",
            "diff": "radareorg_radare2/issue_9467/commit_2f76b33769db26057b2e79a205dce9aef0e4a53a.diff",
            "diff_additions": 13,
            "diff_deletions": 3,
            "diff_file_size": 42137,
            "diff_url": "https://github.com/radareorg/radare2/commit/2f76b33769db26057b2e79a205dce9aef0e4a53a.diff",
            "exists": true,
            "files": [
                {
                    "file_additions": 13,
                    "file_deletions": 3,
                    "file_exists": true,
                    "file_name": "libr/core/cmd_flag.c",
                    "file_size": 42137
                }
            ],
            "interesting": {
                "reopen": false,
                "status": false
            },
            "is_parent": true,
            "sha": "2f76b33769db26057b2e79a205dce9aef0e4a53a"
        },
        {
            "associated_pull_request": [
                "https://github.com/radareorg/radare2/pull/9519"
            ],
            "date": "2018-02-26 17:49:55",
            "diff": "radareorg_radare2/issue_9467/commit_4cb630a60221ab647bc04681f6a0fda3e793bdd3.diff",
            "diff_additions": 8,
            "diff_deletions": 0,
            "diff_file_size": 0,
            "diff_url": "https://github.com/radareorg/radare2/commit/4cb630a60221ab647bc04681f6a0fda3e793bdd3.diff",
            "exists": true,
            "files": [
                {
                    "file_additions": 8,
                    "file_deletions": 0,
                    "file_exists": false,
                    "file_name": "libr/core/graph.c",
                    "file_size": 0
                }
            ],
            "interesting": {
                "reopen": true,
                "status": true
            },
            "is_parent": false,
            "sha": "4cb630a60221ab647bc04681f6a0fda3e793bdd3"
        },
        {
            "associated_pull_request": [
                "https://github.com/radareorg/radare2/pull/9585"
            ],
            "date": "2018-03-04 23:35:53",
            "diff": "radareorg_radare2/issue_9467/commit_c2e6e0422f1d65192161f1368bc42c29191c9ab2.diff",
            "diff_additions": 0,
            "diff_deletions": 8,
            "diff_file_size": 0,
            "diff_url": "https://github.com/radareorg/radare2/commit/c2e6e0422f1d65192161f1368bc42c29191c9ab2.diff",
            "exists": true,
            "files": [
                {
                    "file_additions": 0,
                    "file_deletions": 8,
                    "file_exists": false,
                    "file_name": "libr/core/graph.c",
                    "file_size": 0
                }
            ],
            "interesting": {
                "reopen": false,
                "status": false
            },
            "is_parent": false,
            "sha": "c2e6e0422f1d65192161f1368bc42c29191c9ab2"
        }
    ],
    "first_commit": "2018-02-25 09:31:33",
    "last_commit": "2018-02-26 17:49:55",
    "number": 9467,
    "pull_request": "None",
    "score": {
        "accidental_reopen_likely": false,
        "all_labels": [
            "consoleui",
            "good first issue",
            "test-required"
        ],
        "contains_keywords": [
            "bug",
            "problem",
            "fix",
            "issu"
        ],
        "fix_size": 14,
        "has_labels": [],
        "intersecting": {
            "computed_score": 0.4444444444444444,
            "final_commit_size": 9,
            "intersection_size": 4,
            "previous_commits_size": 9
        },
        "is_makefile_based": true,
        "no_new_files": [],
        "no_other_files": true,
        "num_prohibited_files": 76050,
        "prohibited_files": [
            "hal/inc/pinmap_hal.h",
            "Debug/marvin.bin",
            "Debug/marvin.elf",
            "Debug/marvin.hex",
            "Debug/marvin.bin",
            "Debug/marvin.elf",
            "Debug/marvin.hex",
            "inc/spark_utilities.h",
            "Debug/marvin.bin",
            "Debug/marvin.elf"
        ],
        "reopen": true,
        "reopen_events": [
            [
                "2018-02-26 16:47:13",
                "commit"
            ],
            [
                "2018-02-26 17:50:00",
                "closed"
            ],
            [
                "2018-02-26 17:50:00",
                "commit"
            ],
            [
                "2018-03-03 11:02:30",
                "reopened"
            ],
            [
                "2018-03-04 23:36:17",
                "commit"
            ],
            [
                "2018-03-05 10:22:44",
                "closed"
            ],
            [
                "2019-07-01 16:15:09",
                "commit"
            ]
        ],
        "status": false,
        "strategy": true,
        "total_changes": 32
    }
}