{
    "commits": [
        {
            "diff": "elastic_elasticsearch/issue_36592/commit_e0023ce8e441fcb718b47757ba08476dc60e4ceb.diff",
            "diff_additions": 70,
            "diff_deletions": 43,
            "diff_file_size": 476006,
            "files": [
                {
                    "file_additions": 1,
                    "file_deletions": 1,
                    "file_exists": true,
                    "file_name": "x-pack/plugin/sql/src/main/java/org/elasticsearch/xpack/sql/parser/ExpressionBuilder.java",
                    "file_size": 40564
                },
                {
                    "file_additions": 4,
                    "file_deletions": 4,
                    "file_exists": true,
                    "file_name": "x-pack/plugin/sql/src/main/java/org/elasticsearch/xpack/sql/parser/SqlBaseBaseListener.java",
                    "file_size": 37173
                },
                {
                    "file_additions": 2,
                    "file_deletions": 2,
                    "file_exists": true,
                    "file_name": "x-pack/plugin/sql/src/main/java/org/elasticsearch/xpack/sql/parser/SqlBaseBaseVisitor.java",
                    "file_size": 27293
                },
                {
                    "file_additions": 8,
                    "file_deletions": 8,
                    "file_exists": true,
                    "file_name": "x-pack/plugin/sql/src/main/java/org/elasticsearch/xpack/sql/parser/SqlBaseListener.java",
                    "file_size": 43709
                },
                {
                    "file_additions": 15,
                    "file_deletions": 21,
                    "file_exists": true,
                    "file_name": "x-pack/plugin/sql/src/main/java/org/elasticsearch/xpack/sql/parser/SqlBaseParser.java",
                    "file_size": 274207
                },
                {
                    "file_additions": 4,
                    "file_deletions": 4,
                    "file_exists": true,
                    "file_name": "x-pack/plugin/sql/src/main/java/org/elasticsearch/xpack/sql/parser/SqlBaseVisitor.java",
                    "file_size": 25217
                },
                {
                    "file_additions": 31,
                    "file_deletions": 3,
                    "file_exists": true,
                    "file_name": "x-pack/plugin/sql/src/main/java/org/elasticsearch/xpack/sql/parser/SqlParser.java",
                    "file_size": 11224
                },
                {
                    "file_additions": 5,
                    "file_deletions": 0,
                    "file_exists": true,
                    "file_name": "x-pack/plugin/sql/src/test/java/org/elasticsearch/xpack/sql/parser/SqlParserTests.java",
                    "file_size": 16619
                }
            ],
            "interesting": {
                "reopened": false,
                "status": false
            },
            "sha": "e0023ce8e441fcb718b47757ba08476dc60e4ceb"
        },
        {
            "diff": "elastic_elasticsearch/issue_36592/commit_00bb58e2b4c51994b6f0d5ea6198cfc7bedfcac1.diff",
            "diff_additions": 107,
            "diff_deletions": 15,
            "diff_file_size": 342614,
            "files": [
                {
                    "file_additions": 1,
                    "file_deletions": 1,
                    "file_exists": true,
                    "file_name": "x-pack/plugin/sql/src/main/java/org/elasticsearch/xpack/sql/parser/ExpressionBuilder.java",
                    "file_size": 40564
                },
                {
                    "file_additions": 3,
                    "file_deletions": 9,
                    "file_exists": true,
                    "file_name": "x-pack/plugin/sql/src/main/java/org/elasticsearch/xpack/sql/parser/SqlBaseParser.java",
                    "file_size": 274207
                },
                {
                    "file_additions": 61,
                    "file_deletions": 5,
                    "file_exists": true,
                    "file_name": "x-pack/plugin/sql/src/main/java/org/elasticsearch/xpack/sql/parser/SqlParser.java",
                    "file_size": 11224
                },
                {
                    "file_additions": 42,
                    "file_deletions": 0,
                    "file_exists": true,
                    "file_name": "x-pack/plugin/sql/src/test/java/org/elasticsearch/xpack/sql/parser/SqlParserTests.java",
                    "file_size": 16619
                }
            ],
            "interesting": {
                "reopened": false,
                "status": false
            },
            "sha": "00bb58e2b4c51994b6f0d5ea6198cfc7bedfcac1"
        },
        {
            "diff": "elastic_elasticsearch/issue_36592/commit_3b4053d7d6e372a314c69e6b2a83f621cd0de154.diff",
            "diff_additions": 106,
            "diff_deletions": 15,
            "diff_file_size": 342614,
            "files": [
                {
                    "file_additions": 1,
                    "file_deletions": 1,
                    "file_exists": true,
                    "file_name": "x-pack/plugin/sql/src/main/java/org/elasticsearch/xpack/sql/parser/ExpressionBuilder.java",
                    "file_size": 40564
                },
                {
                    "file_additions": 3,
                    "file_deletions": 9,
                    "file_exists": true,
                    "file_name": "x-pack/plugin/sql/src/main/java/org/elasticsearch/xpack/sql/parser/SqlBaseParser.java",
                    "file_size": 274207
                },
                {
                    "file_additions": 61,
                    "file_deletions": 5,
                    "file_exists": true,
                    "file_name": "x-pack/plugin/sql/src/main/java/org/elasticsearch/xpack/sql/parser/SqlParser.java",
                    "file_size": 11224
                },
                {
                    "file_additions": 41,
                    "file_deletions": 0,
                    "file_exists": true,
                    "file_name": "x-pack/plugin/sql/src/test/java/org/elasticsearch/xpack/sql/parser/SqlParserTests.java",
                    "file_size": 16619
                }
            ],
            "interesting": {
                "reopened": false,
                "status": true
            },
            "sha": "3b4053d7d6e372a314c69e6b2a83f621cd0de154"
        },
        {
            "diff": "elastic_elasticsearch/issue_36592/commit_7d2e2cfdaf4c6b73bb01dc698add4604d3d84203.diff",
            "diff_additions": 126,
            "diff_deletions": 17,
            "diff_file_size": 342614,
            "files": [
                {
                    "file_additions": 1,
                    "file_deletions": 1,
                    "file_exists": true,
                    "file_name": "x-pack/plugin/sql/src/main/java/org/elasticsearch/xpack/sql/parser/ExpressionBuilder.java",
                    "file_size": 40564
                },
                {
                    "file_additions": 3,
                    "file_deletions": 9,
                    "file_exists": true,
                    "file_name": "x-pack/plugin/sql/src/main/java/org/elasticsearch/xpack/sql/parser/SqlBaseParser.java",
                    "file_size": 274207
                },
                {
                    "file_additions": 67,
                    "file_deletions": 7,
                    "file_exists": true,
                    "file_name": "x-pack/plugin/sql/src/main/java/org/elasticsearch/xpack/sql/parser/SqlParser.java",
                    "file_size": 11224
                },
                {
                    "file_additions": 55,
                    "file_deletions": 0,
                    "file_exists": true,
                    "file_name": "x-pack/plugin/sql/src/test/java/org/elasticsearch/xpack/sql/parser/SqlParserTests.java",
                    "file_size": 16619
                }
            ],
            "interesting": {
                "reopened": false,
                "status": false
            },
            "sha": "7d2e2cfdaf4c6b73bb01dc698add4604d3d84203"
        },
        {
            "diff": "elastic_elasticsearch/issue_36592/commit_7fa315489b6149ae026b4d6ca1c848f3a7141c04.diff",
            "diff_additions": 146,
            "diff_deletions": 23,
            "diff_file_size": 342614,
            "files": [
                {
                    "file_additions": 1,
                    "file_deletions": 1,
                    "file_exists": true,
                    "file_name": "x-pack/plugin/sql/src/main/java/org/elasticsearch/xpack/sql/parser/ExpressionBuilder.java",
                    "file_size": 40564
                },
                {
                    "file_additions": 23,
                    "file_deletions": 15,
                    "file_exists": true,
                    "file_name": "x-pack/plugin/sql/src/main/java/org/elasticsearch/xpack/sql/parser/SqlBaseParser.java",
                    "file_size": 274207
                },
                {
                    "file_additions": 67,
                    "file_deletions": 7,
                    "file_exists": true,
                    "file_name": "x-pack/plugin/sql/src/main/java/org/elasticsearch/xpack/sql/parser/SqlParser.java",
                    "file_size": 11224
                },
                {
                    "file_additions": 55,
                    "file_deletions": 0,
                    "file_exists": true,
                    "file_name": "x-pack/plugin/sql/src/test/java/org/elasticsearch/xpack/sql/parser/SqlParserTests.java",
                    "file_size": 16619
                }
            ],
            "interesting": {
                "reopened": false,
                "status": false
            },
            "sha": "7fa315489b6149ae026b4d6ca1c848f3a7141c04"
        }
    ],
    "first_commit": "2018-12-17 16:18:11",
    "last_commit": "2018-12-18 15:44:11",
    "number": 36592,
    "score": 320.0059880239521
}