{
    "covered_issues": [
        394,
        382,
        379,
        374,
        373,
        372,
        368,
        367,
        366,
        359,
        349,
        348,
        347,
        346,
        345,
        338,
        336,
        335,
        334,
        333,
        331,
        330,
        329,
        327,
        326,
        325,
        324,
        323,
        322,
        318,
        317,
        312,
        311,
        308,
        307,
        306,
        305,
        304,
        303,
        302,
        301,
        297,
        295,
        291,
        288,
        287,
        285,
        276,
        275,
        273,
        270,
        267,
        266,
        265,
        262,
        255,
        254,
        253,
        250,
        248,
        247,
        239,
        238,
        237,
        234,
        233,
        231,
        229,
        228,
        227,
        226,
        224,
        220,
        219,
        218,
        212,
        211,
        209,
        206,
        201,
        199,
        198,
        197,
        193,
        192,
        190,
        189,
        188,
        185,
        184,
        181,
        180,
        179,
        178,
        176,
        165,
        162,
        161,
        158,
        157,
        145,
        140,
        139,
        138,
        134,
        133,
        130,
        126,
        125,
        124,
        121,
        109,
        106,
        105,
        104,
        103,
        102,
        101,
        100,
        94,
        89,
        88,
        86,
        77,
        76,
        75,
        74,
        70,
        69,
        67,
        66,
        64,
        62,
        61,
        60,
        59,
        58,
        57,
        56,
        54,
        53,
        52,
        51,
        50,
        49,
        46,
        45,
        42,
        41,
        39,
        35,
        34,
        30,
        29,
        24,
        23,
        22,
        21,
        17,
        15,
        13,
        12,
        11,
        10,
        9,
        6,
        5,
        3,
        2
    ],
    "finished": true
}