{
    "all_issues": 3372,
    "interesting_issues": 7,
    "last_update": "2021-05-16 11:01:11.149029",
    "license": {
        "download": "https://raw.githubusercontent.com/edenhill/librdkafka/master/LICENSE",
        "name": "Other"
    },
    "ratio": 0.0020759193357058124,
    "size": 18811,
    "stars": 5121,
    "url": "https://github.com/edenhill/librdkafka"
}