{
    "commits": [
        {
            "associated_pull_request": [],
            "date": "2023-03-02 20:19:53+00:00",
            "diff": "",
            "diff_additions": 0,
            "diff_deletions": 0,
            "diff_file_size": 0,
            "diff_url": "https://github.com/elfmz/far2l/commit/d63a0d774392a3bc307d9618ec239cc87d8d716d.diff",
            "exists": true,
            "files": [],
            "interesting": {
                "reopen": false,
                "status": false
            },
            "is_parent": true,
            "sha": "d63a0d774392a3bc307d9618ec239cc87d8d716d"
        },
        {
            "associated_pull_request": [],
            "date": "2023-03-02 22:03:06+00:00",
            "diff": "elfmz_far2l/issue_1516/commit_3e949d4965c042c06675eec372e21ae18e157778.diff",
            "diff_additions": 5,
            "diff_deletions": 4,
            "diff_file_size": 50239,
            "diff_url": "https://github.com/elfmz/far2l/commit/3e949d4965c042c06675eec372e21ae18e157778.diff",
            "exists": true,
            "files": [
                {
                    "file_additions": 5,
                    "file_deletions": 4,
                    "file_exists": true,
                    "file_name": "far2l/src/plug/plugins.cpp",
                    "file_size": 50239
                }
            ],
            "interesting": {
                "reopen": true,
                "status": false
            },
            "is_parent": false,
            "sha": "3e949d4965c042c06675eec372e21ae18e157778"
        },
        {
            "associated_pull_request": [],
            "date": "2023-03-04 11:53:59+00:00",
            "diff": "elfmz_far2l/issue_1516/commit_8138c9a4f90cbf119baab427082e2afd214005b9.diff",
            "diff_additions": 25,
            "diff_deletions": 15,
            "diff_file_size": 107364,
            "diff_url": "https://github.com/elfmz/far2l/commit/8138c9a4f90cbf119baab427082e2afd214005b9.diff",
            "exists": true,
            "files": [
                {
                    "file_additions": 1,
                    "file_deletions": 1,
                    "file_exists": true,
                    "file_name": "far2l/src/panels/panel.cpp",
                    "file_size": 57125
                },
                {
                    "file_additions": 24,
                    "file_deletions": 14,
                    "file_exists": true,
                    "file_name": "far2l/src/plug/plugins.cpp",
                    "file_size": 50239
                }
            ],
            "interesting": {
                "reopen": false,
                "status": false
            },
            "is_parent": false,
            "sha": "8138c9a4f90cbf119baab427082e2afd214005b9"
        }
    ],
    "first_commit": "2023-03-02 20:19:53+00:00",
    "last_commit": "2023-03-04 11:53:59+00:00",
    "number": 1516,
    "pull_request": "None",
    "score": {
        "accidental_reopen_likely": false,
        "all_labels": [],
        "contains_keywords": [
            "fix",
            "issu"
        ],
        "fix_size": 41,
        "has_labels": [],
        "intersecting": {
            "computed_score": 0.10810810810810811,
            "final_commit_size": 37,
            "intersection_size": 4,
            "previous_commits_size": 8
        },
        "is_makefile_based": true,
        "no_new_files": [
            "far2l/src/panels/panel.cpp"
        ],
        "no_other_files": false,
        "num_prohibited_files": 96119,
        "prohibited_files": [
            "server/src/main/java/com/genymobile/scrcpy/Device.java",
            "server/src/main/java/com/genymobile/scrcpy/wrappers/SurfaceControl.java",
            "server/src/main/java/com/genymobile/scrcpy/Device.java",
            "server/src/main/java/com/genymobile/scrcpy/wrappers/SurfaceControl.java",
            "app/meson.build",
            "app/scrcpy.1",
            "app/src/common.h",
            "app/src/scrcpy.h",
            "app/src/server.h",
            "server/src/main/java/com/genymobile/scrcpy/Workarounds.java"
        ],
        "reopen": true,
        "reopen_events": [
            [
                "2023-03-02 22:03:14+00:00",
                "closed"
            ],
            [
                "2023-03-02 22:03:14+00:00",
                "commit"
            ],
            [
                "2023-03-03 11:01:47+00:00",
                "reopened"
            ],
            [
                "2023-03-04 11:59:24+00:00",
                "closed"
            ],
            [
                "2023-03-04 11:59:24+00:00",
                "commit"
            ]
        ],
        "status": false,
        "strategy": true,
        "total_changes": 49
    }
}