{
    "covered_issues": [
        30,
        29,
        28,
        27,
        22,
        20,
        19,
        12,
        11,
        10,
        9,
        7,
        6,
        5,
        4,
        3,
        1
    ],
    "finished": true
}