{
    "covered_issues": [
        95,
        93,
        90,
        88,
        86,
        83,
        81,
        79,
        77,
        75,
        74,
        71,
        69,
        67,
        66,
        65,
        64,
        63,
        62,
        60,
        59,
        56,
        55,
        54,
        53,
        47,
        46,
        44,
        43,
        41,
        38,
        37,
        36,
        33,
        32,
        31,
        29,
        28,
        27,
        26,
        23,
        22,
        21,
        19,
        17,
        16,
        14,
        12,
        11,
        9,
        6,
        5,
        3,
        2,
        1
    ],
    "finished": true
}