{
    "covered_issues": [
        1808,
        1806,
        1801,
        1799,
        1795,
        1793,
        1787,
        1780,
        1777,
        1773,
        1767,
        1764,
        1761,
        1759,
        1756,
        1755,
        1752,
        1738,
        1735,
        1732,
        1730,
        1723,
        1721,
        1718,
        1715,
        1713,
        1710,
        1709,
        1707,
        1702,
        1698,
        1696,
        1694,
        1693,
        1691,
        1687,
        1686,
        1683,
        1675,
        1673,
        1670,
        1668,
        1659,
        1654,
        1644,
        1641,
        1630,
        1628,
        1627,
        1625,
        1624,
        1621,
        1617,
        1616,
        1613,
        1610,
        1609,
        1606,
        1603,
        1601,
        1594,
        1592,
        1586,
        1578,
        1572,
        1569,
        1567,
        1566,
        1562,
        1555,
        1554,
        1552,
        1551,
        1547,
        1546,
        1544,
        1543,
        1539,
        1531,
        1530,
        1522,
        1520,
        1518,
        1517,
        1516,
        1514,
        1513,
        1512,
        1510,
        1509,
        1508,
        1506,
        1504,
        1503,
        1499,
        1497,
        1496,
        1494,
        1490,
        1486,
        1485,
        1484,
        1482,
        1481,
        1477,
        1475,
        1473,
        1472,
        1471,
        1467,
        1461,
        1459,
        1458,
        1457,
        1454,
        1452,
        1450,
        1448,
        1446,
        1445,
        1443,
        1441,
        1438,
        1437,
        1434,
        1432,
        1430,
        1425,
        1424,
        1421,
        1418,
        1417,
        1413,
        1409,
        1408,
        1406,
        1399,
        1398,
        1397,
        1395,
        1389,
        1388,
        1385,
        1380,
        1378,
        1376,
        1375,
        1374,
        1373,
        1372,
        1371,
        1370,
        1369,
        1368,
        1367,
        1365,
        1358,
        1356,
        1354,
        1353,
        1352,
        1351,
        1350,
        1348,
        1347,
        1346,
        1343,
        1341,
        1340,
        1339,
        1335,
        1332,
        1331,
        1327,
        1326,
        1321,
        1315,
        1314,
        1313,
        1312,
        1280,
        1278,
        1275,
        1273,
        1268,
        1265,
        1262,
        1258,
        1257,
        1254,
        1252,
        1250,
        1249,
        1248,
        1246,
        1244,
        1243,
        1242,
        1239,
        1238,
        1235,
        1234,
        1233,
        1232,
        1229,
        1226,
        1223,
        1222,
        1220,
        1216,
        1215,
        1214,
        1213,
        1211,
        1210,
        1207,
        1206,
        1204,
        1203,
        1202,
        1201,
        1200,
        1199,
        1196,
        1195,
        1194,
        1192,
        1191,
        1188,
        1187,
        1185,
        1181,
        1175,
        1172,
        1170,
        1168,
        1165,
        1163,
        1158,
        1156,
        1155,
        1154,
        1152,
        1150,
        1145,
        1143,
        1142,
        1141,
        1139,
        1138,
        1136,
        1135,
        1127,
        1124,
        1122,
        1120,
        1119,
        1118,
        1116,
        1115,
        1114,
        1113,
        1111,
        1110,
        1109,
        1107,
        1106,
        1105,
        1104,
        1101,
        1100,
        1096,
        1094,
        1093,
        1092,
        1090,
        1083,
        1082,
        1081,
        1080,
        1079,
        1078,
        1077,
        1075,
        1074,
        1071,
        1069,
        1064,
        1063,
        1062,
        1060,
        1059,
        1058,
        1057,
        1055,
        1054,
        1053,
        1052,
        1050,
        1049,
        1048,
        1047,
        1045,
        1043,
        1042,
        1041,
        1039,
        1036,
        1032,
        1027,
        1023,
        1016,
        1014,
        1013,
        1012,
        1011,
        1007,
        1004,
        1000,
        997,
        996,
        995,
        985,
        984,
        982,
        981,
        979,
        978,
        976,
        975,
        971,
        970,
        967,
        965,
        963,
        962,
        959,
        958,
        957,
        956,
        955,
        954,
        952,
        951,
        950,
        946,
        945,
        944,
        943,
        942,
        941,
        940,
        939,
        938,
        937,
        936,
        935,
        934,
        933,
        932,
        929,
        927,
        926,
        925,
        924,
        923,
        922,
        921,
        920,
        919,
        917,
        916,
        915,
        914,
        913,
        912,
        910,
        907,
        906,
        904,
        903,
        902,
        899,
        898,
        893,
        890,
        889,
        888,
        884,
        882,
        880,
        879,
        877,
        876,
        873,
        872,
        871,
        869,
        868,
        866,
        865,
        864,
        863,
        862,
        861,
        860,
        857,
        856,
        855,
        854,
        853,
        852,
        851,
        850,
        849,
        846,
        845,
        841,
        837,
        836,
        835,
        832,
        831,
        829,
        828,
        827,
        824,
        823,
        820,
        818,
        817,
        816,
        815,
        814,
        813,
        812,
        811,
        810,
        809,
        808,
        807,
        806,
        803,
        799,
        798,
        797,
        794,
        793,
        792,
        791,
        790,
        789,
        788,
        787,
        786,
        784,
        783,
        781,
        780,
        778,
        777,
        776,
        774,
        773,
        772,
        771,
        770,
        769,
        768,
        767,
        766,
        764,
        763,
        762,
        760,
        759,
        758,
        757,
        756,
        755,
        754,
        753,
        752,
        751,
        750,
        747,
        744,
        741,
        740,
        739,
        738,
        737,
        736,
        735,
        734,
        733,
        732,
        731,
        730,
        729,
        727,
        726,
        724,
        721,
        720,
        718,
        717,
        716,
        715,
        714,
        713,
        712,
        711,
        710,
        709,
        708,
        707,
        706,
        703,
        702,
        701,
        700,
        699,
        697,
        696,
        694,
        693,
        691,
        687,
        684,
        682,
        681,
        678,
        675,
        669,
        668,
        666,
        665,
        661,
        659,
        658,
        656,
        655,
        650,
        649,
        648,
        646,
        645,
        644,
        643,
        642,
        641,
        639,
        638,
        637,
        636,
        635,
        634,
        633,
        628,
        626,
        625,
        624,
        622,
        621,
        620,
        617,
        616,
        615,
        613,
        610,
        607,
        606,
        605,
        602,
        601,
        600,
        598,
        597,
        596,
        594,
        593,
        592,
        591,
        590,
        588,
        587,
        586,
        584,
        583,
        582,
        581,
        578,
        577,
        576,
        575,
        574,
        572,
        569,
        568,
        566,
        561,
        560,
        559,
        554,
        553,
        552,
        551,
        550,
        549,
        548,
        547,
        546,
        545,
        544,
        543,
        539,
        533,
        532,
        531,
        529,
        527,
        526,
        524,
        523,
        522,
        520,
        519,
        518,
        516,
        515,
        514,
        508,
        507,
        505,
        504,
        503,
        500,
        497,
        496,
        495,
        494,
        490,
        489,
        488,
        484,
        481,
        477,
        476,
        475,
        473,
        472,
        471,
        468,
        467,
        466,
        464,
        462,
        461,
        458,
        456,
        454,
        453,
        452,
        451,
        450,
        449,
        448,
        447,
        446,
        441,
        440,
        438,
        437,
        436,
        433,
        432,
        431,
        430,
        427,
        423,
        422,
        421,
        420,
        417,
        415,
        413,
        412,
        409,
        408,
        404,
        402,
        401,
        400,
        399,
        398,
        397,
        395,
        394,
        393,
        391,
        389,
        386,
        385,
        384,
        382,
        381,
        380,
        379,
        378,
        377,
        372,
        371,
        370,
        368,
        367,
        365,
        364,
        362,
        361,
        359,
        355,
        353,
        350,
        349,
        346,
        344,
        342,
        341,
        339,
        337,
        336,
        334,
        333,
        331,
        327,
        326,
        324,
        323,
        322,
        321,
        319,
        315,
        314,
        313,
        312,
        310,
        307,
        306,
        305,
        301,
        299,
        297,
        295,
        294,
        293,
        291,
        290,
        288,
        287,
        286,
        285,
        284,
        283,
        280,
        278,
        276,
        271,
        270,
        268,
        265,
        264,
        259,
        257,
        256,
        253,
        252,
        251,
        250,
        249,
        248,
        246,
        241,
        240,
        239,
        237,
        236,
        234,
        233,
        227,
        223,
        222,
        219,
        218,
        217,
        211,
        205,
        201,
        200,
        196,
        194,
        193,
        190,
        189,
        185,
        179,
        171,
        170,
        169,
        166,
        164,
        163,
        162,
        161,
        159,
        157,
        156,
        155,
        154,
        151,
        147,
        145,
        133,
        132,
        122,
        121,
        120,
        117,
        111,
        110,
        109,
        106,
        104,
        102,
        99,
        97,
        92,
        85,
        83,
        81,
        80,
        77,
        76,
        75,
        74,
        73,
        72,
        71,
        70,
        69,
        67,
        63,
        62,
        61,
        60,
        59,
        58,
        56,
        53,
        52,
        51,
        50,
        49,
        47,
        46,
        45,
        44,
        43,
        42,
        41,
        40,
        39,
        38,
        37,
        36,
        35,
        34,
        33,
        32,
        31,
        28,
        27,
        26,
        25,
        24,
        23,
        22,
        21,
        16,
        15,
        14,
        11,
        3,
        2
    ],
    "finished": true
}