{
    "all_issues": 1232,
    "interesting_issues": 3,
    "last_update": "2023-10-22 05:12:29.290182",
    "license": {
        "download": "https://raw.githubusercontent.com/AppImage/AppImageKit/master/LICENSE",
        "name": "Other"
    },
    "ratio": 0.002435064935064935,
    "size": 16330,
    "stars": 8160,
    "url": "https://github.com/AppImage/AppImageKit"
}