{
    "category": [
        "hardware/OS",
        "feature request"
    ],
    "commits": [
        {
            "associated_pull_request": [],
            "date": "2018-11-29 19:42:56",
            "diff": "flatpak_flatpak/issue_2350/commit_701602c6cab1a1c587e7512217175f8826dae94a.diff",
            "diff_additions": 20,
            "diff_deletions": 11,
            "diff_file_size": 92044,
            "diff_url": "https://github.com/flatpak/flatpak/commit/701602c6cab1a1c587e7512217175f8826dae94a.diff",
            "exists": true,
            "files": [
                {
                    "file_additions": 20,
                    "file_deletions": 11,
                    "file_exists": true,
                    "file_name": "system-helper/flatpak-system-helper.c",
                    "file_size": 92044
                }
            ],
            "interesting": {
                "reopen": false,
                "status": false
            },
            "is_parent": true,
            "sha": "701602c6cab1a1c587e7512217175f8826dae94a"
        },
        {
            "associated_pull_request": [],
            "date": "2018-11-30 09:30:20",
            "diff": "flatpak_flatpak/issue_2350/commit_ba5cc9de8f00c919a81e6e8b1a9a9064c9ae1530.diff",
            "diff_additions": 121,
            "diff_deletions": 27,
            "diff_file_size": 674787,
            "diff_url": "https://github.com/flatpak/flatpak/commit/ba5cc9de8f00c919a81e6e8b1a9a9064c9ae1530.diff",
            "exists": true,
            "files": [
                {
                    "file_additions": 68,
                    "file_deletions": 26,
                    "file_exists": true,
                    "file_name": "common/flatpak-dir.c",
                    "file_size": 582743
                },
                {
                    "file_additions": 53,
                    "file_deletions": 1,
                    "file_exists": true,
                    "file_name": "system-helper/flatpak-system-helper.c",
                    "file_size": 92044
                }
            ],
            "interesting": {
                "reopen": false,
                "status": true
            },
            "is_parent": false,
            "sha": "ba5cc9de8f00c919a81e6e8b1a9a9064c9ae1530"
        },
        {
            "associated_pull_request": [],
            "date": "2018-11-30 09:30:20",
            "diff": "flatpak_flatpak/issue_2350/commit_0b6a66013c8071abd3b9f5697d45ba5089ef8bba.diff",
            "diff_additions": 119,
            "diff_deletions": 27,
            "diff_file_size": 674787,
            "diff_url": "https://github.com/flatpak/flatpak/commit/0b6a66013c8071abd3b9f5697d45ba5089ef8bba.diff",
            "exists": true,
            "files": [
                {
                    "file_additions": 68,
                    "file_deletions": 26,
                    "file_exists": true,
                    "file_name": "common/flatpak-dir.c",
                    "file_size": 582743
                },
                {
                    "file_additions": 51,
                    "file_deletions": 1,
                    "file_exists": true,
                    "file_name": "system-helper/flatpak-system-helper.c",
                    "file_size": 92044
                }
            ],
            "interesting": {
                "reopen": false,
                "status": false
            },
            "is_parent": false,
            "sha": "0b6a66013c8071abd3b9f5697d45ba5089ef8bba"
        },
        {
            "associated_pull_request": [],
            "date": "2018-11-30 09:30:20",
            "diff": "flatpak_flatpak/issue_2350/commit_0b6a66013c8071abd3b9f5697d45ba5089ef8bba.diff",
            "diff_additions": 119,
            "diff_deletions": 27,
            "diff_file_size": 674787,
            "diff_url": "https://github.com/flatpak/flatpak/commit/0b6a66013c8071abd3b9f5697d45ba5089ef8bba.diff",
            "exists": true,
            "files": [
                {
                    "file_additions": 68,
                    "file_deletions": 26,
                    "file_exists": true,
                    "file_name": "common/flatpak-dir.c",
                    "file_size": 582743
                },
                {
                    "file_additions": 51,
                    "file_deletions": 1,
                    "file_exists": true,
                    "file_name": "system-helper/flatpak-system-helper.c",
                    "file_size": 92044
                }
            ],
            "interesting": {
                "reopen": false,
                "status": false
            },
            "is_parent": false,
            "sha": "0b6a66013c8071abd3b9f5697d45ba5089ef8bba"
        }
    ],
    "first_commit": "2018-11-30 01:08:40",
    "last_commit": "2018-12-01 00:16:08",
    "number": 2350,
    "pull_request": "None",
    "score": {
        "accidental_reopen_likely": false,
        "all_labels": [
            "oci"
        ],
        "contains_keywords": [
            "fail",
            "test",
            "fix",
            "remov",
            "issu",
            "work",
            "CI"
        ],
        "fix_size": 141,
        "has_labels": [],
        "intersecting": {
            "computed_score": 1.0,
            "final_commit_size": 136,
            "intersection_size": 136,
            "previous_commits_size": 141
        },
        "is_makefile_based": true,
        "no_new_files": [],
        "no_other_files": false,
        "num_prohibited_files": 71438,
        "prohibited_files": [
            "hal/inc/pinmap_hal.h",
            "Debug/marvin.bin",
            "Debug/marvin.elf",
            "Debug/marvin.hex",
            "Debug/marvin.bin",
            "Debug/marvin.elf",
            "Debug/marvin.hex",
            "inc/spark_utilities.h",
            "Debug/marvin.bin",
            "Debug/marvin.elf"
        ],
        "reopen": false,
        "reopen_events": [
            [
                "2018-11-30 09:38:42",
                "commit"
            ],
            [
                "2018-12-01 00:16:11",
                "commit"
            ],
            [
                "2018-12-01 00:31:12",
                "closed"
            ],
            [
                "2018-12-01 00:31:12",
                "commit"
            ]
        ],
        "status": true,
        "strategy": true,
        "total_changes": 471
    }
}