{
    "category": [
        "memory",
        "build/refactor/preprocessing"
    ],
    "commits": [
        {
            "associated_pull_request": [
                "https://github.com/open-mpi/ompi/pull/1708"
            ],
            "date": "2016-05-25 16:48:02",
            "diff": "",
            "diff_additions": 0,
            "diff_deletions": 0,
            "diff_file_size": 0,
            "diff_url": "https://github.com/open-mpi/ompi/commit/8e1d59aea841831ebe324d9fc576578a7c4bb4f9.diff",
            "exists": true,
            "files": [],
            "interesting": {
                "reopen": false,
                "status": false
            },
            "is_parent": true,
            "sha": "8e1d59aea841831ebe324d9fc576578a7c4bb4f9"
        },
        {
            "associated_pull_request": [
                "https://github.com/open-mpi/ompi/pull/1714"
            ],
            "date": "2016-05-25 20:25:07",
            "diff": "open-mpi_ompi/issue_1712/commit_5caf12cd9b4a636c7acf8ba6641464533df494f8.diff",
            "diff_additions": 1,
            "diff_deletions": 1,
            "diff_file_size": 0,
            "diff_url": "https://github.com/open-mpi/ompi/commit/5caf12cd9b4a636c7acf8ba6641464533df494f8.diff",
            "exists": true,
            "files": [
                {
                    "file_additions": 1,
                    "file_deletions": 1,
                    "file_exists": false,
                    "file_name": "opal/mca/btl/scif/btl_scif_component.c",
                    "file_size": 0
                }
            ],
            "interesting": {
                "reopen": true,
                "status": true
            },
            "is_parent": false,
            "sha": "5caf12cd9b4a636c7acf8ba6641464533df494f8"
        },
        {
            "associated_pull_request": [],
            "date": "2016-05-25 20:25:07",
            "diff": "open-mpi_ompi/issue_1712/commit_12c43ad8a61cf69aef8d5aa4e1a275d652d3c52d.diff",
            "diff_additions": 1,
            "diff_deletions": 1,
            "diff_file_size": 0,
            "diff_url": "https://github.com/open-mpi/ompi/commit/12c43ad8a61cf69aef8d5aa4e1a275d652d3c52d.diff",
            "exists": true,
            "files": [
                {
                    "file_additions": 1,
                    "file_deletions": 1,
                    "file_exists": false,
                    "file_name": "ompi/mca/btl/scif/btl_scif_component.c",
                    "file_size": 0
                }
            ],
            "interesting": {
                "reopen": true,
                "status": false
            },
            "is_parent": false,
            "sha": "12c43ad8a61cf69aef8d5aa4e1a275d652d3c52d"
        }
    ],
    "first_commit": "2016-05-25 16:48:02",
    "last_commit": "2016-10-03 17:09:26",
    "number": 1712,
    "pull_request": "None",
    "score": {
        "accidental_reopen_likely": false,
        "all_labels": [
            "Severity: critical",
            "Target: v1.10",
            "Target: v2.x"
        ],
        "contains_keywords": [
            "fix",
            "CI",
            "fault",
            "issu",
            "perform",
            "error"
        ],
        "fix_size": 4,
        "has_labels": [],
        "intersecting": {
            "computed_score": 0.0,
            "final_commit_size": 2,
            "intersection_size": 0,
            "previous_commits_size": 2
        },
        "is_makefile_based": true,
        "no_new_files": [
            "ompi/mca/btl/scif/btl_scif_component.c"
        ],
        "no_other_files": true,
        "num_prohibited_files": 63950,
        "prohibited_files": [
            "kill.h",
            "meminfo.h",
            "kill.h",
            "meminfo.h",
            "kill.h",
            "meminfo.h",
            "testsuite_cli_test.go",
            "testsuite_cli_test.go",
            "common.mk",
            "i3bar/include/draw_util.h"
        ],
        "reopen": true,
        "reopen_events": [
            [
                "2016-05-25 20:26:15",
                "commit"
            ],
            [
                "2016-05-26 21:53:11",
                "closed"
            ],
            [
                "2016-05-26 21:54:58",
                "reopened"
            ],
            [
                "2016-05-26 22:09:22",
                "closed"
            ],
            [
                "2016-05-26 22:09:22",
                "commit"
            ],
            [
                "2016-05-26 23:04:13",
                "commit"
            ],
            [
                "2016-05-26 23:06:27",
                "commit"
            ],
            [
                "2016-05-26 23:09:45",
                "reopened"
            ],
            [
                "2016-05-27 14:58:41",
                "closed"
            ],
            [
                "2016-10-03 17:18:05",
                "commit"
            ]
        ],
        "status": false,
        "strategy": true,
        "total_changes": 4
    }
}