{
    "category": [
        "feature request"
    ],
    "commits": [
        {
            "associated_pull_request": [
                "https://github.com/openwall/john/pull/3200"
            ],
            "date": "2018-03-14 10:12:23",
            "diff": "openwall_john/issue_1782/commit_b5a40e9d109391cbb13929ce65e9dc9e64c80de5.diff",
            "diff_additions": 19,
            "diff_deletions": 114,
            "diff_file_size": 476486,
            "diff_url": "https://github.com/openwall/john/commit/b5a40e9d109391cbb13929ce65e9dc9e64c80de5.diff",
            "exists": true,
            "files": [
                {
                    "file_additions": 1,
                    "file_deletions": 9,
                    "file_exists": true,
                    "file_name": "src/opencl_DES_bs_b_plug.c",
                    "file_size": 20687
                },
                {
                    "file_additions": 1,
                    "file_deletions": 9,
                    "file_exists": true,
                    "file_name": "src/opencl_DES_bs_f_plug.c",
                    "file_size": 22779
                },
                {
                    "file_additions": 1,
                    "file_deletions": 9,
                    "file_exists": true,
                    "file_name": "src/opencl_DES_bs_h_plug.c",
                    "file_size": 23301
                },
                {
                    "file_additions": 0,
                    "file_deletions": 5,
                    "file_exists": true,
                    "file_name": "src/opencl_DES_bs_plug.c",
                    "file_size": 41987
                },
                {
                    "file_additions": 0,
                    "file_deletions": 5,
                    "file_exists": true,
                    "file_name": "src/opencl_hash_check_128_plug.c",
                    "file_size": 18913
                },
                {
                    "file_additions": 5,
                    "file_deletions": 2,
                    "file_exists": true,
                    "file_name": "src/opencl_krb5pa-md5_fmt_plug.c",
                    "file_size": 33970
                },
                {
                    "file_additions": 1,
                    "file_deletions": 11,
                    "file_exists": true,
                    "file_name": "src/opencl_lm_b_plug.c",
                    "file_size": 43691
                },
                {
                    "file_additions": 0,
                    "file_deletions": 11,
                    "file_exists": true,
                    "file_name": "src/opencl_mscash2_helper_plug.c",
                    "file_size": 20582
                },
                {
                    "file_additions": 5,
                    "file_deletions": 2,
                    "file_exists": true,
                    "file_name": "src/opencl_mscash_fmt_plug.c",
                    "file_size": 27689
                },
                {
                    "file_additions": 0,
                    "file_deletions": 9,
                    "file_exists": true,
                    "file_name": "src/opencl_mysqlsha1_fmt_plug.c",
                    "file_size": 38091
                },
                {
                    "file_additions": 5,
                    "file_deletions": 2,
                    "file_exists": true,
                    "file_name": "src/opencl_ntlmv2_fmt_plug.c",
                    "file_size": 37478
                },
                {
                    "file_additions": 0,
                    "file_deletions": 6,
                    "file_exists": true,
                    "file_name": "src/opencl_rawmd4_fmt_plug.c",
                    "file_size": 20381
                },
                {
                    "file_additions": 0,
                    "file_deletions": 6,
                    "file_exists": true,
                    "file_name": "src/opencl_rawmd5_fmt_plug.c",
                    "file_size": 20893
                },
                {
                    "file_additions": 0,
                    "file_deletions": 9,
                    "file_exists": true,
                    "file_name": "src/opencl_rawsha1_fmt_plug.c",
                    "file_size": 36462
                },
                {
                    "file_additions": 0,
                    "file_deletions": 9,
                    "file_exists": true,
                    "file_name": "src/opencl_salted_sha_fmt_plug.c",
                    "file_size": 35568
                },
                {
                    "file_additions": 0,
                    "file_deletions": 10,
                    "file_exists": true,
                    "file_name": "src/opencl_sl3_fmt_plug.c",
                    "file_size": 34014
                }
            ],
            "interesting": {
                "reopen": false,
                "status": false
            },
            "is_parent": true,
            "sha": "b5a40e9d109391cbb13929ce65e9dc9e64c80de5"
        },
        {
            "associated_pull_request": [],
            "date": "2018-03-14 15:03:27",
            "diff": "openwall_john/issue_1782/commit_baf1181802009068c9687112ea5c43561fc70cba.diff",
            "diff_additions": 447,
            "diff_deletions": 300,
            "diff_file_size": 193826,
            "diff_url": "https://github.com/openwall/john/commit/baf1181802009068c9687112ea5c43561fc70cba.diff",
            "exists": true,
            "files": [
                {
                    "file_additions": 33,
                    "file_deletions": 31,
                    "file_exists": true,
                    "file_name": "src/cracker.c",
                    "file_size": 31695
                },
                {
                    "file_additions": 10,
                    "file_deletions": 0,
                    "file_exists": true,
                    "file_name": "src/john.c",
                    "file_size": 57633
                },
                {
                    "file_additions": 379,
                    "file_deletions": 252,
                    "file_exists": true,
                    "file_name": "src/mask.c",
                    "file_size": 70640
                },
                {
                    "file_additions": 21,
                    "file_deletions": 11,
                    "file_exists": true,
                    "file_name": "src/mask_ext.c",
                    "file_size": 4282
                },
                {
                    "file_additions": 4,
                    "file_deletions": 5,
                    "file_exists": true,
                    "file_name": "src/recovery.c",
                    "file_size": 18065
                },
                {
                    "file_additions": 0,
                    "file_deletions": 1,
                    "file_exists": true,
                    "file_name": "src/status.c",
                    "file_size": 11511
                }
            ],
            "interesting": {
                "reopen": false,
                "status": true
            },
            "is_parent": false,
            "sha": "baf1181802009068c9687112ea5c43561fc70cba"
        },
        {
            "associated_pull_request": [
                "https://github.com/openwall/john/pull/3200"
            ],
            "date": "2018-03-14 15:03:27",
            "diff": "openwall_john/issue_1782/commit_aa6c1c9b2bdd4b99149e7e32f89832773e273c03.diff",
            "diff_additions": 453,
            "diff_deletions": 306,
            "diff_file_size": 193826,
            "diff_url": "https://github.com/openwall/john/commit/aa6c1c9b2bdd4b99149e7e32f89832773e273c03.diff",
            "exists": true,
            "files": [
                {
                    "file_additions": 33,
                    "file_deletions": 31,
                    "file_exists": true,
                    "file_name": "src/cracker.c",
                    "file_size": 31695
                },
                {
                    "file_additions": 10,
                    "file_deletions": 0,
                    "file_exists": true,
                    "file_name": "src/john.c",
                    "file_size": 57633
                },
                {
                    "file_additions": 385,
                    "file_deletions": 258,
                    "file_exists": true,
                    "file_name": "src/mask.c",
                    "file_size": 70640
                },
                {
                    "file_additions": 21,
                    "file_deletions": 11,
                    "file_exists": true,
                    "file_name": "src/mask_ext.c",
                    "file_size": 4282
                },
                {
                    "file_additions": 4,
                    "file_deletions": 5,
                    "file_exists": true,
                    "file_name": "src/recovery.c",
                    "file_size": 18065
                },
                {
                    "file_additions": 0,
                    "file_deletions": 1,
                    "file_exists": true,
                    "file_name": "src/status.c",
                    "file_size": 11511
                }
            ],
            "interesting": {
                "reopen": false,
                "status": false
            },
            "is_parent": false,
            "sha": "aa6c1c9b2bdd4b99149e7e32f89832773e273c03"
        },
        {
            "associated_pull_request": [],
            "date": "2018-03-14 15:03:27",
            "diff": "openwall_john/issue_1782/commit_b6c8815ca4e3520a2d960b72b8bf65afce096a7c.diff",
            "diff_additions": 453,
            "diff_deletions": 306,
            "diff_file_size": 193826,
            "diff_url": "https://github.com/openwall/john/commit/b6c8815ca4e3520a2d960b72b8bf65afce096a7c.diff",
            "exists": true,
            "files": [
                {
                    "file_additions": 33,
                    "file_deletions": 31,
                    "file_exists": true,
                    "file_name": "src/cracker.c",
                    "file_size": 31695
                },
                {
                    "file_additions": 10,
                    "file_deletions": 0,
                    "file_exists": true,
                    "file_name": "src/john.c",
                    "file_size": 57633
                },
                {
                    "file_additions": 385,
                    "file_deletions": 258,
                    "file_exists": true,
                    "file_name": "src/mask.c",
                    "file_size": 70640
                },
                {
                    "file_additions": 21,
                    "file_deletions": 11,
                    "file_exists": true,
                    "file_name": "src/mask_ext.c",
                    "file_size": 4282
                },
                {
                    "file_additions": 4,
                    "file_deletions": 5,
                    "file_exists": true,
                    "file_name": "src/recovery.c",
                    "file_size": 18065
                },
                {
                    "file_additions": 0,
                    "file_deletions": 1,
                    "file_exists": true,
                    "file_name": "src/status.c",
                    "file_size": 11511
                }
            ],
            "interesting": {
                "reopen": false,
                "status": false
            },
            "is_parent": false,
            "sha": "b6c8815ca4e3520a2d960b72b8bf65afce096a7c"
        },
        {
            "associated_pull_request": [
                "https://github.com/openwall/john/pull/3200"
            ],
            "date": "2018-03-14 15:03:27",
            "diff": "openwall_john/issue_1782/commit_c1d7a2f31fae4189ad172b0c2d9861f47b591bc1.diff",
            "diff_additions": 453,
            "diff_deletions": 306,
            "diff_file_size": 193826,
            "diff_url": "https://github.com/openwall/john/commit/c1d7a2f31fae4189ad172b0c2d9861f47b591bc1.diff",
            "exists": true,
            "files": [
                {
                    "file_additions": 33,
                    "file_deletions": 31,
                    "file_exists": true,
                    "file_name": "src/cracker.c",
                    "file_size": 31695
                },
                {
                    "file_additions": 10,
                    "file_deletions": 0,
                    "file_exists": true,
                    "file_name": "src/john.c",
                    "file_size": 57633
                },
                {
                    "file_additions": 385,
                    "file_deletions": 258,
                    "file_exists": true,
                    "file_name": "src/mask.c",
                    "file_size": 70640
                },
                {
                    "file_additions": 21,
                    "file_deletions": 11,
                    "file_exists": true,
                    "file_name": "src/mask_ext.c",
                    "file_size": 4282
                },
                {
                    "file_additions": 4,
                    "file_deletions": 5,
                    "file_exists": true,
                    "file_name": "src/recovery.c",
                    "file_size": 18065
                },
                {
                    "file_additions": 0,
                    "file_deletions": 1,
                    "file_exists": true,
                    "file_name": "src/status.c",
                    "file_size": 11511
                }
            ],
            "interesting": {
                "reopen": false,
                "status": false
            },
            "is_parent": false,
            "sha": "c1d7a2f31fae4189ad172b0c2d9861f47b591bc1"
        }
    ],
    "first_commit": "2018-03-14 15:04:23",
    "last_commit": "2018-03-15 07:31:03",
    "number": 1782,
    "pull_request": "None",
    "score": {
        "accidental_reopen_likely": false,
        "all_labels": [
            "enhancement"
        ],
        "contains_keywords": [
            "fail",
            "warn",
            "error",
            "workaround",
            "bug",
            "problem",
            "fix",
            "work",
            "fault"
        ],
        "fix_size": 675,
        "has_labels": [],
        "intersecting": {
            "computed_score": 1.0,
            "final_commit_size": 675,
            "intersection_size": 675,
            "previous_commits_size": 675
        },
        "is_makefile_based": false,
        "no_new_files": [],
        "no_other_files": false,
        "num_prohibited_files": 110740,
        "prohibited_files": [
            "hal/inc/pinmap_hal.h",
            "Debug/marvin.bin",
            "Debug/marvin.elf",
            "Debug/marvin.hex",
            "Debug/marvin.bin",
            "Debug/marvin.elf",
            "Debug/marvin.hex",
            "inc/spark_utilities.h",
            "Debug/marvin.bin",
            "Debug/marvin.elf"
        ],
        "reopen": false,
        "reopen_events": [
            [
                "2018-03-14 19:51:40",
                "commit"
            ],
            [
                "2018-03-14 20:34:12",
                "commit"
            ],
            [
                "2018-03-14 21:00:04",
                "commit"
            ],
            [
                "2018-03-15 07:31:06",
                "commit"
            ],
            [
                "2018-03-15 07:44:48",
                "closed"
            ]
        ],
        "status": true,
        "strategy": true,
        "total_changes": 3157
    }
}