{
    "commits": [
        {
            "associated_pull_request": [],
            "date": "2022-04-02 19:12:43+00:00",
            "diff": "igraph_igraph/issue_2020/commit_1eb6761323f18ca231dc0abc5062d2eebe00bf76.diff",
            "diff_additions": 8,
            "diff_deletions": 4,
            "diff_file_size": 0,
            "diff_url": "https://github.com/igraph/igraph/commit/1eb6761323f18ca231dc0abc5062d2eebe00bf76.diff",
            "exists": true,
            "files": [
                {
                    "file_additions": 2,
                    "file_deletions": 1,
                    "file_exists": false,
                    "file_name": "fuzzing/bliss_fuzzer.cpp",
                    "file_size": 0
                },
                {
                    "file_additions": 2,
                    "file_deletions": 1,
                    "file_exists": false,
                    "file_name": "fuzzing/edge_connectivity_fuzzer.cpp",
                    "file_size": 0
                },
                {
                    "file_additions": 2,
                    "file_deletions": 1,
                    "file_exists": false,
                    "file_name": "fuzzing/vertex_connectivity_fuzzer.cpp",
                    "file_size": 0
                },
                {
                    "file_additions": 2,
                    "file_deletions": 1,
                    "file_exists": false,
                    "file_name": "fuzzing/vertex_separators_fuzzer.cpp",
                    "file_size": 0
                }
            ],
            "interesting": {
                "reopen": false,
                "status": false
            },
            "is_parent": true,
            "sha": "1eb6761323f18ca231dc0abc5062d2eebe00bf76"
        },
        {
            "associated_pull_request": [],
            "date": "2022-04-03 09:33:06+00:00",
            "diff": "igraph_igraph/issue_2020/commit_d43323b2d1053b6662296d930b46cd889e52a38d.diff",
            "diff_additions": 43,
            "diff_deletions": 33,
            "diff_file_size": 9453,
            "diff_url": "https://github.com/igraph/igraph/commit/d43323b2d1053b6662296d930b46cd889e52a38d.diff",
            "exists": true,
            "files": [
                {
                    "file_additions": 43,
                    "file_deletions": 33,
                    "file_exists": true,
                    "file_name": "src/core/set.c",
                    "file_size": 9453
                }
            ],
            "interesting": {
                "reopen": false,
                "status": false
            },
            "is_parent": false,
            "sha": "d43323b2d1053b6662296d930b46cd889e52a38d"
        },
        {
            "associated_pull_request": [],
            "date": "2022-04-05 16:15:50+00:00",
            "diff": "igraph_igraph/issue_2020/commit_0ba2bc5fc33f1e62e0c7a97f887550c8193bd3f5.diff",
            "diff_additions": 18,
            "diff_deletions": 6,
            "diff_file_size": 9418,
            "diff_url": "https://github.com/igraph/igraph/commit/0ba2bc5fc33f1e62e0c7a97f887550c8193bd3f5.diff",
            "exists": true,
            "files": [
                {
                    "file_additions": 18,
                    "file_deletions": 6,
                    "file_exists": true,
                    "file_name": "src/core/psumtree.c",
                    "file_size": 9418
                }
            ],
            "interesting": {
                "reopen": true,
                "status": false
            },
            "is_parent": false,
            "sha": "0ba2bc5fc33f1e62e0c7a97f887550c8193bd3f5"
        }
    ],
    "first_commit": "2022-04-02 19:12:43+00:00",
    "last_commit": "2022-04-05 19:06:12+00:00",
    "number": 2020,
    "pull_request": "None",
    "score": {
        "accidental_reopen_likely": false,
        "all_labels": [],
        "contains_keywords": [
            "fail",
            "fix",
            "warn"
        ],
        "fix_size": 91,
        "has_labels": [],
        "intersecting": {
            "computed_score": 0.0,
            "final_commit_size": 22,
            "intersection_size": 0,
            "previous_commits_size": 69
        },
        "is_makefile_based": true,
        "no_new_files": [
            "src/core/psumtree.c"
        ],
        "no_other_files": false,
        "num_prohibited_files": 144007,
        "prohibited_files": [
            "server/src/main/java/com/genymobile/scrcpy/Device.java",
            "server/src/main/java/com/genymobile/scrcpy/wrappers/SurfaceControl.java",
            "server/src/main/java/com/genymobile/scrcpy/Device.java",
            "server/src/main/java/com/genymobile/scrcpy/wrappers/SurfaceControl.java",
            "app/meson.build",
            "app/scrcpy.1",
            "app/src/common.h",
            "app/src/scrcpy.h",
            "app/src/server.h",
            "server/src/main/java/com/genymobile/scrcpy/Workarounds.java"
        ],
        "reopen": true,
        "reopen_events": [
            [
                "2022-04-03 09:08:14+00:00",
                "commit"
            ],
            [
                "2022-04-03 09:33:08+00:00",
                "commit"
            ],
            [
                "2022-04-05 16:15:52+00:00",
                "commit"
            ],
            [
                "2022-04-05 16:16:02+00:00",
                "closed"
            ],
            [
                "2022-04-05 18:48:43+00:00",
                "reopened"
            ],
            [
                "2022-04-05 19:06:14+00:00",
                "commit"
            ],
            [
                "2022-04-05 19:06:28+00:00",
                "closed"
            ]
        ],
        "status": false,
        "strategy": true,
        "total_changes": 112
    }
}