{
    "all_issues": 1942,
    "interesting_issues": 4,
    "last_update": "2021-05-16 19:04:11.725620",
    "license": {
        "download": "https://raw.githubusercontent.com/spdk/spdk/master/LICENSE",
        "name": "Other"
    },
    "ratio": 0.0020597322348094747,
    "size": 249511,
    "stars": 1666,
    "url": "https://github.com/spdk/spdk"
}