{
    "commits": [
        {
            "associated_pull_request": [
                "https://github.com/dosemu2/dosemu2/pull/1920"
            ],
            "date": "2023-02-22 13:59:39+00:00",
            "diff": "dosemu2_dosemu2/issue_1921/commit_2a0b157ae7c13431b71bedefc1de6f5060bd7957.diff",
            "diff_additions": 9,
            "diff_deletions": 9,
            "diff_file_size": 129121,
            "diff_url": "https://github.com/dosemu2/dosemu2/commit/2a0b157ae7c13431b71bedefc1de6f5060bd7957.diff",
            "exists": true,
            "files": [
                {
                    "file_additions": 9,
                    "file_deletions": 9,
                    "file_exists": true,
                    "file_name": "src/dosext/mfs/mfs.c",
                    "file_size": 129121
                }
            ],
            "interesting": {
                "reopen": false,
                "status": false
            },
            "is_parent": true,
            "sha": "2a0b157ae7c13431b71bedefc1de6f5060bd7957"
        },
        {
            "associated_pull_request": [],
            "date": "2023-02-23 18:15:01+00:00",
            "diff": "dosemu2_dosemu2/issue_1921/commit_fb43043aba5ac8f2957f8033540f7fccec5dcb1f.diff",
            "diff_additions": 0,
            "diff_deletions": 1,
            "diff_file_size": 52646,
            "diff_url": "https://github.com/dosemu2/dosemu2/commit/fb43043aba5ac8f2957f8033540f7fccec5dcb1f.diff",
            "exists": true,
            "files": [
                {
                    "file_additions": 0,
                    "file_deletions": 1,
                    "file_exists": true,
                    "file_name": "src/base/bios/int10.c",
                    "file_size": 52646
                }
            ],
            "interesting": {
                "reopen": false,
                "status": false
            },
            "is_parent": false,
            "sha": "fb43043aba5ac8f2957f8033540f7fccec5dcb1f"
        },
        {
            "associated_pull_request": [],
            "date": "2023-02-23 19:26:15+00:00",
            "diff": "dosemu2_dosemu2/issue_1921/commit_19b1374c5e24584b4735eed08ddb92c61486ef8c.diff",
            "diff_additions": 11,
            "diff_deletions": 4,
            "diff_file_size": 52646,
            "diff_url": "https://github.com/dosemu2/dosemu2/commit/19b1374c5e24584b4735eed08ddb92c61486ef8c.diff",
            "exists": true,
            "files": [
                {
                    "file_additions": 11,
                    "file_deletions": 4,
                    "file_exists": true,
                    "file_name": "src/base/bios/int10.c",
                    "file_size": 52646
                }
            ],
            "interesting": {
                "reopen": false,
                "status": false
            },
            "is_parent": false,
            "sha": "19b1374c5e24584b4735eed08ddb92c61486ef8c"
        },
        {
            "associated_pull_request": [],
            "date": "2023-02-24 08:54:45+00:00",
            "diff": "dosemu2_dosemu2/issue_1921/commit_d308c1befe430f827e9e0fe8f4adfdbbdbf3f0cd.diff",
            "diff_additions": 22,
            "diff_deletions": 8,
            "diff_file_size": 51037,
            "diff_url": "https://github.com/dosemu2/dosemu2/commit/d308c1befe430f827e9e0fe8f4adfdbbdbf3f0cd.diff",
            "exists": true,
            "files": [
                {
                    "file_additions": 11,
                    "file_deletions": 4,
                    "file_exists": true,
                    "file_name": "src/base/init/config.c",
                    "file_size": 44498
                },
                {
                    "file_additions": 11,
                    "file_deletions": 4,
                    "file_exists": true,
                    "file_name": "src/base/kbd_unicode/keyb_raw.c",
                    "file_size": 6539
                }
            ],
            "interesting": {
                "reopen": true,
                "status": false
            },
            "is_parent": false,
            "sha": "d308c1befe430f827e9e0fe8f4adfdbbdbf3f0cd"
        },
        {
            "associated_pull_request": [],
            "date": "2023-02-24 13:33:16+00:00",
            "diff": "dosemu2_dosemu2/issue_1921/commit_fe880e936c491c2174f8d09117f7df8784b45b92.diff",
            "diff_additions": 8,
            "diff_deletions": 0,
            "diff_file_size": 5672,
            "diff_url": "https://github.com/dosemu2/dosemu2/commit/fe880e936c491c2174f8d09117f7df8784b45b92.diff",
            "exists": true,
            "files": [
                {
                    "file_additions": 8,
                    "file_deletions": 0,
                    "file_exists": true,
                    "file_name": "src/base/bios/int16.c",
                    "file_size": 5672
                }
            ],
            "interesting": {
                "reopen": false,
                "status": false
            },
            "is_parent": false,
            "sha": "fe880e936c491c2174f8d09117f7df8784b45b92"
        },
        {
            "associated_pull_request": [],
            "date": "2023-02-25 17:18:12+00:00",
            "diff": "dosemu2_dosemu2/issue_1921/commit_f60e5f91690626d3512e5b51ad133df348fdfc35.diff",
            "diff_additions": 11,
            "diff_deletions": 1,
            "diff_file_size": 45897,
            "diff_url": "https://github.com/dosemu2/dosemu2/commit/f60e5f91690626d3512e5b51ad133df348fdfc35.diff",
            "exists": true,
            "files": [
                {
                    "file_additions": 11,
                    "file_deletions": 1,
                    "file_exists": true,
                    "file_name": "src/plugin/term/keyb_slang.c",
                    "file_size": 45897
                }
            ],
            "interesting": {
                "reopen": false,
                "status": false
            },
            "is_parent": false,
            "sha": "f60e5f91690626d3512e5b51ad133df348fdfc35"
        },
        {
            "associated_pull_request": [],
            "date": "2023-02-25 18:08:51+00:00",
            "diff": "dosemu2_dosemu2/issue_1921/commit_4623aea84213584204eaed91d0f641a78d5d65ae.diff",
            "diff_additions": 3,
            "diff_deletions": 0,
            "diff_file_size": 45897,
            "diff_url": "https://github.com/dosemu2/dosemu2/commit/4623aea84213584204eaed91d0f641a78d5d65ae.diff",
            "exists": true,
            "files": [
                {
                    "file_additions": 3,
                    "file_deletions": 0,
                    "file_exists": true,
                    "file_name": "src/plugin/term/keyb_slang.c",
                    "file_size": 45897
                }
            ],
            "interesting": {
                "reopen": false,
                "status": false
            },
            "is_parent": false,
            "sha": "4623aea84213584204eaed91d0f641a78d5d65ae"
        }
    ],
    "first_commit": "2023-02-22 13:59:39+00:00",
    "last_commit": "2023-02-25 18:08:51+00:00",
    "number": 1921,
    "pull_request": "None",
    "score": {
        "accidental_reopen_likely": false,
        "all_labels": [],
        "contains_keywords": [
            "work",
            "fail",
            "chang",
            "fix",
            "CI",
            "patch",
            "debug",
            "test",
            "attempt",
            "fault",
            "remov",
            "bug",
            "error",
            "problem",
            "report"
        ],
        "fix_size": 69,
        "has_labels": [],
        "intersecting": {
            "computed_score": 0.25,
            "final_commit_size": 4,
            "intersection_size": 1,
            "previous_commits_size": 66
        },
        "is_makefile_based": true,
        "no_new_files": [],
        "no_other_files": false,
        "num_prohibited_files": 491666,
        "prohibited_files": [
            "server/src/main/java/com/genymobile/scrcpy/Device.java",
            "server/src/main/java/com/genymobile/scrcpy/wrappers/SurfaceControl.java",
            "server/src/main/java/com/genymobile/scrcpy/Device.java",
            "server/src/main/java/com/genymobile/scrcpy/wrappers/SurfaceControl.java",
            "app/meson.build",
            "app/scrcpy.1",
            "app/src/common.h",
            "app/src/scrcpy.h",
            "app/src/server.h",
            "server/src/main/java/com/genymobile/scrcpy/Workarounds.java"
        ],
        "reopen": true,
        "reopen_events": [
            [
                "2023-02-23 18:16:31+00:00",
                "closed"
            ],
            [
                "2023-02-23 18:16:31+00:00",
                "commit"
            ],
            [
                "2023-02-23 19:26:50+00:00",
                "commit"
            ],
            [
                "2023-02-24 08:56:24+00:00",
                "commit"
            ],
            [
                "2023-02-24 13:18:21+00:00",
                "reopened"
            ],
            [
                "2023-02-24 13:33:38+00:00",
                "commit"
            ],
            [
                "2023-02-25 18:14:35+00:00",
                "commit"
            ],
            [
                "2023-02-25 18:14:36+00:00",
                "closed"
            ],
            [
                "2023-02-25 18:14:36+00:00",
                "commit"
            ]
        ],
        "status": false,
        "strategy": true,
        "total_changes": 87
    }
}