{
    "category": [
        "build/refactor/preprocessing",
        "network/protocol"
    ],
    "commits": [
        {
            "associated_pull_request": [
                "https://github.com/jerryscript-project/jerryscript/pull/1577"
            ],
            "date": "2017-03-08 09:58:25",
            "diff": "jerryscript-project_jerryscript/issue_1649/commit_a2a160d6f9e4b5c990881819ed3f38753dbcb130.diff",
            "diff_additions": 159,
            "diff_deletions": 65,
            "diff_file_size": 309042,
            "diff_url": "https://github.com/jerryscript-project/jerryscript/commit/a2a160d6f9e4b5c990881819ed3f38753dbcb130.diff",
            "exists": true,
            "files": [
                {
                    "file_additions": 91,
                    "file_deletions": 0,
                    "file_exists": true,
                    "file_name": "jerry-core/ecma/operations/ecma-exceptions.c",
                    "file_size": 16401
                },
                {
                    "file_additions": 18,
                    "file_deletions": 2,
                    "file_exists": true,
                    "file_name": "jerry-core/ecma/operations/ecma-get-put-value.c",
                    "file_size": 10791
                },
                {
                    "file_additions": 9,
                    "file_deletions": 1,
                    "file_exists": true,
                    "file_name": "jerry-core/ecma/operations/ecma-reference.c",
                    "file_size": 12783
                },
                {
                    "file_additions": 17,
                    "file_deletions": 51,
                    "file_exists": true,
                    "file_name": "jerry-core/parser/js/js-parser.c",
                    "file_size": 91321
                },
                {
                    "file_additions": 24,
                    "file_deletions": 11,
                    "file_exists": true,
                    "file_name": "jerry-core/vm/vm.c",
                    "file_size": 177746
                }
            ],
            "interesting": {
                "reopen": false,
                "status": false
            },
            "is_parent": true,
            "sha": "a2a160d6f9e4b5c990881819ed3f38753dbcb130"
        },
        {
            "associated_pull_request": [],
            "date": "2017-03-09 09:09:22",
            "diff": "jerryscript-project_jerryscript/issue_1649/commit_3d9d51da0adbd75fd21a9dcd8f9bb999f7b58a1e.diff",
            "diff_additions": 10,
            "diff_deletions": 10,
            "diff_file_size": 35809,
            "diff_url": "https://github.com/jerryscript-project/jerryscript/commit/3d9d51da0adbd75fd21a9dcd8f9bb999f7b58a1e.diff",
            "exists": true,
            "files": [
                {
                    "file_additions": 1,
                    "file_deletions": 1,
                    "file_exists": true,
                    "file_name": "jerry-core/jmem/jmem-allocator.c",
                    "file_size": 6173
                },
                {
                    "file_additions": 1,
                    "file_deletions": 1,
                    "file_exists": true,
                    "file_name": "jerry-core/jmem/jmem-poolman.c",
                    "file_size": 5168
                },
                {
                    "file_additions": 1,
                    "file_deletions": 1,
                    "file_exists": true,
                    "file_name": "jerry-core/parser/regexp/re-compiler.c",
                    "file_size": 5380
                },
                {
                    "file_additions": 1,
                    "file_deletions": 1,
                    "file_exists": true,
                    "file_name": "targets/curie_bsp/source/curie-bsp-port.c",
                    "file_size": 2052
                },
                {
                    "file_additions": 1,
                    "file_deletions": 1,
                    "file_exists": false,
                    "file_name": "targets/default/jerry-port-default-date.c",
                    "file_size": 0
                },
                {
                    "file_additions": 1,
                    "file_deletions": 1,
                    "file_exists": false,
                    "file_name": "targets/default/jerry-port-default-fatal.c",
                    "file_size": 0
                },
                {
                    "file_additions": 1,
                    "file_deletions": 1,
                    "file_exists": false,
                    "file_name": "targets/mbed/source/port/jerry_port.c",
                    "file_size": 0
                },
                {
                    "file_additions": 1,
                    "file_deletions": 1,
                    "file_exists": true,
                    "file_name": "targets/mbedos5/source/jerry_port_mbed.c",
                    "file_size": 2846
                },
                {
                    "file_additions": 1,
                    "file_deletions": 1,
                    "file_exists": true,
                    "file_name": "targets/nuttx-stm32f4/jerry_main.c",
                    "file_size": 12130
                },
                {
                    "file_additions": 1,
                    "file_deletions": 1,
                    "file_exists": true,
                    "file_name": "targets/zephyr/src/jerry-port.c",
                    "file_size": 2060
                }
            ],
            "interesting": {
                "reopen": false,
                "status": true
            },
            "is_parent": false,
            "sha": "3d9d51da0adbd75fd21a9dcd8f9bb999f7b58a1e"
        },
        {
            "associated_pull_request": [
                "https://github.com/jerryscript-project/jerryscript/pull/1651"
            ],
            "date": "2017-03-09 09:09:22",
            "diff": "jerryscript-project_jerryscript/issue_1649/commit_e99e41c5350bbba91e4e098cdb680a4146afb50e.diff",
            "diff_additions": 11,
            "diff_deletions": 11,
            "diff_file_size": 35809,
            "diff_url": "https://github.com/jerryscript-project/jerryscript/commit/e99e41c5350bbba91e4e098cdb680a4146afb50e.diff",
            "exists": true,
            "files": [
                {
                    "file_additions": 1,
                    "file_deletions": 1,
                    "file_exists": false,
                    "file_name": "jerry-core/debugger/jerry-debugger-ws.c",
                    "file_size": 0
                },
                {
                    "file_additions": 1,
                    "file_deletions": 1,
                    "file_exists": true,
                    "file_name": "jerry-core/jmem/jmem-allocator.c",
                    "file_size": 6173
                },
                {
                    "file_additions": 1,
                    "file_deletions": 1,
                    "file_exists": true,
                    "file_name": "jerry-core/jmem/jmem-poolman.c",
                    "file_size": 5168
                },
                {
                    "file_additions": 1,
                    "file_deletions": 1,
                    "file_exists": true,
                    "file_name": "jerry-core/parser/regexp/re-compiler.c",
                    "file_size": 5380
                },
                {
                    "file_additions": 1,
                    "file_deletions": 1,
                    "file_exists": true,
                    "file_name": "targets/curie_bsp/source/curie-bsp-port.c",
                    "file_size": 2052
                },
                {
                    "file_additions": 1,
                    "file_deletions": 1,
                    "file_exists": false,
                    "file_name": "targets/default/jerry-port-default-date.c",
                    "file_size": 0
                },
                {
                    "file_additions": 1,
                    "file_deletions": 1,
                    "file_exists": false,
                    "file_name": "targets/default/jerry-port-default-fatal.c",
                    "file_size": 0
                },
                {
                    "file_additions": 1,
                    "file_deletions": 1,
                    "file_exists": false,
                    "file_name": "targets/mbed/source/port/jerry_port.c",
                    "file_size": 0
                },
                {
                    "file_additions": 1,
                    "file_deletions": 1,
                    "file_exists": true,
                    "file_name": "targets/mbedos5/source/jerry_port_mbed.c",
                    "file_size": 2846
                },
                {
                    "file_additions": 1,
                    "file_deletions": 1,
                    "file_exists": true,
                    "file_name": "targets/nuttx-stm32f4/jerry_main.c",
                    "file_size": 12130
                },
                {
                    "file_additions": 1,
                    "file_deletions": 1,
                    "file_exists": true,
                    "file_name": "targets/zephyr/src/jerry-port.c",
                    "file_size": 2060
                }
            ],
            "interesting": {
                "reopen": false,
                "status": false
            },
            "is_parent": false,
            "sha": "e99e41c5350bbba91e4e098cdb680a4146afb50e"
        },
        {
            "associated_pull_request": [
                "https://github.com/jerryscript-project/jerryscript/pull/1651"
            ],
            "date": "2017-03-09 12:41:26",
            "diff": "jerryscript-project_jerryscript/issue_1649/commit_f8dd54abb64f9520383c09478f3b74cd450365d4.diff",
            "diff_additions": 11,
            "diff_deletions": 11,
            "diff_file_size": 35809,
            "diff_url": "https://github.com/jerryscript-project/jerryscript/commit/f8dd54abb64f9520383c09478f3b74cd450365d4.diff",
            "exists": true,
            "files": [
                {
                    "file_additions": 1,
                    "file_deletions": 1,
                    "file_exists": false,
                    "file_name": "jerry-core/debugger/jerry-debugger-ws.c",
                    "file_size": 0
                },
                {
                    "file_additions": 1,
                    "file_deletions": 1,
                    "file_exists": true,
                    "file_name": "jerry-core/jmem/jmem-allocator.c",
                    "file_size": 6173
                },
                {
                    "file_additions": 1,
                    "file_deletions": 1,
                    "file_exists": true,
                    "file_name": "jerry-core/jmem/jmem-poolman.c",
                    "file_size": 5168
                },
                {
                    "file_additions": 1,
                    "file_deletions": 1,
                    "file_exists": true,
                    "file_name": "jerry-core/parser/regexp/re-compiler.c",
                    "file_size": 5380
                },
                {
                    "file_additions": 1,
                    "file_deletions": 1,
                    "file_exists": true,
                    "file_name": "targets/curie_bsp/source/curie-bsp-port.c",
                    "file_size": 2052
                },
                {
                    "file_additions": 1,
                    "file_deletions": 1,
                    "file_exists": false,
                    "file_name": "targets/default/jerry-port-default-date.c",
                    "file_size": 0
                },
                {
                    "file_additions": 1,
                    "file_deletions": 1,
                    "file_exists": false,
                    "file_name": "targets/default/jerry-port-default-fatal.c",
                    "file_size": 0
                },
                {
                    "file_additions": 1,
                    "file_deletions": 1,
                    "file_exists": false,
                    "file_name": "targets/mbed/source/port/jerry_port.c",
                    "file_size": 0
                },
                {
                    "file_additions": 1,
                    "file_deletions": 1,
                    "file_exists": true,
                    "file_name": "targets/mbedos5/source/jerry_port_mbed.c",
                    "file_size": 2846
                },
                {
                    "file_additions": 1,
                    "file_deletions": 1,
                    "file_exists": true,
                    "file_name": "targets/nuttx-stm32f4/jerry_main.c",
                    "file_size": 12130
                },
                {
                    "file_additions": 1,
                    "file_deletions": 1,
                    "file_exists": true,
                    "file_name": "targets/zephyr/src/jerry-port.c",
                    "file_size": 2060
                }
            ],
            "interesting": {
                "reopen": false,
                "status": false
            },
            "is_parent": false,
            "sha": "f8dd54abb64f9520383c09478f3b74cd450365d4"
        }
    ],
    "first_commit": "2017-03-08 09:58:25",
    "last_commit": "2017-03-09 12:41:26",
    "number": 1649,
    "pull_request": "None",
    "score": {
        "accidental_reopen_likely": false,
        "all_labels": [],
        "contains_keywords": [
            "warn",
            "error"
        ],
        "fix_size": 22,
        "has_labels": [],
        "intersecting": {
            "computed_score": 1.0,
            "final_commit_size": 22,
            "intersection_size": 22,
            "previous_commits_size": 22
        },
        "is_makefile_based": true,
        "no_new_files": [],
        "no_other_files": false,
        "num_prohibited_files": 95320,
        "prohibited_files": [
            "kill.h",
            "meminfo.h",
            "kill.h",
            "meminfo.h",
            "kill.h",
            "meminfo.h",
            "testsuite_cli_test.go",
            "testsuite_cli_test.go",
            "common.mk",
            "i3bar/include/draw_util.h"
        ],
        "reopen": false,
        "reopen_events": [
            [
                "2017-03-09 09:12:45",
                "commit"
            ],
            [
                "2017-03-09 10:57:11",
                "commit"
            ],
            [
                "2017-03-09 11:53:48",
                "commit"
            ],
            [
                "2017-03-09 12:41:27",
                "closed"
            ],
            [
                "2017-03-09 12:41:28",
                "commit"
            ]
        ],
        "status": true,
        "strategy": true,
        "total_changes": 288
    }
}