{
    "category": [
        "feature request",
        "wrong API usage"
    ],
    "commits": [
        {
            "associated_pull_request": [],
            "date": "2018-03-07 17:13:24",
            "diff": "phpredis_phpredis/issue_1302/commit_fd93e26fc42ae0be6c5d5510516933e7d9350722.diff",
            "diff_additions": 1,
            "diff_deletions": 6,
            "diff_file_size": 34286,
            "diff_url": "https://github.com/phpredis/phpredis/commit/fd93e26fc42ae0be6c5d5510516933e7d9350722.diff",
            "exists": true,
            "files": [
                {
                    "file_additions": 1,
                    "file_deletions": 6,
                    "file_exists": true,
                    "file_name": "redis_session.c",
                    "file_size": 34286
                }
            ],
            "interesting": {
                "reopen": false,
                "status": false
            },
            "is_parent": true,
            "sha": "fd93e26fc42ae0be6c5d5510516933e7d9350722"
        },
        {
            "associated_pull_request": [],
            "date": "2018-03-22 20:57:32",
            "diff": "phpredis_phpredis/issue_1302/commit_ec8d2412e75f2f4aa5ebacc6d2c95e9607378b57.diff",
            "diff_additions": 24,
            "diff_deletions": 6,
            "diff_file_size": 265511,
            "diff_url": "https://github.com/phpredis/phpredis/commit/ec8d2412e75f2f4aa5ebacc6d2c95e9607378b57.diff",
            "exists": true,
            "files": [
                {
                    "file_additions": 6,
                    "file_deletions": 6,
                    "file_exists": true,
                    "file_name": "redis.c",
                    "file_size": 121300
                },
                {
                    "file_additions": 18,
                    "file_deletions": 0,
                    "file_exists": true,
                    "file_name": "redis_commands.c",
                    "file_size": 144211
                }
            ],
            "interesting": {
                "reopen": false,
                "status": false
            },
            "is_parent": false,
            "sha": "ec8d2412e75f2f4aa5ebacc6d2c95e9607378b57"
        },
        {
            "associated_pull_request": [],
            "date": "2018-04-10 20:45:13",
            "diff": "phpredis_phpredis/issue_1302/commit_5908aa477a33ff79b4252177ec0766fa9f7bac07.diff",
            "diff_additions": 59,
            "diff_deletions": 65,
            "diff_file_size": 37011,
            "diff_url": "https://github.com/phpredis/phpredis/commit/5908aa477a33ff79b4252177ec0766fa9f7bac07.diff",
            "exists": true,
            "files": [
                {
                    "file_additions": 59,
                    "file_deletions": 65,
                    "file_exists": true,
                    "file_name": "redis_array.c",
                    "file_size": 37011
                }
            ],
            "interesting": {
                "reopen": false,
                "status": true
            },
            "is_parent": false,
            "sha": "5908aa477a33ff79b4252177ec0766fa9f7bac07"
        },
        {
            "associated_pull_request": [],
            "date": "2018-04-10 20:45:13",
            "diff": "phpredis_phpredis/issue_1302/commit_f1e175d11c325d96c67bbf5d7f7088315927ab35.diff",
            "diff_additions": 59,
            "diff_deletions": 65,
            "diff_file_size": 37011,
            "diff_url": "https://github.com/phpredis/phpredis/commit/f1e175d11c325d96c67bbf5d7f7088315927ab35.diff",
            "exists": true,
            "files": [
                {
                    "file_additions": 59,
                    "file_deletions": 65,
                    "file_exists": true,
                    "file_name": "redis_array.c",
                    "file_size": 37011
                }
            ],
            "interesting": {
                "reopen": false,
                "status": false
            },
            "is_parent": false,
            "sha": "f1e175d11c325d96c67bbf5d7f7088315927ab35"
        },
        {
            "associated_pull_request": [],
            "date": "2018-04-22 19:22:09",
            "diff": "phpredis_phpredis/issue_1302/commit_8e83383ca2b074e48228ccb51d71f7d311357958.diff",
            "diff_additions": 65,
            "diff_deletions": 8,
            "diff_file_size": 264366,
            "diff_url": "https://github.com/phpredis/phpredis/commit/8e83383ca2b074e48228ccb51d71f7d311357958.diff",
            "exists": true,
            "files": [
                {
                    "file_additions": 4,
                    "file_deletions": 0,
                    "file_exists": true,
                    "file_name": "redis.c",
                    "file_size": 121300
                },
                {
                    "file_additions": 4,
                    "file_deletions": 0,
                    "file_exists": true,
                    "file_name": "redis_array.c",
                    "file_size": 37011
                },
                {
                    "file_additions": 57,
                    "file_deletions": 8,
                    "file_exists": true,
                    "file_name": "redis_cluster.c",
                    "file_size": 106055
                }
            ],
            "interesting": {
                "reopen": false,
                "status": true
            },
            "is_parent": false,
            "sha": "8e83383ca2b074e48228ccb51d71f7d311357958"
        },
        {
            "associated_pull_request": [
                "https://github.com/phpredis/phpredis/pull/1340"
            ],
            "date": "2018-03-22 20:57:32",
            "diff": "phpredis_phpredis/issue_1302/commit_beb6e8f3aba298f79d23730a2ce95cef47698bd1.diff",
            "diff_additions": 24,
            "diff_deletions": 6,
            "diff_file_size": 265511,
            "diff_url": "https://github.com/phpredis/phpredis/commit/beb6e8f3aba298f79d23730a2ce95cef47698bd1.diff",
            "exists": true,
            "files": [
                {
                    "file_additions": 6,
                    "file_deletions": 6,
                    "file_exists": true,
                    "file_name": "redis.c",
                    "file_size": 121300
                },
                {
                    "file_additions": 18,
                    "file_deletions": 0,
                    "file_exists": true,
                    "file_name": "redis_commands.c",
                    "file_size": 144211
                }
            ],
            "interesting": {
                "reopen": false,
                "status": false
            },
            "is_parent": false,
            "sha": "beb6e8f3aba298f79d23730a2ce95cef47698bd1"
        },
        {
            "associated_pull_request": [
                "https://github.com/phpredis/phpredis/pull/1340"
            ],
            "date": "2018-04-10 20:45:13",
            "diff": "phpredis_phpredis/issue_1302/commit_acd10409bc84f9d179281bcc9acd2c9f131578a7.diff",
            "diff_additions": 32,
            "diff_deletions": 7,
            "diff_file_size": 37011,
            "diff_url": "https://github.com/phpredis/phpredis/commit/acd10409bc84f9d179281bcc9acd2c9f131578a7.diff",
            "exists": true,
            "files": [
                {
                    "file_additions": 32,
                    "file_deletions": 7,
                    "file_exists": true,
                    "file_name": "redis_array.c",
                    "file_size": 37011
                }
            ],
            "interesting": {
                "reopen": false,
                "status": false
            },
            "is_parent": false,
            "sha": "acd10409bc84f9d179281bcc9acd2c9f131578a7"
        },
        {
            "associated_pull_request": [
                "https://github.com/phpredis/phpredis/pull/1340"
            ],
            "date": "2018-04-22 19:22:09",
            "diff": "phpredis_phpredis/issue_1302/commit_742cdd05940815b3ed41d5d1db1182d6eaa783b0.diff",
            "diff_additions": 65,
            "diff_deletions": 8,
            "diff_file_size": 264366,
            "diff_url": "https://github.com/phpredis/phpredis/commit/742cdd05940815b3ed41d5d1db1182d6eaa783b0.diff",
            "exists": true,
            "files": [
                {
                    "file_additions": 4,
                    "file_deletions": 0,
                    "file_exists": true,
                    "file_name": "redis.c",
                    "file_size": 121300
                },
                {
                    "file_additions": 4,
                    "file_deletions": 0,
                    "file_exists": true,
                    "file_name": "redis_array.c",
                    "file_size": 37011
                },
                {
                    "file_additions": 57,
                    "file_deletions": 8,
                    "file_exists": true,
                    "file_name": "redis_cluster.c",
                    "file_size": 106055
                }
            ],
            "interesting": {
                "reopen": false,
                "status": false
            },
            "is_parent": false,
            "sha": "742cdd05940815b3ed41d5d1db1182d6eaa783b0"
        }
    ],
    "first_commit": "2018-03-07 17:13:24",
    "last_commit": "2018-04-22 19:26:13",
    "number": 1302,
    "pull_request": "None",
    "score": {
        "accidental_reopen_likely": false,
        "all_labels": [
            "improvement"
        ],
        "contains_keywords": [
            "test",
            "issu",
            "work"
        ],
        "fix_size": 243,
        "has_labels": [],
        "intersecting": {
            "computed_score": 0.9473684210526315,
            "final_commit_size": 76,
            "intersection_size": 72,
            "previous_commits_size": 239
        },
        "is_makefile_based": false,
        "no_new_files": [],
        "no_other_files": false,
        "num_prohibited_files": 172961,
        "prohibited_files": [
            "hal/inc/pinmap_hal.h",
            "Debug/marvin.bin",
            "Debug/marvin.elf",
            "Debug/marvin.hex",
            "Debug/marvin.bin",
            "Debug/marvin.elf",
            "Debug/marvin.hex",
            "inc/spark_utilities.h",
            "Debug/marvin.bin",
            "Debug/marvin.elf"
        ],
        "reopen": false,
        "reopen_events": [
            [
                "2018-03-22 21:00:29",
                "commit"
            ],
            [
                "2018-04-10 20:47:39",
                "commit"
            ],
            [
                "2018-04-10 20:57:00",
                "commit"
            ],
            [
                "2018-04-22 19:22:45",
                "commit"
            ],
            [
                "2018-04-22 19:26:31",
                "commit"
            ],
            [
                "2018-04-22 19:26:31",
                "commit"
            ],
            [
                "2018-04-22 19:26:31",
                "commit"
            ],
            [
                "2018-04-23 06:19:16",
                "closed"
            ]
        ],
        "status": true,
        "strategy": true,
        "total_changes": 500
    }
}