{
    "category": [
        "hardware/OS",
        "feature request"
    ],
    "commits": [
        {
            "associated_pull_request": [],
            "date": "2014-09-05 06:06:55",
            "diff": "openzfs_zfs/issue_224/commit_1ca56e603395b2d84c8043d5ff18f2082f57e6f1.diff",
            "diff_additions": 9,
            "diff_deletions": 9,
            "diff_file_size": 127286,
            "diff_url": "https://github.com/openzfs/zfs/commit/1ca56e603395b2d84c8043d5ff18f2082f57e6f1.diff",
            "exists": true,
            "files": [
                {
                    "file_additions": 9,
                    "file_deletions": 9,
                    "file_exists": true,
                    "file_name": "lib/libzfs/libzfs_pool.c",
                    "file_size": 127286
                }
            ],
            "interesting": {
                "reopen": false,
                "status": false
            },
            "is_parent": true,
            "sha": "1ca56e603395b2d84c8043d5ff18f2082f57e6f1"
        },
        {
            "associated_pull_request": [],
            "date": "2014-08-04 11:09:32",
            "diff": "openzfs_zfs/issue_224/commit_cd3939c5f06945a3883a362379d0c12e57f31a4d.diff",
            "diff_additions": 121,
            "diff_deletions": 37,
            "diff_file_size": 26640,
            "diff_url": "https://github.com/openzfs/zfs/commit/cd3939c5f06945a3883a362379d0c12e57f31a4d.diff",
            "exists": true,
            "files": [
                {
                    "file_additions": 1,
                    "file_deletions": 1,
                    "file_exists": true,
                    "file_name": "module/zfs/zfs_replay.c",
                    "file_size": 26640
                },
                {
                    "file_additions": 116,
                    "file_deletions": 34,
                    "file_exists": false,
                    "file_name": "module/zfs/zpl_file.c",
                    "file_size": 0
                },
                {
                    "file_additions": 4,
                    "file_deletions": 2,
                    "file_exists": false,
                    "file_name": "module/zfs/zpl_xattr.c",
                    "file_size": 0
                }
            ],
            "interesting": {
                "reopen": false,
                "status": true
            },
            "is_parent": false,
            "sha": "cd3939c5f06945a3883a362379d0c12e57f31a4d"
        },
        {
            "associated_pull_request": [],
            "date": "2013-03-12 01:16:36",
            "diff": "openzfs_zfs/issue_224/commit_acf0ade362cb8b26d67770114ee6fa17816e6b65.diff",
            "diff_additions": 6,
            "diff_deletions": 62,
            "diff_file_size": 0,
            "diff_url": "https://github.com/openzfs/zfs/commit/acf0ade362cb8b26d67770114ee6fa17816e6b65.diff",
            "exists": true,
            "files": [
                {
                    "file_additions": 6,
                    "file_deletions": 49,
                    "file_exists": false,
                    "file_name": "module/spl/spl-generic.c",
                    "file_size": 0
                },
                {
                    "file_additions": 0,
                    "file_deletions": 13,
                    "file_exists": false,
                    "file_name": "module/spl/spl-proc.c",
                    "file_size": 0
                }
            ],
            "interesting": {
                "reopen": false,
                "status": false
            },
            "is_parent": false,
            "sha": "acf0ade362cb8b26d67770114ee6fa17816e6b65"
        },
        {
            "associated_pull_request": [],
            "date": "2013-03-12 01:16:36",
            "diff": "openzfs_zfs/issue_224/commit_acf0ade362cb8b26d67770114ee6fa17816e6b65.diff",
            "diff_additions": 6,
            "diff_deletions": 62,
            "diff_file_size": 0,
            "diff_url": "https://github.com/openzfs/zfs/commit/acf0ade362cb8b26d67770114ee6fa17816e6b65.diff",
            "exists": true,
            "files": [
                {
                    "file_additions": 6,
                    "file_deletions": 49,
                    "file_exists": false,
                    "file_name": "module/spl/spl-generic.c",
                    "file_size": 0
                },
                {
                    "file_additions": 0,
                    "file_deletions": 13,
                    "file_exists": false,
                    "file_name": "module/spl/spl-proc.c",
                    "file_size": 0
                }
            ],
            "interesting": {
                "reopen": true,
                "status": false
            },
            "is_parent": false,
            "sha": "acf0ade362cb8b26d67770114ee6fa17816e6b65"
        },
        {
            "associated_pull_request": [],
            "date": "2018-08-20 22:26:20",
            "diff": "openzfs_zfs/issue_224/commit_5c6223ed5a7d51fd19b0c1a71784034202dd0697.diff",
            "diff_additions": 53,
            "diff_deletions": 0,
            "diff_file_size": 0,
            "diff_url": "https://github.com/openzfs/zfs/commit/5c6223ed5a7d51fd19b0c1a71784034202dd0697.diff",
            "exists": true,
            "files": [
                {
                    "file_additions": 53,
                    "file_deletions": 0,
                    "file_exists": false,
                    "file_name": "module/zfs/zpl_file.c",
                    "file_size": 0
                }
            ],
            "interesting": {
                "reopen": false,
                "status": true
            },
            "is_parent": false,
            "sha": "5c6223ed5a7d51fd19b0c1a71784034202dd0697"
        },
        {
            "associated_pull_request": [],
            "date": "2018-08-20 22:26:20",
            "diff": "openzfs_zfs/issue_224/commit_2d2584f9fc84e4d993ed940888b9cfd07f5ca01b.diff",
            "diff_additions": 53,
            "diff_deletions": 0,
            "diff_file_size": 0,
            "diff_url": "https://github.com/openzfs/zfs/commit/2d2584f9fc84e4d993ed940888b9cfd07f5ca01b.diff",
            "exists": true,
            "files": [
                {
                    "file_additions": 53,
                    "file_deletions": 0,
                    "file_exists": false,
                    "file_name": "module/zfs/zpl_file.c",
                    "file_size": 0
                }
            ],
            "interesting": {
                "reopen": false,
                "status": true
            },
            "is_parent": false,
            "sha": "2d2584f9fc84e4d993ed940888b9cfd07f5ca01b"
        },
        {
            "associated_pull_request": [],
            "date": "2018-08-20 22:26:20",
            "diff": "openzfs_zfs/issue_224/commit_a7796d67881439331a74934b727a519806c15737.diff",
            "diff_additions": 52,
            "diff_deletions": 0,
            "diff_file_size": 0,
            "diff_url": "https://github.com/openzfs/zfs/commit/a7796d67881439331a74934b727a519806c15737.diff",
            "exists": true,
            "files": [
                {
                    "file_additions": 52,
                    "file_deletions": 0,
                    "file_exists": false,
                    "file_name": "module/zfs/zpl_file.c",
                    "file_size": 0
                }
            ],
            "interesting": {
                "reopen": false,
                "status": true
            },
            "is_parent": false,
            "sha": "a7796d67881439331a74934b727a519806c15737"
        },
        {
            "associated_pull_request": [],
            "date": "2018-08-20 22:26:20",
            "diff": "openzfs_zfs/issue_224/commit_17153a0c3833f13c14f240247f164ef57aefc4be.diff",
            "diff_additions": 52,
            "diff_deletions": 0,
            "diff_file_size": 0,
            "diff_url": "https://github.com/openzfs/zfs/commit/17153a0c3833f13c14f240247f164ef57aefc4be.diff",
            "exists": true,
            "files": [
                {
                    "file_additions": 52,
                    "file_deletions": 0,
                    "file_exists": false,
                    "file_name": "module/zfs/zpl_file.c",
                    "file_size": 0
                }
            ],
            "interesting": {
                "reopen": false,
                "status": true
            },
            "is_parent": false,
            "sha": "17153a0c3833f13c14f240247f164ef57aefc4be"
        },
        {
            "associated_pull_request": [],
            "date": "2018-08-20 22:26:20",
            "diff": "openzfs_zfs/issue_224/commit_61bd6cc26638e4a9dc79454df7a4367f159b2e13.diff",
            "diff_additions": 52,
            "diff_deletions": 0,
            "diff_file_size": 0,
            "diff_url": "https://github.com/openzfs/zfs/commit/61bd6cc26638e4a9dc79454df7a4367f159b2e13.diff",
            "exists": true,
            "files": [
                {
                    "file_additions": 52,
                    "file_deletions": 0,
                    "file_exists": false,
                    "file_name": "module/zfs/zpl_file.c",
                    "file_size": 0
                }
            ],
            "interesting": {
                "reopen": false,
                "status": true
            },
            "is_parent": false,
            "sha": "61bd6cc26638e4a9dc79454df7a4367f159b2e13"
        },
        {
            "associated_pull_request": [
                "https://github.com/openzfs/zfs/pull/7823"
            ],
            "date": "2018-08-20 22:26:20",
            "diff": "openzfs_zfs/issue_224/commit_5f1ea5380c41d256ffd3e16315acff18baa36f4d.diff",
            "diff_additions": 52,
            "diff_deletions": 0,
            "diff_file_size": 0,
            "diff_url": "https://github.com/openzfs/zfs/commit/5f1ea5380c41d256ffd3e16315acff18baa36f4d.diff",
            "exists": true,
            "files": [
                {
                    "file_additions": 52,
                    "file_deletions": 0,
                    "file_exists": false,
                    "file_name": "module/zfs/zpl_file.c",
                    "file_size": 0
                }
            ],
            "interesting": {
                "reopen": false,
                "status": true
            },
            "is_parent": false,
            "sha": "5f1ea5380c41d256ffd3e16315acff18baa36f4d"
        },
        {
            "associated_pull_request": [
                "https://github.com/openzfs/zfs/pull/7823"
            ],
            "date": "2018-08-27 17:04:21",
            "diff": "openzfs_zfs/issue_224/commit_a584ef26053065f486d46a7335bea222cb03eeea.diff",
            "diff_additions": 52,
            "diff_deletions": 0,
            "diff_file_size": 0,
            "diff_url": "https://github.com/openzfs/zfs/commit/a584ef26053065f486d46a7335bea222cb03eeea.diff",
            "exists": true,
            "files": [
                {
                    "file_additions": 52,
                    "file_deletions": 0,
                    "file_exists": false,
                    "file_name": "module/zfs/zpl_file.c",
                    "file_size": 0
                }
            ],
            "interesting": {
                "reopen": false,
                "status": true
            },
            "is_parent": false,
            "sha": "a584ef26053065f486d46a7335bea222cb03eeea"
        }
    ],
    "first_commit": "2014-09-05 16:19:01",
    "last_commit": "2018-08-27 17:04:21",
    "number": 224,
    "pull_request": "None",
    "score": {
        "accidental_reopen_likely": false,
        "all_labels": [
            "Type: Feature"
        ],
        "contains_keywords": [
            "fail",
            "report",
            "warn",
            "chang",
            "reason",
            "confirm",
            "error",
            "workaround",
            "bug",
            "problem",
            "crash",
            "test",
            "fix",
            "patch",
            "remov",
            "attempt",
            "issu",
            "work",
            "perform",
            "CI",
            "fault",
            "debug"
        ],
        "fix_size": 262,
        "has_labels": [],
        "intersecting": {
            "computed_score": 1.0,
            "final_commit_size": 53,
            "intersection_size": 53,
            "previous_commits_size": 262
        },
        "is_makefile_based": true,
        "no_new_files": [],
        "no_other_files": false,
        "num_prohibited_files": 100994,
        "prohibited_files": [
            "hal/inc/pinmap_hal.h",
            "Debug/marvin.bin",
            "Debug/marvin.elf",
            "Debug/marvin.hex",
            "Debug/marvin.bin",
            "Debug/marvin.elf",
            "Debug/marvin.hex",
            "inc/spark_utilities.h",
            "Debug/marvin.bin",
            "Debug/marvin.elf"
        ],
        "reopen": true,
        "reopen_events": [
            [
                "2014-09-08 18:16:39",
                "commit"
            ],
            [
                "2015-03-01 04:13:23",
                "commit"
            ],
            [
                "2018-05-29 23:19:42",
                "closed"
            ],
            [
                "2018-05-29 23:19:42",
                "commit"
            ],
            [
                "2018-05-29 23:30:14",
                "reopened"
            ],
            [
                "2018-08-21 22:30:40",
                "commit"
            ],
            [
                "2018-08-21 23:00:12",
                "commit"
            ],
            [
                "2018-08-22 00:26:20",
                "commit"
            ],
            [
                "2018-08-22 16:56:30",
                "commit"
            ],
            [
                "2018-08-23 00:16:42",
                "commit"
            ],
            [
                "2018-08-23 04:47:39",
                "commit"
            ],
            [
                "2018-08-27 17:04:31",
                "closed"
            ],
            [
                "2018-08-27 17:04:31",
                "commit"
            ]
        ],
        "status": false,
        "strategy": true,
        "total_changes": 678
    }
}