{
    "commits": [
        {
            "associated_pull_request": [
                "https://github.com/libuv/libuv/pull/3957"
            ],
            "date": "2023-04-17 18:48:39+00:00",
            "diff": "libuv_libuv/issue_1674/commit_e02642cf3b768b2c58a41f97fa38507e032ae415.diff",
            "diff_additions": 237,
            "diff_deletions": 7,
            "diff_file_size": 199217,
            "diff_url": "https://github.com/libuv/libuv/commit/e02642cf3b768b2c58a41f97fa38507e032ae415.diff",
            "exists": true,
            "files": [
                {
                    "file_additions": 17,
                    "file_deletions": 0,
                    "file_exists": true,
                    "file_name": "src/threadpool.c",
                    "file_size": 11089
                },
                {
                    "file_additions": 10,
                    "file_deletions": 1,
                    "file_exists": true,
                    "file_name": "src/unix/aix.c",
                    "file_size": 33695
                },
                {
                    "file_additions": 9,
                    "file_deletions": 1,
                    "file_exists": true,
                    "file_name": "src/unix/kqueue.c",
                    "file_size": 16689
                },
                {
                    "file_additions": 12,
                    "file_deletions": 1,
                    "file_exists": true,
                    "file_name": "src/unix/linux.c",
                    "file_size": 66743
                },
                {
                    "file_additions": 10,
                    "file_deletions": 1,
                    "file_exists": true,
                    "file_name": "src/unix/os390.c",
                    "file_size": 27948
                },
                {
                    "file_additions": 10,
                    "file_deletions": 1,
                    "file_exists": true,
                    "file_name": "src/unix/posix-poll.c",
                    "file_size": 10590
                },
                {
                    "file_additions": 18,
                    "file_deletions": 2,
                    "file_exists": true,
                    "file_name": "src/win/core.c",
                    "file_size": 21550
                },
                {
                    "file_additions": 151,
                    "file_deletions": 0,
                    "file_exists": true,
                    "file_name": "test/test-metrics.c",
                    "file_size": 10913
                }
            ],
            "interesting": {
                "reopen": false,
                "status": false
            },
            "is_parent": true,
            "sha": "e02642cf3b768b2c58a41f97fa38507e032ae415"
        },
        {
            "associated_pull_request": [],
            "date": "2023-04-26 11:43:13+00:00",
            "diff": "libuv_libuv/issue_1674/commit_a5c02408e842881a0840332ace0a335687c78d37.diff",
            "diff_additions": 79,
            "diff_deletions": 0,
            "diff_file_size": 90130,
            "diff_url": "https://github.com/libuv/libuv/commit/a5c02408e842881a0840332ace0a335687c78d37.diff",
            "exists": true,
            "files": [
                {
                    "file_additions": 33,
                    "file_deletions": 0,
                    "file_exists": true,
                    "file_name": "src/unix/core.c",
                    "file_size": 39801
                },
                {
                    "file_additions": 33,
                    "file_deletions": 0,
                    "file_exists": true,
                    "file_name": "src/win/util.c",
                    "file_size": 48253
                },
                {
                    "file_additions": 13,
                    "file_deletions": 0,
                    "file_exists": true,
                    "file_name": "test/test-hrtime.c",
                    "file_size": 2076
                }
            ],
            "interesting": {
                "reopen": false,
                "status": false
            },
            "is_parent": false,
            "sha": "a5c02408e842881a0840332ace0a335687c78d37"
        },
        {
            "associated_pull_request": [
                "https://github.com/libuv/libuv/pull/3971"
            ],
            "date": "2023-04-26 11:43:13+00:00",
            "diff": "libuv_libuv/issue_1674/commit_4e796fdeb64e8e64dd338680287b5560f1cc1561.diff",
            "diff_additions": 76,
            "diff_deletions": 0,
            "diff_file_size": 90130,
            "diff_url": "https://github.com/libuv/libuv/commit/4e796fdeb64e8e64dd338680287b5560f1cc1561.diff",
            "exists": true,
            "files": [
                {
                    "file_additions": 30,
                    "file_deletions": 0,
                    "file_exists": true,
                    "file_name": "src/unix/core.c",
                    "file_size": 39801
                },
                {
                    "file_additions": 33,
                    "file_deletions": 0,
                    "file_exists": true,
                    "file_name": "src/win/util.c",
                    "file_size": 48253
                },
                {
                    "file_additions": 13,
                    "file_deletions": 0,
                    "file_exists": true,
                    "file_name": "test/test-hrtime.c",
                    "file_size": 2076
                }
            ],
            "interesting": {
                "reopen": true,
                "status": false
            },
            "is_parent": false,
            "sha": "4e796fdeb64e8e64dd338680287b5560f1cc1561"
        },
        {
            "associated_pull_request": [
                "https://github.com/libuv/libuv/pull/3971"
            ],
            "date": "2023-04-27 20:13:46+00:00",
            "diff": "libuv_libuv/issue_1674/commit_c8a1e6132bf377ea84c7e1e9c840691ef4999a07.diff",
            "diff_additions": 76,
            "diff_deletions": 0,
            "diff_file_size": 90130,
            "diff_url": "https://github.com/libuv/libuv/commit/c8a1e6132bf377ea84c7e1e9c840691ef4999a07.diff",
            "exists": true,
            "files": [
                {
                    "file_additions": 30,
                    "file_deletions": 0,
                    "file_exists": true,
                    "file_name": "src/unix/core.c",
                    "file_size": 39801
                },
                {
                    "file_additions": 33,
                    "file_deletions": 0,
                    "file_exists": true,
                    "file_name": "src/win/util.c",
                    "file_size": 48253
                },
                {
                    "file_additions": 13,
                    "file_deletions": 0,
                    "file_exists": true,
                    "file_name": "test/test-hrtime.c",
                    "file_size": 2076
                }
            ],
            "interesting": {
                "reopen": false,
                "status": false
            },
            "is_parent": false,
            "sha": "c8a1e6132bf377ea84c7e1e9c840691ef4999a07"
        }
    ],
    "first_commit": "2023-04-24 21:29:14+00:00",
    "last_commit": "2023-04-27 20:13:46+00:00",
    "number": 1674,
    "pull_request": "None",
    "score": {
        "accidental_reopen_likely": false,
        "all_labels": [
            "feature-request"
        ],
        "contains_keywords": [
            "work",
            "fix",
            "issu",
            "reason",
            "attempt"
        ],
        "fix_size": 82,
        "has_labels": [],
        "intersecting": {
            "computed_score": 1.0,
            "final_commit_size": 79,
            "intersection_size": 79,
            "previous_commits_size": 82
        },
        "is_makefile_based": true,
        "no_new_files": [],
        "no_other_files": false,
        "num_prohibited_files": 15286,
        "prohibited_files": [
            "server/src/main/java/com/genymobile/scrcpy/Device.java",
            "server/src/main/java/com/genymobile/scrcpy/wrappers/SurfaceControl.java",
            "server/src/main/java/com/genymobile/scrcpy/Device.java",
            "server/src/main/java/com/genymobile/scrcpy/wrappers/SurfaceControl.java",
            "app/meson.build",
            "app/scrcpy.1",
            "app/src/common.h",
            "app/src/scrcpy.h",
            "app/src/server.h",
            "server/src/main/java/com/genymobile/scrcpy/Workarounds.java"
        ],
        "reopen": true,
        "reopen_events": [
            [
                "2019-11-15 08:04:23+00:00",
                "closed"
            ],
            [
                "2023-04-26 11:58:37+00:00",
                "commit"
            ],
            [
                "2023-04-26 21:16:09+00:00",
                "commit"
            ],
            [
                "2023-04-27 02:34:05+00:00",
                "reopened"
            ],
            [
                "2023-04-27 20:13:48+00:00",
                "closed"
            ],
            [
                "2023-04-27 20:13:50+00:00",
                "commit"
            ]
        ],
        "status": false,
        "strategy": true,
        "total_changes": 475
    }
}