{
    "covered_issues": [
        238,
        224,
        212,
        208,
        200,
        190,
        155,
        137,
        129,
        128,
        124,
        120,
        118,
        103,
        101,
        95,
        91,
        84,
        73,
        60,
        51,
        44,
        41,
        35,
        30,
        29,
        28,
        27,
        25,
        24,
        23,
        20,
        15,
        14,
        13,
        12,
        11,
        10,
        8,
        7,
        5,
        4,
        3,
        2,
        1
    ],
    "finished": true
}