{
    "covered_issues": [
        585,
        584,
        583,
        580,
        575,
        559,
        553,
        551,
        549,
        546,
        544,
        543,
        541,
        539,
        538,
        537,
        534,
        533,
        531,
        529,
        528,
        524,
        522,
        521,
        520,
        519,
        518,
        516,
        515,
        514,
        513,
        512,
        511,
        507,
        506,
        505,
        503,
        502,
        501,
        500,
        499,
        498,
        497,
        496,
        493,
        492,
        491,
        490,
        489,
        488,
        487,
        485,
        483,
        482,
        480,
        479,
        478,
        477,
        476,
        475,
        474,
        473,
        471,
        470,
        469,
        468,
        467,
        466,
        465,
        464,
        462,
        461,
        460,
        459,
        458,
        454,
        452,
        451,
        450,
        448,
        446,
        445,
        444,
        443,
        442,
        441,
        440,
        439,
        438,
        437,
        436,
        435,
        434,
        433,
        432,
        431,
        430,
        429,
        426,
        425,
        424,
        423,
        422,
        421,
        416,
        414,
        412,
        410,
        409,
        408,
        407,
        405,
        402,
        401,
        400,
        399,
        398,
        397,
        396,
        395,
        394,
        393,
        390,
        389,
        388,
        386,
        384,
        383,
        380,
        377,
        375,
        374,
        373,
        370,
        369,
        368,
        364,
        363,
        362,
        361,
        360,
        359,
        358,
        356,
        355,
        354,
        352,
        351,
        350,
        349,
        348,
        347,
        346,
        344,
        341,
        340,
        338,
        337,
        336,
        335,
        334,
        330,
        326,
        325,
        324,
        322,
        320,
        319,
        318,
        317,
        316,
        315,
        314,
        312,
        310,
        309,
        308,
        304,
        303,
        302,
        301,
        300,
        299,
        298,
        296,
        295,
        293,
        292,
        291,
        289,
        288,
        287,
        285,
        283,
        282,
        280,
        279,
        278,
        277,
        276,
        275,
        274,
        273,
        272,
        271,
        270,
        269,
        267,
        266,
        265,
        264,
        263,
        262,
        261,
        259,
        258,
        257,
        256,
        254,
        253,
        252,
        251,
        249,
        247,
        246,
        244,
        242,
        241,
        240,
        237,
        235,
        234,
        232,
        231,
        230,
        229,
        228,
        227,
        226,
        224,
        223,
        222,
        221,
        220,
        219,
        218,
        217,
        216,
        215,
        214,
        213,
        212,
        211,
        210,
        209,
        207,
        206,
        205,
        204,
        203,
        202,
        201,
        200,
        199,
        198,
        197,
        196,
        195,
        194,
        191,
        189,
        188,
        187,
        185,
        184,
        182,
        181,
        180,
        178,
        176,
        175,
        174,
        172,
        171,
        170,
        169,
        168,
        167,
        166,
        165,
        163,
        161,
        160,
        159,
        158,
        157,
        156,
        155,
        154,
        153,
        152,
        151,
        150,
        149,
        148,
        147,
        146,
        145,
        144,
        143,
        142,
        141,
        140,
        139,
        138,
        137,
        136,
        134,
        133,
        131,
        130,
        129,
        128,
        127,
        126,
        123,
        122,
        121,
        120,
        119,
        118,
        117,
        116,
        114,
        113,
        111,
        110,
        109,
        108,
        107,
        106,
        105,
        104,
        102,
        101,
        100,
        99,
        97,
        96,
        92,
        91,
        90,
        89,
        88,
        87,
        86,
        85,
        84,
        83,
        82,
        81,
        80,
        79,
        78,
        77,
        74,
        73,
        72,
        71,
        70,
        69,
        68,
        67,
        66,
        65,
        64,
        63,
        62,
        60,
        59,
        55,
        52,
        51,
        50,
        49,
        48,
        47,
        46,
        44,
        42,
        41,
        40,
        39,
        38,
        36,
        35,
        34,
        33,
        32,
        31,
        30,
        29,
        28,
        27,
        26,
        25,
        24,
        23,
        22,
        21,
        19,
        18,
        17,
        16,
        15,
        14,
        13,
        11,
        10,
        7,
        6,
        5,
        2,
        1
    ],
    "finished": true
}