{
    "covered_issues": [
        143,
        141,
        140,
        138,
        136,
        134,
        132,
        126,
        125,
        124,
        122,
        121,
        120,
        117,
        116,
        115,
        113,
        111,
        104,
        103,
        102,
        100,
        99,
        98,
        97,
        96,
        95,
        94,
        93,
        92,
        91,
        90,
        89,
        88,
        87,
        86,
        84,
        83,
        82,
        81,
        80,
        79,
        77,
        75,
        74,
        73,
        72,
        71,
        67,
        55,
        54,
        52,
        50,
        45,
        42,
        39,
        37,
        36,
        35,
        33,
        32,
        30,
        28,
        27,
        23,
        16,
        13
    ],
    "finished": true
}