{
    "commits": [
        {
            "associated_pull_request": [],
            "date": "2020-03-23 17:28:40+00:00",
            "diff": "haproxy_haproxy/issue_53/commit_ce7b00f9267d5b8cd97575e13b16e9d27d3714d5.diff",
            "diff_additions": 35,
            "diff_deletions": 35,
            "diff_file_size": 171618,
            "diff_url": "https://github.com/haproxy/haproxy/commit/ce7b00f9267d5b8cd97575e13b16e9d27d3714d5.diff",
            "exists": true,
            "files": [
                {
                    "file_additions": 1,
                    "file_deletions": 1,
                    "file_exists": false,
                    "file_name": "contrib/mod_defender/spoa.c",
                    "file_size": 0
                },
                {
                    "file_additions": 2,
                    "file_deletions": 2,
                    "file_exists": false,
                    "file_name": "contrib/modsecurity/modsec_wrapper.c",
                    "file_size": 0
                },
                {
                    "file_additions": 1,
                    "file_deletions": 1,
                    "file_exists": false,
                    "file_name": "contrib/modsecurity/spoa.c",
                    "file_size": 0
                },
                {
                    "file_additions": 1,
                    "file_deletions": 1,
                    "file_exists": false,
                    "file_name": "contrib/plug_qdisc/plug_qdisc.c",
                    "file_size": 0
                },
                {
                    "file_additions": 10,
                    "file_deletions": 10,
                    "file_exists": false,
                    "file_name": "contrib/prometheus-exporter/service-prometheus.c",
                    "file_size": 0
                },
                {
                    "file_additions": 1,
                    "file_deletions": 1,
                    "file_exists": false,
                    "file_name": "contrib/spoa_example/spoa.c",
                    "file_size": 0
                },
                {
                    "file_additions": 2,
                    "file_deletions": 2,
                    "file_exists": false,
                    "file_name": "contrib/spoa_server/ps_lua.c",
                    "file_size": 0
                },
                {
                    "file_additions": 2,
                    "file_deletions": 2,
                    "file_exists": false,
                    "file_name": "contrib/spoa_server/ps_python.c",
                    "file_size": 0
                },
                {
                    "file_additions": 5,
                    "file_deletions": 5,
                    "file_exists": false,
                    "file_name": "contrib/spoa_server/spoa.c",
                    "file_size": 0
                },
                {
                    "file_additions": 1,
                    "file_deletions": 1,
                    "file_exists": false,
                    "file_name": "contrib/wireshark-dissectors/peers/packet-happp.c",
                    "file_size": 0
                },
                {
                    "file_additions": 2,
                    "file_deletions": 2,
                    "file_exists": true,
                    "file_name": "src/connection.c",
                    "file_size": 81942
                },
                {
                    "file_additions": 1,
                    "file_deletions": 1,
                    "file_exists": true,
                    "file_name": "src/ev_evports.c",
                    "file_size": 10228
                },
                {
                    "file_additions": 5,
                    "file_deletions": 5,
                    "file_exists": true,
                    "file_name": "src/hlua_fcn.c",
                    "file_size": 65582
                },
                {
                    "file_additions": 1,
                    "file_deletions": 1,
                    "file_exists": true,
                    "file_name": "src/raw_sock.c",
                    "file_size": 13866
                }
            ],
            "interesting": {
                "reopen": false,
                "status": false
            },
            "is_parent": true,
            "sha": "ce7b00f9267d5b8cd97575e13b16e9d27d3714d5"
        },
        {
            "associated_pull_request": [],
            "date": "2020-03-28 16:35:50+00:00",
            "diff": "haproxy_haproxy/issue_53/commit_b428517fee01b92546ee82cf420644d548f15a90.diff",
            "diff_additions": 3,
            "diff_deletions": 0,
            "diff_file_size": 216354,
            "diff_url": "https://github.com/haproxy/haproxy/commit/b428517fee01b92546ee82cf420644d548f15a90.diff",
            "exists": true,
            "files": [
                {
                    "file_additions": 3,
                    "file_deletions": 0,
                    "file_exists": true,
                    "file_name": "src/stats.c",
                    "file_size": 216354
                }
            ],
            "interesting": {
                "reopen": true,
                "status": false
            },
            "is_parent": false,
            "sha": "b428517fee01b92546ee82cf420644d548f15a90"
        },
        {
            "associated_pull_request": [],
            "date": "2020-03-28 16:35:50+00:00",
            "diff": "haproxy_haproxy/issue_53/commit_3c9b1144e67a071300f2201979f5937124df5d87.diff",
            "diff_additions": 3,
            "diff_deletions": 0,
            "diff_file_size": 216354,
            "diff_url": "https://github.com/haproxy/haproxy/commit/3c9b1144e67a071300f2201979f5937124df5d87.diff",
            "exists": true,
            "files": [
                {
                    "file_additions": 3,
                    "file_deletions": 0,
                    "file_exists": true,
                    "file_name": "src/stats.c",
                    "file_size": 216354
                }
            ],
            "interesting": {
                "reopen": false,
                "status": false
            },
            "is_parent": false,
            "sha": "3c9b1144e67a071300f2201979f5937124df5d87"
        },
        {
            "associated_pull_request": [],
            "date": "2020-03-28 16:35:50+00:00",
            "diff": "haproxy_haproxy/issue_53/commit_90e2d3181f5350a9c91b51751308d08de98f8a73.diff",
            "diff_additions": 3,
            "diff_deletions": 0,
            "diff_file_size": 216354,
            "diff_url": "https://github.com/haproxy/haproxy/commit/90e2d3181f5350a9c91b51751308d08de98f8a73.diff",
            "exists": true,
            "files": [
                {
                    "file_additions": 3,
                    "file_deletions": 0,
                    "file_exists": true,
                    "file_name": "src/stats.c",
                    "file_size": 216354
                }
            ],
            "interesting": {
                "reopen": false,
                "status": false
            },
            "is_parent": false,
            "sha": "90e2d3181f5350a9c91b51751308d08de98f8a73"
        },
        {
            "associated_pull_request": [],
            "date": "2020-03-28 16:35:50+00:00",
            "diff": "haproxy_haproxy/issue_53/commit_4ffe77737ef3a14d11ada53bc90be252991ee6d4.diff",
            "diff_additions": 3,
            "diff_deletions": 0,
            "diff_file_size": 216354,
            "diff_url": "https://github.com/haproxy/haproxy/commit/4ffe77737ef3a14d11ada53bc90be252991ee6d4.diff",
            "exists": true,
            "files": [
                {
                    "file_additions": 3,
                    "file_deletions": 0,
                    "file_exists": true,
                    "file_name": "src/stats.c",
                    "file_size": 216354
                }
            ],
            "interesting": {
                "reopen": false,
                "status": false
            },
            "is_parent": false,
            "sha": "4ffe77737ef3a14d11ada53bc90be252991ee6d4"
        },
        {
            "associated_pull_request": [],
            "date": "2020-03-28 16:35:50+00:00",
            "diff": "haproxy_haproxy/issue_53/commit_2dd53797c13fd8a6ca4fa11efc5ab16f8fa4a10d.diff",
            "diff_additions": 3,
            "diff_deletions": 0,
            "diff_file_size": 216354,
            "diff_url": "https://github.com/haproxy/haproxy/commit/2dd53797c13fd8a6ca4fa11efc5ab16f8fa4a10d.diff",
            "exists": true,
            "files": [
                {
                    "file_additions": 3,
                    "file_deletions": 0,
                    "file_exists": true,
                    "file_name": "src/stats.c",
                    "file_size": 216354
                }
            ],
            "interesting": {
                "reopen": false,
                "status": false
            },
            "is_parent": false,
            "sha": "2dd53797c13fd8a6ca4fa11efc5ab16f8fa4a10d"
        },
        {
            "associated_pull_request": [],
            "date": "2020-03-28 16:35:50+00:00",
            "diff": "haproxy_haproxy/issue_53/commit_2d1a01ab176dfbd572d0c7148318c1df88b0cf82.diff",
            "diff_additions": 3,
            "diff_deletions": 0,
            "diff_file_size": 216354,
            "diff_url": "https://github.com/haproxy/haproxy/commit/2d1a01ab176dfbd572d0c7148318c1df88b0cf82.diff",
            "exists": true,
            "files": [
                {
                    "file_additions": 3,
                    "file_deletions": 0,
                    "file_exists": true,
                    "file_name": "src/stats.c",
                    "file_size": 216354
                }
            ],
            "interesting": {
                "reopen": false,
                "status": false
            },
            "is_parent": false,
            "sha": "2d1a01ab176dfbd572d0c7148318c1df88b0cf82"
        }
    ],
    "first_commit": "2020-03-31 15:09:35+00:00",
    "last_commit": "2020-04-02 12:47:09+00:00",
    "number": 53,
    "pull_request": "None",
    "score": {
        "accidental_reopen_likely": false,
        "all_labels": [
            "type: bug",
            "severity: minor",
            "subsystem: stats",
            "status: fixed"
        ],
        "contains_keywords": [
            "work",
            "chang",
            "fix",
            "issu",
            "patch",
            "bug"
        ],
        "fix_size": 19,
        "has_labels": [],
        "intersecting": {
            "computed_score": 0.25,
            "final_commit_size": 4,
            "intersection_size": 1,
            "previous_commits_size": 16
        },
        "is_makefile_based": true,
        "no_new_files": [],
        "no_other_files": false,
        "num_prohibited_files": 224889,
        "prohibited_files": [
            "server/src/main/java/com/genymobile/scrcpy/Device.java",
            "server/src/main/java/com/genymobile/scrcpy/wrappers/SurfaceControl.java",
            "server/src/main/java/com/genymobile/scrcpy/Device.java",
            "server/src/main/java/com/genymobile/scrcpy/wrappers/SurfaceControl.java",
            "app/meson.build",
            "app/scrcpy.1",
            "app/src/common.h",
            "app/src/scrcpy.h",
            "app/src/server.h",
            "server/src/main/java/com/genymobile/scrcpy/Workarounds.java"
        ],
        "reopen": true,
        "reopen_events": [
            [
                "2020-03-31 15:22:38+00:00",
                "closed"
            ],
            [
                "2020-03-31 15:22:38+00:00",
                "commit"
            ],
            [
                "2020-03-31 15:29:32+00:00",
                "reopened"
            ],
            [
                "2020-04-01 05:25:28+00:00",
                "commit"
            ],
            [
                "2020-04-01 05:25:36+00:00",
                "commit"
            ],
            [
                "2020-04-02 05:25:27+00:00",
                "commit"
            ],
            [
                "2020-04-02 05:25:33+00:00",
                "commit"
            ],
            [
                "2020-04-02 12:55:11+00:00",
                "closed"
            ],
            [
                "2020-04-03 05:25:28+00:00",
                "commit"
            ]
        ],
        "status": false,
        "strategy": true,
        "total_changes": 88
    }
}