{
    "all_issues": 2482,
    "interesting_issues": 1,
    "last_update": "2023-11-09 07:58:06.493408",
    "license": {
        "download": "https://raw.githubusercontent.com/Azure/azure-iot-sdk-c/main/LICENSE",
        "name": "Other"
    },
    "ratio": 0.00040290088638195,
    "size": 61195,
    "stars": 557,
    "url": "https://github.com/Azure/azure-iot-sdk-c"
}