{
    "category": [
        "memory",
        "hardware/OS"
    ],
    "commits": [
        {
            "associated_pull_request": [],
            "date": "2015-04-27 10:07:49",
            "diff": "antirez_disque/issue_73/commit_56f8c90b2fd19022b9055cc33e74fd38b8ea76d1.diff",
            "diff_additions": 7,
            "diff_deletions": 7,
            "diff_file_size": 7173,
            "diff_url": "https://github.com/antirez/disque/commit/56f8c90b2fd19022b9055cc33e74fd38b8ea76d1.diff",
            "exists": true,
            "files": [
                {
                    "file_additions": 7,
                    "file_deletions": 7,
                    "file_exists": true,
                    "file_name": "src/sha1.c",
                    "file_size": 7173
                }
            ],
            "interesting": {
                "reopen": false,
                "status": false
            },
            "is_parent": true,
            "sha": "56f8c90b2fd19022b9055cc33e74fd38b8ea76d1"
        },
        {
            "associated_pull_request": [],
            "date": "2015-05-30 07:51:13",
            "diff": "antirez_disque/issue_73/commit_48535408bbb4fd80d8c1499cb9cfc6014e1b44ac.diff",
            "diff_additions": 19,
            "diff_deletions": 17,
            "diff_file_size": 0,
            "diff_url": "https://github.com/antirez/disque/commit/48535408bbb4fd80d8c1499cb9cfc6014e1b44ac.diff",
            "exists": true,
            "files": [
                {
                    "file_additions": 19,
                    "file_deletions": 17,
                    "file_exists": false,
                    "file_name": "src/disque.c",
                    "file_size": 0
                }
            ],
            "interesting": {
                "reopen": true,
                "status": false
            },
            "is_parent": false,
            "sha": "48535408bbb4fd80d8c1499cb9cfc6014e1b44ac"
        },
        {
            "associated_pull_request": [],
            "date": "2015-06-11 09:24:27",
            "diff": "antirez_disque/issue_73/commit_83362b25bb24c961e3bc339effa5bf8c668ca4a5.diff",
            "diff_additions": 2,
            "diff_deletions": 2,
            "diff_file_size": 12245,
            "diff_url": "https://github.com/antirez/disque/commit/83362b25bb24c961e3bc339effa5bf8c668ca4a5.diff",
            "exists": true,
            "files": [
                {
                    "file_additions": 2,
                    "file_deletions": 2,
                    "file_exists": true,
                    "file_name": "src/ack.c",
                    "file_size": 12245
                }
            ],
            "interesting": {
                "reopen": false,
                "status": false
            },
            "is_parent": false,
            "sha": "83362b25bb24c961e3bc339effa5bf8c668ca4a5"
        },
        {
            "associated_pull_request": [],
            "date": "2015-06-12 14:48:05",
            "diff": "antirez_disque/issue_73/commit_8f72365c88de51c13527a70a5d868b3af64a2174.diff",
            "diff_additions": 3,
            "diff_deletions": 0,
            "diff_file_size": 104208,
            "diff_url": "https://github.com/antirez/disque/commit/8f72365c88de51c13527a70a5d868b3af64a2174.diff",
            "exists": true,
            "files": [
                {
                    "file_additions": 3,
                    "file_deletions": 0,
                    "file_exists": true,
                    "file_name": "src/cluster.c",
                    "file_size": 104208
                }
            ],
            "interesting": {
                "reopen": false,
                "status": false
            },
            "is_parent": false,
            "sha": "8f72365c88de51c13527a70a5d868b3af64a2174"
        },
        {
            "associated_pull_request": [],
            "date": "2015-06-28 15:39:18",
            "diff": "antirez_disque/issue_73/commit_5bedbffd21506684eb1c863109231a357093a358.diff",
            "diff_additions": 24,
            "diff_deletions": 1,
            "diff_file_size": 104208,
            "diff_url": "https://github.com/antirez/disque/commit/5bedbffd21506684eb1c863109231a357093a358.diff",
            "exists": true,
            "files": [
                {
                    "file_additions": 24,
                    "file_deletions": 1,
                    "file_exists": true,
                    "file_name": "src/cluster.c",
                    "file_size": 104208
                }
            ],
            "interesting": {
                "reopen": false,
                "status": false
            },
            "is_parent": false,
            "sha": "5bedbffd21506684eb1c863109231a357093a358"
        },
        {
            "associated_pull_request": [],
            "date": "2015-06-28 15:44:06",
            "diff": "antirez_disque/issue_73/commit_a7d2350f1387afd8046493f1f28b01aabecf085d.diff",
            "diff_additions": 23,
            "diff_deletions": 1,
            "diff_file_size": 104208,
            "diff_url": "https://github.com/antirez/disque/commit/a7d2350f1387afd8046493f1f28b01aabecf085d.diff",
            "exists": true,
            "files": [
                {
                    "file_additions": 23,
                    "file_deletions": 1,
                    "file_exists": true,
                    "file_name": "src/cluster.c",
                    "file_size": 104208
                }
            ],
            "interesting": {
                "reopen": false,
                "status": false
            },
            "is_parent": false,
            "sha": "a7d2350f1387afd8046493f1f28b01aabecf085d"
        },
        {
            "associated_pull_request": [],
            "date": "2015-06-28 15:44:06",
            "diff": "antirez_disque/issue_73/commit_7dfcd6b5a43b2976b835cf6e2e85f27f30f70fcf.diff",
            "diff_additions": 23,
            "diff_deletions": 1,
            "diff_file_size": 104208,
            "diff_url": "https://github.com/antirez/disque/commit/7dfcd6b5a43b2976b835cf6e2e85f27f30f70fcf.diff",
            "exists": true,
            "files": [
                {
                    "file_additions": 23,
                    "file_deletions": 1,
                    "file_exists": true,
                    "file_name": "src/cluster.c",
                    "file_size": 104208
                }
            ],
            "interesting": {
                "reopen": false,
                "status": false
            },
            "is_parent": false,
            "sha": "7dfcd6b5a43b2976b835cf6e2e85f27f30f70fcf"
        }
    ],
    "first_commit": "2015-05-21 17:14:51",
    "last_commit": "2015-06-30 07:30:41",
    "number": 73,
    "pull_request": "None",
    "score": {
        "accidental_reopen_likely": false,
        "all_labels": [],
        "contains_keywords": [
            "fail",
            "report",
            "warn",
            "chang",
            "reason",
            "confirm",
            "error",
            "bug",
            "problem",
            "crash",
            "test",
            "fix",
            "remov",
            "issu",
            "work",
            "perform",
            "fault",
            "leak",
            "debug"
        ],
        "fix_size": 59,
        "has_labels": [],
        "intersecting": {
            "computed_score": 1.0,
            "final_commit_size": 24,
            "intersection_size": 24,
            "previous_commits_size": 59
        },
        "is_makefile_based": true,
        "no_new_files": [],
        "no_other_files": false,
        "num_prohibited_files": 74935,
        "prohibited_files": [
            "hal/inc/pinmap_hal.h",
            "Debug/marvin.bin",
            "Debug/marvin.elf",
            "Debug/marvin.hex",
            "Debug/marvin.bin",
            "Debug/marvin.elf",
            "Debug/marvin.hex",
            "inc/spark_utilities.h",
            "Debug/marvin.bin",
            "Debug/marvin.elf"
        ],
        "reopen": true,
        "reopen_events": [
            [
                "2015-05-30 07:52:17",
                "commit"
            ],
            [
                "2015-05-30 07:54:12",
                "closed"
            ],
            [
                "2015-06-03 07:01:51",
                "reopened"
            ],
            [
                "2015-06-11 09:24:28",
                "commit"
            ],
            [
                "2015-06-12 14:59:12",
                "commit"
            ],
            [
                "2015-06-28 15:41:59",
                "commit"
            ],
            [
                "2015-06-28 15:44:32",
                "commit"
            ],
            [
                "2015-06-30 07:38:22",
                "commit"
            ],
            [
                "2015-07-18 11:30:24",
                "closed"
            ]
        ],
        "status": false,
        "strategy": true,
        "total_changes": 130
    }
}