{
    "covered_issues": [
        38,
        36,
        34,
        33,
        31,
        30,
        29,
        26,
        23,
        21,
        20,
        18,
        17,
        13,
        12,
        7,
        4
    ],
    "finished": true
}