{
    "category": [
        "hardware/OS",
        "control flow"
    ],
    "commits": [
        {
            "associated_pull_request": [
                "https://github.com/surge-synthesizer/surge/pull/1536"
            ],
            "date": "2020-01-30 21:54:30",
            "diff": "surge-synthesizer_surge/issue_1537/commit_721f4eaf250120452f1a4c0658b960b43634f503.diff",
            "diff_additions": 9,
            "diff_deletions": 4,
            "diff_file_size": 0,
            "diff_url": "https://github.com/surge-synthesizer/surge/commit/721f4eaf250120452f1a4c0658b960b43634f503.diff",
            "exists": true,
            "files": [
                {
                    "file_additions": 9,
                    "file_deletions": 4,
                    "file_exists": false,
                    "file_name": "src/vst3/SurgeVst3Processor.cpp",
                    "file_size": 0
                }
            ],
            "interesting": {
                "reopen": false,
                "status": false
            },
            "is_parent": true,
            "sha": "721f4eaf250120452f1a4c0658b960b43634f503"
        },
        {
            "associated_pull_request": [],
            "date": "2020-01-31 15:55:29",
            "diff": "surge-synthesizer_surge/issue_1537/commit_46ce5252e7be95b0ffff215d8c4074e3a4dc7fc6.diff",
            "diff_additions": 26,
            "diff_deletions": 11,
            "diff_file_size": 0,
            "diff_url": "https://github.com/surge-synthesizer/surge/commit/46ce5252e7be95b0ffff215d8c4074e3a4dc7fc6.diff",
            "exists": true,
            "files": [
                {
                    "file_additions": 26,
                    "file_deletions": 11,
                    "file_exists": false,
                    "file_name": "src/common/WavSupport.cpp",
                    "file_size": 0
                }
            ],
            "interesting": {
                "reopen": false,
                "status": true
            },
            "is_parent": false,
            "sha": "46ce5252e7be95b0ffff215d8c4074e3a4dc7fc6"
        },
        {
            "associated_pull_request": [
                "https://github.com/surge-synthesizer/surge/pull/1539"
            ],
            "date": "2020-01-31 15:55:29",
            "diff": "surge-synthesizer_surge/issue_1537/commit_cd3f252b1a7cf17c795599cf5d1d3c8009f8b2f4.diff",
            "diff_additions": 26,
            "diff_deletions": 11,
            "diff_file_size": 0,
            "diff_url": "https://github.com/surge-synthesizer/surge/commit/cd3f252b1a7cf17c795599cf5d1d3c8009f8b2f4.diff",
            "exists": true,
            "files": [
                {
                    "file_additions": 26,
                    "file_deletions": 11,
                    "file_exists": false,
                    "file_name": "src/common/WavSupport.cpp",
                    "file_size": 0
                }
            ],
            "interesting": {
                "reopen": false,
                "status": false
            },
            "is_parent": false,
            "sha": "cd3f252b1a7cf17c795599cf5d1d3c8009f8b2f4"
        },
        {
            "associated_pull_request": [
                "https://github.com/surge-synthesizer/surge/pull/1539"
            ],
            "date": "2020-01-31 16:24:17",
            "diff": "surge-synthesizer_surge/issue_1537/commit_8b475e89a808da38bd8a139507ec3b39a07ca929.diff",
            "diff_additions": 26,
            "diff_deletions": 11,
            "diff_file_size": 0,
            "diff_url": "https://github.com/surge-synthesizer/surge/commit/8b475e89a808da38bd8a139507ec3b39a07ca929.diff",
            "exists": true,
            "files": [
                {
                    "file_additions": 26,
                    "file_deletions": 11,
                    "file_exists": false,
                    "file_name": "src/common/WavSupport.cpp",
                    "file_size": 0
                }
            ],
            "interesting": {
                "reopen": false,
                "status": false
            },
            "is_parent": false,
            "sha": "8b475e89a808da38bd8a139507ec3b39a07ca929"
        }
    ],
    "first_commit": "2020-01-30 21:54:30",
    "last_commit": "2020-01-31 16:24:17",
    "number": 1537,
    "pull_request": "None",
    "score": {
        "accidental_reopen_likely": false,
        "all_labels": [
            "Audio Formats"
        ],
        "contains_keywords": [
            "crash",
            "chang",
            "confirm",
            "error",
            "fix",
            "test"
        ],
        "fix_size": 30,
        "has_labels": [],
        "intersecting": {
            "computed_score": 1.0,
            "final_commit_size": 30,
            "intersection_size": 30,
            "previous_commits_size": 30
        },
        "is_makefile_based": true,
        "no_new_files": [],
        "no_other_files": true,
        "num_prohibited_files": 39844,
        "prohibited_files": [
            "tools/building.py",
            "tools/building.py",
            "tools/building.py",
            "emcc.py",
            "src/library_emmalloc.js",
            "src/shell.js",
            "tests/test_core.py",
            "src/shell.js",
            "tests/test_core.py",
            "src/library.js"
        ],
        "reopen": false,
        "reopen_events": [
            [
                "2020-01-31 15:56:10",
                "commit"
            ],
            [
                "2020-01-31 16:13:07",
                "commit"
            ],
            [
                "2020-01-31 16:24:18",
                "closed"
            ],
            [
                "2020-01-31 16:24:19",
                "commit"
            ]
        ],
        "status": true,
        "strategy": true,
        "total_changes": 124
    }
}