{
    "covered_issues": [
        34,
        32,
        27,
        26,
        25,
        24,
        22,
        21,
        17,
        16,
        10,
        9,
        6,
        5,
        3,
        2,
        1
    ],
    "finished": true
}