{
    "covered_issues": [
        237,
        236,
        235,
        233,
        232,
        230,
        227,
        225,
        223,
        221,
        218,
        217,
        216,
        215,
        214,
        213,
        209,
        208,
        206,
        202,
        201,
        200,
        199,
        197,
        194,
        193,
        192,
        191,
        188,
        187,
        184,
        182,
        181,
        180,
        179,
        178,
        177,
        176,
        175,
        171,
        169,
        168,
        167,
        166,
        165,
        164,
        162,
        161,
        160,
        159,
        158,
        155,
        154,
        152,
        150,
        149,
        143,
        142,
        141,
        140,
        139,
        138,
        137,
        136,
        134,
        133,
        132,
        131,
        130,
        129,
        128,
        127,
        125,
        122,
        121,
        120,
        118,
        117,
        116,
        115,
        114,
        113,
        111,
        110,
        109,
        108,
        107,
        105,
        104,
        103,
        102,
        101,
        97,
        95,
        94,
        92,
        91,
        88,
        87,
        86,
        85,
        81,
        77,
        76,
        73,
        72,
        71,
        70,
        69,
        68,
        67,
        62,
        58,
        57,
        55,
        54,
        53,
        52,
        51,
        50,
        49,
        48,
        46,
        40,
        39,
        36,
        33,
        26,
        24,
        23,
        21,
        17,
        12,
        9,
        8,
        7,
        4
    ],
    "finished": true
}