{
    "commits": [
        {
            "associated_pull_request": [],
            "date": "2019-10-17 20:01:37+00:00",
            "diff": "",
            "diff_additions": 0,
            "diff_deletions": 0,
            "diff_file_size": 0,
            "diff_url": "https://github.com/winsiderss/systeminformer/commit/cfc6cdd65c2fc8927fffc67cf8abf9a81f41b5d4.diff",
            "exists": true,
            "files": [],
            "interesting": {
                "reopen": false,
                "status": false
            },
            "is_parent": true,
            "sha": "cfc6cdd65c2fc8927fffc67cf8abf9a81f41b5d4"
        },
        {
            "associated_pull_request": [],
            "date": "2019-10-17 21:13:09+00:00",
            "diff": "winsiderss_systeminformer/issue_484/commit_082bb8f9f0b38205a312a07748b042089f2cf2a7.diff",
            "diff_additions": 7,
            "diff_deletions": 0,
            "diff_file_size": 43299,
            "diff_url": "https://github.com/winsiderss/systeminformer/commit/082bb8f9f0b38205a312a07748b042089f2cf2a7.diff",
            "exists": true,
            "files": [
                {
                    "file_additions": 7,
                    "file_deletions": 0,
                    "file_exists": true,
                    "file_name": "phlib/http.c",
                    "file_size": 43299
                }
            ],
            "interesting": {
                "reopen": true,
                "status": false
            },
            "is_parent": false,
            "sha": "082bb8f9f0b38205a312a07748b042089f2cf2a7"
        },
        {
            "associated_pull_request": [],
            "date": "2019-10-18 07:52:23+00:00",
            "diff": "winsiderss_systeminformer/issue_484/commit_49502ff7020d01752876f2730efe7d0dfa75ec7b.diff",
            "diff_additions": 43,
            "diff_deletions": 25,
            "diff_file_size": 43299,
            "diff_url": "https://github.com/winsiderss/systeminformer/commit/49502ff7020d01752876f2730efe7d0dfa75ec7b.diff",
            "exists": true,
            "files": [
                {
                    "file_additions": 43,
                    "file_deletions": 25,
                    "file_exists": true,
                    "file_name": "phlib/http.c",
                    "file_size": 43299
                }
            ],
            "interesting": {
                "reopen": false,
                "status": false
            },
            "is_parent": false,
            "sha": "49502ff7020d01752876f2730efe7d0dfa75ec7b"
        },
        {
            "associated_pull_request": [],
            "date": "2019-10-18 13:18:35+00:00",
            "diff": "winsiderss_systeminformer/issue_484/commit_71b0300c09ed13160b30e0afacf7b6fddab4593e.diff",
            "diff_additions": 2,
            "diff_deletions": 3,
            "diff_file_size": 43299,
            "diff_url": "https://github.com/winsiderss/systeminformer/commit/71b0300c09ed13160b30e0afacf7b6fddab4593e.diff",
            "exists": true,
            "files": [
                {
                    "file_additions": 2,
                    "file_deletions": 3,
                    "file_exists": true,
                    "file_name": "phlib/http.c",
                    "file_size": 43299
                }
            ],
            "interesting": {
                "reopen": false,
                "status": false
            },
            "is_parent": false,
            "sha": "71b0300c09ed13160b30e0afacf7b6fddab4593e"
        }
    ],
    "first_commit": "2019-10-17 20:01:37+00:00",
    "last_commit": "2019-10-18 13:18:35+00:00",
    "number": 484,
    "pull_request": "None",
    "score": {
        "accidental_reopen_likely": false,
        "all_labels": [],
        "contains_keywords": [
            "work",
            "fix",
            "patch",
            "fault",
            "problem"
        ],
        "fix_size": 57,
        "has_labels": [],
        "intersecting": {
            "computed_score": 1.0,
            "final_commit_size": 6,
            "intersection_size": 6,
            "previous_commits_size": 57
        },
        "is_makefile_based": false,
        "no_new_files": [],
        "no_other_files": true,
        "num_prohibited_files": 29214,
        "prohibited_files": [
            "server/src/main/java/com/genymobile/scrcpy/Device.java",
            "server/src/main/java/com/genymobile/scrcpy/wrappers/SurfaceControl.java",
            "server/src/main/java/com/genymobile/scrcpy/Device.java",
            "server/src/main/java/com/genymobile/scrcpy/wrappers/SurfaceControl.java",
            "app/meson.build",
            "app/scrcpy.1",
            "app/src/common.h",
            "app/src/scrcpy.h",
            "app/src/server.h",
            "server/src/main/java/com/genymobile/scrcpy/Workarounds.java"
        ],
        "reopen": true,
        "reopen_events": [
            [
                "2019-10-17 21:13:14+00:00",
                "closed"
            ],
            [
                "2019-10-17 21:13:14+00:00",
                "commit"
            ],
            [
                "2019-10-17 21:29:04+00:00",
                "reopened"
            ],
            [
                "2019-10-18 07:52:28+00:00",
                "closed"
            ],
            [
                "2019-10-18 07:52:28+00:00",
                "commit"
            ],
            [
                "2019-10-18 13:18:41+00:00",
                "commit"
            ]
        ],
        "status": false,
        "strategy": true,
        "total_changes": 80
    }
}