{
    "commits": [
        {
            "associated_pull_request": [],
            "date": "2017-12-29 21:53:58+00:00",
            "diff": "mintty_mintty/issue_601/commit_83598d895fcab200d82eebf40e64977d91c0f3fb.diff",
            "diff_additions": 6,
            "diff_deletions": 2,
            "diff_file_size": 137282,
            "diff_url": "https://github.com/mintty/mintty/commit/83598d895fcab200d82eebf40e64977d91c0f3fb.diff",
            "exists": true,
            "files": [
                {
                    "file_additions": 6,
                    "file_deletions": 2,
                    "file_exists": true,
                    "file_name": "src/term.c",
                    "file_size": 137282
                }
            ],
            "interesting": {
                "reopen": false,
                "status": false
            },
            "is_parent": true,
            "sha": "83598d895fcab200d82eebf40e64977d91c0f3fb"
        },
        {
            "associated_pull_request": [],
            "date": "2018-01-02 12:11:36+00:00",
            "diff": "mintty_mintty/issue_601/commit_2d216d636337196a0bf97de8a89c208582709f32.diff",
            "diff_additions": 7,
            "diff_deletions": 0,
            "diff_file_size": 157007,
            "diff_url": "https://github.com/mintty/mintty/commit/2d216d636337196a0bf97de8a89c208582709f32.diff",
            "exists": true,
            "files": [
                {
                    "file_additions": 7,
                    "file_deletions": 0,
                    "file_exists": true,
                    "file_name": "src/wintext.c",
                    "file_size": 157007
                }
            ],
            "interesting": {
                "reopen": false,
                "status": false
            },
            "is_parent": false,
            "sha": "2d216d636337196a0bf97de8a89c208582709f32"
        },
        {
            "associated_pull_request": [],
            "date": "2018-01-03 18:44:55+00:00",
            "diff": "mintty_mintty/issue_601/commit_e13b130822d1f3bd0557301e04fc1e12d9ae2919.diff",
            "diff_additions": 10,
            "diff_deletions": 2,
            "diff_file_size": 137282,
            "diff_url": "https://github.com/mintty/mintty/commit/e13b130822d1f3bd0557301e04fc1e12d9ae2919.diff",
            "exists": true,
            "files": [
                {
                    "file_additions": 10,
                    "file_deletions": 2,
                    "file_exists": true,
                    "file_name": "src/term.c",
                    "file_size": 137282
                }
            ],
            "interesting": {
                "reopen": false,
                "status": false
            },
            "is_parent": false,
            "sha": "e13b130822d1f3bd0557301e04fc1e12d9ae2919"
        },
        {
            "associated_pull_request": [],
            "date": "2018-09-23 17:57:44+00:00",
            "diff": "mintty_mintty/issue_601/commit_14567216093ffe7a47040163d0980ab85ab8b5b3.diff",
            "diff_additions": 4,
            "diff_deletions": 0,
            "diff_file_size": 319602,
            "diff_url": "https://github.com/mintty/mintty/commit/14567216093ffe7a47040163d0980ab85ab8b5b3.diff",
            "exists": true,
            "files": [
                {
                    "file_additions": 2,
                    "file_deletions": 0,
                    "file_exists": true,
                    "file_name": "src/config.c",
                    "file_size": 134202
                },
                {
                    "file_additions": 2,
                    "file_deletions": 0,
                    "file_exists": true,
                    "file_name": "src/termout.c",
                    "file_size": 185400
                }
            ],
            "interesting": {
                "reopen": false,
                "status": false
            },
            "is_parent": false,
            "sha": "14567216093ffe7a47040163d0980ab85ab8b5b3"
        },
        {
            "associated_pull_request": [],
            "date": "2018-10-04 16:05:07+00:00",
            "diff": "mintty_mintty/issue_601/commit_f35aa2aa72295f979dd90250c98fa7a4dc9e1c2e.diff",
            "diff_additions": 8,
            "diff_deletions": 1,
            "diff_file_size": 185400,
            "diff_url": "https://github.com/mintty/mintty/commit/f35aa2aa72295f979dd90250c98fa7a4dc9e1c2e.diff",
            "exists": true,
            "files": [
                {
                    "file_additions": 8,
                    "file_deletions": 1,
                    "file_exists": true,
                    "file_name": "src/termout.c",
                    "file_size": 185400
                }
            ],
            "interesting": {
                "reopen": true,
                "status": false
            },
            "is_parent": false,
            "sha": "f35aa2aa72295f979dd90250c98fa7a4dc9e1c2e"
        },
        {
            "associated_pull_request": [],
            "date": "2020-02-17 23:00:00+00:00",
            "diff": "mintty_mintty/issue_601/commit_f1870cc8907758f58bf2c9e2af3dfcc4f5cf81c5.diff",
            "diff_additions": 9,
            "diff_deletions": 1,
            "diff_file_size": 291209,
            "diff_url": "https://github.com/mintty/mintty/commit/f1870cc8907758f58bf2c9e2af3dfcc4f5cf81c5.diff",
            "exists": true,
            "files": [
                {
                    "file_additions": 2,
                    "file_deletions": 0,
                    "file_exists": true,
                    "file_name": "src/config.c",
                    "file_size": 134202
                },
                {
                    "file_additions": 7,
                    "file_deletions": 1,
                    "file_exists": true,
                    "file_name": "src/wintext.c",
                    "file_size": 157007
                }
            ],
            "interesting": {
                "reopen": false,
                "status": false
            },
            "is_parent": false,
            "sha": "f1870cc8907758f58bf2c9e2af3dfcc4f5cf81c5"
        }
    ],
    "first_commit": "2017-12-29 21:53:58+00:00",
    "last_commit": "2020-02-19 09:53:05+00:00",
    "number": 601,
    "pull_request": "None",
    "score": {
        "accidental_reopen_likely": false,
        "all_labels": [
            "enhancement",
            "help wanted",
            "Difficulty-Insane"
        ],
        "contains_keywords": [
            "confirm",
            "work",
            "chang",
            "fix",
            "issu",
            "CI",
            "patch",
            "perform",
            "debug",
            "reason",
            "test",
            "fault",
            "remov",
            "bug",
            "error",
            "crash",
            "report"
        ],
        "fix_size": 45,
        "has_labels": [],
        "intersecting": {
            "computed_score": 0.16666666666666666,
            "final_commit_size": 12,
            "intersection_size": 2,
            "previous_commits_size": 35
        },
        "is_makefile_based": true,
        "no_new_files": [],
        "no_other_files": false,
        "num_prohibited_files": 289600,
        "prohibited_files": [
            "server/src/main/java/com/genymobile/scrcpy/Device.java",
            "server/src/main/java/com/genymobile/scrcpy/wrappers/SurfaceControl.java",
            "server/src/main/java/com/genymobile/scrcpy/Device.java",
            "server/src/main/java/com/genymobile/scrcpy/wrappers/SurfaceControl.java",
            "app/meson.build",
            "app/scrcpy.1",
            "app/src/common.h",
            "app/src/scrcpy.h",
            "app/src/server.h",
            "server/src/main/java/com/genymobile/scrcpy/Workarounds.java"
        ],
        "reopen": true,
        "reopen_events": [
            [
                "2018-01-02 12:12:10+00:00",
                "commit"
            ],
            [
                "2018-01-03 18:45:52+00:00",
                "commit"
            ],
            [
                "2018-01-08 21:25:01+00:00",
                "closed"
            ],
            [
                "2018-09-23 20:04:29+00:00",
                "commit"
            ],
            [
                "2018-10-04 16:07:29+00:00",
                "commit"
            ],
            [
                "2020-02-16 09:39:01+00:00",
                "reopened"
            ],
            [
                "2020-02-18 10:19:30+00:00",
                "commit"
            ],
            [
                "2020-02-19 09:54:49+00:00",
                "commit"
            ],
            [
                "2020-02-25 08:28:18+00:00",
                "closed"
            ]
        ],
        "status": false,
        "strategy": true,
        "total_changes": 50
    }
}