{
    "commits": [
        {
            "associated_pull_request": [],
            "date": "2016-11-24 21:19:09+00:00",
            "diff": "",
            "diff_additions": 0,
            "diff_deletions": 0,
            "diff_file_size": 0,
            "diff_url": "https://github.com/vermaseren/form/commit/6fe5632f513100fcabdc4c7fb002609b1bf8efea.diff",
            "exists": true,
            "files": [],
            "interesting": {
                "reopen": false,
                "status": false
            },
            "is_parent": true,
            "sha": "6fe5632f513100fcabdc4c7fb002609b1bf8efea"
        },
        {
            "associated_pull_request": [],
            "date": "2016-11-28 13:06:40+00:00",
            "diff": "vermaseren_form/issue_149/commit_6ce79f3fa76de7aa5669f5da52c05b4f882d88fd.diff",
            "diff_additions": 2,
            "diff_deletions": 1,
            "diff_file_size": 52729,
            "diff_url": "https://github.com/vermaseren/form/commit/6ce79f3fa76de7aa5669f5da52c05b4f882d88fd.diff",
            "exists": true,
            "files": [
                {
                    "file_additions": 2,
                    "file_deletions": 1,
                    "file_exists": true,
                    "file_name": "sources/function.c",
                    "file_size": 52729
                }
            ],
            "interesting": {
                "reopen": true,
                "status": false
            },
            "is_parent": false,
            "sha": "6ce79f3fa76de7aa5669f5da52c05b4f882d88fd"
        },
        {
            "associated_pull_request": [],
            "date": "2016-11-29 13:20:36+00:00",
            "diff": "vermaseren_form/issue_149/commit_b993ca7ed6961ad319b6c1914a6a0c7360e7f76c.diff",
            "diff_additions": 2,
            "diff_deletions": 1,
            "diff_file_size": 62375,
            "diff_url": "https://github.com/vermaseren/form/commit/b993ca7ed6961ad319b6c1914a6a0c7360e7f76c.diff",
            "exists": true,
            "files": [
                {
                    "file_additions": 2,
                    "file_deletions": 1,
                    "file_exists": true,
                    "file_name": "sources/symmetr.c",
                    "file_size": 62375
                }
            ],
            "interesting": {
                "reopen": false,
                "status": false
            },
            "is_parent": false,
            "sha": "b993ca7ed6961ad319b6c1914a6a0c7360e7f76c"
        }
    ],
    "first_commit": "2016-11-24 21:45:10+00:00",
    "last_commit": "2016-11-29 13:20:36+00:00",
    "number": 149,
    "pull_request": "None",
    "score": {
        "accidental_reopen_likely": false,
        "all_labels": [
            "bug"
        ],
        "contains_keywords": [
            "work",
            "fail",
            "chang",
            "fix",
            "issu",
            "patch",
            "crash"
        ],
        "fix_size": 6,
        "has_labels": [
            "bug"
        ],
        "intersecting": {
            "computed_score": 0.0,
            "final_commit_size": 3,
            "intersection_size": 0,
            "previous_commits_size": 3
        },
        "is_makefile_based": true,
        "no_new_files": [
            "sources/symmetr.c"
        ],
        "no_other_files": false,
        "num_prohibited_files": 115847,
        "prohibited_files": [
            "server/src/main/java/com/genymobile/scrcpy/Device.java",
            "server/src/main/java/com/genymobile/scrcpy/wrappers/SurfaceControl.java",
            "server/src/main/java/com/genymobile/scrcpy/Device.java",
            "server/src/main/java/com/genymobile/scrcpy/wrappers/SurfaceControl.java",
            "app/meson.build",
            "app/scrcpy.1",
            "app/src/common.h",
            "app/src/scrcpy.h",
            "app/src/server.h",
            "server/src/main/java/com/genymobile/scrcpy/Workarounds.java"
        ],
        "reopen": true,
        "reopen_events": [
            [
                "2016-11-28 13:55:49+00:00",
                "closed"
            ],
            [
                "2016-11-28 13:55:49+00:00",
                "commit"
            ],
            [
                "2016-11-29 12:34:32+00:00",
                "reopened"
            ],
            [
                "2016-11-29 13:27:54+00:00",
                "closed"
            ],
            [
                "2016-11-29 13:27:54+00:00",
                "commit"
            ]
        ],
        "status": false,
        "strategy": true,
        "total_changes": 6
    }
}