{
    "commits": [
        {
            "diff": "spring-projects_spring-boot/issue_22159/commit_2643c60c5ac427680e53484d0d4f9f8413bd9976.diff",
            "diff_additions": 9,
            "diff_deletions": 11,
            "diff_file_size": 5248,
            "files": [
                {
                    "file_additions": 3,
                    "file_deletions": 3,
                    "file_exists": true,
                    "file_name": "spring-boot-project/spring-boot/src/main/java/org/springframework/boot/web/context/WebServerInitializedEvent.java",
                    "file_size": 1867
                },
                {
                    "file_additions": 3,
                    "file_deletions": 4,
                    "file_exists": true,
                    "file_name": "spring-boot-project/spring-boot/src/main/java/org/springframework/boot/web/reactive/context/ReactiveWebServerInitializedEvent.java",
                    "file_size": 1479
                },
                {
                    "file_additions": 3,
                    "file_deletions": 4,
                    "file_exists": true,
                    "file_name": "spring-boot-project/spring-boot/src/main/java/org/springframework/boot/web/servlet/context/ServletWebServerInitializedEvent.java",
                    "file_size": 1902
                }
            ],
            "interesting": {
                "reopened": false,
                "status": false
            },
            "sha": "2643c60c5ac427680e53484d0d4f9f8413bd9976"
        },
        {
            "diff": "spring-projects_spring-boot/issue_22159/commit_5b1856b9277e8d1c8c6fac9cb54a434dcb44117a.diff",
            "diff_additions": 45,
            "diff_deletions": 0,
            "diff_file_size": 0,
            "files": [
                {
                    "file_additions": 45,
                    "file_deletions": 0,
                    "file_exists": false,
                    "file_name": "spring-boot-project/spring-boot/src/main/java/org/springframework/boot/diagnostics/analyzer/LiquibaseChangelogMissingFailureAnalyzer.java",
                    "file_size": 0
                }
            ],
            "interesting": {
                "reopened": false,
                "status": false
            },
            "sha": "5b1856b9277e8d1c8c6fac9cb54a434dcb44117a"
        },
        {
            "diff": "spring-projects_spring-boot/issue_22159/commit_e6a65a1588e00edcc50a4e127bc20c38bb21d1d4.diff",
            "diff_additions": 44,
            "diff_deletions": 0,
            "diff_file_size": 0,
            "files": [
                {
                    "file_additions": 44,
                    "file_deletions": 0,
                    "file_exists": false,
                    "file_name": "spring-boot-project/spring-boot/src/main/java/org/springframework/boot/diagnostics/analyzer/LiquibaseChangelogMissingFailureAnalyzer.java",
                    "file_size": 0
                }
            ],
            "interesting": {
                "reopened": false,
                "status": true
            },
            "sha": "e6a65a1588e00edcc50a4e127bc20c38bb21d1d4"
        },
        {
            "diff": "spring-projects_spring-boot/issue_22159/commit_4821b3a615758f45023aee13ee1086331f978491.diff",
            "diff_additions": 52,
            "diff_deletions": 0,
            "diff_file_size": 0,
            "files": [
                {
                    "file_additions": 52,
                    "file_deletions": 0,
                    "file_exists": false,
                    "file_name": "spring-boot-project/spring-boot/src/main/java/org/springframework/boot/diagnostics/analyzer/LiquibaseChangelogMissingFailureAnalyzer.java",
                    "file_size": 0
                }
            ],
            "interesting": {
                "reopened": false,
                "status": false
            },
            "sha": "4821b3a615758f45023aee13ee1086331f978491"
        },
        {
            "diff": "spring-projects_spring-boot/issue_22159/commit_a33709da1c6f5881d39cbf914106bb052a86b51d.diff",
            "diff_additions": 139,
            "diff_deletions": 0,
            "diff_file_size": 0,
            "files": [
                {
                    "file_additions": 52,
                    "file_deletions": 0,
                    "file_exists": false,
                    "file_name": "spring-boot-project/spring-boot/src/main/java/org/springframework/boot/diagnostics/analyzer/LiquibaseChangelogMissingFailureAnalyzer.java",
                    "file_size": 0
                },
                {
                    "file_additions": 87,
                    "file_deletions": 0,
                    "file_exists": false,
                    "file_name": "spring-boot-project/spring-boot/src/test/java/org/springframework/boot/diagnostics/analyzer/LiquibaseChangelogMissingFailureAnalyzerTest.java",
                    "file_size": 0
                }
            ],
            "interesting": {
                "reopened": false,
                "status": false
            },
            "sha": "a33709da1c6f5881d39cbf914106bb052a86b51d"
        },
        {
            "diff": "spring-projects_spring-boot/issue_22159/commit_3c4fe9622422078fae3bc9926429fb47cc1890c0.diff",
            "diff_additions": 139,
            "diff_deletions": 0,
            "diff_file_size": 0,
            "files": [
                {
                    "file_additions": 52,
                    "file_deletions": 0,
                    "file_exists": false,
                    "file_name": "spring-boot-project/spring-boot/src/main/java/org/springframework/boot/diagnostics/analyzer/LiquibaseChangelogMissingFailureAnalyzer.java",
                    "file_size": 0
                },
                {
                    "file_additions": 87,
                    "file_deletions": 0,
                    "file_exists": false,
                    "file_name": "spring-boot-project/spring-boot/src/test/java/org/springframework/boot/diagnostics/analyzer/LiquibaseChangelogMissingFailureAnalyzerTest.java",
                    "file_size": 0
                }
            ],
            "interesting": {
                "reopened": false,
                "status": false
            },
            "sha": "3c4fe9622422078fae3bc9926429fb47cc1890c0"
        }
    ],
    "first_commit": "2020-07-13 13:16:45",
    "last_commit": "2020-07-15 20:45:30",
    "number": 22159,
    "score": 336.0091116173121
}