{
    "commits": [
        {
            "diff": "spring-projects_spring-boot/issue_7357/commit_df341a348ab216219b306d593e24497d7baceba1.diff",
            "diff_additions": 67,
            "diff_deletions": 1,
            "diff_file_size": 0,
            "files": [
                {
                    "file_additions": 26,
                    "file_deletions": 0,
                    "file_exists": false,
                    "file_name": "spring-boot-autoconfigure/src/main/java/org/springframework/boot/autoconfigure/security/SecurityProperties.java",
                    "file_size": 0
                },
                {
                    "file_additions": 8,
                    "file_deletions": 0,
                    "file_exists": false,
                    "file_name": "spring-boot-autoconfigure/src/main/java/org/springframework/boot/autoconfigure/security/SpringBootWebSecurityConfiguration.java",
                    "file_size": 0
                },
                {
                    "file_additions": 33,
                    "file_deletions": 1,
                    "file_exists": false,
                    "file_name": "spring-boot-autoconfigure/src/test/java/org/springframework/boot/autoconfigure/security/SpringBootWebSecurityConfigurationTests.java",
                    "file_size": 0
                }
            ],
            "interesting": {
                "reopened": false,
                "status": false
            },
            "sha": "df341a348ab216219b306d593e24497d7baceba1"
        },
        {
            "diff": "spring-projects_spring-boot/issue_7357/commit_ee5ae271036a9d707e3072f7a93def10a24ffa49.diff",
            "diff_additions": 80,
            "diff_deletions": 1,
            "diff_file_size": 0,
            "files": [
                {
                    "file_additions": 38,
                    "file_deletions": 0,
                    "file_exists": false,
                    "file_name": "spring-boot-autoconfigure/src/main/java/org/springframework/boot/autoconfigure/security/SecurityProperties.java",
                    "file_size": 0
                },
                {
                    "file_additions": 9,
                    "file_deletions": 0,
                    "file_exists": false,
                    "file_name": "spring-boot-autoconfigure/src/main/java/org/springframework/boot/autoconfigure/security/SpringBootWebSecurityConfiguration.java",
                    "file_size": 0
                },
                {
                    "file_additions": 33,
                    "file_deletions": 1,
                    "file_exists": false,
                    "file_name": "spring-boot-autoconfigure/src/test/java/org/springframework/boot/autoconfigure/security/SpringBootWebSecurityConfigurationTests.java",
                    "file_size": 0
                }
            ],
            "interesting": {
                "reopened": false,
                "status": true
            },
            "sha": "ee5ae271036a9d707e3072f7a93def10a24ffa49"
        },
        {
            "diff": "spring-projects_spring-boot/issue_7357/commit_16672a34bcabce3dae5bcb003d58b9e81b42d261.diff",
            "diff_additions": 80,
            "diff_deletions": 1,
            "diff_file_size": 0,
            "files": [
                {
                    "file_additions": 38,
                    "file_deletions": 0,
                    "file_exists": false,
                    "file_name": "spring-boot-autoconfigure/src/main/java/org/springframework/boot/autoconfigure/security/SecurityProperties.java",
                    "file_size": 0
                },
                {
                    "file_additions": 9,
                    "file_deletions": 0,
                    "file_exists": false,
                    "file_name": "spring-boot-autoconfigure/src/main/java/org/springframework/boot/autoconfigure/security/SpringBootWebSecurityConfiguration.java",
                    "file_size": 0
                },
                {
                    "file_additions": 33,
                    "file_deletions": 1,
                    "file_exists": false,
                    "file_name": "spring-boot-autoconfigure/src/test/java/org/springframework/boot/autoconfigure/security/SpringBootWebSecurityConfigurationTests.java",
                    "file_size": 0
                }
            ],
            "interesting": {
                "reopened": false,
                "status": false
            },
            "sha": "16672a34bcabce3dae5bcb003d58b9e81b42d261"
        },
        {
            "diff": "spring-projects_spring-boot/issue_7357/commit_d7bbea63b77d55db0db34f9f488ac6e51debdcfa.diff",
            "diff_additions": 80,
            "diff_deletions": 1,
            "diff_file_size": 0,
            "files": [
                {
                    "file_additions": 38,
                    "file_deletions": 0,
                    "file_exists": false,
                    "file_name": "spring-boot-autoconfigure/src/main/java/org/springframework/boot/autoconfigure/security/SecurityProperties.java",
                    "file_size": 0
                },
                {
                    "file_additions": 9,
                    "file_deletions": 0,
                    "file_exists": false,
                    "file_name": "spring-boot-autoconfigure/src/main/java/org/springframework/boot/autoconfigure/security/SpringBootWebSecurityConfiguration.java",
                    "file_size": 0
                },
                {
                    "file_additions": 33,
                    "file_deletions": 1,
                    "file_exists": false,
                    "file_name": "spring-boot-autoconfigure/src/test/java/org/springframework/boot/autoconfigure/security/SpringBootWebSecurityConfigurationTests.java",
                    "file_size": 0
                }
            ],
            "interesting": {
                "reopened": false,
                "status": false
            },
            "sha": "d7bbea63b77d55db0db34f9f488ac6e51debdcfa"
        }
    ],
    "first_commit": "2016-11-12 10:16:30",
    "last_commit": "2016-11-17 05:44:40",
    "number": 7357,
    "score": 320.0128617363344
}