{
    "commits": [
        {
            "associated_pull_request": [],
            "date": "2022-01-06 21:33:35+00:00",
            "diff": "dosemu2_dosemu2/issue_1576/commit_4e4b5fcf7d83c58031fba433c24c308d65acfbf9.diff",
            "diff_additions": 15,
            "diff_deletions": 3,
            "diff_file_size": 36131,
            "diff_url": "https://github.com/dosemu2/dosemu2/commit/4e4b5fcf7d83c58031fba433c24c308d65acfbf9.diff",
            "exists": true,
            "files": [
                {
                    "file_additions": 10,
                    "file_deletions": 1,
                    "file_exists": true,
                    "file_name": "src/base/video/render.c",
                    "file_size": 23017
                },
                {
                    "file_additions": 5,
                    "file_deletions": 2,
                    "file_exists": true,
                    "file_name": "src/base/video/video.c",
                    "file_size": 13114
                }
            ],
            "interesting": {
                "reopen": false,
                "status": false
            },
            "is_parent": true,
            "sha": "4e4b5fcf7d83c58031fba433c24c308d65acfbf9"
        },
        {
            "associated_pull_request": [],
            "date": "2022-01-07 22:24:48+00:00",
            "diff": "dosemu2_dosemu2/issue_1576/commit_582a2cf772a339bf1cd5d3fa41e3ba436eea2ff5.diff",
            "diff_additions": 7,
            "diff_deletions": 13,
            "diff_file_size": 8530,
            "diff_url": "https://github.com/dosemu2/dosemu2/commit/582a2cf772a339bf1cd5d3fa41e3ba436eea2ff5.diff",
            "exists": true,
            "files": [
                {
                    "file_additions": 1,
                    "file_deletions": 13,
                    "file_exists": true,
                    "file_name": "src/base/lib/libpcl/pcl.c",
                    "file_size": 5263
                },
                {
                    "file_additions": 6,
                    "file_deletions": 0,
                    "file_exists": true,
                    "file_name": "src/base/lib/libpcl/pcl_ctx.c",
                    "file_size": 3267
                }
            ],
            "interesting": {
                "reopen": false,
                "status": false
            },
            "is_parent": false,
            "sha": "582a2cf772a339bf1cd5d3fa41e3ba436eea2ff5"
        },
        {
            "associated_pull_request": [],
            "date": "2022-01-07 23:30:49+00:00",
            "diff": "dosemu2_dosemu2/issue_1576/commit_79969dc804baa051b9f7646ac2adc8fc41950565.diff",
            "diff_additions": 1,
            "diff_deletions": 1,
            "diff_file_size": 26043,
            "diff_url": "https://github.com/dosemu2/dosemu2/commit/79969dc804baa051b9f7646ac2adc8fc41950565.diff",
            "exists": true,
            "files": [
                {
                    "file_additions": 1,
                    "file_deletions": 1,
                    "file_exists": true,
                    "file_name": "src/dosext/mfs/mangle.c",
                    "file_size": 26043
                }
            ],
            "interesting": {
                "reopen": false,
                "status": false
            },
            "is_parent": false,
            "sha": "79969dc804baa051b9f7646ac2adc8fc41950565"
        },
        {
            "associated_pull_request": [],
            "date": "2022-01-08 11:16:11+00:00",
            "diff": "dosemu2_dosemu2/issue_1576/commit_109a52b3dd777fc470436c1305107c14fdc14ec8.diff",
            "diff_additions": 1,
            "diff_deletions": 1,
            "diff_file_size": 26043,
            "diff_url": "https://github.com/dosemu2/dosemu2/commit/109a52b3dd777fc470436c1305107c14fdc14ec8.diff",
            "exists": true,
            "files": [
                {
                    "file_additions": 1,
                    "file_deletions": 1,
                    "file_exists": true,
                    "file_name": "src/dosext/mfs/mangle.c",
                    "file_size": 26043
                }
            ],
            "interesting": {
                "reopen": false,
                "status": false
            },
            "is_parent": false,
            "sha": "109a52b3dd777fc470436c1305107c14fdc14ec8"
        },
        {
            "associated_pull_request": [],
            "date": "2022-01-08 11:23:45+00:00",
            "diff": "dosemu2_dosemu2/issue_1576/commit_33e5aee21d18c2bc55146f302e47450e92a7d228.diff",
            "diff_additions": 11,
            "diff_deletions": 3,
            "diff_file_size": 155164,
            "diff_url": "https://github.com/dosemu2/dosemu2/commit/33e5aee21d18c2bc55146f302e47450e92a7d228.diff",
            "exists": true,
            "files": [
                {
                    "file_additions": 9,
                    "file_deletions": 1,
                    "file_exists": true,
                    "file_name": "src/dosext/mfs/mangle.c",
                    "file_size": 26043
                },
                {
                    "file_additions": 2,
                    "file_deletions": 2,
                    "file_exists": true,
                    "file_name": "src/dosext/mfs/mfs.c",
                    "file_size": 129121
                }
            ],
            "interesting": {
                "reopen": true,
                "status": false
            },
            "is_parent": false,
            "sha": "33e5aee21d18c2bc55146f302e47450e92a7d228"
        },
        {
            "associated_pull_request": [],
            "date": "2022-01-08 21:16:36+00:00",
            "diff": "dosemu2_dosemu2/issue_1576/commit_f343f97eb04909dbe6fdb2ee5466015df57659ae.diff",
            "diff_additions": 13,
            "diff_deletions": 7,
            "diff_file_size": 8530,
            "diff_url": "https://github.com/dosemu2/dosemu2/commit/f343f97eb04909dbe6fdb2ee5466015df57659ae.diff",
            "exists": true,
            "files": [
                {
                    "file_additions": 13,
                    "file_deletions": 1,
                    "file_exists": true,
                    "file_name": "src/base/lib/libpcl/pcl.c",
                    "file_size": 5263
                },
                {
                    "file_additions": 0,
                    "file_deletions": 6,
                    "file_exists": true,
                    "file_name": "src/base/lib/libpcl/pcl_ctx.c",
                    "file_size": 3267
                }
            ],
            "interesting": {
                "reopen": false,
                "status": false
            },
            "is_parent": false,
            "sha": "f343f97eb04909dbe6fdb2ee5466015df57659ae"
        },
        {
            "associated_pull_request": [],
            "date": "2022-01-08 21:02:58+00:00",
            "diff": "dosemu2_dosemu2/issue_1576/commit_fad89942449358a80f16eaa8ae1f4ab0663e6e73.diff",
            "diff_additions": 0,
            "diff_deletions": 6,
            "diff_file_size": 1420,
            "diff_url": "https://github.com/dosemu2/dosemu2/commit/fad89942449358a80f16eaa8ae1f4ab0663e6e73.diff",
            "exists": true,
            "files": [
                {
                    "file_additions": 0,
                    "file_deletions": 6,
                    "file_exists": true,
                    "file_name": "src/base/lib/mcontext/context.c",
                    "file_size": 1420
                }
            ],
            "interesting": {
                "reopen": false,
                "status": false
            },
            "is_parent": false,
            "sha": "fad89942449358a80f16eaa8ae1f4ab0663e6e73"
        },
        {
            "associated_pull_request": [],
            "date": "2022-01-09 00:49:55+00:00",
            "diff": "dosemu2_dosemu2/issue_1576/commit_3c268e328e9c31d126408e8cf7ba6445c9922e22.diff",
            "diff_additions": 6,
            "diff_deletions": 1,
            "diff_file_size": 20888,
            "diff_url": "https://github.com/dosemu2/dosemu2/commit/3c268e328e9c31d126408e8cf7ba6445c9922e22.diff",
            "exists": true,
            "files": [
                {
                    "file_additions": 6,
                    "file_deletions": 1,
                    "file_exists": true,
                    "file_name": "src/arch/linux/async/signal.c",
                    "file_size": 20888
                }
            ],
            "interesting": {
                "reopen": false,
                "status": false
            },
            "is_parent": false,
            "sha": "3c268e328e9c31d126408e8cf7ba6445c9922e22"
        }
    ],
    "first_commit": "2022-01-06 21:33:35+00:00",
    "last_commit": "2023-01-25 16:32:29+00:00",
    "number": 1576,
    "pull_request": "None",
    "score": {
        "accidental_reopen_likely": false,
        "all_labels": [],
        "contains_keywords": [
            "work",
            "fix",
            "issu",
            "patch",
            "debug",
            "bug",
            "crash",
            "report"
        ],
        "fix_size": 50,
        "has_labels": [],
        "intersecting": {
            "computed_score": 0.0,
            "final_commit_size": 8,
            "intersection_size": 0,
            "previous_commits_size": 42
        },
        "is_makefile_based": true,
        "no_new_files": [
            "src/arch/linux/async/signal.c"
        ],
        "no_other_files": false,
        "num_prohibited_files": 563206,
        "prohibited_files": [
            "server/src/main/java/com/genymobile/scrcpy/Device.java",
            "server/src/main/java/com/genymobile/scrcpy/wrappers/SurfaceControl.java",
            "server/src/main/java/com/genymobile/scrcpy/Device.java",
            "server/src/main/java/com/genymobile/scrcpy/wrappers/SurfaceControl.java",
            "app/meson.build",
            "app/scrcpy.1",
            "app/src/common.h",
            "app/src/scrcpy.h",
            "app/src/server.h",
            "server/src/main/java/com/genymobile/scrcpy/Workarounds.java"
        ],
        "reopen": true,
        "reopen_events": [
            [
                "2022-01-07 23:38:13+00:00",
                "commit"
            ],
            [
                "2022-01-07 23:38:13+00:00",
                "commit"
            ],
            [
                "2022-01-07 23:38:13+00:00",
                "closed"
            ],
            [
                "2022-01-07 23:38:13+00:00",
                "commit"
            ],
            [
                "2022-01-08 11:25:05+00:00",
                "commit"
            ],
            [
                "2022-01-08 11:25:05+00:00",
                "commit"
            ],
            [
                "2022-01-08 12:51:57+00:00",
                "reopened"
            ],
            [
                "2022-01-08 21:20:37+00:00",
                "commit"
            ],
            [
                "2022-01-08 21:20:37+00:00",
                "closed"
            ],
            [
                "2022-01-08 21:20:37+00:00",
                "commit"
            ],
            [
                "2022-01-08 21:20:37+00:00",
                "commit"
            ],
            [
                "2022-01-08 22:48:23+00:00",
                "reopened"
            ],
            [
                "2022-01-09 00:55:18+00:00",
                "closed"
            ],
            [
                "2022-01-09 00:55:18+00:00",
                "commit"
            ],
            [
                "2023-01-25 17:04:42+00:00",
                "commit"
            ]
        ],
        "status": false,
        "strategy": true,
        "total_changes": 89
    }
}