{
    "commits": [
        {
            "diff": "elastic_elasticsearch/issue_38623/commit_c921a87fc51c8fe57efdfcb2277c967886fce080.diff",
            "diff_additions": 33,
            "diff_deletions": 43,
            "diff_file_size": 42841,
            "files": [
                {
                    "file_additions": 17,
                    "file_deletions": 0,
                    "file_exists": true,
                    "file_name": "server/src/main/java/org/elasticsearch/common/time/DateUtils.java",
                    "file_size": 17817
                },
                {
                    "file_additions": 8,
                    "file_deletions": 14,
                    "file_exists": false,
                    "file_name": "x-pack/plugin/core/src/test/java/org/elasticsearch/protocol/xpack/watcher/GetWatchResponseTests.java",
                    "file_size": 0
                },
                {
                    "file_additions": 2,
                    "file_deletions": 8,
                    "file_exists": true,
                    "file_name": "x-pack/plugin/core/src/test/java/org/elasticsearch/xpack/core/ml/calendars/ScheduledEventTests.java",
                    "file_size": 5328
                },
                {
                    "file_additions": 0,
                    "file_deletions": 16,
                    "file_exists": false,
                    "file_name": "x-pack/plugin/sql/src/test/java/org/elasticsearch/xpack/sql/TestUtils.java",
                    "file_size": 0
                },
                {
                    "file_additions": 4,
                    "file_deletions": 3,
                    "file_exists": false,
                    "file_name": "x-pack/plugin/sql/src/test/java/org/elasticsearch/xpack/sql/type/DataTypeConversionTests.java",
                    "file_size": 0
                },
                {
                    "file_additions": 2,
                    "file_deletions": 2,
                    "file_exists": true,
                    "file_name": "x-pack/plugin/watcher/src/test/java/org/elasticsearch/xpack/watcher/actions/index/IndexActionTests.java",
                    "file_size": 19696
                }
            ],
            "interesting": {
                "reopened": false,
                "status": false
            },
            "sha": "c921a87fc51c8fe57efdfcb2277c967886fce080"
        },
        {
            "diff": "elastic_elasticsearch/issue_38623/commit_9b4d96534b0b2ee3fb590418c7e0ff86adb689f3.diff",
            "diff_additions": 31,
            "diff_deletions": 31,
            "diff_file_size": 16040,
            "files": [
                {
                    "file_additions": 2,
                    "file_deletions": 2,
                    "file_exists": true,
                    "file_name": "x-pack/docs/src/test/java/org/elasticsearch/smoketest/XDocsClientYamlTestSuiteIT.java",
                    "file_size": 6311
                },
                {
                    "file_additions": 3,
                    "file_deletions": 3,
                    "file_exists": false,
                    "file_name": "x-pack/plugin/ml/qa/ml-with-security/src/test/java/org/elasticsearch/smoketest/MlWithSecurityUserRoleIT.java",
                    "file_size": 0
                },
                {
                    "file_additions": 2,
                    "file_deletions": 2,
                    "file_exists": false,
                    "file_name": "x-pack/plugin/src/test/java/org/elasticsearch/xpack/test/rest/XPackRestIT.java",
                    "file_size": 0
                },
                {
                    "file_additions": 4,
                    "file_deletions": 4,
                    "file_exists": false,
                    "file_name": "x-pack/qa/smoke-test-watcher-with-security/src/test/java/org/elasticsearch/smoketest/SmokeTestWatcherWithSecurityClientYamlTestSuiteIT.java",
                    "file_size": 0
                },
                {
                    "file_additions": 4,
                    "file_deletions": 4,
                    "file_exists": false,
                    "file_name": "x-pack/qa/smoke-test-watcher/src/test/java/org/elasticsearch/smoketest/WatcherRestIT.java",
                    "file_size": 0
                },
                {
                    "file_additions": 4,
                    "file_deletions": 4,
                    "file_exists": false,
                    "file_name": "x-pack/qa/third-party/hipchat/src/test/java/org/elasticsearch/smoketest/WatcherHipchatYamlTestSuiteIT.java",
                    "file_size": 0
                },
                {
                    "file_additions": 4,
                    "file_deletions": 4,
                    "file_exists": true,
                    "file_name": "x-pack/qa/third-party/jira/src/test/java/org/elasticsearch/smoketest/WatcherJiraYamlTestSuiteIT.java",
                    "file_size": 3239
                },
                {
                    "file_additions": 4,
                    "file_deletions": 4,
                    "file_exists": true,
                    "file_name": "x-pack/qa/third-party/pagerduty/src/test/java/org/elasticsearch/smoketest/WatcherPagerDutyYamlTestSuiteIT.java",
                    "file_size": 3249
                },
                {
                    "file_additions": 4,
                    "file_deletions": 4,
                    "file_exists": true,
                    "file_name": "x-pack/qa/third-party/slack/src/test/java/org/elasticsearch/smoketest/WatcherSlackYamlTestSuiteIT.java",
                    "file_size": 3241
                }
            ],
            "interesting": {
                "reopened": false,
                "status": false
            },
            "sha": "9b4d96534b0b2ee3fb590418c7e0ff86adb689f3"
        },
        {
            "diff": "elastic_elasticsearch/issue_38623/commit_8433480ea24ca45577b0eb798326699be67a4c03.diff",
            "diff_additions": 9339,
            "diff_deletions": 991,
            "diff_file_size": 911370,
            "files": [
                {
                    "file_additions": 25,
                    "file_deletions": 14,
                    "file_exists": true,
                    "file_name": "buildSrc/src/main/java/org/elasticsearch/gradle/testclusters/ElasticsearchNode.java",
                    "file_size": 62781
                },
                {
                    "file_additions": 3,
                    "file_deletions": 3,
                    "file_exists": true,
                    "file_name": "client/rest-high-level/src/test/java/org/elasticsearch/client/IndicesClientIT.java",
                    "file_size": 100961
                },
                {
                    "file_additions": 13,
                    "file_deletions": 29,
                    "file_exists": true,
                    "file_name": "qa/full-cluster-restart/src/test/java/org/elasticsearch/upgrades/FullClusterRestartIT.java",
                    "file_size": 80527
                },
                {
                    "file_additions": 0,
                    "file_deletions": 78,
                    "file_exists": false,
                    "file_name": "qa/full-cluster-restart/src/test/java/org/elasticsearch/upgrades/FullClusterRestartSettingsUpgradeIT.java",
                    "file_size": 0
                },
                {
                    "file_additions": 1,
                    "file_deletions": 9,
                    "file_exists": true,
                    "file_name": "qa/full-cluster-restart/src/test/java/org/elasticsearch/upgrades/QueryBuilderBWCIT.java",
                    "file_size": 11474
                },
                {
                    "file_additions": 12,
                    "file_deletions": 0,
                    "file_exists": true,
                    "file_name": "server/src/main/java/org/elasticsearch/index/CompositeIndexEventListener.java",
                    "file_size": 9910
                },
                {
                    "file_additions": 1,
                    "file_deletions": 0,
                    "file_exists": true,
                    "file_name": "server/src/main/java/org/elasticsearch/index/IndexService.java",
                    "file_size": 47167
                },
                {
                    "file_additions": 25,
                    "file_deletions": 0,
                    "file_exists": true,
                    "file_name": "server/src/main/java/org/elasticsearch/index/mapper/CompletionFieldMapper.java",
                    "file_size": 24622
                },
                {
                    "file_additions": 6,
                    "file_deletions": 0,
                    "file_exists": true,
                    "file_name": "server/src/main/java/org/elasticsearch/index/query/IntervalsSourceProvider.java",
                    "file_size": 40484
                },
                {
                    "file_additions": 7,
                    "file_deletions": 0,
                    "file_exists": true,
                    "file_name": "server/src/main/java/org/elasticsearch/index/shard/IndexEventListener.java",
                    "file_size": 6534
                },
                {
                    "file_additions": 35,
                    "file_deletions": 9,
                    "file_exists": true,
                    "file_name": "server/src/main/java/org/elasticsearch/indices/IndicesService.java",
                    "file_size": 82099
                },
                {
                    "file_additions": 1,
                    "file_deletions": 1,
                    "file_exists": true,
                    "file_name": "server/src/main/java/org/elasticsearch/indices/analysis/PreBuiltCacheFactory.java",
                    "file_size": 3756
                },
                {
                    "file_additions": 22,
                    "file_deletions": 0,
                    "file_exists": true,
                    "file_name": "server/src/test/java/org/elasticsearch/index/mapper/CompletionFieldMapperTests.java",
                    "file_size": 33647
                },
                {
                    "file_additions": 1,
                    "file_deletions": 5,
                    "file_exists": true,
                    "file_name": "server/src/test/java/org/elasticsearch/index/mapper/ExternalMapper.java",
                    "file_size": 7312
                },
                {
                    "file_additions": 2,
                    "file_deletions": 1,
                    "file_exists": true,
                    "file_name": "server/src/test/java/org/elasticsearch/index/query/IntervalQueryBuilderTests.java",
                    "file_size": 30485
                },
                {
                    "file_additions": 124,
                    "file_deletions": 0,
                    "file_exists": true,
                    "file_name": "server/src/test/java/org/elasticsearch/indices/IndicesServiceCloseTests.java",
                    "file_size": 14197
                },
                {
                    "file_additions": 6,
                    "file_deletions": 3,
                    "file_exists": true,
                    "file_name": "test/framework/src/main/java/org/elasticsearch/index/replication/ESIndexLevelReplicationTestCase.java",
                    "file_size": 45386
                },
                {
                    "file_additions": 0,
                    "file_deletions": 64,
                    "file_exists": true,
                    "file_name": "test/framework/src/main/java/org/elasticsearch/test/rest/yaml/ClientYamlTestExecutionContext.java",
                    "file_size": 8371
                },
                {
                    "file_additions": 1,
                    "file_deletions": 11,
                    "file_exists": true,
                    "file_name": "test/framework/src/main/java/org/elasticsearch/test/rest/yaml/section/DoSection.java",
                    "file_size": 23806
                },
                {
                    "file_additions": 0,
                    "file_deletions": 4,
                    "file_exists": true,
                    "file_name": "test/framework/src/main/java/org/elasticsearch/upgrades/AbstractFullClusterRestartTestCase.java",
                    "file_size": 1929
                },
                {
                    "file_additions": 2,
                    "file_deletions": 2,
                    "file_exists": true,
                    "file_name": "x-pack/docs/src/test/java/org/elasticsearch/smoketest/XDocsClientYamlTestSuiteIT.java",
                    "file_size": 6311
                },
                {
                    "file_additions": 7,
                    "file_deletions": 1,
                    "file_exists": true,
                    "file_name": "x-pack/plugin/ccr/src/test/java/org/elasticsearch/xpack/CcrIntegTestCase.java",
                    "file_size": 43264
                },
                {
                    "file_additions": 1,
                    "file_deletions": 0,
                    "file_exists": false,
                    "file_name": "x-pack/plugin/ccr/src/test/java/org/elasticsearch/xpack/ccr/CcrRetentionLeaseIT.java",
                    "file_size": 0
                },
                {
                    "file_additions": 1,
                    "file_deletions": 0,
                    "file_exists": false,
                    "file_name": "x-pack/plugin/ccr/src/test/java/org/elasticsearch/xpack/ccr/FollowStatsIT.java",
                    "file_size": 0
                },
                {
                    "file_additions": 1,
                    "file_deletions": 0,
                    "file_exists": false,
                    "file_name": "x-pack/plugin/ccr/src/test/java/org/elasticsearch/xpack/ccr/IndexFollowingIT.java",
                    "file_size": 0
                },
                {
                    "file_additions": 295,
                    "file_deletions": 218,
                    "file_exists": true,
                    "file_name": "x-pack/plugin/ccr/src/test/java/org/elasticsearch/xpack/ccr/action/ShardFollowTaskReplicationTests.java",
                    "file_size": 40089
                },
                {
                    "file_additions": 9,
                    "file_deletions": 0,
                    "file_exists": true,
                    "file_name": "x-pack/plugin/core/src/main/java/org/elasticsearch/license/XPackLicenseState.java",
                    "file_size": 27997
                },
                {
                    "file_additions": 1,
                    "file_deletions": 0,
                    "file_exists": true,
                    "file_name": "x-pack/plugin/core/src/main/java/org/elasticsearch/xpack/core/ClientHelper.java",
                    "file_size": 9657
                },
                {
                    "file_additions": 4,
                    "file_deletions": 2,
                    "file_exists": true,
                    "file_name": "x-pack/plugin/core/src/main/java/org/elasticsearch/xpack/core/XPackClientPlugin.java",
                    "file_size": 36002
                },
                {
                    "file_additions": 2,
                    "file_deletions": 0,
                    "file_exists": true,
                    "file_name": "x-pack/plugin/core/src/main/java/org/elasticsearch/xpack/core/XPackField.java",
                    "file_size": 3982
                },
                {
                    "file_additions": 5,
                    "file_deletions": 0,
                    "file_exists": true,
                    "file_name": "x-pack/plugin/core/src/main/java/org/elasticsearch/xpack/core/XPackSettings.java",
                    "file_size": 11586
                },
                {
                    "file_additions": 83,
                    "file_deletions": 0,
                    "file_exists": false,
                    "file_name": "x-pack/plugin/core/src/main/java/org/elasticsearch/xpack/core/dataframe/DataFrameFeatureSetUsage.java",
                    "file_size": 0
                },
                {
                    "file_additions": 46,
                    "file_deletions": 0,
                    "file_exists": false,
                    "file_name": "x-pack/plugin/core/src/main/java/org/elasticsearch/xpack/core/dataframe/DataFrameField.java",
                    "file_size": 0
                },
                {
                    "file_additions": 73,
                    "file_deletions": 0,
                    "file_exists": false,
                    "file_name": "x-pack/plugin/core/src/main/java/org/elasticsearch/xpack/core/dataframe/DataFrameMessages.java",
                    "file_size": 0
                },
                {
                    "file_additions": 102,
                    "file_deletions": 0,
                    "file_exists": false,
                    "file_name": "x-pack/plugin/core/src/main/java/org/elasticsearch/xpack/core/dataframe/transform/DataFrameIndexerTransformStats.java",
                    "file_size": 0
                },
                {
                    "file_additions": 149,
                    "file_deletions": 0,
                    "file_exists": false,
                    "file_name": "x-pack/plugin/core/src/main/java/org/elasticsearch/xpack/core/dataframe/transform/DataFrameTransformState.java",
                    "file_size": 0
                },
                {
                    "file_additions": 36,
                    "file_deletions": 0,
                    "file_exists": false,
                    "file_name": "x-pack/plugin/core/src/test/java/org/elasticsearch/xpack/core/dataframe/DataFrameFeatureSetUsageTests.java",
                    "file_size": 0
                },
                {
                    "file_additions": 74,
                    "file_deletions": 0,
                    "file_exists": false,
                    "file_name": "x-pack/plugin/core/src/test/java/org/elasticsearch/xpack/core/dataframe/DataFrameMessagesTests.java",
                    "file_size": 0
                },
                {
                    "file_additions": 53,
                    "file_deletions": 0,
                    "file_exists": false,
                    "file_name": "x-pack/plugin/core/src/test/java/org/elasticsearch/xpack/core/dataframe/transform/DataFrameIndexerTransformStatsTests.java",
                    "file_size": 0
                },
                {
                    "file_additions": 57,
                    "file_deletions": 0,
                    "file_exists": false,
                    "file_name": "x-pack/plugin/core/src/test/java/org/elasticsearch/xpack/core/dataframe/transform/DataFrameTransformStateTests.java",
                    "file_size": 0
                },
                {
                    "file_additions": 0,
                    "file_deletions": 6,
                    "file_exists": false,
                    "file_name": "x-pack/plugin/core/src/test/java/org/elasticsearch/xpack/test/rest/XPackRestTestHelper.java",
                    "file_size": 0
                },
                {
                    "file_additions": 58,
                    "file_deletions": 0,
                    "file_exists": false,
                    "file_name": "x-pack/plugin/data-frame/qa/single-node-tests/src/test/java/org/elasticsearch/xpack/dataframe/integration/DataFrameConfigurationIndexIT.java",
                    "file_size": 0
                },
                {
                    "file_additions": 59,
                    "file_deletions": 0,
                    "file_exists": false,
                    "file_name": "x-pack/plugin/data-frame/qa/single-node-tests/src/test/java/org/elasticsearch/xpack/dataframe/integration/DataFrameMetaDataIT.java",
                    "file_size": 0
                },
                {
                    "file_additions": 263,
                    "file_deletions": 0,
                    "file_exists": false,
                    "file_name": "x-pack/plugin/data-frame/qa/single-node-tests/src/test/java/org/elasticsearch/xpack/dataframe/integration/DataFramePivotRestIT.java",
                    "file_size": 0
                },
                {
                    "file_additions": 224,
                    "file_deletions": 0,
                    "file_exists": false,
                    "file_name": "x-pack/plugin/data-frame/qa/single-node-tests/src/test/java/org/elasticsearch/xpack/dataframe/integration/DataFrameRestTestCase.java",
                    "file_size": 0
                },
                {
                    "file_additions": 58,
                    "file_deletions": 0,
                    "file_exists": false,
                    "file_name": "x-pack/plugin/data-frame/qa/single-node-tests/src/test/java/org/elasticsearch/xpack/dataframe/integration/DataFrameUsageIT.java",
                    "file_size": 0
                },
                {
                    "file_additions": 226,
                    "file_deletions": 0,
                    "file_exists": false,
                    "file_name": "x-pack/plugin/data-frame/src/main/java/org/elasticsearch/xpack/dataframe/DataFrame.java",
                    "file_size": 0
                },
                {
                    "file_additions": 88,
                    "file_deletions": 0,
                    "file_exists": false,
                    "file_name": "x-pack/plugin/data-frame/src/main/java/org/elasticsearch/xpack/dataframe/DataFrameFeatureSet.java",
                    "file_size": 0
                },
                {
                    "file_additions": 103,
                    "file_deletions": 0,
                    "file_exists": false,
                    "file_name": "x-pack/plugin/data-frame/src/main/java/org/elasticsearch/xpack/dataframe/action/DataFrameTransformStateAndStats.java",
                    "file_size": 0
                },
                {
                    "file_additions": 175,
                    "file_deletions": 0,
                    "file_exists": false,
                    "file_name": "x-pack/plugin/data-frame/src/main/java/org/elasticsearch/xpack/dataframe/action/DeleteDataFrameTransformAction.java",
                    "file_size": 0
                },
                {
                    "file_additions": 223,
                    "file_deletions": 0,
                    "file_exists": false,
                    "file_name": "x-pack/plugin/data-frame/src/main/java/org/elasticsearch/xpack/dataframe/action/GetDataFrameTransformsAction.java",
                    "file_size": 0
                },
                {
                    "file_additions": 193,
                    "file_deletions": 0,
                    "file_exists": false,
                    "file_name": "x-pack/plugin/data-frame/src/main/java/org/elasticsearch/xpack/dataframe/action/GetDataFrameTransformsStatsAction.java",
                    "file_size": 0
                },
                {
                    "file_additions": 119,
                    "file_deletions": 0,
                    "file_exists": false,
                    "file_name": "x-pack/plugin/data-frame/src/main/java/org/elasticsearch/xpack/dataframe/action/PutDataFrameTransformAction.java",
                    "file_size": 0
                },
                {
                    "file_additions": 162,
                    "file_deletions": 0,
                    "file_exists": false,
                    "file_name": "x-pack/plugin/data-frame/src/main/java/org/elasticsearch/xpack/dataframe/action/StartDataFrameTransformAction.java",
                    "file_size": 0
                },
                {
                    "file_additions": 200,
                    "file_deletions": 0,
                    "file_exists": false,
                    "file_name": "x-pack/plugin/data-frame/src/main/java/org/elasticsearch/xpack/dataframe/action/StopDataFrameTransformAction.java",
                    "file_size": 0
                },
                {
                    "file_additions": 99,
                    "file_deletions": 0,
                    "file_exists": false,
                    "file_name": "x-pack/plugin/data-frame/src/main/java/org/elasticsearch/xpack/dataframe/action/TransportDeleteDataFrameTransformAction.java",
                    "file_size": 0
                },
                {
                    "file_additions": 101,
                    "file_deletions": 0,
                    "file_exists": false,
                    "file_name": "x-pack/plugin/data-frame/src/main/java/org/elasticsearch/xpack/dataframe/action/TransportGetDataFrameTransformsAction.java",
                    "file_size": 0
                },
                {
                    "file_additions": 98,
                    "file_deletions": 0,
                    "file_exists": false,
                    "file_name": "x-pack/plugin/data-frame/src/main/java/org/elasticsearch/xpack/dataframe/action/TransportGetDataFrameTransformsStatsAction.java",
                    "file_size": 0
                },
                {
                    "file_additions": 148,
                    "file_deletions": 0,
                    "file_exists": false,
                    "file_name": "x-pack/plugin/data-frame/src/main/java/org/elasticsearch/xpack/dataframe/action/TransportPutDataFrameTransformAction.java",
                    "file_size": 0
                },
                {
                    "file_additions": 110,
                    "file_deletions": 0,
                    "file_exists": false,
                    "file_name": "x-pack/plugin/data-frame/src/main/java/org/elasticsearch/xpack/dataframe/action/TransportStartDataFrameTransformAction.java",
                    "file_size": 0
                },
                {
                    "file_additions": 120,
                    "file_deletions": 0,
                    "file_exists": false,
                    "file_name": "x-pack/plugin/data-frame/src/main/java/org/elasticsearch/xpack/dataframe/action/TransportStopDataFrameTransformAction.java",
                    "file_size": 0
                },
                {
                    "file_additions": 107,
                    "file_deletions": 0,
                    "file_exists": false,
                    "file_name": "x-pack/plugin/data-frame/src/main/java/org/elasticsearch/xpack/dataframe/persistence/DataFrameInternalIndex.java",
                    "file_size": 0
                },
                {
                    "file_additions": 41,
                    "file_deletions": 0,
                    "file_exists": false,
                    "file_name": "x-pack/plugin/data-frame/src/main/java/org/elasticsearch/xpack/dataframe/persistence/DataFramePersistentTaskUtils.java",
                    "file_size": 0
                },
                {
                    "file_additions": 151,
                    "file_deletions": 0,
                    "file_exists": false,
                    "file_name": "x-pack/plugin/data-frame/src/main/java/org/elasticsearch/xpack/dataframe/persistence/DataFrameTransformsConfigManager.java",
                    "file_size": 0
                },
                {
                    "file_additions": 89,
                    "file_deletions": 0,
                    "file_exists": false,
                    "file_name": "x-pack/plugin/data-frame/src/main/java/org/elasticsearch/xpack/dataframe/persistence/DataframeIndex.java",
                    "file_size": 0
                },
                {
                    "file_additions": 49,
                    "file_deletions": 0,
                    "file_exists": false,
                    "file_name": "x-pack/plugin/data-frame/src/main/java/org/elasticsearch/xpack/dataframe/rest/action/RestDeleteDataFrameTransformAction.java",
                    "file_size": 0
                },
                {
                    "file_additions": 36,
                    "file_deletions": 0,
                    "file_exists": false,
                    "file_name": "x-pack/plugin/data-frame/src/main/java/org/elasticsearch/xpack/dataframe/rest/action/RestGetDataFrameTransformsAction.java",
                    "file_size": 0
                },
                {
                    "file_additions": 36,
                    "file_deletions": 0,
                    "file_exists": false,
                    "file_name": "x-pack/plugin/data-frame/src/main/java/org/elasticsearch/xpack/dataframe/rest/action/RestGetDataFrameTransformsStatsAction.java",
                    "file_size": 0
                },
                {
                    "file_additions": 42,
                    "file_deletions": 0,
                    "file_exists": false,
                    "file_name": "x-pack/plugin/data-frame/src/main/java/org/elasticsearch/xpack/dataframe/rest/action/RestPutDataFrameTransformAction.java",
                    "file_size": 0
                },
                {
                    "file_additions": 40,
                    "file_deletions": 0,
                    "file_exists": false,
                    "file_name": "x-pack/plugin/data-frame/src/main/java/org/elasticsearch/xpack/dataframe/rest/action/RestStartDataFrameTransformAction.java",
                    "file_size": 0
                },
                {
                    "file_additions": 43,
                    "file_deletions": 0,
                    "file_exists": false,
                    "file_name": "x-pack/plugin/data-frame/src/main/java/org/elasticsearch/xpack/dataframe/rest/action/RestStopDataFrameTransformAction.java",
                    "file_size": 0
                },
                {
                    "file_additions": 90,
                    "file_deletions": 0,
                    "file_exists": false,
                    "file_name": "x-pack/plugin/data-frame/src/main/java/org/elasticsearch/xpack/dataframe/transforms/DataFrameIndexer.java",
                    "file_size": 0
                },
                {
                    "file_additions": 99,
                    "file_deletions": 0,
                    "file_exists": false,
                    "file_name": "x-pack/plugin/data-frame/src/main/java/org/elasticsearch/xpack/dataframe/transforms/DataFrameTransform.java",
                    "file_size": 0
                },
                {
                    "file_additions": 210,
                    "file_deletions": 0,
                    "file_exists": false,
                    "file_name": "x-pack/plugin/data-frame/src/main/java/org/elasticsearch/xpack/dataframe/transforms/DataFrameTransformConfig.java",
                    "file_size": 0
                },
                {
                    "file_additions": 71,
                    "file_deletions": 0,
                    "file_exists": false,
                    "file_name": "x-pack/plugin/data-frame/src/main/java/org/elasticsearch/xpack/dataframe/transforms/DataFrameTransformPersistentTasksExecutor.java",
                    "file_size": 0
                },
                {
                    "file_additions": 328,
                    "file_deletions": 0,
                    "file_exists": false,
                    "file_name": "x-pack/plugin/data-frame/src/main/java/org/elasticsearch/xpack/dataframe/transforms/DataFrameTransformTask.java",
                    "file_size": 0
                },
                {
                    "file_additions": 113,
                    "file_deletions": 0,
                    "file_exists": false,
                    "file_name": "x-pack/plugin/data-frame/src/main/java/org/elasticsearch/xpack/dataframe/transforms/QueryConfig.java",
                    "file_size": 0
                },
                {
                    "file_additions": 120,
                    "file_deletions": 0,
                    "file_exists": false,
                    "file_name": "x-pack/plugin/data-frame/src/main/java/org/elasticsearch/xpack/dataframe/transforms/pivot/AggregationConfig.java",
                    "file_size": 0
                },
                {
                    "file_additions": 66,
                    "file_deletions": 0,
                    "file_exists": false,
                    "file_name": "x-pack/plugin/data-frame/src/main/java/org/elasticsearch/xpack/dataframe/transforms/pivot/AggregationResultUtils.java",
                    "file_size": 0
                },
                {
                    "file_additions": 62,
                    "file_deletions": 0,
                    "file_exists": false,
                    "file_name": "x-pack/plugin/data-frame/src/main/java/org/elasticsearch/xpack/dataframe/transforms/pivot/Aggregations.java",
                    "file_size": 0
                },
                {
                    "file_additions": 182,
                    "file_deletions": 0,
                    "file_exists": false,
                    "file_name": "x-pack/plugin/data-frame/src/main/java/org/elasticsearch/xpack/dataframe/transforms/pivot/DateHistogramGroupSource.java",
                    "file_size": 0
                },
                {
                    "file_additions": 185,
                    "file_deletions": 0,
                    "file_exists": false,
                    "file_name": "x-pack/plugin/data-frame/src/main/java/org/elasticsearch/xpack/dataframe/transforms/pivot/GroupConfig.java",
                    "file_size": 0
                },
                {
                    "file_additions": 102,
                    "file_deletions": 0,
                    "file_exists": false,
                    "file_name": "x-pack/plugin/data-frame/src/main/java/org/elasticsearch/xpack/dataframe/transforms/pivot/HistogramGroupSource.java",
                    "file_size": 0
                },
                {
                    "file_additions": 130,
                    "file_deletions": 0,
                    "file_exists": false,
                    "file_name": "x-pack/plugin/data-frame/src/main/java/org/elasticsearch/xpack/dataframe/transforms/pivot/Pivot.java",
                    "file_size": 0
                },
                {
                    "file_additions": 147,
                    "file_deletions": 0,
                    "file_exists": false,
                    "file_name": "x-pack/plugin/data-frame/src/main/java/org/elasticsearch/xpack/dataframe/transforms/pivot/PivotConfig.java",
                    "file_size": 0
                },
                {
                    "file_additions": 143,
                    "file_deletions": 0,
                    "file_exists": false,
                    "file_name": "x-pack/plugin/data-frame/src/main/java/org/elasticsearch/xpack/dataframe/transforms/pivot/SchemaUtil.java",
                    "file_size": 0
                },
                {
                    "file_additions": 121,
                    "file_deletions": 0,
                    "file_exists": false,
                    "file_name": "x-pack/plugin/data-frame/src/main/java/org/elasticsearch/xpack/dataframe/transforms/pivot/SingleGroupSource.java",
                    "file_size": 0
                },
                {
                    "file_additions": 50,
                    "file_deletions": 0,
                    "file_exists": false,
                    "file_name": "x-pack/plugin/data-frame/src/main/java/org/elasticsearch/xpack/dataframe/transforms/pivot/TermsGroupSource.java",
                    "file_size": 0
                },
                {
                    "file_additions": 152,
                    "file_deletions": 0,
                    "file_exists": false,
                    "file_name": "x-pack/plugin/data-frame/src/test/java/org/elasticsearch/xpack/dataframe/DataFrameFeatureSetTests.java",
                    "file_size": 0
                },
                {
                    "file_additions": 27,
                    "file_deletions": 0,
                    "file_exists": false,
                    "file_name": "x-pack/plugin/data-frame/src/test/java/org/elasticsearch/xpack/dataframe/LocalStateDataFrame.java",
                    "file_size": 0
                },
                {
                    "file_additions": 40,
                    "file_deletions": 0,
                    "file_exists": false,
                    "file_name": "x-pack/plugin/data-frame/src/test/java/org/elasticsearch/xpack/dataframe/action/DataFrameTransformStateAndStatsTests.java",
                    "file_size": 0
                },
                {
                    "file_additions": 23,
                    "file_deletions": 0,
                    "file_exists": false,
                    "file_name": "x-pack/plugin/data-frame/src/test/java/org/elasticsearch/xpack/dataframe/action/DeleteDataFrameTransformActionRequestTests.java",
                    "file_size": 0
                },
                {
                    "file_additions": 28,
                    "file_deletions": 0,
                    "file_exists": false,
                    "file_name": "x-pack/plugin/data-frame/src/test/java/org/elasticsearch/xpack/dataframe/action/GetDataFrameTransformsActionRequestTests.java",
                    "file_size": 0
                },
                {
                    "file_additions": 46,
                    "file_deletions": 0,
                    "file_exists": false,
                    "file_name": "x-pack/plugin/data-frame/src/test/java/org/elasticsearch/xpack/dataframe/action/GetDataFrameTransformsActionResponseTests.java",
                    "file_size": 0
                },
                {
                    "file_additions": 27,
                    "file_deletions": 0,
                    "file_exists": false,
                    "file_name": "x-pack/plugin/data-frame/src/test/java/org/elasticsearch/xpack/dataframe/action/GetDataFrameTransformsStatsActionRequestTests.java",
                    "file_size": 0
                },
                {
                    "file_additions": 75,
                    "file_deletions": 0,
                    "file_exists": false,
                    "file_name": "x-pack/plugin/data-frame/src/test/java/org/elasticsearch/xpack/dataframe/action/PutDataFrameTransformActionRequestTests.java",
                    "file_size": 0
                },
                {
                    "file_additions": 22,
                    "file_deletions": 0,
                    "file_exists": false,
                    "file_name": "x-pack/plugin/data-frame/src/test/java/org/elasticsearch/xpack/dataframe/action/StartDataFrameTransformActionTests.java",
                    "file_size": 0
                },
                {
                    "file_additions": 37,
                    "file_deletions": 0,
                    "file_exists": false,
                    "file_name": "x-pack/plugin/data-frame/src/test/java/org/elasticsearch/xpack/dataframe/action/StopDataFrameTransformActionRequestTests.java",
                    "file_size": 0
                },
                {
                    "file_additions": 75,
                    "file_deletions": 0,
                    "file_exists": false,
                    "file_name": "x-pack/plugin/data-frame/src/test/java/org/elasticsearch/xpack/dataframe/persistence/DataFrameSingleNodeTestCase.java",
                    "file_size": 0
                },
                {
                    "file_additions": 105,
                    "file_deletions": 0,
                    "file_exists": false,
                    "file_name": "x-pack/plugin/data-frame/src/test/java/org/elasticsearch/xpack/dataframe/persistence/DataFrameTransformsConfigManagerTests.java",
                    "file_size": 0
                },
                {
                    "file_additions": 65,
                    "file_deletions": 0,
                    "file_exists": false,
                    "file_name": "x-pack/plugin/data-frame/src/test/java/org/elasticsearch/xpack/dataframe/transforms/AbstractSerializingDataFrameTestCase.java",
                    "file_size": 0
                },
                {
                    "file_additions": 99,
                    "file_deletions": 0,
                    "file_exists": false,
                    "file_name": "x-pack/plugin/data-frame/src/test/java/org/elasticsearch/xpack/dataframe/transforms/DataFrameTransformConfigTests.java",
                    "file_size": 0
                },
                {
                    "file_additions": 92,
                    "file_deletions": 0,
                    "file_exists": false,
                    "file_name": "x-pack/plugin/data-frame/src/test/java/org/elasticsearch/xpack/dataframe/transforms/MockDeprecatedAggregationBuilder.java",
                    "file_size": 0
                },
                {
                    "file_additions": 88,
                    "file_deletions": 0,
                    "file_exists": false,
                    "file_name": "x-pack/plugin/data-frame/src/test/java/org/elasticsearch/xpack/dataframe/transforms/MockDeprecatedQueryBuilder.java",
                    "file_size": 0
                },
                {
                    "file_additions": 142,
                    "file_deletions": 0,
                    "file_exists": false,
                    "file_name": "x-pack/plugin/data-frame/src/test/java/org/elasticsearch/xpack/dataframe/transforms/QueryConfigTests.java",
                    "file_size": 0
                },
                {
                    "file_additions": 150,
                    "file_deletions": 0,
                    "file_exists": false,
                    "file_name": "x-pack/plugin/data-frame/src/test/java/org/elasticsearch/xpack/dataframe/transforms/pivot/AggregationConfigTests.java",
                    "file_size": 0
                },
                {
                    "file_additions": 323,
                    "file_deletions": 0,
                    "file_exists": false,
                    "file_name": "x-pack/plugin/data-frame/src/test/java/org/elasticsearch/xpack/dataframe/transforms/pivot/AggregationResultUtilsTests.java",
                    "file_size": 0
                },
                {
                    "file_additions": 23,
                    "file_deletions": 0,
                    "file_exists": false,
                    "file_name": "x-pack/plugin/data-frame/src/test/java/org/elasticsearch/xpack/dataframe/transforms/pivot/AggregationsTests.java",
                    "file_size": 0
                },
                {
                    "file_additions": 51,
                    "file_deletions": 0,
                    "file_exists": false,
                    "file_name": "x-pack/plugin/data-frame/src/test/java/org/elasticsearch/xpack/dataframe/transforms/pivot/DateHistogramGroupSourceTests.java",
                    "file_size": 0
                },
                {
                    "file_additions": 101,
                    "file_deletions": 0,
                    "file_exists": false,
                    "file_name": "x-pack/plugin/data-frame/src/test/java/org/elasticsearch/xpack/dataframe/transforms/pivot/GroupConfigTests.java",
                    "file_size": 0
                },
                {
                    "file_additions": 38,
                    "file_deletions": 0,
                    "file_exists": false,
                    "file_name": "x-pack/plugin/data-frame/src/test/java/org/elasticsearch/xpack/dataframe/transforms/pivot/HistogramGroupSourceTests.java",
                    "file_size": 0
                },
                {
                    "file_additions": 144,
                    "file_deletions": 0,
                    "file_exists": false,
                    "file_name": "x-pack/plugin/data-frame/src/test/java/org/elasticsearch/xpack/dataframe/transforms/pivot/PivotConfigTests.java",
                    "file_size": 0
                },
                {
                    "file_additions": 212,
                    "file_deletions": 0,
                    "file_exists": false,
                    "file_name": "x-pack/plugin/data-frame/src/test/java/org/elasticsearch/xpack/dataframe/transforms/pivot/PivotTests.java",
                    "file_size": 0
                },
                {
                    "file_additions": 38,
                    "file_deletions": 0,
                    "file_exists": false,
                    "file_name": "x-pack/plugin/data-frame/src/test/java/org/elasticsearch/xpack/dataframe/transforms/pivot/TermsGroupSourceTests.java",
                    "file_size": 0
                },
                {
                    "file_additions": 3,
                    "file_deletions": 3,
                    "file_exists": false,
                    "file_name": "x-pack/plugin/ml/qa/ml-with-security/src/test/java/org/elasticsearch/smoketest/MlWithSecurityUserRoleIT.java",
                    "file_size": 0
                },
                {
                    "file_additions": 30,
                    "file_deletions": 0,
                    "file_exists": true,
                    "file_name": "x-pack/plugin/ml/src/test/java/org/elasticsearch/xpack/ml/MlSingleNodeTestCase.java",
                    "file_size": 9293
                },
                {
                    "file_additions": 2,
                    "file_deletions": 0,
                    "file_exists": true,
                    "file_name": "x-pack/plugin/security/src/main/java/org/elasticsearch/xpack/security/authz/AuthorizationUtils.java",
                    "file_size": 7568
                },
                {
                    "file_additions": 2,
                    "file_deletions": 2,
                    "file_exists": false,
                    "file_name": "x-pack/plugin/src/test/java/org/elasticsearch/xpack/test/rest/XPackRestIT.java",
                    "file_size": 0
                },
                {
                    "file_additions": 13,
                    "file_deletions": 196,
                    "file_exists": true,
                    "file_name": "x-pack/qa/full-cluster-restart/src/test/java/org/elasticsearch/xpack/restart/FullClusterRestartIT.java",
                    "file_size": 39242
                },
                {
                    "file_additions": 0,
                    "file_deletions": 13,
                    "file_exists": true,
                    "file_name": "x-pack/qa/full-cluster-restart/src/test/java/org/elasticsearch/xpack/restart/MlMigrationFullClusterRestartIT.java",
                    "file_size": 11055
                },
                {
                    "file_additions": 76,
                    "file_deletions": 2,
                    "file_exists": true,
                    "file_name": "x-pack/qa/rolling-upgrade-multi-cluster/src/test/java/org/elasticsearch/upgrades/CcrRollingUpgradeIT.java",
                    "file_size": 20147
                },
                {
                    "file_additions": 0,
                    "file_deletions": 291,
                    "file_exists": false,
                    "file_name": "x-pack/qa/rolling-upgrade/src/test/java/org/elasticsearch/upgrades/RollupIDUpgradeIT.java",
                    "file_size": 0
                },
                {
                    "file_additions": 4,
                    "file_deletions": 4,
                    "file_exists": false,
                    "file_name": "x-pack/qa/smoke-test-watcher-with-security/src/test/java/org/elasticsearch/smoketest/SmokeTestWatcherWithSecurityClientYamlTestSuiteIT.java",
                    "file_size": 0
                },
                {
                    "file_additions": 4,
                    "file_deletions": 4,
                    "file_exists": false,
                    "file_name": "x-pack/qa/smoke-test-watcher/src/test/java/org/elasticsearch/smoketest/WatcherRestIT.java",
                    "file_size": 0
                },
                {
                    "file_additions": 4,
                    "file_deletions": 4,
                    "file_exists": false,
                    "file_name": "x-pack/qa/third-party/hipchat/src/test/java/org/elasticsearch/smoketest/WatcherHipchatYamlTestSuiteIT.java",
                    "file_size": 0
                },
                {
                    "file_additions": 4,
                    "file_deletions": 4,
                    "file_exists": true,
                    "file_name": "x-pack/qa/third-party/jira/src/test/java/org/elasticsearch/smoketest/WatcherJiraYamlTestSuiteIT.java",
                    "file_size": 3239
                },
                {
                    "file_additions": 4,
                    "file_deletions": 4,
                    "file_exists": true,
                    "file_name": "x-pack/qa/third-party/pagerduty/src/test/java/org/elasticsearch/smoketest/WatcherPagerDutyYamlTestSuiteIT.java",
                    "file_size": 3249
                },
                {
                    "file_additions": 4,
                    "file_deletions": 4,
                    "file_exists": true,
                    "file_name": "x-pack/qa/third-party/slack/src/test/java/org/elasticsearch/smoketest/WatcherSlackYamlTestSuiteIT.java",
                    "file_size": 3241
                }
            ],
            "interesting": {
                "reopened": false,
                "status": false
            },
            "sha": "8433480ea24ca45577b0eb798326699be67a4c03"
        }
    ],
    "first_commit": "2019-02-08 13:24:11",
    "last_commit": "2019-02-18 16:01:48",
    "number": 38623,
    "score": 320.00038211692777
}