{
    "category": [
        "hardware/OS",
        "build/refactor/preprocessing",
        "feature request"
    ],
    "commits": [
        {
            "associated_pull_request": [
                "https://github.com/surge-synthesizer/surge/pull/993"
            ],
            "date": "2019-08-06 22:03:57",
            "diff": "surge-synthesizer_surge/issue_996/commit_83ebf1adc3e88f593beffcf6a5b06e74ffaab848.diff",
            "diff_additions": 20,
            "diff_deletions": 2,
            "diff_file_size": 0,
            "diff_url": "https://github.com/surge-synthesizer/surge/commit/83ebf1adc3e88f593beffcf6a5b06e74ffaab848.diff",
            "exists": true,
            "files": [
                {
                    "file_additions": 20,
                    "file_deletions": 2,
                    "file_exists": false,
                    "file_name": "src/common/WavSupport.cpp",
                    "file_size": 0
                }
            ],
            "interesting": {
                "reopen": false,
                "status": false
            },
            "is_parent": true,
            "sha": "83ebf1adc3e88f593beffcf6a5b06e74ffaab848"
        },
        {
            "associated_pull_request": [],
            "date": "2019-08-07 12:16:39",
            "diff": "surge-synthesizer_surge/issue_996/commit_62273b0a2806597c9671653619ef64d31d846d73.diff",
            "diff_additions": 152,
            "diff_deletions": 104,
            "diff_file_size": 0,
            "diff_url": "https://github.com/surge-synthesizer/surge/commit/62273b0a2806597c9671653619ef64d31d846d73.diff",
            "exists": true,
            "files": [
                {
                    "file_additions": 146,
                    "file_deletions": 104,
                    "file_exists": false,
                    "file_name": "src/common/gui/COscillatorDisplay.cpp",
                    "file_size": 0
                },
                {
                    "file_additions": 6,
                    "file_deletions": 0,
                    "file_exists": false,
                    "file_name": "src/common/gui/SurgeGUIEditor.cpp",
                    "file_size": 0
                }
            ],
            "interesting": {
                "reopen": false,
                "status": false
            },
            "is_parent": false,
            "sha": "62273b0a2806597c9671653619ef64d31d846d73"
        },
        {
            "associated_pull_request": [
                "https://github.com/surge-synthesizer/surge/pull/998"
            ],
            "date": "2019-08-07 12:16:39",
            "diff": "surge-synthesizer_surge/issue_996/commit_ac6e8232d0eb5f43c37ee510826218bcbe55c8a4.diff",
            "diff_additions": 157,
            "diff_deletions": 95,
            "diff_file_size": 0,
            "diff_url": "https://github.com/surge-synthesizer/surge/commit/ac6e8232d0eb5f43c37ee510826218bcbe55c8a4.diff",
            "exists": true,
            "files": [
                {
                    "file_additions": 144,
                    "file_deletions": 95,
                    "file_exists": false,
                    "file_name": "src/common/gui/COscillatorDisplay.cpp",
                    "file_size": 0
                },
                {
                    "file_additions": 13,
                    "file_deletions": 0,
                    "file_exists": false,
                    "file_name": "src/common/gui/SurgeGUIEditor.cpp",
                    "file_size": 0
                }
            ],
            "interesting": {
                "reopen": false,
                "status": false
            },
            "is_parent": false,
            "sha": "ac6e8232d0eb5f43c37ee510826218bcbe55c8a4"
        },
        {
            "associated_pull_request": [
                "https://github.com/surge-synthesizer/surge/pull/998"
            ],
            "date": "2019-08-07 14:55:34",
            "diff": "surge-synthesizer_surge/issue_996/commit_52aa6dd1bd7536df72e9c2347d162b7f0567e32d.diff",
            "diff_additions": 157,
            "diff_deletions": 95,
            "diff_file_size": 0,
            "diff_url": "https://github.com/surge-synthesizer/surge/commit/52aa6dd1bd7536df72e9c2347d162b7f0567e32d.diff",
            "exists": true,
            "files": [
                {
                    "file_additions": 144,
                    "file_deletions": 95,
                    "file_exists": false,
                    "file_name": "src/common/gui/COscillatorDisplay.cpp",
                    "file_size": 0
                },
                {
                    "file_additions": 13,
                    "file_deletions": 0,
                    "file_exists": false,
                    "file_name": "src/common/gui/SurgeGUIEditor.cpp",
                    "file_size": 0
                }
            ],
            "interesting": {
                "reopen": true,
                "status": false
            },
            "is_parent": false,
            "sha": "52aa6dd1bd7536df72e9c2347d162b7f0567e32d"
        },
        {
            "associated_pull_request": [
                "https://github.com/surge-synthesizer/surge/pull/1003"
            ],
            "date": "2019-08-08 01:17:54",
            "diff": "surge-synthesizer_surge/issue_996/commit_e76f6c327f81aa7ff6719de61f0dd3045f2fc2cd.diff",
            "diff_additions": 12,
            "diff_deletions": 1,
            "diff_file_size": 0,
            "diff_url": "https://github.com/surge-synthesizer/surge/commit/e76f6c327f81aa7ff6719de61f0dd3045f2fc2cd.diff",
            "exists": true,
            "files": [
                {
                    "file_additions": 12,
                    "file_deletions": 1,
                    "file_exists": false,
                    "file_name": "src/common/gui/COscillatorDisplay.cpp",
                    "file_size": 0
                }
            ],
            "interesting": {
                "reopen": false,
                "status": false
            },
            "is_parent": false,
            "sha": "e76f6c327f81aa7ff6719de61f0dd3045f2fc2cd"
        },
        {
            "associated_pull_request": [
                "https://github.com/surge-synthesizer/surge/pull/1003"
            ],
            "date": "2019-08-08 01:26:22",
            "diff": "surge-synthesizer_surge/issue_996/commit_fb41645cd816c440fff3274ba21be49ca931e8d1.diff",
            "diff_additions": 12,
            "diff_deletions": 1,
            "diff_file_size": 0,
            "diff_url": "https://github.com/surge-synthesizer/surge/commit/fb41645cd816c440fff3274ba21be49ca931e8d1.diff",
            "exists": true,
            "files": [
                {
                    "file_additions": 12,
                    "file_deletions": 1,
                    "file_exists": false,
                    "file_name": "src/common/gui/COscillatorDisplay.cpp",
                    "file_size": 0
                }
            ],
            "interesting": {
                "reopen": false,
                "status": false
            },
            "is_parent": false,
            "sha": "fb41645cd816c440fff3274ba21be49ca931e8d1"
        }
    ],
    "first_commit": "2019-08-06 22:03:57",
    "last_commit": "2019-08-08 01:26:22",
    "number": 996,
    "pull_request": "None",
    "score": {
        "accidental_reopen_likely": false,
        "all_labels": [
            "UI"
        ],
        "contains_keywords": [
            "chang",
            "work",
            "bug"
        ],
        "fix_size": 201,
        "has_labels": [],
        "intersecting": {
            "computed_score": 1.0,
            "final_commit_size": 13,
            "intersection_size": 13,
            "previous_commits_size": 201
        },
        "is_makefile_based": true,
        "no_new_files": [],
        "no_other_files": false,
        "num_prohibited_files": 64548,
        "prohibited_files": [
            "tools/building.py",
            "tools/building.py",
            "tools/building.py",
            "emcc.py",
            "src/library_emmalloc.js",
            "src/shell.js",
            "tests/test_core.py",
            "src/shell.js",
            "tests/test_core.py",
            "src/library.js"
        ],
        "reopen": true,
        "reopen_events": [
            [
                "2019-08-07 12:17:23",
                "commit"
            ],
            [
                "2019-08-07 14:44:56",
                "commit"
            ],
            [
                "2019-08-07 14:55:35",
                "closed"
            ],
            [
                "2019-08-07 14:55:36",
                "commit"
            ],
            [
                "2019-08-07 22:55:02",
                "reopened"
            ],
            [
                "2019-08-08 01:19:04",
                "commit"
            ],
            [
                "2019-08-08 01:26:23",
                "closed"
            ],
            [
                "2019-08-08 01:26:24",
                "commit"
            ]
        ],
        "status": false,
        "strategy": true,
        "total_changes": 808
    }
}