{
    "commits": [
        {
            "associated_pull_request": [],
            "date": "2023-01-12 19:31:46+00:00",
            "diff": "",
            "diff_additions": 0,
            "diff_deletions": 0,
            "diff_file_size": 0,
            "diff_url": "https://github.com/yugabyte/yugabyte-db/commit/582ba89ed241b7a4ffd28c301ddec0aaf0f22836.diff",
            "exists": true,
            "files": [],
            "interesting": {
                "reopen": false,
                "status": false
            },
            "is_parent": true,
            "sha": "582ba89ed241b7a4ffd28c301ddec0aaf0f22836"
        },
        {
            "associated_pull_request": [],
            "date": "2023-01-13 17:47:45+00:00",
            "diff": "yugabyte_yugabyte-db/issue_15528/commit_ea8786afd63eb2f82b1ad937e254bb7c8a47e0c8.diff",
            "diff_additions": 11,
            "diff_deletions": 8,
            "diff_file_size": 24496,
            "diff_url": "https://github.com/yugabyte/yugabyte-db/commit/ea8786afd63eb2f82b1ad937e254bb7c8a47e0c8.diff",
            "exists": true,
            "files": [
                {
                    "file_additions": 11,
                    "file_deletions": 8,
                    "file_exists": true,
                    "file_name": "src/yb/rpc/connection.cc",
                    "file_size": 24496
                }
            ],
            "interesting": {
                "reopen": true,
                "status": false
            },
            "is_parent": false,
            "sha": "ea8786afd63eb2f82b1ad937e254bb7c8a47e0c8"
        },
        {
            "associated_pull_request": [],
            "date": "2023-03-09 22:07:07+00:00",
            "diff": "yugabyte_yugabyte-db/issue_15528/commit_a7bdc592a99c61e3fee85299e5aa93f7d1fff756.diff",
            "diff_additions": 11,
            "diff_deletions": 8,
            "diff_file_size": 24496,
            "diff_url": "https://github.com/yugabyte/yugabyte-db/commit/a7bdc592a99c61e3fee85299e5aa93f7d1fff756.diff",
            "exists": true,
            "files": [
                {
                    "file_additions": 11,
                    "file_deletions": 8,
                    "file_exists": true,
                    "file_name": "src/yb/rpc/connection.cc",
                    "file_size": 24496
                }
            ],
            "interesting": {
                "reopen": false,
                "status": false
            },
            "is_parent": false,
            "sha": "a7bdc592a99c61e3fee85299e5aa93f7d1fff756"
        },
        {
            "associated_pull_request": [],
            "date": "2023-03-09 22:07:43+00:00",
            "diff": "yugabyte_yugabyte-db/issue_15528/commit_52edd6e5d47cee1aa2ecfb5784e8c84567f17b5c.diff",
            "diff_additions": 11,
            "diff_deletions": 8,
            "diff_file_size": 24496,
            "diff_url": "https://github.com/yugabyte/yugabyte-db/commit/52edd6e5d47cee1aa2ecfb5784e8c84567f17b5c.diff",
            "exists": true,
            "files": [
                {
                    "file_additions": 11,
                    "file_deletions": 8,
                    "file_exists": true,
                    "file_name": "src/yb/rpc/connection.cc",
                    "file_size": 24496
                }
            ],
            "interesting": {
                "reopen": false,
                "status": false
            },
            "is_parent": false,
            "sha": "52edd6e5d47cee1aa2ecfb5784e8c84567f17b5c"
        }
    ],
    "first_commit": "2023-01-16 18:38:55+00:00",
    "last_commit": "2023-03-10 05:12:57+00:00",
    "number": 15528,
    "pull_request": "None",
    "score": {
        "accidental_reopen_likely": false,
        "all_labels": [
            "kind/bug",
            "area/docdb",
            "priority/medium",
            "2.14 Backport Required",
            "2.16 Backport Required"
        ],
        "contains_keywords": [
            "work",
            "fail",
            "fix",
            "issu",
            "perform",
            "test",
            "error"
        ],
        "fix_size": 17,
        "has_labels": [],
        "intersecting": {
            "computed_score": 1.0,
            "final_commit_size": 14,
            "intersection_size": 14,
            "previous_commits_size": 17
        },
        "is_makefile_based": true,
        "no_new_files": [],
        "no_other_files": true,
        "num_prohibited_files": 44301,
        "prohibited_files": [
            "server/src/main/java/com/genymobile/scrcpy/Device.java",
            "server/src/main/java/com/genymobile/scrcpy/wrappers/SurfaceControl.java",
            "server/src/main/java/com/genymobile/scrcpy/Device.java",
            "server/src/main/java/com/genymobile/scrcpy/wrappers/SurfaceControl.java",
            "app/meson.build",
            "app/scrcpy.1",
            "app/src/common.h",
            "app/src/scrcpy.h",
            "app/src/server.h",
            "server/src/main/java/com/genymobile/scrcpy/Workarounds.java"
        ],
        "reopen": true,
        "reopen_events": [
            [
                "2023-01-16 22:28:24+00:00",
                "closed"
            ],
            [
                "2023-01-16 22:28:24+00:00",
                "commit"
            ],
            [
                "2023-03-09 21:45:34+00:00",
                "reopened"
            ],
            [
                "2023-03-10 00:31:15+00:00",
                "commit"
            ],
            [
                "2023-03-10 05:13:00+00:00",
                "commit"
            ],
            [
                "2023-03-10 15:40:43+00:00",
                "closed"
            ]
        ],
        "status": false,
        "strategy": true,
        "total_changes": 57
    }
}