{
    "all_issues": 424,
    "interesting_issues": 1,
    "last_update": "2023-11-05 10:10:06.712174",
    "license": {
        "download": "https://raw.githubusercontent.com/mdbtools/mdbtools/dev/COPYING",
        "name": "GNU General Public License v2.0"
    },
    "ratio": 0.0023584905660377358,
    "size": 4162,
    "stars": 899,
    "url": "https://github.com/mdbtools/mdbtools"
}