{
    "covered_issues": [
        12016,
        12013,
        11991,
        11990,
        11987,
        11982,
        11975,
        11974,
        11973,
        11969,
        11967,
        11965,
        11964,
        11959,
        11958,
        11955,
        11939,
        11938,
        11935,
        11928,
        11924,
        11917,
        11914,
        11913,
        11887,
        11886,
        11867,
        11861,
        11856,
        11852,
        11846,
        11844,
        11843,
        11841,
        11838,
        11824,
        11819,
        11817,
        11815,
        11813,
        11809,
        11806,
        11799,
        11798,
        11791,
        11784,
        11783,
        11781,
        11772,
        11756,
        11755,
        11751,
        11750,
        11749,
        11743,
        11742,
        11737,
        11735,
        11734,
        11733,
        11732,
        11731,
        11730,
        11729,
        11725,
        11724,
        11723,
        11722,
        11708,
        11703,
        11701,
        11699,
        11690,
        11676,
        11674,
        11672,
        11664,
        11663,
        11657,
        11654,
        11652,
        11644,
        11637,
        11632,
        11627,
        11623,
        11619,
        11616,
        11614,
        11607,
        11595,
        11589,
        11583,
        11572,
        11571,
        11570,
        11566,
        11557,
        11545,
        11543,
        11542,
        11541,
        11540,
        11532,
        11524,
        11512,
        11510,
        11509,
        11508,
        11503,
        11493,
        11490,
        11480,
        11473,
        11469,
        11466,
        11464,
        11458,
        11448,
        11441,
        11439,
        11438,
        11437,
        11433,
        11430,
        11421,
        11419,
        11417,
        11412,
        11411,
        11407,
        11406,
        11402,
        11399,
        11384,
        11381,
        11378,
        11373,
        11371,
        11364,
        11354,
        11349,
        11347,
        11322,
        11306,
        11302,
        11299,
        11289,
        11286,
        11270,
        11269,
        11257,
        11255,
        11251,
        11250,
        11248,
        11246,
        11216,
        11215,
        11213,
        11188,
        11169,
        11167,
        11153,
        11142,
        11138,
        11137,
        11125,
        11114,
        11108,
        11099,
        11097,
        11084,
        11070,
        11067,
        11062,
        11058,
        11056,
        11055,
        11052,
        11042,
        11034,
        11029,
        11020,
        11005,
        10986,
        10978,
        10971,
        10965,
        10954,
        10952,
        10941,
        10938,
        10929,
        10927,
        10902,
        10901,
        10884,
        10879,
        10869,
        10854,
        10849,
        10842,
        10826,
        10816,
        10813,
        10812,
        10811,
        10799,
        10797,
        10794,
        10783,
        10782,
        10773,
        10755,
        10749,
        10737,
        10736,
        10734,
        10731,
        10708,
        10705,
        10698,
        10693,
        10691,
        10689,
        10674,
        10669,
        10665,
        10664,
        10657,
        10648,
        10647,
        10643,
        10641,
        10635,
        10633,
        10631,
        10622,
        10617,
        10592,
        10590,
        10588,
        10586,
        10584,
        10583,
        10577,
        10576,
        10566,
        10546,
        10542,
        10525,
        10524,
        10521,
        10512,
        10490,
        10486,
        10480,
        10477,
        10475,
        10471,
        10468,
        10464,
        10455,
        10452,
        10449,
        10437,
        10435,
        10433,
        10432,
        10431,
        10430,
        10426,
        10415,
        10392,
        10391,
        10390,
        10388,
        10373,
        10361,
        10358,
        10354,
        10347,
        10345,
        10342,
        10339,
        10318,
        10315,
        10312,
        10301,
        10300,
        10287,
        10285,
        10276,
        10265,
        10263,
        10257,
        10254,
        10252,
        10243,
        10233,
        10225,
        10222,
        10216,
        10210,
        10205,
        10193,
        10175,
        10168,
        10159,
        10157,
        10156,
        10155,
        10154,
        10153,
        10151,
        10149,
        10142,
        10124,
        10121,
        10116,
        10115,
        10111,
        10103,
        10100,
        10099,
        10097,
        10096,
        10083,
        10076,
        10074,
        10057,
        10056,
        10050,
        10049,
        10044,
        10041,
        10036,
        10032,
        10031,
        10028,
        9987,
        9986,
        9985,
        9984,
        9980,
        9974,
        9972,
        9965,
        9953,
        9951,
        9933,
        9924,
        9920,
        9919,
        9917,
        9906,
        9902,
        9890,
        9889,
        9884,
        9882,
        9881,
        9876,
        9875,
        9871,
        9869,
        9868,
        9862,
        9861,
        9859,
        9851,
        9850,
        9846,
        9836,
        9833,
        9807,
        9797,
        9791,
        9785,
        9782,
        9781,
        9780,
        9778,
        9777,
        9772,
        9767,
        9763,
        9762,
        9759,
        9749,
        9747,
        9743,
        9729,
        9728,
        9726,
        9725,
        9721,
        9716,
        9713,
        9706,
        9705,
        9703,
        9698,
        9697,
        9670,
        9669,
        9659,
        9658,
        9656,
        9654,
        9650,
        9638,
        9627,
        9626,
        9625,
        9619,
        9617,
        9595,
        9590,
        9588,
        9586,
        9582,
        9576,
        9569,
        9568,
        9555,
        9554,
        9544,
        9540,
        9537,
        9534,
        9528,
        9527,
        9526,
        9503,
        9501,
        9496,
        9494,
        9492,
        9487,
        9484,
        9468,
        9462,
        9455,
        9453,
        9451,
        9447,
        9446,
        9444,
        9440,
        9434,
        9433,
        9419,
        9407,
        9404,
        9403,
        9392,
        9389,
        9388,
        9386,
        9369,
        9365,
        9354,
        9346,
        9343,
        9342,
        9339,
        9338,
        9337,
        9329,
        9321,
        9317,
        9309,
        9301,
        9271,
        9238,
        9211,
        9207,
        9206,
        9204,
        9203,
        9200,
        9197,
        9196,
        9195,
        9193,
        9192,
        9170,
        9169,
        9167,
        9166,
        9162,
        9161,
        9160,
        9157,
        9138,
        9133,
        9132,
        9124,
        9122,
        9120,
        9115,
        9113,
        9106,
        9105,
        9099,
        9085,
        9083,
        9070,
        9068,
        9066,
        9061,
        9059,
        9057,
        9056,
        9054,
        9053,
        9042,
        9041,
        9035,
        9032,
        9018,
        9014,
        9013,
        9012,
        9010,
        9008,
        9005,
        8996,
        8991,
        8990,
        8983,
        8963,
        8962,
        8958,
        8955,
        8938,
        8932,
        8927,
        8925,
        8918,
        8916,
        8914,
        8909,
        8907,
        8905,
        8893,
        8884,
        8877,
        8870,
        8868,
        8863,
        8862,
        8860,
        8858,
        8856,
        8854,
        8853,
        8850,
        8848,
        8846,
        8841,
        8840,
        8831,
        8829,
        8825,
        8824,
        8823,
        8822,
        8813,
        8803,
        8801,
        8786,
        8782,
        8778,
        8776,
        8774,
        8772,
        8771,
        8770,
        8766,
        8764,
        8763,
        8762,
        8757,
        8750,
        8746,
        8743,
        8739,
        8738,
        8736,
        8734,
        8733,
        8732,
        8730,
        8727,
        8724,
        8718,
        8694,
        8689,
        8687,
        8684,
        8682,
        8680,
        8677,
        8675,
        8672,
        8670,
        8669,
        8666,
        8664,
        8658,
        8656,
        8652,
        8651,
        8616,
        8614,
        8603,
        8586,
        8583,
        8568,
        8566,
        8563,
        8562,
        8560,
        8555,
        8554,
        8546,
        8542,
        8538,
        8532,
        8531,
        8526,
        8524,
        8522,
        8510,
        8509,
        8508,
        8505,
        8498,
        8491,
        8490,
        8489,
        8466,
        8464,
        8450,
        8442,
        8434,
        8426,
        8420,
        8419,
        8416,
        8414,
        8410,
        8407,
        8403,
        8402,
        8395,
        8391,
        8385,
        8381,
        8379,
        8378,
        8377,
        8368,
        8367,
        8364,
        8360,
        8358,
        8356,
        8345,
        8341,
        8340,
        8335,
        8332,
        8327,
        8326,
        8323,
        8321,
        8315,
        8310,
        8306,
        8305,
        8304,
        8303,
        8301,
        8299,
        8294,
        8292,
        8285,
        8282,
        8274,
        8271,
        8270,
        8269,
        8260,
        8259,
        8257,
        8253,
        8248,
        8246,
        8232,
        8230,
        8225,
        8221,
        8218,
        8217,
        8213,
        8200,
        8195,
        8189,
        8183,
        8182,
        8179,
        8171,
        8170,
        8169,
        8141,
        8137,
        8118,
        8117,
        8104,
        8100,
        8097,
        8089,
        8086,
        8085,
        8084,
        8078,
        8074,
        8064,
        8055,
        8049,
        8047,
        8046,
        8045,
        8040,
        8036,
        8033,
        8024,
        8022,
        8013,
        8005,
        8004,
        8003,
        8001,
        8000,
        7999,
        7993,
        7990,
        7982,
        7980,
        7979,
        7978,
        7976,
        7971,
        7968,
        7967,
        7966,
        7963,
        7961,
        7955,
        7954,
        7949,
        7937,
        7932,
        7928,
        7925,
        7920,
        7918,
        7909,
        7908,
        7903,
        7901,
        7892,
        7880,
        7878,
        7874,
        7870,
        7869,
        7868,
        7867,
        7865,
        7864,
        7862,
        7851,
        7847,
        7842,
        7833,
        7832,
        7830,
        7818,
        7816,
        7810,
        7806,
        7805,
        7804,
        7801,
        7796,
        7790,
        7784,
        7783,
        7779,
        7772,
        7769,
        7768,
        7763,
        7757,
        7755,
        7753,
        7752,
        7746,
        7742,
        7739,
        7738,
        7737,
        7736,
        7731,
        7729,
        7728,
        7727,
        7725,
        7724,
        7723,
        7721,
        7719,
        7717,
        7715,
        7711,
        7710,
        7704,
        7703,
        7702,
        7700,
        7699,
        7697,
        7694,
        7692,
        7689,
        7688,
        7676,
        7674,
        7666,
        7663,
        7660,
        7658,
        7653,
        7648,
        7647,
        7644,
        7642,
        7639,
        7635,
        7634,
        7631,
        7628,
        7627,
        7626,
        7625,
        7624,
        7623,
        7620,
        7617,
        7616,
        7615,
        7612,
        7607,
        7603,
        7586,
        7583,
        7580,
        7578,
        7570,
        7569,
        7565,
        7564,
        7562,
        7560,
        7555,
        7531,
        7529,
        7528,
        7521,
        7520,
        7519,
        7516,
        7515,
        7514,
        7513,
        7507,
        7504,
        7502,
        7500,
        7499,
        7494,
        7489,
        7486,
        7483,
        7475,
        7473,
        7471,
        7458,
        7442,
        7437,
        7433,
        7429,
        7424,
        7417,
        7414,
        7413,
        7410,
        7407,
        7405,
        7401,
        7400,
        7399,
        7396,
        7389,
        7388,
        7384,
        7377,
        7374,
        7369,
        7368,
        7363,
        7362,
        7361,
        7359,
        7357,
        7348,
        7335,
        7331,
        7330,
        7322,
        7320,
        7319,
        7316,
        7312,
        7309,
        7308,
        7303,
        7302,
        7295,
        7275,
        7272,
        7270,
        7266,
        7255,
        7253,
        7251,
        7247,
        7246,
        7240,
        7239,
        7235,
        7234,
        7223,
        7221,
        7220,
        7216,
        7214,
        7209,
        7203,
        7199,
        7198,
        7195,
        7188,
        7187,
        7186,
        7182,
        7157,
        7155,
        7150,
        7147,
        7137,
        7136,
        7135,
        7133,
        7132,
        7129,
        7128,
        7127,
        7121,
        7118,
        7115,
        7111,
        7109,
        7107,
        7101,
        7100,
        7098,
        7095,
        7094,
        7093,
        7087,
        7064,
        7058,
        7056,
        7049,
        7045,
        7035,
        7030,
        7029,
        7027,
        7025,
        7020,
        7019,
        7009,
        7008,
        6995,
        6987,
        6985,
        6983,
        6981,
        6977,
        6976,
        6974,
        6966,
        6963,
        6962,
        6950,
        6949,
        6948,
        6941,
        6940,
        6936,
        6932,
        6931,
        6928,
        6927,
        6924,
        6920,
        6917,
        6914,
        6912,
        6907,
        6902,
        6900,
        6899,
        6897,
        6894,
        6891,
        6890,
        6888,
        6883,
        6881,
        6877,
        6875,
        6871,
        6870,
        6860,
        6859,
        6858,
        6856,
        6854,
        6853,
        6850,
        6836,
        6835,
        6834,
        6833,
        6827,
        6823,
        6819,
        6816,
        6815,
        6808,
        6801,
        6799,
        6795,
        6794,
        6789,
        6788,
        6786,
        6785,
        6775,
        6773,
        6772,
        6763,
        6762,
        6761,
        6758,
        6757,
        6752,
        6749,
        6743,
        6742,
        6740,
        6733,
        6730,
        6729,
        6723,
        6712,
        6703,
        6700,
        6691,
        6684,
        6682,
        6677,
        6671,
        6666,
        6656,
        6655,
        6648,
        6642,
        6640,
        6639,
        6633,
        6631,
        6628,
        6618,
        6617,
        6616,
        6614,
        6613,
        6612,
        6607,
        6606,
        6601,
        6595,
        6593,
        6592,
        6591,
        6586,
        6583,
        6581,
        6579,
        6575,
        6570,
        6568,
        6565,
        6562,
        6560,
        6559,
        6558,
        6557,
        6552,
        6549,
        6548,
        6547,
        6546,
        6540,
        6539,
        6537,
        6536,
        6535,
        6533,
        6530,
        6524,
        6522,
        6518,
        6517,
        6514,
        6513,
        6507,
        6506,
        6501,
        6497,
        6475,
        6472,
        6470,
        6468,
        6458,
        6456,
        6452,
        6444,
        6441,
        6436,
        6433,
        6430,
        6425,
        6411,
        6398,
        6396,
        6394,
        6393,
        6383,
        6379,
        6377,
        6376,
        6374,
        6372,
        6367,
        6364,
        6360,
        6354,
        6352,
        6349,
        6346,
        6345,
        6324,
        6323,
        6322,
        6317,
        6316,
        6303,
        6300,
        6299,
        6298,
        6297,
        6296,
        6293,
        6291,
        6289,
        6288,
        6285,
        6278,
        6277,
        6275,
        6274,
        6265,
        6264,
        6259,
        6258,
        6256,
        6255,
        6247,
        6241,
        6236,
        6233,
        6228,
        6227,
        6222,
        6221,
        6215,
        6206,
        6201,
        6200,
        6197,
        6188,
        6186,
        6182,
        6180,
        6179,
        6177,
        6173,
        6171,
        6162,
        6161,
        6150,
        6149,
        6147,
        6141,
        6134,
        6130,
        6127,
        6119,
        6116,
        6115,
        6114,
        6107,
        6106,
        6105,
        6103,
        6101,
        6095,
        6094,
        6093,
        6090,
        6088,
        6084,
        6081,
        6079,
        6078,
        6077,
        6075,
        6069,
        6068,
        6058,
        6056,
        6053,
        6052,
        6049,
        6025,
        6024,
        6020,
        6019,
        6016,
        6014,
        6005,
        6004,
        5999,
        5996,
        5992,
        5990,
        5987,
        5982,
        5973,
        5969,
        5967,
        5965,
        5964,
        5954,
        5951,
        5935,
        5932,
        5920,
        5915,
        5914,
        5894,
        5893,
        5873,
        5872,
        5871,
        5849,
        5842,
        5821,
        5820,
        5815,
        5814,
        5813,
        5810,
        5807,
        5801,
        5798,
        5789,
        5782,
        5760,
        5739,
        5713,
        5712,
        5687,
        5672,
        5671,
        5670,
        5667,
        5645,
        5643,
        5638,
        5637,
        5631,
        5613,
        5611,
        5604,
        5593,
        5588,
        5585,
        5584,
        5583,
        5581,
        5578,
        5566,
        5560,
        5559,
        5551,
        5540,
        5535,
        5532,
        5530,
        5529,
        5528,
        5524,
        5520,
        5514,
        5513,
        5512,
        5511,
        5510,
        5502,
        5501,
        5492,
        5490,
        5489,
        5488,
        5482,
        5481,
        5479,
        5470,
        5465,
        5459,
        5454,
        5447,
        5443,
        5442,
        5432,
        5396,
        5394,
        5393,
        5387,
        5383,
        5377,
        5376,
        5375,
        5370,
        5367,
        5363,
        5362,
        5361,
        5357,
        5350,
        5349,
        5348,
        5346,
        5336,
        5335,
        5321,
        5302,
        5299,
        5292,
        5280,
        5279,
        5278,
        5273,
        5270,
        5268,
        5266,
        5262,
        5260,
        5256,
        5242,
        5233,
        5231,
        5223,
        5214,
        5195,
        5190,
        5189,
        5183,
        5182,
        5181,
        5178,
        5177,
        5165,
        5164,
        5157,
        5155,
        5151,
        5149,
        5145,
        5143,
        5141,
        5137,
        5130,
        5124,
        5120,
        5117,
        5115,
        5114,
        5105,
        5091,
        5086,
        5085,
        5084,
        5083,
        5082,
        5075,
        5070,
        5069,
        5067,
        5059,
        5048,
        5047,
        5043,
        5032,
        5031,
        5020,
        5009,
        5008,
        5000,
        4995,
        4993,
        4991,
        4990,
        4971,
        4959,
        4956,
        4952,
        4950,
        4948,
        4937,
        4932,
        4920,
        4917,
        4914,
        4899,
        4896,
        4892,
        4887,
        4886,
        4877,
        4870,
        4865,
        4863,
        4857,
        4848,
        4846,
        4843,
        4830,
        4829,
        4807,
        4806,
        4805,
        4803,
        4801,
        4799,
        4795,
        4788,
        4784,
        4771,
        4770,
        4769,
        4761,
        4745,
        4744,
        4732,
        4730,
        4726,
        4718,
        4707,
        4702,
        4693,
        4688,
        4686,
        4676,
        4669,
        4665,
        4649,
        4643,
        4629,
        4624,
        4621,
        4605,
        4578,
        4577,
        4567,
        4564,
        4563,
        4560,
        4558,
        4557,
        4555,
        4553,
        4543,
        4542,
        4536,
        4535,
        4529,
        4528,
        4523,
        4519,
        4516,
        4514,
        4509,
        4508,
        4502,
        4499,
        4496,
        4490,
        4486,
        4479,
        4478,
        4477,
        4468,
        4466,
        4465,
        4453,
        4452,
        4451,
        4449,
        4446,
        4443,
        4441,
        4440,
        4437,
        4436,
        4435,
        4434,
        4433,
        4429,
        4417,
        4416,
        4412,
        4405,
        4404,
        4402,
        4390,
        4373,
        4368,
        4367,
        4354,
        4353,
        4349,
        4347,
        4345,
        4338,
        4336,
        4334,
        4327,
        4314,
        4307,
        4306,
        4303,
        4300,
        4296,
        4292,
        4284,
        4281,
        4280,
        4277,
        4268,
        4263,
        4260,
        4255,
        4248,
        4240,
        4238,
        4222,
        4220,
        4219,
        4212,
        4211,
        4208,
        4207,
        4205,
        4178,
        4168,
        4166,
        4162,
        4157,
        4153,
        4151,
        4146,
        4139,
        4135,
        4131,
        4130,
        4127,
        4126,
        4122,
        4117,
        4113,
        4109,
        4108,
        4102,
        4098,
        4087,
        4078,
        4072,
        4069,
        4067,
        4055,
        4053,
        4045,
        4035,
        4027,
        4020,
        4005,
        4001,
        3998,
        3996,
        3995,
        3993,
        3992,
        3991,
        3989,
        3986,
        3984,
        3980,
        3977,
        3972,
        3969,
        3968,
        3943,
        3941,
        3940,
        3939,
        3938,
        3937,
        3918,
        3904,
        3903,
        3902,
        3890,
        3882,
        3880,
        3879,
        3859,
        3855,
        3854,
        3845,
        3830,
        3821,
        3818,
        3817,
        3816,
        3812,
        3811,
        3810,
        3809,
        3807,
        3798,
        3780,
        3763,
        3762,
        3759,
        3750,
        3740,
        3720,
        3718,
        3705,
        3698,
        3695,
        3685,
        3683,
        3681,
        3680,
        3667,
        3660,
        3657,
        3643,
        3639,
        3633,
        3632,
        3630,
        3629,
        3625,
        3616,
        3613,
        3610,
        3608,
        3605,
        3594,
        3583,
        3582,
        3576,
        3573,
        3571,
        3569,
        3566,
        3558,
        3557,
        3556,
        3555,
        3548,
        3547,
        3546,
        3538,
        3527,
        3525,
        3522,
        3521,
        3510,
        3509,
        3498,
        3496,
        3484,
        3480,
        3479,
        3478,
        3477,
        3476,
        3463,
        3458,
        3457,
        3450,
        3447,
        3445,
        3443,
        3442,
        3417,
        3416,
        3414,
        3409,
        3408,
        3395,
        3392,
        3385,
        3384,
        3380,
        3379,
        3378,
        3368,
        3348,
        3330,
        3326,
        3322,
        3305,
        3297,
        3296,
        3289,
        3286,
        3279,
        3277,
        3270,
        3269,
        3268,
        3267,
        3264,
        3257,
        3256,
        3255,
        3251,
        3247,
        3246,
        3244,
        3243,
        3232,
        3226,
        3225,
        3224,
        3223,
        3216,
        3211,
        3202,
        3200,
        3196,
        3192,
        3188,
        3183,
        3178,
        3177,
        3173,
        3167,
        3158,
        3154,
        3147,
        3144,
        3133,
        3129,
        3126,
        3117,
        3116,
        3115,
        3108,
        3107,
        3098,
        3095,
        3089,
        3084,
        3080,
        3075,
        3065,
        3059,
        3056,
        3049,
        3048,
        3042,
        3036,
        3035,
        3033,
        3032,
        3026,
        3015,
        3009,
        3003,
        2998,
        2990,
        2989,
        2988,
        2987,
        2966,
        2956,
        2947,
        2946,
        2945,
        2938,
        2936,
        2931,
        2930,
        2929,
        2922,
        2921,
        2920,
        2919,
        2897,
        2894,
        2892,
        2891,
        2879,
        2863,
        2853,
        2851,
        2850,
        2849,
        2843,
        2839,
        2828,
        2821,
        2817,
        2814,
        2811,
        2802,
        2801,
        2799,
        2782,
        2770,
        2761,
        2754,
        2751,
        2750,
        2744,
        2743,
        2737,
        2700,
        2691,
        2678,
        2677,
        2674,
        2668,
        2667,
        2666,
        2665,
        2664,
        2663,
        2661,
        2657,
        2656,
        2653,
        2652,
        2650,
        2644,
        2643,
        2635,
        2616,
        2614,
        2610,
        2607,
        2606,
        2605,
        2604,
        2592,
        2591,
        2585,
        2579,
        2574,
        2573,
        2572,
        2569,
        2568,
        2565,
        2561,
        2560,
        2559,
        2550,
        2546,
        2538,
        2535,
        2533,
        2530,
        2526,
        2525,
        2519,
        2518,
        2515,
        2514,
        2505,
        2499,
        2495,
        2486,
        2483,
        2427,
        2411,
        2402,
        2397,
        2394,
        2391,
        2390,
        2380,
        2375,
        2370,
        2363,
        2358,
        2337,
        2333,
        2331,
        2328,
        2326,
        2324,
        2320,
        2316,
        2300,
        2296,
        2287,
        2275,
        2270,
        2269,
        2262,
        2261,
        2256,
        2239,
        2234,
        2233,
        2232,
        2231,
        2230,
        2228,
        2227,
        2224,
        2209,
        2185,
        2179,
        2167,
        2166,
        2165,
        2164,
        2160,
        2158,
        2153,
        2151,
        2150,
        2147,
        2141,
        2129,
        2116,
        2115,
        2114,
        2109,
        2100,
        2097,
        2086,
        2081,
        2080,
        2075,
        2072,
        2071,
        2069,
        2068,
        2067,
        2055,
        2049,
        2044,
        2040,
        2034,
        2030,
        2028,
        2027,
        2023,
        2012,
        2009,
        2004,
        2002,
        2000,
        1999,
        1998,
        1986,
        1976,
        1973,
        1970,
        1967,
        1966,
        1964,
        1956,
        1943,
        1934,
        1932,
        1930,
        1924,
        1922,
        1921,
        1919,
        1916,
        1914,
        1907,
        1906,
        1905,
        1902,
        1893,
        1890,
        1884,
        1877,
        1876,
        1875,
        1869,
        1868,
        1866,
        1865,
        1864,
        1854,
        1848,
        1842,
        1839,
        1838,
        1831,
        1829,
        1828,
        1827,
        1826,
        1825,
        1823,
        1822,
        1819,
        1813,
        1806,
        1796,
        1795,
        1794,
        1793,
        1792,
        1790,
        1780,
        1779,
        1776,
        1771,
        1765,
        1762,
        1759,
        1754,
        1753,
        1751,
        1745,
        1744,
        1732,
        1713,
        1712,
        1709,
        1707,
        1705,
        1702,
        1699,
        1698,
        1696,
        1695,
        1694,
        1686,
        1684,
        1683,
        1676,
        1674,
        1669,
        1664,
        1660,
        1658,
        1655,
        1654,
        1647,
        1636,
        1633,
        1632,
        1631,
        1630,
        1624,
        1623,
        1614,
        1611,
        1610,
        1609,
        1607,
        1599,
        1597,
        1596,
        1593,
        1589,
        1586,
        1585,
        1579,
        1576,
        1575,
        1573,
        1571,
        1570,
        1569,
        1565,
        1559,
        1551,
        1549,
        1547,
        1545,
        1541,
        1530,
        1527,
        1526,
        1524,
        1521,
        1520,
        1512,
        1511,
        1510,
        1506,
        1505,
        1501,
        1498,
        1494,
        1487,
        1485,
        1475,
        1472,
        1468,
        1467,
        1460,
        1456,
        1450,
        1449,
        1446,
        1445,
        1440,
        1438,
        1435,
        1429,
        1428,
        1427,
        1425,
        1424,
        1419,
        1418,
        1412,
        1408,
        1407,
        1406,
        1405,
        1404,
        1402,
        1396,
        1393,
        1383,
        1379,
        1375,
        1370,
        1366,
        1363,
        1359,
        1355,
        1352,
        1350,
        1348,
        1346,
        1344,
        1343,
        1342,
        1336,
        1333,
        1332,
        1329,
        1328,
        1323,
        1317,
        1312,
        1304,
        1301,
        1299,
        1298,
        1293,
        1286,
        1284,
        1282,
        1281,
        1276,
        1274,
        1273,
        1272,
        1271,
        1269,
        1263,
        1262,
        1252,
        1247,
        1242,
        1241,
        1240,
        1231,
        1230,
        1225,
        1220,
        1218,
        1215,
        1214,
        1209,
        1208,
        1198,
        1191,
        1185,
        1183,
        1182,
        1175,
        1174,
        1172,
        1170,
        1162,
        1159,
        1156,
        1155,
        1153,
        1152,
        1148,
        1146,
        1145,
        1142,
        1136,
        1132,
        1123,
        1117,
        1116,
        1113,
        1112,
        1111,
        1106,
        1100,
        1098,
        1097,
        1094,
        1093,
        1092,
        1089,
        1088,
        1087,
        1083,
        1081,
        1077,
        1069,
        1065,
        1064,
        1063,
        1060,
        1049,
        1043,
        1036,
        1035,
        1033,
        1023,
        1021,
        1020,
        1019,
        1018,
        1012,
        1011,
        1010,
        1009,
        1006,
        1005,
        988,
        987,
        986,
        985,
        984,
        982,
        981,
        980,
        966,
        965,
        959,
        954,
        953,
        940,
        937,
        935,
        933,
        922,
        909,
        881,
        874,
        869,
        857,
        850,
        840,
        833,
        818,
        814,
        813,
        812,
        805,
        804,
        802,
        800,
        799,
        797,
        793,
        792,
        785,
        778,
        776,
        754,
        751,
        739,
        735,
        734,
        733,
        732,
        722,
        714,
        707,
        682,
        671,
        669,
        668,
        663,
        662,
        661,
        660,
        659,
        655,
        652,
        649,
        648,
        640,
        639,
        638,
        635,
        634,
        627,
        626,
        618,
        616,
        609,
        607,
        600,
        599,
        594,
        592,
        587,
        585,
        579,
        576,
        575,
        569,
        568,
        557,
        544,
        543,
        540,
        538,
        533,
        526,
        525,
        523,
        522,
        521,
        515,
        500,
        495,
        493,
        491,
        490,
        489,
        487,
        484,
        478,
        473,
        471,
        469,
        466,
        464,
        462,
        460,
        456,
        455,
        444,
        437,
        433,
        429,
        426,
        420,
        416,
        414,
        406,
        405,
        404,
        403,
        402,
        398,
        396,
        394,
        393,
        388,
        385,
        383,
        380,
        375,
        374,
        373,
        372,
        371,
        369,
        367,
        352,
        349,
        347,
        346,
        345,
        343,
        341,
        340,
        338,
        337,
        333,
        330,
        324,
        323,
        322,
        318,
        317,
        311,
        302,
        299,
        294,
        290,
        282,
        281,
        272,
        271,
        269,
        268,
        266,
        259,
        257,
        256,
        255,
        254,
        252,
        251,
        250,
        248,
        247,
        244,
        242,
        239,
        236,
        235,
        224,
        223,
        222,
        220,
        219,
        218,
        217,
        216,
        215,
        214,
        213,
        212,
        211,
        208,
        207,
        205,
        204,
        203,
        202,
        201,
        200,
        198,
        195,
        192,
        191,
        190,
        188,
        187,
        186,
        185,
        183,
        181,
        180,
        179,
        178,
        177,
        176,
        175,
        173,
        172,
        171,
        170,
        169,
        168,
        167,
        166,
        165,
        164,
        162,
        159,
        158,
        157,
        155,
        154,
        152,
        149,
        148,
        147,
        145,
        143,
        142,
        141,
        138,
        137,
        136,
        135,
        133,
        132,
        131,
        130,
        129,
        128,
        127,
        126,
        125,
        121,
        120,
        119,
        118,
        117,
        116,
        115,
        114,
        113,
        112,
        111,
        110,
        109,
        108,
        107,
        106,
        105,
        104,
        103,
        102,
        101,
        100,
        99,
        96,
        94,
        93,
        92,
        91,
        90,
        87,
        86,
        85,
        84,
        83,
        82,
        81,
        80,
        79,
        75,
        74,
        73,
        72,
        70,
        69,
        68,
        66,
        65,
        64,
        63,
        62,
        61,
        57,
        56,
        55,
        54,
        52,
        51,
        49,
        47,
        45,
        44,
        43,
        42,
        41,
        40,
        38,
        37,
        36,
        35,
        33,
        31,
        30,
        29,
        28,
        26,
        25,
        23,
        22,
        20,
        19,
        18,
        17,
        16,
        15,
        13,
        12,
        11,
        10,
        9,
        8,
        7,
        6,
        5,
        3,
        2,
        1
    ],
    "finished": true
}