{
    "covered_issues": [
        1646,
        1645,
        1644,
        1643,
        1639,
        1637,
        1635,
        1634,
        1636,
        1629,
        1628,
        1626,
        1625,
        1624,
        1623,
        1621,
        1620,
        1618,
        1617,
        1616,
        1614,
        1613,
        1612,
        1611,
        1609,
        1608,
        1607,
        1604,
        1603,
        1601,
        1599,
        1598,
        1597,
        1591,
        1590,
        1589,
        1588,
        1587,
        1586,
        1585,
        1584,
        1583,
        1582,
        1579,
        1577,
        1574,
        1571,
        1568,
        1567,
        1564,
        1563,
        1560,
        1558,
        1557,
        1556,
        1553,
        1550,
        1546,
        1540,
        1539,
        1538,
        1534,
        1533,
        1532,
        1531,
        1555,
        1529,
        1528,
        1526,
        1525,
        1524,
        1522,
        1521,
        1518,
        1512,
        1508,
        1502,
        1500,
        1499,
        1498,
        1495,
        1493,
        1491,
        1488,
        1487,
        1486,
        1485,
        1480,
        1479,
        1473,
        1472,
        1470,
        1469,
        1467,
        1466,
        1463,
        1462,
        1460,
        1455,
        1454,
        1452,
        1451,
        1449,
        1447,
        1445,
        1443,
        1440,
        1438,
        1435,
        1433,
        1432,
        1430,
        1429,
        1427,
        1426,
        1425,
        1424,
        1422,
        1421,
        1420,
        1419,
        1418,
        1417,
        1416,
        1415,
        1413,
        1406,
        1405,
        1403,
        1402,
        1401,
        1398,
        1394,
        1390,
        1389,
        1386,
        1383,
        1382,
        1380,
        1379,
        1377,
        1376,
        1371,
        1370,
        1369,
        1368,
        1366,
        1364,
        1361,
        1360,
        1359,
        1358,
        1357,
        1356,
        1355,
        1354,
        1351,
        1348,
        1346,
        1344,
        1343,
        1349,
        1341,
        1340,
        1338,
        1335,
        1334,
        1333,
        1332,
        1329,
        1328,
        1323,
        1321,
        1320,
        1319,
        1318,
        1317,
        1316,
        1315,
        1309,
        1307,
        1306,
        1305,
        1304,
        1300,
        1299,
        1297,
        1294,
        1290,
        1289,
        1287,
        1283,
        1282,
        1277,
        1274,
        1273,
        1272,
        1271,
        1269,
        1268,
        1267,
        1263,
        1261,
        1260,
        1259,
        1258,
        1255,
        1253,
        1248,
        1246,
        1245,
        1244,
        1241,
        1237,
        1236,
        1233,
        1229,
        1228,
        1227,
        1224,
        1223,
        1222,
        1220,
        1217,
        1216,
        1215,
        1213,
        1212,
        1211,
        1210,
        1209,
        1208,
        1206,
        1205,
        1204,
        1203,
        1202,
        1201,
        1200,
        1199,
        1198,
        1197,
        1196,
        1195,
        1194,
        1193,
        1191,
        1188,
        1186,
        1182,
        1181,
        1180,
        1179,
        1176,
        1175,
        1174,
        1173,
        1172,
        1171,
        1170,
        1169,
        1168,
        1184,
        1167,
        1165,
        1163,
        1162,
        1161,
        1160,
        1159,
        1158,
        1156,
        1155,
        1154,
        1153,
        1152,
        1151,
        1149,
        1148,
        1147,
        1146,
        1143,
        1142,
        1134,
        1131,
        1130,
        1129,
        1128,
        1127,
        1125,
        1124,
        1123,
        1122,
        1121,
        1120,
        1119,
        1117,
        1116,
        1115,
        1114,
        1112,
        1111,
        1110,
        1109,
        1108,
        1107,
        1106,
        1105,
        1104,
        1103,
        1102,
        1100,
        1099,
        1096,
        1095,
        1093,
        1091,
        1090,
        1089,
        1088,
        1076,
        1075,
        1074,
        1072,
        1070,
        1068,
        1067,
        1066,
        1065,
        1063,
        1060,
        1059,
        1058,
        1057,
        1056,
        1053,
        1052,
        1051,
        1049,
        1048,
        1047,
        1046,
        1045,
        1043,
        1042,
        1041,
        1040,
        1039,
        1038,
        1037,
        1036,
        1035,
        1034,
        1033,
        1032,
        1031,
        1030,
        1029,
        1028,
        1027,
        1026,
        1025,
        1024,
        1023,
        1022,
        1021,
        1020,
        1018,
        1017,
        1016,
        1015,
        1011,
        1010,
        1009,
        1007,
        1005,
        1000,
        1013,
        999,
        998,
        997,
        996,
        995,
        994,
        993,
        992,
        990,
        989,
        988,
        987,
        986,
        985,
        984,
        983,
        982,
        981,
        980,
        979,
        978,
        977,
        976,
        975,
        974,
        973,
        972,
        971,
        970,
        968,
        967,
        966,
        965,
        964,
        963,
        961,
        960,
        959,
        958,
        957,
        956,
        955,
        954,
        953,
        952,
        951,
        950,
        949,
        948,
        947,
        946,
        945,
        944,
        943,
        942,
        941,
        940,
        939,
        938,
        937,
        936,
        935,
        934,
        933,
        932,
        931,
        930,
        929,
        928,
        927,
        926,
        925,
        924,
        923,
        921,
        920,
        919,
        918,
        917,
        916,
        915,
        914,
        913,
        912,
        911,
        910,
        909,
        908,
        907,
        906,
        905,
        904,
        903,
        902,
        901,
        900,
        899,
        898,
        897,
        896,
        895,
        894,
        893,
        892,
        890,
        889,
        888,
        886,
        884,
        883,
        882,
        881,
        880,
        878,
        877,
        876,
        875,
        872,
        871,
        870,
        869,
        868,
        866,
        865,
        864,
        863,
        862,
        861,
        860,
        859,
        858,
        857,
        856,
        855,
        854,
        852,
        850,
        849,
        848,
        846,
        845,
        844,
        843,
        842,
        841,
        840,
        839,
        837,
        836,
        835,
        834,
        833,
        832,
        831,
        830,
        829,
        828,
        827,
        826,
        825,
        824,
        823,
        821,
        819,
        818,
        817,
        816,
        815,
        814,
        813,
        812,
        811,
        810,
        809,
        808,
        807,
        806,
        804,
        803,
        801,
        800,
        799,
        798,
        797,
        795,
        794,
        793,
        792,
        791,
        789,
        788,
        786,
        785,
        784,
        783,
        782,
        781,
        779,
        778,
        777,
        776,
        774,
        773,
        772,
        771,
        770,
        769,
        765,
        763,
        762,
        761,
        760,
        759,
        755,
        754,
        753,
        752,
        751,
        750,
        749,
        748,
        747,
        745,
        744,
        743,
        742,
        740,
        739,
        738,
        737,
        736,
        735,
        734,
        733,
        732,
        731,
        730,
        729,
        728,
        727,
        726,
        725,
        724,
        723,
        722,
        721,
        720,
        719,
        718,
        717,
        716,
        715,
        714,
        713,
        712,
        711,
        710,
        709,
        708,
        707,
        705,
        704,
        703,
        702,
        700,
        699,
        698,
        697,
        695,
        694,
        693,
        692,
        691,
        690,
        689,
        687,
        685,
        683,
        681,
        678,
        677,
        676,
        675,
        674,
        673,
        672,
        671,
        670,
        669,
        668,
        667,
        666,
        665,
        664,
        663,
        662,
        661,
        660,
        659,
        658,
        657,
        656,
        655,
        654,
        653,
        652,
        651,
        650,
        649,
        648,
        647,
        646,
        645,
        644,
        643,
        642,
        641,
        640,
        639,
        638,
        637,
        636,
        635,
        634,
        633,
        632,
        631,
        630,
        629,
        627,
        626,
        625,
        624,
        623,
        622,
        621,
        620,
        619,
        617,
        616,
        615,
        614,
        613,
        612,
        611,
        610,
        609,
        608,
        607,
        605,
        604,
        603,
        602,
        601,
        600,
        599,
        598,
        597,
        596,
        595,
        594,
        593,
        592,
        591,
        590,
        589,
        588,
        587,
        586,
        585,
        584,
        583,
        582,
        581,
        580,
        579,
        578,
        577,
        576,
        575,
        574,
        573,
        572,
        569,
        568,
        565,
        564,
        563,
        562,
        558,
        556,
        555,
        554,
        553,
        552,
        551,
        548,
        546,
        542,
        540,
        539,
        538,
        537,
        536,
        535,
        533,
        532,
        529,
        520,
        518,
        516,
        515,
        506,
        504,
        503,
        501,
        500,
        499,
        498,
        497,
        496,
        495,
        494,
        493,
        491,
        489,
        488,
        487,
        486,
        485,
        484,
        483,
        482,
        481,
        480,
        479,
        478,
        477,
        476,
        475,
        474,
        473,
        472,
        471,
        470,
        469,
        468,
        467,
        466,
        465,
        464,
        463,
        462,
        461,
        460,
        459,
        458,
        457,
        456,
        455,
        454,
        453,
        452,
        451,
        450,
        449,
        448,
        447,
        446,
        445,
        444,
        443,
        442,
        441,
        440,
        439,
        438,
        437,
        436,
        435,
        434,
        433,
        432,
        430,
        429,
        428,
        427,
        426,
        425,
        423,
        422,
        421,
        420,
        419,
        418,
        417,
        416,
        413,
        412,
        411,
        410,
        409,
        408,
        407,
        406,
        405,
        404,
        403,
        402,
        401,
        400,
        399,
        398,
        397,
        396,
        395,
        394,
        393,
        392,
        391,
        390,
        389,
        388,
        387,
        386,
        385,
        384,
        383,
        381,
        380,
        379,
        377,
        376,
        375,
        374,
        373,
        372,
        371,
        370,
        369,
        368,
        367,
        366,
        365,
        363,
        362,
        361,
        360,
        359,
        358,
        357,
        356,
        355,
        353,
        352,
        351,
        350,
        348,
        347,
        346,
        345,
        344,
        343,
        342,
        341,
        339,
        338,
        336,
        334,
        333,
        331,
        328,
        327,
        326,
        324,
        323,
        322,
        321,
        320,
        319,
        318,
        317,
        316,
        315,
        314,
        313,
        312,
        311,
        310,
        309,
        308,
        307,
        306,
        305,
        304,
        303,
        302,
        301,
        300,
        299,
        298,
        297,
        296,
        295,
        294,
        293,
        292,
        291,
        290,
        289,
        288,
        287,
        286,
        285,
        284,
        283,
        282,
        281,
        280,
        279,
        278,
        277,
        276,
        275,
        274,
        273,
        272,
        270,
        269,
        268,
        267,
        266,
        265,
        264,
        263,
        262,
        261,
        260,
        259,
        258,
        257,
        256,
        255,
        254,
        253,
        252,
        251,
        250,
        249,
        248,
        247,
        245,
        243,
        242,
        241,
        240,
        239,
        238,
        237,
        236,
        235,
        233,
        232,
        231,
        230,
        229,
        228,
        227,
        225,
        224,
        223,
        222,
        221,
        220,
        219,
        218,
        216,
        214,
        213,
        212,
        209,
        208,
        207,
        206,
        205,
        204,
        203,
        202,
        201,
        200,
        199,
        198,
        197,
        196,
        195,
        194,
        193,
        192,
        191,
        190,
        189,
        188,
        187,
        186,
        184,
        181,
        178,
        177,
        176,
        175,
        174,
        173,
        172,
        171,
        170,
        169,
        168,
        166,
        165,
        164,
        163,
        162,
        161,
        160,
        158,
        157,
        156,
        155,
        154,
        153,
        152,
        151,
        150,
        149,
        148,
        147,
        146,
        145,
        144,
        142,
        141,
        140,
        139,
        138,
        137,
        136,
        135,
        134,
        133,
        132,
        131,
        130,
        129,
        128,
        127,
        125,
        124,
        123,
        122,
        121,
        120,
        119,
        118,
        117,
        116,
        114,
        113,
        112,
        111,
        110,
        109,
        108,
        106,
        93,
        87,
        86,
        85,
        79,
        75,
        74,
        73,
        72,
        71,
        70,
        69,
        67,
        66,
        65,
        64,
        63,
        60,
        57,
        56,
        54,
        53,
        52,
        49,
        46,
        45,
        43,
        42,
        38,
        37,
        35,
        34,
        33,
        32,
        30,
        27,
        25,
        23,
        14,
        13,
        12,
        11,
        10,
        9,
        8,
        7,
        6,
        5,
        4,
        3,
        2,
        1
    ],
    "finished": true
}