{
    "covered_issues": [
        8015,
        8006,
        7983,
        7982,
        7976,
        7966,
        7964,
        7957,
        7954,
        7950,
        7948,
        7946,
        7944,
        7942,
        7940,
        7938,
        7934,
        7919,
        7916,
        7914,
        7910,
        7908,
        7886,
        7875,
        7869,
        7859,
        7856,
        7854,
        7852,
        7847,
        7844,
        7839,
        7830,
        7825,
        7819,
        7814,
        7806,
        7804,
        7799,
        7797,
        7791,
        7788,
        7787,
        7783,
        7780,
        7779,
        7777,
        7776,
        7769,
        7768,
        7761,
        7745,
        7743,
        7738,
        7734,
        7731,
        7725,
        7723,
        7722,
        7721,
        7716,
        7712,
        7703,
        7697,
        7696,
        7695,
        7684,
        7678,
        7672,
        7661,
        7654,
        7639,
        7630,
        7629,
        7627,
        7626,
        7618,
        7613,
        7610,
        7609,
        7607,
        7604,
        7603,
        7600,
        7598,
        7597,
        7595,
        7594,
        7593,
        7588,
        7587,
        7586,
        7582,
        7577,
        7574,
        7571,
        7570,
        7565,
        7562,
        7561,
        7558,
        7556,
        7555,
        7553,
        7551,
        7547,
        7546,
        7541,
        7540,
        7539,
        7538,
        7537,
        7532,
        7529,
        7527,
        7526,
        7525,
        7523,
        7512,
        7502,
        7498,
        7494,
        7482,
        7479,
        7476,
        7475,
        7471,
        7487,
        7455,
        7452,
        7448,
        7446,
        7443,
        7439,
        7437,
        7436,
        7434,
        7431,
        7428,
        7425,
        7422,
        7420,
        7400,
        7396,
        7380,
        7355,
        7352,
        7351,
        7350,
        7344,
        7341,
        7339,
        7338,
        7336,
        7331,
        7330,
        7323,
        7316,
        7313,
        7296,
        7294,
        7282,
        7277,
        7276,
        7261,
        7258,
        7257,
        7256,
        7254,
        7253,
        7250,
        7244,
        7242,
        7241,
        7240,
        7236,
        7233,
        7232,
        7230,
        7228,
        7224,
        7220,
        7219,
        7216,
        7211,
        7205,
        7203,
        7202,
        7200,
        7193,
        7186,
        7185,
        7183,
        7174,
        7168,
        7165,
        7162,
        7150,
        7149,
        7148,
        7147,
        7142,
        7140,
        7136,
        7132,
        7131,
        7126,
        7125,
        7122,
        7120,
        7116,
        7115,
        7112,
        7109,
        7107,
        7104,
        7101,
        7098,
        7097,
        7086,
        7080,
        7079,
        7075,
        7071,
        7069,
        7061,
        7060,
        7054,
        7052,
        7050,
        7048,
        7046,
        7044,
        7042,
        7033,
        7032,
        7031,
        7028,
        7022,
        7021,
        7018,
        7015,
        7010,
        7006,
        7000,
        6993,
        6991,
        6989,
        6988,
        6986,
        6984,
        6982,
        6974,
        6972,
        6970,
        6968,
        6965,
        6963,
        6961,
        6955,
        6953,
        6951,
        6950,
        6947,
        6944,
        6942,
        6940,
        6932,
        6927,
        6925,
        6918,
        6917,
        6915,
        6912,
        6911,
        6909,
        6905,
        6898,
        6895,
        6892,
        6889,
        6887,
        6885,
        6880,
        6876,
        6871,
        6867,
        6857,
        6855,
        6853,
        6847,
        6845,
        6842,
        6833,
        6825,
        6820,
        6812,
        6807,
        6794,
        6793,
        6792,
        6791,
        6790,
        6781,
        6780,
        6772,
        6770,
        6766,
        6765,
        6762,
        6760,
        6757,
        6752,
        6749,
        6748,
        6739,
        6736,
        6733,
        6732,
        6725,
        6720,
        6718,
        6711,
        6697,
        6694,
        6693,
        6690,
        6687,
        6679,
        6665,
        6660,
        6655,
        6654,
        6653,
        6650,
        6643,
        6640,
        6639,
        6637,
        6624,
        6618,
        6617,
        6612,
        6611,
        6610,
        6599,
        6598,
        6595,
        6594,
        6589,
        6588,
        6587,
        6583,
        6577,
        6551,
        6544,
        6541,
        6538,
        6534,
        6531,
        6530,
        6528,
        6513,
        6511,
        6641,
        6508,
        6505,
        6499,
        6491,
        6487,
        6477,
        6468,
        6461,
        6444,
        6442,
        6440,
        6436,
        6435,
        6433,
        6426,
        6424,
        6421,
        6414,
        6412,
        6408,
        6406,
        6400,
        6394,
        6387,
        6385,
        6367,
        6366,
        6359,
        6358,
        6357,
        6356,
        6351,
        6350,
        6345,
        6341,
        6336,
        6335,
        6328,
        6320,
        6312,
        6309,
        6308,
        6307,
        6306,
        6299,
        6293,
        6291,
        6284,
        6280,
        6271,
        6263,
        6262,
        6256,
        6251,
        6248,
        6243,
        6241,
        6236,
        6229,
        6218,
        6217,
        6213,
        6211,
        6209,
        6201,
        6200,
        6190,
        6189,
        6183,
        6179,
        6174,
        6170,
        6169,
        6167,
        6166,
        6163,
        6158,
        6152,
        6142,
        6140,
        6135,
        6133,
        6131,
        6128,
        6127,
        6125,
        6114,
        6112,
        6111,
        6108,
        6105,
        6104,
        6100,
        6097,
        6093,
        6090,
        6089,
        6086,
        6078,
        6072,
        6068,
        6066,
        6059,
        6055,
        6053,
        6047,
        6046,
        6043,
        6040,
        6038,
        6037,
        6025,
        6010,
        6006,
        6004,
        5998,
        5997,
        5994,
        5988,
        5987,
        5986,
        5981,
        5979,
        5976,
        5975,
        5963,
        5960,
        5959,
        5957,
        5951,
        5937,
        5935,
        5930,
        5928,
        5923,
        5920,
        5914,
        5913,
        5902,
        5900,
        5899,
        5894,
        5890,
        5889,
        5886,
        5882,
        5881,
        5876,
        5875,
        5874,
        5869,
        5867,
        5859,
        5857,
        5856,
        5854,
        5852,
        5845,
        5838,
        5837,
        5836,
        5832,
        5839,
        5831,
        5830,
        5829,
        5828,
        5823,
        5817,
        5816,
        5815,
        5809,
        5808,
        5807,
        5804,
        5802,
        5785,
        5784,
        5783,
        5781,
        5778,
        5774,
        5763,
        5761,
        5757,
        5756,
        5752,
        5749,
        5745,
        5742,
        5771,
        5736,
        5731,
        5730,
        5729,
        5728,
        5724,
        5723,
        5720,
        5718,
        5716,
        5712,
        5704,
        5698,
        5694,
        5686,
        5684,
        5670,
        5669,
        5668,
        5663,
        5662,
        5661,
        5654,
        5653,
        5651,
        5644,
        5643,
        5632,
        5630,
        5624,
        5619,
        5609,
        5605,
        5604,
        5603,
        5600,
        5595,
        5594,
        5591,
        5588,
        5587,
        5582,
        5575,
        5573,
        5572,
        5567,
        5554,
        5542,
        5541,
        5533,
        5532,
        5523,
        5522,
        5520,
        5518,
        5516,
        5513,
        5512,
        5507,
        5495,
        5486,
        5478,
        5475,
        5474,
        5473,
        5432,
        5430,
        5426,
        5416,
        5408,
        5395,
        5389,
        5388,
        5384,
        5377,
        5369,
        5368,
        5367,
        5365,
        5354,
        5353,
        5351,
        5348,
        5347,
        5344,
        5343,
        5341,
        5338,
        5330,
        5326,
        5323,
        5314,
        5311,
        5310,
        5308,
        5307,
        5306,
        5295,
        5294,
        5290,
        5287,
        5282,
        5281,
        5279,
        5274,
        5273,
        5268,
        5266,
        5260,
        5255,
        5250,
        5246,
        5237,
        5226,
        5225,
        5223,
        5219,
        5211,
        5209,
        5208,
        5205,
        5202,
        5195,
        5194,
        5191,
        5189,
        5187,
        5183,
        5182,
        5180,
        5177,
        5167,
        5163,
        5161,
        5158,
        5156,
        5152,
        5150,
        5145,
        5141,
        5135,
        5127,
        5120,
        5119,
        5112,
        5105,
        5097,
        5093,
        5090,
        5082,
        5077,
        5075,
        5070,
        5064,
        5055,
        5037,
        5035,
        5034,
        5032,
        5029,
        5023,
        5039,
        5022,
        5016,
        5004,
        5002,
        4992,
        4990,
        4989,
        4986,
        4984,
        4979,
        4978,
        4972,
        4969,
        4965,
        4961,
        4955,
        4953,
        4943,
        4941,
        4938,
        4929,
        4923,
        4917,
        4911,
        4906,
        4900,
        4899,
        4892,
        4877,
        4874,
        4869,
        4866,
        4859,
        4848,
        4842,
        4840,
        4839,
        4836,
        4835,
        4833,
        4832,
        4830,
        4822,
        4821,
        4820,
        4819,
        4814,
        4810,
        4807,
        4805,
        4799,
        4798,
        4795,
        4792,
        4789,
        4788,
        4780,
        4779,
        4774,
        4773,
        4771,
        4763,
        4762,
        4760,
        4757,
        4755,
        4753,
        4750,
        4743,
        4742,
        4740,
        4738,
        4734,
        4733,
        4728,
        4722,
        4713,
        4709,
        4707,
        4706,
        4703,
        4695,
        4682,
        4679,
        4675,
        4670,
        4669,
        4668,
        4658,
        4657,
        4655,
        4651,
        4649,
        4645,
        4641,
        4638,
        4633,
        4630,
        4616,
        4615,
        4607,
        4605,
        4604,
        4601,
        4597,
        4585,
        4579,
        4577,
        4575,
        4572,
        4567,
        4564,
        4563,
        4557,
        4552,
        4528,
        4526,
        4524,
        4522,
        4513,
        4512,
        4507,
        4500,
        4497,
        4493,
        4489,
        4486,
        4482,
        4479,
        4474,
        4472,
        4467,
        4466,
        4462,
        4459,
        4453,
        4891,
        4442,
        4436,
        4429,
        4425,
        4421,
        4419,
        4415,
        4414,
        4411,
        4408,
        4403,
        4397,
        4396,
        4393,
        4391,
        4389,
        4388,
        4387,
        4384,
        4381,
        4374,
        4372,
        4369,
        4368,
        4361,
        4355,
        4353,
        4352,
        4351,
        4349,
        4344,
        4342,
        4341,
        4340,
        4337,
        4334,
        4333,
        4322,
        4319,
        4318,
        4314,
        4312,
        4308,
        4304,
        4303,
        4301,
        4295,
        4292,
        4291,
        4282,
        4279,
        4268,
        4265,
        4264,
        4258,
        4254,
        4252,
        4248,
        4241,
        4232,
        4231,
        4230,
        4227,
        4225,
        4222,
        4218,
        4213,
        4206,
        4205,
        4200,
        4191,
        4190,
        4186,
        4182,
        4181,
        4180,
        4175,
        4168,
        4167,
        4162,
        4143,
        4133,
        4129,
        4122,
        4109,
        4108,
        4082,
        4078,
        4077,
        4068,
        4055,
        4053,
        4043,
        4041,
        4039,
        4036,
        4034,
        4032,
        4019,
        4016,
        4014,
        4008,
        4003,
        3999,
        3992,
        3987,
        3983,
        3982,
        3980,
        3976,
        3970,
        3963,
        3960,
        3955,
        3949,
        3948,
        3947,
        3946,
        3942,
        3940,
        3928,
        3926,
        3921,
        3920,
        3916,
        3914,
        3908,
        3907,
        3904,
        3901,
        3876,
        3869,
        3867,
        3861,
        3857,
        3854,
        3850,
        3847,
        3846,
        3845,
        3844,
        3843,
        3837,
        3830,
        3820,
        3806,
        3802,
        3798,
        3793,
        3790,
        3779,
        3770,
        3769,
        3766,
        3765,
        3761,
        3756,
        3750,
        3737,
        3729,
        3726,
        3725,
        3724,
        3723,
        3722,
        3698,
        3695,
        3694,
        3678,
        3657,
        3656,
        3653,
        3643,
        3642,
        3641,
        3640,
        3635,
        3633,
        3629,
        3620,
        3615,
        3614,
        3613,
        3612,
        3609,
        3608,
        3592,
        3589,
        3587,
        3583,
        3569,
        3568,
        3566,
        3564,
        3562,
        3561,
        3549,
        3541,
        3540,
        3539,
        3535,
        3531,
        3526,
        3525,
        3520,
        3518,
        3517,
        3515,
        3511,
        3509,
        3504,
        3502,
        3500,
        3498,
        3492,
        3488,
        3487,
        3484,
        3481,
        3479,
        3478,
        3476,
        3473,
        3470,
        3460,
        3458,
        3457,
        3455,
        3451,
        3449,
        3445,
        3443,
        3439,
        3433,
        3428,
        3425,
        3424,
        3419,
        3414,
        3412,
        3408,
        3406,
        3400,
        3388,
        3380,
        3379,
        3378,
        3375,
        3374,
        3369,
        3365,
        3362,
        3357,
        3353,
        3348,
        3341,
        3339,
        3335,
        3330,
        3328,
        3327,
        3322,
        3316,
        3315,
        3314,
        3312,
        3308,
        3307,
        3289,
        3288,
        3286,
        3282,
        3273,
        3265,
        3261,
        3255,
        3246,
        3245,
        3243,
        3241,
        3235,
        3233,
        3221,
        3210,
        3206,
        3205,
        3199,
        3198,
        3197,
        3196,
        3190,
        3184,
        3180,
        3173,
        3168,
        3157,
        3147,
        3141,
        3140,
        3136,
        3135,
        3131,
        3130,
        3124,
        3123,
        3122,
        3117,
        3108,
        3104,
        3101,
        3098,
        3097,
        3095,
        3090,
        3088,
        3080,
        3071,
        3070,
        3069,
        3068,
        3067,
        3066,
        3065,
        3062,
        3050,
        3049,
        3048,
        3041,
        3036,
        3032,
        3021,
        3017,
        3016,
        3012,
        3011,
        3010,
        3009,
        3004,
        3000,
        2997,
        2995,
        2993,
        2992,
        2991,
        2989,
        2987,
        2982,
        2981,
        2971,
        2969,
        2968,
        2967,
        2965,
        2957,
        2954,
        2949,
        2943,
        2937,
        2920,
        2919,
        2917,
        2913,
        2912,
        2911,
        2909,
        2903,
        2897,
        2885,
        2879,
        2875,
        2870,
        2868,
        2867,
        2860,
        2854,
        2844,
        2838,
        2834,
        2824,
        2815,
        2814,
        2812,
        2810,
        2809,
        2804,
        2795,
        2791,
        2788,
        2787,
        2786,
        2785,
        2783,
        2772,
        2760,
        2759,
        2757,
        2752,
        2750,
        2747,
        2743,
        2738,
        2734,
        2731,
        2730,
        2729,
        2721,
        2717,
        2713,
        2709,
        2697,
        2690,
        2687,
        2676,
        2669,
        2659,
        2652,
        2651,
        2646,
        2640,
        2637,
        2634,
        2612,
        2609,
        2596,
        2593,
        2589,
        2587,
        2586,
        2578,
        2576,
        2558,
        2522,
        2513,
        2512,
        2503,
        2497,
        2496,
        2495,
        2493,
        2490,
        2483,
        2478,
        2476,
        2471,
        2470,
        2466,
        2460,
        2458,
        2451,
        2450,
        2447,
        2444,
        2439,
        2436,
        2433,
        2429,
        2426,
        2418,
        2412,
        2409,
        2397,
        2389,
        2388,
        2383,
        2382,
        2381,
        2378,
        2371,
        2365,
        2364,
        2358,
        2352,
        2351,
        2346,
        2344,
        2333,
        2330,
        2329,
        2327,
        2326,
        2316,
        2313,
        2309,
        2307,
        2298,
        2290,
        2288,
        2287,
        2282,
        2275,
        2268,
        2267,
        2247,
        2245,
        2241,
        2240,
        2237,
        2235,
        2234,
        2231,
        2230,
        2229,
        2228,
        2227,
        2226,
        2225,
        2224,
        2223,
        2222,
        2218,
        2210,
        2209,
        2207,
        2205,
        2197,
        2196,
        2189,
        2184,
        2179,
        2177,
        2165,
        2162,
        2143,
        2142,
        2140,
        2139,
        2129,
        2125,
        2118,
        2114,
        2112,
        2104,
        2099,
        2091,
        2086,
        2084,
        2082,
        2080,
        2073,
        2072,
        2068,
        2059,
        2056,
        2055,
        2045,
        2043,
        2038,
        2036,
        2035,
        2034,
        2033,
        2026,
        2017,
        2016,
        2015,
        2014,
        2013,
        2012,
        2009,
        2006,
        2005,
        2003,
        2000,
        1998,
        1996,
        1994,
        1992,
        1990,
        1989,
        1987,
        1983,
        1982,
        1980,
        1978,
        1974,
        1971,
        1969,
        1967,
        1960,
        1958,
        1956,
        1951,
        1949,
        1948,
        1936,
        1934,
        1930,
        1928,
        1927,
        1925,
        1921,
        1920,
        1914,
        1912,
        1902,
        1897,
        1891,
        1888,
        1887,
        1886,
        1882,
        1881,
        1880,
        1873,
        1869,
        1867,
        1860,
        1857,
        1847,
        1845,
        1840,
        1836,
        1834,
        1831,
        1828,
        1826,
        1825,
        1820,
        1812,
        1810,
        1804,
        1803,
        1802,
        1800,
        1799,
        1793,
        1791,
        1790,
        1786,
        1783,
        1778,
        1770,
        1759,
        1753,
        1741,
        1738,
        1730,
        1728,
        1717,
        1714,
        1702,
        1689,
        1675,
        1668,
        1662,
        1653,
        1647,
        1645,
        1644,
        1639,
        1636,
        1631,
        1629,
        1623,
        1622,
        1619,
        1616,
        1609,
        1600,
        1599,
        1597,
        1596,
        1591,
        1590,
        1583,
        1580,
        1575,
        1567,
        1549,
        1547,
        1546,
        1543,
        1537,
        1534,
        1532,
        1531,
        1526,
        1525,
        1520,
        1518,
        1511,
        1510,
        1501,
        1499,
        1498,
        1496,
        1494,
        1492,
        1491,
        1482,
        1475,
        1472,
        1471,
        1467,
        1466,
        1462,
        1459,
        1457,
        1452,
        1436,
        1432,
        1431,
        1427,
        1426,
        1421,
        1416,
        1414,
        1413,
        1412,
        1410,
        1403,
        1401,
        1399,
        1397,
        1391,
        1388,
        1384,
        1383,
        1377,
        1373,
        1369,
        1367,
        1364,
        1362,
        1360,
        1357,
        1355,
        1348,
        1346,
        1344,
        1338,
        1335,
        1333,
        1332,
        1327,
        1321,
        1320,
        1317,
        1314,
        1310,
        1309,
        1299,
        1296,
        1294,
        1289,
        1284,
        1282,
        1280,
        1278,
        1276,
        1273,
        1265,
        1259,
        1258,
        1253,
        1249,
        1248,
        1246,
        1237,
        1234,
        1233,
        1232,
        1225,
        1217,
        1210,
        1209,
        1207,
        1203,
        1201,
        1200,
        1197,
        1196,
        1193,
        1190,
        1181,
        1176,
        1175,
        1171,
        1170,
        1165,
        1162,
        1160,
        1156,
        1155,
        1145,
        1142,
        1141,
        1139,
        1135,
        1132,
        1127,
        1123,
        1121,
        1112,
        1109,
        1105,
        1104,
        1099,
        1096,
        1091,
        1088,
        1081,
        1070,
        1063,
        1062,
        1059,
        1058,
        1054,
        1053,
        1050,
        1045,
        1039,
        1037,
        1035,
        1032,
        1029,
        1028,
        1020,
        1019,
        1018,
        1015,
        1012,
        1011,
        1009,
        1007,
        1003,
        999,
        997,
        995,
        994,
        992,
        990,
        986,
        972,
        966,
        964,
        962,
        951,
        945,
        944,
        940,
        939,
        925,
        924,
        923,
        916,
        910,
        907,
        902,
        901,
        896,
        880,
        875,
        873,
        871,
        870,
        866,
        861,
        856,
        853,
        852,
        851,
        847,
        845,
        843,
        839,
        825,
        823,
        820,
        816,
        810,
        805,
        803,
        793,
        792,
        784,
        778,
        777,
        767,
        764,
        763,
        761,
        760,
        757,
        749,
        746,
        738,
        736,
        735,
        733,
        732,
        725,
        719,
        715,
        713,
        712,
        703,
        702,
        700,
        692,
        689,
        686,
        685,
        682,
        676,
        674,
        669,
        667,
        665,
        661,
        658,
        657,
        656,
        655,
        652,
        647,
        644,
        639,
        638,
        637,
        636,
        634,
        632,
        630,
        625,
        621,
        619,
        617,
        613,
        604,
        601,
        600,
        597,
        593,
        588,
        581,
        576,
        573,
        567,
        566,
        563,
        562,
        559,
        557,
        554,
        553,
        549,
        548,
        521,
        518,
        512,
        511,
        508,
        506,
        505,
        501,
        498,
        497,
        496,
        492,
        486,
        485,
        480,
        477,
        474,
        472,
        470,
        469,
        467,
        463,
        461,
        456,
        454,
        453,
        451,
        442,
        441,
        440,
        439,
        435,
        432,
        431,
        428,
        427,
        414,
        413,
        409,
        407,
        404,
        402,
        399,
        396,
        392,
        389,
        388,
        387,
        384,
        383,
        380,
        368,
        366,
        364,
        363,
        352,
        349,
        337,
        336,
        329,
        327,
        324,
        316,
        309,
        305,
        304,
        300,
        298,
        295,
        288,
        287,
        279,
        242,
        239,
        231,
        227,
        214,
        213,
        209,
        204,
        203,
        201,
        200,
        199,
        195,
        191,
        187,
        186,
        185,
        181,
        172,
        171,
        168,
        164,
        159,
        153,
        149,
        148,
        145,
        144,
        142,
        139,
        138,
        134,
        132,
        128,
        123,
        121,
        106,
        105,
        102,
        101,
        96,
        94,
        93,
        90,
        85,
        83,
        78,
        76,
        73,
        68,
        66,
        59,
        57,
        53,
        52,
        50,
        48,
        47,
        45,
        40,
        36,
        13,
        8,
        7
    ],
    "finished": true
}