{
    "commits": [
        {
            "associated_pull_request": [],
            "date": "2021-05-05 08:10:38+00:00",
            "diff": "assaultcube_ac/issue_259/commit_57d46e2e6891bcabc51516c31867ebcedb5a12d1.diff",
            "diff_additions": 11,
            "diff_deletions": 10,
            "diff_file_size": 87437,
            "diff_url": "https://github.com/assaultcube/AC/commit/57d46e2e6891bcabc51516c31867ebcedb5a12d1.diff",
            "exists": true,
            "files": [
                {
                    "file_additions": 7,
                    "file_deletions": 7,
                    "file_exists": true,
                    "file_name": "source/src/menus.cpp",
                    "file_size": 51992
                },
                {
                    "file_additions": 4,
                    "file_deletions": 3,
                    "file_exists": true,
                    "file_name": "source/src/rendergl.cpp",
                    "file_size": 35445
                }
            ],
            "interesting": {
                "reopen": false,
                "status": false
            },
            "is_parent": true,
            "sha": "57d46e2e6891bcabc51516c31867ebcedb5a12d1"
        },
        {
            "associated_pull_request": [],
            "date": "2021-05-06 11:12:35+00:00",
            "diff": "assaultcube_ac/issue_259/commit_edddcd930400f4529367cc397d63eac542f42350.diff",
            "diff_additions": 1,
            "diff_deletions": 1,
            "diff_file_size": 58512,
            "diff_url": "https://github.com/assaultcube/AC/commit/edddcd930400f4529367cc397d63eac542f42350.diff",
            "exists": true,
            "files": [
                {
                    "file_additions": 1,
                    "file_deletions": 1,
                    "file_exists": true,
                    "file_name": "source/src/clientgame.cpp",
                    "file_size": 58512
                }
            ],
            "interesting": {
                "reopen": true,
                "status": false
            },
            "is_parent": false,
            "sha": "edddcd930400f4529367cc397d63eac542f42350"
        },
        {
            "associated_pull_request": [],
            "date": "2021-08-13 11:21:04+00:00",
            "diff": "assaultcube_ac/issue_259/commit_a61a6001f1ff872dd6d2ae7f0fe60e216f6c8961.diff",
            "diff_additions": 24,
            "diff_deletions": 8,
            "diff_file_size": 108728,
            "diff_url": "https://github.com/assaultcube/AC/commit/a61a6001f1ff872dd6d2ae7f0fe60e216f6c8961.diff",
            "exists": true,
            "files": [
                {
                    "file_additions": 3,
                    "file_deletions": 4,
                    "file_exists": true,
                    "file_name": "source/src/clientgame.cpp",
                    "file_size": 58512
                },
                {
                    "file_additions": 21,
                    "file_deletions": 4,
                    "file_exists": true,
                    "file_name": "source/src/renderhud.cpp",
                    "file_size": 50216
                }
            ],
            "interesting": {
                "reopen": false,
                "status": false
            },
            "is_parent": false,
            "sha": "a61a6001f1ff872dd6d2ae7f0fe60e216f6c8961"
        }
    ],
    "first_commit": "2021-05-05 08:10:38+00:00",
    "last_commit": "2021-08-13 11:21:04+00:00",
    "number": 259,
    "pull_request": "None",
    "score": {
        "accidental_reopen_likely": false,
        "all_labels": [
            "Change Request"
        ],
        "contains_keywords": [
            "work",
            "chang",
            "issu",
            "test",
            "problem"
        ],
        "fix_size": 32,
        "has_labels": [],
        "intersecting": {
            "computed_score": 0.03225806451612903,
            "final_commit_size": 31,
            "intersection_size": 1,
            "previous_commits_size": 2
        },
        "is_makefile_based": false,
        "no_new_files": [
            "source/src/renderhud.cpp"
        ],
        "no_other_files": false,
        "num_prohibited_files": 182454,
        "prohibited_files": [
            "server/src/main/java/com/genymobile/scrcpy/Device.java",
            "server/src/main/java/com/genymobile/scrcpy/wrappers/SurfaceControl.java",
            "server/src/main/java/com/genymobile/scrcpy/Device.java",
            "server/src/main/java/com/genymobile/scrcpy/wrappers/SurfaceControl.java",
            "app/meson.build",
            "app/scrcpy.1",
            "app/src/common.h",
            "app/src/scrcpy.h",
            "app/src/server.h",
            "server/src/main/java/com/genymobile/scrcpy/Workarounds.java"
        ],
        "reopen": true,
        "reopen_events": [
            [
                "2021-05-06 11:12:42+00:00",
                "commit"
            ],
            [
                "2021-05-06 11:14:59+00:00",
                "closed"
            ],
            [
                "2021-07-24 04:49:35+00:00",
                "reopened"
            ],
            [
                "2021-08-13 11:26:34+00:00",
                "closed"
            ],
            [
                "2021-08-13 11:27:25+00:00",
                "commit"
            ]
        ],
        "status": false,
        "strategy": true,
        "total_changes": 55
    }
}