{
    "covered_issues": [
        413,
        412,
        409,
        403,
        394,
        390,
        371,
        369,
        367,
        363,
        357,
        356,
        355,
        354,
        342,
        337,
        335,
        332,
        328,
        327,
        318,
        308,
        306,
        305,
        303,
        302,
        301,
        292,
        286,
        284,
        283,
        278,
        277,
        275,
        272,
        264,
        263,
        261,
        258,
        257,
        255,
        253,
        252,
        249,
        248,
        246,
        238,
        235,
        220,
        217,
        213,
        211,
        210,
        203,
        202,
        201,
        200,
        195,
        178,
        175,
        174,
        172,
        169,
        164,
        163,
        162,
        149,
        144,
        136,
        134,
        133,
        132,
        131,
        128,
        127,
        126,
        122,
        120,
        114,
        112,
        109,
        108,
        104,
        103,
        102,
        99,
        96,
        94,
        90,
        88,
        87,
        83,
        77,
        76,
        72,
        68,
        65,
        58,
        55,
        53,
        50,
        47,
        46,
        44,
        36,
        34,
        33,
        28,
        25,
        24,
        23,
        22,
        21,
        20,
        17,
        15,
        13,
        11,
        6,
        5,
        4,
        3
    ],
    "finished": true
}