{
    "covered_issues": [
        559,
        557,
        556,
        555,
        538,
        530,
        516,
        499,
        493,
        483,
        463,
        462,
        461,
        460,
        459,
        458,
        457,
        448,
        447,
        446,
        444,
        443,
        442,
        440,
        439,
        437,
        434,
        432,
        423,
        422,
        417,
        416,
        412,
        405,
        404,
        403,
        402,
        394,
        393,
        392,
        391,
        390,
        386,
        385,
        384,
        382,
        381,
        380,
        379,
        378,
        377,
        376,
        375,
        374,
        372,
        371,
        369,
        368,
        367,
        366,
        365,
        364,
        363,
        362,
        360,
        357,
        356,
        355,
        354,
        353,
        352,
        351,
        350,
        349,
        348,
        347,
        346,
        345,
        344,
        343,
        341,
        340,
        337,
        336,
        335,
        333,
        332,
        331,
        329,
        328,
        327,
        326,
        322,
        321,
        319,
        316,
        315,
        313,
        311,
        310,
        308,
        307,
        306,
        304,
        302,
        300,
        299,
        293,
        292,
        291,
        289,
        288,
        287,
        286,
        284,
        283,
        281,
        278,
        277,
        276,
        275,
        274,
        272,
        271,
        266,
        265,
        258,
        255,
        246,
        244,
        241,
        240,
        239,
        238,
        237,
        234,
        231,
        230,
        229,
        226,
        225,
        224,
        223,
        222,
        221,
        219,
        218,
        217,
        216,
        214,
        212,
        211,
        210,
        209,
        208,
        206,
        204,
        202,
        201,
        200,
        199,
        198,
        197,
        196,
        194,
        192,
        191,
        186,
        183,
        178,
        176,
        173,
        172,
        171,
        169,
        168,
        166,
        165,
        163,
        162,
        160,
        156,
        155,
        154,
        153,
        152,
        151,
        149,
        147,
        146,
        145,
        144,
        142,
        141,
        140,
        138,
        137,
        136,
        134,
        133,
        132,
        131,
        125,
        123,
        122,
        120,
        117,
        115,
        113,
        112,
        109,
        108,
        107,
        106,
        105,
        101,
        98,
        97,
        96,
        95,
        94,
        93,
        92,
        90,
        88,
        87,
        86,
        83,
        81,
        80,
        78,
        76,
        74,
        73,
        72,
        71,
        70,
        67,
        66,
        65,
        64,
        62,
        61,
        60,
        59,
        58,
        57,
        55,
        54,
        49,
        45,
        42,
        41,
        38,
        37,
        35,
        34,
        33,
        31,
        30,
        26,
        25,
        24,
        23,
        22,
        21,
        18,
        17,
        16,
        15,
        14,
        13,
        12,
        11,
        10,
        9,
        8
    ],
    "finished": true
}