{
    "commits": [
        {
            "associated_pull_request": [],
            "date": "2018-11-12 14:23:17+00:00",
            "diff": "curl_curl/issue_3261/commit_42fd235040095e77f7bef26ec7506ad0b3cd8039.diff",
            "diff_additions": 1,
            "diff_deletions": 1,
            "diff_file_size": 0,
            "diff_url": "https://github.com/curl/curl/commit/42fd235040095e77f7bef26ec7506ad0b3cd8039.diff",
            "exists": true,
            "files": [
                {
                    "file_additions": 1,
                    "file_deletions": 1,
                    "file_exists": false,
                    "file_name": "lib/vtls/nss.c",
                    "file_size": 0
                }
            ],
            "interesting": {
                "reopen": false,
                "status": false
            },
            "is_parent": true,
            "sha": "42fd235040095e77f7bef26ec7506ad0b3cd8039"
        },
        {
            "associated_pull_request": [
                "https://github.com/curl/curl/pull/3262"
            ],
            "date": "2018-11-12 15:22:23+00:00",
            "diff": "curl_curl/issue_3261/commit_0c448093dd1cbf7f1b9242ddf4fc166b42088a74.diff",
            "diff_additions": 5,
            "diff_deletions": 1,
            "diff_file_size": 0,
            "diff_url": "https://github.com/curl/curl/commit/0c448093dd1cbf7f1b9242ddf4fc166b42088a74.diff",
            "exists": true,
            "files": [
                {
                    "file_additions": 5,
                    "file_deletions": 1,
                    "file_exists": false,
                    "file_name": "lib/vtls/nss.c",
                    "file_size": 0
                }
            ],
            "interesting": {
                "reopen": true,
                "status": false
            },
            "is_parent": false,
            "sha": "0c448093dd1cbf7f1b9242ddf4fc166b42088a74"
        },
        {
            "associated_pull_request": [],
            "date": "2018-12-02 22:33:38+00:00",
            "diff": "curl_curl/issue_3261/commit_61ce4822eda60fbc1c03081006a92f9da18c413d.diff",
            "diff_additions": 13,
            "diff_deletions": 1,
            "diff_file_size": 0,
            "diff_url": "https://github.com/curl/curl/commit/61ce4822eda60fbc1c03081006a92f9da18c413d.diff",
            "exists": true,
            "files": [
                {
                    "file_additions": 13,
                    "file_deletions": 1,
                    "file_exists": false,
                    "file_name": "lib/vtls/nss.c",
                    "file_size": 0
                }
            ],
            "interesting": {
                "reopen": false,
                "status": false
            },
            "is_parent": false,
            "sha": "61ce4822eda60fbc1c03081006a92f9da18c413d"
        },
        {
            "associated_pull_request": [],
            "date": "2018-12-03 11:42:48+00:00",
            "diff": "curl_curl/issue_3261/commit_109abb8108f80b0a1b7b758afec3c0ab7fc56165.diff",
            "diff_additions": 10,
            "diff_deletions": 0,
            "diff_file_size": 0,
            "diff_url": "https://github.com/curl/curl/commit/109abb8108f80b0a1b7b758afec3c0ab7fc56165.diff",
            "exists": true,
            "files": [
                {
                    "file_additions": 10,
                    "file_deletions": 0,
                    "file_exists": false,
                    "file_name": "lib/vtls/nss.c",
                    "file_size": 0
                }
            ],
            "interesting": {
                "reopen": false,
                "status": false
            },
            "is_parent": false,
            "sha": "109abb8108f80b0a1b7b758afec3c0ab7fc56165"
        },
        {
            "associated_pull_request": [],
            "date": "2018-12-03 11:42:48+00:00",
            "diff": "curl_curl/issue_3261/commit_0751db515a4272e6bd965da45aaa2d27f55f6537.diff",
            "diff_additions": 9,
            "diff_deletions": 0,
            "diff_file_size": 0,
            "diff_url": "https://github.com/curl/curl/commit/0751db515a4272e6bd965da45aaa2d27f55f6537.diff",
            "exists": true,
            "files": [
                {
                    "file_additions": 9,
                    "file_deletions": 0,
                    "file_exists": false,
                    "file_name": "lib/vtls/nss.c",
                    "file_size": 0
                }
            ],
            "interesting": {
                "reopen": false,
                "status": false
            },
            "is_parent": false,
            "sha": "0751db515a4272e6bd965da45aaa2d27f55f6537"
        },
        {
            "associated_pull_request": [],
            "date": "2018-12-03 11:42:48+00:00",
            "diff": "curl_curl/issue_3261/commit_6848ea585b34d7f1d3f73c1d6749321fc5843fbe.diff",
            "diff_additions": 9,
            "diff_deletions": 0,
            "diff_file_size": 0,
            "diff_url": "https://github.com/curl/curl/commit/6848ea585b34d7f1d3f73c1d6749321fc5843fbe.diff",
            "exists": true,
            "files": [
                {
                    "file_additions": 9,
                    "file_deletions": 0,
                    "file_exists": false,
                    "file_name": "lib/vtls/nss.c",
                    "file_size": 0
                }
            ],
            "interesting": {
                "reopen": false,
                "status": false
            },
            "is_parent": false,
            "sha": "6848ea585b34d7f1d3f73c1d6749321fc5843fbe"
        }
    ],
    "first_commit": "2018-11-12 14:23:17+00:00",
    "last_commit": "2018-12-05 14:24:32+00:00",
    "number": 3261,
    "pull_request": "None",
    "score": {
        "accidental_reopen_likely": false,
        "all_labels": [
            "regression",
            "TLS"
        ],
        "contains_keywords": [
            "work",
            "fail",
            "chang",
            "fix",
            "issu",
            "patch",
            "debug",
            "reason",
            "test",
            "attempt",
            "fault",
            "warn",
            "bug",
            "error"
        ],
        "fix_size": 20,
        "has_labels": [],
        "intersecting": {
            "computed_score": 1.0,
            "final_commit_size": 10,
            "intersection_size": 10,
            "previous_commits_size": 20
        },
        "is_makefile_based": true,
        "no_new_files": [],
        "no_other_files": true,
        "num_prohibited_files": 24346,
        "prohibited_files": [
            "server/src/main/java/com/genymobile/scrcpy/Device.java",
            "server/src/main/java/com/genymobile/scrcpy/wrappers/SurfaceControl.java",
            "server/src/main/java/com/genymobile/scrcpy/Device.java",
            "server/src/main/java/com/genymobile/scrcpy/wrappers/SurfaceControl.java",
            "app/meson.build",
            "app/scrcpy.1",
            "app/src/common.h",
            "app/src/scrcpy.h",
            "app/src/server.h",
            "server/src/main/java/com/genymobile/scrcpy/Workarounds.java"
        ],
        "reopen": true,
        "reopen_events": [
            [
                "2018-11-12 15:22:58+00:00",
                "commit"
            ],
            [
                "2018-11-13 22:55:53+00:00",
                "commit"
            ],
            [
                "2018-11-14 09:36:19+00:00",
                "closed"
            ],
            [
                "2018-12-02 22:34:53+00:00",
                "reopened"
            ],
            [
                "2018-12-02 22:34:56+00:00",
                "commit"
            ],
            [
                "2018-12-03 11:49:37+00:00",
                "commit"
            ],
            [
                "2018-12-04 06:51:09+00:00",
                "commit"
            ],
            [
                "2018-12-05 14:25:21+00:00",
                "closed"
            ],
            [
                "2018-12-05 14:25:21+00:00",
                "commit"
            ]
        ],
        "status": false,
        "strategy": true,
        "total_changes": 50
    }
}