{
    "covered_issues": [
        103,
        102,
        99,
        98,
        97,
        95,
        86,
        85,
        82,
        66,
        65,
        62,
        61,
        56,
        54,
        53,
        49,
        44,
        43,
        42,
        40,
        34,
        32,
        31,
        29,
        28,
        26,
        14,
        13,
        10,
        8,
        7,
        6,
        4,
        3,
        2,
        1
    ],
    "finished": true
}