{
    "commits": [
        {
            "associated_pull_request": [],
            "date": "2014-01-07 14:58:53+00:00",
            "diff": "",
            "diff_additions": 0,
            "diff_deletions": 0,
            "diff_file_size": 0,
            "diff_url": "https://github.com/confluentinc/librdkafka/commit/7966ac1e05b8034e2b791a7c3ec3133012bbc2d9.diff",
            "exists": true,
            "files": [],
            "interesting": {
                "reopen": false,
                "status": false
            },
            "is_parent": true,
            "sha": "7966ac1e05b8034e2b791a7c3ec3133012bbc2d9"
        },
        {
            "associated_pull_request": [],
            "date": "2014-01-17 02:08:12+00:00",
            "diff": "confluentinc_librdkafka/issue_49/commit_c644561abd73ac4d8da7a2a819f14f985d490ff8.diff",
            "diff_additions": 14,
            "diff_deletions": 1,
            "diff_file_size": 0,
            "diff_url": "https://github.com/confluentinc/librdkafka/commit/c644561abd73ac4d8da7a2a819f14f985d490ff8.diff",
            "exists": true,
            "files": [
                {
                    "file_additions": 14,
                    "file_deletions": 1,
                    "file_exists": false,
                    "file_name": "rdkafka_broker.c",
                    "file_size": 0
                }
            ],
            "interesting": {
                "reopen": true,
                "status": false
            },
            "is_parent": false,
            "sha": "c644561abd73ac4d8da7a2a819f14f985d490ff8"
        },
        {
            "associated_pull_request": [],
            "date": "2014-06-14 21:43:20+00:00",
            "diff": "confluentinc_librdkafka/issue_49/commit_84a12a197419132d3636fb532f7471ca45888fda.diff",
            "diff_additions": 13,
            "diff_deletions": 1,
            "diff_file_size": 6922,
            "diff_url": "https://github.com/confluentinc/librdkafka/commit/84a12a197419132d3636fb532f7471ca45888fda.diff",
            "exists": true,
            "files": [
                {
                    "file_additions": 13,
                    "file_deletions": 1,
                    "file_exists": true,
                    "file_name": "mklove/modules/configure.cc",
                    "file_size": 6922
                }
            ],
            "interesting": {
                "reopen": false,
                "status": false
            },
            "is_parent": false,
            "sha": "84a12a197419132d3636fb532f7471ca45888fda"
        }
    ],
    "first_commit": "2014-01-07 15:01:48+00:00",
    "last_commit": "2014-06-14 21:43:20+00:00",
    "number": 49,
    "pull_request": "None",
    "score": {
        "accidental_reopen_likely": false,
        "all_labels": [
            "portability"
        ],
        "contains_keywords": [
            "confirm",
            "work",
            "fail",
            "chang",
            "fix",
            "issu",
            "perform",
            "debug",
            "reason",
            "test",
            "fault",
            "remov",
            "warn",
            "bug",
            "error",
            "problem",
            "report"
        ],
        "fix_size": 29,
        "has_labels": [],
        "intersecting": {
            "computed_score": 0.0,
            "final_commit_size": 14,
            "intersection_size": 0,
            "previous_commits_size": 15
        },
        "is_makefile_based": true,
        "no_new_files": [
            "mklove/modules/configure.cc"
        ],
        "no_other_files": false,
        "num_prohibited_files": 38617,
        "prohibited_files": [
            "server/src/main/java/com/genymobile/scrcpy/Device.java",
            "server/src/main/java/com/genymobile/scrcpy/wrappers/SurfaceControl.java",
            "server/src/main/java/com/genymobile/scrcpy/Device.java",
            "server/src/main/java/com/genymobile/scrcpy/wrappers/SurfaceControl.java",
            "app/meson.build",
            "app/scrcpy.1",
            "app/src/common.h",
            "app/src/scrcpy.h",
            "app/src/server.h",
            "server/src/main/java/com/genymobile/scrcpy/Workarounds.java"
        ],
        "reopen": true,
        "reopen_events": [
            [
                "2014-01-07 15:08:47+00:00",
                "commit"
            ],
            [
                "2014-01-17 02:08:29+00:00",
                "commit"
            ],
            [
                "2014-01-17 03:33:28+00:00",
                "closed"
            ],
            [
                "2014-06-01 08:40:05+00:00",
                "reopened"
            ],
            [
                "2014-06-14 21:44:44+00:00",
                "commit"
            ],
            [
                "2014-06-14 21:45:43+00:00",
                "closed"
            ],
            [
                "2017-05-16 21:41:09+00:00",
                "commit"
            ],
            [
                "2017-05-16 21:41:42+00:00",
                "commit"
            ]
        ],
        "status": false,
        "strategy": true,
        "total_changes": 29
    }
}