{
    "category": [
        "network/protocols",
        "network/protocol",
        "feature request"
    ],
    "commits": [
        {
            "associated_pull_request": [],
            "date": "2016-11-18 21:45:06",
            "diff": "",
            "diff_additions": 0,
            "diff_deletions": 0,
            "diff_file_size": 0,
            "diff_url": "https://github.com/esnet/iperf/commit/c4a56a3c49cf6fe5a6621eb0c148613ab5dcbed1.diff",
            "exists": true,
            "files": [],
            "interesting": {
                "reopen": false,
                "status": false
            },
            "is_parent": true,
            "sha": "c4a56a3c49cf6fe5a6621eb0c148613ab5dcbed1"
        },
        {
            "associated_pull_request": [],
            "date": "2016-11-23 19:05:47",
            "diff": "esnet_iperf/issue_356/commit_d2202ee3be6007324eb98f60d6fcd3eb8b51c838.diff",
            "diff_additions": 98,
            "diff_deletions": 9,
            "diff_file_size": 50723,
            "diff_url": "https://github.com/esnet/iperf/commit/d2202ee3be6007324eb98f60d6fcd3eb8b51c838.diff",
            "exists": true,
            "files": [
                {
                    "file_additions": 4,
                    "file_deletions": 0,
                    "file_exists": true,
                    "file_name": "src/iperf_error.c",
                    "file_size": 15740
                },
                {
                    "file_additions": 35,
                    "file_deletions": 9,
                    "file_exists": true,
                    "file_name": "src/iperf_tcp.c",
                    "file_size": 18474
                },
                {
                    "file_additions": 59,
                    "file_deletions": 0,
                    "file_exists": true,
                    "file_name": "src/iperf_udp.c",
                    "file_size": 16509
                }
            ],
            "interesting": {
                "reopen": true,
                "status": false
            },
            "is_parent": false,
            "sha": "d2202ee3be6007324eb98f60d6fcd3eb8b51c838"
        },
        {
            "associated_pull_request": [],
            "date": "2016-12-01 19:53:37",
            "diff": "esnet_iperf/issue_356/commit_55598a072f681fbaeaa25a7cc884640bac8a3813.diff",
            "diff_additions": 24,
            "diff_deletions": 24,
            "diff_file_size": 34983,
            "diff_url": "https://github.com/esnet/iperf/commit/55598a072f681fbaeaa25a7cc884640bac8a3813.diff",
            "exists": true,
            "files": [
                {
                    "file_additions": 8,
                    "file_deletions": 8,
                    "file_exists": true,
                    "file_name": "src/iperf_tcp.c",
                    "file_size": 18474
                },
                {
                    "file_additions": 16,
                    "file_deletions": 16,
                    "file_exists": true,
                    "file_name": "src/iperf_udp.c",
                    "file_size": 16509
                }
            ],
            "interesting": {
                "reopen": false,
                "status": false
            },
            "is_parent": false,
            "sha": "55598a072f681fbaeaa25a7cc884640bac8a3813"
        },
        {
            "associated_pull_request": [],
            "date": "2016-11-23 19:05:47",
            "diff": "esnet_iperf/issue_356/commit_66f89829e43a708aafc0bf0ec8ad931daca23b9c.diff",
            "diff_additions": 98,
            "diff_deletions": 9,
            "diff_file_size": 50723,
            "diff_url": "https://github.com/esnet/iperf/commit/66f89829e43a708aafc0bf0ec8ad931daca23b9c.diff",
            "exists": true,
            "files": [
                {
                    "file_additions": 4,
                    "file_deletions": 0,
                    "file_exists": true,
                    "file_name": "src/iperf_error.c",
                    "file_size": 15740
                },
                {
                    "file_additions": 35,
                    "file_deletions": 9,
                    "file_exists": true,
                    "file_name": "src/iperf_tcp.c",
                    "file_size": 18474
                },
                {
                    "file_additions": 59,
                    "file_deletions": 0,
                    "file_exists": true,
                    "file_name": "src/iperf_udp.c",
                    "file_size": 16509
                }
            ],
            "interesting": {
                "reopen": false,
                "status": false
            },
            "is_parent": false,
            "sha": "66f89829e43a708aafc0bf0ec8ad931daca23b9c"
        },
        {
            "associated_pull_request": [],
            "date": "2016-12-01 19:53:37",
            "diff": "esnet_iperf/issue_356/commit_d873190e73e410c6b7686c7ca55bfeb00e0687ba.diff",
            "diff_additions": 24,
            "diff_deletions": 24,
            "diff_file_size": 34983,
            "diff_url": "https://github.com/esnet/iperf/commit/d873190e73e410c6b7686c7ca55bfeb00e0687ba.diff",
            "exists": true,
            "files": [
                {
                    "file_additions": 8,
                    "file_deletions": 8,
                    "file_exists": true,
                    "file_name": "src/iperf_tcp.c",
                    "file_size": 18474
                },
                {
                    "file_additions": 16,
                    "file_deletions": 16,
                    "file_exists": true,
                    "file_name": "src/iperf_udp.c",
                    "file_size": 16509
                }
            ],
            "interesting": {
                "reopen": false,
                "status": false
            },
            "is_parent": false,
            "sha": "d873190e73e410c6b7686c7ca55bfeb00e0687ba"
        }
    ],
    "first_commit": "2016-11-18 21:45:06",
    "last_commit": "2017-01-07 06:28:36",
    "number": 356,
    "pull_request": "None",
    "score": {
        "accidental_reopen_likely": false,
        "all_labels": [
            "enhancement"
        ],
        "contains_keywords": [
            "bug",
            "problem",
            "test",
            "debug"
        ],
        "fix_size": 122,
        "has_labels": [],
        "intersecting": {
            "computed_score": 1.0,
            "final_commit_size": 44,
            "intersection_size": 44,
            "previous_commits_size": 122
        },
        "is_makefile_based": true,
        "no_new_files": [],
        "no_other_files": false,
        "num_prohibited_files": 68806,
        "prohibited_files": [
            "hal/inc/pinmap_hal.h",
            "Debug/marvin.bin",
            "Debug/marvin.elf",
            "Debug/marvin.hex",
            "Debug/marvin.bin",
            "Debug/marvin.elf",
            "Debug/marvin.hex",
            "inc/spark_utilities.h",
            "Debug/marvin.bin",
            "Debug/marvin.elf"
        ],
        "reopen": true,
        "reopen_events": [
            [
                "2016-11-23 19:08:09",
                "closed"
            ],
            [
                "2016-11-23 19:08:09",
                "commit"
            ],
            [
                "2016-11-23 19:42:55",
                "reopened"
            ],
            [
                "2016-12-01 19:54:18",
                "commit"
            ],
            [
                "2017-01-10 18:35:28",
                "commit"
            ],
            [
                "2017-01-10 18:35:28",
                "commit"
            ],
            [
                "2017-01-10 18:36:07",
                "closed"
            ]
        ],
        "status": false,
        "strategy": true,
        "total_changes": 310
    }
}