{
    "covered_issues": [
        1428,
        1424,
        1419,
        1413,
        1412,
        1407,
        1406,
        1377,
        1375,
        1374,
        1372,
        1361,
        1353,
        1348,
        1347,
        1343,
        1342,
        1339,
        1338,
        1337,
        1336,
        1334,
        1328,
        1320,
        1312,
        1305,
        1303,
        1302,
        1296,
        1295,
        1281,
        1278,
        1273,
        1253,
        1249,
        1247,
        1246,
        1241,
        1237,
        1227,
        1216,
        1211,
        1200,
        1199,
        1197,
        1194,
        1192,
        1182,
        1159,
        1155,
        1154,
        1153,
        1146,
        1137,
        1121,
        1103,
        1059,
        1056,
        1027,
        1016,
        1014,
        1013,
        1006,
        1005,
        995,
        992,
        987,
        986,
        960,
        954,
        953,
        936,
        899,
        896,
        893,
        890,
        889,
        872,
        871,
        870,
        864,
        858,
        803,
        802,
        793,
        787,
        785,
        781,
        771,
        763,
        749,
        745,
        727,
        722,
        718,
        699,
        698,
        696,
        691,
        688,
        674,
        670,
        653,
        645,
        633,
        631,
        630,
        624,
        620,
        618,
        615,
        613,
        609,
        607,
        606,
        602,
        599,
        598,
        596,
        591,
        588,
        583,
        580,
        577,
        574,
        571,
        570,
        569,
        567,
        563,
        559,
        558,
        545,
        544,
        534,
        531,
        528,
        515,
        512,
        509,
        501,
        498,
        492,
        479,
        475,
        474,
        468,
        467,
        463,
        457,
        448,
        446,
        443,
        441,
        439,
        435,
        434,
        428,
        415,
        414,
        413,
        409,
        408,
        406,
        405,
        390,
        389,
        375,
        374,
        370,
        367,
        366,
        364,
        363,
        361,
        357,
        356,
        351,
        348,
        347,
        346,
        345,
        338,
        330,
        327,
        321,
        320,
        316,
        315,
        312,
        308,
        307,
        306,
        301,
        290,
        286,
        285,
        283,
        280,
        278,
        277,
        275,
        273,
        271,
        267,
        263,
        256,
        255,
        254,
        253,
        244,
        243,
        241,
        240,
        239,
        237,
        236,
        229,
        226,
        225,
        222,
        221,
        215,
        213,
        207,
        206,
        205,
        204,
        196,
        190,
        179,
        178,
        177,
        176,
        175,
        161,
        158,
        153,
        152,
        147,
        145,
        141,
        139,
        138,
        136,
        131,
        129,
        124,
        122,
        120,
        116,
        114,
        113,
        109,
        101,
        96,
        92,
        90,
        87,
        80,
        79,
        78,
        74,
        72,
        65,
        61,
        59,
        56,
        55,
        42,
        41
    ],
    "finished": true
}