{
    "all_issues": 398,
    "interesting_issues": 1,
    "last_update": "2023-11-06 09:02:19.089019",
    "license": {
        "download": "https://raw.githubusercontent.com/kiibohd/controller/master/LICENSE",
        "name": "GNU General Public License v3.0"
    },
    "ratio": 0.002512562814070352,
    "size": 39368,
    "stars": 804,
    "url": "https://github.com/kiibohd/controller"
}