{
    "commits": [
        {
            "associated_pull_request": [],
            "date": "2020-04-25 20:22:10+00:00",
            "diff": "bradharding_doomretro/issue_582/commit_0316dcdd4de3dd2999be0b16d2b0ff367d563f0a.diff",
            "diff_additions": 8,
            "diff_deletions": 8,
            "diff_file_size": 112433,
            "diff_url": "https://github.com/bradharding/doomretro/commit/0316dcdd4de3dd2999be0b16d2b0ff367d563f0a.diff",
            "exists": true,
            "files": [
                {
                    "file_additions": 8,
                    "file_deletions": 8,
                    "file_exists": true,
                    "file_name": "src/p_spec.c",
                    "file_size": 112433
                }
            ],
            "interesting": {
                "reopen": false,
                "status": false
            },
            "is_parent": true,
            "sha": "0316dcdd4de3dd2999be0b16d2b0ff367d563f0a"
        },
        {
            "associated_pull_request": [],
            "date": "2020-04-26 01:14:21+00:00",
            "diff": "bradharding_doomretro/issue_582/commit_37b24dda62e59b43a7c5310aceeceeade98c69fd.diff",
            "diff_additions": 3,
            "diff_deletions": 1,
            "diff_file_size": 55392,
            "diff_url": "https://github.com/bradharding/doomretro/commit/37b24dda62e59b43a7c5310aceeceeade98c69fd.diff",
            "exists": true,
            "files": [
                {
                    "file_additions": 3,
                    "file_deletions": 1,
                    "file_exists": true,
                    "file_name": "src/p_mobj.c",
                    "file_size": 55392
                }
            ],
            "interesting": {
                "reopen": true,
                "status": false
            },
            "is_parent": false,
            "sha": "37b24dda62e59b43a7c5310aceeceeade98c69fd"
        },
        {
            "associated_pull_request": [],
            "date": "2020-05-16 08:29:50+00:00",
            "diff": "bradharding_doomretro/issue_582/commit_ffda2857de8cb3c24c6425538b0383959c545e56.diff",
            "diff_additions": 5,
            "diff_deletions": 0,
            "diff_file_size": 55392,
            "diff_url": "https://github.com/bradharding/doomretro/commit/ffda2857de8cb3c24c6425538b0383959c545e56.diff",
            "exists": true,
            "files": [
                {
                    "file_additions": 5,
                    "file_deletions": 0,
                    "file_exists": true,
                    "file_name": "src/p_mobj.c",
                    "file_size": 55392
                }
            ],
            "interesting": {
                "reopen": false,
                "status": false
            },
            "is_parent": false,
            "sha": "ffda2857de8cb3c24c6425538b0383959c545e56"
        }
    ],
    "first_commit": "2020-04-25 20:22:10+00:00",
    "last_commit": "2020-05-16 08:29:50+00:00",
    "number": 582,
    "pull_request": "None",
    "score": {
        "accidental_reopen_likely": false,
        "all_labels": [],
        "contains_keywords": [
            "fix",
            "issu"
        ],
        "fix_size": 7,
        "has_labels": [],
        "intersecting": {
            "computed_score": 0.6666666666666666,
            "final_commit_size": 6,
            "intersection_size": 4,
            "previous_commits_size": 5
        },
        "is_makefile_based": true,
        "no_new_files": [],
        "no_other_files": true,
        "num_prohibited_files": 193395,
        "prohibited_files": [
            "server/src/main/java/com/genymobile/scrcpy/Device.java",
            "server/src/main/java/com/genymobile/scrcpy/wrappers/SurfaceControl.java",
            "server/src/main/java/com/genymobile/scrcpy/Device.java",
            "server/src/main/java/com/genymobile/scrcpy/wrappers/SurfaceControl.java",
            "app/meson.build",
            "app/scrcpy.1",
            "app/src/common.h",
            "app/src/scrcpy.h",
            "app/src/server.h",
            "server/src/main/java/com/genymobile/scrcpy/Workarounds.java"
        ],
        "reopen": true,
        "reopen_events": [
            [
                "2020-04-26 01:14:29+00:00",
                "commit"
            ],
            [
                "2020-04-26 01:16:03+00:00",
                "closed"
            ],
            [
                "2020-05-16 06:33:39+00:00",
                "reopened"
            ],
            [
                "2020-05-16 08:29:59+00:00",
                "closed"
            ],
            [
                "2020-05-16 08:29:59+00:00",
                "commit"
            ]
        ],
        "status": false,
        "strategy": true,
        "total_changes": 25
    }
}