{
    "all_issues": 3072,
    "interesting_issues": 7,
    "last_update": "2023-11-03 19:06:15.828440",
    "license": {
        "download": "https://raw.githubusercontent.com/ostreedev/ostree/main/COPYING",
        "name": "Other"
    },
    "ratio": 0.0022786458333333335,
    "size": 22808,
    "stars": 1054,
    "url": "https://github.com/ostreedev/ostree"
}