{
    "covered_issues": [
        79,
        77,
        76,
        75,
        74,
        73,
        72,
        69,
        68,
        64,
        62,
        60,
        59,
        56,
        54,
        51,
        50,
        48,
        47,
        46,
        45,
        43,
        42,
        41,
        40,
        39,
        38,
        36,
        32,
        31,
        30,
        29,
        28,
        25,
        23,
        22,
        20,
        19,
        6,
        4,
        3,
        2,
        1
    ],
    "finished": true
}