{
    "category": [
        "memory",
        "build/refactor/preprocessing"
    ],
    "commits": [
        {
            "associated_pull_request": [
                "https://github.com/ponylang/ponyc/pull/889"
            ],
            "date": "2016-05-28 17:48:12",
            "diff": "",
            "diff_additions": 0,
            "diff_deletions": 0,
            "diff_file_size": 0,
            "diff_url": "https://github.com/ponylang/ponyc/commit/97eb761c78b6c03f3a21ffb75230bf7e17a1a748.diff",
            "exists": true,
            "files": [],
            "interesting": {
                "reopen": false,
                "status": false
            },
            "is_parent": true,
            "sha": "97eb761c78b6c03f3a21ffb75230bf7e17a1a748"
        },
        {
            "associated_pull_request": [],
            "date": "2016-05-29 19:37:21",
            "diff": "ponylang_ponyc/issue_891/commit_ca2e3670b31b07fd416d445d063172031abce1bd.diff",
            "diff_additions": 2,
            "diff_deletions": 2,
            "diff_file_size": 7197,
            "diff_url": "https://github.com/ponylang/ponyc/commit/ca2e3670b31b07fd416d445d063172031abce1bd.diff",
            "exists": true,
            "files": [
                {
                    "file_additions": 2,
                    "file_deletions": 2,
                    "file_exists": true,
                    "file_name": "src/libponyc/codegen/genheader.c",
                    "file_size": 7197
                }
            ],
            "interesting": {
                "reopen": false,
                "status": true
            },
            "is_parent": false,
            "sha": "ca2e3670b31b07fd416d445d063172031abce1bd"
        },
        {
            "associated_pull_request": [],
            "date": "2016-05-29 19:37:21",
            "diff": "ponylang_ponyc/issue_891/commit_c583ceccf5af636f7d9bda3a5167f8e6adefa789.diff",
            "diff_additions": 7,
            "diff_deletions": 3,
            "diff_file_size": 7197,
            "diff_url": "https://github.com/ponylang/ponyc/commit/c583ceccf5af636f7d9bda3a5167f8e6adefa789.diff",
            "exists": true,
            "files": [
                {
                    "file_additions": 7,
                    "file_deletions": 3,
                    "file_exists": true,
                    "file_name": "src/libponyc/codegen/genheader.c",
                    "file_size": 7197
                }
            ],
            "interesting": {
                "reopen": false,
                "status": false
            },
            "is_parent": false,
            "sha": "c583ceccf5af636f7d9bda3a5167f8e6adefa789"
        },
        {
            "associated_pull_request": [],
            "date": "2016-05-29 19:37:21",
            "diff": "ponylang_ponyc/issue_891/commit_ba2e1f57aaea38f990e282a47627e4df38dcbf93.diff",
            "diff_additions": 7,
            "diff_deletions": 3,
            "diff_file_size": 7197,
            "diff_url": "https://github.com/ponylang/ponyc/commit/ba2e1f57aaea38f990e282a47627e4df38dcbf93.diff",
            "exists": true,
            "files": [
                {
                    "file_additions": 7,
                    "file_deletions": 3,
                    "file_exists": true,
                    "file_name": "src/libponyc/codegen/genheader.c",
                    "file_size": 7197
                }
            ],
            "interesting": {
                "reopen": false,
                "status": true
            },
            "is_parent": false,
            "sha": "ba2e1f57aaea38f990e282a47627e4df38dcbf93"
        },
        {
            "associated_pull_request": [
                "https://github.com/ponylang/ponyc/pull/892"
            ],
            "date": "2016-05-29 19:37:21",
            "diff": "ponylang_ponyc/issue_891/commit_ab73309fc215f4adce9a76ccd5996e1f6b6a229c.diff",
            "diff_additions": 24,
            "diff_deletions": 3,
            "diff_file_size": 31767,
            "diff_url": "https://github.com/ponylang/ponyc/commit/ab73309fc215f4adce9a76ccd5996e1f6b6a229c.diff",
            "exists": true,
            "files": [
                {
                    "file_additions": 7,
                    "file_deletions": 3,
                    "file_exists": true,
                    "file_name": "src/libponyc/codegen/genheader.c",
                    "file_size": 7197
                },
                {
                    "file_additions": 17,
                    "file_deletions": 0,
                    "file_exists": true,
                    "file_name": "test/libponyc/badpony.cc",
                    "file_size": 24570
                }
            ],
            "interesting": {
                "reopen": false,
                "status": false
            },
            "is_parent": false,
            "sha": "ab73309fc215f4adce9a76ccd5996e1f6b6a229c"
        },
        {
            "associated_pull_request": [
                "https://github.com/ponylang/ponyc/pull/892"
            ],
            "date": "2016-05-31 09:45:16",
            "diff": "ponylang_ponyc/issue_891/commit_3f9dff53a57955f474ccf1a203a1c25f5d820ce1.diff",
            "diff_additions": 24,
            "diff_deletions": 3,
            "diff_file_size": 31767,
            "diff_url": "https://github.com/ponylang/ponyc/commit/3f9dff53a57955f474ccf1a203a1c25f5d820ce1.diff",
            "exists": true,
            "files": [
                {
                    "file_additions": 7,
                    "file_deletions": 3,
                    "file_exists": true,
                    "file_name": "src/libponyc/codegen/genheader.c",
                    "file_size": 7197
                },
                {
                    "file_additions": 17,
                    "file_deletions": 0,
                    "file_exists": true,
                    "file_name": "test/libponyc/badpony.cc",
                    "file_size": 24570
                }
            ],
            "interesting": {
                "reopen": false,
                "status": false
            },
            "is_parent": false,
            "sha": "3f9dff53a57955f474ccf1a203a1c25f5d820ce1"
        }
    ],
    "first_commit": "2016-05-28 17:48:12",
    "last_commit": "2016-05-31 09:45:16",
    "number": 891,
    "pull_request": "None",
    "score": {
        "accidental_reopen_likely": false,
        "all_labels": [],
        "contains_keywords": [
            "test",
            "crash",
            "fail"
        ],
        "fix_size": 27,
        "has_labels": [],
        "intersecting": {
            "computed_score": 1.0,
            "final_commit_size": 27,
            "intersection_size": 27,
            "previous_commits_size": 27
        },
        "is_makefile_based": true,
        "no_new_files": [],
        "no_other_files": true,
        "num_prohibited_files": 86796,
        "prohibited_files": [
            "kill.h",
            "meminfo.h",
            "kill.h",
            "meminfo.h",
            "kill.h",
            "meminfo.h",
            "testsuite_cli_test.go",
            "testsuite_cli_test.go",
            "common.mk",
            "i3bar/include/draw_util.h"
        ],
        "reopen": false,
        "reopen_events": [
            [
                "2016-05-29 19:42:20",
                "commit"
            ],
            [
                "2016-05-29 19:45:23",
                "commit"
            ],
            [
                "2016-05-29 20:28:50",
                "commit"
            ],
            [
                "2016-05-30 04:07:10",
                "commit"
            ],
            [
                "2016-05-30 08:57:12",
                "commit"
            ],
            [
                "2016-05-31 09:45:17",
                "commit"
            ],
            [
                "2016-06-01 10:43:13",
                "closed"
            ]
        ],
        "status": true,
        "strategy": true,
        "total_changes": 78
    }
}