{
    "category": [
        "memory",
        "wrong API usage",
        "feature request"
    ],
    "commits": [
        {
            "associated_pull_request": [],
            "date": "2021-04-19 22:36:34",
            "diff": "erthink_libmdbx/issue_186/commit_b7110eb4d4cdff61b4c7b2f14452489127755da7.diff",
            "diff_additions": 0,
            "diff_deletions": 151,
            "diff_file_size": 853827,
            "diff_url": "https://github.com/erthink/libmdbx/commit/b7110eb4d4cdff61b4c7b2f14452489127755da7.diff",
            "exists": true,
            "files": [
                {
                    "file_additions": 0,
                    "file_deletions": 151,
                    "file_exists": true,
                    "file_name": "src/core.c",
                    "file_size": 853827
                }
            ],
            "interesting": {
                "reopen": false,
                "status": false
            },
            "is_parent": true,
            "sha": "b7110eb4d4cdff61b4c7b2f14452489127755da7"
        },
        {
            "associated_pull_request": [],
            "date": "2021-04-21 09:20:32",
            "diff": "erthink_libmdbx/issue_186/commit_416a80278957ccf90918ef16d906fff6f45cb4d7.diff",
            "diff_additions": 4,
            "diff_deletions": 1,
            "diff_file_size": 853827,
            "diff_url": "https://github.com/erthink/libmdbx/commit/416a80278957ccf90918ef16d906fff6f45cb4d7.diff",
            "exists": true,
            "files": [
                {
                    "file_additions": 4,
                    "file_deletions": 1,
                    "file_exists": true,
                    "file_name": "src/core.c",
                    "file_size": 853827
                }
            ],
            "interesting": {
                "reopen": false,
                "status": false
            },
            "is_parent": false,
            "sha": "416a80278957ccf90918ef16d906fff6f45cb4d7"
        },
        {
            "associated_pull_request": [],
            "date": "2021-04-23 16:03:07",
            "diff": "erthink_libmdbx/issue_186/commit_d1fea74d0eb48e36f96363627a018a468842eb73.diff",
            "diff_additions": 119,
            "diff_deletions": 103,
            "diff_file_size": 853827,
            "diff_url": "https://github.com/erthink/libmdbx/commit/d1fea74d0eb48e36f96363627a018a468842eb73.diff",
            "exists": true,
            "files": [
                {
                    "file_additions": 119,
                    "file_deletions": 103,
                    "file_exists": true,
                    "file_name": "src/core.c",
                    "file_size": 853827
                }
            ],
            "interesting": {
                "reopen": false,
                "status": false
            },
            "is_parent": false,
            "sha": "d1fea74d0eb48e36f96363627a018a468842eb73"
        },
        {
            "associated_pull_request": [],
            "date": "2021-04-25 23:47:25",
            "diff": "erthink_libmdbx/issue_186/commit_66e5078e28216f33ce6f59a52517eb07843a68d4.diff",
            "diff_additions": 62,
            "diff_deletions": 65,
            "diff_file_size": 853827,
            "diff_url": "https://github.com/erthink/libmdbx/commit/66e5078e28216f33ce6f59a52517eb07843a68d4.diff",
            "exists": true,
            "files": [
                {
                    "file_additions": 62,
                    "file_deletions": 65,
                    "file_exists": true,
                    "file_name": "src/core.c",
                    "file_size": 853827
                }
            ],
            "interesting": {
                "reopen": false,
                "status": true
            },
            "is_parent": false,
            "sha": "66e5078e28216f33ce6f59a52517eb07843a68d4"
        },
        {
            "associated_pull_request": [],
            "date": "2021-04-26 11:08:30",
            "diff": "erthink_libmdbx/issue_186/commit_3e272d339a336657d0032369efbaa54b965348b6.diff",
            "diff_additions": 21,
            "diff_deletions": 16,
            "diff_file_size": 853827,
            "diff_url": "https://github.com/erthink/libmdbx/commit/3e272d339a336657d0032369efbaa54b965348b6.diff",
            "exists": true,
            "files": [
                {
                    "file_additions": 21,
                    "file_deletions": 16,
                    "file_exists": true,
                    "file_name": "src/core.c",
                    "file_size": 853827
                }
            ],
            "interesting": {
                "reopen": false,
                "status": false
            },
            "is_parent": false,
            "sha": "3e272d339a336657d0032369efbaa54b965348b6"
        },
        {
            "associated_pull_request": [],
            "date": "2021-04-26 14:51:11",
            "diff": "erthink_libmdbx/issue_186/commit_4fa5e95241ef6bc26e9c57175d0de23d3da3b96d.diff",
            "diff_additions": 409,
            "diff_deletions": 208,
            "diff_file_size": 853827,
            "diff_url": "https://github.com/erthink/libmdbx/commit/4fa5e95241ef6bc26e9c57175d0de23d3da3b96d.diff",
            "exists": true,
            "files": [
                {
                    "file_additions": 409,
                    "file_deletions": 208,
                    "file_exists": true,
                    "file_name": "src/core.c",
                    "file_size": 853827
                }
            ],
            "interesting": {
                "reopen": false,
                "status": false
            },
            "is_parent": false,
            "sha": "4fa5e95241ef6bc26e9c57175d0de23d3da3b96d"
        },
        {
            "associated_pull_request": [],
            "date": "2021-04-27 13:09:34",
            "diff": "erthink_libmdbx/issue_186/commit_7aa1b7b99475c3893a61a63bd4e1d0cb26541ce2.diff",
            "diff_additions": 63,
            "diff_deletions": 4,
            "diff_file_size": 853827,
            "diff_url": "https://github.com/erthink/libmdbx/commit/7aa1b7b99475c3893a61a63bd4e1d0cb26541ce2.diff",
            "exists": true,
            "files": [
                {
                    "file_additions": 63,
                    "file_deletions": 4,
                    "file_exists": true,
                    "file_name": "src/core.c",
                    "file_size": 853827
                }
            ],
            "interesting": {
                "reopen": false,
                "status": true
            },
            "is_parent": false,
            "sha": "7aa1b7b99475c3893a61a63bd4e1d0cb26541ce2"
        },
        {
            "associated_pull_request": [],
            "date": "2021-04-27 15:02:11",
            "diff": "erthink_libmdbx/issue_186/commit_f95a277ac58fca4a3c9e4579f7ce855b9a61b403.diff",
            "diff_additions": 90,
            "diff_deletions": 11,
            "diff_file_size": 853827,
            "diff_url": "https://github.com/erthink/libmdbx/commit/f95a277ac58fca4a3c9e4579f7ce855b9a61b403.diff",
            "exists": true,
            "files": [
                {
                    "file_additions": 90,
                    "file_deletions": 11,
                    "file_exists": true,
                    "file_name": "src/core.c",
                    "file_size": 853827
                }
            ],
            "interesting": {
                "reopen": false,
                "status": false
            },
            "is_parent": false,
            "sha": "f95a277ac58fca4a3c9e4579f7ce855b9a61b403"
        },
        {
            "associated_pull_request": [],
            "date": "2021-04-27 16:23:20",
            "diff": "erthink_libmdbx/issue_186/commit_6134220b8a20e4b887e7bb1f18b9daa6dc1b94ac.diff",
            "diff_additions": 53,
            "diff_deletions": 65,
            "diff_file_size": 853827,
            "diff_url": "https://github.com/erthink/libmdbx/commit/6134220b8a20e4b887e7bb1f18b9daa6dc1b94ac.diff",
            "exists": true,
            "files": [
                {
                    "file_additions": 53,
                    "file_deletions": 65,
                    "file_exists": true,
                    "file_name": "src/core.c",
                    "file_size": 853827
                }
            ],
            "interesting": {
                "reopen": false,
                "status": false
            },
            "is_parent": false,
            "sha": "6134220b8a20e4b887e7bb1f18b9daa6dc1b94ac"
        },
        {
            "associated_pull_request": [],
            "date": "2021-04-27 20:08:52",
            "diff": "erthink_libmdbx/issue_186/commit_89558657ea504d00ff94281abb8c2e97ff877db8.diff",
            "diff_additions": 26,
            "diff_deletions": 1,
            "diff_file_size": 853827,
            "diff_url": "https://github.com/erthink/libmdbx/commit/89558657ea504d00ff94281abb8c2e97ff877db8.diff",
            "exists": true,
            "files": [
                {
                    "file_additions": 26,
                    "file_deletions": 1,
                    "file_exists": true,
                    "file_name": "src/core.c",
                    "file_size": 853827
                }
            ],
            "interesting": {
                "reopen": false,
                "status": false
            },
            "is_parent": false,
            "sha": "89558657ea504d00ff94281abb8c2e97ff877db8"
        },
        {
            "associated_pull_request": [],
            "date": "2021-04-27 18:57:57",
            "diff": "erthink_libmdbx/issue_186/commit_7cbd500534c9b06027ea42ce3e0a63771f146e44.diff",
            "diff_additions": 20,
            "diff_deletions": 33,
            "diff_file_size": 853827,
            "diff_url": "https://github.com/erthink/libmdbx/commit/7cbd500534c9b06027ea42ce3e0a63771f146e44.diff",
            "exists": true,
            "files": [
                {
                    "file_additions": 20,
                    "file_deletions": 33,
                    "file_exists": true,
                    "file_name": "src/core.c",
                    "file_size": 853827
                }
            ],
            "interesting": {
                "reopen": false,
                "status": false
            },
            "is_parent": false,
            "sha": "7cbd500534c9b06027ea42ce3e0a63771f146e44"
        },
        {
            "associated_pull_request": [],
            "date": "2021-04-27 19:50:36",
            "diff": "erthink_libmdbx/issue_186/commit_4111d7238c8ae184d8272bd730a75923c8eb62ce.diff",
            "diff_additions": 9,
            "diff_deletions": 1,
            "diff_file_size": 853827,
            "diff_url": "https://github.com/erthink/libmdbx/commit/4111d7238c8ae184d8272bd730a75923c8eb62ce.diff",
            "exists": true,
            "files": [
                {
                    "file_additions": 9,
                    "file_deletions": 1,
                    "file_exists": true,
                    "file_name": "src/core.c",
                    "file_size": 853827
                }
            ],
            "interesting": {
                "reopen": false,
                "status": false
            },
            "is_parent": false,
            "sha": "4111d7238c8ae184d8272bd730a75923c8eb62ce"
        },
        {
            "associated_pull_request": [],
            "date": "2021-04-27 20:16:28",
            "diff": "erthink_libmdbx/issue_186/commit_7d249c97adf34cf9d6861a47e37c1c7202dd62a8.diff",
            "diff_additions": 4,
            "diff_deletions": 1,
            "diff_file_size": 853827,
            "diff_url": "https://github.com/erthink/libmdbx/commit/7d249c97adf34cf9d6861a47e37c1c7202dd62a8.diff",
            "exists": true,
            "files": [
                {
                    "file_additions": 4,
                    "file_deletions": 1,
                    "file_exists": true,
                    "file_name": "src/core.c",
                    "file_size": 853827
                }
            ],
            "interesting": {
                "reopen": false,
                "status": false
            },
            "is_parent": false,
            "sha": "7d249c97adf34cf9d6861a47e37c1c7202dd62a8"
        },
        {
            "associated_pull_request": [],
            "date": "2021-04-28 08:49:18",
            "diff": "erthink_libmdbx/issue_186/commit_17116b9b461585a6985ab7fb66a151d5136c4459.diff",
            "diff_additions": 21,
            "diff_deletions": 18,
            "diff_file_size": 853827,
            "diff_url": "https://github.com/erthink/libmdbx/commit/17116b9b461585a6985ab7fb66a151d5136c4459.diff",
            "exists": true,
            "files": [
                {
                    "file_additions": 21,
                    "file_deletions": 18,
                    "file_exists": true,
                    "file_name": "src/core.c",
                    "file_size": 853827
                }
            ],
            "interesting": {
                "reopen": false,
                "status": false
            },
            "is_parent": false,
            "sha": "17116b9b461585a6985ab7fb66a151d5136c4459"
        },
        {
            "associated_pull_request": [],
            "date": "2021-04-28 12:20:15",
            "diff": "erthink_libmdbx/issue_186/commit_329a2a50e6e279bf9c84caf052c7e4bb12ef3f49.diff",
            "diff_additions": 89,
            "diff_deletions": 67,
            "diff_file_size": 853827,
            "diff_url": "https://github.com/erthink/libmdbx/commit/329a2a50e6e279bf9c84caf052c7e4bb12ef3f49.diff",
            "exists": true,
            "files": [
                {
                    "file_additions": 89,
                    "file_deletions": 67,
                    "file_exists": true,
                    "file_name": "src/core.c",
                    "file_size": 853827
                }
            ],
            "interesting": {
                "reopen": false,
                "status": false
            },
            "is_parent": false,
            "sha": "329a2a50e6e279bf9c84caf052c7e4bb12ef3f49"
        },
        {
            "associated_pull_request": [],
            "date": "2021-04-28 13:38:08",
            "diff": "erthink_libmdbx/issue_186/commit_9fed78c92dc27b15ab71ae580ad15a321d170d30.diff",
            "diff_additions": 10,
            "diff_deletions": 3,
            "diff_file_size": 853827,
            "diff_url": "https://github.com/erthink/libmdbx/commit/9fed78c92dc27b15ab71ae580ad15a321d170d30.diff",
            "exists": true,
            "files": [
                {
                    "file_additions": 10,
                    "file_deletions": 3,
                    "file_exists": true,
                    "file_name": "src/core.c",
                    "file_size": 853827
                }
            ],
            "interesting": {
                "reopen": false,
                "status": false
            },
            "is_parent": false,
            "sha": "9fed78c92dc27b15ab71ae580ad15a321d170d30"
        },
        {
            "associated_pull_request": [],
            "date": "2021-04-28 14:41:26",
            "diff": "erthink_libmdbx/issue_186/commit_39230c9a2268b281da52c9b34141c48b73f17481.diff",
            "diff_additions": 67,
            "diff_deletions": 55,
            "diff_file_size": 853827,
            "diff_url": "https://github.com/erthink/libmdbx/commit/39230c9a2268b281da52c9b34141c48b73f17481.diff",
            "exists": true,
            "files": [
                {
                    "file_additions": 67,
                    "file_deletions": 55,
                    "file_exists": true,
                    "file_name": "src/core.c",
                    "file_size": 853827
                }
            ],
            "interesting": {
                "reopen": false,
                "status": false
            },
            "is_parent": false,
            "sha": "39230c9a2268b281da52c9b34141c48b73f17481"
        },
        {
            "associated_pull_request": [],
            "date": "2021-04-28 15:03:35",
            "diff": "erthink_libmdbx/issue_186/commit_aa5a39160a93d574ad5204dde1d322eb129e533c.diff",
            "diff_additions": 34,
            "diff_deletions": 2,
            "diff_file_size": 853827,
            "diff_url": "https://github.com/erthink/libmdbx/commit/aa5a39160a93d574ad5204dde1d322eb129e533c.diff",
            "exists": true,
            "files": [
                {
                    "file_additions": 34,
                    "file_deletions": 2,
                    "file_exists": true,
                    "file_name": "src/core.c",
                    "file_size": 853827
                }
            ],
            "interesting": {
                "reopen": false,
                "status": false
            },
            "is_parent": false,
            "sha": "aa5a39160a93d574ad5204dde1d322eb129e533c"
        },
        {
            "associated_pull_request": [],
            "date": "2021-04-28 16:51:58",
            "diff": "erthink_libmdbx/issue_186/commit_c3b2c1fdef880f7a564859adfe26ba3bc4a77a62.diff",
            "diff_additions": 71,
            "diff_deletions": 54,
            "diff_file_size": 853827,
            "diff_url": "https://github.com/erthink/libmdbx/commit/c3b2c1fdef880f7a564859adfe26ba3bc4a77a62.diff",
            "exists": true,
            "files": [
                {
                    "file_additions": 71,
                    "file_deletions": 54,
                    "file_exists": true,
                    "file_name": "src/core.c",
                    "file_size": 853827
                }
            ],
            "interesting": {
                "reopen": false,
                "status": false
            },
            "is_parent": false,
            "sha": "c3b2c1fdef880f7a564859adfe26ba3bc4a77a62"
        }
    ],
    "first_commit": "2021-04-20 12:17:51",
    "last_commit": "2021-04-28 20:38:41",
    "number": 186,
    "pull_request": "None",
    "score": {
        "accidental_reopen_likely": false,
        "all_labels": [
            "bug",
            "enhancement"
        ],
        "contains_keywords": [
            "workaround",
            "perform",
            "issu",
            "problem",
            "chang",
            "work",
            "debug",
            "error",
            "fix",
            "reason",
            "test",
            "bug",
            "fail"
        ],
        "fix_size": 1187,
        "has_labels": [
            "bug"
        ],
        "intersecting": {
            "computed_score": 1.0,
            "final_commit_size": 126,
            "intersection_size": 126,
            "previous_commits_size": 1187
        },
        "is_makefile_based": true,
        "no_new_files": [],
        "no_other_files": false,
        "num_prohibited_files": 216145,
        "prohibited_files": [
            "tools/building.py",
            "tools/building.py",
            "tools/building.py",
            "emcc.py",
            "src/library_emmalloc.js",
            "src/shell.js",
            "tests/test_core.py",
            "src/shell.js",
            "tests/test_core.py",
            "src/library.js"
        ],
        "reopen": false,
        "reopen_events": [
            [
                "2021-04-21 10:29:33",
                "commit"
            ],
            [
                "2021-04-25 23:08:57",
                "commit"
            ],
            [
                "2021-04-25 23:47:49",
                "commit"
            ],
            [
                "2021-04-26 11:14:59",
                "commit"
            ],
            [
                "2021-04-26 15:19:13",
                "commit"
            ],
            [
                "2021-04-27 13:10:27",
                "commit"
            ],
            [
                "2021-04-27 15:02:31",
                "commit"
            ],
            [
                "2021-04-28 21:36:08",
                "commit"
            ],
            [
                "2021-04-28 21:36:08",
                "commit"
            ],
            [
                "2021-04-28 21:36:08",
                "commit"
            ],
            [
                "2021-04-28 21:36:08",
                "commit"
            ],
            [
                "2021-04-28 21:36:08",
                "commit"
            ],
            [
                "2021-04-28 21:36:09",
                "commit"
            ],
            [
                "2021-04-28 21:36:09",
                "commit"
            ],
            [
                "2021-04-28 21:36:09",
                "commit"
            ],
            [
                "2021-04-28 21:36:09",
                "commit"
            ],
            [
                "2021-04-28 21:36:09",
                "commit"
            ],
            [
                "2021-04-28 21:36:09",
                "commit"
            ],
            [
                "2021-04-29 14:04:05",
                "closed"
            ]
        ],
        "status": true,
        "strategy": true,
        "total_changes": 2031
    }
}