{
    "category": [
        "memory",
        "network/protocol"
    ],
    "commits": [
        {
            "associated_pull_request": [],
            "date": "2016-04-01 07:37:34",
            "diff": "scanmem_scanmem/issue_131/commit_38c92c356c5fdd915329406ff9f30b8ac1e8ce90.diff",
            "diff_additions": 6,
            "diff_deletions": 0,
            "diff_file_size": 51726,
            "diff_url": "https://github.com/scanmem/scanmem/commit/38c92c356c5fdd915329406ff9f30b8ac1e8ce90.diff",
            "exists": true,
            "files": [
                {
                    "file_additions": 6,
                    "file_deletions": 0,
                    "file_exists": true,
                    "file_name": "handlers.c",
                    "file_size": 51726
                }
            ],
            "interesting": {
                "reopen": false,
                "status": false
            },
            "is_parent": true,
            "sha": "38c92c356c5fdd915329406ff9f30b8ac1e8ce90"
        },
        {
            "associated_pull_request": [],
            "date": "2016-04-05 07:05:18",
            "diff": "scanmem_scanmem/issue_131/commit_41c55bdcc2b4e6ee8a79d9db7958297cb9bc8b02.diff",
            "diff_additions": 21,
            "diff_deletions": 4,
            "diff_file_size": 9148,
            "diff_url": "https://github.com/scanmem/scanmem/commit/41c55bdcc2b4e6ee8a79d9db7958297cb9bc8b02.diff",
            "exists": true,
            "files": [
                {
                    "file_additions": 21,
                    "file_deletions": 4,
                    "file_exists": true,
                    "file_name": "scanmem.c",
                    "file_size": 9148
                }
            ],
            "interesting": {
                "reopen": false,
                "status": false
            },
            "is_parent": false,
            "sha": "41c55bdcc2b4e6ee8a79d9db7958297cb9bc8b02"
        },
        {
            "associated_pull_request": [],
            "date": "2016-04-05 07:05:18",
            "diff": "scanmem_scanmem/issue_131/commit_beeb07b51a63a7561cb234b6e4e7c3ceb297b59b.diff",
            "diff_additions": 20,
            "diff_deletions": 6,
            "diff_file_size": 9148,
            "diff_url": "https://github.com/scanmem/scanmem/commit/beeb07b51a63a7561cb234b6e4e7c3ceb297b59b.diff",
            "exists": true,
            "files": [
                {
                    "file_additions": 20,
                    "file_deletions": 6,
                    "file_exists": true,
                    "file_name": "scanmem.c",
                    "file_size": 9148
                }
            ],
            "interesting": {
                "reopen": false,
                "status": false
            },
            "is_parent": false,
            "sha": "beeb07b51a63a7561cb234b6e4e7c3ceb297b59b"
        },
        {
            "associated_pull_request": [],
            "date": "2016-04-05 07:05:18",
            "diff": "scanmem_scanmem/issue_131/commit_af0450a4fd983423256449b2ac87cc042fd7bf75.diff",
            "diff_additions": 144,
            "diff_deletions": 11,
            "diff_file_size": 9148,
            "diff_url": "https://github.com/scanmem/scanmem/commit/af0450a4fd983423256449b2ac87cc042fd7bf75.diff",
            "exists": true,
            "files": [
                {
                    "file_additions": 144,
                    "file_deletions": 11,
                    "file_exists": true,
                    "file_name": "scanmem.c",
                    "file_size": 9148
                }
            ],
            "interesting": {
                "reopen": false,
                "status": false
            },
            "is_parent": false,
            "sha": "af0450a4fd983423256449b2ac87cc042fd7bf75"
        },
        {
            "associated_pull_request": [],
            "date": "2016-04-05 07:05:18",
            "diff": "scanmem_scanmem/issue_131/commit_b58d9870329920df63e9a2eb45583fd46349410a.diff",
            "diff_additions": 144,
            "diff_deletions": 11,
            "diff_file_size": 9148,
            "diff_url": "https://github.com/scanmem/scanmem/commit/b58d9870329920df63e9a2eb45583fd46349410a.diff",
            "exists": true,
            "files": [
                {
                    "file_additions": 144,
                    "file_deletions": 11,
                    "file_exists": true,
                    "file_name": "scanmem.c",
                    "file_size": 9148
                }
            ],
            "interesting": {
                "reopen": false,
                "status": false
            },
            "is_parent": false,
            "sha": "b58d9870329920df63e9a2eb45583fd46349410a"
        },
        {
            "associated_pull_request": [],
            "date": "2016-04-11 07:32:52",
            "diff": "scanmem_scanmem/issue_131/commit_532f99675320158f3eff94714ee7d63163e521c7.diff",
            "diff_additions": 28,
            "diff_deletions": 6,
            "diff_file_size": 9148,
            "diff_url": "https://github.com/scanmem/scanmem/commit/532f99675320158f3eff94714ee7d63163e521c7.diff",
            "exists": true,
            "files": [
                {
                    "file_additions": 28,
                    "file_deletions": 6,
                    "file_exists": true,
                    "file_name": "scanmem.c",
                    "file_size": 9148
                }
            ],
            "interesting": {
                "reopen": true,
                "status": false
            },
            "is_parent": false,
            "sha": "532f99675320158f3eff94714ee7d63163e521c7"
        },
        {
            "associated_pull_request": [],
            "date": "2016-04-11 07:32:52",
            "diff": "scanmem_scanmem/issue_131/commit_7f468c4c448584460805da53bd48f6ed77c51c62.diff",
            "diff_additions": 28,
            "diff_deletions": 6,
            "diff_file_size": 9148,
            "diff_url": "https://github.com/scanmem/scanmem/commit/7f468c4c448584460805da53bd48f6ed77c51c62.diff",
            "exists": true,
            "files": [
                {
                    "file_additions": 28,
                    "file_deletions": 6,
                    "file_exists": true,
                    "file_name": "scanmem.c",
                    "file_size": 9148
                }
            ],
            "interesting": {
                "reopen": false,
                "status": false
            },
            "is_parent": false,
            "sha": "7f468c4c448584460805da53bd48f6ed77c51c62"
        },
        {
            "associated_pull_request": [],
            "date": "2016-04-11 07:32:52",
            "diff": "scanmem_scanmem/issue_131/commit_ea87c499ab1c2dfdf3968123bfd3e23df67cb67f.diff",
            "diff_additions": 28,
            "diff_deletions": 6,
            "diff_file_size": 9148,
            "diff_url": "https://github.com/scanmem/scanmem/commit/ea87c499ab1c2dfdf3968123bfd3e23df67cb67f.diff",
            "exists": true,
            "files": [
                {
                    "file_additions": 28,
                    "file_deletions": 6,
                    "file_exists": true,
                    "file_name": "scanmem.c",
                    "file_size": 9148
                }
            ],
            "interesting": {
                "reopen": false,
                "status": false
            },
            "is_parent": false,
            "sha": "ea87c499ab1c2dfdf3968123bfd3e23df67cb67f"
        }
    ],
    "first_commit": "2016-04-01 09:29:03",
    "last_commit": "2016-04-26 12:35:13",
    "number": 131,
    "pull_request": "None",
    "score": {
        "accidental_reopen_likely": false,
        "all_labels": [
            "bug",
            "security"
        ],
        "contains_keywords": [
            "work",
            "fix",
            "patch",
            "bug",
            "test",
            "issu",
            "perform",
            "error",
            "debug",
            "chang",
            "confirm",
            "problem"
        ],
        "fix_size": 149,
        "has_labels": [
            "bug"
        ],
        "intersecting": {
            "computed_score": 1.0,
            "final_commit_size": 30,
            "intersection_size": 30,
            "previous_commits_size": 149
        },
        "is_makefile_based": true,
        "no_new_files": [],
        "no_other_files": true,
        "num_prohibited_files": 83368,
        "prohibited_files": [
            "kill.h",
            "meminfo.h",
            "kill.h",
            "meminfo.h",
            "kill.h",
            "meminfo.h",
            "testsuite_cli_test.go",
            "testsuite_cli_test.go",
            "common.mk",
            "i3bar/include/draw_util.h"
        ],
        "reopen": true,
        "reopen_events": [
            [
                "2016-04-05 07:25:51",
                "commit"
            ],
            [
                "2016-04-05 10:39:21",
                "commit"
            ],
            [
                "2016-04-06 22:16:48",
                "commit"
            ],
            [
                "2016-04-09 21:14:28",
                "commit"
            ],
            [
                "2016-04-09 21:16:19",
                "closed"
            ],
            [
                "2016-04-11 07:45:06",
                "commit"
            ],
            [
                "2016-04-11 07:47:07",
                "reopened"
            ],
            [
                "2016-04-11 17:37:16",
                "commit"
            ],
            [
                "2016-04-11 17:39:03",
                "closed"
            ],
            [
                "2016-04-26 12:47:02",
                "commit"
            ]
        ],
        "status": false,
        "strategy": true,
        "total_changes": 469
    }
}