{
    "commits": [
        {
            "associated_pull_request": [
                "https://github.com/yugabyte/yugabyte-db/pull/14052"
            ],
            "date": "2022-09-21 15:22:39+00:00",
            "diff": "",
            "diff_additions": 0,
            "diff_deletions": 0,
            "diff_file_size": 0,
            "diff_url": "https://github.com/yugabyte/yugabyte-db/commit/207bd5d6e31bd27b91c44f8dbd7a6c494572216e.diff",
            "exists": true,
            "files": [],
            "interesting": {
                "reopen": false,
                "status": false
            },
            "is_parent": true,
            "sha": "207bd5d6e31bd27b91c44f8dbd7a6c494572216e"
        },
        {
            "associated_pull_request": [],
            "date": "2022-09-13 20:27:53+00:00",
            "diff": "yugabyte_yugabyte-db/issue_13850/commit_82bcb2e159106d72d7725777d171fcf93449bd11.diff",
            "diff_additions": 32,
            "diff_deletions": 21,
            "diff_file_size": 169083,
            "diff_url": "https://github.com/yugabyte/yugabyte-db/commit/82bcb2e159106d72d7725777d171fcf93449bd11.diff",
            "exists": true,
            "files": [
                {
                    "file_additions": 29,
                    "file_deletions": 18,
                    "file_exists": true,
                    "file_name": "src/yb/consensus/consensus_queue.cc",
                    "file_size": 71010
                },
                {
                    "file_additions": 3,
                    "file_deletions": 3,
                    "file_exists": true,
                    "file_name": "src/yb/integration-tests/remote_bootstrap-itest.cc",
                    "file_size": 98073
                }
            ],
            "interesting": {
                "reopen": true,
                "status": false
            },
            "is_parent": false,
            "sha": "82bcb2e159106d72d7725777d171fcf93449bd11"
        },
        {
            "associated_pull_request": [],
            "date": "2022-09-13 20:27:53+00:00",
            "diff": "yugabyte_yugabyte-db/issue_13850/commit_e42970e1935ea65a866582b75c7b6a44013c51af.diff",
            "diff_additions": 28,
            "diff_deletions": 17,
            "diff_file_size": 71010,
            "diff_url": "https://github.com/yugabyte/yugabyte-db/commit/e42970e1935ea65a866582b75c7b6a44013c51af.diff",
            "exists": true,
            "files": [
                {
                    "file_additions": 28,
                    "file_deletions": 17,
                    "file_exists": true,
                    "file_name": "src/yb/consensus/consensus_queue.cc",
                    "file_size": 71010
                }
            ],
            "interesting": {
                "reopen": false,
                "status": false
            },
            "is_parent": false,
            "sha": "e42970e1935ea65a866582b75c7b6a44013c51af"
        }
    ],
    "first_commit": "2022-09-21 15:22:39+00:00",
    "last_commit": "2023-03-15 16:58:56+00:00",
    "number": 13850,
    "pull_request": "None",
    "score": {
        "accidental_reopen_likely": false,
        "all_labels": [
            "kind/bug",
            "kind/failing-test",
            "area/docdb",
            "priority/high",
            "2.14 Backport Required"
        ],
        "contains_keywords": [
            "work",
            "fail",
            "chang",
            "fix",
            "debug",
            "test",
            "fault",
            "remov",
            "warn",
            "bug"
        ],
        "fix_size": 87,
        "has_labels": [],
        "intersecting": {
            "computed_score": 0.024390243902439025,
            "final_commit_size": 41,
            "intersection_size": 1,
            "previous_commits_size": 47
        },
        "is_makefile_based": true,
        "no_new_files": [],
        "no_other_files": false,
        "num_prohibited_files": 30251,
        "prohibited_files": [
            "server/src/main/java/com/genymobile/scrcpy/Device.java",
            "server/src/main/java/com/genymobile/scrcpy/wrappers/SurfaceControl.java",
            "server/src/main/java/com/genymobile/scrcpy/Device.java",
            "server/src/main/java/com/genymobile/scrcpy/wrappers/SurfaceControl.java",
            "app/meson.build",
            "app/scrcpy.1",
            "app/src/common.h",
            "app/src/scrcpy.h",
            "app/src/server.h",
            "server/src/main/java/com/genymobile/scrcpy/Workarounds.java"
        ],
        "reopen": true,
        "reopen_events": [
            [
                "2022-09-21 15:28:54+00:00",
                "commit"
            ],
            [
                "2022-09-22 23:51:07+00:00",
                "closed"
            ],
            [
                "2023-03-08 18:49:26+00:00",
                "reopened"
            ],
            [
                "2023-03-15 16:59:00+00:00",
                "commit"
            ],
            [
                "2023-03-15 17:09:28+00:00",
                "closed"
            ]
        ],
        "status": false,
        "strategy": true,
        "total_changes": 98
    }
}