{
    "covered_issues": [
        39,
        32,
        31,
        30,
        29,
        28,
        27,
        26,
        25,
        23,
        22,
        21,
        19,
        18,
        17,
        16,
        15,
        14,
        13,
        12,
        11,
        10,
        9,
        8,
        6,
        5,
        3,
        2,
        1
    ],
    "finished": true
}