{
    "category": [
        "memory",
        "network/protocol"
    ],
    "commits": [
        {
            "associated_pull_request": [
                "https://github.com/nanomsg/nng/pull/447"
            ],
            "date": "2018-05-16 21:12:29",
            "diff": "nanomsg_nng/issue_441/commit_eab6a4d2d96d11d3926e927c135362fc166895f0.diff",
            "diff_additions": 55,
            "diff_deletions": 103,
            "diff_file_size": 23910,
            "diff_url": "https://github.com/nanomsg/nng/commit/eab6a4d2d96d11d3926e927c135362fc166895f0.diff",
            "exists": true,
            "files": [
                {
                    "file_additions": 0,
                    "file_deletions": 1,
                    "file_exists": true,
                    "file_name": "src/core/aio.c",
                    "file_size": 18557
                },
                {
                    "file_additions": 55,
                    "file_deletions": 102,
                    "file_exists": true,
                    "file_name": "src/core/taskq.c",
                    "file_size": 5353
                }
            ],
            "interesting": {
                "reopen": false,
                "status": false
            },
            "is_parent": true,
            "sha": "eab6a4d2d96d11d3926e927c135362fc166895f0"
        },
        {
            "associated_pull_request": [],
            "date": "2018-05-17 04:46:56",
            "diff": "nanomsg_nng/issue_441/commit_2360edad16cf2d6da98c4d46fc9bbdcefe430a10.diff",
            "diff_additions": 7,
            "diff_deletions": 28,
            "diff_file_size": 0,
            "diff_url": "https://github.com/nanomsg/nng/commit/2360edad16cf2d6da98c4d46fc9bbdcefe430a10.diff",
            "exists": true,
            "files": [
                {
                    "file_additions": 7,
                    "file_deletions": 28,
                    "file_exists": false,
                    "file_name": "src/protocol/bus0/bus.c",
                    "file_size": 0
                }
            ],
            "interesting": {
                "reopen": false,
                "status": true
            },
            "is_parent": false,
            "sha": "2360edad16cf2d6da98c4d46fc9bbdcefe430a10"
        },
        {
            "associated_pull_request": [
                "https://github.com/nanomsg/nng/pull/448"
            ],
            "date": "2018-05-17 04:46:56",
            "diff": "nanomsg_nng/issue_441/commit_e490aa3353f05e158a0f1f485f371cd49e70b4f5.diff",
            "diff_additions": 79,
            "diff_deletions": 2,
            "diff_file_size": 0,
            "diff_url": "https://github.com/nanomsg/nng/commit/e490aa3353f05e158a0f1f485f371cd49e70b4f5.diff",
            "exists": true,
            "files": [
                {
                    "file_additions": 79,
                    "file_deletions": 2,
                    "file_exists": false,
                    "file_name": "src/protocol/bus0/bus.c",
                    "file_size": 0
                }
            ],
            "interesting": {
                "reopen": false,
                "status": false
            },
            "is_parent": false,
            "sha": "e490aa3353f05e158a0f1f485f371cd49e70b4f5"
        },
        {
            "associated_pull_request": [
                "https://github.com/nanomsg/nng/pull/448"
            ],
            "date": "2018-05-17 04:46:56",
            "diff": "nanomsg_nng/issue_441/commit_e490aa3353f05e158a0f1f485f371cd49e70b4f5.diff",
            "diff_additions": 79,
            "diff_deletions": 2,
            "diff_file_size": 0,
            "diff_url": "https://github.com/nanomsg/nng/commit/e490aa3353f05e158a0f1f485f371cd49e70b4f5.diff",
            "exists": true,
            "files": [
                {
                    "file_additions": 79,
                    "file_deletions": 2,
                    "file_exists": false,
                    "file_name": "src/protocol/bus0/bus.c",
                    "file_size": 0
                }
            ],
            "interesting": {
                "reopen": false,
                "status": false
            },
            "is_parent": false,
            "sha": "e490aa3353f05e158a0f1f485f371cd49e70b4f5"
        }
    ],
    "first_commit": "2018-05-17 04:08:55",
    "last_commit": "2018-05-17 16:44:39",
    "number": 441,
    "pull_request": "None",
    "score": {
        "accidental_reopen_likely": false,
        "all_labels": [],
        "contains_keywords": [
            "chang",
            "problem",
            "crash",
            "fix",
            "patch"
        ],
        "fix_size": 109,
        "has_labels": [],
        "intersecting": {
            "computed_score": 1.0,
            "final_commit_size": 82,
            "intersection_size": 82,
            "previous_commits_size": 109
        },
        "is_makefile_based": true,
        "no_new_files": [],
        "no_other_files": false,
        "num_prohibited_files": 64039,
        "prohibited_files": [
            "hal/inc/pinmap_hal.h",
            "Debug/marvin.bin",
            "Debug/marvin.elf",
            "Debug/marvin.hex",
            "Debug/marvin.bin",
            "Debug/marvin.elf",
            "Debug/marvin.hex",
            "inc/spark_utilities.h",
            "Debug/marvin.bin",
            "Debug/marvin.elf"
        ],
        "reopen": false,
        "reopen_events": [
            [
                "2018-05-17 04:47:24",
                "commit"
            ],
            [
                "2018-05-17 16:45:02",
                "commit"
            ],
            [
                "2018-05-17 17:03:56",
                "closed"
            ],
            [
                "2018-05-17 17:03:56",
                "commit"
            ]
        ],
        "status": true,
        "strategy": true,
        "total_changes": 355
    }
}