{
    "covered_issues": [
        520,
        518,
        513,
        508,
        507,
        506,
        504,
        503,
        491,
        475,
        464,
        455,
        453,
        451,
        444,
        441,
        434,
        428,
        427,
        425,
        424,
        423,
        420,
        415,
        413,
        410,
        409,
        405,
        404,
        401,
        400,
        398,
        397,
        386,
        385,
        383,
        380,
        377,
        376,
        375,
        370,
        362,
        361,
        359,
        355,
        353,
        349,
        340,
        336,
        335,
        334,
        328,
        326,
        321,
        319,
        318,
        314,
        313,
        311,
        309,
        307,
        302,
        294,
        288,
        287,
        285,
        281,
        280,
        279,
        275,
        273,
        272,
        269,
        268,
        267,
        266,
        264,
        263,
        262,
        260,
        258,
        257,
        256,
        255,
        254,
        253,
        252,
        248,
        247,
        245,
        244,
        241,
        239,
        238,
        234,
        232,
        230,
        223,
        222,
        221,
        217,
        216,
        215,
        214,
        213,
        212,
        210,
        209,
        206,
        205,
        204,
        203,
        201,
        199,
        198,
        197,
        196,
        195,
        194,
        193,
        192,
        190,
        189,
        187,
        186,
        185,
        184,
        182,
        181,
        179,
        178,
        175,
        174,
        173,
        172,
        171,
        170,
        169,
        168,
        167,
        166,
        163,
        160,
        159,
        157,
        156,
        155,
        154,
        152,
        151,
        149,
        147,
        146,
        145,
        142,
        141,
        138,
        135,
        134,
        133,
        132,
        131,
        130,
        126,
        123,
        121,
        119,
        118,
        117,
        116,
        115,
        114,
        111,
        110,
        108,
        105,
        103,
        101,
        98,
        97,
        95,
        90,
        89,
        88,
        87,
        86,
        85,
        84,
        82,
        81,
        80,
        76,
        75,
        74,
        73,
        72,
        71,
        69,
        68,
        67,
        66,
        65,
        64,
        62,
        60,
        58,
        57,
        56,
        55,
        54,
        53,
        52,
        50,
        48,
        47,
        46,
        45,
        44,
        43,
        42,
        41,
        39,
        38,
        37,
        36,
        35,
        34,
        33,
        32,
        31,
        30,
        29,
        28,
        27,
        26,
        25,
        24,
        23,
        22,
        21,
        20,
        18,
        17,
        15,
        14,
        13,
        11,
        10,
        9,
        8,
        7,
        6,
        4,
        3,
        2,
        1
    ],
    "finished": true
}