{
    "covered_issues": [
        172,
        170,
        168,
        166,
        165,
        164,
        162,
        161,
        160,
        159,
        158,
        157,
        149,
        148,
        147,
        146,
        143,
        142,
        141,
        140,
        138,
        134,
        133,
        132,
        131,
        130,
        123,
        122,
        120,
        119,
        116,
        115,
        114,
        112,
        111,
        109,
        108,
        107,
        105,
        103,
        102,
        100,
        98,
        97,
        96,
        95,
        94,
        93,
        92,
        90,
        89,
        87,
        84,
        82,
        81,
        77,
        76,
        72,
        70,
        69,
        68,
        61,
        60,
        58,
        57,
        56,
        54,
        53,
        50,
        46,
        44,
        42,
        39,
        38,
        37,
        36,
        35,
        34,
        32,
        31,
        29,
        28,
        27,
        26,
        22,
        21,
        18,
        15,
        14,
        12,
        11,
        9,
        8,
        6,
        5,
        4,
        3
    ],
    "finished": true
}