{
    "category": [
        "build/refactor/preprocessing",
        "control flow"
    ],
    "commits": [
        {
            "associated_pull_request": [],
            "date": "2015-01-12 16:32:14",
            "diff": "",
            "diff_additions": 0,
            "diff_deletions": 0,
            "diff_file_size": 0,
            "diff_url": "https://github.com/micropython/micropython/commit/b58da9420cdd0cca1e79be32f24088345cf66946.diff",
            "exists": true,
            "files": [],
            "interesting": {
                "reopen": false,
                "status": false
            },
            "is_parent": true,
            "sha": "b58da9420cdd0cca1e79be32f24088345cf66946"
        },
        {
            "associated_pull_request": [],
            "date": "2015-01-12 21:56:35",
            "diff": "micropython_micropython/issue_699/commit_0178aa9a113dc224820fd638dc353dfe5ea6bee2.diff",
            "diff_additions": 8,
            "diff_deletions": 2,
            "diff_file_size": 78623,
            "diff_url": "https://github.com/micropython/micropython/commit/0178aa9a113dc224820fd638dc353dfe5ea6bee2.diff",
            "exists": true,
            "files": [
                {
                    "file_additions": 7,
                    "file_deletions": 1,
                    "file_exists": true,
                    "file_name": "py/objstr.c",
                    "file_size": 78623
                },
                {
                    "file_additions": 1,
                    "file_deletions": 1,
                    "file_exists": false,
                    "file_name": "unix/modtime.c",
                    "file_size": 0
                }
            ],
            "interesting": {
                "reopen": false,
                "status": false
            },
            "is_parent": false,
            "sha": "0178aa9a113dc224820fd638dc353dfe5ea6bee2"
        },
        {
            "associated_pull_request": [],
            "date": "2015-01-16 17:47:07",
            "diff": "micropython_micropython/issue_699/commit_963a5a3e82ded7ee75adae72ae7cb14796fa150e.diff",
            "diff_additions": 51,
            "diff_deletions": 49,
            "diff_file_size": 632713,
            "diff_url": "https://github.com/micropython/micropython/commit/963a5a3e82ded7ee75adae72ae7cb14796fa150e.diff",
            "exists": true,
            "files": [
                {
                    "file_additions": 4,
                    "file_deletions": 4,
                    "file_exists": true,
                    "file_name": "py/asmx86.c",
                    "file_size": 19404
                },
                {
                    "file_additions": 1,
                    "file_deletions": 1,
                    "file_exists": true,
                    "file_name": "py/bc.c",
                    "file_size": 13590
                },
                {
                    "file_additions": 1,
                    "file_deletions": 1,
                    "file_exists": true,
                    "file_name": "py/binary.c",
                    "file_size": 13807
                },
                {
                    "file_additions": 1,
                    "file_deletions": 1,
                    "file_exists": true,
                    "file_name": "py/builtinimport.c",
                    "file_size": 19672
                },
                {
                    "file_additions": 10,
                    "file_deletions": 10,
                    "file_exists": true,
                    "file_name": "py/compile.c",
                    "file_size": 149098
                },
                {
                    "file_additions": 1,
                    "file_deletions": 1,
                    "file_exists": true,
                    "file_name": "py/emitbc.c",
                    "file_size": 35292
                },
                {
                    "file_additions": 1,
                    "file_deletions": 1,
                    "file_exists": true,
                    "file_name": "py/lexer.c",
                    "file_size": 27396
                },
                {
                    "file_additions": 1,
                    "file_deletions": 1,
                    "file_exists": true,
                    "file_name": "py/map.c",
                    "file_size": 15751
                },
                {
                    "file_additions": 1,
                    "file_deletions": 1,
                    "file_exists": true,
                    "file_name": "py/mpz.c",
                    "file_size": 47681
                },
                {
                    "file_additions": 2,
                    "file_deletions": 2,
                    "file_exists": true,
                    "file_name": "py/obj.c",
                    "file_size": 20945
                },
                {
                    "file_additions": 1,
                    "file_deletions": 1,
                    "file_exists": true,
                    "file_name": "py/objint.c",
                    "file_size": 16198
                },
                {
                    "file_additions": 1,
                    "file_deletions": 1,
                    "file_exists": true,
                    "file_name": "py/objlist.c",
                    "file_size": 20198
                },
                {
                    "file_additions": 9,
                    "file_deletions": 9,
                    "file_exists": true,
                    "file_name": "py/objstr.c",
                    "file_size": 78623
                },
                {
                    "file_additions": 1,
                    "file_deletions": 1,
                    "file_exists": true,
                    "file_name": "py/parse.c",
                    "file_size": 46877
                },
                {
                    "file_additions": 4,
                    "file_deletions": 1,
                    "file_exists": false,
                    "file_name": "py/pfenv.c",
                    "file_size": 0
                },
                {
                    "file_additions": 1,
                    "file_deletions": 1,
                    "file_exists": true,
                    "file_name": "py/qstr.c",
                    "file_size": 14376
                },
                {
                    "file_additions": 2,
                    "file_deletions": 2,
                    "file_exists": true,
                    "file_name": "py/runtime.c",
                    "file_size": 60804
                },
                {
                    "file_additions": 2,
                    "file_deletions": 2,
                    "file_exists": true,
                    "file_name": "py/sequence.c",
                    "file_size": 7151
                },
                {
                    "file_additions": 2,
                    "file_deletions": 2,
                    "file_exists": true,
                    "file_name": "py/showbc.c",
                    "file_size": 18289
                },
                {
                    "file_additions": 1,
                    "file_deletions": 1,
                    "file_exists": true,
                    "file_name": "py/vstr.c",
                    "file_size": 7561
                },
                {
                    "file_additions": 2,
                    "file_deletions": 2,
                    "file_exists": false,
                    "file_name": "unix/main.c",
                    "file_size": 0
                },
                {
                    "file_additions": 2,
                    "file_deletions": 3,
                    "file_exists": false,
                    "file_name": "unix/modffi.c",
                    "file_size": 0
                }
            ],
            "interesting": {
                "reopen": false,
                "status": false
            },
            "is_parent": false,
            "sha": "963a5a3e82ded7ee75adae72ae7cb14796fa150e"
        },
        {
            "associated_pull_request": [],
            "date": "2015-01-20 11:55:10",
            "diff": "micropython_micropython/issue_699/commit_50912e7f5dc579fd2917537046793dfa30decadf.diff",
            "diff_additions": 128,
            "diff_deletions": 126,
            "diff_file_size": 370600,
            "diff_url": "https://github.com/micropython/micropython/commit/50912e7f5dc579fd2917537046793dfa30decadf.diff",
            "exists": true,
            "files": [
                {
                    "file_additions": 2,
                    "file_deletions": 2,
                    "file_exists": true,
                    "file_name": "py/argcheck.c",
                    "file_size": 5838
                },
                {
                    "file_additions": 9,
                    "file_deletions": 9,
                    "file_exists": true,
                    "file_name": "py/compile.c",
                    "file_size": 149098
                },
                {
                    "file_additions": 2,
                    "file_deletions": 2,
                    "file_exists": true,
                    "file_name": "py/objmodule.c",
                    "file_size": 11071
                },
                {
                    "file_additions": 14,
                    "file_deletions": 14,
                    "file_exists": true,
                    "file_name": "py/objstr.c",
                    "file_size": 78623
                },
                {
                    "file_additions": 3,
                    "file_deletions": 3,
                    "file_exists": true,
                    "file_name": "py/parse.c",
                    "file_size": 46877
                },
                {
                    "file_additions": 36,
                    "file_deletions": 36,
                    "file_exists": true,
                    "file_name": "py/runtime.c",
                    "file_size": 60804
                },
                {
                    "file_additions": 17,
                    "file_deletions": 17,
                    "file_exists": true,
                    "file_name": "py/showbc.c",
                    "file_size": 18289
                },
                {
                    "file_additions": 1,
                    "file_deletions": 1,
                    "file_exists": false,
                    "file_name": "stmhal/moduselect.c",
                    "file_size": 0
                },
                {
                    "file_additions": 2,
                    "file_deletions": 2,
                    "file_exists": false,
                    "file_name": "stmhal/pyexec.c",
                    "file_size": 0
                },
                {
                    "file_additions": 4,
                    "file_deletions": 4,
                    "file_exists": false,
                    "file_name": "stmhal/stm32f4xx_it.c",
                    "file_size": 0
                },
                {
                    "file_additions": 36,
                    "file_deletions": 36,
                    "file_exists": false,
                    "file_name": "stmhal/usbd_conf.c",
                    "file_size": 0
                },
                {
                    "file_additions": 2,
                    "file_deletions": 0,
                    "file_exists": false,
                    "file_name": "unix/main.c",
                    "file_size": 0
                }
            ],
            "interesting": {
                "reopen": false,
                "status": true
            },
            "is_parent": false,
            "sha": "50912e7f5dc579fd2917537046793dfa30decadf"
        },
        {
            "associated_pull_request": [],
            "date": "2015-01-20 12:47:20",
            "diff": "micropython_micropython/issue_699/commit_ff8dd3f486afb0d6ff1427d8a6a8a8ed73baa660.diff",
            "diff_additions": 156,
            "diff_deletions": 19,
            "diff_file_size": 882667,
            "diff_url": "https://github.com/micropython/micropython/commit/ff8dd3f486afb0d6ff1427d8a6a8a8ed73baa660.diff",
            "exists": true,
            "files": [
                {
                    "file_additions": 1,
                    "file_deletions": 0,
                    "file_exists": true,
                    "file_name": "extmod/modubinascii.c",
                    "file_size": 8454
                },
                {
                    "file_additions": 2,
                    "file_deletions": 0,
                    "file_exists": true,
                    "file_name": "extmod/moductypes.c",
                    "file_size": 28152
                },
                {
                    "file_additions": 1,
                    "file_deletions": 0,
                    "file_exists": true,
                    "file_name": "extmod/moduhashlib.c",
                    "file_size": 12524
                },
                {
                    "file_additions": 4,
                    "file_deletions": 0,
                    "file_exists": true,
                    "file_name": "extmod/modure.c",
                    "file_size": 15742
                },
                {
                    "file_additions": 1,
                    "file_deletions": 0,
                    "file_exists": true,
                    "file_name": "extmod/moduzlib.c",
                    "file_size": 7405
                },
                {
                    "file_additions": 1,
                    "file_deletions": 0,
                    "file_exists": true,
                    "file_name": "py/asmx86.c",
                    "file_size": 19404
                },
                {
                    "file_additions": 2,
                    "file_deletions": 0,
                    "file_exists": true,
                    "file_name": "py/builtinevex.c",
                    "file_size": 6020
                },
                {
                    "file_additions": 5,
                    "file_deletions": 2,
                    "file_exists": true,
                    "file_name": "py/compile.c",
                    "file_size": 149098
                },
                {
                    "file_additions": 12,
                    "file_deletions": 0,
                    "file_exists": true,
                    "file_name": "py/emitbc.c",
                    "file_size": 35292
                },
                {
                    "file_additions": 2,
                    "file_deletions": 0,
                    "file_exists": true,
                    "file_name": "py/emitglue.c",
                    "file_size": 7298
                },
                {
                    "file_additions": 33,
                    "file_deletions": 5,
                    "file_exists": true,
                    "file_name": "py/emitnative.c",
                    "file_size": 126522
                },
                {
                    "file_additions": 3,
                    "file_deletions": 0,
                    "file_exists": false,
                    "file_name": "py/emitpass1.c",
                    "file_size": 0
                },
                {
                    "file_additions": 3,
                    "file_deletions": 0,
                    "file_exists": true,
                    "file_name": "py/modmicropython.c",
                    "file_size": 8375
                },
                {
                    "file_additions": 3,
                    "file_deletions": 3,
                    "file_exists": true,
                    "file_name": "py/mpz.c",
                    "file_size": 47681
                },
                {
                    "file_additions": 3,
                    "file_deletions": 0,
                    "file_exists": true,
                    "file_name": "py/objarray.c",
                    "file_size": 27004
                },
                {
                    "file_additions": 1,
                    "file_deletions": 0,
                    "file_exists": true,
                    "file_name": "py/objbool.c",
                    "file_size": 3193
                },
                {
                    "file_additions": 1,
                    "file_deletions": 0,
                    "file_exists": true,
                    "file_name": "py/objboundmeth.c",
                    "file_size": 4086
                },
                {
                    "file_additions": 1,
                    "file_deletions": 0,
                    "file_exists": true,
                    "file_name": "py/objcell.c",
                    "file_size": 2450
                },
                {
                    "file_additions": 1,
                    "file_deletions": 0,
                    "file_exists": true,
                    "file_name": "py/objclosure.c",
                    "file_size": 3801
                },
                {
                    "file_additions": 2,
                    "file_deletions": 0,
                    "file_exists": true,
                    "file_name": "py/objcomplex.c",
                    "file_size": 9482
                },
                {
                    "file_additions": 2,
                    "file_deletions": 0,
                    "file_exists": true,
                    "file_name": "py/objdict.c",
                    "file_size": 23261
                },
                {
                    "file_additions": 2,
                    "file_deletions": 2,
                    "file_exists": true,
                    "file_name": "py/objenumerate.c",
                    "file_size": 3225
                },
                {
                    "file_additions": 1,
                    "file_deletions": 1,
                    "file_exists": true,
                    "file_name": "py/objfilter.c",
                    "file_size": 2521
                },
                {
                    "file_additions": 2,
                    "file_deletions": 0,
                    "file_exists": true,
                    "file_name": "py/objfloat.c",
                    "file_size": 11864
                },
                {
                    "file_additions": 1,
                    "file_deletions": 0,
                    "file_exists": true,
                    "file_name": "py/objfun.c",
                    "file_size": 19563
                },
                {
                    "file_additions": 1,
                    "file_deletions": 0,
                    "file_exists": true,
                    "file_name": "py/objgenerator.c",
                    "file_size": 14175
                },
                {
                    "file_additions": 4,
                    "file_deletions": 0,
                    "file_exists": true,
                    "file_name": "py/objint.c",
                    "file_size": 16198
                },
                {
                    "file_additions": 1,
                    "file_deletions": 0,
                    "file_exists": true,
                    "file_name": "py/objlist.c",
                    "file_size": 20198
                },
                {
                    "file_additions": 1,
                    "file_deletions": 1,
                    "file_exists": true,
                    "file_name": "py/objmap.c",
                    "file_size": 2649
                },
                {
                    "file_additions": 1,
                    "file_deletions": 0,
                    "file_exists": true,
                    "file_name": "py/objmodule.c",
                    "file_size": 11071
                },
                {
                    "file_additions": 4,
                    "file_deletions": 0,
                    "file_exists": true,
                    "file_name": "py/objnamedtuple.c",
                    "file_size": 7387
                },
                {
                    "file_additions": 2,
                    "file_deletions": 0,
                    "file_exists": true,
                    "file_name": "py/objnone.c",
                    "file_size": 1904
                },
                {
                    "file_additions": 3,
                    "file_deletions": 1,
                    "file_exists": true,
                    "file_name": "py/objobject.c",
                    "file_size": 4673
                },
                {
                    "file_additions": 1,
                    "file_deletions": 1,
                    "file_exists": true,
                    "file_name": "py/objproperty.c",
                    "file_size": 4117
                },
                {
                    "file_additions": 2,
                    "file_deletions": 1,
                    "file_exists": true,
                    "file_name": "py/objrange.c",
                    "file_size": 7579
                },
                {
                    "file_additions": 1,
                    "file_deletions": 1,
                    "file_exists": true,
                    "file_name": "py/objreversed.c",
                    "file_size": 2926
                },
                {
                    "file_additions": 1,
                    "file_deletions": 0,
                    "file_exists": true,
                    "file_name": "py/objset.c",
                    "file_size": 21383
                },
                {
                    "file_additions": 3,
                    "file_deletions": 0,
                    "file_exists": true,
                    "file_name": "py/objslice.c",
                    "file_size": 5835
                },
                {
                    "file_additions": 4,
                    "file_deletions": 0,
                    "file_exists": true,
                    "file_name": "py/objstr.c",
                    "file_size": 78623
                },
                {
                    "file_additions": 5,
                    "file_deletions": 0,
                    "file_exists": true,
                    "file_name": "py/objstringio.c",
                    "file_size": 9465
                },
                {
                    "file_additions": 3,
                    "file_deletions": 0,
                    "file_exists": true,
                    "file_name": "py/objstrunicode.c",
                    "file_size": 12397
                },
                {
                    "file_additions": 2,
                    "file_deletions": 0,
                    "file_exists": true,
                    "file_name": "py/objtuple.c",
                    "file_size": 10786
                },
                {
                    "file_additions": 5,
                    "file_deletions": 0,
                    "file_exists": true,
                    "file_name": "py/objtype.c",
                    "file_size": 56640
                },
                {
                    "file_additions": 1,
                    "file_deletions": 1,
                    "file_exists": true,
                    "file_name": "py/objzip.c",
                    "file_size": 2688
                },
                {
                    "file_additions": 1,
                    "file_deletions": 0,
                    "file_exists": true,
                    "file_name": "py/parsenumbase.c",
                    "file_size": 2405
                },
                {
                    "file_additions": 2,
                    "file_deletions": 0,
                    "file_exists": false,
                    "file_name": "py/pfenv.c",
                    "file_size": 0
                },
                {
                    "file_additions": 1,
                    "file_deletions": 0,
                    "file_exists": false,
                    "file_name": "py/pfenv_printf.c",
                    "file_size": 0
                },
                {
                    "file_additions": 2,
                    "file_deletions": 0,
                    "file_exists": true,
                    "file_name": "py/sequence.c",
                    "file_size": 7151
                },
                {
                    "file_additions": 2,
                    "file_deletions": 0,
                    "file_exists": false,
                    "file_name": "unix/file.c",
                    "file_size": 0
                },
                {
                    "file_additions": 8,
                    "file_deletions": 0,
                    "file_exists": false,
                    "file_name": "unix/modffi.c",
                    "file_size": 0
                },
                {
                    "file_additions": 5,
                    "file_deletions": 0,
                    "file_exists": false,
                    "file_name": "unix/modsocket.c",
                    "file_size": 0
                }
            ],
            "interesting": {
                "reopen": false,
                "status": true
            },
            "is_parent": false,
            "sha": "ff8dd3f486afb0d6ff1427d8a6a8a8ed73baa660"
        },
        {
            "associated_pull_request": [],
            "date": "2015-01-22 14:08:58",
            "diff": "micropython_micropython/issue_699/commit_e5bcbcdebd0af90df914c480d714af8f09174bf0.diff",
            "diff_additions": 8,
            "diff_deletions": 7,
            "diff_file_size": 23397,
            "diff_url": "https://github.com/micropython/micropython/commit/e5bcbcdebd0af90df914c480d714af8f09174bf0.diff",
            "exists": true,
            "files": [
                {
                    "file_additions": 8,
                    "file_deletions": 7,
                    "file_exists": true,
                    "file_name": "py/asmx64.c",
                    "file_size": 23397
                }
            ],
            "interesting": {
                "reopen": false,
                "status": true
            },
            "is_parent": false,
            "sha": "e5bcbcdebd0af90df914c480d714af8f09174bf0"
        },
        {
            "associated_pull_request": [],
            "date": "2015-01-22 14:10:11",
            "diff": "micropython_micropython/issue_699/commit_24b8cff9efa430a16465385707692e7933ac472f.diff",
            "diff_additions": 6,
            "diff_deletions": 5,
            "diff_file_size": 29083,
            "diff_url": "https://github.com/micropython/micropython/commit/24b8cff9efa430a16465385707692e7933ac472f.diff",
            "exists": true,
            "files": [
                {
                    "file_additions": 1,
                    "file_deletions": 1,
                    "file_exists": true,
                    "file_name": "extmod/crypto-algorithms/sha256.c",
                    "file_size": 5378
                },
                {
                    "file_additions": 1,
                    "file_deletions": 1,
                    "file_exists": true,
                    "file_name": "extmod/re1.5/compilecode.c",
                    "file_size": 6266
                },
                {
                    "file_additions": 4,
                    "file_deletions": 3,
                    "file_exists": true,
                    "file_name": "extmod/uzlib/tinflate.c",
                    "file_size": 17439
                }
            ],
            "interesting": {
                "reopen": false,
                "status": true
            },
            "is_parent": false,
            "sha": "24b8cff9efa430a16465385707692e7933ac472f"
        }
    ],
    "first_commit": "2015-01-12 16:32:14",
    "last_commit": "2015-03-19 00:25:33",
    "number": 699,
    "pull_request": "None",
    "score": {
        "accidental_reopen_likely": false,
        "all_labels": [
            "rfc"
        ],
        "contains_keywords": [
            "work",
            "fix",
            "reason",
            "patch",
            "test",
            "issu",
            "warn",
            "error",
            "chang",
            "fail",
            "problem"
        ],
        "fix_size": 445,
        "has_labels": [],
        "intersecting": {
            "computed_score": 0.0,
            "final_commit_size": 9,
            "intersection_size": 0,
            "previous_commits_size": 436
        },
        "is_makefile_based": false,
        "no_new_files": [
            "extmod/crypto-algorithms/sha256.c",
            "extmod/re1.5/compilecode.c",
            "extmod/uzlib/tinflate.c"
        ],
        "no_other_files": false,
        "num_prohibited_files": 103549,
        "prohibited_files": [
            "kill.h",
            "meminfo.h",
            "kill.h",
            "meminfo.h",
            "kill.h",
            "meminfo.h",
            "testsuite_cli_test.go",
            "testsuite_cli_test.go",
            "common.mk",
            "i3bar/include/draw_util.h"
        ],
        "reopen": false,
        "reopen_events": [
            [
                "2015-01-12 21:57:11",
                "commit"
            ],
            [
                "2015-01-16 17:48:47",
                "commit"
            ],
            [
                "2015-01-20 11:55:43",
                "commit"
            ],
            [
                "2015-01-20 12:47:57",
                "commit"
            ],
            [
                "2015-01-22 14:09:46",
                "commit"
            ],
            [
                "2015-01-22 14:10:46",
                "commit"
            ],
            [
                "2015-03-19 00:27:01",
                "commit"
            ],
            [
                "2015-03-19 00:33:01",
                "closed"
            ]
        ],
        "status": true,
        "strategy": true,
        "total_changes": 565
    }
}