{
    "covered_issues": [
        109,
        106,
        103,
        84,
        68,
        62,
        43,
        41,
        39,
        38,
        37,
        33,
        29,
        26,
        23,
        22,
        21,
        19,
        18,
        17,
        16,
        15,
        11,
        10,
        9,
        8,
        4,
        2,
        1
    ],
    "finished": true
}