{
    "covered_issues": [
        322,
        310,
        308,
        295,
        290,
        274,
        271,
        269,
        268,
        266,
        259,
        257,
        255,
        251,
        248,
        245,
        239,
        233,
        232,
        231,
        230,
        227,
        225,
        224,
        220,
        217,
        212,
        209,
        205,
        201,
        198,
        197,
        196,
        194,
        192,
        191,
        188,
        186,
        185,
        183,
        181,
        180,
        172,
        170,
        168,
        163,
        162,
        160,
        158,
        156,
        155,
        153,
        152,
        145,
        144,
        143,
        140,
        139,
        138,
        135,
        129,
        127,
        126,
        124,
        122,
        120,
        118,
        117,
        116,
        114,
        101,
        99,
        97,
        94,
        92,
        91,
        89,
        88,
        87,
        86,
        84,
        80,
        77,
        73,
        71,
        69,
        68,
        66,
        65,
        63,
        62,
        61,
        57,
        55,
        53,
        52,
        50,
        49,
        47,
        46,
        45,
        42,
        40,
        38,
        37,
        36,
        35,
        34,
        33,
        32,
        31,
        30,
        28,
        27,
        26,
        24,
        23,
        22,
        21,
        20,
        19,
        18,
        17,
        16,
        15,
        14,
        12,
        10,
        9,
        8,
        6,
        5,
        4,
        3,
        1
    ],
    "finished": true
}