{
    "commits": [
        {
            "associated_pull_request": [],
            "date": "2013-12-07 07:19:38+00:00",
            "diff": "conformal_spectrwm/issue_28/commit_585edea31eefccd1ce51f54f5172d65c361e053b.diff",
            "diff_additions": 10,
            "diff_deletions": 10,
            "diff_file_size": 431902,
            "diff_url": "https://github.com/conformal/spectrwm/commit/585edea31eefccd1ce51f54f5172d65c361e053b.diff",
            "exists": true,
            "files": [
                {
                    "file_additions": 10,
                    "file_deletions": 10,
                    "file_exists": true,
                    "file_name": "spectrwm.c",
                    "file_size": 431902
                }
            ],
            "interesting": {
                "reopen": false,
                "status": false
            },
            "is_parent": true,
            "sha": "585edea31eefccd1ce51f54f5172d65c361e053b"
        },
        {
            "associated_pull_request": [],
            "date": "2013-12-12 08:10:04+00:00",
            "diff": "conformal_spectrwm/issue_28/commit_f52df6cff180069d25ae18b0ee926bbf6e890e9c.diff",
            "diff_additions": 40,
            "diff_deletions": 7,
            "diff_file_size": 431902,
            "diff_url": "https://github.com/conformal/spectrwm/commit/f52df6cff180069d25ae18b0ee926bbf6e890e9c.diff",
            "exists": true,
            "files": [
                {
                    "file_additions": 40,
                    "file_deletions": 7,
                    "file_exists": true,
                    "file_name": "spectrwm.c",
                    "file_size": 431902
                }
            ],
            "interesting": {
                "reopen": true,
                "status": false
            },
            "is_parent": false,
            "sha": "f52df6cff180069d25ae18b0ee926bbf6e890e9c"
        },
        {
            "associated_pull_request": [],
            "date": "2014-02-25 05:26:53+00:00",
            "diff": "conformal_spectrwm/issue_28/commit_870f90b273b2fbe1aed69a3125c1ae361d6988e6.diff",
            "diff_additions": 7,
            "diff_deletions": 0,
            "diff_file_size": 431902,
            "diff_url": "https://github.com/conformal/spectrwm/commit/870f90b273b2fbe1aed69a3125c1ae361d6988e6.diff",
            "exists": true,
            "files": [
                {
                    "file_additions": 7,
                    "file_deletions": 0,
                    "file_exists": true,
                    "file_name": "spectrwm.c",
                    "file_size": 431902
                }
            ],
            "interesting": {
                "reopen": false,
                "status": false
            },
            "is_parent": false,
            "sha": "870f90b273b2fbe1aed69a3125c1ae361d6988e6"
        }
    ],
    "first_commit": "2014-02-07 15:37:39+00:00",
    "last_commit": "2014-02-26 04:48:26+00:00",
    "number": 28,
    "pull_request": "None",
    "score": {
        "accidental_reopen_likely": false,
        "all_labels": [],
        "contains_keywords": [
            "work",
            "chang",
            "fix",
            "reason",
            "test"
        ],
        "fix_size": 54,
        "has_labels": [],
        "intersecting": {
            "computed_score": 0.125,
            "final_commit_size": 8,
            "intersection_size": 1,
            "previous_commits_size": 47
        },
        "is_makefile_based": true,
        "no_new_files": [],
        "no_other_files": true,
        "num_prohibited_files": 152700,
        "prohibited_files": [
            "server/src/main/java/com/genymobile/scrcpy/Device.java",
            "server/src/main/java/com/genymobile/scrcpy/wrappers/SurfaceControl.java",
            "server/src/main/java/com/genymobile/scrcpy/Device.java",
            "server/src/main/java/com/genymobile/scrcpy/wrappers/SurfaceControl.java",
            "app/meson.build",
            "app/scrcpy.1",
            "app/src/common.h",
            "app/src/scrcpy.h",
            "app/src/server.h",
            "server/src/main/java/com/genymobile/scrcpy/Workarounds.java"
        ],
        "reopen": true,
        "reopen_events": [
            [
                "2014-02-07 15:44:52+00:00",
                "commit"
            ],
            [
                "2014-02-07 15:55:48+00:00",
                "closed"
            ],
            [
                "2014-02-07 15:57:01+00:00",
                "reopened"
            ],
            [
                "2014-02-26 04:58:44+00:00",
                "commit"
            ],
            [
                "2014-02-26 08:20:09+00:00",
                "closed"
            ]
        ],
        "status": false,
        "strategy": true,
        "total_changes": 74
    }
}