{
    "category": [
        "memory",
        "GUI"
    ],
    "commits": [
        {
            "associated_pull_request": [],
            "date": "2019-03-19 14:04:32",
            "diff": "libvips_libvips/issue_1263/commit_16d6e995a36a8a3d8a6a8accfab171296e34aaa1.diff",
            "diff_additions": 2,
            "diff_deletions": 1,
            "diff_file_size": 30673,
            "diff_url": "https://github.com/libvips/libvips/commit/16d6e995a36a8a3d8a6a8accfab171296e34aaa1.diff",
            "exists": true,
            "files": [
                {
                    "file_additions": 2,
                    "file_deletions": 1,
                    "file_exists": true,
                    "file_name": "libvips/foreign/vipspng.c",
                    "file_size": 30673
                }
            ],
            "interesting": {
                "reopen": false,
                "status": false
            },
            "is_parent": true,
            "sha": "16d6e995a36a8a3d8a6a8accfab171296e34aaa1"
        },
        {
            "associated_pull_request": [],
            "date": "2019-03-20 12:50:44",
            "diff": "libvips_libvips/issue_1263/commit_d7f9ad8b41dfb22f3d7dde0bac2327ec00323248.diff",
            "diff_additions": 11,
            "diff_deletions": 6,
            "diff_file_size": 0,
            "diff_url": "https://github.com/libvips/libvips/commit/d7f9ad8b41dfb22f3d7dde0bac2327ec00323248.diff",
            "exists": true,
            "files": [
                {
                    "file_additions": 11,
                    "file_deletions": 6,
                    "file_exists": false,
                    "file_name": "libvips/iofuncs/base64.c",
                    "file_size": 0
                }
            ],
            "interesting": {
                "reopen": true,
                "status": false
            },
            "is_parent": false,
            "sha": "d7f9ad8b41dfb22f3d7dde0bac2327ec00323248"
        },
        {
            "associated_pull_request": [],
            "date": "2019-03-20 13:51:41",
            "diff": "libvips_libvips/issue_1263/commit_af0dc5265fbfa349e2122261f6ca5a284f68aa7f.diff",
            "diff_additions": 20,
            "diff_deletions": 0,
            "diff_file_size": 0,
            "diff_url": "https://github.com/libvips/libvips/commit/af0dc5265fbfa349e2122261f6ca5a284f68aa7f.diff",
            "exists": true,
            "files": [
                {
                    "file_additions": 20,
                    "file_deletions": 0,
                    "file_exists": false,
                    "file_name": "libvips/iofuncs/base64.c",
                    "file_size": 0
                }
            ],
            "interesting": {
                "reopen": false,
                "status": false
            },
            "is_parent": false,
            "sha": "af0dc5265fbfa349e2122261f6ca5a284f68aa7f"
        }
    ],
    "first_commit": "2019-03-19 14:04:32",
    "last_commit": "2019-03-20 13:51:41",
    "number": 1263,
    "pull_request": "None",
    "score": {
        "accidental_reopen_likely": false,
        "all_labels": [
            "bug",
            "in development"
        ],
        "contains_keywords": [
            "report",
            "error",
            "bug",
            "problem",
            "test",
            "fix",
            "remov",
            "issu",
            "work",
            "debug"
        ],
        "fix_size": 38,
        "has_labels": [
            "bug"
        ],
        "intersecting": {
            "computed_score": 0.047619047619047616,
            "final_commit_size": 21,
            "intersection_size": 1,
            "previous_commits_size": 18
        },
        "is_makefile_based": true,
        "no_new_files": [],
        "no_other_files": false,
        "num_prohibited_files": 52001,
        "prohibited_files": [
            "hal/inc/pinmap_hal.h",
            "Debug/marvin.bin",
            "Debug/marvin.elf",
            "Debug/marvin.hex",
            "Debug/marvin.bin",
            "Debug/marvin.elf",
            "Debug/marvin.hex",
            "inc/spark_utilities.h",
            "Debug/marvin.bin",
            "Debug/marvin.elf"
        ],
        "reopen": true,
        "reopen_events": [
            [
                "2019-03-20 12:52:38",
                "commit"
            ],
            [
                "2019-03-20 12:52:53",
                "closed"
            ],
            [
                "2019-03-20 13:34:21",
                "reopened"
            ],
            [
                "2019-03-20 13:52:24",
                "commit"
            ],
            [
                "2019-03-20 13:53:04",
                "closed"
            ]
        ],
        "status": false,
        "strategy": true,
        "total_changes": 40
    }
}