{
    "commits": [
        {
            "associated_pull_request": [
                "https://github.com/olikraus/u8g2/pull/2176"
            ],
            "date": "2023-05-15 07:48:29+00:00",
            "diff": "olikraus_u8g2/issue_1086/commit_61c3ae5908acf1b265b1f05f13a31a7cf6354fd7.diff",
            "diff_additions": 4,
            "diff_deletions": 0,
            "diff_file_size": 56507,
            "diff_url": "https://github.com/olikraus/u8g2/commit/61c3ae5908acf1b265b1f05f13a31a7cf6354fd7.diff",
            "exists": true,
            "files": [
                {
                    "file_additions": 4,
                    "file_deletions": 0,
                    "file_exists": true,
                    "file_name": "cppsrc/U8x8lib.cpp",
                    "file_size": 56507
                }
            ],
            "interesting": {
                "reopen": false,
                "status": false
            },
            "is_parent": true,
            "sha": "61c3ae5908acf1b265b1f05f13a31a7cf6354fd7"
        },
        {
            "associated_pull_request": [],
            "date": "2023-05-21 20:46:07+00:00",
            "diff": "olikraus_u8g2/issue_1086/commit_3db043ba45d32ec791b53d65d70508d01ab25c22.diff",
            "diff_additions": 102,
            "diff_deletions": 1,
            "diff_file_size": 110010,
            "diff_url": "https://github.com/olikraus/u8g2/commit/3db043ba45d32ec791b53d65d70508d01ab25c22.diff",
            "exists": true,
            "files": [
                {
                    "file_additions": 94,
                    "file_deletions": 1,
                    "file_exists": true,
                    "file_name": "csrc/u8x8_d_sed1330.c",
                    "file_size": 19976
                },
                {
                    "file_additions": 8,
                    "file_deletions": 0,
                    "file_exists": true,
                    "file_name": "tools/codebuild/codebuild.c",
                    "file_size": 90034
                }
            ],
            "interesting": {
                "reopen": false,
                "status": false
            },
            "is_parent": false,
            "sha": "3db043ba45d32ec791b53d65d70508d01ab25c22"
        },
        {
            "associated_pull_request": [],
            "date": "2023-05-21 20:48:00+00:00",
            "diff": "olikraus_u8g2/issue_1086/commit_e398b6b2d9b50dde8734e2b0bcc887aa231fbb00.diff",
            "diff_additions": 61,
            "diff_deletions": 0,
            "diff_file_size": 428819,
            "diff_url": "https://github.com/olikraus/u8g2/commit/e398b6b2d9b50dde8734e2b0bcc887aa231fbb00.diff",
            "exists": true,
            "files": [
                {
                    "file_additions": 33,
                    "file_deletions": 0,
                    "file_exists": true,
                    "file_name": "csrc/u8g2_d_memory.c",
                    "file_size": 35206
                },
                {
                    "file_additions": 28,
                    "file_deletions": 0,
                    "file_exists": true,
                    "file_name": "csrc/u8g2_d_setup.c",
                    "file_size": 393613
                }
            ],
            "interesting": {
                "reopen": false,
                "status": false
            },
            "is_parent": false,
            "sha": "e398b6b2d9b50dde8734e2b0bcc887aa231fbb00"
        },
        {
            "associated_pull_request": [],
            "date": "2023-06-06 19:02:04+00:00",
            "diff": "olikraus_u8g2/issue_1086/commit_a143183f0d117d57572a3646567a78900b0de75d.diff",
            "diff_additions": 13,
            "diff_deletions": 12,
            "diff_file_size": 19976,
            "diff_url": "https://github.com/olikraus/u8g2/commit/a143183f0d117d57572a3646567a78900b0de75d.diff",
            "exists": true,
            "files": [
                {
                    "file_additions": 13,
                    "file_deletions": 12,
                    "file_exists": true,
                    "file_name": "csrc/u8x8_d_sed1330.c",
                    "file_size": 19976
                }
            ],
            "interesting": {
                "reopen": false,
                "status": false
            },
            "is_parent": false,
            "sha": "a143183f0d117d57572a3646567a78900b0de75d"
        }
    ],
    "first_commit": "2023-05-15 07:48:29+00:00",
    "last_commit": "2023-06-06 19:02:04+00:00",
    "number": 1086,
    "pull_request": "None",
    "score": {
        "accidental_reopen_likely": false,
        "all_labels": [],
        "contains_keywords": [
            "confirm",
            "work",
            "chang",
            "issu",
            "test",
            "remov",
            "problem"
        ],
        "fix_size": 169,
        "has_labels": [],
        "intersecting": {
            "computed_score": 0.9473684210526315,
            "final_commit_size": 19,
            "intersection_size": 18,
            "previous_commits_size": 168
        },
        "is_makefile_based": true,
        "no_new_files": [],
        "no_other_files": false,
        "num_prohibited_files": 113088,
        "prohibited_files": [
            "server/src/main/java/com/genymobile/scrcpy/Device.java",
            "server/src/main/java/com/genymobile/scrcpy/wrappers/SurfaceControl.java",
            "server/src/main/java/com/genymobile/scrcpy/Device.java",
            "server/src/main/java/com/genymobile/scrcpy/wrappers/SurfaceControl.java",
            "app/meson.build",
            "app/scrcpy.1",
            "app/src/common.h",
            "app/src/scrcpy.h",
            "app/src/server.h",
            "server/src/main/java/com/genymobile/scrcpy/Workarounds.java"
        ],
        "reopen": true,
        "reopen_events": [
            [
                "2020-06-14 20:05:24+00:00",
                "closed"
            ],
            [
                "2023-05-19 13:59:26+00:00",
                "reopened"
            ],
            [
                "2023-05-21 20:46:39+00:00",
                "commit"
            ],
            [
                "2023-05-21 20:57:57+00:00",
                "commit"
            ],
            [
                "2023-05-21 20:57:57+00:00",
                "commit"
            ],
            [
                "2023-05-23 15:34:34+00:00",
                "closed"
            ],
            [
                "2023-05-23 15:34:41+00:00",
                "reopened"
            ],
            [
                "2023-05-24 14:50:56+00:00",
                "closed"
            ],
            [
                "2023-05-24 14:51:20+00:00",
                "reopened"
            ],
            [
                "2023-06-06 19:02:08+00:00",
                "commit"
            ],
            [
                "2023-06-06 21:17:44+00:00",
                "closed"
            ]
        ],
        "status": false,
        "strategy": true,
        "total_changes": 193
    }
}