{
    "all_issues": 156,
    "interesting_issues": 1,
    "last_update": "2023-10-31 17:55:44.096623",
    "license": {
        "download": "https://raw.githubusercontent.com/lavabit/magma/develop/LICENSE",
        "name": "GNU Affero General Public License v3.0"
    },
    "ratio": 0.00641025641025641,
    "size": 584435,
    "stars": 1814,
    "url": "https://github.com/lavabit/magma"
}