{
    "covered_issues": [
        260,
        258,
        244,
        209,
        207,
        205,
        200,
        188,
        186,
        154,
        148,
        141,
        137,
        134,
        128,
        126,
        122,
        116,
        111,
        96,
        95,
        92,
        88,
        81,
        78,
        73,
        72,
        51,
        49,
        40,
        35,
        21
    ],
    "finished": true
}