{
    "category": [
        "memory"
    ],
    "commits": [
        {
            "associated_pull_request": [],
            "date": "2016-12-31 12:01:11",
            "diff": "openssl_openssl/issue_2111/commit_04c6f2e8d54bb51fc6deae72db257798b43d43fb.diff",
            "diff_additions": 53,
            "diff_deletions": 45,
            "diff_file_size": 245759,
            "diff_url": "https://github.com/openssl/openssl/commit/04c6f2e8d54bb51fc6deae72db257798b43d43fb.diff",
            "exists": true,
            "files": [
                {
                    "file_additions": 6,
                    "file_deletions": 2,
                    "file_exists": true,
                    "file_name": "crypto/asn1/a_digest.c",
                    "file_size": 2431
                },
                {
                    "file_additions": 8,
                    "file_deletions": 5,
                    "file_exists": true,
                    "file_name": "crypto/asn1/tasn_new.c",
                    "file_size": 8468
                },
                {
                    "file_additions": 2,
                    "file_deletions": 0,
                    "file_exists": true,
                    "file_name": "crypto/evp/pmeth_lib.c",
                    "file_size": 69248
                },
                {
                    "file_additions": 12,
                    "file_deletions": 8,
                    "file_exists": true,
                    "file_name": "crypto/ex_data.c",
                    "file_size": 14244
                },
                {
                    "file_additions": 20,
                    "file_deletions": 30,
                    "file_exists": true,
                    "file_name": "crypto/x509/x_name.c",
                    "file_size": 16215
                },
                {
                    "file_additions": 5,
                    "file_deletions": 0,
                    "file_exists": true,
                    "file_name": "ssl/statem/statem_srvr.c",
                    "file_size": 135153
                }
            ],
            "interesting": {
                "reopen": false,
                "status": false
            },
            "is_parent": false,
            "sha": "04c6f2e8d54bb51fc6deae72db257798b43d43fb"
        },
        {
            "associated_pull_request": [],
            "date": "2016-12-21 10:21:36",
            "diff": "openssl_openssl/issue_2111/commit_ca8ed5756fe814e09efd453d393de371aeea2124.diff",
            "diff_additions": 138,
            "diff_deletions": 72,
            "diff_file_size": 188032,
            "diff_url": "https://github.com/openssl/openssl/commit/ca8ed5756fe814e09efd453d393de371aeea2124.diff",
            "exists": true,
            "files": [
                {
                    "file_additions": 6,
                    "file_deletions": 2,
                    "file_exists": true,
                    "file_name": "crypto/asn1/a_digest.c",
                    "file_size": 2431
                },
                {
                    "file_additions": 1,
                    "file_deletions": 0,
                    "file_exists": true,
                    "file_name": "crypto/asn1/tasn_dec.c",
                    "file_size": 37716
                },
                {
                    "file_additions": 7,
                    "file_deletions": 4,
                    "file_exists": true,
                    "file_name": "crypto/asn1/tasn_new.c",
                    "file_size": 8468
                },
                {
                    "file_additions": 21,
                    "file_deletions": 14,
                    "file_exists": false,
                    "file_name": "crypto/asn1/x_name.c",
                    "file_size": 0
                },
                {
                    "file_additions": 2,
                    "file_deletions": 0,
                    "file_exists": true,
                    "file_name": "crypto/evp/pmeth_lib.c",
                    "file_size": 69248
                },
                {
                    "file_additions": 21,
                    "file_deletions": 16,
                    "file_exists": true,
                    "file_name": "crypto/ex_data.c",
                    "file_size": 14244
                },
                {
                    "file_additions": 7,
                    "file_deletions": 4,
                    "file_exists": false,
                    "file_name": "crypto/hmac/hm_pmeth.c",
                    "file_size": 0
                },
                {
                    "file_additions": 48,
                    "file_deletions": 24,
                    "file_exists": false,
                    "file_name": "crypto/rand/md_rand.c",
                    "file_size": 0
                },
                {
                    "file_additions": 17,
                    "file_deletions": 8,
                    "file_exists": true,
                    "file_name": "crypto/x509/x509_lu.c",
                    "file_size": 25592
                },
                {
                    "file_additions": 1,
                    "file_deletions": 0,
                    "file_exists": false,
                    "file_name": "ssl/s3_clnt.c",
                    "file_size": 0
                },
                {
                    "file_additions": 1,
                    "file_deletions": 0,
                    "file_exists": false,
                    "file_name": "ssl/s3_pkt.c",
                    "file_size": 0
                },
                {
                    "file_additions": 5,
                    "file_deletions": 0,
                    "file_exists": false,
                    "file_name": "ssl/s3_srvr.c",
                    "file_size": 0
                },
                {
                    "file_additions": 1,
                    "file_deletions": 0,
                    "file_exists": true,
                    "file_name": "ssl/ssl_cert.c",
                    "file_size": 30333
                }
            ],
            "interesting": {
                "reopen": false,
                "status": false
            },
            "is_parent": false,
            "sha": "ca8ed5756fe814e09efd453d393de371aeea2124"
        },
        {
            "associated_pull_request": [],
            "date": "2017-02-01 17:29:47",
            "diff": "openssl_openssl/issue_2111/commit_c021388b04a8ca0c51d5b5f5d5a7550e0e91030a.diff",
            "diff_additions": 53,
            "diff_deletions": 45,
            "diff_file_size": 190337,
            "diff_url": "https://github.com/openssl/openssl/commit/c021388b04a8ca0c51d5b5f5d5a7550e0e91030a.diff",
            "exists": true,
            "files": [
                {
                    "file_additions": 6,
                    "file_deletions": 2,
                    "file_exists": true,
                    "file_name": "crypto/asn1/a_digest.c",
                    "file_size": 2431
                },
                {
                    "file_additions": 8,
                    "file_deletions": 5,
                    "file_exists": true,
                    "file_name": "crypto/asn1/tasn_new.c",
                    "file_size": 8468
                },
                {
                    "file_additions": 2,
                    "file_deletions": 0,
                    "file_exists": true,
                    "file_name": "crypto/evp/pmeth_lib.c",
                    "file_size": 69248
                },
                {
                    "file_additions": 12,
                    "file_deletions": 8,
                    "file_exists": true,
                    "file_name": "crypto/ex_data.c",
                    "file_size": 14244
                },
                {
                    "file_additions": 20,
                    "file_deletions": 30,
                    "file_exists": true,
                    "file_name": "crypto/x509/x_name.c",
                    "file_size": 16215
                },
                {
                    "file_additions": 5,
                    "file_deletions": 0,
                    "file_exists": true,
                    "file_name": "ssl/statem/statem_lib.c",
                    "file_size": 79731
                }
            ],
            "interesting": {
                "reopen": false,
                "status": true
            },
            "is_parent": false,
            "sha": "c021388b04a8ca0c51d5b5f5d5a7550e0e91030a"
        },
        {
            "associated_pull_request": [],
            "date": "2017-02-01 17:29:47",
            "diff": "openssl_openssl/issue_2111/commit_83b4049ab75e9da1815e9c854a9297bca3d4af6b.diff",
            "diff_additions": 53,
            "diff_deletions": 45,
            "diff_file_size": 190337,
            "diff_url": "https://github.com/openssl/openssl/commit/83b4049ab75e9da1815e9c854a9297bca3d4af6b.diff",
            "exists": true,
            "files": [
                {
                    "file_additions": 6,
                    "file_deletions": 2,
                    "file_exists": true,
                    "file_name": "crypto/asn1/a_digest.c",
                    "file_size": 2431
                },
                {
                    "file_additions": 8,
                    "file_deletions": 5,
                    "file_exists": true,
                    "file_name": "crypto/asn1/tasn_new.c",
                    "file_size": 8468
                },
                {
                    "file_additions": 2,
                    "file_deletions": 0,
                    "file_exists": true,
                    "file_name": "crypto/evp/pmeth_lib.c",
                    "file_size": 69248
                },
                {
                    "file_additions": 12,
                    "file_deletions": 8,
                    "file_exists": true,
                    "file_name": "crypto/ex_data.c",
                    "file_size": 14244
                },
                {
                    "file_additions": 20,
                    "file_deletions": 30,
                    "file_exists": true,
                    "file_name": "crypto/x509/x_name.c",
                    "file_size": 16215
                },
                {
                    "file_additions": 5,
                    "file_deletions": 0,
                    "file_exists": true,
                    "file_name": "ssl/statem/statem_lib.c",
                    "file_size": 79731
                }
            ],
            "interesting": {
                "reopen": false,
                "status": true
            },
            "is_parent": false,
            "sha": "83b4049ab75e9da1815e9c854a9297bca3d4af6b"
        },
        {
            "associated_pull_request": [],
            "date": "2016-12-21 10:21:36",
            "diff": "openssl_openssl/issue_2111/commit_748cb9a17f4f2b77aad816cf658cd4025dc847ee.diff",
            "diff_additions": 138,
            "diff_deletions": 72,
            "diff_file_size": 188032,
            "diff_url": "https://github.com/openssl/openssl/commit/748cb9a17f4f2b77aad816cf658cd4025dc847ee.diff",
            "exists": true,
            "files": [
                {
                    "file_additions": 6,
                    "file_deletions": 2,
                    "file_exists": true,
                    "file_name": "crypto/asn1/a_digest.c",
                    "file_size": 2431
                },
                {
                    "file_additions": 1,
                    "file_deletions": 0,
                    "file_exists": true,
                    "file_name": "crypto/asn1/tasn_dec.c",
                    "file_size": 37716
                },
                {
                    "file_additions": 7,
                    "file_deletions": 4,
                    "file_exists": true,
                    "file_name": "crypto/asn1/tasn_new.c",
                    "file_size": 8468
                },
                {
                    "file_additions": 21,
                    "file_deletions": 14,
                    "file_exists": false,
                    "file_name": "crypto/asn1/x_name.c",
                    "file_size": 0
                },
                {
                    "file_additions": 2,
                    "file_deletions": 0,
                    "file_exists": true,
                    "file_name": "crypto/evp/pmeth_lib.c",
                    "file_size": 69248
                },
                {
                    "file_additions": 21,
                    "file_deletions": 16,
                    "file_exists": true,
                    "file_name": "crypto/ex_data.c",
                    "file_size": 14244
                },
                {
                    "file_additions": 7,
                    "file_deletions": 4,
                    "file_exists": false,
                    "file_name": "crypto/hmac/hm_pmeth.c",
                    "file_size": 0
                },
                {
                    "file_additions": 48,
                    "file_deletions": 24,
                    "file_exists": false,
                    "file_name": "crypto/rand/md_rand.c",
                    "file_size": 0
                },
                {
                    "file_additions": 17,
                    "file_deletions": 8,
                    "file_exists": true,
                    "file_name": "crypto/x509/x509_lu.c",
                    "file_size": 25592
                },
                {
                    "file_additions": 1,
                    "file_deletions": 0,
                    "file_exists": false,
                    "file_name": "ssl/s3_clnt.c",
                    "file_size": 0
                },
                {
                    "file_additions": 1,
                    "file_deletions": 0,
                    "file_exists": false,
                    "file_name": "ssl/s3_pkt.c",
                    "file_size": 0
                },
                {
                    "file_additions": 5,
                    "file_deletions": 0,
                    "file_exists": false,
                    "file_name": "ssl/s3_srvr.c",
                    "file_size": 0
                },
                {
                    "file_additions": 1,
                    "file_deletions": 0,
                    "file_exists": true,
                    "file_name": "ssl/ssl_cert.c",
                    "file_size": 30333
                }
            ],
            "interesting": {
                "reopen": false,
                "status": false
            },
            "is_parent": false,
            "sha": "748cb9a17f4f2b77aad816cf658cd4025dc847ee"
        }
    ],
    "first_commit": "2017-02-01 07:13:12",
    "last_commit": "2017-02-06 21:06:39",
    "number": 2111,
    "pull_request": "None",
    "score": {
        "accidental_reopen_likely": false,
        "all_labels": [],
        "contains_keywords": [
            "fail",
            "chang",
            "error",
            "patch",
            "issu",
            "work",
            "leak"
        ],
        "fix_size": 288,
        "has_labels": [],
        "intersecting": {
            "computed_score": 1.0,
            "final_commit_size": 195,
            "intersection_size": 195,
            "previous_commits_size": 288
        },
        "is_makefile_based": false,
        "no_new_files": [],
        "no_other_files": true,
        "num_prohibited_files": 154224,
        "prohibited_files": [
            "hal/inc/pinmap_hal.h",
            "Debug/marvin.bin",
            "Debug/marvin.elf",
            "Debug/marvin.hex",
            "Debug/marvin.bin",
            "Debug/marvin.elf",
            "Debug/marvin.hex",
            "inc/spark_utilities.h",
            "Debug/marvin.bin",
            "Debug/marvin.elf"
        ],
        "reopen": false,
        "reopen_events": [
            [
                "2016-12-21 11:15:56",
                "commit"
            ],
            [
                "2016-12-31 23:39:09",
                "commit"
            ],
            [
                "2017-01-31 08:56:09",
                "commit"
            ],
            [
                "2017-02-01 07:15:38",
                "commit"
            ],
            [
                "2017-02-01 07:43:28",
                "commit"
            ],
            [
                "2017-02-01 17:51:27",
                "commit"
            ],
            [
                "2017-02-03 19:40:58",
                "commit"
            ],
            [
                "2017-02-04 23:59:02",
                "commit"
            ],
            [
                "2017-02-06 21:16:37",
                "commit"
            ],
            [
                "2017-02-07 15:14:30",
                "closed"
            ]
        ],
        "status": true,
        "strategy": true,
        "total_changes": 714
    }
}