{
    "commits": [
        {
            "diff": "elastic_elasticsearch/issue_39842/commit_1a915446037ab83ae292df8733e7ba7d63bb667e.diff",
            "diff_additions": 40,
            "diff_deletions": 2,
            "diff_file_size": 14484,
            "files": [
                {
                    "file_additions": 3,
                    "file_deletions": 2,
                    "file_exists": true,
                    "file_name": "server/src/main/java/org/elasticsearch/action/search/SearchPhaseExecutionException.java",
                    "file_size": 6705
                },
                {
                    "file_additions": 37,
                    "file_deletions": 0,
                    "file_exists": true,
                    "file_name": "server/src/test/java/org/elasticsearch/action/search/SearchPhaseExecutionExceptionTests.java",
                    "file_size": 7779
                }
            ],
            "interesting": {
                "reopened": false,
                "status": false
            },
            "sha": "1a915446037ab83ae292df8733e7ba7d63bb667e"
        },
        {
            "diff": "elastic_elasticsearch/issue_39842/commit_582c81ac627297e930a29dadc07ae7691f003a09.diff",
            "diff_additions": 174,
            "diff_deletions": 6,
            "diff_file_size": 111224,
            "files": [
                {
                    "file_additions": 5,
                    "file_deletions": 0,
                    "file_exists": true,
                    "file_name": "x-pack/plugin/core/src/main/java/org/elasticsearch/xpack/core/ml/datafeed/extractor/DataExtractor.java",
                    "file_size": 1253
                },
                {
                    "file_additions": 139,
                    "file_deletions": 0,
                    "file_exists": false,
                    "file_name": "x-pack/plugin/ml/qa/native-multi-node-tests/src/test/java/org/elasticsearch/xpack/ml/integration/DatafeedWithAggsIT.java",
                    "file_size": 0
                },
                {
                    "file_additions": 1,
                    "file_deletions": 1,
                    "file_exists": true,
                    "file_name": "x-pack/plugin/ml/src/main/java/org/elasticsearch/xpack/ml/datafeed/DatafeedJob.java",
                    "file_size": 23633
                },
                {
                    "file_additions": 5,
                    "file_deletions": 0,
                    "file_exists": true,
                    "file_name": "x-pack/plugin/ml/src/main/java/org/elasticsearch/xpack/ml/datafeed/extractor/aggregation/AbstractAggregationDataExtractor.java",
                    "file_size": 6939
                },
                {
                    "file_additions": 6,
                    "file_deletions": 1,
                    "file_exists": true,
                    "file_name": "x-pack/plugin/ml/src/main/java/org/elasticsearch/xpack/ml/datafeed/extractor/chunked/ChunkedDataExtractor.java",
                    "file_size": 14534
                },
                {
                    "file_additions": 5,
                    "file_deletions": 0,
                    "file_exists": true,
                    "file_name": "x-pack/plugin/ml/src/main/java/org/elasticsearch/xpack/ml/datafeed/extractor/scroll/ScrollDataExtractor.java",
                    "file_size": 10110
                },
                {
                    "file_additions": 8,
                    "file_deletions": 4,
                    "file_exists": true,
                    "file_name": "x-pack/plugin/ml/src/test/java/org/elasticsearch/xpack/ml/datafeed/DatafeedJobTests.java",
                    "file_size": 28194
                },
                {
                    "file_additions": 5,
                    "file_deletions": 0,
                    "file_exists": true,
                    "file_name": "x-pack/plugin/ml/src/test/java/org/elasticsearch/xpack/ml/datafeed/extractor/chunked/ChunkedDataExtractorTests.java",
                    "file_size": 26561
                }
            ],
            "interesting": {
                "reopened": false,
                "status": false
            },
            "sha": "582c81ac627297e930a29dadc07ae7691f003a09"
        },
        {
            "diff": "elastic_elasticsearch/issue_39842/commit_fb412db63925a95fe5b199b6fabb640f137863b9.diff",
            "diff_additions": 174,
            "diff_deletions": 6,
            "diff_file_size": 111224,
            "files": [
                {
                    "file_additions": 5,
                    "file_deletions": 0,
                    "file_exists": true,
                    "file_name": "x-pack/plugin/core/src/main/java/org/elasticsearch/xpack/core/ml/datafeed/extractor/DataExtractor.java",
                    "file_size": 1253
                },
                {
                    "file_additions": 139,
                    "file_deletions": 0,
                    "file_exists": false,
                    "file_name": "x-pack/plugin/ml/qa/native-multi-node-tests/src/test/java/org/elasticsearch/xpack/ml/integration/DatafeedWithAggsIT.java",
                    "file_size": 0
                },
                {
                    "file_additions": 1,
                    "file_deletions": 1,
                    "file_exists": true,
                    "file_name": "x-pack/plugin/ml/src/main/java/org/elasticsearch/xpack/ml/datafeed/DatafeedJob.java",
                    "file_size": 23633
                },
                {
                    "file_additions": 5,
                    "file_deletions": 0,
                    "file_exists": true,
                    "file_name": "x-pack/plugin/ml/src/main/java/org/elasticsearch/xpack/ml/datafeed/extractor/aggregation/AbstractAggregationDataExtractor.java",
                    "file_size": 6939
                },
                {
                    "file_additions": 6,
                    "file_deletions": 1,
                    "file_exists": true,
                    "file_name": "x-pack/plugin/ml/src/main/java/org/elasticsearch/xpack/ml/datafeed/extractor/chunked/ChunkedDataExtractor.java",
                    "file_size": 14534
                },
                {
                    "file_additions": 5,
                    "file_deletions": 0,
                    "file_exists": true,
                    "file_name": "x-pack/plugin/ml/src/main/java/org/elasticsearch/xpack/ml/datafeed/extractor/scroll/ScrollDataExtractor.java",
                    "file_size": 10110
                },
                {
                    "file_additions": 8,
                    "file_deletions": 4,
                    "file_exists": true,
                    "file_name": "x-pack/plugin/ml/src/test/java/org/elasticsearch/xpack/ml/datafeed/DatafeedJobTests.java",
                    "file_size": 28194
                },
                {
                    "file_additions": 5,
                    "file_deletions": 0,
                    "file_exists": true,
                    "file_name": "x-pack/plugin/ml/src/test/java/org/elasticsearch/xpack/ml/datafeed/extractor/chunked/ChunkedDataExtractorTests.java",
                    "file_size": 26561
                }
            ],
            "interesting": {
                "reopened": false,
                "status": false
            },
            "sha": "fb412db63925a95fe5b199b6fabb640f137863b9"
        },
        {
            "diff": "elastic_elasticsearch/issue_39842/commit_c083ded535e958ad8168afc2eca508e34600710c.diff",
            "diff_additions": 174,
            "diff_deletions": 6,
            "diff_file_size": 111224,
            "files": [
                {
                    "file_additions": 5,
                    "file_deletions": 0,
                    "file_exists": true,
                    "file_name": "x-pack/plugin/core/src/main/java/org/elasticsearch/xpack/core/ml/datafeed/extractor/DataExtractor.java",
                    "file_size": 1253
                },
                {
                    "file_additions": 139,
                    "file_deletions": 0,
                    "file_exists": false,
                    "file_name": "x-pack/plugin/ml/qa/native-multi-node-tests/src/test/java/org/elasticsearch/xpack/ml/integration/DatafeedWithAggsIT.java",
                    "file_size": 0
                },
                {
                    "file_additions": 1,
                    "file_deletions": 1,
                    "file_exists": true,
                    "file_name": "x-pack/plugin/ml/src/main/java/org/elasticsearch/xpack/ml/datafeed/DatafeedJob.java",
                    "file_size": 23633
                },
                {
                    "file_additions": 5,
                    "file_deletions": 0,
                    "file_exists": true,
                    "file_name": "x-pack/plugin/ml/src/main/java/org/elasticsearch/xpack/ml/datafeed/extractor/aggregation/AbstractAggregationDataExtractor.java",
                    "file_size": 6939
                },
                {
                    "file_additions": 6,
                    "file_deletions": 1,
                    "file_exists": true,
                    "file_name": "x-pack/plugin/ml/src/main/java/org/elasticsearch/xpack/ml/datafeed/extractor/chunked/ChunkedDataExtractor.java",
                    "file_size": 14534
                },
                {
                    "file_additions": 5,
                    "file_deletions": 0,
                    "file_exists": true,
                    "file_name": "x-pack/plugin/ml/src/main/java/org/elasticsearch/xpack/ml/datafeed/extractor/scroll/ScrollDataExtractor.java",
                    "file_size": 10110
                },
                {
                    "file_additions": 8,
                    "file_deletions": 4,
                    "file_exists": true,
                    "file_name": "x-pack/plugin/ml/src/test/java/org/elasticsearch/xpack/ml/datafeed/DatafeedJobTests.java",
                    "file_size": 28194
                },
                {
                    "file_additions": 5,
                    "file_deletions": 0,
                    "file_exists": true,
                    "file_name": "x-pack/plugin/ml/src/test/java/org/elasticsearch/xpack/ml/datafeed/extractor/chunked/ChunkedDataExtractorTests.java",
                    "file_size": 26561
                }
            ],
            "interesting": {
                "reopened": false,
                "status": false
            },
            "sha": "c083ded535e958ad8168afc2eca508e34600710c"
        },
        {
            "diff": "elastic_elasticsearch/issue_39842/commit_5b01e3e90afd1458b6360d1a28a29ae3f35828ef.diff",
            "diff_additions": 174,
            "diff_deletions": 6,
            "diff_file_size": 111224,
            "files": [
                {
                    "file_additions": 5,
                    "file_deletions": 0,
                    "file_exists": true,
                    "file_name": "x-pack/plugin/core/src/main/java/org/elasticsearch/xpack/core/ml/datafeed/extractor/DataExtractor.java",
                    "file_size": 1253
                },
                {
                    "file_additions": 139,
                    "file_deletions": 0,
                    "file_exists": false,
                    "file_name": "x-pack/plugin/ml/qa/native-multi-node-tests/src/test/java/org/elasticsearch/xpack/ml/integration/DatafeedWithAggsIT.java",
                    "file_size": 0
                },
                {
                    "file_additions": 1,
                    "file_deletions": 1,
                    "file_exists": true,
                    "file_name": "x-pack/plugin/ml/src/main/java/org/elasticsearch/xpack/ml/datafeed/DatafeedJob.java",
                    "file_size": 23633
                },
                {
                    "file_additions": 5,
                    "file_deletions": 0,
                    "file_exists": true,
                    "file_name": "x-pack/plugin/ml/src/main/java/org/elasticsearch/xpack/ml/datafeed/extractor/aggregation/AbstractAggregationDataExtractor.java",
                    "file_size": 6939
                },
                {
                    "file_additions": 6,
                    "file_deletions": 1,
                    "file_exists": true,
                    "file_name": "x-pack/plugin/ml/src/main/java/org/elasticsearch/xpack/ml/datafeed/extractor/chunked/ChunkedDataExtractor.java",
                    "file_size": 14534
                },
                {
                    "file_additions": 5,
                    "file_deletions": 0,
                    "file_exists": true,
                    "file_name": "x-pack/plugin/ml/src/main/java/org/elasticsearch/xpack/ml/datafeed/extractor/scroll/ScrollDataExtractor.java",
                    "file_size": 10110
                },
                {
                    "file_additions": 8,
                    "file_deletions": 4,
                    "file_exists": true,
                    "file_name": "x-pack/plugin/ml/src/test/java/org/elasticsearch/xpack/ml/datafeed/DatafeedJobTests.java",
                    "file_size": 28194
                },
                {
                    "file_additions": 5,
                    "file_deletions": 0,
                    "file_exists": true,
                    "file_name": "x-pack/plugin/ml/src/test/java/org/elasticsearch/xpack/ml/datafeed/extractor/chunked/ChunkedDataExtractorTests.java",
                    "file_size": 26561
                }
            ],
            "interesting": {
                "reopened": false,
                "status": false
            },
            "sha": "5b01e3e90afd1458b6360d1a28a29ae3f35828ef"
        }
    ],
    "first_commit": "2019-03-08 16:08:55",
    "last_commit": "2019-03-18 18:45:37",
    "number": 39842,
    "score": 352.005249343832
}