{
    "commits": [
        {
            "associated_pull_request": [],
            "date": "2020-02-29 12:04:58+00:00",
            "diff": "zephyrproject-rtos_zephyr/issue_23178/commit_2a3874fc54f1445ff5252be9ca4baa450aa4da80.diff",
            "diff_additions": 5,
            "diff_deletions": 0,
            "diff_file_size": 28704,
            "diff_url": "https://github.com/zephyrproject-rtos/zephyr/commit/2a3874fc54f1445ff5252be9ca4baa450aa4da80.diff",
            "exists": true,
            "files": [
                {
                    "file_additions": 5,
                    "file_deletions": 0,
                    "file_exists": true,
                    "file_name": "drivers/usb/device/usb_dc_stm32.c",
                    "file_size": 28704
                }
            ],
            "interesting": {
                "reopen": false,
                "status": false
            },
            "is_parent": false,
            "sha": "2a3874fc54f1445ff5252be9ca4baa450aa4da80"
        },
        {
            "associated_pull_request": [
                "https://github.com/zephyrproject-rtos/zephyr/pull/23179"
            ],
            "date": "2020-02-29 12:04:58+00:00",
            "diff": "zephyrproject-rtos_zephyr/issue_23178/commit_169f281e3c069d37617bc18ac6b9b843ce288669.diff",
            "diff_additions": 15,
            "diff_deletions": 10,
            "diff_file_size": 28704,
            "diff_url": "https://github.com/zephyrproject-rtos/zephyr/commit/169f281e3c069d37617bc18ac6b9b843ce288669.diff",
            "exists": true,
            "files": [
                {
                    "file_additions": 15,
                    "file_deletions": 10,
                    "file_exists": true,
                    "file_name": "drivers/usb/device/usb_dc_stm32.c",
                    "file_size": 28704
                }
            ],
            "interesting": {
                "reopen": false,
                "status": false
            },
            "is_parent": false,
            "sha": "169f281e3c069d37617bc18ac6b9b843ce288669"
        },
        {
            "associated_pull_request": [
                "https://github.com/zephyrproject-rtos/zephyr/pull/23179"
            ],
            "date": "2020-02-29 12:04:58+00:00",
            "diff": "zephyrproject-rtos_zephyr/issue_23178/commit_c4a7d96c04ed36ed752ab09400295392532c68af.diff",
            "diff_additions": 15,
            "diff_deletions": 10,
            "diff_file_size": 28704,
            "diff_url": "https://github.com/zephyrproject-rtos/zephyr/commit/c4a7d96c04ed36ed752ab09400295392532c68af.diff",
            "exists": true,
            "files": [
                {
                    "file_additions": 15,
                    "file_deletions": 10,
                    "file_exists": true,
                    "file_name": "drivers/usb/device/usb_dc_stm32.c",
                    "file_size": 28704
                }
            ],
            "interesting": {
                "reopen": false,
                "status": false
            },
            "is_parent": false,
            "sha": "c4a7d96c04ed36ed752ab09400295392532c68af"
        },
        {
            "associated_pull_request": [],
            "date": "2020-02-29 12:04:58+00:00",
            "diff": "zephyrproject-rtos_zephyr/issue_23178/commit_15e466580e7e2af0c6f3d908fcb9848bff25251f.diff",
            "diff_additions": 15,
            "diff_deletions": 10,
            "diff_file_size": 28704,
            "diff_url": "https://github.com/zephyrproject-rtos/zephyr/commit/15e466580e7e2af0c6f3d908fcb9848bff25251f.diff",
            "exists": true,
            "files": [
                {
                    "file_additions": 15,
                    "file_deletions": 10,
                    "file_exists": true,
                    "file_name": "drivers/usb/device/usb_dc_stm32.c",
                    "file_size": 28704
                }
            ],
            "interesting": {
                "reopen": true,
                "status": false
            },
            "is_parent": false,
            "sha": "15e466580e7e2af0c6f3d908fcb9848bff25251f"
        },
        {
            "associated_pull_request": [
                "https://github.com/zephyrproject-rtos/zephyr/pull/26288"
            ],
            "date": "2020-06-09 19:14:32+00:00",
            "diff": "zephyrproject-rtos_zephyr/issue_23178/commit_7ba33ef23c00b6b3f5d9dbdfb266652c73ab0f5e.diff",
            "diff_additions": 23,
            "diff_deletions": 14,
            "diff_file_size": 18011,
            "diff_url": "https://github.com/zephyrproject-rtos/zephyr/commit/7ba33ef23c00b6b3f5d9dbdfb266652c73ab0f5e.diff",
            "exists": true,
            "files": [
                {
                    "file_additions": 23,
                    "file_deletions": 14,
                    "file_exists": true,
                    "file_name": "drivers/usb/device/usb_dc_sam0.c",
                    "file_size": 18011
                }
            ],
            "interesting": {
                "reopen": false,
                "status": false
            },
            "is_parent": false,
            "sha": "7ba33ef23c00b6b3f5d9dbdfb266652c73ab0f5e"
        },
        {
            "associated_pull_request": [
                "https://github.com/zephyrproject-rtos/zephyr/pull/26288"
            ],
            "date": "2020-06-09 19:14:32+00:00",
            "diff": "zephyrproject-rtos_zephyr/issue_23178/commit_dcf64c93e3630ec455aa5014e26853c9307d871e.diff",
            "diff_additions": 23,
            "diff_deletions": 14,
            "diff_file_size": 18011,
            "diff_url": "https://github.com/zephyrproject-rtos/zephyr/commit/dcf64c93e3630ec455aa5014e26853c9307d871e.diff",
            "exists": true,
            "files": [
                {
                    "file_additions": 23,
                    "file_deletions": 14,
                    "file_exists": true,
                    "file_name": "drivers/usb/device/usb_dc_sam0.c",
                    "file_size": 18011
                }
            ],
            "interesting": {
                "reopen": false,
                "status": false
            },
            "is_parent": false,
            "sha": "dcf64c93e3630ec455aa5014e26853c9307d871e"
        },
        {
            "associated_pull_request": [],
            "date": "2020-06-09 19:14:32+00:00",
            "diff": "zephyrproject-rtos_zephyr/issue_23178/commit_02f5af726523e826998fecc4472ebe492164b1c6.diff",
            "diff_additions": 15,
            "diff_deletions": 13,
            "diff_file_size": 18011,
            "diff_url": "https://github.com/zephyrproject-rtos/zephyr/commit/02f5af726523e826998fecc4472ebe492164b1c6.diff",
            "exists": true,
            "files": [
                {
                    "file_additions": 15,
                    "file_deletions": 13,
                    "file_exists": true,
                    "file_name": "drivers/usb/device/usb_dc_sam0.c",
                    "file_size": 18011
                }
            ],
            "interesting": {
                "reopen": false,
                "status": false
            },
            "is_parent": false,
            "sha": "02f5af726523e826998fecc4472ebe492164b1c6"
        }
    ],
    "first_commit": "2020-02-29 14:14:31+00:00",
    "last_commit": "2020-07-01 08:33:19+00:00",
    "number": 23178,
    "pull_request": "None",
    "score": {
        "accidental_reopen_likely": false,
        "all_labels": [
            "bug",
            "priority: low",
            "area: Drivers",
            "area: USB",
            "platform: Microchip SAM"
        ],
        "contains_keywords": [
            "work",
            "fix",
            "issu",
            "patch",
            "test",
            "leak"
        ],
        "fix_size": 55,
        "has_labels": [
            "bug"
        ],
        "intersecting": {
            "computed_score": 0.875,
            "final_commit_size": 24,
            "intersection_size": 21,
            "previous_commits_size": 52
        },
        "is_makefile_based": true,
        "no_new_files": [],
        "no_other_files": false,
        "num_prohibited_files": 86883,
        "prohibited_files": [
            "server/src/main/java/com/genymobile/scrcpy/Device.java",
            "server/src/main/java/com/genymobile/scrcpy/wrappers/SurfaceControl.java",
            "server/src/main/java/com/genymobile/scrcpy/Device.java",
            "server/src/main/java/com/genymobile/scrcpy/wrappers/SurfaceControl.java",
            "app/meson.build",
            "app/scrcpy.1",
            "app/src/common.h",
            "app/src/scrcpy.h",
            "app/src/server.h",
            "server/src/main/java/com/genymobile/scrcpy/Workarounds.java"
        ],
        "reopen": true,
        "reopen_events": [
            [
                "2020-02-29 12:53:17+00:00",
                "commit"
            ],
            [
                "2020-02-29 12:54:05+00:00",
                "commit"
            ],
            [
                "2020-02-29 14:11:46+00:00",
                "commit"
            ],
            [
                "2020-03-01 08:38:22+00:00",
                "commit"
            ],
            [
                "2020-03-03 06:54:07+00:00",
                "commit"
            ],
            [
                "2020-03-10 16:32:50+00:00",
                "commit"
            ],
            [
                "2020-03-13 10:14:47+00:00",
                "commit"
            ],
            [
                "2020-03-18 17:42:50+00:00",
                "commit"
            ],
            [
                "2020-05-14 14:42:19+00:00",
                "closed"
            ],
            [
                "2020-05-15 08:31:36+00:00",
                "reopened"
            ],
            [
                "2020-06-09 19:22:52+00:00",
                "commit"
            ],
            [
                "2020-06-12 20:14:18+00:00",
                "commit"
            ],
            [
                "2020-06-13 13:42:05+00:00",
                "commit"
            ],
            [
                "2020-06-18 20:19:22+00:00",
                "commit"
            ],
            [
                "2020-06-18 20:24:30+00:00",
                "commit"
            ],
            [
                "2020-06-18 20:26:01+00:00",
                "commit"
            ],
            [
                "2020-06-23 17:52:44+00:00",
                "commit"
            ],
            [
                "2020-06-25 17:57:35+00:00",
                "commit"
            ],
            [
                "2020-06-25 18:24:11+00:00",
                "commit"
            ],
            [
                "2020-07-06 13:58:22+00:00",
                "closed"
            ],
            [
                "2020-07-06 13:58:24+00:00",
                "commit"
            ],
            [
                "2020-07-12 11:26:31+00:00",
                "commit"
            ],
            [
                "2020-10-29 08:18:01+00:00",
                "commit"
            ]
        ],
        "status": false,
        "strategy": true,
        "total_changes": 182
    }
}