{
    "all_issues": 3620,
    "interesting_issues": 6,
    "last_update": "2023-10-30 22:04:52.527735",
    "license": {
        "download": "https://raw.githubusercontent.com/kamailio/kamailio/master/COPYING",
        "name": "Other"
    },
    "ratio": 0.0016574585635359116,
    "size": 103177,
    "stars": 1986,
    "url": "https://github.com/kamailio/kamailio"
}