{
    "covered_issues": [
        556,
        536,
        529,
        520,
        512,
        507,
        505,
        497,
        474,
        470,
        469,
        468,
        467,
        466,
        438,
        416,
        404,
        403,
        402,
        396,
        394,
        393,
        389,
        386,
        385,
        383,
        381,
        380,
        378,
        377,
        376,
        375,
        371,
        369,
        364,
        362,
        359,
        353,
        350,
        348,
        345,
        342,
        337,
        335,
        327,
        326,
        319,
        306,
        300,
        297,
        294,
        271,
        251,
        249,
        247,
        244,
        243,
        237,
        236,
        226,
        220,
        218,
        217,
        216,
        206,
        195,
        193,
        190,
        181,
        171,
        170,
        168,
        159,
        152,
        144,
        135,
        119,
        105,
        98,
        94,
        92,
        89,
        88,
        87,
        85,
        84,
        82,
        81,
        80,
        79,
        78,
        77,
        76,
        75,
        74,
        73,
        71,
        70,
        68,
        67,
        65,
        64,
        63,
        62,
        60,
        59,
        58,
        52,
        50,
        48,
        47,
        46,
        45,
        44,
        43,
        42,
        41,
        40,
        39,
        37,
        36,
        33,
        32,
        31,
        29,
        28,
        27,
        26,
        25,
        24,
        20,
        15,
        14,
        13,
        12,
        11,
        10,
        9,
        8,
        7,
        6,
        5,
        4,
        3,
        2,
        1
    ],
    "finished": true
}