{
    "category": [
        "memory",
        "build/refactor/preprocessing"
    ],
    "commits": [
        {
            "associated_pull_request": [],
            "date": "2016-12-11 20:42:47",
            "diff": "radareorg_radare2/issue_6307/commit_356d0725d2a104c041cafb51f17a4676b212bddf.diff",
            "diff_additions": 1,
            "diff_deletions": 0,
            "diff_file_size": 114196,
            "diff_url": "https://github.com/radareorg/radare2/commit/356d0725d2a104c041cafb51f17a4676b212bddf.diff",
            "exists": true,
            "files": [
                {
                    "file_additions": 1,
                    "file_deletions": 0,
                    "file_exists": true,
                    "file_name": "libr/core/cmd_search.c",
                    "file_size": 114196
                }
            ],
            "interesting": {
                "reopen": false,
                "status": false
            },
            "is_parent": true,
            "sha": "356d0725d2a104c041cafb51f17a4676b212bddf"
        },
        {
            "associated_pull_request": [],
            "date": "2016-12-11 22:19:54",
            "diff": "radareorg_radare2/issue_6307/commit_4598fc34ca8bd2f6eb5d842f7cc0b363481b198e.diff",
            "diff_additions": 6,
            "diff_deletions": 4,
            "diff_file_size": 102260,
            "diff_url": "https://github.com/radareorg/radare2/commit/4598fc34ca8bd2f6eb5d842f7cc0b363481b198e.diff",
            "exists": true,
            "files": [
                {
                    "file_additions": 6,
                    "file_deletions": 4,
                    "file_exists": true,
                    "file_name": "libr/anal/esil.c",
                    "file_size": 102260
                }
            ],
            "interesting": {
                "reopen": true,
                "status": false
            },
            "is_parent": false,
            "sha": "4598fc34ca8bd2f6eb5d842f7cc0b363481b198e"
        },
        {
            "associated_pull_request": [],
            "date": "2016-12-12 16:29:50",
            "diff": "radareorg_radare2/issue_6307/commit_bf697820a496c45e92affb90ea960ce930a97e33.diff",
            "diff_additions": 34,
            "diff_deletions": 19,
            "diff_file_size": 418155,
            "diff_url": "https://github.com/radareorg/radare2/commit/bf697820a496c45e92affb90ea960ce930a97e33.diff",
            "exists": true,
            "files": [
                {
                    "file_additions": 30,
                    "file_deletions": 15,
                    "file_exists": true,
                    "file_name": "libr/anal/esil.c",
                    "file_size": 102260
                },
                {
                    "file_additions": 4,
                    "file_deletions": 4,
                    "file_exists": true,
                    "file_name": "libr/core/cmd_anal.c",
                    "file_size": 315895
                }
            ],
            "interesting": {
                "reopen": false,
                "status": false
            },
            "is_parent": false,
            "sha": "bf697820a496c45e92affb90ea960ce930a97e33"
        },
        {
            "associated_pull_request": [],
            "date": "2016-12-12 16:29:50",
            "diff": "radareorg_radare2/issue_6307/commit_692f08549b4351a89e64abe5547ece86d145468a.diff",
            "diff_additions": 34,
            "diff_deletions": 19,
            "diff_file_size": 418155,
            "diff_url": "https://github.com/radareorg/radare2/commit/692f08549b4351a89e64abe5547ece86d145468a.diff",
            "exists": true,
            "files": [
                {
                    "file_additions": 30,
                    "file_deletions": 15,
                    "file_exists": true,
                    "file_name": "libr/anal/esil.c",
                    "file_size": 102260
                },
                {
                    "file_additions": 4,
                    "file_deletions": 4,
                    "file_exists": true,
                    "file_name": "libr/core/cmd_anal.c",
                    "file_size": 315895
                }
            ],
            "interesting": {
                "reopen": false,
                "status": false
            },
            "is_parent": false,
            "sha": "692f08549b4351a89e64abe5547ece86d145468a"
        },
        {
            "associated_pull_request": [],
            "date": "2016-12-12 16:29:50",
            "diff": "radareorg_radare2/issue_6307/commit_c6582aec2c78d1d59b9131bda8a98d28a0ea0366.diff",
            "diff_additions": 34,
            "diff_deletions": 19,
            "diff_file_size": 418155,
            "diff_url": "https://github.com/radareorg/radare2/commit/c6582aec2c78d1d59b9131bda8a98d28a0ea0366.diff",
            "exists": true,
            "files": [
                {
                    "file_additions": 30,
                    "file_deletions": 15,
                    "file_exists": true,
                    "file_name": "libr/anal/esil.c",
                    "file_size": 102260
                },
                {
                    "file_additions": 4,
                    "file_deletions": 4,
                    "file_exists": true,
                    "file_name": "libr/core/cmd_anal.c",
                    "file_size": 315895
                }
            ],
            "interesting": {
                "reopen": false,
                "status": false
            },
            "is_parent": false,
            "sha": "c6582aec2c78d1d59b9131bda8a98d28a0ea0366"
        }
    ],
    "first_commit": "2016-12-11 20:42:47",
    "last_commit": "2017-01-17 06:38:26",
    "number": 6307,
    "pull_request": "None",
    "score": {
        "accidental_reopen_likely": false,
        "all_labels": [
            "AVR",
            "bug",
            "test-required"
        ],
        "contains_keywords": [
            "fail",
            "chang",
            "bug",
            "crash",
            "fix",
            "issu",
            "fault",
            "leak",
            "debug"
        ],
        "fix_size": 56,
        "has_labels": [
            "bug"
        ],
        "intersecting": {
            "computed_score": 1.0,
            "final_commit_size": 50,
            "intersection_size": 50,
            "previous_commits_size": 56
        },
        "is_makefile_based": true,
        "no_new_files": [],
        "no_other_files": true,
        "num_prohibited_files": 107674,
        "prohibited_files": [
            "hal/inc/pinmap_hal.h",
            "Debug/marvin.bin",
            "Debug/marvin.elf",
            "Debug/marvin.hex",
            "Debug/marvin.bin",
            "Debug/marvin.elf",
            "Debug/marvin.hex",
            "inc/spark_utilities.h",
            "Debug/marvin.bin",
            "Debug/marvin.elf"
        ],
        "reopen": true,
        "reopen_events": [
            [
                "2016-12-11 22:20:16",
                "closed"
            ],
            [
                "2016-12-11 22:20:16",
                "commit"
            ],
            [
                "2016-12-12 10:02:54",
                "reopened"
            ],
            [
                "2016-12-12 16:29:57",
                "commit"
            ],
            [
                "2016-12-12 17:42:35",
                "closed"
            ],
            [
                "2016-12-14 17:23:34",
                "commit"
            ],
            [
                "2016-12-14 17:23:34",
                "commit"
            ],
            [
                "2017-01-17 06:41:14",
                "commit"
            ],
            [
                "2017-01-17 06:41:14",
                "commit"
            ]
        ],
        "status": false,
        "strategy": true,
        "total_changes": 170
    }
}