{
    "all_issues": 2146,
    "interesting_issues": 3,
    "last_update": "2023-10-27 09:14:32.382665",
    "license": {
        "download": "undefined",
        "name": "unknown"
    },
    "ratio": 0.0013979496738117428,
    "size": 10885,
    "stars": 3266,
    "url": "https://github.com/openrazer/openrazer"
}