{
    "commits": [
        {
            "associated_pull_request": [
                "https://github.com/jemalloc/jemalloc/pull/2463"
            ],
            "date": "2023-06-10 00:37:47+00:00",
            "diff": "jemalloc_jemalloc/issue_2449/commit_41e0b857bef0b787a581c7a8334b46981d5e06ed.diff",
            "diff_additions": 0,
            "diff_deletions": 16,
            "diff_file_size": 4337,
            "diff_url": "https://github.com/jemalloc/jemalloc/commit/41e0b857bef0b787a581c7a8334b46981d5e06ed.diff",
            "exists": true,
            "files": [
                {
                    "file_additions": 0,
                    "file_deletions": 8,
                    "file_exists": true,
                    "file_name": "test/integration/MALLOCX_ARENA.c",
                    "file_size": 1359
                },
                {
                    "file_additions": 0,
                    "file_deletions": 8,
                    "file_exists": true,
                    "file_name": "test/integration/allocated.c",
                    "file_size": 2978
                }
            ],
            "interesting": {
                "reopen": false,
                "status": false
            },
            "is_parent": true,
            "sha": "41e0b857bef0b787a581c7a8334b46981d5e06ed"
        },
        {
            "associated_pull_request": [],
            "date": "2023-07-17 22:22:26+00:00",
            "diff": "jemalloc_jemalloc/issue_2449/commit_bd355c03d00f51d36c63b1516c8a1d5728d2bd1d.diff",
            "diff_additions": 10,
            "diff_deletions": 0,
            "diff_file_size": 32504,
            "diff_url": "https://github.com/jemalloc/jemalloc/commit/bd355c03d00f51d36c63b1516c8a1d5728d2bd1d.diff",
            "exists": true,
            "files": [
                {
                    "file_additions": 10,
                    "file_deletions": 0,
                    "file_exists": true,
                    "file_name": "src/hpa.c",
                    "file_size": 32504
                }
            ],
            "interesting": {
                "reopen": false,
                "status": false
            },
            "is_parent": false,
            "sha": "bd355c03d00f51d36c63b1516c8a1d5728d2bd1d"
        },
        {
            "associated_pull_request": [],
            "date": "2023-07-17 22:22:26+00:00",
            "diff": "jemalloc_jemalloc/issue_2449/commit_3d3445a1a9def9118c66360815d2843f0ea38652.diff",
            "diff_additions": 39,
            "diff_deletions": 0,
            "diff_file_size": 120194,
            "diff_url": "https://github.com/jemalloc/jemalloc/commit/3d3445a1a9def9118c66360815d2843f0ea38652.diff",
            "exists": true,
            "files": [
                {
                    "file_additions": 39,
                    "file_deletions": 0,
                    "file_exists": true,
                    "file_name": "src/jemalloc.c",
                    "file_size": 120194
                }
            ],
            "interesting": {
                "reopen": false,
                "status": false
            },
            "is_parent": false,
            "sha": "3d3445a1a9def9118c66360815d2843f0ea38652"
        },
        {
            "associated_pull_request": [],
            "date": "2023-07-17 22:22:26+00:00",
            "diff": "jemalloc_jemalloc/issue_2449/commit_9f1d5df8c41bee0dd1b13eb09ad50bb8b0f08703.diff",
            "diff_additions": 87,
            "diff_deletions": 1,
            "diff_file_size": 122082,
            "diff_url": "https://github.com/jemalloc/jemalloc/commit/9f1d5df8c41bee0dd1b13eb09ad50bb8b0f08703.diff",
            "exists": true,
            "files": [
                {
                    "file_additions": 41,
                    "file_deletions": 1,
                    "file_exists": true,
                    "file_name": "src/jemalloc.c",
                    "file_size": 120194
                },
                {
                    "file_additions": 46,
                    "file_deletions": 0,
                    "file_exists": true,
                    "file_name": "test/unit/hpa_validate_conf.c",
                    "file_size": 1888
                }
            ],
            "interesting": {
                "reopen": false,
                "status": false
            },
            "is_parent": false,
            "sha": "9f1d5df8c41bee0dd1b13eb09ad50bb8b0f08703"
        },
        {
            "associated_pull_request": [],
            "date": "2023-07-17 22:22:26+00:00",
            "diff": "jemalloc_jemalloc/issue_2449/commit_d71bb1d2770f59e52dca8ee4f8157ce913ee6467.diff",
            "diff_additions": 99,
            "diff_deletions": 1,
            "diff_file_size": 122082,
            "diff_url": "https://github.com/jemalloc/jemalloc/commit/d71bb1d2770f59e52dca8ee4f8157ce913ee6467.diff",
            "exists": true,
            "files": [
                {
                    "file_additions": 41,
                    "file_deletions": 1,
                    "file_exists": true,
                    "file_name": "src/jemalloc.c",
                    "file_size": 120194
                },
                {
                    "file_additions": 58,
                    "file_deletions": 0,
                    "file_exists": true,
                    "file_name": "test/unit/hpa_validate_conf.c",
                    "file_size": 1888
                }
            ],
            "interesting": {
                "reopen": false,
                "status": false
            },
            "is_parent": false,
            "sha": "d71bb1d2770f59e52dca8ee4f8157ce913ee6467"
        },
        {
            "associated_pull_request": [],
            "date": "2023-07-17 22:22:26+00:00",
            "diff": "jemalloc_jemalloc/issue_2449/commit_bf1546583b70c44d843c605baa5eb7355552ac57.diff",
            "diff_additions": 101,
            "diff_deletions": 1,
            "diff_file_size": 122082,
            "diff_url": "https://github.com/jemalloc/jemalloc/commit/bf1546583b70c44d843c605baa5eb7355552ac57.diff",
            "exists": true,
            "files": [
                {
                    "file_additions": 41,
                    "file_deletions": 1,
                    "file_exists": true,
                    "file_name": "src/jemalloc.c",
                    "file_size": 120194
                },
                {
                    "file_additions": 60,
                    "file_deletions": 0,
                    "file_exists": true,
                    "file_name": "test/unit/hpa_validate_conf.c",
                    "file_size": 1888
                }
            ],
            "interesting": {
                "reopen": false,
                "status": false
            },
            "is_parent": false,
            "sha": "bf1546583b70c44d843c605baa5eb7355552ac57"
        },
        {
            "associated_pull_request": [],
            "date": "2023-07-17 22:22:26+00:00",
            "diff": "jemalloc_jemalloc/issue_2449/commit_0ca184134568da564103d6cc79ed34b8d6335abb.diff",
            "diff_additions": 101,
            "diff_deletions": 1,
            "diff_file_size": 122082,
            "diff_url": "https://github.com/jemalloc/jemalloc/commit/0ca184134568da564103d6cc79ed34b8d6335abb.diff",
            "exists": true,
            "files": [
                {
                    "file_additions": 41,
                    "file_deletions": 1,
                    "file_exists": true,
                    "file_name": "src/jemalloc.c",
                    "file_size": 120194
                },
                {
                    "file_additions": 60,
                    "file_deletions": 0,
                    "file_exists": true,
                    "file_name": "test/unit/hpa_validate_conf.c",
                    "file_size": 1888
                }
            ],
            "interesting": {
                "reopen": false,
                "status": false
            },
            "is_parent": false,
            "sha": "0ca184134568da564103d6cc79ed34b8d6335abb"
        },
        {
            "associated_pull_request": [],
            "date": "2023-07-17 22:22:26+00:00",
            "diff": "jemalloc_jemalloc/issue_2449/commit_e2f7bb26683f2868dad863dd3f61793c23e65d8d.diff",
            "diff_additions": 97,
            "diff_deletions": 1,
            "diff_file_size": 122082,
            "diff_url": "https://github.com/jemalloc/jemalloc/commit/e2f7bb26683f2868dad863dd3f61793c23e65d8d.diff",
            "exists": true,
            "files": [
                {
                    "file_additions": 41,
                    "file_deletions": 1,
                    "file_exists": true,
                    "file_name": "src/jemalloc.c",
                    "file_size": 120194
                },
                {
                    "file_additions": 56,
                    "file_deletions": 0,
                    "file_exists": true,
                    "file_name": "test/unit/hpa_validate_conf.c",
                    "file_size": 1888
                }
            ],
            "interesting": {
                "reopen": false,
                "status": false
            },
            "is_parent": false,
            "sha": "e2f7bb26683f2868dad863dd3f61793c23e65d8d"
        },
        {
            "associated_pull_request": [],
            "date": "2023-07-17 22:22:26+00:00",
            "diff": "jemalloc_jemalloc/issue_2449/commit_13f5f5b595fea91e039a544ac5a8aefb8025d817.diff",
            "diff_additions": 97,
            "diff_deletions": 1,
            "diff_file_size": 122082,
            "diff_url": "https://github.com/jemalloc/jemalloc/commit/13f5f5b595fea91e039a544ac5a8aefb8025d817.diff",
            "exists": true,
            "files": [
                {
                    "file_additions": 41,
                    "file_deletions": 1,
                    "file_exists": true,
                    "file_name": "src/jemalloc.c",
                    "file_size": 120194
                },
                {
                    "file_additions": 56,
                    "file_deletions": 0,
                    "file_exists": true,
                    "file_name": "test/unit/hpa_validate_conf.c",
                    "file_size": 1888
                }
            ],
            "interesting": {
                "reopen": false,
                "status": false
            },
            "is_parent": false,
            "sha": "13f5f5b595fea91e039a544ac5a8aefb8025d817"
        },
        {
            "associated_pull_request": [],
            "date": "2023-07-17 22:22:26+00:00",
            "diff": "jemalloc_jemalloc/issue_2449/commit_45e475f84973444cf46e272743e2d8b3cf341640.diff",
            "diff_additions": 99,
            "diff_deletions": 1,
            "diff_file_size": 122082,
            "diff_url": "https://github.com/jemalloc/jemalloc/commit/45e475f84973444cf46e272743e2d8b3cf341640.diff",
            "exists": true,
            "files": [
                {
                    "file_additions": 43,
                    "file_deletions": 1,
                    "file_exists": true,
                    "file_name": "src/jemalloc.c",
                    "file_size": 120194
                },
                {
                    "file_additions": 56,
                    "file_deletions": 0,
                    "file_exists": true,
                    "file_name": "test/unit/hpa_validate_conf.c",
                    "file_size": 1888
                }
            ],
            "interesting": {
                "reopen": false,
                "status": true
            },
            "is_parent": false,
            "sha": "45e475f84973444cf46e272743e2d8b3cf341640"
        },
        {
            "associated_pull_request": [
                "https://github.com/jemalloc/jemalloc/pull/2484"
            ],
            "date": "2023-07-17 22:22:26+00:00",
            "diff": "jemalloc_jemalloc/issue_2449/commit_5fefe178749ccc5b0b7155774dc02cdaccc66a16.diff",
            "diff_additions": 99,
            "diff_deletions": 1,
            "diff_file_size": 122082,
            "diff_url": "https://github.com/jemalloc/jemalloc/commit/5fefe178749ccc5b0b7155774dc02cdaccc66a16.diff",
            "exists": true,
            "files": [
                {
                    "file_additions": 43,
                    "file_deletions": 1,
                    "file_exists": true,
                    "file_name": "src/jemalloc.c",
                    "file_size": 120194
                },
                {
                    "file_additions": 56,
                    "file_deletions": 0,
                    "file_exists": true,
                    "file_name": "test/unit/hpa_validate_conf.c",
                    "file_size": 1888
                }
            ],
            "interesting": {
                "reopen": false,
                "status": true
            },
            "is_parent": false,
            "sha": "5fefe178749ccc5b0b7155774dc02cdaccc66a16"
        },
        {
            "associated_pull_request": [
                "https://github.com/jemalloc/jemalloc/pull/2484"
            ],
            "date": "2023-07-17 22:22:26+00:00",
            "diff": "jemalloc_jemalloc/issue_2449/commit_3aae792b1021a3e46490bd52e8b3300c3aa71e82.diff",
            "diff_additions": 99,
            "diff_deletions": 1,
            "diff_file_size": 122082,
            "diff_url": "https://github.com/jemalloc/jemalloc/commit/3aae792b1021a3e46490bd52e8b3300c3aa71e82.diff",
            "exists": true,
            "files": [
                {
                    "file_additions": 43,
                    "file_deletions": 1,
                    "file_exists": true,
                    "file_name": "src/jemalloc.c",
                    "file_size": 120194
                },
                {
                    "file_additions": 56,
                    "file_deletions": 0,
                    "file_exists": true,
                    "file_name": "test/unit/hpa_validate_conf.c",
                    "file_size": 1888
                }
            ],
            "interesting": {
                "reopen": false,
                "status": false
            },
            "is_parent": false,
            "sha": "3aae792b1021a3e46490bd52e8b3300c3aa71e82"
        }
    ],
    "first_commit": "2023-07-14 16:06:32+00:00",
    "last_commit": "2023-08-08 21:36:19+00:00",
    "number": 2449,
    "pull_request": "None",
    "score": {
        "accidental_reopen_likely": false,
        "all_labels": [],
        "contains_keywords": [
            "confirm",
            "work",
            "chang",
            "fix",
            "issu",
            "CI",
            "debug",
            "test",
            "attempt",
            "bug",
            "problem",
            "report"
        ],
        "fix_size": 73,
        "has_labels": [],
        "intersecting": {
            "computed_score": 1.0,
            "final_commit_size": 45,
            "intersection_size": 45,
            "previous_commits_size": 73
        },
        "is_makefile_based": true,
        "no_new_files": [],
        "no_other_files": false,
        "num_prohibited_files": 155688,
        "prohibited_files": [
            "server/src/main/java/com/genymobile/scrcpy/Device.java",
            "server/src/main/java/com/genymobile/scrcpy/wrappers/SurfaceControl.java",
            "server/src/main/java/com/genymobile/scrcpy/Device.java",
            "server/src/main/java/com/genymobile/scrcpy/wrappers/SurfaceControl.java",
            "app/meson.build",
            "app/scrcpy.1",
            "app/src/common.h",
            "app/src/scrcpy.h",
            "app/src/server.h",
            "server/src/main/java/com/genymobile/scrcpy/Workarounds.java"
        ],
        "reopen": false,
        "reopen_events": [
            [
                "2023-07-17 22:23:56+00:00",
                "commit"
            ],
            [
                "2023-07-20 18:14:29+00:00",
                "commit"
            ],
            [
                "2023-07-24 19:41:35+00:00",
                "commit"
            ],
            [
                "2023-07-24 22:37:39+00:00",
                "commit"
            ],
            [
                "2023-07-25 18:03:38+00:00",
                "commit"
            ],
            [
                "2023-07-27 17:31:17+00:00",
                "commit"
            ],
            [
                "2023-08-04 18:01:13+00:00",
                "commit"
            ],
            [
                "2023-08-04 18:02:16+00:00",
                "commit"
            ],
            [
                "2023-08-08 19:22:29+00:00",
                "commit"
            ],
            [
                "2023-08-08 20:37:16+00:00",
                "commit"
            ],
            [
                "2023-08-08 21:36:21+00:00",
                "closed"
            ],
            [
                "2023-08-08 21:36:24+00:00",
                "commit"
            ]
        ],
        "status": true,
        "strategy": true,
        "total_changes": 953
    }
}