{
    "covered_issues": [
        145,
        143,
        141,
        137,
        131,
        130,
        127,
        113,
        111,
        109,
        101,
        100,
        99,
        93,
        92,
        87,
        86,
        85,
        82,
        81,
        80,
        77,
        75,
        66,
        65,
        63,
        62,
        59,
        58,
        52,
        46,
        45,
        44,
        39,
        35,
        33,
        31,
        30,
        25,
        24,
        23,
        22,
        21,
        19,
        18,
        14,
        10,
        9,
        8,
        7,
        6
    ],
    "finished": true
}