{
    "covered_issues": [
        22,
        21,
        20,
        15,
        13,
        12,
        11,
        7,
        6,
        5,
        4,
        2,
        1
    ],
    "finished": true
}