{
    "covered_issues": [
        94,
        68,
        65,
        64,
        61,
        59,
        53,
        52,
        50,
        49,
        48,
        43,
        42,
        39,
        37,
        35,
        34,
        32,
        31,
        30,
        29,
        27,
        26,
        18,
        17,
        13,
        12,
        10,
        7,
        3
    ],
    "finished": true
}