{
    "covered_issues": [
        61,
        54,
        52,
        43,
        40,
        39,
        38,
        34,
        25,
        22,
        17,
        13,
        11,
        10,
        7,
        1
    ],
    "finished": true
}