{
    "category": [
        "memory",
        "feature request"
    ],
    "commits": [
        {
            "associated_pull_request": [],
            "date": "2016-04-03 05:14:58",
            "diff": "kevinlawler_kona/issue_422/commit_aac5b17bc2763104169a389dc5806a4b26e3a86b.diff",
            "diff_additions": 4,
            "diff_deletions": 2,
            "diff_file_size": 31241,
            "diff_url": "https://github.com/kevinlawler/kona/commit/aac5b17bc2763104169a389dc5806a4b26e3a86b.diff",
            "exists": true,
            "files": [
                {
                    "file_additions": 4,
                    "file_deletions": 2,
                    "file_exists": true,
                    "file_name": "src/p.c",
                    "file_size": 31241
                }
            ],
            "interesting": {
                "reopen": false,
                "status": false
            },
            "is_parent": true,
            "sha": "aac5b17bc2763104169a389dc5806a4b26e3a86b"
        },
        {
            "associated_pull_request": [],
            "date": "2016-04-04 22:04:24",
            "diff": "kevinlawler_kona/issue_422/commit_1488da16fc59118cc92b76552f8e7c6e308985b5.diff",
            "diff_additions": 8,
            "diff_deletions": 9,
            "diff_file_size": 127084,
            "diff_url": "https://github.com/kevinlawler/kona/commit/1488da16fc59118cc92b76552f8e7c6e308985b5.diff",
            "exists": true,
            "files": [
                {
                    "file_additions": 2,
                    "file_deletions": 1,
                    "file_exists": true,
                    "file_name": "src/kc.c",
                    "file_size": 18884
                },
                {
                    "file_additions": 1,
                    "file_deletions": 3,
                    "file_exists": true,
                    "file_name": "src/p.c",
                    "file_size": 31241
                },
                {
                    "file_additions": 5,
                    "file_deletions": 5,
                    "file_exists": true,
                    "file_name": "src/tests.c",
                    "file_size": 76959
                }
            ],
            "interesting": {
                "reopen": true,
                "status": false
            },
            "is_parent": false,
            "sha": "1488da16fc59118cc92b76552f8e7c6e308985b5"
        },
        {
            "associated_pull_request": [],
            "date": "2016-04-07 22:44:34",
            "diff": "kevinlawler_kona/issue_422/commit_68072e383fe925c51c9ecf3310cfefef89f85629.diff",
            "diff_additions": 2,
            "diff_deletions": 5,
            "diff_file_size": 108200,
            "diff_url": "https://github.com/kevinlawler/kona/commit/68072e383fe925c51c9ecf3310cfefef89f85629.diff",
            "exists": true,
            "files": [
                {
                    "file_additions": 1,
                    "file_deletions": 4,
                    "file_exists": true,
                    "file_name": "src/p.c",
                    "file_size": 31241
                },
                {
                    "file_additions": 1,
                    "file_deletions": 1,
                    "file_exists": true,
                    "file_name": "src/tests.c",
                    "file_size": 76959
                }
            ],
            "interesting": {
                "reopen": false,
                "status": false
            },
            "is_parent": false,
            "sha": "68072e383fe925c51c9ecf3310cfefef89f85629"
        }
    ],
    "first_commit": "2016-04-03 05:14:58",
    "last_commit": "2016-04-07 22:44:34",
    "number": 422,
    "pull_request": "None",
    "score": {
        "accidental_reopen_likely": false,
        "all_labels": [
            "exploratory"
        ],
        "contains_keywords": [
            "error",
            "fix"
        ],
        "fix_size": 18,
        "has_labels": [],
        "intersecting": {
            "computed_score": 0.42857142857142855,
            "final_commit_size": 7,
            "intersection_size": 3,
            "previous_commits_size": 14
        },
        "is_makefile_based": true,
        "no_new_files": [],
        "no_other_files": false,
        "num_prohibited_files": 48809,
        "prohibited_files": [
            "hal/inc/pinmap_hal.h",
            "Debug/marvin.bin",
            "Debug/marvin.elf",
            "Debug/marvin.hex",
            "Debug/marvin.bin",
            "Debug/marvin.elf",
            "Debug/marvin.hex",
            "inc/spark_utilities.h",
            "Debug/marvin.bin",
            "Debug/marvin.elf"
        ],
        "reopen": true,
        "reopen_events": [
            [
                "2016-04-04 22:02:49",
                "closed"
            ],
            [
                "2016-04-04 22:02:49",
                "commit"
            ],
            [
                "2016-04-04 22:25:53",
                "reopened"
            ],
            [
                "2016-04-07 22:42:43",
                "closed"
            ],
            [
                "2016-04-07 22:42:43",
                "commit"
            ]
        ],
        "status": false,
        "strategy": true,
        "total_changes": 30
    }
}