{
    "category": [
        "build/refactor/preprocessing",
        "network/protocol"
    ],
    "commits": [
        {
            "associated_pull_request": [],
            "date": "2014-05-08 13:13:40",
            "diff": "libvips_libvips/issue_120/commit_f6f7d4eeed270945b296b59c7c09be3202dc1539.diff",
            "diff_additions": 6,
            "diff_deletions": 10,
            "diff_file_size": 23801,
            "diff_url": "https://github.com/libvips/libvips/commit/f6f7d4eeed270945b296b59c7c09be3202dc1539.diff",
            "exists": true,
            "files": [
                {
                    "file_additions": 6,
                    "file_deletions": 10,
                    "file_exists": true,
                    "file_name": "libvips/colour/colourspace.c",
                    "file_size": 23801
                }
            ],
            "interesting": {
                "reopen": false,
                "status": false
            },
            "is_parent": true,
            "sha": "f6f7d4eeed270945b296b59c7c09be3202dc1539"
        },
        {
            "associated_pull_request": [],
            "date": "2014-05-08 13:24:22",
            "diff": "libvips_libvips/issue_120/commit_ccead97c05d2c61259c2799d446389eaa16b9cb7.diff",
            "diff_additions": 7,
            "diff_deletions": 0,
            "diff_file_size": 75640,
            "diff_url": "https://github.com/libvips/libvips/commit/ccead97c05d2c61259c2799d446389eaa16b9cb7.diff",
            "exists": true,
            "files": [
                {
                    "file_additions": 7,
                    "file_deletions": 0,
                    "file_exists": true,
                    "file_name": "libvips/foreign/dzsave.c",
                    "file_size": 75640
                }
            ],
            "interesting": {
                "reopen": true,
                "status": false
            },
            "is_parent": false,
            "sha": "ccead97c05d2c61259c2799d446389eaa16b9cb7"
        },
        {
            "associated_pull_request": [],
            "date": "2014-06-06 11:14:29",
            "diff": "libvips_libvips/issue_120/commit_527f8ff2cc3a1871ac51f18f1375a94bea6894c3.diff",
            "diff_additions": 2,
            "diff_deletions": 2,
            "diff_file_size": 71421,
            "diff_url": "https://github.com/libvips/libvips/commit/527f8ff2cc3a1871ac51f18f1375a94bea6894c3.diff",
            "exists": true,
            "files": [
                {
                    "file_additions": 2,
                    "file_deletions": 2,
                    "file_exists": true,
                    "file_name": "libvips/foreign/tiff2vips.c",
                    "file_size": 71421
                }
            ],
            "interesting": {
                "reopen": true,
                "status": false
            },
            "is_parent": false,
            "sha": "527f8ff2cc3a1871ac51f18f1375a94bea6894c3"
        }
    ],
    "first_commit": "2014-05-08 13:13:40",
    "last_commit": "2014-06-06 11:14:29",
    "number": 120,
    "pull_request": "None",
    "score": {
        "accidental_reopen_likely": false,
        "all_labels": [
            "question"
        ],
        "contains_keywords": [
            "fail",
            "report",
            "warn",
            "chang",
            "error",
            "bug",
            "problem",
            "crash",
            "test",
            "fix",
            "remov",
            "issu",
            "work",
            "perform",
            "fault",
            "leak",
            "debug"
        ],
        "fix_size": 11,
        "has_labels": [],
        "intersecting": {
            "computed_score": 0.0,
            "final_commit_size": 3,
            "intersection_size": 0,
            "previous_commits_size": 8
        },
        "is_makefile_based": true,
        "no_new_files": [
            "libvips/foreign/tiff2vips.c"
        ],
        "no_other_files": false,
        "num_prohibited_files": 52040,
        "prohibited_files": [
            "hal/inc/pinmap_hal.h",
            "Debug/marvin.bin",
            "Debug/marvin.elf",
            "Debug/marvin.hex",
            "Debug/marvin.bin",
            "Debug/marvin.elf",
            "Debug/marvin.hex",
            "inc/spark_utilities.h",
            "Debug/marvin.bin",
            "Debug/marvin.elf"
        ],
        "reopen": true,
        "reopen_events": [
            [
                "2014-05-08 09:24:08",
                "closed"
            ],
            [
                "2014-05-08 09:49:00",
                "reopened"
            ],
            [
                "2014-05-08 12:51:28",
                "closed"
            ],
            [
                "2014-05-08 13:25:29",
                "commit"
            ],
            [
                "2014-06-05 13:15:56",
                "reopened"
            ],
            [
                "2014-06-06 11:15:15",
                "commit"
            ],
            [
                "2014-06-10 08:37:15",
                "closed"
            ],
            [
                "2014-06-10 08:37:19",
                "reopened"
            ],
            [
                "2014-06-10 10:23:57",
                "closed"
            ],
            [
                "2014-06-10 11:07:12",
                "reopened"
            ],
            [
                "2014-06-10 12:13:25",
                "closed"
            ]
        ],
        "status": false,
        "strategy": true,
        "total_changes": 27
    }
}