{
    "all_issues": 1103,
    "interesting_issues": 11,
    "last_update": "2021-05-16 22:15:48.709611",
    "license": {
        "download": "https://raw.githubusercontent.com/eclipse/paho.mqtt.c/master/LICENSE",
        "name": "Other"
    },
    "ratio": 0.009972801450589302,
    "size": 8190,
    "stars": 1110,
    "url": "https://github.com/eclipse/paho.mqtt.c"
}