{
    "commits": [
        {
            "associated_pull_request": [],
            "date": "2020-03-04 19:17:47+00:00",
            "diff": "miktex_miktex/issue_486/commit_e6e7b14dfa120e2606a3511f2b3d64ea933d1859.diff",
            "diff_additions": 2736,
            "diff_deletions": 2518,
            "diff_file_size": 830900,
            "diff_url": "https://github.com/MiKTeX/miktex/commit/e6e7b14dfa120e2606a3511f2b3d64ea933d1859.diff",
            "exists": true,
            "files": [
                {
                    "file_additions": 2,
                    "file_deletions": 0,
                    "file_exists": true,
                    "file_name": "Programs/GraphicsUtilities/asymptote/source/application.cc",
                    "file_size": 18627
                },
                {
                    "file_additions": 26,
                    "file_deletions": 6,
                    "file_exists": true,
                    "file_name": "Programs/GraphicsUtilities/asymptote/source/beziercurve.cc",
                    "file_size": 1828
                },
                {
                    "file_additions": 236,
                    "file_deletions": 69,
                    "file_exists": true,
                    "file_name": "Programs/GraphicsUtilities/asymptote/source/bezierpatch.cc",
                    "file_size": 25651
                },
                {
                    "file_additions": 403,
                    "file_deletions": 402,
                    "file_exists": true,
                    "file_name": "Programs/GraphicsUtilities/asymptote/source/camp.tab.cc",
                    "file_size": 129563
                },
                {
                    "file_additions": 4,
                    "file_deletions": 6,
                    "file_exists": true,
                    "file_name": "Programs/GraphicsUtilities/asymptote/source/drawpath3.cc",
                    "file_size": 5542
                },
                {
                    "file_additions": 125,
                    "file_deletions": 79,
                    "file_exists": true,
                    "file_name": "Programs/GraphicsUtilities/asymptote/source/drawsurface.cc",
                    "file_size": 24712
                },
                {
                    "file_additions": 19,
                    "file_deletions": 22,
                    "file_exists": true,
                    "file_name": "Programs/GraphicsUtilities/asymptote/source/glrender.cc",
                    "file_size": 67696
                },
                {
                    "file_additions": 32,
                    "file_deletions": 11,
                    "file_exists": true,
                    "file_name": "Programs/GraphicsUtilities/asymptote/source/interact.cc",
                    "file_size": 5789
                },
                {
                    "file_additions": 46,
                    "file_deletions": 2,
                    "file_exists": true,
                    "file_name": "Programs/GraphicsUtilities/asymptote/source/jsfile.cc",
                    "file_size": 11437
                },
                {
                    "file_additions": 128,
                    "file_deletions": 149,
                    "file_exists": true,
                    "file_name": "Programs/GraphicsUtilities/asymptote/source/lex.yy.cc",
                    "file_size": 83590
                },
                {
                    "file_additions": 15,
                    "file_deletions": 9,
                    "file_exists": true,
                    "file_name": "Programs/GraphicsUtilities/asymptote/source/path.cc",
                    "file_size": 33417
                },
                {
                    "file_additions": 14,
                    "file_deletions": 7,
                    "file_exists": true,
                    "file_name": "Programs/GraphicsUtilities/asymptote/source/path3.cc",
                    "file_size": 37991
                },
                {
                    "file_additions": 0,
                    "file_deletions": 246,
                    "file_exists": false,
                    "file_name": "Programs/GraphicsUtilities/asymptote/source/quaternion.cc",
                    "file_size": 0
                },
                {
                    "file_additions": 1,
                    "file_deletions": 1,
                    "file_exists": true,
                    "file_name": "Programs/GraphicsUtilities/asymptote/source/revision.cc",
                    "file_size": 62
                },
                {
                    "file_additions": 382,
                    "file_deletions": 256,
                    "file_exists": true,
                    "file_name": "Programs/GraphicsUtilities/asymptote/source/runarray.cc",
                    "file_size": 76304
                },
                {
                    "file_additions": 95,
                    "file_deletions": 94,
                    "file_exists": true,
                    "file_name": "Programs/GraphicsUtilities/asymptote/source/runfile.cc",
                    "file_size": 17893
                },
                {
                    "file_additions": 13,
                    "file_deletions": 17,
                    "file_exists": true,
                    "file_name": "Programs/GraphicsUtilities/asymptote/source/runhistory.cc",
                    "file_size": 8096
                },
                {
                    "file_additions": 125,
                    "file_deletions": 123,
                    "file_exists": true,
                    "file_name": "Programs/GraphicsUtilities/asymptote/source/runmath.cc",
                    "file_size": 22170
                },
                {
                    "file_additions": 85,
                    "file_deletions": 87,
                    "file_exists": true,
                    "file_name": "Programs/GraphicsUtilities/asymptote/source/runpair.cc",
                    "file_size": 16483
                },
                {
                    "file_additions": 117,
                    "file_deletions": 103,
                    "file_exists": true,
                    "file_name": "Programs/GraphicsUtilities/asymptote/source/runpath.cc",
                    "file_size": 26844
                },
                {
                    "file_additions": 120,
                    "file_deletions": 110,
                    "file_exists": true,
                    "file_name": "Programs/GraphicsUtilities/asymptote/source/runpath3d.cc",
                    "file_size": 25701
                },
                {
                    "file_additions": 253,
                    "file_deletions": 238,
                    "file_exists": true,
                    "file_name": "Programs/GraphicsUtilities/asymptote/source/runpicture.cc",
                    "file_size": 58084
                },
                {
                    "file_additions": 438,
                    "file_deletions": 442,
                    "file_exists": true,
                    "file_name": "Programs/GraphicsUtilities/asymptote/source/runtime.cc",
                    "file_size": 62786
                },
                {
                    "file_additions": 37,
                    "file_deletions": 37,
                    "file_exists": true,
                    "file_name": "Programs/GraphicsUtilities/asymptote/source/runtriple.cc",
                    "file_size": 13944
                },
                {
                    "file_additions": 20,
                    "file_deletions": 2,
                    "file_exists": true,
                    "file_name": "Programs/GraphicsUtilities/asymptote/source/settings.cc",
                    "file_size": 56690
                }
            ],
            "interesting": {
                "reopen": false,
                "status": false
            },
            "is_parent": true,
            "sha": "e6e7b14dfa120e2606a3511f2b3d64ea933d1859"
        },
        {
            "associated_pull_request": [],
            "date": "2020-03-04 19:33:40+00:00",
            "diff": "miktex_miktex/issue_486/commit_7e18ed1be8c6db2e08fcb03a7dd367e33c1eacad.diff",
            "diff_additions": 4,
            "diff_deletions": 0,
            "diff_file_size": 27780,
            "diff_url": "https://github.com/MiKTeX/miktex/commit/7e18ed1be8c6db2e08fcb03a7dd367e33c1eacad.diff",
            "exists": true,
            "files": [
                {
                    "file_additions": 4,
                    "file_deletions": 0,
                    "file_exists": true,
                    "file_name": "Programs/TeXAndFriends/luatex/source/luatex.c",
                    "file_size": 27780
                }
            ],
            "interesting": {
                "reopen": true,
                "status": false
            },
            "is_parent": false,
            "sha": "7e18ed1be8c6db2e08fcb03a7dd367e33c1eacad"
        },
        {
            "associated_pull_request": [],
            "date": "2020-05-04 20:58:24+00:00",
            "diff": "miktex_miktex/issue_486/commit_1167894afb3bd0f541ecc2ae42e39892212264ba.diff",
            "diff_additions": 13,
            "diff_deletions": 6,
            "diff_file_size": 27780,
            "diff_url": "https://github.com/MiKTeX/miktex/commit/1167894afb3bd0f541ecc2ae42e39892212264ba.diff",
            "exists": true,
            "files": [
                {
                    "file_additions": 13,
                    "file_deletions": 6,
                    "file_exists": true,
                    "file_name": "Programs/TeXAndFriends/luatex/source/luatex.c",
                    "file_size": 27780
                }
            ],
            "interesting": {
                "reopen": false,
                "status": false
            },
            "is_parent": false,
            "sha": "1167894afb3bd0f541ecc2ae42e39892212264ba"
        }
    ],
    "first_commit": "2020-03-04 09:18:20+00:00",
    "last_commit": "2020-05-04 20:58:24+00:00",
    "number": 486,
    "pull_request": "None",
    "score": {
        "accidental_reopen_likely": false,
        "all_labels": [
            "bug"
        ],
        "contains_keywords": [
            "work",
            "fail",
            "fix",
            "issu",
            "reason",
            "error",
            "report"
        ],
        "fix_size": 15,
        "has_labels": [
            "bug"
        ],
        "intersecting": {
            "computed_score": 0.3333333333333333,
            "final_commit_size": 15,
            "intersection_size": 5,
            "previous_commits_size": 5
        },
        "is_makefile_based": true,
        "no_new_files": [],
        "no_other_files": false,
        "num_prohibited_files": 187554,
        "prohibited_files": [
            "server/src/main/java/com/genymobile/scrcpy/Device.java",
            "server/src/main/java/com/genymobile/scrcpy/wrappers/SurfaceControl.java",
            "server/src/main/java/com/genymobile/scrcpy/Device.java",
            "server/src/main/java/com/genymobile/scrcpy/wrappers/SurfaceControl.java",
            "app/meson.build",
            "app/scrcpy.1",
            "app/src/common.h",
            "app/src/scrcpy.h",
            "app/src/server.h",
            "server/src/main/java/com/genymobile/scrcpy/Workarounds.java"
        ],
        "reopen": true,
        "reopen_events": [
            [
                "2020-03-05 17:35:41+00:00",
                "commit"
            ],
            [
                "2020-03-23 17:09:08+00:00",
                "closed"
            ],
            [
                "2020-04-20 17:34:27+00:00",
                "reopened"
            ],
            [
                "2020-05-04 20:58:28+00:00",
                "commit"
            ],
            [
                "2020-05-18 19:08:00+00:00",
                "closed"
            ]
        ],
        "status": false,
        "strategy": true,
        "total_changes": 5277
    }
}