{
    "covered_issues": [
        414,
        413,
        396,
        391,
        381,
        375,
        374,
        372,
        367,
        364,
        355,
        347,
        346,
        341,
        336,
        335,
        334,
        332,
        330,
        324,
        319,
        316,
        310,
        308,
        307,
        300,
        294,
        293,
        288,
        286,
        283,
        281,
        280,
        279,
        277,
        276,
        275,
        274,
        273,
        272,
        271,
        270,
        266,
        265,
        262,
        258,
        257,
        256,
        255,
        253,
        250,
        245,
        244,
        243,
        242,
        240,
        239,
        236,
        235,
        233,
        229,
        227,
        226,
        225,
        223,
        220,
        219,
        218,
        217,
        216,
        215,
        213,
        212,
        211,
        209,
        208,
        207,
        206,
        204,
        201,
        200,
        199,
        198,
        197,
        195,
        194,
        193,
        188,
        185,
        183,
        182,
        181,
        180,
        179,
        177,
        176,
        175,
        174,
        173,
        172,
        170,
        166,
        162,
        161,
        159,
        157,
        156,
        155,
        154,
        153,
        152,
        151,
        149,
        148,
        147,
        146,
        145,
        144,
        143,
        142,
        141,
        136,
        130,
        129,
        128,
        123,
        122,
        119,
        112,
        111,
        109,
        108,
        104,
        103,
        101,
        98,
        97,
        94,
        93,
        90,
        87,
        86,
        85,
        84,
        80,
        78,
        76,
        75,
        74,
        73,
        72,
        70,
        69,
        68,
        67,
        66,
        65,
        64,
        60,
        59,
        56,
        55,
        54,
        53,
        52,
        50,
        49,
        48,
        47,
        46,
        45,
        44,
        43,
        42,
        39,
        38,
        34,
        33,
        31,
        30,
        29,
        26,
        25,
        24,
        22,
        17,
        16,
        13,
        12,
        8,
        7,
        6,
        5,
        4,
        3,
        2,
        1
    ],
    "finished": true
}