{
    "commits": [
        {
            "associated_pull_request": [],
            "date": "2015-01-15 01:18:57+00:00",
            "diff": "dynamorio_dynamorio/issue_1589/commit_4a23bef20704f308d4db58d9c78580e4f9f823e7.diff",
            "diff_additions": 82,
            "diff_deletions": 17,
            "diff_file_size": 0,
            "diff_url": "https://github.com/DynamoRIO/dynamorio/commit/4a23bef20704f308d4db58d9c78580e4f9f823e7.diff",
            "exists": true,
            "files": [
                {
                    "file_additions": 73,
                    "file_deletions": 8,
                    "file_exists": false,
                    "file_name": "core/arch/arm/decode.c",
                    "file_size": 0
                },
                {
                    "file_additions": 9,
                    "file_deletions": 9,
                    "file_exists": false,
                    "file_name": "core/arch/arm/table_t32_base.c",
                    "file_size": 0
                }
            ],
            "interesting": {
                "reopen": false,
                "status": false
            },
            "is_parent": true,
            "sha": "4a23bef20704f308d4db58d9c78580e4f9f823e7"
        },
        {
            "associated_pull_request": [],
            "date": "2015-01-16 18:42:15+00:00",
            "diff": "dynamorio_dynamorio/issue_1589/commit_7111497871e5d95b86767c54c28c149e302c971f.diff",
            "diff_additions": 52,
            "diff_deletions": 35,
            "diff_file_size": 678151,
            "diff_url": "https://github.com/DynamoRIO/dynamorio/commit/7111497871e5d95b86767c54c28c149e302c971f.diff",
            "exists": true,
            "files": [
                {
                    "file_additions": 12,
                    "file_deletions": 3,
                    "file_exists": true,
                    "file_name": "core/unix/loader.c",
                    "file_size": 89194
                },
                {
                    "file_additions": 3,
                    "file_deletions": 2,
                    "file_exists": true,
                    "file_name": "core/unix/memquery.c",
                    "file_size": 14387
                },
                {
                    "file_additions": 4,
                    "file_deletions": 4,
                    "file_exists": true,
                    "file_name": "core/unix/memquery_emulate.c",
                    "file_size": 21346
                },
                {
                    "file_additions": 2,
                    "file_deletions": 2,
                    "file_exists": true,
                    "file_name": "core/unix/module.c",
                    "file_size": 26119
                },
                {
                    "file_additions": 24,
                    "file_deletions": 18,
                    "file_exists": true,
                    "file_name": "core/unix/module_elf.c",
                    "file_size": 64169
                },
                {
                    "file_additions": 6,
                    "file_deletions": 5,
                    "file_exists": true,
                    "file_name": "core/unix/module_macho.c",
                    "file_size": 27020
                },
                {
                    "file_additions": 1,
                    "file_deletions": 1,
                    "file_exists": true,
                    "file_name": "core/unix/os.c",
                    "file_size": 435916
                }
            ],
            "interesting": {
                "reopen": true,
                "status": false
            },
            "is_parent": false,
            "sha": "7111497871e5d95b86767c54c28c149e302c971f"
        },
        {
            "associated_pull_request": [],
            "date": "2015-01-22 15:33:49+00:00",
            "diff": "dynamorio_dynamorio/issue_1589/commit_b73cd68672a31496c0d91d8299ce9346eb4f192c.diff",
            "diff_additions": 113,
            "diff_deletions": 47,
            "diff_file_size": 957734,
            "diff_url": "https://github.com/DynamoRIO/dynamorio/commit/b73cd68672a31496c0d91d8299ce9346eb4f192c.diff",
            "exists": true,
            "files": [
                {
                    "file_additions": 37,
                    "file_deletions": 5,
                    "file_exists": true,
                    "file_name": "core/unix/loader.c",
                    "file_size": 89194
                },
                {
                    "file_additions": 3,
                    "file_deletions": 1,
                    "file_exists": true,
                    "file_name": "core/unix/memquery.c",
                    "file_size": 14387
                },
                {
                    "file_additions": 4,
                    "file_deletions": 2,
                    "file_exists": true,
                    "file_name": "core/unix/memquery_emulate.c",
                    "file_size": 21346
                },
                {
                    "file_additions": 19,
                    "file_deletions": 2,
                    "file_exists": true,
                    "file_name": "core/unix/module.c",
                    "file_size": 26119
                },
                {
                    "file_additions": 33,
                    "file_deletions": 29,
                    "file_exists": true,
                    "file_name": "core/unix/module_elf.c",
                    "file_size": 64169
                },
                {
                    "file_additions": 8,
                    "file_deletions": 6,
                    "file_exists": true,
                    "file_name": "core/unix/module_macho.c",
                    "file_size": 27020
                },
                {
                    "file_additions": 2,
                    "file_deletions": 1,
                    "file_exists": true,
                    "file_name": "core/unix/os.c",
                    "file_size": 435916
                },
                {
                    "file_additions": 7,
                    "file_deletions": 1,
                    "file_exists": true,
                    "file_name": "core/win32/module.c",
                    "file_size": 279583
                }
            ],
            "interesting": {
                "reopen": true,
                "status": false
            },
            "is_parent": false,
            "sha": "b73cd68672a31496c0d91d8299ce9346eb4f192c"
        },
        {
            "associated_pull_request": [],
            "date": "2015-03-27 15:31:27+00:00",
            "diff": "dynamorio_dynamorio/issue_1589/commit_b5fe443c16c3797a7111b6e576169742f2bd2588.diff",
            "diff_additions": 6,
            "diff_deletions": 5,
            "diff_file_size": 89194,
            "diff_url": "https://github.com/DynamoRIO/dynamorio/commit/b5fe443c16c3797a7111b6e576169742f2bd2588.diff",
            "exists": true,
            "files": [
                {
                    "file_additions": 6,
                    "file_deletions": 5,
                    "file_exists": true,
                    "file_name": "core/unix/loader.c",
                    "file_size": 89194
                }
            ],
            "interesting": {
                "reopen": false,
                "status": false
            },
            "is_parent": false,
            "sha": "b5fe443c16c3797a7111b6e576169742f2bd2588"
        }
    ],
    "first_commit": "2015-01-15 23:33:00+00:00",
    "last_commit": "2015-03-28 19:42:26+00:00",
    "number": 1589,
    "pull_request": "None",
    "score": {
        "accidental_reopen_likely": false,
        "all_labels": [
            "OpSys-Linux",
            "Priority-High",
            "Hotlist-Release",
            "Bug-DRCrash"
        ],
        "contains_keywords": [
            "work",
            "chang",
            "fix",
            "issu",
            "reason",
            "test",
            "fault",
            "problem",
            "crash"
        ],
        "fix_size": 185,
        "has_labels": [],
        "intersecting": {
            "computed_score": 0.2,
            "final_commit_size": 10,
            "intersection_size": 2,
            "previous_commits_size": 177
        },
        "is_makefile_based": true,
        "no_new_files": [],
        "no_other_files": false,
        "num_prohibited_files": 166441,
        "prohibited_files": [
            "server/src/main/java/com/genymobile/scrcpy/Device.java",
            "server/src/main/java/com/genymobile/scrcpy/wrappers/SurfaceControl.java",
            "server/src/main/java/com/genymobile/scrcpy/Device.java",
            "server/src/main/java/com/genymobile/scrcpy/wrappers/SurfaceControl.java",
            "app/meson.build",
            "app/scrcpy.1",
            "app/src/common.h",
            "app/src/scrcpy.h",
            "app/src/server.h",
            "server/src/main/java/com/genymobile/scrcpy/Workarounds.java"
        ],
        "reopen": true,
        "reopen_events": [
            [
                "2015-01-16 18:51:45+00:00",
                "closed"
            ],
            [
                "2015-01-16 18:51:45+00:00",
                "commit"
            ],
            [
                "2015-01-22 19:02:18+00:00",
                "reopened"
            ],
            [
                "2015-01-22 21:09:18+00:00",
                "closed"
            ],
            [
                "2015-01-22 21:09:18+00:00",
                "commit"
            ],
            [
                "2015-03-27 15:29:26+00:00",
                "reopened"
            ],
            [
                "2015-03-28 19:42:27+00:00",
                "closed"
            ],
            [
                "2015-03-28 19:42:27+00:00",
                "commit"
            ]
        ],
        "status": false,
        "strategy": true,
        "total_changes": 357
    }
}