{
    "category": [
        "memory",
        "hardware/OS"
    ],
    "commits": [
        {
            "associated_pull_request": [
                "https://github.com/zephyrproject-rtos/zephyr/pull/13558"
            ],
            "date": "2019-02-20 20:23:25",
            "diff": "zephyrproject-rtos_zephyr/issue_13550/commit_78b644ea3a07ec6393355e01ada929066c6d50ee.diff",
            "diff_additions": 27,
            "diff_deletions": 26,
            "diff_file_size": 9504,
            "diff_url": "https://github.com/zephyrproject-rtos/zephyr/commit/78b644ea3a07ec6393355e01ada929066c6d50ee.diff",
            "exists": true,
            "files": [
                {
                    "file_additions": 27,
                    "file_deletions": 26,
                    "file_exists": true,
                    "file_name": "drivers/net/slip.c",
                    "file_size": 9504
                }
            ],
            "interesting": {
                "reopen": false,
                "status": false
            },
            "is_parent": true,
            "sha": "78b644ea3a07ec6393355e01ada929066c6d50ee"
        },
        {
            "associated_pull_request": [],
            "date": "2019-02-21 22:02:37",
            "diff": "zephyrproject-rtos_zephyr/issue_13550/commit_22bdccf028042fc4f27f3cb84432314b472c091c.diff",
            "diff_additions": 30,
            "diff_deletions": 6,
            "diff_file_size": 11343,
            "diff_url": "https://github.com/zephyrproject-rtos/zephyr/commit/22bdccf028042fc4f27f3cb84432314b472c091c.diff",
            "exists": true,
            "files": [
                {
                    "file_additions": 30,
                    "file_deletions": 6,
                    "file_exists": true,
                    "file_name": "drivers/display/ssd1306.c",
                    "file_size": 11343
                }
            ],
            "interesting": {
                "reopen": false,
                "status": true
            },
            "is_parent": false,
            "sha": "22bdccf028042fc4f27f3cb84432314b472c091c"
        },
        {
            "associated_pull_request": [],
            "date": "2019-02-21 22:02:37",
            "diff": "zephyrproject-rtos_zephyr/issue_13550/commit_480a863b065dea78d8dc0708ea2c9cffd3e9e2c2.diff",
            "diff_additions": 30,
            "diff_deletions": 6,
            "diff_file_size": 11343,
            "diff_url": "https://github.com/zephyrproject-rtos/zephyr/commit/480a863b065dea78d8dc0708ea2c9cffd3e9e2c2.diff",
            "exists": true,
            "files": [
                {
                    "file_additions": 30,
                    "file_deletions": 6,
                    "file_exists": true,
                    "file_name": "drivers/display/ssd1306.c",
                    "file_size": 11343
                }
            ],
            "interesting": {
                "reopen": false,
                "status": false
            },
            "is_parent": false,
            "sha": "480a863b065dea78d8dc0708ea2c9cffd3e9e2c2"
        },
        {
            "associated_pull_request": [],
            "date": "2019-02-21 22:02:37",
            "diff": "zephyrproject-rtos_zephyr/issue_13550/commit_a39d7548ebc97d9f54e75e829e1739aec45927fb.diff",
            "diff_additions": 30,
            "diff_deletions": 6,
            "diff_file_size": 11343,
            "diff_url": "https://github.com/zephyrproject-rtos/zephyr/commit/a39d7548ebc97d9f54e75e829e1739aec45927fb.diff",
            "exists": true,
            "files": [
                {
                    "file_additions": 30,
                    "file_deletions": 6,
                    "file_exists": true,
                    "file_name": "drivers/display/ssd1306.c",
                    "file_size": 11343
                }
            ],
            "interesting": {
                "reopen": false,
                "status": false
            },
            "is_parent": false,
            "sha": "a39d7548ebc97d9f54e75e829e1739aec45927fb"
        },
        {
            "associated_pull_request": [],
            "date": "2019-02-22 09:34:10",
            "diff": "zephyrproject-rtos_zephyr/issue_13550/commit_58c0c82a133801b1b1b09ee37b5462e79510dee5.diff",
            "diff_additions": 1,
            "diff_deletions": 1,
            "diff_file_size": 10229,
            "diff_url": "https://github.com/zephyrproject-rtos/zephyr/commit/58c0c82a133801b1b1b09ee37b5462e79510dee5.diff",
            "exists": true,
            "files": [
                {
                    "file_additions": 1,
                    "file_deletions": 1,
                    "file_exists": true,
                    "file_name": "drivers/i2c/i2c_ll_stm32.c",
                    "file_size": 10229
                }
            ],
            "interesting": {
                "reopen": false,
                "status": false
            },
            "is_parent": false,
            "sha": "58c0c82a133801b1b1b09ee37b5462e79510dee5"
        },
        {
            "associated_pull_request": [],
            "date": "2019-02-21 22:02:37",
            "diff": "zephyrproject-rtos_zephyr/issue_13550/commit_4be2e55e2b3639600fc43802e62f50f12af4b955.diff",
            "diff_additions": 30,
            "diff_deletions": 6,
            "diff_file_size": 11343,
            "diff_url": "https://github.com/zephyrproject-rtos/zephyr/commit/4be2e55e2b3639600fc43802e62f50f12af4b955.diff",
            "exists": true,
            "files": [
                {
                    "file_additions": 30,
                    "file_deletions": 6,
                    "file_exists": true,
                    "file_name": "drivers/display/ssd1306.c",
                    "file_size": 11343
                }
            ],
            "interesting": {
                "reopen": false,
                "status": true
            },
            "is_parent": false,
            "sha": "4be2e55e2b3639600fc43802e62f50f12af4b955"
        },
        {
            "associated_pull_request": [],
            "date": "2019-02-21 22:02:37",
            "diff": "zephyrproject-rtos_zephyr/issue_13550/commit_e9ecb1a79db36a4f815a72cc16bece0404828462.diff",
            "diff_additions": 28,
            "diff_deletions": 6,
            "diff_file_size": 11343,
            "diff_url": "https://github.com/zephyrproject-rtos/zephyr/commit/e9ecb1a79db36a4f815a72cc16bece0404828462.diff",
            "exists": true,
            "files": [
                {
                    "file_additions": 28,
                    "file_deletions": 6,
                    "file_exists": true,
                    "file_name": "drivers/display/ssd1306.c",
                    "file_size": 11343
                }
            ],
            "interesting": {
                "reopen": false,
                "status": false
            },
            "is_parent": false,
            "sha": "e9ecb1a79db36a4f815a72cc16bece0404828462"
        }
    ],
    "first_commit": "2019-02-21 14:34:30",
    "last_commit": "2019-02-22 19:47:31",
    "number": 13550,
    "pull_request": "None",
    "score": {
        "accidental_reopen_likely": false,
        "all_labels": [
            "area: Display",
            "area: I2C",
            "bug",
            "platform: STM32",
            "priority: low"
        ],
        "contains_keywords": [
            "chang",
            "fix",
            "issu",
            "work"
        ],
        "fix_size": 41,
        "has_labels": [
            "bug"
        ],
        "intersecting": {
            "computed_score": 0.9428571428571428,
            "final_commit_size": 35,
            "intersection_size": 33,
            "previous_commits_size": 39
        },
        "is_makefile_based": true,
        "no_new_files": [],
        "no_other_files": false,
        "num_prohibited_files": 79349,
        "prohibited_files": [
            "hal/inc/pinmap_hal.h",
            "Debug/marvin.bin",
            "Debug/marvin.elf",
            "Debug/marvin.hex",
            "Debug/marvin.bin",
            "Debug/marvin.elf",
            "Debug/marvin.hex",
            "inc/spark_utilities.h",
            "Debug/marvin.bin",
            "Debug/marvin.elf"
        ],
        "reopen": false,
        "reopen_events": [
            [
                "2019-02-21 22:08:44",
                "commit"
            ],
            [
                "2019-02-21 22:29:20",
                "commit"
            ],
            [
                "2019-02-22 01:48:59",
                "commit"
            ],
            [
                "2019-02-22 09:35:52",
                "commit"
            ],
            [
                "2019-02-22 19:26:38",
                "commit"
            ],
            [
                "2019-02-22 19:47:41",
                "commit"
            ],
            [
                "2019-03-19 16:54:40",
                "closed"
            ]
        ],
        "status": true,
        "strategy": true,
        "total_changes": 233
    }
}