{
    "category": [
        "build/refactor/preprocessing",
        "GUI",
        "control flow"
    ],
    "commits": [
        {
            "associated_pull_request": [
                "https://github.com/surge-synthesizer/surge/pull/3161"
            ],
            "date": "2020-11-16 20:17:30",
            "diff": "surge-synthesizer_surge/issue_2966/commit_6a549b8a0633123200ba6572340aa5764a5d62f7.diff",
            "diff_additions": 17,
            "diff_deletions": 4,
            "diff_file_size": 0,
            "diff_url": "https://github.com/surge-synthesizer/surge/commit/6a549b8a0633123200ba6572340aa5764a5d62f7.diff",
            "exists": true,
            "files": [
                {
                    "file_additions": 17,
                    "file_deletions": 4,
                    "file_exists": false,
                    "file_name": "src/common/gui/CLFOGui.cpp",
                    "file_size": 0
                }
            ],
            "interesting": {
                "reopen": false,
                "status": false
            },
            "is_parent": true,
            "sha": "6a549b8a0633123200ba6572340aa5764a5d62f7"
        },
        {
            "associated_pull_request": [
                "https://github.com/surge-synthesizer/surge/pull/3163"
            ],
            "date": "2020-11-16 22:24:12",
            "diff": "surge-synthesizer_surge/issue_2966/commit_3867d6ca7747407d9c995fcc8902b5a7b01ff548.diff",
            "diff_additions": 35,
            "diff_deletions": 8,
            "diff_file_size": 112557,
            "diff_url": "https://github.com/surge-synthesizer/surge/commit/3867d6ca7747407d9c995fcc8902b5a7b01ff548.diff",
            "exists": true,
            "files": [
                {
                    "file_additions": 6,
                    "file_deletions": 0,
                    "file_exists": true,
                    "file_name": "src/common/SurgePatch.cpp",
                    "file_size": 112557
                },
                {
                    "file_additions": 4,
                    "file_deletions": 3,
                    "file_exists": false,
                    "file_name": "src/common/dsp/MSEGModulationHelper.cpp",
                    "file_size": 0
                },
                {
                    "file_additions": 25,
                    "file_deletions": 5,
                    "file_exists": false,
                    "file_name": "src/common/gui/MSEGEditor.cpp",
                    "file_size": 0
                }
            ],
            "interesting": {
                "reopen": false,
                "status": false
            },
            "is_parent": false,
            "sha": "3867d6ca7747407d9c995fcc8902b5a7b01ff548"
        },
        {
            "associated_pull_request": [],
            "date": "2020-11-23 02:23:23",
            "diff": "surge-synthesizer_surge/issue_2966/commit_74dfdd62db83df2301a9a5cbf060599d88e9ecef.diff",
            "diff_additions": 30,
            "diff_deletions": 4,
            "diff_file_size": 0,
            "diff_url": "https://github.com/surge-synthesizer/surge/commit/74dfdd62db83df2301a9a5cbf060599d88e9ecef.diff",
            "exists": true,
            "files": [
                {
                    "file_additions": 19,
                    "file_deletions": 0,
                    "file_exists": false,
                    "file_name": "src/common/dsp/MSEGModulationHelper.cpp",
                    "file_size": 0
                },
                {
                    "file_additions": 11,
                    "file_deletions": 4,
                    "file_exists": false,
                    "file_name": "src/common/gui/MSEGEditor.cpp",
                    "file_size": 0
                }
            ],
            "interesting": {
                "reopen": false,
                "status": false
            },
            "is_parent": false,
            "sha": "74dfdd62db83df2301a9a5cbf060599d88e9ecef"
        },
        {
            "associated_pull_request": [],
            "date": "2020-11-23 02:23:23",
            "diff": "surge-synthesizer_surge/issue_2966/commit_1eaed7a17712e59064599dba37b9fd76f9b6f234.diff",
            "diff_additions": 179,
            "diff_deletions": 81,
            "diff_file_size": 0,
            "diff_url": "https://github.com/surge-synthesizer/surge/commit/1eaed7a17712e59064599dba37b9fd76f9b6f234.diff",
            "exists": true,
            "files": [
                {
                    "file_additions": 150,
                    "file_deletions": 4,
                    "file_exists": false,
                    "file_name": "src/common/dsp/MSEGModulationHelper.cpp",
                    "file_size": 0
                },
                {
                    "file_additions": 29,
                    "file_deletions": 77,
                    "file_exists": false,
                    "file_name": "src/common/gui/MSEGEditor.cpp",
                    "file_size": 0
                }
            ],
            "interesting": {
                "reopen": false,
                "status": true
            },
            "is_parent": false,
            "sha": "1eaed7a17712e59064599dba37b9fd76f9b6f234"
        },
        {
            "associated_pull_request": [
                "https://github.com/surge-synthesizer/surge/pull/3206"
            ],
            "date": "2020-11-23 02:23:23",
            "diff": "surge-synthesizer_surge/issue_2966/commit_e16a7fe6d7805ae7d792dd3c14e6c56c9be8cb5c.diff",
            "diff_additions": 194,
            "diff_deletions": 90,
            "diff_file_size": 0,
            "diff_url": "https://github.com/surge-synthesizer/surge/commit/e16a7fe6d7805ae7d792dd3c14e6c56c9be8cb5c.diff",
            "exists": true,
            "files": [
                {
                    "file_additions": 150,
                    "file_deletions": 4,
                    "file_exists": false,
                    "file_name": "src/common/dsp/MSEGModulationHelper.cpp",
                    "file_size": 0
                },
                {
                    "file_additions": 44,
                    "file_deletions": 86,
                    "file_exists": false,
                    "file_name": "src/common/gui/MSEGEditor.cpp",
                    "file_size": 0
                }
            ],
            "interesting": {
                "reopen": false,
                "status": false
            },
            "is_parent": false,
            "sha": "e16a7fe6d7805ae7d792dd3c14e6c56c9be8cb5c"
        },
        {
            "associated_pull_request": [
                "https://github.com/surge-synthesizer/surge/pull/3206"
            ],
            "date": "2020-11-23 17:05:14",
            "diff": "surge-synthesizer_surge/issue_2966/commit_52dda0202ffcd7e20b14ee9874dcf0528dafa113.diff",
            "diff_additions": 194,
            "diff_deletions": 90,
            "diff_file_size": 0,
            "diff_url": "https://github.com/surge-synthesizer/surge/commit/52dda0202ffcd7e20b14ee9874dcf0528dafa113.diff",
            "exists": true,
            "files": [
                {
                    "file_additions": 150,
                    "file_deletions": 4,
                    "file_exists": false,
                    "file_name": "src/common/dsp/MSEGModulationHelper.cpp",
                    "file_size": 0
                },
                {
                    "file_additions": 44,
                    "file_deletions": 86,
                    "file_exists": false,
                    "file_name": "src/common/gui/MSEGEditor.cpp",
                    "file_size": 0
                }
            ],
            "interesting": {
                "reopen": false,
                "status": false
            },
            "is_parent": false,
            "sha": "52dda0202ffcd7e20b14ee9874dcf0528dafa113"
        },
        {
            "associated_pull_request": [
                "https://github.com/surge-synthesizer/surge/pull/3208"
            ],
            "date": "2020-11-23 18:36:46",
            "diff": "surge-synthesizer_surge/issue_2966/commit_9a2725f8417e5b07cf76b7bb7aa866dab1a62e4b.diff",
            "diff_additions": 6,
            "diff_deletions": 1,
            "diff_file_size": 0,
            "diff_url": "https://github.com/surge-synthesizer/surge/commit/9a2725f8417e5b07cf76b7bb7aa866dab1a62e4b.diff",
            "exists": true,
            "files": [
                {
                    "file_additions": 6,
                    "file_deletions": 1,
                    "file_exists": false,
                    "file_name": "src/common/dsp/MSEGModulationHelper.cpp",
                    "file_size": 0
                }
            ],
            "interesting": {
                "reopen": false,
                "status": false
            },
            "is_parent": false,
            "sha": "9a2725f8417e5b07cf76b7bb7aa866dab1a62e4b"
        },
        {
            "associated_pull_request": [
                "https://github.com/surge-synthesizer/surge/pull/3208"
            ],
            "date": "2020-11-23 18:48:24",
            "diff": "surge-synthesizer_surge/issue_2966/commit_1f5b0666df1cdf8afa0324a349509010023bfa71.diff",
            "diff_additions": 6,
            "diff_deletions": 1,
            "diff_file_size": 0,
            "diff_url": "https://github.com/surge-synthesizer/surge/commit/1f5b0666df1cdf8afa0324a349509010023bfa71.diff",
            "exists": true,
            "files": [
                {
                    "file_additions": 6,
                    "file_deletions": 1,
                    "file_exists": false,
                    "file_name": "src/common/dsp/MSEGModulationHelper.cpp",
                    "file_size": 0
                }
            ],
            "interesting": {
                "reopen": false,
                "status": false
            },
            "is_parent": false,
            "sha": "1f5b0666df1cdf8afa0324a349509010023bfa71"
        }
    ],
    "first_commit": "2020-11-16 20:17:30",
    "last_commit": "2020-11-23 18:48:24",
    "number": 2966,
    "pull_request": "None",
    "score": {
        "accidental_reopen_likely": false,
        "all_labels": [
            "Modulation",
            "UI",
            "UX"
        ],
        "contains_keywords": [
            "remov",
            "issu",
            "chang",
            "work",
            "fix",
            "test"
        ],
        "fix_size": 365,
        "has_labels": [],
        "intersecting": {
            "computed_score": 1.0,
            "final_commit_size": 7,
            "intersection_size": 7,
            "previous_commits_size": 365
        },
        "is_makefile_based": true,
        "no_new_files": [],
        "no_other_files": false,
        "num_prohibited_files": 73809,
        "prohibited_files": [
            "tools/building.py",
            "tools/building.py",
            "tools/building.py",
            "emcc.py",
            "src/library_emmalloc.js",
            "src/shell.js",
            "tests/test_core.py",
            "src/shell.js",
            "tests/test_core.py",
            "src/library.js"
        ],
        "reopen": false,
        "reopen_events": [
            [
                "2020-11-16 22:25:08",
                "commit"
            ],
            [
                "2020-11-16 23:05:08",
                "commit"
            ],
            [
                "2020-11-23 02:24:13",
                "commit"
            ],
            [
                "2020-11-23 16:47:58",
                "commit"
            ],
            [
                "2020-11-23 16:52:09",
                "commit"
            ],
            [
                "2020-11-23 17:05:15",
                "commit"
            ],
            [
                "2020-11-23 18:37:15",
                "commit"
            ],
            [
                "2020-11-23 18:48:26",
                "commit"
            ],
            [
                "2020-11-24 13:52:39",
                "closed"
            ]
        ],
        "status": true,
        "strategy": true,
        "total_changes": 940
    }
}