{
    "commits": [
        {
            "associated_pull_request": [],
            "date": "2013-11-04 03:50:37+00:00",
            "diff": "radareorg_radare2/issue_309/commit_1769a767cd72f8df2c1eb25720d0d668675605da.diff",
            "diff_additions": 43,
            "diff_deletions": 44,
            "diff_file_size": 24116,
            "diff_url": "https://github.com/radareorg/radare2/commit/1769a767cd72f8df2c1eb25720d0d668675605da.diff",
            "exists": true,
            "files": [
                {
                    "file_additions": 22,
                    "file_deletions": 22,
                    "file_exists": false,
                    "file_name": "libr/anal/p/anal_arm.c",
                    "file_size": 0
                },
                {
                    "file_additions": 20,
                    "file_deletions": 21,
                    "file_exists": true,
                    "file_name": "libr/bin/p/bin_mach0.c",
                    "file_size": 24116
                },
                {
                    "file_additions": 1,
                    "file_deletions": 1,
                    "file_exists": false,
                    "file_name": "libr/util/ht.c",
                    "file_size": 0
                }
            ],
            "interesting": {
                "reopen": false,
                "status": false
            },
            "is_parent": true,
            "sha": "1769a767cd72f8df2c1eb25720d0d668675605da"
        },
        {
            "associated_pull_request": [],
            "date": "2013-11-04 14:58:18+00:00",
            "diff": "radareorg_radare2/issue_309/commit_37a655a889970a3b5befa32af7601fdd683c8704.diff",
            "diff_additions": 5,
            "diff_deletions": 5,
            "diff_file_size": 218265,
            "diff_url": "https://github.com/radareorg/radare2/commit/37a655a889970a3b5befa32af7601fdd683c8704.diff",
            "exists": true,
            "files": [
                {
                    "file_additions": 5,
                    "file_deletions": 5,
                    "file_exists": true,
                    "file_name": "libr/core/disasm.c",
                    "file_size": 218265
                }
            ],
            "interesting": {
                "reopen": true,
                "status": false
            },
            "is_parent": false,
            "sha": "37a655a889970a3b5befa32af7601fdd683c8704"
        },
        {
            "associated_pull_request": [],
            "date": "2013-11-05 02:23:29+00:00",
            "diff": "radareorg_radare2/issue_309/commit_438d502646a796277e9b1f5b02e15b7eebb54fbd.diff",
            "diff_additions": 14,
            "diff_deletions": 2,
            "diff_file_size": 218265,
            "diff_url": "https://github.com/radareorg/radare2/commit/438d502646a796277e9b1f5b02e15b7eebb54fbd.diff",
            "exists": true,
            "files": [
                {
                    "file_additions": 14,
                    "file_deletions": 2,
                    "file_exists": true,
                    "file_name": "libr/core/disasm.c",
                    "file_size": 218265
                }
            ],
            "interesting": {
                "reopen": true,
                "status": false
            },
            "is_parent": false,
            "sha": "438d502646a796277e9b1f5b02e15b7eebb54fbd"
        },
        {
            "associated_pull_request": [],
            "date": "2013-11-06 00:48:55+00:00",
            "diff": "radareorg_radare2/issue_309/commit_19165d308adcc557d3dd4b54e9e1802bf9509246.diff",
            "diff_additions": 12,
            "diff_deletions": 4,
            "diff_file_size": 218265,
            "diff_url": "https://github.com/radareorg/radare2/commit/19165d308adcc557d3dd4b54e9e1802bf9509246.diff",
            "exists": true,
            "files": [
                {
                    "file_additions": 12,
                    "file_deletions": 4,
                    "file_exists": true,
                    "file_name": "libr/core/disasm.c",
                    "file_size": 218265
                }
            ],
            "interesting": {
                "reopen": false,
                "status": false
            },
            "is_parent": false,
            "sha": "19165d308adcc557d3dd4b54e9e1802bf9509246"
        }
    ],
    "first_commit": "2013-11-04 03:50:37+00:00",
    "last_commit": "2018-02-01 15:07:51+00:00",
    "number": 309,
    "pull_request": "None",
    "score": {
        "accidental_reopen_likely": false,
        "all_labels": [],
        "contains_keywords": [
            "chang",
            "fix",
            "issu",
            "test",
            "warn",
            "bug"
        ],
        "fix_size": 28,
        "has_labels": [],
        "intersecting": {
            "computed_score": 0.5,
            "final_commit_size": 16,
            "intersection_size": 8,
            "previous_commits_size": 20
        },
        "is_makefile_based": true,
        "no_new_files": [],
        "no_other_files": false,
        "num_prohibited_files": 25385,
        "prohibited_files": [
            "server/src/main/java/com/genymobile/scrcpy/Device.java",
            "server/src/main/java/com/genymobile/scrcpy/wrappers/SurfaceControl.java",
            "server/src/main/java/com/genymobile/scrcpy/Device.java",
            "server/src/main/java/com/genymobile/scrcpy/wrappers/SurfaceControl.java",
            "app/meson.build",
            "app/scrcpy.1",
            "app/src/common.h",
            "app/src/scrcpy.h",
            "app/src/server.h",
            "server/src/main/java/com/genymobile/scrcpy/Workarounds.java"
        ],
        "reopen": true,
        "reopen_events": [
            [
                "2013-11-04 14:57:39+00:00",
                "commit"
            ],
            [
                "2013-11-04 15:16:22+00:00",
                "closed"
            ],
            [
                "2013-11-04 15:16:22+00:00",
                "commit"
            ],
            [
                "2013-11-04 16:14:03+00:00",
                "reopened"
            ],
            [
                "2013-11-05 02:24:00+00:00",
                "closed"
            ],
            [
                "2013-11-05 02:24:00+00:00",
                "commit"
            ],
            [
                "2013-11-05 06:19:31+00:00",
                "reopened"
            ],
            [
                "2013-11-06 00:49:06+00:00",
                "closed"
            ],
            [
                "2013-11-06 00:49:06+00:00",
                "commit"
            ],
            [
                "2019-12-30 09:54:26+00:00",
                "commit"
            ]
        ],
        "status": false,
        "strategy": true,
        "total_changes": 129
    }
}