{
    "covered_issues": [
        285,
        284,
        280,
        256,
        248,
        237,
        233,
        231,
        228,
        223,
        222,
        221,
        219,
        218,
        216,
        214,
        212,
        204,
        203,
        199,
        195,
        192,
        191,
        190,
        184,
        181,
        180,
        178,
        177,
        176,
        166,
        165,
        162,
        161,
        156,
        155,
        152,
        147,
        143,
        142,
        137,
        133,
        131,
        130,
        129,
        128,
        127,
        126,
        125,
        123,
        122,
        120,
        119,
        118,
        117,
        116,
        115,
        113,
        112,
        111,
        110,
        109,
        108,
        104,
        103,
        101,
        100,
        98,
        97,
        94,
        93,
        92,
        87,
        85,
        84,
        83,
        81,
        80,
        75,
        74,
        73,
        69,
        66,
        65,
        64,
        61,
        60,
        58,
        57,
        56,
        55,
        54,
        53,
        52,
        51,
        50,
        49,
        48,
        46,
        45,
        44,
        40,
        39,
        38,
        37,
        36,
        33,
        32,
        31,
        30,
        29,
        28,
        27,
        24,
        22,
        21,
        20,
        18,
        17,
        16,
        15,
        14,
        13,
        12,
        9,
        7,
        6,
        4,
        3,
        2,
        1
    ],
    "finished": true
}