{
    "category": [
        "build/refactor/preprocessing",
        "wrong API usage"
    ],
    "commits": [
        {
            "associated_pull_request": [
                "https://github.com/gluster/glusterfs/pull/1547"
            ],
            "date": "2020-10-07 17:05:17",
            "diff": "",
            "diff_additions": 0,
            "diff_deletions": 0,
            "diff_file_size": 0,
            "diff_url": "https://github.com/gluster/glusterfs/commit/8129a622bd2e4c9df53242dc62141708a18d1c59.diff",
            "exists": true,
            "files": [],
            "interesting": {
                "reopen": false,
                "status": false
            },
            "is_parent": true,
            "sha": "8129a622bd2e4c9df53242dc62141708a18d1c59"
        },
        {
            "associated_pull_request": [
                "https://github.com/gluster/glusterfs/pull/1572"
            ],
            "date": "2020-10-08 14:50:55",
            "diff": "gluster_glusterfs/issue_1569/commit_94c9fd0bd8cdc6b7acdcdbed26e3b33763258bfc.diff",
            "diff_additions": 11,
            "diff_deletions": 0,
            "diff_file_size": 456093,
            "diff_url": "https://github.com/gluster/glusterfs/commit/94c9fd0bd8cdc6b7acdcdbed26e3b33763258bfc.diff",
            "exists": true,
            "files": [
                {
                    "file_additions": 11,
                    "file_deletions": 0,
                    "file_exists": true,
                    "file_name": "xlators/mgmt/glusterd/src/glusterd-utils.c",
                    "file_size": 456093
                }
            ],
            "interesting": {
                "reopen": false,
                "status": true
            },
            "is_parent": false,
            "sha": "94c9fd0bd8cdc6b7acdcdbed26e3b33763258bfc"
        },
        {
            "associated_pull_request": [
                "https://github.com/gluster/glusterfs/pull/1622"
            ],
            "date": "2020-10-13 11:10:23",
            "diff": "gluster_glusterfs/issue_1569/commit_5c340169d887299852b5775ce1db2c2591e4e50c.diff",
            "diff_additions": 10,
            "diff_deletions": 10,
            "diff_file_size": 456093,
            "diff_url": "https://github.com/gluster/glusterfs/commit/5c340169d887299852b5775ce1db2c2591e4e50c.diff",
            "exists": true,
            "files": [
                {
                    "file_additions": 10,
                    "file_deletions": 10,
                    "file_exists": true,
                    "file_name": "xlators/mgmt/glusterd/src/glusterd-utils.c",
                    "file_size": 456093
                }
            ],
            "interesting": {
                "reopen": false,
                "status": false
            },
            "is_parent": false,
            "sha": "5c340169d887299852b5775ce1db2c2591e4e50c"
        },
        {
            "associated_pull_request": [
                "https://github.com/gluster/glusterfs/pull/1622"
            ],
            "date": "2020-10-13 14:39:45",
            "diff": "gluster_glusterfs/issue_1569/commit_07e37295f7a90ae293f68d04a6b2fc65ab3f0f51.diff",
            "diff_additions": 10,
            "diff_deletions": 10,
            "diff_file_size": 456093,
            "diff_url": "https://github.com/gluster/glusterfs/commit/07e37295f7a90ae293f68d04a6b2fc65ab3f0f51.diff",
            "exists": true,
            "files": [
                {
                    "file_additions": 10,
                    "file_deletions": 10,
                    "file_exists": true,
                    "file_name": "xlators/mgmt/glusterd/src/glusterd-utils.c",
                    "file_size": 456093
                }
            ],
            "interesting": {
                "reopen": false,
                "status": false
            },
            "is_parent": false,
            "sha": "07e37295f7a90ae293f68d04a6b2fc65ab3f0f51"
        },
        {
            "associated_pull_request": [],
            "date": "2020-10-13 14:39:45",
            "diff": "gluster_glusterfs/issue_1569/commit_889e4566de04810fd2b81e705998ad2f6f4505f7.diff",
            "diff_additions": 10,
            "diff_deletions": 10,
            "diff_file_size": 456093,
            "diff_url": "https://github.com/gluster/glusterfs/commit/889e4566de04810fd2b81e705998ad2f6f4505f7.diff",
            "exists": true,
            "files": [
                {
                    "file_additions": 10,
                    "file_deletions": 10,
                    "file_exists": true,
                    "file_name": "xlators/mgmt/glusterd/src/glusterd-utils.c",
                    "file_size": 456093
                }
            ],
            "interesting": {
                "reopen": false,
                "status": false
            },
            "is_parent": false,
            "sha": "889e4566de04810fd2b81e705998ad2f6f4505f7"
        }
    ],
    "first_commit": "2020-10-07 17:05:17",
    "last_commit": "2020-10-20 06:37:35",
    "number": 1569,
    "pull_request": "None",
    "score": {
        "accidental_reopen_likely": false,
        "all_labels": [
            "Type:Bug"
        ],
        "contains_keywords": [
            "fail",
            "chang",
            "patch",
            "issu",
            "work",
            "fault"
        ],
        "fix_size": 12,
        "has_labels": [],
        "intersecting": {
            "computed_score": 1.0,
            "final_commit_size": 11,
            "intersection_size": 11,
            "previous_commits_size": 12
        },
        "is_makefile_based": true,
        "no_new_files": [],
        "no_other_files": false,
        "num_prohibited_files": 107655,
        "prohibited_files": [
            "hal/inc/pinmap_hal.h",
            "Debug/marvin.bin",
            "Debug/marvin.elf",
            "Debug/marvin.hex",
            "Debug/marvin.bin",
            "Debug/marvin.elf",
            "Debug/marvin.hex",
            "inc/spark_utilities.h",
            "Debug/marvin.bin",
            "Debug/marvin.elf"
        ],
        "reopen": true,
        "reopen_events": [
            [
                "2020-10-08 14:52:14",
                "commit"
            ],
            [
                "2020-10-09 15:12:44",
                "closed"
            ],
            [
                "2020-10-09 15:12:46",
                "commit"
            ],
            [
                "2020-10-12 06:21:51",
                "commit"
            ],
            [
                "2020-10-13 11:07:34",
                "reopened"
            ],
            [
                "2020-10-13 11:16:05",
                "commit"
            ],
            [
                "2020-10-13 14:39:46",
                "closed"
            ],
            [
                "2020-10-13 14:39:47",
                "commit"
            ],
            [
                "2020-10-20 06:37:58",
                "commit"
            ]
        ],
        "status": false,
        "strategy": true,
        "total_changes": 71
    }
}