{
    "commits": [
        {
            "associated_pull_request": [],
            "date": "2017-11-13 04:58:36+00:00",
            "diff": "ivmai_bdwgc/issue_181/commit_918500dcd5f629391e442f68620873909c733ea7.diff",
            "diff_additions": 17,
            "diff_deletions": 2,
            "diff_file_size": 49880,
            "diff_url": "https://github.com/ivmai/bdwgc/commit/918500dcd5f629391e442f68620873909c733ea7.diff",
            "exists": true,
            "files": [
                {
                    "file_additions": 17,
                    "file_deletions": 2,
                    "file_exists": true,
                    "file_name": "pthread_stop_world.c",
                    "file_size": 49880
                }
            ],
            "interesting": {
                "reopen": false,
                "status": false
            },
            "is_parent": true,
            "sha": "918500dcd5f629391e442f68620873909c733ea7"
        },
        {
            "associated_pull_request": [],
            "date": "2017-11-13 06:04:04+00:00",
            "diff": "ivmai_bdwgc/issue_181/commit_04fd7b5309596423e4342502d3123028d836d551.diff",
            "diff_additions": 9,
            "diff_deletions": 0,
            "diff_file_size": 49880,
            "diff_url": "https://github.com/ivmai/bdwgc/commit/04fd7b5309596423e4342502d3123028d836d551.diff",
            "exists": true,
            "files": [
                {
                    "file_additions": 9,
                    "file_deletions": 0,
                    "file_exists": true,
                    "file_name": "pthread_stop_world.c",
                    "file_size": 49880
                }
            ],
            "interesting": {
                "reopen": false,
                "status": false
            },
            "is_parent": false,
            "sha": "04fd7b5309596423e4342502d3123028d836d551"
        },
        {
            "associated_pull_request": [],
            "date": "2017-11-17 18:32:40+00:00",
            "diff": "ivmai_bdwgc/issue_181/commit_af409e4bdfa25bbab911a706a9f123d98be54c23.diff",
            "diff_additions": 18,
            "diff_deletions": 1,
            "diff_file_size": 49880,
            "diff_url": "https://github.com/ivmai/bdwgc/commit/af409e4bdfa25bbab911a706a9f123d98be54c23.diff",
            "exists": true,
            "files": [
                {
                    "file_additions": 18,
                    "file_deletions": 1,
                    "file_exists": true,
                    "file_name": "pthread_stop_world.c",
                    "file_size": 49880
                }
            ],
            "interesting": {
                "reopen": false,
                "status": false
            },
            "is_parent": false,
            "sha": "af409e4bdfa25bbab911a706a9f123d98be54c23"
        },
        {
            "associated_pull_request": [],
            "date": "2017-12-12 16:56:28+00:00",
            "diff": "ivmai_bdwgc/issue_181/commit_ebc872b55629efb4be570aec8f89c323b567a2e9.diff",
            "diff_additions": 4,
            "diff_deletions": 11,
            "diff_file_size": 49880,
            "diff_url": "https://github.com/ivmai/bdwgc/commit/ebc872b55629efb4be570aec8f89c323b567a2e9.diff",
            "exists": true,
            "files": [
                {
                    "file_additions": 4,
                    "file_deletions": 11,
                    "file_exists": true,
                    "file_name": "pthread_stop_world.c",
                    "file_size": 49880
                }
            ],
            "interesting": {
                "reopen": false,
                "status": false
            },
            "is_parent": false,
            "sha": "ebc872b55629efb4be570aec8f89c323b567a2e9"
        },
        {
            "associated_pull_request": [],
            "date": "2017-12-28 08:37:57+00:00",
            "diff": "ivmai_bdwgc/issue_181/commit_ff5a875bb4ceeffce412a08403dca84ba0a81840.diff",
            "diff_additions": 8,
            "diff_deletions": 7,
            "diff_file_size": 49880,
            "diff_url": "https://github.com/ivmai/bdwgc/commit/ff5a875bb4ceeffce412a08403dca84ba0a81840.diff",
            "exists": true,
            "files": [
                {
                    "file_additions": 8,
                    "file_deletions": 7,
                    "file_exists": true,
                    "file_name": "pthread_stop_world.c",
                    "file_size": 49880
                }
            ],
            "interesting": {
                "reopen": true,
                "status": false
            },
            "is_parent": false,
            "sha": "ff5a875bb4ceeffce412a08403dca84ba0a81840"
        },
        {
            "associated_pull_request": [],
            "date": "2018-03-29 06:54:39+00:00",
            "diff": "ivmai_bdwgc/issue_181/commit_b9fbd1f588beb1a02e4a36cc57e48a4013836086.diff",
            "diff_additions": 5,
            "diff_deletions": 6,
            "diff_file_size": 49880,
            "diff_url": "https://github.com/ivmai/bdwgc/commit/b9fbd1f588beb1a02e4a36cc57e48a4013836086.diff",
            "exists": true,
            "files": [
                {
                    "file_additions": 5,
                    "file_deletions": 6,
                    "file_exists": true,
                    "file_name": "pthread_stop_world.c",
                    "file_size": 49880
                }
            ],
            "interesting": {
                "reopen": false,
                "status": false
            },
            "is_parent": false,
            "sha": "b9fbd1f588beb1a02e4a36cc57e48a4013836086"
        },
        {
            "associated_pull_request": [],
            "date": "2018-03-29 07:23:27+00:00",
            "diff": "ivmai_bdwgc/issue_181/commit_a3610ca70797f484fd2027268de33630b3e70ce5.diff",
            "diff_additions": 22,
            "diff_deletions": 42,
            "diff_file_size": 49880,
            "diff_url": "https://github.com/ivmai/bdwgc/commit/a3610ca70797f484fd2027268de33630b3e70ce5.diff",
            "exists": true,
            "files": [
                {
                    "file_additions": 22,
                    "file_deletions": 42,
                    "file_exists": true,
                    "file_name": "pthread_stop_world.c",
                    "file_size": 49880
                }
            ],
            "interesting": {
                "reopen": false,
                "status": false
            },
            "is_parent": false,
            "sha": "a3610ca70797f484fd2027268de33630b3e70ce5"
        },
        {
            "associated_pull_request": [],
            "date": "2018-03-30 17:41:41+00:00",
            "diff": "ivmai_bdwgc/issue_181/commit_5bf02fe0f63a73ea16e53803977fbef08941c170.diff",
            "diff_additions": 6,
            "diff_deletions": 2,
            "diff_file_size": 49880,
            "diff_url": "https://github.com/ivmai/bdwgc/commit/5bf02fe0f63a73ea16e53803977fbef08941c170.diff",
            "exists": true,
            "files": [
                {
                    "file_additions": 6,
                    "file_deletions": 2,
                    "file_exists": true,
                    "file_name": "pthread_stop_world.c",
                    "file_size": 49880
                }
            ],
            "interesting": {
                "reopen": false,
                "status": false
            },
            "is_parent": false,
            "sha": "5bf02fe0f63a73ea16e53803977fbef08941c170"
        },
        {
            "associated_pull_request": [],
            "date": "2018-04-02 06:22:51+00:00",
            "diff": "ivmai_bdwgc/issue_181/commit_c2e958362144d84473bfdf4e7231fce6dd1dd416.diff",
            "diff_additions": 114,
            "diff_deletions": 101,
            "diff_file_size": 49880,
            "diff_url": "https://github.com/ivmai/bdwgc/commit/c2e958362144d84473bfdf4e7231fce6dd1dd416.diff",
            "exists": true,
            "files": [
                {
                    "file_additions": 114,
                    "file_deletions": 101,
                    "file_exists": true,
                    "file_name": "pthread_stop_world.c",
                    "file_size": 49880
                }
            ],
            "interesting": {
                "reopen": false,
                "status": false
            },
            "is_parent": false,
            "sha": "c2e958362144d84473bfdf4e7231fce6dd1dd416"
        },
        {
            "associated_pull_request": [],
            "date": "2018-04-02 22:03:17+00:00",
            "diff": "ivmai_bdwgc/issue_181/commit_09c682780e88dae59df18dc19223b770ac6e0e18.diff",
            "diff_additions": 1,
            "diff_deletions": 1,
            "diff_file_size": 49880,
            "diff_url": "https://github.com/ivmai/bdwgc/commit/09c682780e88dae59df18dc19223b770ac6e0e18.diff",
            "exists": true,
            "files": [
                {
                    "file_additions": 1,
                    "file_deletions": 1,
                    "file_exists": true,
                    "file_name": "pthread_stop_world.c",
                    "file_size": 49880
                }
            ],
            "interesting": {
                "reopen": false,
                "status": false
            },
            "is_parent": false,
            "sha": "09c682780e88dae59df18dc19223b770ac6e0e18"
        },
        {
            "associated_pull_request": [],
            "date": "2018-04-02 22:23:01+00:00",
            "diff": "ivmai_bdwgc/issue_181/commit_3498427481eb25ca885e64433e9b4bd198aa0368.diff",
            "diff_additions": 21,
            "diff_deletions": 10,
            "diff_file_size": 49880,
            "diff_url": "https://github.com/ivmai/bdwgc/commit/3498427481eb25ca885e64433e9b4bd198aa0368.diff",
            "exists": true,
            "files": [
                {
                    "file_additions": 21,
                    "file_deletions": 10,
                    "file_exists": true,
                    "file_name": "pthread_stop_world.c",
                    "file_size": 49880
                }
            ],
            "interesting": {
                "reopen": false,
                "status": false
            },
            "is_parent": false,
            "sha": "3498427481eb25ca885e64433e9b4bd198aa0368"
        },
        {
            "associated_pull_request": [],
            "date": "2018-04-04 22:40:58+00:00",
            "diff": "ivmai_bdwgc/issue_181/commit_295a2f24e2ebb39afcbc5763fecd09daa2982390.diff",
            "diff_additions": 27,
            "diff_deletions": 13,
            "diff_file_size": 49880,
            "diff_url": "https://github.com/ivmai/bdwgc/commit/295a2f24e2ebb39afcbc5763fecd09daa2982390.diff",
            "exists": true,
            "files": [
                {
                    "file_additions": 27,
                    "file_deletions": 13,
                    "file_exists": true,
                    "file_name": "pthread_stop_world.c",
                    "file_size": 49880
                }
            ],
            "interesting": {
                "reopen": false,
                "status": false
            },
            "is_parent": false,
            "sha": "295a2f24e2ebb39afcbc5763fecd09daa2982390"
        }
    ],
    "first_commit": "2017-11-13 04:58:36+00:00",
    "last_commit": "2018-04-04 22:40:58+00:00",
    "number": 181,
    "pull_request": "None",
    "score": {
        "accidental_reopen_likely": false,
        "all_labels": [],
        "contains_keywords": [
            "work",
            "fail",
            "chang",
            "fix",
            "issu",
            "test",
            "error",
            "workaround"
        ],
        "fix_size": 286,
        "has_labels": [],
        "intersecting": {
            "computed_score": 0.7575757575757576,
            "final_commit_size": 33,
            "intersection_size": 25,
            "previous_commits_size": 278
        },
        "is_makefile_based": true,
        "no_new_files": [],
        "no_other_files": false,
        "num_prohibited_files": 483686,
        "prohibited_files": [
            "server/src/main/java/com/genymobile/scrcpy/Device.java",
            "server/src/main/java/com/genymobile/scrcpy/wrappers/SurfaceControl.java",
            "server/src/main/java/com/genymobile/scrcpy/Device.java",
            "server/src/main/java/com/genymobile/scrcpy/wrappers/SurfaceControl.java",
            "app/meson.build",
            "app/scrcpy.1",
            "app/src/common.h",
            "app/src/scrcpy.h",
            "app/src/server.h",
            "server/src/main/java/com/genymobile/scrcpy/Workarounds.java"
        ],
        "reopen": true,
        "reopen_events": [
            [
                "2017-11-13 06:05:39+00:00",
                "commit"
            ],
            [
                "2017-11-17 18:34:19+00:00",
                "commit"
            ],
            [
                "2017-12-12 16:57:57+00:00",
                "commit"
            ],
            [
                "2017-12-22 19:58:24+00:00",
                "closed"
            ],
            [
                "2017-12-28 08:41:55+00:00",
                "commit"
            ],
            [
                "2017-12-28 12:28:17+00:00",
                "reopened"
            ],
            [
                "2018-03-29 08:52:55+00:00",
                "commit"
            ],
            [
                "2018-03-29 08:52:56+00:00",
                "commit"
            ],
            [
                "2018-04-02 06:54:52+00:00",
                "commit"
            ],
            [
                "2018-04-02 06:54:52+00:00",
                "commit"
            ],
            [
                "2018-04-02 23:26:04+00:00",
                "commit"
            ],
            [
                "2018-04-02 23:26:04+00:00",
                "commit"
            ],
            [
                "2018-04-03 06:47:50+00:00",
                "closed"
            ],
            [
                "2018-04-04 22:44:02+00:00",
                "commit"
            ]
        ],
        "status": false,
        "strategy": true,
        "total_changes": 448
    }
}