{
    "commits": [
        {
            "associated_pull_request": [],
            "date": "2022-11-09 21:33:06+00:00",
            "diff": "yugabyte_yugabyte-db/issue_14716/commit_b006e2b5dfd32e5a53ad49ea5e394211f0c67f38.diff",
            "diff_additions": 28,
            "diff_deletions": 62,
            "diff_file_size": 0,
            "diff_url": "https://github.com/yugabyte/yugabyte-db/commit/b006e2b5dfd32e5a53ad49ea5e394211f0c67f38.diff",
            "exists": true,
            "files": [
                {
                    "file_additions": 28,
                    "file_deletions": 62,
                    "file_exists": false,
                    "file_name": "ent/src/yb/integration-tests/cdcsdk_ysql-test.cc",
                    "file_size": 0
                }
            ],
            "interesting": {
                "reopen": false,
                "status": false
            },
            "is_parent": true,
            "sha": "b006e2b5dfd32e5a53ad49ea5e394211f0c67f38"
        },
        {
            "associated_pull_request": [],
            "date": "2022-11-07 17:32:36+00:00",
            "diff": "yugabyte_yugabyte-db/issue_14716/commit_584d7de37616bca43bf39af8d5993fa08d59c9df.diff",
            "diff_additions": 25,
            "diff_deletions": 14,
            "diff_file_size": 214883,
            "diff_url": "https://github.com/yugabyte/yugabyte-db/commit/584d7de37616bca43bf39af8d5993fa08d59c9df.diff",
            "exists": true,
            "files": [
                {
                    "file_additions": 4,
                    "file_deletions": 4,
                    "file_exists": true,
                    "file_name": "src/yb/rocksdb/db/version_set.cc",
                    "file_size": 142185
                },
                {
                    "file_additions": 5,
                    "file_deletions": 10,
                    "file_exists": true,
                    "file_name": "src/yb/rocksdb/tools/ldb_cmd.cc",
                    "file_size": 68124
                },
                {
                    "file_additions": 16,
                    "file_deletions": 0,
                    "file_exists": true,
                    "file_name": "src/yb/tools/ldb_test.cc",
                    "file_size": 4574
                }
            ],
            "interesting": {
                "reopen": true,
                "status": false
            },
            "is_parent": false,
            "sha": "584d7de37616bca43bf39af8d5993fa08d59c9df"
        },
        {
            "associated_pull_request": [],
            "date": "2022-11-07 17:32:36+00:00",
            "diff": "yugabyte_yugabyte-db/issue_14716/commit_b65a6ae783479e4f2e962c7ee7dc463020aeabc9.diff",
            "diff_additions": 25,
            "diff_deletions": 14,
            "diff_file_size": 214883,
            "diff_url": "https://github.com/yugabyte/yugabyte-db/commit/b65a6ae783479e4f2e962c7ee7dc463020aeabc9.diff",
            "exists": true,
            "files": [
                {
                    "file_additions": 4,
                    "file_deletions": 4,
                    "file_exists": true,
                    "file_name": "src/yb/rocksdb/db/version_set.cc",
                    "file_size": 142185
                },
                {
                    "file_additions": 5,
                    "file_deletions": 10,
                    "file_exists": true,
                    "file_name": "src/yb/rocksdb/tools/ldb_cmd.cc",
                    "file_size": 68124
                },
                {
                    "file_additions": 16,
                    "file_deletions": 0,
                    "file_exists": true,
                    "file_name": "src/yb/tools/ldb_test.cc",
                    "file_size": 4574
                }
            ],
            "interesting": {
                "reopen": false,
                "status": false
            },
            "is_parent": false,
            "sha": "b65a6ae783479e4f2e962c7ee7dc463020aeabc9"
        },
        {
            "associated_pull_request": [],
            "date": "2022-11-07 17:32:36+00:00",
            "diff": "yugabyte_yugabyte-db/issue_14716/commit_3bb8e287f210ff5e8992470cec46ff002acbfa85.diff",
            "diff_additions": 25,
            "diff_deletions": 14,
            "diff_file_size": 214883,
            "diff_url": "https://github.com/yugabyte/yugabyte-db/commit/3bb8e287f210ff5e8992470cec46ff002acbfa85.diff",
            "exists": true,
            "files": [
                {
                    "file_additions": 4,
                    "file_deletions": 4,
                    "file_exists": true,
                    "file_name": "src/yb/rocksdb/db/version_set.cc",
                    "file_size": 142185
                },
                {
                    "file_additions": 5,
                    "file_deletions": 10,
                    "file_exists": true,
                    "file_name": "src/yb/rocksdb/tools/ldb_cmd.cc",
                    "file_size": 68124
                },
                {
                    "file_additions": 16,
                    "file_deletions": 0,
                    "file_exists": true,
                    "file_name": "src/yb/tools/ldb_test.cc",
                    "file_size": 4574
                }
            ],
            "interesting": {
                "reopen": false,
                "status": false
            },
            "is_parent": false,
            "sha": "3bb8e287f210ff5e8992470cec46ff002acbfa85"
        }
    ],
    "first_commit": "2022-11-09 21:34:36+00:00",
    "last_commit": "2023-03-06 14:48:18+00:00",
    "number": 14716,
    "pull_request": "None",
    "score": {
        "accidental_reopen_likely": false,
        "all_labels": [
            "kind/bug",
            "area/docdb",
            "priority/medium",
            "2.14 Backport Required",
            "2.16 Backport Required"
        ],
        "contains_keywords": [
            "fix",
            "issu",
            "test",
            "crash"
        ],
        "fix_size": 62,
        "has_labels": [],
        "intersecting": {
            "computed_score": 0.7027027027027027,
            "final_commit_size": 37,
            "intersection_size": 26,
            "previous_commits_size": 51
        },
        "is_makefile_based": true,
        "no_new_files": [],
        "no_other_files": true,
        "num_prohibited_files": 74495,
        "prohibited_files": [
            "server/src/main/java/com/genymobile/scrcpy/Device.java",
            "server/src/main/java/com/genymobile/scrcpy/wrappers/SurfaceControl.java",
            "server/src/main/java/com/genymobile/scrcpy/Device.java",
            "server/src/main/java/com/genymobile/scrcpy/wrappers/SurfaceControl.java",
            "app/meson.build",
            "app/scrcpy.1",
            "app/src/common.h",
            "app/src/scrcpy.h",
            "app/src/server.h",
            "server/src/main/java/com/genymobile/scrcpy/Workarounds.java"
        ],
        "reopen": true,
        "reopen_events": [
            [
                "2022-11-09 21:49:44+00:00",
                "commit"
            ],
            [
                "2022-11-09 21:50:25+00:00",
                "closed"
            ],
            [
                "2022-12-07 08:37:36+00:00",
                "commit"
            ],
            [
                "2023-03-04 01:29:44+00:00",
                "reopened"
            ],
            [
                "2023-03-06 14:45:59+00:00",
                "commit"
            ],
            [
                "2023-03-06 14:48:22+00:00",
                "commit"
            ],
            [
                "2023-03-06 14:49:18+00:00",
                "closed"
            ]
        ],
        "status": false,
        "strategy": true,
        "total_changes": 207
    }
}