{
    "category": [
        "wrong API usage"
    ],
    "commits": [
        {
            "associated_pull_request": [],
            "date": "2020-10-31 21:39:19",
            "diff": "",
            "diff_additions": 0,
            "diff_deletions": 0,
            "diff_file_size": 0,
            "diff_url": "https://github.com/erthink/libmdbx/commit/21d2af9e902ba6e3220651996754427ff9ac361d.diff",
            "exists": true,
            "files": [],
            "interesting": {
                "reopen": false,
                "status": false
            },
            "is_parent": true,
            "sha": "21d2af9e902ba6e3220651996754427ff9ac361d"
        },
        {
            "associated_pull_request": [],
            "date": "2020-11-15 04:54:09",
            "diff": "erthink_libmdbx/issue_136/commit_3ed58c281a6ad2071763bec4c2f82c75e28ee306.diff",
            "diff_additions": 2,
            "diff_deletions": 0,
            "diff_file_size": 23763,
            "diff_url": "https://github.com/erthink/libmdbx/commit/3ed58c281a6ad2071763bec4c2f82c75e28ee306.diff",
            "exists": true,
            "files": [
                {
                    "file_additions": 2,
                    "file_deletions": 0,
                    "file_exists": true,
                    "file_name": "src/mdbx_load.c",
                    "file_size": 23763
                }
            ],
            "interesting": {
                "reopen": false,
                "status": false
            },
            "is_parent": false,
            "sha": "3ed58c281a6ad2071763bec4c2f82c75e28ee306"
        },
        {
            "associated_pull_request": [],
            "date": "2020-11-15 04:57:15",
            "diff": "erthink_libmdbx/issue_136/commit_74e495569ed7d87e37fb23f302685d4153579092.diff",
            "diff_additions": 9,
            "diff_deletions": 4,
            "diff_file_size": 23763,
            "diff_url": "https://github.com/erthink/libmdbx/commit/74e495569ed7d87e37fb23f302685d4153579092.diff",
            "exists": true,
            "files": [
                {
                    "file_additions": 9,
                    "file_deletions": 4,
                    "file_exists": true,
                    "file_name": "src/mdbx_load.c",
                    "file_size": 23763
                }
            ],
            "interesting": {
                "reopen": false,
                "status": false
            },
            "is_parent": false,
            "sha": "74e495569ed7d87e37fb23f302685d4153579092"
        },
        {
            "associated_pull_request": [],
            "date": "2020-11-15 21:50:27",
            "diff": "erthink_libmdbx/issue_136/commit_06691aeafc0df4b6021170df3a40f6162c07102e.diff",
            "diff_additions": 1,
            "diff_deletions": 1,
            "diff_file_size": 23763,
            "diff_url": "https://github.com/erthink/libmdbx/commit/06691aeafc0df4b6021170df3a40f6162c07102e.diff",
            "exists": true,
            "files": [
                {
                    "file_additions": 1,
                    "file_deletions": 1,
                    "file_exists": true,
                    "file_name": "src/mdbx_load.c",
                    "file_size": 23763
                }
            ],
            "interesting": {
                "reopen": false,
                "status": true
            },
            "is_parent": false,
            "sha": "06691aeafc0df4b6021170df3a40f6162c07102e"
        }
    ],
    "first_commit": "2020-10-31 21:39:19",
    "last_commit": "2020-11-27 07:09:03",
    "number": 136,
    "pull_request": "None",
    "score": {
        "accidental_reopen_likely": false,
        "all_labels": [],
        "contains_keywords": [
            "workaround",
            "issu",
            "warn",
            "chang",
            "work",
            "error",
            "fix",
            "reason",
            "report",
            "test",
            "bug",
            "fail"
        ],
        "fix_size": 13,
        "has_labels": [],
        "intersecting": {
            "computed_score": 0.5,
            "final_commit_size": 2,
            "intersection_size": 1,
            "previous_commits_size": 12
        },
        "is_makefile_based": true,
        "no_new_files": [],
        "no_other_files": true,
        "num_prohibited_files": 34350,
        "prohibited_files": [
            "tools/building.py",
            "tools/building.py",
            "tools/building.py",
            "emcc.py",
            "src/library_emmalloc.js",
            "src/shell.js",
            "tests/test_core.py",
            "src/shell.js",
            "tests/test_core.py",
            "src/library.js"
        ],
        "reopen": false,
        "reopen_events": [
            [
                "2020-11-15 05:02:59",
                "commit"
            ],
            [
                "2020-11-15 05:02:59",
                "commit"
            ],
            [
                "2020-11-15 05:29:31",
                "closed"
            ],
            [
                "2020-11-15 21:53:51",
                "commit"
            ],
            [
                "2020-11-27 08:42:22",
                "commit"
            ]
        ],
        "status": true,
        "strategy": true,
        "total_changes": 17
    }
}