{
    "category": [
        "memory",
        "multithreading"
    ],
    "commits": [
        {
            "associated_pull_request": [],
            "date": "2017-12-11 19:05:49",
            "diff": "nesbox_tic-80/issue_197/commit_80dcda8c2a9188f49e7c4dc69ba72da7455b98a5.diff",
            "diff_additions": 1,
            "diff_deletions": 2,
            "diff_file_size": 3534,
            "diff_url": "https://github.com/nesbox/TIC-80/commit/80dcda8c2a9188f49e7c4dc69ba72da7455b98a5.diff",
            "exists": true,
            "files": [
                {
                    "file_additions": 1,
                    "file_deletions": 2,
                    "file_exists": true,
                    "file_name": "src/tic.c",
                    "file_size": 3534
                }
            ],
            "interesting": {
                "reopen": false,
                "status": false
            },
            "is_parent": true,
            "sha": "80dcda8c2a9188f49e7c4dc69ba72da7455b98a5"
        },
        {
            "associated_pull_request": [],
            "date": "2017-12-12 01:29:56",
            "diff": "nesbox_tic-80/issue_197/commit_7562ae7e6478bb0e68bb912707dedc8f22439482.diff",
            "diff_additions": 23,
            "diff_deletions": 0,
            "diff_file_size": 0,
            "diff_url": "https://github.com/nesbox/TIC-80/commit/7562ae7e6478bb0e68bb912707dedc8f22439482.diff",
            "exists": true,
            "files": [
                {
                    "file_additions": 23,
                    "file_deletions": 0,
                    "file_exists": false,
                    "file_name": "src/luaapi.c",
                    "file_size": 0
                }
            ],
            "interesting": {
                "reopen": false,
                "status": false
            },
            "is_parent": false,
            "sha": "7562ae7e6478bb0e68bb912707dedc8f22439482"
        },
        {
            "associated_pull_request": [],
            "date": "2017-12-12 09:50:39",
            "diff": "nesbox_tic-80/issue_197/commit_18aca45673f2311215b24db42f65fa23cc2dcbc4.diff",
            "diff_additions": 32,
            "diff_deletions": 1,
            "diff_file_size": 0,
            "diff_url": "https://github.com/nesbox/TIC-80/commit/18aca45673f2311215b24db42f65fa23cc2dcbc4.diff",
            "exists": true,
            "files": [
                {
                    "file_additions": 20,
                    "file_deletions": 1,
                    "file_exists": false,
                    "file_name": "src/luaapi.c",
                    "file_size": 0
                },
                {
                    "file_additions": 12,
                    "file_deletions": 0,
                    "file_exists": false,
                    "file_name": "src/run.c",
                    "file_size": 0
                }
            ],
            "interesting": {
                "reopen": false,
                "status": false
            },
            "is_parent": false,
            "sha": "18aca45673f2311215b24db42f65fa23cc2dcbc4"
        },
        {
            "associated_pull_request": [],
            "date": "2017-12-12 10:46:05",
            "diff": "nesbox_tic-80/issue_197/commit_c90b3ba171e8c989354c007df58dec88667d0bcb.diff",
            "diff_additions": 5,
            "diff_deletions": 14,
            "diff_file_size": 0,
            "diff_url": "https://github.com/nesbox/TIC-80/commit/c90b3ba171e8c989354c007df58dec88667d0bcb.diff",
            "exists": true,
            "files": [
                {
                    "file_additions": 2,
                    "file_deletions": 7,
                    "file_exists": false,
                    "file_name": "src/luaapi.c",
                    "file_size": 0
                },
                {
                    "file_additions": 3,
                    "file_deletions": 7,
                    "file_exists": false,
                    "file_name": "src/run.c",
                    "file_size": 0
                }
            ],
            "interesting": {
                "reopen": false,
                "status": false
            },
            "is_parent": false,
            "sha": "c90b3ba171e8c989354c007df58dec88667d0bcb"
        },
        {
            "associated_pull_request": [],
            "date": "2017-12-20 00:27:40",
            "diff": "nesbox_tic-80/issue_197/commit_bc0660cf5c436542ac5432a78219f0399ef67781.diff",
            "diff_additions": 12,
            "diff_deletions": 0,
            "diff_file_size": 0,
            "diff_url": "https://github.com/nesbox/TIC-80/commit/bc0660cf5c436542ac5432a78219f0399ef67781.diff",
            "exists": true,
            "files": [
                {
                    "file_additions": 12,
                    "file_deletions": 0,
                    "file_exists": false,
                    "file_name": "src/bfapi.c",
                    "file_size": 0
                }
            ],
            "interesting": {
                "reopen": true,
                "status": false
            },
            "is_parent": false,
            "sha": "bc0660cf5c436542ac5432a78219f0399ef67781"
        },
        {
            "associated_pull_request": [],
            "date": "2017-12-20 11:42:34",
            "diff": "nesbox_tic-80/issue_197/commit_0e997f5d333457cd43e3ad24475175420d785d6a.diff",
            "diff_additions": 9,
            "diff_deletions": 1,
            "diff_file_size": 0,
            "diff_url": "https://github.com/nesbox/TIC-80/commit/0e997f5d333457cd43e3ad24475175420d785d6a.diff",
            "exists": true,
            "files": [
                {
                    "file_additions": 9,
                    "file_deletions": 1,
                    "file_exists": false,
                    "file_name": "src/jsapi.c",
                    "file_size": 0
                }
            ],
            "interesting": {
                "reopen": false,
                "status": false
            },
            "is_parent": false,
            "sha": "0e997f5d333457cd43e3ad24475175420d785d6a"
        },
        {
            "associated_pull_request": [],
            "date": "2018-01-11 09:41:44",
            "diff": "nesbox_tic-80/issue_197/commit_ea362a12e09afcfb45e5e9e6836d3df5adb3aefe.diff",
            "diff_additions": 12,
            "diff_deletions": 1,
            "diff_file_size": 0,
            "diff_url": "https://github.com/nesbox/TIC-80/commit/ea362a12e09afcfb45e5e9e6836d3df5adb3aefe.diff",
            "exists": true,
            "files": [
                {
                    "file_additions": 12,
                    "file_deletions": 1,
                    "file_exists": false,
                    "file_name": "src/jsapi.c",
                    "file_size": 0
                }
            ],
            "interesting": {
                "reopen": false,
                "status": false
            },
            "is_parent": false,
            "sha": "ea362a12e09afcfb45e5e9e6836d3df5adb3aefe"
        },
        {
            "associated_pull_request": [],
            "date": "2017-12-12 09:50:39",
            "diff": "nesbox_tic-80/issue_197/commit_efb9c2c4b50194b2a8fe2c4daa19627b9194e24e.diff",
            "diff_additions": 32,
            "diff_deletions": 1,
            "diff_file_size": 0,
            "diff_url": "https://github.com/nesbox/TIC-80/commit/efb9c2c4b50194b2a8fe2c4daa19627b9194e24e.diff",
            "exists": true,
            "files": [
                {
                    "file_additions": 20,
                    "file_deletions": 1,
                    "file_exists": false,
                    "file_name": "src/luaapi.c",
                    "file_size": 0
                },
                {
                    "file_additions": 12,
                    "file_deletions": 0,
                    "file_exists": false,
                    "file_name": "src/run.c",
                    "file_size": 0
                }
            ],
            "interesting": {
                "reopen": false,
                "status": false
            },
            "is_parent": false,
            "sha": "efb9c2c4b50194b2a8fe2c4daa19627b9194e24e"
        },
        {
            "associated_pull_request": [],
            "date": "2017-12-12 10:46:05",
            "diff": "nesbox_tic-80/issue_197/commit_af5bbc13aef947cf0ed63a84458e24f44b99a658.diff",
            "diff_additions": 5,
            "diff_deletions": 14,
            "diff_file_size": 0,
            "diff_url": "https://github.com/nesbox/TIC-80/commit/af5bbc13aef947cf0ed63a84458e24f44b99a658.diff",
            "exists": true,
            "files": [
                {
                    "file_additions": 2,
                    "file_deletions": 7,
                    "file_exists": false,
                    "file_name": "src/luaapi.c",
                    "file_size": 0
                },
                {
                    "file_additions": 3,
                    "file_deletions": 7,
                    "file_exists": false,
                    "file_name": "src/run.c",
                    "file_size": 0
                }
            ],
            "interesting": {
                "reopen": false,
                "status": false
            },
            "is_parent": false,
            "sha": "af5bbc13aef947cf0ed63a84458e24f44b99a658"
        },
        {
            "associated_pull_request": [],
            "date": "2017-12-20 11:42:34",
            "diff": "nesbox_tic-80/issue_197/commit_548a2837b5a1526c082c887ab04d07e80777d6b1.diff",
            "diff_additions": 9,
            "diff_deletions": 1,
            "diff_file_size": 0,
            "diff_url": "https://github.com/nesbox/TIC-80/commit/548a2837b5a1526c082c887ab04d07e80777d6b1.diff",
            "exists": true,
            "files": [
                {
                    "file_additions": 9,
                    "file_deletions": 1,
                    "file_exists": false,
                    "file_name": "src/jsapi.c",
                    "file_size": 0
                }
            ],
            "interesting": {
                "reopen": false,
                "status": false
            },
            "is_parent": false,
            "sha": "548a2837b5a1526c082c887ab04d07e80777d6b1"
        }
    ],
    "first_commit": "2017-12-11 19:05:49",
    "last_commit": "2018-10-17 00:18:08",
    "number": 197,
    "pull_request": "None",
    "score": {
        "accidental_reopen_likely": false,
        "all_labels": [
            "bug"
        ],
        "contains_keywords": [
            "chang",
            "reason",
            "error",
            "bug",
            "problem",
            "test",
            "fix",
            "issu",
            "work",
            "perform",
            "debug"
        ],
        "fix_size": 93,
        "has_labels": [
            "bug"
        ],
        "intersecting": {
            "computed_score": 1.0,
            "final_commit_size": 10,
            "intersection_size": 10,
            "previous_commits_size": 93
        },
        "is_makefile_based": true,
        "no_new_files": [],
        "no_other_files": false,
        "num_prohibited_files": 7196,
        "prohibited_files": [
            "hal/inc/pinmap_hal.h",
            "Debug/marvin.bin",
            "Debug/marvin.elf",
            "Debug/marvin.hex",
            "Debug/marvin.bin",
            "Debug/marvin.elf",
            "Debug/marvin.hex",
            "inc/spark_utilities.h",
            "Debug/marvin.bin",
            "Debug/marvin.elf"
        ],
        "reopen": true,
        "reopen_events": [
            [
                "2017-12-12 01:30:05",
                "commit"
            ],
            [
                "2017-12-12 09:50:52",
                "commit"
            ],
            [
                "2017-12-12 09:52:48",
                "closed"
            ],
            [
                "2017-12-12 10:46:13",
                "commit"
            ],
            [
                "2017-12-20 00:27:25",
                "commit"
            ],
            [
                "2017-12-20 07:15:06",
                "reopened"
            ],
            [
                "2017-12-20 11:42:42",
                "commit"
            ],
            [
                "2017-12-20 11:43:15",
                "closed"
            ],
            [
                "2018-01-11 09:41:53",
                "commit"
            ],
            [
                "2018-10-17 00:25:46",
                "commit"
            ],
            [
                "2018-10-17 00:25:46",
                "commit"
            ],
            [
                "2018-10-17 00:25:46",
                "commit"
            ]
        ],
        "status": false,
        "strategy": true,
        "total_changes": 175
    }
}