{
    "covered_issues": [
        1329,
        1328,
        1319,
        1318,
        1317,
        1316,
        1315,
        1312,
        1311,
        1310,
        1306,
        1305,
        1304,
        1303,
        1301,
        1300,
        1296,
        1293,
        1292,
        1290,
        1288,
        1287,
        1286,
        1283,
        1280,
        1278,
        1277,
        1276,
        1274,
        1272,
        1271,
        1268,
        1263,
        1262,
        1259,
        1253,
        1251,
        1248,
        1244,
        1243,
        1236,
        1235,
        1232,
        1228,
        1226,
        1224,
        1223,
        1222,
        1221,
        1220,
        1219,
        1218,
        1216,
        1215,
        1214,
        1212,
        1211,
        1210,
        1209,
        1204,
        1201,
        1199,
        1198,
        1196,
        1195,
        1192,
        1190,
        1185,
        1184,
        1182,
        1180,
        1179,
        1176,
        1173,
        1172,
        1171,
        1163,
        1159,
        1157,
        1156,
        1153,
        1150,
        1148,
        1147,
        1146,
        1145,
        1144,
        1143,
        1142,
        1141,
        1140,
        1135,
        1132,
        1131,
        1130,
        1128,
        1124,
        1123,
        1120,
        1118,
        1110,
        1108,
        1105,
        1103,
        1100,
        1099,
        1097,
        1096,
        1089,
        1086,
        1083,
        1082,
        1081,
        1079,
        1076,
        1075,
        1072,
        1070,
        1066,
        1065,
        1063,
        1059,
        1055,
        1053,
        1052,
        1049,
        1047,
        1046,
        1044,
        1043,
        1041,
        1040,
        1039,
        1038,
        1036,
        1033,
        1029,
        1028,
        1027,
        1025,
        1024,
        1022,
        1021,
        1011,
        1009,
        1008,
        1006,
        1003,
        1002,
        1001,
        999,
        994,
        993,
        992,
        991,
        990,
        985,
        983,
        982,
        980,
        978,
        977,
        976,
        975,
        974,
        972,
        970,
        969,
        968,
        960,
        958,
        956,
        955,
        954,
        953,
        951,
        947,
        946,
        945,
        944,
        940,
        939,
        938,
        937,
        936,
        934,
        933,
        931,
        930,
        928,
        924,
        922,
        921,
        920,
        919,
        918,
        915,
        913,
        912,
        910,
        908,
        906,
        905,
        902,
        901,
        897,
        895,
        894,
        889,
        888,
        886,
        885,
        884,
        883,
        882,
        881,
        880,
        879,
        877,
        873,
        871,
        870,
        869,
        865,
        864,
        863,
        862,
        861,
        860,
        859,
        858,
        855,
        853,
        850,
        849,
        847,
        846,
        845,
        844,
        841,
        840,
        838,
        837,
        836,
        834,
        831,
        829,
        828,
        827,
        826,
        825,
        824,
        823,
        822,
        820,
        819,
        818,
        817,
        815,
        814,
        812,
        811,
        810,
        809,
        808,
        807,
        805,
        804,
        803,
        801,
        800,
        799,
        798,
        797,
        796,
        795,
        794,
        793,
        792,
        791,
        790,
        789,
        788,
        787,
        785,
        784,
        783,
        782,
        780,
        779,
        778,
        777,
        776,
        775,
        774,
        773,
        772,
        771,
        770,
        769,
        767,
        766,
        765,
        761,
        759,
        758,
        757,
        755,
        754,
        750,
        748,
        746,
        745,
        743,
        742,
        741,
        739,
        738,
        736,
        731,
        730,
        729,
        728,
        727,
        726,
        725,
        723,
        721,
        720,
        718,
        709,
        708,
        707,
        706,
        705,
        702,
        700,
        698,
        697,
        696,
        695,
        694,
        693,
        692,
        691,
        690,
        688,
        687,
        686,
        681,
        679,
        677,
        676,
        675,
        673,
        672,
        671,
        668,
        667,
        663,
        661,
        660,
        659,
        658,
        656,
        654,
        653,
        652,
        651,
        650,
        648,
        647,
        646,
        644,
        643,
        642,
        641,
        639,
        638,
        636,
        633,
        631,
        630,
        626,
        624,
        623,
        622,
        621,
        620,
        619,
        618,
        616,
        615,
        613,
        610,
        609,
        607,
        602,
        601,
        600,
        599,
        598,
        597,
        594,
        591,
        589,
        588,
        587,
        586,
        585,
        584,
        583,
        582,
        581,
        580,
        579,
        578,
        577,
        576,
        575,
        574,
        573,
        572,
        571,
        570,
        564,
        560,
        555,
        554,
        553,
        552,
        550,
        549,
        548,
        547,
        545,
        544,
        543,
        541,
        540,
        538,
        536,
        534,
        533,
        529,
        528,
        525,
        523,
        522,
        519,
        518,
        517,
        516,
        515,
        514,
        512,
        511,
        508,
        503,
        501,
        500,
        499,
        498,
        497,
        494,
        492,
        491,
        490,
        489,
        488,
        487,
        485,
        484,
        482,
        481,
        480,
        479,
        478,
        477,
        475,
        474,
        472,
        471,
        470,
        469,
        468,
        467,
        466,
        465,
        464,
        463,
        462,
        461,
        459,
        458,
        457,
        455,
        454,
        453,
        450,
        449,
        447,
        445,
        444,
        443,
        442,
        441,
        438,
        437,
        436,
        429,
        426,
        425,
        424,
        422,
        421,
        420,
        419,
        417,
        416,
        415,
        413,
        412,
        411,
        410,
        409,
        408,
        407,
        406,
        405,
        404,
        403,
        402,
        400,
        399,
        397,
        396,
        395,
        394,
        393,
        391,
        390,
        389,
        388,
        387,
        385,
        384,
        383,
        382,
        381,
        379,
        376,
        373,
        372,
        370,
        369,
        367,
        366,
        364,
        363,
        361,
        360,
        359,
        357,
        356,
        355,
        354,
        353,
        352,
        351,
        350,
        349,
        348,
        347,
        346,
        345,
        344,
        343,
        342,
        341,
        340,
        339,
        338,
        337,
        336,
        335,
        334,
        333,
        332,
        331,
        330,
        329,
        328,
        326,
        324,
        323,
        322,
        317,
        316,
        314,
        313,
        311,
        310,
        307,
        306,
        305,
        303,
        302,
        301,
        300,
        299,
        298,
        296,
        295,
        294,
        292,
        291,
        290,
        289,
        288,
        279,
        278,
        275,
        273,
        272,
        270,
        269,
        268,
        267,
        266,
        265,
        264,
        263,
        262,
        261,
        260,
        259,
        255,
        254,
        253,
        252,
        251,
        250,
        247,
        244,
        241,
        240,
        238,
        235,
        233,
        232,
        231,
        230,
        229,
        227,
        224,
        222,
        221,
        219,
        217,
        216,
        215,
        214,
        213,
        212,
        209,
        208,
        207,
        206,
        205,
        204,
        203,
        202,
        200,
        199,
        196,
        194,
        193,
        192,
        191,
        189,
        188,
        187,
        186,
        185,
        182,
        180,
        175,
        173,
        172,
        169,
        168,
        167,
        160,
        159,
        158,
        156,
        151,
        150,
        149,
        148,
        147,
        146,
        144,
        142,
        139,
        137,
        136,
        132,
        131,
        130,
        128,
        127,
        126,
        125,
        124,
        123,
        121,
        119,
        118,
        117,
        116,
        115,
        113,
        111,
        110,
        108,
        107,
        106,
        105,
        104,
        103,
        98,
        97,
        96,
        95,
        94,
        93,
        92,
        91,
        90,
        88,
        87,
        84,
        81,
        80,
        79,
        78,
        77,
        76,
        72,
        70,
        63,
        61,
        58,
        57,
        56,
        50,
        49,
        48,
        47,
        46,
        45,
        43,
        42,
        39,
        38,
        37,
        35,
        34,
        33,
        32,
        31,
        30,
        29,
        28,
        27,
        24,
        23,
        22,
        21,
        20,
        18,
        17,
        16,
        14,
        12,
        11,
        10,
        9,
        8,
        7,
        5
    ],
    "finished": true
}