{
    "category": [
        "memory",
        "wrong API usage"
    ],
    "commits": [
        {
            "associated_pull_request": [],
            "date": "2015-11-27 21:14:08",
            "diff": "collectd_collectd/issue_1350/commit_72880f7c39fa0fc673b8f2db7530f035d123b4b0.diff",
            "diff_additions": 3,
            "diff_deletions": 0,
            "diff_file_size": 72172,
            "diff_url": "https://github.com/collectd/collectd/commit/72880f7c39fa0fc673b8f2db7530f035d123b4b0.diff",
            "exists": true,
            "files": [
                {
                    "file_additions": 3,
                    "file_deletions": 0,
                    "file_exists": true,
                    "file_name": "src/snmp.c",
                    "file_size": 72172
                }
            ],
            "interesting": {
                "reopen": false,
                "status": false
            },
            "is_parent": true,
            "sha": "72880f7c39fa0fc673b8f2db7530f035d123b4b0"
        },
        {
            "associated_pull_request": [],
            "date": "2015-11-30 09:15:06",
            "diff": "collectd_collectd/issue_1350/commit_a9f03564aad7917086d9b3f9cdb98a8613eaaf98.diff",
            "diff_additions": 96,
            "diff_deletions": 0,
            "diff_file_size": 14274,
            "diff_url": "https://github.com/collectd/collectd/commit/a9f03564aad7917086d9b3f9cdb98a8613eaaf98.diff",
            "exists": true,
            "files": [
                {
                    "file_additions": 64,
                    "file_deletions": 0,
                    "file_exists": true,
                    "file_name": "src/ceph_test.c",
                    "file_size": 5715
                },
                {
                    "file_additions": 32,
                    "file_deletions": 0,
                    "file_exists": true,
                    "file_name": "src/daemon/plugin_mock.c",
                    "file_size": 8559
                }
            ],
            "interesting": {
                "reopen": false,
                "status": false
            },
            "is_parent": false,
            "sha": "a9f03564aad7917086d9b3f9cdb98a8613eaaf98"
        },
        {
            "associated_pull_request": [],
            "date": "2015-11-30 10:25:48",
            "diff": "collectd_collectd/issue_1350/commit_bb715b67ca90d28ad8b69c08689673a9680271de.diff",
            "diff_additions": 121,
            "diff_deletions": 119,
            "diff_file_size": 47135,
            "diff_url": "https://github.com/collectd/collectd/commit/bb715b67ca90d28ad8b69c08689673a9680271de.diff",
            "exists": true,
            "files": [
                {
                    "file_additions": 120,
                    "file_deletions": 118,
                    "file_exists": true,
                    "file_name": "src/ceph.c",
                    "file_size": 41420
                },
                {
                    "file_additions": 1,
                    "file_deletions": 1,
                    "file_exists": true,
                    "file_name": "src/ceph_test.c",
                    "file_size": 5715
                }
            ],
            "interesting": {
                "reopen": false,
                "status": false
            },
            "is_parent": false,
            "sha": "bb715b67ca90d28ad8b69c08689673a9680271de"
        },
        {
            "associated_pull_request": [],
            "date": "2015-11-30 10:25:48",
            "diff": "collectd_collectd/issue_1350/commit_bb715b67ca90d28ad8b69c08689673a9680271de.diff",
            "diff_additions": 121,
            "diff_deletions": 119,
            "diff_file_size": 47135,
            "diff_url": "https://github.com/collectd/collectd/commit/bb715b67ca90d28ad8b69c08689673a9680271de.diff",
            "exists": true,
            "files": [
                {
                    "file_additions": 120,
                    "file_deletions": 118,
                    "file_exists": true,
                    "file_name": "src/ceph.c",
                    "file_size": 41420
                },
                {
                    "file_additions": 1,
                    "file_deletions": 1,
                    "file_exists": true,
                    "file_name": "src/ceph_test.c",
                    "file_size": 5715
                }
            ],
            "interesting": {
                "reopen": true,
                "status": false
            },
            "is_parent": false,
            "sha": "bb715b67ca90d28ad8b69c08689673a9680271de"
        },
        {
            "associated_pull_request": [
                "https://github.com/collectd/collectd/pull/1399"
            ],
            "date": "2015-12-02 19:37:28",
            "diff": "collectd_collectd/issue_1350/commit_380959068f87619143e98c52399847eb761fb222.diff",
            "diff_additions": 47,
            "diff_deletions": 36,
            "diff_file_size": 41420,
            "diff_url": "https://github.com/collectd/collectd/commit/380959068f87619143e98c52399847eb761fb222.diff",
            "exists": true,
            "files": [
                {
                    "file_additions": 47,
                    "file_deletions": 36,
                    "file_exists": true,
                    "file_name": "src/ceph.c",
                    "file_size": 41420
                }
            ],
            "interesting": {
                "reopen": false,
                "status": false
            },
            "is_parent": false,
            "sha": "380959068f87619143e98c52399847eb761fb222"
        },
        {
            "associated_pull_request": [],
            "date": "2015-12-03 10:49:42",
            "diff": "collectd_collectd/issue_1350/commit_e63a8fc526aff9bbc89a23084e98523677977ddf.diff",
            "diff_additions": 204,
            "diff_deletions": 61,
            "diff_file_size": 47135,
            "diff_url": "https://github.com/collectd/collectd/commit/e63a8fc526aff9bbc89a23084e98523677977ddf.diff",
            "exists": true,
            "files": [
                {
                    "file_additions": 77,
                    "file_deletions": 61,
                    "file_exists": true,
                    "file_name": "src/ceph.c",
                    "file_size": 41420
                },
                {
                    "file_additions": 127,
                    "file_deletions": 0,
                    "file_exists": true,
                    "file_name": "src/ceph_test.c",
                    "file_size": 5715
                }
            ],
            "interesting": {
                "reopen": false,
                "status": true
            },
            "is_parent": false,
            "sha": "e63a8fc526aff9bbc89a23084e98523677977ddf"
        },
        {
            "associated_pull_request": [
                "https://github.com/collectd/collectd/pull/1399"
            ],
            "date": "2015-12-03 12:05:03",
            "diff": "collectd_collectd/issue_1350/commit_e5a9d9dee9e5ad0d47a68723bb7aa33b65355214.diff",
            "diff_additions": 205,
            "diff_deletions": 61,
            "diff_file_size": 47135,
            "diff_url": "https://github.com/collectd/collectd/commit/e5a9d9dee9e5ad0d47a68723bb7aa33b65355214.diff",
            "exists": true,
            "files": [
                {
                    "file_additions": 78,
                    "file_deletions": 61,
                    "file_exists": true,
                    "file_name": "src/ceph.c",
                    "file_size": 41420
                },
                {
                    "file_additions": 127,
                    "file_deletions": 0,
                    "file_exists": true,
                    "file_name": "src/ceph_test.c",
                    "file_size": 5715
                }
            ],
            "interesting": {
                "reopen": false,
                "status": false
            },
            "is_parent": false,
            "sha": "e5a9d9dee9e5ad0d47a68723bb7aa33b65355214"
        }
    ],
    "first_commit": "2015-11-28 06:50:45",
    "last_commit": "2015-12-03 12:05:03",
    "number": 1350,
    "pull_request": "None",
    "score": {
        "accidental_reopen_likely": false,
        "all_labels": [
            "Bug"
        ],
        "contains_keywords": [
            "reason",
            "error",
            "bug",
            "problem",
            "crash",
            "test",
            "fix",
            "remov",
            "issu",
            "work",
            "CI",
            "fault",
            "leak",
            "debug"
        ],
        "fix_size": 422,
        "has_labels": [],
        "intersecting": {
            "computed_score": 0.9730941704035875,
            "final_commit_size": 223,
            "intersection_size": 217,
            "previous_commits_size": 416
        },
        "is_makefile_based": true,
        "no_new_files": [],
        "no_other_files": false,
        "num_prohibited_files": 105566,
        "prohibited_files": [
            "hal/inc/pinmap_hal.h",
            "Debug/marvin.bin",
            "Debug/marvin.elf",
            "Debug/marvin.hex",
            "Debug/marvin.bin",
            "Debug/marvin.elf",
            "Debug/marvin.hex",
            "inc/spark_utilities.h",
            "Debug/marvin.bin",
            "Debug/marvin.elf"
        ],
        "reopen": true,
        "reopen_events": [
            [
                "2015-11-30 10:31:29",
                "commit"
            ],
            [
                "2015-11-30 10:31:29",
                "commit"
            ],
            [
                "2015-11-30 10:42:51",
                "closed"
            ],
            [
                "2015-11-30 10:42:51",
                "commit"
            ],
            [
                "2015-12-02 18:40:51",
                "reopened"
            ],
            [
                "2015-12-02 19:38:07",
                "commit"
            ],
            [
                "2015-12-03 10:52:03",
                "commit"
            ],
            [
                "2015-12-03 12:05:21",
                "commit"
            ],
            [
                "2015-12-04 11:36:17",
                "closed"
            ]
        ],
        "status": false,
        "strategy": true,
        "total_changes": 1193
    }
}