{
    "covered_issues": [
        260,
        257,
        256,
        255,
        254,
        251,
        248,
        246,
        245,
        241,
        238,
        234,
        232,
        228,
        224,
        186,
        184,
        177,
        161,
        160,
        149,
        130,
        126,
        125,
        120,
        119,
        118,
        111,
        109,
        93,
        84,
        73,
        72,
        70,
        65,
        64,
        63,
        62,
        55,
        54,
        53,
        52,
        48,
        46,
        45,
        44,
        43,
        42,
        40,
        39,
        38,
        37,
        35,
        31,
        30,
        28,
        27,
        26,
        25,
        24,
        23,
        22,
        21,
        20,
        19,
        18,
        14,
        13,
        12,
        11,
        10,
        9,
        8,
        7,
        6,
        4,
        3,
        2,
        1
    ],
    "finished": true
}