{
    "commits": [
        {
            "diff": "elastic_elasticsearch/issue_34590/commit_a69c540f12daded596ce2db931b0d3fbbe19c942.diff",
            "diff_additions": 1,
            "diff_deletions": 0,
            "diff_file_size": 80527,
            "files": [
                {
                    "file_additions": 1,
                    "file_deletions": 0,
                    "file_exists": true,
                    "file_name": "qa/full-cluster-restart/src/test/java/org/elasticsearch/upgrades/FullClusterRestartIT.java",
                    "file_size": 80527
                }
            ],
            "interesting": {
                "reopened": false,
                "status": false
            },
            "sha": "a69c540f12daded596ce2db931b0d3fbbe19c942"
        },
        {
            "diff": "elastic_elasticsearch/issue_34590/commit_48720bb53efbfbea095aa52383fc5dc91abab9d4.diff",
            "diff_additions": 51,
            "diff_deletions": 38,
            "diff_file_size": 108630,
            "files": [
                {
                    "file_additions": 41,
                    "file_deletions": 38,
                    "file_exists": true,
                    "file_name": "x-pack/plugin/sql/src/main/java/org/elasticsearch/xpack/sql/analysis/analyzer/Verifier.java",
                    "file_size": 42339
                },
                {
                    "file_additions": 10,
                    "file_deletions": 0,
                    "file_exists": true,
                    "file_name": "x-pack/plugin/sql/src/test/java/org/elasticsearch/xpack/sql/analysis/analyzer/VerifierErrorMessagesTests.java",
                    "file_size": 66291
                }
            ],
            "interesting": {
                "reopened": false,
                "status": true
            },
            "sha": "48720bb53efbfbea095aa52383fc5dc91abab9d4"
        },
        {
            "diff": "elastic_elasticsearch/issue_34590/commit_e420b780616687f6a2eb2147b610b12ba53b7924.diff",
            "diff_additions": 30,
            "diff_deletions": 8,
            "diff_file_size": 108630,
            "files": [
                {
                    "file_additions": 20,
                    "file_deletions": 8,
                    "file_exists": true,
                    "file_name": "x-pack/plugin/sql/src/main/java/org/elasticsearch/xpack/sql/analysis/analyzer/Verifier.java",
                    "file_size": 42339
                },
                {
                    "file_additions": 10,
                    "file_deletions": 0,
                    "file_exists": true,
                    "file_name": "x-pack/plugin/sql/src/test/java/org/elasticsearch/xpack/sql/analysis/analyzer/VerifierErrorMessagesTests.java",
                    "file_size": 66291
                }
            ],
            "interesting": {
                "reopened": false,
                "status": false
            },
            "sha": "e420b780616687f6a2eb2147b610b12ba53b7924"
        }
    ],
    "first_commit": "2018-10-25 11:37:23",
    "last_commit": "2018-10-30 04:29:15",
    "number": 34590,
    "score": 352.03125
}