{
    "covered_issues": [
        3203,
        3192,
        3186,
        3183,
        3178,
        3150,
        3146,
        3145,
        3144,
        3138,
        3135,
        3134,
        3104,
        3065,
        3064,
        3060,
        3052,
        3049,
        3048,
        3047,
        3042,
        3041,
        3038,
        3031,
        3027,
        3026,
        3024,
        3023,
        3020,
        3016,
        3013,
        3007,
        2995,
        2982,
        2975,
        2970,
        2968,
        2965,
        2962,
        2957,
        2933,
        2932,
        2931,
        2917,
        2916,
        2915,
        2913,
        2909,
        2901,
        2899,
        2898,
        2890,
        2889,
        2880,
        2878,
        2849,
        2848,
        2844,
        2841,
        2837,
        2836,
        2834,
        2814,
        2811,
        2809,
        2798,
        2796,
        2794,
        2791,
        2784,
        2781,
        2780,
        2777,
        2774,
        2756,
        2753,
        2740,
        2739,
        2738,
        2729,
        2728,
        2724,
        2722,
        2700,
        2694,
        2690,
        2687,
        2681,
        2680,
        2676,
        2672,
        2670,
        2667,
        2653,
        2649,
        2646,
        2643,
        2638,
        2637,
        2636,
        2635,
        2631,
        2616,
        2615,
        2613,
        2612,
        2609,
        2607,
        2604,
        2594,
        2591,
        2587,
        2584,
        2577,
        2571,
        2561,
        2560,
        2558,
        2557,
        2538,
        2536,
        2526,
        2525,
        2518,
        2517,
        2504,
        2497,
        2491,
        2489,
        2487,
        2484,
        2477,
        2473,
        2467,
        2460,
        2459,
        2445,
        2441,
        2439,
        2436,
        2435,
        2429,
        2425,
        2424,
        2421,
        2420,
        2417,
        2414,
        2412,
        2407,
        2406,
        2405,
        2395,
        2394,
        2393,
        2391,
        2390,
        2387,
        2386,
        2384,
        2383,
        2382,
        2377,
        2376,
        2375,
        2374,
        2370,
        2369,
        2365,
        2361,
        2357,
        2353,
        2352,
        2348,
        2341,
        2330,
        2329,
        2326,
        2325,
        2323,
        2321,
        2317,
        2316,
        2313,
        2312,
        2308,
        2307,
        2306,
        2305,
        2304,
        2299,
        2298,
        2297,
        2294,
        2288,
        2286,
        2282,
        2279,
        2278,
        2275,
        2273,
        2272,
        2271,
        2263,
        2262,
        2259,
        2251,
        2246,
        2241,
        2237,
        2234,
        2230,
        2229,
        2223,
        2215,
        2213,
        2210,
        2209,
        2206,
        2202,
        2198,
        2197,
        2193,
        2184,
        2171,
        2170,
        2169,
        2166,
        2164,
        2158,
        2150,
        2148,
        2144,
        2138,
        2137,
        2125,
        2120,
        2119,
        2118,
        2100,
        2098,
        2095,
        2091,
        2090,
        2086,
        2084,
        2083,
        2082,
        2072,
        2071,
        2068,
        2066,
        2062,
        2061,
        2058,
        2045,
        2044,
        2031,
        2030,
        2021,
        2019,
        2012,
        2005,
        2000,
        1999,
        1984,
        1980,
        1978,
        1977,
        1967,
        1965,
        1960,
        1956,
        1949,
        1946,
        1943,
        1921,
        1920,
        1914,
        1912,
        1910,
        1903,
        1900,
        1891,
        1879,
        1875,
        1874,
        1864,
        1863,
        1861,
        1857,
        1847,
        1845,
        1840,
        1833,
        1821,
        1805,
        1801,
        1798,
        1786,
        1785,
        1781,
        1779,
        1759,
        1752,
        1742,
        1735,
        1730,
        1727,
        1722,
        1717,
        1713,
        1711,
        1707,
        1706,
        1704,
        1701,
        1697,
        1695,
        1694,
        1689,
        1688,
        1676,
        1674,
        1669,
        1659,
        1658,
        1654,
        1652,
        1651,
        1648,
        1647,
        1646,
        1645,
        1643,
        1642,
        1638,
        1635,
        1629,
        1628,
        1626,
        1624,
        1619,
        1617,
        1612,
        1611,
        1589,
        1588,
        1585,
        1584,
        1571,
        1570,
        1563,
        1559,
        1551,
        1550,
        1549,
        1547,
        1546,
        1542,
        1533,
        1530,
        1529,
        1526,
        1520,
        1513,
        1510,
        1507,
        1506,
        1505,
        1502,
        1501,
        1497,
        1493,
        1492,
        1491,
        1488,
        1486,
        1479,
        1472,
        1459,
        1455,
        1452,
        1449,
        1447,
        1445,
        1443,
        1441,
        1438,
        1436,
        1434,
        1433,
        1428,
        1423,
        1422,
        1421,
        1414,
        1413,
        1411,
        1410,
        1409,
        1405,
        1394,
        1392,
        1391,
        1390,
        1387,
        1385,
        1379,
        1376,
        1375,
        1374,
        1370,
        1369,
        1366,
        1362,
        1357,
        1356,
        1355,
        1353,
        1351,
        1350,
        1348,
        1346,
        1343,
        1341,
        1340,
        1339,
        1337,
        1336,
        1335,
        1331,
        1329,
        1324,
        1323,
        1321,
        1320,
        1314,
        1313,
        1309,
        1308,
        1307,
        1305,
        1304,
        1296,
        1293,
        1292,
        1289,
        1288,
        1285,
        1284,
        1281,
        1271,
        1270,
        1268,
        1264,
        1261,
        1259,
        1257,
        1249,
        1248,
        1247,
        1245,
        1244,
        1243,
        1241,
        1240,
        1234,
        1230,
        1202,
        1201,
        1195,
        1193,
        1186,
        1181,
        1167,
        1166,
        1156,
        1155,
        1153,
        1150,
        1124,
        1120,
        1119,
        1116,
        1115,
        1114,
        1109,
        1096,
        1091,
        1088,
        1085,
        1084,
        1083,
        1079,
        1078,
        1071,
        1068,
        1067,
        1066,
        1065,
        1064,
        1062,
        1061,
        1059,
        1058,
        1055,
        1046,
        1045,
        1044,
        1037,
        1036,
        1029,
        1027,
        1024,
        1019,
        1018,
        1017,
        1016,
        1009,
        1000,
        999,
        965,
        962,
        948,
        934,
        932,
        924,
        921,
        920,
        918,
        916,
        911,
        910,
        903,
        901,
        900,
        890,
        873,
        869,
        867,
        863,
        858,
        853,
        841,
        840,
        836,
        835,
        834,
        833,
        832,
        831,
        830,
        818,
        817,
        803,
        802,
        799,
        792,
        787,
        784,
        775,
        772,
        771,
        768,
        767,
        764,
        763,
        761,
        760,
        759,
        753,
        750,
        749,
        748,
        746,
        745,
        744,
        742,
        741,
        740,
        738,
        737,
        727,
        726,
        723,
        719,
        718,
        716,
        715,
        713,
        709,
        702,
        699,
        696,
        688,
        687,
        685,
        680,
        676,
        675,
        669,
        667,
        666,
        665,
        656,
        653,
        652,
        651,
        645,
        642,
        639,
        634,
        633,
        631,
        629,
        628,
        622,
        621,
        620,
        619,
        618,
        617,
        614,
        605,
        602,
        599,
        593,
        592,
        590,
        589,
        584,
        581,
        580,
        579,
        578,
        577,
        575,
        573,
        570,
        568,
        564,
        561,
        560,
        559,
        557,
        554,
        553,
        552,
        551,
        548,
        547,
        544,
        526,
        522,
        521,
        512,
        510,
        507,
        502,
        501,
        491,
        489,
        486,
        483,
        481,
        480,
        478,
        477,
        475,
        471,
        469,
        468,
        467,
        466,
        465,
        464,
        460,
        457,
        456,
        455,
        454,
        447,
        446,
        443,
        441,
        440,
        437,
        436,
        435,
        434,
        433,
        432,
        429,
        428,
        427,
        426,
        423,
        421,
        420,
        418,
        417,
        414,
        413,
        411,
        405,
        404,
        403,
        402,
        398,
        394,
        388,
        387,
        386,
        385,
        377,
        374,
        370,
        366,
        364,
        363,
        361,
        360,
        359,
        358,
        354,
        349,
        346,
        345,
        344,
        343,
        335,
        333,
        332,
        331,
        329,
        323,
        316,
        306,
        304,
        302,
        301,
        300,
        292,
        291,
        287,
        285,
        282,
        278,
        272,
        269,
        267,
        263,
        261,
        257,
        256,
        255,
        254,
        253,
        249,
        246,
        239,
        238,
        223,
        222,
        218,
        215,
        204,
        197,
        196,
        195,
        192,
        191,
        190,
        185,
        181,
        179,
        175,
        174,
        173,
        172,
        171,
        169,
        168,
        167,
        166,
        158,
        157,
        155,
        152,
        146,
        135,
        121,
        120,
        118,
        115,
        114,
        111,
        110,
        109,
        106,
        105,
        102,
        101,
        98,
        97,
        96,
        94,
        88,
        87,
        86,
        85,
        79,
        77,
        76,
        74,
        71,
        66,
        57,
        52,
        45,
        38,
        37,
        36,
        35,
        32,
        31,
        24,
        23,
        22,
        20,
        19,
        18,
        17,
        16,
        15,
        14,
        13,
        12,
        11,
        10,
        9,
        8,
        7
    ],
    "finished": true
}