{
    "commits": [
        {
            "diff": "spring-projects_spring-boot/issue_13913/commit_e2a75942463faac195a90541917067fc95b8d164.diff",
            "diff_additions": 181,
            "diff_deletions": 5,
            "diff_file_size": 18907,
            "files": [
                {
                    "file_additions": 53,
                    "file_deletions": 0,
                    "file_exists": true,
                    "file_name": "spring-boot-project/spring-boot-autoconfigure/src/main/java/org/springframework/boot/autoconfigure/web/reactive/function/client/ClientHttpConnectorAutoConfiguration.java",
                    "file_size": 2247
                },
                {
                    "file_additions": 62,
                    "file_deletions": 0,
                    "file_exists": true,
                    "file_name": "spring-boot-project/spring-boot-autoconfigure/src/main/java/org/springframework/boot/autoconfigure/web/reactive/function/client/ClientHttpConnectorConfiguration.java",
                    "file_size": 3353
                },
                {
                    "file_additions": 2,
                    "file_deletions": 1,
                    "file_exists": true,
                    "file_name": "spring-boot-project/spring-boot-autoconfigure/src/main/java/org/springframework/boot/autoconfigure/web/reactive/function/client/WebClientAutoConfiguration.java",
                    "file_size": 3013
                },
                {
                    "file_additions": 59,
                    "file_deletions": 0,
                    "file_exists": true,
                    "file_name": "spring-boot-project/spring-boot-autoconfigure/src/test/java/org/springframework/boot/autoconfigure/web/reactive/function/client/ClientHttpConnectorAutoConfigurationTests.java",
                    "file_size": 4231
                },
                {
                    "file_additions": 5,
                    "file_deletions": 4,
                    "file_exists": true,
                    "file_name": "spring-boot-project/spring-boot-autoconfigure/src/test/java/org/springframework/boot/autoconfigure/web/reactive/function/client/WebClientAutoConfigurationTests.java",
                    "file_size": 6063
                }
            ],
            "interesting": {
                "reopened": false,
                "status": false
            },
            "sha": "e2a75942463faac195a90541917067fc95b8d164"
        },
        {
            "diff": "spring-projects_spring-boot/issue_13913/commit_1c448f92012c2348f623ae571b8ec2793daed8b0.diff",
            "diff_additions": 317,
            "diff_deletions": 79,
            "diff_file_size": 29421,
            "files": [
                {
                    "file_additions": 64,
                    "file_deletions": 0,
                    "file_exists": false,
                    "file_name": "spring-boot-project/spring-boot-actuator-autoconfigure/src/main/java/org/springframework/boot/actuate/autoconfigure/metrics/MaximumUriTagsReachedMeterFilter.java",
                    "file_size": 0
                },
                {
                    "file_additions": 15,
                    "file_deletions": 0,
                    "file_exists": true,
                    "file_name": "spring-boot-project/spring-boot-actuator-autoconfigure/src/main/java/org/springframework/boot/actuate/autoconfigure/metrics/MetricsProperties.java",
                    "file_size": 7515
                },
                {
                    "file_additions": 1,
                    "file_deletions": 40,
                    "file_exists": false,
                    "file_name": "spring-boot-project/spring-boot-actuator-autoconfigure/src/main/java/org/springframework/boot/actuate/autoconfigure/metrics/web/client/RestTemplateMetricsAutoConfiguration.java",
                    "file_size": 0
                },
                {
                    "file_additions": 13,
                    "file_deletions": 0,
                    "file_exists": true,
                    "file_name": "spring-boot-project/spring-boot-actuator-autoconfigure/src/main/java/org/springframework/boot/actuate/autoconfigure/metrics/web/reactive/WebFluxMetricsAutoConfiguration.java",
                    "file_size": 4184
                },
                {
                    "file_additions": 13,
                    "file_deletions": 0,
                    "file_exists": true,
                    "file_name": "spring-boot-project/spring-boot-actuator-autoconfigure/src/main/java/org/springframework/boot/actuate/autoconfigure/metrics/web/servlet/WebMvcMetricsAutoConfiguration.java",
                    "file_size": 5986
                },
                {
                    "file_additions": 6,
                    "file_deletions": 4,
                    "file_exists": true,
                    "file_name": "spring-boot-project/spring-boot-actuator-autoconfigure/src/test/java/org/springframework/boot/actuate/autoconfigure/metrics/test/MetricsRun.java",
                    "file_size": 5274
                },
                {
                    "file_additions": 98,
                    "file_deletions": 5,
                    "file_exists": true,
                    "file_name": "spring-boot-project/spring-boot-actuator-autoconfigure/src/test/java/org/springframework/boot/actuate/autoconfigure/metrics/web/reactive/WebFluxMetricsAutoConfigurationTests.java",
                    "file_size": 6462
                },
                {
                    "file_additions": 107,
                    "file_deletions": 30,
                    "file_exists": false,
                    "file_name": "spring-boot-project/spring-boot-actuator-autoconfigure/src/test/java/org/springframework/boot/actuate/autoconfigure/web/servlet/WebMvcMetricsAutoConfigurationTests.java",
                    "file_size": 0
                }
            ],
            "interesting": {
                "reopened": false,
                "status": false
            },
            "sha": "1c448f92012c2348f623ae571b8ec2793daed8b0"
        },
        {
            "diff": "spring-projects_spring-boot/issue_13913/commit_6904c101f65ba91e9785761b0000b0a34ad1933a.diff",
            "diff_additions": 260,
            "diff_deletions": 82,
            "diff_file_size": 31296,
            "files": [
                {
                    "file_additions": 15,
                    "file_deletions": 0,
                    "file_exists": true,
                    "file_name": "spring-boot-project/spring-boot-actuator-autoconfigure/src/main/java/org/springframework/boot/actuate/autoconfigure/metrics/MetricsProperties.java",
                    "file_size": 7515
                },
                {
                    "file_additions": 58,
                    "file_deletions": 0,
                    "file_exists": true,
                    "file_name": "spring-boot-project/spring-boot-actuator-autoconfigure/src/main/java/org/springframework/boot/actuate/autoconfigure/metrics/OnlyOnceLoggingDenyMeterFilter.java",
                    "file_size": 1875
                },
                {
                    "file_additions": 5,
                    "file_deletions": 41,
                    "file_exists": false,
                    "file_name": "spring-boot-project/spring-boot-actuator-autoconfigure/src/main/java/org/springframework/boot/actuate/autoconfigure/metrics/web/client/RestTemplateMetricsAutoConfiguration.java",
                    "file_size": 0
                },
                {
                    "file_additions": 14,
                    "file_deletions": 0,
                    "file_exists": true,
                    "file_name": "spring-boot-project/spring-boot-actuator-autoconfigure/src/main/java/org/springframework/boot/actuate/autoconfigure/metrics/web/reactive/WebFluxMetricsAutoConfiguration.java",
                    "file_size": 4184
                },
                {
                    "file_additions": 14,
                    "file_deletions": 0,
                    "file_exists": true,
                    "file_name": "spring-boot-project/spring-boot-actuator-autoconfigure/src/main/java/org/springframework/boot/actuate/autoconfigure/metrics/web/servlet/WebMvcMetricsAutoConfiguration.java",
                    "file_size": 5986
                },
                {
                    "file_additions": 6,
                    "file_deletions": 4,
                    "file_exists": true,
                    "file_name": "spring-boot-project/spring-boot-actuator-autoconfigure/src/test/java/org/springframework/boot/actuate/autoconfigure/metrics/test/MetricsRun.java",
                    "file_size": 5274
                },
                {
                    "file_additions": 1,
                    "file_deletions": 1,
                    "file_exists": false,
                    "file_name": "spring-boot-project/spring-boot-actuator-autoconfigure/src/test/java/org/springframework/boot/actuate/autoconfigure/metrics/web/client/RestTemplateMetricsAutoConfigurationTests.java",
                    "file_size": 0
                },
                {
                    "file_additions": 65,
                    "file_deletions": 5,
                    "file_exists": true,
                    "file_name": "spring-boot-project/spring-boot-actuator-autoconfigure/src/test/java/org/springframework/boot/actuate/autoconfigure/metrics/web/reactive/WebFluxMetricsAutoConfigurationTests.java",
                    "file_size": 6462
                },
                {
                    "file_additions": 82,
                    "file_deletions": 31,
                    "file_exists": false,
                    "file_name": "spring-boot-project/spring-boot-actuator-autoconfigure/src/test/java/org/springframework/boot/actuate/autoconfigure/web/servlet/WebMvcMetricsAutoConfigurationTests.java",
                    "file_size": 0
                }
            ],
            "interesting": {
                "reopened": false,
                "status": true
            },
            "sha": "6904c101f65ba91e9785761b0000b0a34ad1933a"
        },
        {
            "diff": "spring-projects_spring-boot/issue_13913/commit_75733ba87053a5c7fd69f9c3f54333e6087f0073.diff",
            "diff_additions": 261,
            "diff_deletions": 82,
            "diff_file_size": 31296,
            "files": [
                {
                    "file_additions": 15,
                    "file_deletions": 0,
                    "file_exists": true,
                    "file_name": "spring-boot-project/spring-boot-actuator-autoconfigure/src/main/java/org/springframework/boot/actuate/autoconfigure/metrics/MetricsProperties.java",
                    "file_size": 7515
                },
                {
                    "file_additions": 58,
                    "file_deletions": 0,
                    "file_exists": true,
                    "file_name": "spring-boot-project/spring-boot-actuator-autoconfigure/src/main/java/org/springframework/boot/actuate/autoconfigure/metrics/OnlyOnceLoggingDenyMeterFilter.java",
                    "file_size": 1875
                },
                {
                    "file_additions": 5,
                    "file_deletions": 41,
                    "file_exists": false,
                    "file_name": "spring-boot-project/spring-boot-actuator-autoconfigure/src/main/java/org/springframework/boot/actuate/autoconfigure/metrics/web/client/RestTemplateMetricsAutoConfiguration.java",
                    "file_size": 0
                },
                {
                    "file_additions": 14,
                    "file_deletions": 0,
                    "file_exists": true,
                    "file_name": "spring-boot-project/spring-boot-actuator-autoconfigure/src/main/java/org/springframework/boot/actuate/autoconfigure/metrics/web/reactive/WebFluxMetricsAutoConfiguration.java",
                    "file_size": 4184
                },
                {
                    "file_additions": 14,
                    "file_deletions": 0,
                    "file_exists": true,
                    "file_name": "spring-boot-project/spring-boot-actuator-autoconfigure/src/main/java/org/springframework/boot/actuate/autoconfigure/metrics/web/servlet/WebMvcMetricsAutoConfiguration.java",
                    "file_size": 5986
                },
                {
                    "file_additions": 6,
                    "file_deletions": 4,
                    "file_exists": true,
                    "file_name": "spring-boot-project/spring-boot-actuator-autoconfigure/src/test/java/org/springframework/boot/actuate/autoconfigure/metrics/test/MetricsRun.java",
                    "file_size": 5274
                },
                {
                    "file_additions": 1,
                    "file_deletions": 1,
                    "file_exists": false,
                    "file_name": "spring-boot-project/spring-boot-actuator-autoconfigure/src/test/java/org/springframework/boot/actuate/autoconfigure/metrics/web/client/RestTemplateMetricsAutoConfigurationTests.java",
                    "file_size": 0
                },
                {
                    "file_additions": 66,
                    "file_deletions": 5,
                    "file_exists": true,
                    "file_name": "spring-boot-project/spring-boot-actuator-autoconfigure/src/test/java/org/springframework/boot/actuate/autoconfigure/metrics/web/reactive/WebFluxMetricsAutoConfigurationTests.java",
                    "file_size": 6462
                },
                {
                    "file_additions": 82,
                    "file_deletions": 31,
                    "file_exists": false,
                    "file_name": "spring-boot-project/spring-boot-actuator-autoconfigure/src/test/java/org/springframework/boot/actuate/autoconfigure/web/servlet/WebMvcMetricsAutoConfigurationTests.java",
                    "file_size": 0
                }
            ],
            "interesting": {
                "reopened": false,
                "status": false
            },
            "sha": "75733ba87053a5c7fd69f9c3f54333e6087f0073"
        },
        {
            "diff": "spring-projects_spring-boot/issue_13913/commit_8b4da918cb6f32283459026012718d8ec7ffff41.diff",
            "diff_additions": 258,
            "diff_deletions": 73,
            "diff_file_size": 31296,
            "files": [
                {
                    "file_additions": 15,
                    "file_deletions": 0,
                    "file_exists": true,
                    "file_name": "spring-boot-project/spring-boot-actuator-autoconfigure/src/main/java/org/springframework/boot/actuate/autoconfigure/metrics/MetricsProperties.java",
                    "file_size": 7515
                },
                {
                    "file_additions": 59,
                    "file_deletions": 0,
                    "file_exists": true,
                    "file_name": "spring-boot-project/spring-boot-actuator-autoconfigure/src/main/java/org/springframework/boot/actuate/autoconfigure/metrics/OnlyOnceLoggingDenyMeterFilter.java",
                    "file_size": 1875
                },
                {
                    "file_additions": 5,
                    "file_deletions": 41,
                    "file_exists": false,
                    "file_name": "spring-boot-project/spring-boot-actuator-autoconfigure/src/main/java/org/springframework/boot/actuate/autoconfigure/metrics/web/client/RestTemplateMetricsAutoConfiguration.java",
                    "file_size": 0
                },
                {
                    "file_additions": 14,
                    "file_deletions": 0,
                    "file_exists": true,
                    "file_name": "spring-boot-project/spring-boot-actuator-autoconfigure/src/main/java/org/springframework/boot/actuate/autoconfigure/metrics/web/reactive/WebFluxMetricsAutoConfiguration.java",
                    "file_size": 4184
                },
                {
                    "file_additions": 14,
                    "file_deletions": 0,
                    "file_exists": true,
                    "file_name": "spring-boot-project/spring-boot-actuator-autoconfigure/src/main/java/org/springframework/boot/actuate/autoconfigure/metrics/web/servlet/WebMvcMetricsAutoConfiguration.java",
                    "file_size": 5986
                },
                {
                    "file_additions": 1,
                    "file_deletions": 0,
                    "file_exists": true,
                    "file_name": "spring-boot-project/spring-boot-actuator-autoconfigure/src/test/java/org/springframework/boot/actuate/autoconfigure/metrics/test/MetricsRun.java",
                    "file_size": 5274
                },
                {
                    "file_additions": 1,
                    "file_deletions": 1,
                    "file_exists": false,
                    "file_name": "spring-boot-project/spring-boot-actuator-autoconfigure/src/test/java/org/springframework/boot/actuate/autoconfigure/metrics/web/client/RestTemplateMetricsAutoConfigurationTests.java",
                    "file_size": 0
                },
                {
                    "file_additions": 64,
                    "file_deletions": 0,
                    "file_exists": true,
                    "file_name": "spring-boot-project/spring-boot-actuator-autoconfigure/src/test/java/org/springframework/boot/actuate/autoconfigure/metrics/web/reactive/WebFluxMetricsAutoConfigurationTests.java",
                    "file_size": 6462
                },
                {
                    "file_additions": 85,
                    "file_deletions": 31,
                    "file_exists": false,
                    "file_name": "spring-boot-project/spring-boot-actuator-autoconfigure/src/test/java/org/springframework/boot/actuate/autoconfigure/web/servlet/WebMvcMetricsAutoConfigurationTests.java",
                    "file_size": 0
                }
            ],
            "interesting": {
                "reopened": false,
                "status": false
            },
            "sha": "8b4da918cb6f32283459026012718d8ec7ffff41"
        },
        {
            "diff": "spring-projects_spring-boot/issue_13913/commit_53cb48c992394bb5b9c3ac94dd482169f9b71426.diff",
            "diff_additions": 257,
            "diff_deletions": 73,
            "diff_file_size": 26022,
            "files": [
                {
                    "file_additions": 15,
                    "file_deletions": 0,
                    "file_exists": true,
                    "file_name": "spring-boot-project/spring-boot-actuator-autoconfigure/src/main/java/org/springframework/boot/actuate/autoconfigure/metrics/MetricsProperties.java",
                    "file_size": 7515
                },
                {
                    "file_additions": 59,
                    "file_deletions": 0,
                    "file_exists": true,
                    "file_name": "spring-boot-project/spring-boot-actuator-autoconfigure/src/main/java/org/springframework/boot/actuate/autoconfigure/metrics/OnlyOnceLoggingDenyMeterFilter.java",
                    "file_size": 1875
                },
                {
                    "file_additions": 5,
                    "file_deletions": 41,
                    "file_exists": false,
                    "file_name": "spring-boot-project/spring-boot-actuator-autoconfigure/src/main/java/org/springframework/boot/actuate/autoconfigure/metrics/web/client/RestTemplateMetricsAutoConfiguration.java",
                    "file_size": 0
                },
                {
                    "file_additions": 14,
                    "file_deletions": 0,
                    "file_exists": true,
                    "file_name": "spring-boot-project/spring-boot-actuator-autoconfigure/src/main/java/org/springframework/boot/actuate/autoconfigure/metrics/web/reactive/WebFluxMetricsAutoConfiguration.java",
                    "file_size": 4184
                },
                {
                    "file_additions": 14,
                    "file_deletions": 0,
                    "file_exists": true,
                    "file_name": "spring-boot-project/spring-boot-actuator-autoconfigure/src/main/java/org/springframework/boot/actuate/autoconfigure/metrics/web/servlet/WebMvcMetricsAutoConfiguration.java",
                    "file_size": 5986
                },
                {
                    "file_additions": 1,
                    "file_deletions": 1,
                    "file_exists": false,
                    "file_name": "spring-boot-project/spring-boot-actuator-autoconfigure/src/test/java/org/springframework/boot/actuate/autoconfigure/metrics/web/client/RestTemplateMetricsAutoConfigurationTests.java",
                    "file_size": 0
                },
                {
                    "file_additions": 64,
                    "file_deletions": 0,
                    "file_exists": true,
                    "file_name": "spring-boot-project/spring-boot-actuator-autoconfigure/src/test/java/org/springframework/boot/actuate/autoconfigure/metrics/web/reactive/WebFluxMetricsAutoConfigurationTests.java",
                    "file_size": 6462
                },
                {
                    "file_additions": 85,
                    "file_deletions": 31,
                    "file_exists": false,
                    "file_name": "spring-boot-project/spring-boot-actuator-autoconfigure/src/test/java/org/springframework/boot/actuate/autoconfigure/web/servlet/WebMvcMetricsAutoConfigurationTests.java",
                    "file_size": 0
                }
            ],
            "interesting": {
                "reopened": false,
                "status": false
            },
            "sha": "53cb48c992394bb5b9c3ac94dd482169f9b71426"
        },
        {
            "diff": "spring-projects_spring-boot/issue_13913/commit_3abd0332c91a331e735913a9a18b25996252db11.diff",
            "diff_additions": 257,
            "diff_deletions": 73,
            "diff_file_size": 26022,
            "files": [
                {
                    "file_additions": 15,
                    "file_deletions": 0,
                    "file_exists": true,
                    "file_name": "spring-boot-project/spring-boot-actuator-autoconfigure/src/main/java/org/springframework/boot/actuate/autoconfigure/metrics/MetricsProperties.java",
                    "file_size": 7515
                },
                {
                    "file_additions": 59,
                    "file_deletions": 0,
                    "file_exists": true,
                    "file_name": "spring-boot-project/spring-boot-actuator-autoconfigure/src/main/java/org/springframework/boot/actuate/autoconfigure/metrics/OnlyOnceLoggingDenyMeterFilter.java",
                    "file_size": 1875
                },
                {
                    "file_additions": 5,
                    "file_deletions": 41,
                    "file_exists": false,
                    "file_name": "spring-boot-project/spring-boot-actuator-autoconfigure/src/main/java/org/springframework/boot/actuate/autoconfigure/metrics/web/client/RestTemplateMetricsAutoConfiguration.java",
                    "file_size": 0
                },
                {
                    "file_additions": 14,
                    "file_deletions": 0,
                    "file_exists": true,
                    "file_name": "spring-boot-project/spring-boot-actuator-autoconfigure/src/main/java/org/springframework/boot/actuate/autoconfigure/metrics/web/reactive/WebFluxMetricsAutoConfiguration.java",
                    "file_size": 4184
                },
                {
                    "file_additions": 14,
                    "file_deletions": 0,
                    "file_exists": true,
                    "file_name": "spring-boot-project/spring-boot-actuator-autoconfigure/src/main/java/org/springframework/boot/actuate/autoconfigure/metrics/web/servlet/WebMvcMetricsAutoConfiguration.java",
                    "file_size": 5986
                },
                {
                    "file_additions": 1,
                    "file_deletions": 1,
                    "file_exists": false,
                    "file_name": "spring-boot-project/spring-boot-actuator-autoconfigure/src/test/java/org/springframework/boot/actuate/autoconfigure/metrics/web/client/RestTemplateMetricsAutoConfigurationTests.java",
                    "file_size": 0
                },
                {
                    "file_additions": 64,
                    "file_deletions": 0,
                    "file_exists": true,
                    "file_name": "spring-boot-project/spring-boot-actuator-autoconfigure/src/test/java/org/springframework/boot/actuate/autoconfigure/metrics/web/reactive/WebFluxMetricsAutoConfigurationTests.java",
                    "file_size": 6462
                },
                {
                    "file_additions": 85,
                    "file_deletions": 31,
                    "file_exists": false,
                    "file_name": "spring-boot-project/spring-boot-actuator-autoconfigure/src/test/java/org/springframework/boot/actuate/autoconfigure/web/servlet/WebMvcMetricsAutoConfigurationTests.java",
                    "file_size": 0
                }
            ],
            "interesting": {
                "reopened": false,
                "status": false
            },
            "sha": "3abd0332c91a331e735913a9a18b25996252db11"
        },
        {
            "diff": "spring-projects_spring-boot/issue_13913/commit_f55065b71e8b4ccc6f6066f9d30854552fab65ec.diff",
            "diff_additions": 257,
            "diff_deletions": 73,
            "diff_file_size": 26022,
            "files": [
                {
                    "file_additions": 15,
                    "file_deletions": 0,
                    "file_exists": true,
                    "file_name": "spring-boot-project/spring-boot-actuator-autoconfigure/src/main/java/org/springframework/boot/actuate/autoconfigure/metrics/MetricsProperties.java",
                    "file_size": 7515
                },
                {
                    "file_additions": 59,
                    "file_deletions": 0,
                    "file_exists": true,
                    "file_name": "spring-boot-project/spring-boot-actuator-autoconfigure/src/main/java/org/springframework/boot/actuate/autoconfigure/metrics/OnlyOnceLoggingDenyMeterFilter.java",
                    "file_size": 1875
                },
                {
                    "file_additions": 5,
                    "file_deletions": 41,
                    "file_exists": false,
                    "file_name": "spring-boot-project/spring-boot-actuator-autoconfigure/src/main/java/org/springframework/boot/actuate/autoconfigure/metrics/web/client/RestTemplateMetricsAutoConfiguration.java",
                    "file_size": 0
                },
                {
                    "file_additions": 14,
                    "file_deletions": 0,
                    "file_exists": true,
                    "file_name": "spring-boot-project/spring-boot-actuator-autoconfigure/src/main/java/org/springframework/boot/actuate/autoconfigure/metrics/web/reactive/WebFluxMetricsAutoConfiguration.java",
                    "file_size": 4184
                },
                {
                    "file_additions": 14,
                    "file_deletions": 0,
                    "file_exists": true,
                    "file_name": "spring-boot-project/spring-boot-actuator-autoconfigure/src/main/java/org/springframework/boot/actuate/autoconfigure/metrics/web/servlet/WebMvcMetricsAutoConfiguration.java",
                    "file_size": 5986
                },
                {
                    "file_additions": 1,
                    "file_deletions": 1,
                    "file_exists": false,
                    "file_name": "spring-boot-project/spring-boot-actuator-autoconfigure/src/test/java/org/springframework/boot/actuate/autoconfigure/metrics/web/client/RestTemplateMetricsAutoConfigurationTests.java",
                    "file_size": 0
                },
                {
                    "file_additions": 64,
                    "file_deletions": 0,
                    "file_exists": true,
                    "file_name": "spring-boot-project/spring-boot-actuator-autoconfigure/src/test/java/org/springframework/boot/actuate/autoconfigure/metrics/web/reactive/WebFluxMetricsAutoConfigurationTests.java",
                    "file_size": 6462
                },
                {
                    "file_additions": 85,
                    "file_deletions": 31,
                    "file_exists": false,
                    "file_name": "spring-boot-project/spring-boot-actuator-autoconfigure/src/test/java/org/springframework/boot/actuate/autoconfigure/web/servlet/WebMvcMetricsAutoConfigurationTests.java",
                    "file_size": 0
                }
            ],
            "interesting": {
                "reopened": false,
                "status": false
            },
            "sha": "f55065b71e8b4ccc6f6066f9d30854552fab65ec"
        },
        {
            "diff": "spring-projects_spring-boot/issue_13913/commit_ea1667e0c4f7129cc2e90a3dfcbd6552856dc00a.diff",
            "diff_additions": 230,
            "diff_deletions": 42,
            "diff_file_size": 26022,
            "files": [
                {
                    "file_additions": 15,
                    "file_deletions": 0,
                    "file_exists": true,
                    "file_name": "spring-boot-project/spring-boot-actuator-autoconfigure/src/main/java/org/springframework/boot/actuate/autoconfigure/metrics/MetricsProperties.java",
                    "file_size": 7515
                },
                {
                    "file_additions": 59,
                    "file_deletions": 0,
                    "file_exists": true,
                    "file_name": "spring-boot-project/spring-boot-actuator-autoconfigure/src/main/java/org/springframework/boot/actuate/autoconfigure/metrics/OnlyOnceLoggingDenyMeterFilter.java",
                    "file_size": 1875
                },
                {
                    "file_additions": 5,
                    "file_deletions": 41,
                    "file_exists": false,
                    "file_name": "spring-boot-project/spring-boot-actuator-autoconfigure/src/main/java/org/springframework/boot/actuate/autoconfigure/metrics/web/client/RestTemplateMetricsAutoConfiguration.java",
                    "file_size": 0
                },
                {
                    "file_additions": 14,
                    "file_deletions": 0,
                    "file_exists": true,
                    "file_name": "spring-boot-project/spring-boot-actuator-autoconfigure/src/main/java/org/springframework/boot/actuate/autoconfigure/metrics/web/reactive/WebFluxMetricsAutoConfiguration.java",
                    "file_size": 4184
                },
                {
                    "file_additions": 14,
                    "file_deletions": 0,
                    "file_exists": true,
                    "file_name": "spring-boot-project/spring-boot-actuator-autoconfigure/src/main/java/org/springframework/boot/actuate/autoconfigure/metrics/web/servlet/WebMvcMetricsAutoConfiguration.java",
                    "file_size": 5986
                },
                {
                    "file_additions": 1,
                    "file_deletions": 1,
                    "file_exists": false,
                    "file_name": "spring-boot-project/spring-boot-actuator-autoconfigure/src/test/java/org/springframework/boot/actuate/autoconfigure/metrics/web/client/RestTemplateMetricsAutoConfigurationTests.java",
                    "file_size": 0
                },
                {
                    "file_additions": 55,
                    "file_deletions": 0,
                    "file_exists": true,
                    "file_name": "spring-boot-project/spring-boot-actuator-autoconfigure/src/test/java/org/springframework/boot/actuate/autoconfigure/metrics/web/reactive/WebFluxMetricsAutoConfigurationTests.java",
                    "file_size": 6462
                },
                {
                    "file_additions": 67,
                    "file_deletions": 0,
                    "file_exists": false,
                    "file_name": "spring-boot-project/spring-boot-actuator-autoconfigure/src/test/java/org/springframework/boot/actuate/autoconfigure/web/servlet/WebMvcMetricsAutoConfigurationTests.java",
                    "file_size": 0
                }
            ],
            "interesting": {
                "reopened": false,
                "status": true
            },
            "sha": "ea1667e0c4f7129cc2e90a3dfcbd6552856dc00a"
        },
        {
            "diff": "spring-projects_spring-boot/issue_13913/commit_80cd28468c14b95706f4c456f3e554913b94dfff.diff",
            "diff_additions": 228,
            "diff_deletions": 42,
            "diff_file_size": 26022,
            "files": [
                {
                    "file_additions": 15,
                    "file_deletions": 0,
                    "file_exists": true,
                    "file_name": "spring-boot-project/spring-boot-actuator-autoconfigure/src/main/java/org/springframework/boot/actuate/autoconfigure/metrics/MetricsProperties.java",
                    "file_size": 7515
                },
                {
                    "file_additions": 59,
                    "file_deletions": 0,
                    "file_exists": true,
                    "file_name": "spring-boot-project/spring-boot-actuator-autoconfigure/src/main/java/org/springframework/boot/actuate/autoconfigure/metrics/OnlyOnceLoggingDenyMeterFilter.java",
                    "file_size": 1875
                },
                {
                    "file_additions": 5,
                    "file_deletions": 41,
                    "file_exists": false,
                    "file_name": "spring-boot-project/spring-boot-actuator-autoconfigure/src/main/java/org/springframework/boot/actuate/autoconfigure/metrics/web/client/RestTemplateMetricsAutoConfiguration.java",
                    "file_size": 0
                },
                {
                    "file_additions": 14,
                    "file_deletions": 0,
                    "file_exists": true,
                    "file_name": "spring-boot-project/spring-boot-actuator-autoconfigure/src/main/java/org/springframework/boot/actuate/autoconfigure/metrics/web/reactive/WebFluxMetricsAutoConfiguration.java",
                    "file_size": 4184
                },
                {
                    "file_additions": 14,
                    "file_deletions": 0,
                    "file_exists": true,
                    "file_name": "spring-boot-project/spring-boot-actuator-autoconfigure/src/main/java/org/springframework/boot/actuate/autoconfigure/metrics/web/servlet/WebMvcMetricsAutoConfiguration.java",
                    "file_size": 5986
                },
                {
                    "file_additions": 1,
                    "file_deletions": 1,
                    "file_exists": false,
                    "file_name": "spring-boot-project/spring-boot-actuator-autoconfigure/src/test/java/org/springframework/boot/actuate/autoconfigure/metrics/web/client/RestTemplateMetricsAutoConfigurationTests.java",
                    "file_size": 0
                },
                {
                    "file_additions": 54,
                    "file_deletions": 0,
                    "file_exists": true,
                    "file_name": "spring-boot-project/spring-boot-actuator-autoconfigure/src/test/java/org/springframework/boot/actuate/autoconfigure/metrics/web/reactive/WebFluxMetricsAutoConfigurationTests.java",
                    "file_size": 6462
                },
                {
                    "file_additions": 66,
                    "file_deletions": 0,
                    "file_exists": false,
                    "file_name": "spring-boot-project/spring-boot-actuator-autoconfigure/src/test/java/org/springframework/boot/actuate/autoconfigure/web/servlet/WebMvcMetricsAutoConfigurationTests.java",
                    "file_size": 0
                }
            ],
            "interesting": {
                "reopened": false,
                "status": false
            },
            "sha": "80cd28468c14b95706f4c456f3e554913b94dfff"
        },
        {
            "diff": "spring-projects_spring-boot/issue_13913/commit_385216ad451467b6f0fad152b739f2e3d88d7656.diff",
            "diff_additions": 405,
            "diff_deletions": 75,
            "diff_file_size": 38143,
            "files": [
                {
                    "file_additions": 15,
                    "file_deletions": 0,
                    "file_exists": true,
                    "file_name": "spring-boot-project/spring-boot-actuator-autoconfigure/src/main/java/org/springframework/boot/actuate/autoconfigure/metrics/MetricsProperties.java",
                    "file_size": 7515
                },
                {
                    "file_additions": 60,
                    "file_deletions": 0,
                    "file_exists": true,
                    "file_name": "spring-boot-project/spring-boot-actuator-autoconfigure/src/main/java/org/springframework/boot/actuate/autoconfigure/metrics/OnlyOnceLoggingDenyMeterFilter.java",
                    "file_size": 1875
                },
                {
                    "file_additions": 15,
                    "file_deletions": 47,
                    "file_exists": false,
                    "file_name": "spring-boot-project/spring-boot-actuator-autoconfigure/src/main/java/org/springframework/boot/actuate/autoconfigure/metrics/web/client/RestTemplateMetricsAutoConfiguration.java",
                    "file_size": 0
                },
                {
                    "file_additions": 22,
                    "file_deletions": 2,
                    "file_exists": true,
                    "file_name": "spring-boot-project/spring-boot-actuator-autoconfigure/src/main/java/org/springframework/boot/actuate/autoconfigure/metrics/web/reactive/WebFluxMetricsAutoConfiguration.java",
                    "file_size": 4184
                },
                {
                    "file_additions": 23,
                    "file_deletions": 3,
                    "file_exists": true,
                    "file_name": "spring-boot-project/spring-boot-actuator-autoconfigure/src/main/java/org/springframework/boot/actuate/autoconfigure/metrics/web/servlet/WebMvcMetricsAutoConfiguration.java",
                    "file_size": 5986
                },
                {
                    "file_additions": 46,
                    "file_deletions": 0,
                    "file_exists": true,
                    "file_name": "spring-boot-project/spring-boot-actuator-autoconfigure/src/test/java/org/springframework/boot/actuate/autoconfigure/metrics/web/TestController.java",
                    "file_size": 1323
                },
                {
                    "file_additions": 39,
                    "file_deletions": 21,
                    "file_exists": false,
                    "file_name": "spring-boot-project/spring-boot-actuator-autoconfigure/src/test/java/org/springframework/boot/actuate/autoconfigure/metrics/web/client/RestTemplateMetricsAutoConfigurationTests.java",
                    "file_size": 0
                },
                {
                    "file_additions": 121,
                    "file_deletions": 0,
                    "file_exists": true,
                    "file_name": "spring-boot-project/spring-boot-actuator-autoconfigure/src/test/java/org/springframework/boot/actuate/autoconfigure/metrics/web/reactive/WebFluxMetricsAutoConfigurationTests.java",
                    "file_size": 6462
                },
                {
                    "file_additions": 64,
                    "file_deletions": 2,
                    "file_exists": true,
                    "file_name": "spring-boot-project/spring-boot-actuator-autoconfigure/src/test/java/org/springframework/boot/actuate/autoconfigure/metrics/web/servlet/WebMvcMetricsAutoConfigurationTests.java",
                    "file_size": 10798
                }
            ],
            "interesting": {
                "reopened": false,
                "status": false
            },
            "sha": "385216ad451467b6f0fad152b739f2e3d88d7656"
        }
    ],
    "first_commit": "2018-08-22 17:14:34",
    "last_commit": "2018-08-30 11:03:55",
    "number": 13913,
    "score": 320.001108033241
}