{
    "covered_issues": [
        2142,
        2109,
        2101,
        2077,
        2066,
        2059,
        2028,
        2006,
        2005,
        2000,
        1996,
        1995,
        1994,
        1993,
        1978,
        1939,
        1931,
        1927,
        1923,
        1922,
        1921,
        1920,
        1919,
        1918,
        1917,
        1916,
        1911,
        1907,
        1892,
        1881,
        1875,
        1859,
        1858,
        1849,
        1832,
        1830,
        1829,
        1827,
        1805,
        1801,
        1793,
        1783,
        1782,
        1769,
        1757,
        1733,
        1722,
        1697,
        1692,
        1688,
        1681,
        1669,
        1658,
        1642,
        1640,
        1631,
        1614,
        1612,
        1611,
        1610,
        1609,
        1603,
        1578,
        1573,
        1572,
        1568,
        1537,
        1530,
        1515,
        1514,
        1513,
        1507,
        1490,
        1487,
        1484,
        1481,
        1479,
        1462,
        1446,
        1440,
        1432,
        1425,
        1424,
        1423,
        1422,
        1420,
        1415,
        1409,
        1406,
        1378,
        1358,
        1357,
        1340,
        1334,
        1328,
        1325,
        1317,
        1316,
        1304,
        1283,
        1267,
        1261,
        1252,
        1222,
        1221,
        1219,
        1216,
        1196,
        1192,
        1178,
        1159,
        1157,
        1145,
        1142,
        1126,
        1125,
        1122,
        1112,
        1111,
        1072,
        1056,
        1052,
        1043,
        1038,
        1034,
        1031,
        1028,
        1019,
        1018,
        1015,
        1011,
        1010,
        1003,
        1002,
        1001,
        1000,
        976,
        974,
        968,
        960,
        958,
        953,
        950,
        944,
        940,
        933,
        932,
        930,
        924,
        923,
        912,
        909,
        908,
        907,
        905,
        902,
        895,
        894,
        893,
        892,
        891,
        890,
        889,
        888,
        887,
        886,
        885,
        883,
        882,
        881,
        880,
        875,
        873,
        872,
        868,
        867,
        866,
        865,
        864,
        862,
        861,
        856,
        853,
        852,
        851,
        850,
        849,
        843,
        835,
        830,
        829,
        828,
        827,
        826,
        808,
        807,
        799,
        793,
        785,
        777,
        771,
        768,
        752,
        738,
        737,
        735,
        734,
        726,
        725,
        724,
        723,
        721,
        720,
        719,
        718,
        717,
        716,
        711,
        704,
        689,
        688,
        687,
        685,
        682,
        678,
        676,
        675,
        674,
        673,
        662,
        659,
        645,
        643,
        642,
        641,
        638,
        632,
        631,
        630,
        625,
        624,
        620,
        619,
        612,
        611,
        610,
        609,
        599,
        598,
        592,
        579,
        578,
        575,
        573,
        572,
        571,
        570,
        569,
        568,
        567,
        562,
        560,
        559,
        550,
        547,
        546,
        545,
        541,
        540,
        533,
        532,
        525,
        522,
        516,
        515,
        514,
        513,
        512,
        511,
        509,
        504,
        502,
        498,
        496,
        495,
        485,
        481,
        480,
        477,
        471,
        465,
        463,
        460,
        459,
        456,
        455,
        452,
        451,
        442,
        436,
        433,
        431,
        430,
        424,
        423,
        420,
        419,
        417,
        414,
        413,
        407,
        405,
        401,
        397,
        391,
        388,
        377,
        374,
        372,
        371,
        370,
        366,
        361,
        359,
        356,
        354,
        349,
        347,
        345,
        344,
        343,
        342,
        341,
        339,
        336,
        314,
        309,
        305,
        304,
        301,
        294,
        285,
        282,
        281,
        280,
        276,
        275,
        274,
        268,
        266,
        264,
        263,
        260,
        258,
        254,
        253,
        252,
        251,
        248,
        244,
        241,
        233,
        230,
        215,
        206,
        205,
        203,
        195,
        186,
        184,
        183,
        182,
        177,
        175,
        172,
        171,
        170,
        168,
        158,
        155,
        154,
        148,
        147,
        145,
        141,
        139,
        137,
        135,
        134,
        132,
        131,
        128,
        127,
        125,
        123,
        121,
        120,
        115,
        114,
        112,
        108,
        106,
        103,
        99,
        98,
        97,
        93,
        79,
        65,
        63,
        61,
        60,
        57,
        39,
        34,
        33,
        31,
        30,
        15,
        7,
        3,
        1
    ],
    "finished": true
}