{
    "covered_issues": [
        407,
        405,
        403,
        396,
        394,
        386,
        385,
        384,
        380,
        379,
        371,
        368,
        366,
        362,
        361,
        360,
        357,
        356,
        355,
        353,
        351,
        349,
        348,
        347,
        341,
        340,
        339,
        329,
        326,
        324,
        322,
        321,
        320,
        319,
        318,
        317,
        316,
        315,
        314,
        313,
        312,
        311,
        309,
        308,
        305,
        302,
        300,
        297,
        296,
        295,
        294,
        293,
        292,
        291,
        290,
        289,
        288,
        287,
        285,
        284,
        282,
        279,
        274,
        273,
        272,
        271,
        268,
        267,
        266,
        265,
        264,
        263,
        262,
        261,
        260,
        259,
        258,
        257,
        256,
        255,
        254,
        250,
        249,
        248,
        246,
        245,
        244,
        242,
        241,
        239,
        238,
        237,
        236,
        235,
        231,
        230,
        229,
        228,
        227,
        226,
        225,
        223,
        222,
        220,
        219,
        218,
        217,
        216,
        215,
        211,
        210,
        209,
        207,
        206,
        205,
        204,
        202,
        201,
        200,
        199,
        198,
        195,
        194,
        192,
        188,
        186,
        177,
        175,
        173,
        172,
        171,
        169,
        168,
        167,
        166,
        165,
        164,
        163,
        161,
        159,
        158,
        157,
        156,
        155,
        154,
        153,
        152,
        151,
        150,
        149,
        148,
        147,
        146,
        145,
        144,
        143,
        142,
        141,
        140,
        139,
        138,
        137,
        136,
        135,
        134,
        133,
        132,
        131,
        130,
        129,
        128,
        126,
        125,
        124,
        123,
        121,
        120,
        119,
        117,
        114,
        113,
        109,
        105,
        104,
        102,
        94,
        93,
        92,
        87,
        86,
        84,
        81,
        79,
        76,
        75,
        69,
        66,
        59,
        57,
        56,
        53,
        52,
        51,
        50,
        48,
        46,
        45,
        44,
        43,
        42,
        41,
        38,
        33,
        32,
        31,
        29,
        27,
        26,
        25,
        24,
        23,
        21,
        20,
        19,
        17,
        16,
        12,
        11,
        10,
        8,
        7,
        6,
        4,
        3,
        1
    ],
    "finished": true
}