{
    "covered_issues": [
        235,
        230,
        228,
        219,
        218,
        217,
        216,
        215,
        214,
        213,
        211,
        210,
        209,
        208,
        207,
        206,
        205,
        197,
        190,
        189,
        188,
        187,
        186,
        185,
        184,
        183,
        182,
        181,
        180,
        179,
        177,
        175,
        174,
        173,
        172,
        171,
        170,
        169,
        167,
        166,
        165,
        162,
        161,
        156,
        155,
        153,
        152,
        150,
        149,
        148,
        147,
        146,
        145,
        141,
        139,
        137,
        135,
        133,
        132,
        130,
        126,
        123,
        121,
        120,
        119,
        117,
        116,
        115,
        114,
        113,
        112,
        111,
        110,
        109,
        107,
        104,
        103,
        102,
        101,
        100,
        99,
        98,
        97,
        95,
        89,
        88,
        86,
        85,
        83,
        82,
        81,
        80,
        79,
        78,
        77,
        75,
        74,
        72,
        71,
        70,
        69,
        68,
        67,
        65,
        63,
        62,
        61,
        60,
        59,
        58,
        57,
        55,
        54,
        52,
        51,
        50,
        49,
        48,
        46,
        45,
        44,
        43,
        42,
        41,
        40,
        39,
        38,
        37,
        35,
        34,
        32,
        28,
        27,
        26,
        25,
        24,
        23,
        22,
        21,
        20,
        19,
        18,
        17,
        13,
        11,
        10,
        9,
        8,
        7,
        6,
        5,
        4,
        3,
        2
    ],
    "finished": true
}