{
    "covered_issues": [
        5932,
        5862,
        5845,
        5800,
        5778,
        5684,
        4624,
        4243,
        4219,
        4184,
        4074,
        4073,
        4033,
        4032,
        4031,
        4030,
        4019,
        4016,
        4015,
        4014,
        4013,
        3986,
        3850,
        3796,
        3716,
        3591,
        3541,
        3297,
        3258,
        3249,
        3196,
        3123,
        2870,
        2860,
        2619,
        2542,
        2527,
        2520,
        2505,
        2488,
        2481,
        2466,
        2464,
        2460,
        2459,
        2458,
        2457,
        2424,
        2320,
        2314,
        2170,
        2163,
        2082,
        2075,
        1903,
        1865,
        1724,
        1705,
        1651,
        1649,
        1637,
        1500,
        1417,
        1360,
        1338,
        1337,
        1328,
        1283,
        1262,
        1189,
        1187,
        1128,
        1099,
        1004,
        1001,
        962,
        942,
        938,
        930,
        896,
        885,
        884,
        881,
        763,
        570,
        566,
        546,
        480,
        478,
        476,
        463,
        461,
        451,
        441,
        427,
        425,
        424,
        423,
        397,
        348,
        346,
        344,
        329,
        322,
        317,
        316,
        290,
        279,
        273,
        272,
        271,
        212,
        197,
        196,
        186,
        159,
        143,
        142,
        118,
        92,
        63,
        7
    ],
    "finished": true
}