{
    "commits": [
        {
            "associated_pull_request": [],
            "date": "2014-03-28 19:36:31+00:00",
            "diff": "krakjoe_pthreads/issue_292/commit_65975fe5bbbb3b03ae5afce443e08af41953dc87.diff",
            "diff_additions": 33,
            "diff_deletions": 10,
            "diff_file_size": 16064,
            "diff_url": "https://github.com/krakjoe/pthreads/commit/65975fe5bbbb3b03ae5afce443e08af41953dc87.diff",
            "exists": true,
            "files": [
                {
                    "file_additions": 33,
                    "file_deletions": 10,
                    "file_exists": true,
                    "file_name": "src/object.c",
                    "file_size": 16064
                }
            ],
            "interesting": {
                "reopen": false,
                "status": false
            },
            "is_parent": true,
            "sha": "65975fe5bbbb3b03ae5afce443e08af41953dc87"
        },
        {
            "associated_pull_request": [],
            "date": "2014-04-08 06:45:55+00:00",
            "diff": "krakjoe_pthreads/issue_292/commit_e4f45a5fc74c145f57a048bf800bad989730486c.diff",
            "diff_additions": 64,
            "diff_deletions": 76,
            "diff_file_size": 63012,
            "diff_url": "https://github.com/krakjoe/pthreads/commit/e4f45a5fc74c145f57a048bf800bad989730486c.diff",
            "exists": true,
            "files": [
                {
                    "file_additions": 7,
                    "file_deletions": 13,
                    "file_exists": true,
                    "file_name": "src/prepare.c",
                    "file_size": 29590
                },
                {
                    "file_additions": 18,
                    "file_deletions": 17,
                    "file_exists": true,
                    "file_name": "src/resources.c",
                    "file_size": 2115
                },
                {
                    "file_additions": 39,
                    "file_deletions": 46,
                    "file_exists": true,
                    "file_name": "src/store.c",
                    "file_size": 31307
                }
            ],
            "interesting": {
                "reopen": false,
                "status": false
            },
            "is_parent": false,
            "sha": "e4f45a5fc74c145f57a048bf800bad989730486c"
        },
        {
            "associated_pull_request": [],
            "date": "2014-04-08 07:06:44+00:00",
            "diff": "krakjoe_pthreads/issue_292/commit_ffd9a148dd1430343f1e6fc5f8ebbfeb27ed4a42.diff",
            "diff_additions": 12,
            "diff_deletions": 38,
            "diff_file_size": 53800,
            "diff_url": "https://github.com/krakjoe/pthreads/commit/ffd9a148dd1430343f1e6fc5f8ebbfeb27ed4a42.diff",
            "exists": true,
            "files": [
                {
                    "file_additions": 2,
                    "file_deletions": 0,
                    "file_exists": true,
                    "file_name": "php_pthreads.c",
                    "file_size": 35621
                },
                {
                    "file_additions": 0,
                    "file_deletions": 4,
                    "file_exists": true,
                    "file_name": "src/object.c",
                    "file_size": 16064
                },
                {
                    "file_additions": 10,
                    "file_deletions": 34,
                    "file_exists": true,
                    "file_name": "src/resources.c",
                    "file_size": 2115
                }
            ],
            "interesting": {
                "reopen": true,
                "status": false
            },
            "is_parent": false,
            "sha": "ffd9a148dd1430343f1e6fc5f8ebbfeb27ed4a42"
        },
        {
            "associated_pull_request": [],
            "date": "2014-04-08 20:33:24+00:00",
            "diff": "krakjoe_pthreads/issue_292/commit_d61b724561ce1e5f2279e4a917298012e811bc95.diff",
            "diff_additions": 25,
            "diff_deletions": 12,
            "diff_file_size": 98633,
            "diff_url": "https://github.com/krakjoe/pthreads/commit/d61b724561ce1e5f2279e4a917298012e811bc95.diff",
            "exists": true,
            "files": [
                {
                    "file_additions": 12,
                    "file_deletions": 4,
                    "file_exists": true,
                    "file_name": "php_pthreads.c",
                    "file_size": 35621
                },
                {
                    "file_additions": 4,
                    "file_deletions": 4,
                    "file_exists": true,
                    "file_name": "src/prepare.c",
                    "file_size": 29590
                },
                {
                    "file_additions": 7,
                    "file_deletions": 2,
                    "file_exists": true,
                    "file_name": "src/resources.c",
                    "file_size": 2115
                },
                {
                    "file_additions": 2,
                    "file_deletions": 2,
                    "file_exists": true,
                    "file_name": "src/store.c",
                    "file_size": 31307
                }
            ],
            "interesting": {
                "reopen": false,
                "status": false
            },
            "is_parent": false,
            "sha": "d61b724561ce1e5f2279e4a917298012e811bc95"
        },
        {
            "associated_pull_request": [],
            "date": "2014-04-09 16:15:27+00:00",
            "diff": "krakjoe_pthreads/issue_292/commit_4ac9f127432590d69395da70fabecc8c33a2f414.diff",
            "diff_additions": 1,
            "diff_deletions": 1,
            "diff_file_size": 31307,
            "diff_url": "https://github.com/krakjoe/pthreads/commit/4ac9f127432590d69395da70fabecc8c33a2f414.diff",
            "exists": true,
            "files": [
                {
                    "file_additions": 1,
                    "file_deletions": 1,
                    "file_exists": true,
                    "file_name": "src/store.c",
                    "file_size": 31307
                }
            ],
            "interesting": {
                "reopen": false,
                "status": false
            },
            "is_parent": false,
            "sha": "4ac9f127432590d69395da70fabecc8c33a2f414"
        }
    ],
    "first_commit": "2014-03-28 19:36:31+00:00",
    "last_commit": "2014-04-09 16:15:27+00:00",
    "number": 292,
    "pull_request": "None",
    "score": {
        "accidental_reopen_likely": false,
        "all_labels": [],
        "contains_keywords": [
            "confirm",
            "work",
            "chang",
            "fix",
            "issu",
            "perform",
            "test",
            "fault",
            "leak",
            "bug",
            "error",
            "problem",
            "crash",
            "report"
        ],
        "fix_size": 133,
        "has_labels": [],
        "intersecting": {
            "computed_score": 1.0,
            "final_commit_size": 2,
            "intersection_size": 2,
            "previous_commits_size": 133
        },
        "is_makefile_based": false,
        "no_new_files": [],
        "no_other_files": false,
        "num_prohibited_files": 165900,
        "prohibited_files": [
            "server/src/main/java/com/genymobile/scrcpy/Device.java",
            "server/src/main/java/com/genymobile/scrcpy/wrappers/SurfaceControl.java",
            "server/src/main/java/com/genymobile/scrcpy/Device.java",
            "server/src/main/java/com/genymobile/scrcpy/wrappers/SurfaceControl.java",
            "app/meson.build",
            "app/scrcpy.1",
            "app/src/common.h",
            "app/src/scrcpy.h",
            "app/src/server.h",
            "server/src/main/java/com/genymobile/scrcpy/Workarounds.java"
        ],
        "reopen": true,
        "reopen_events": [
            [
                "2014-04-08 06:46:17+00:00",
                "closed"
            ],
            [
                "2014-04-08 06:46:17+00:00",
                "commit"
            ],
            [
                "2014-04-08 07:06:47+00:00",
                "commit"
            ],
            [
                "2014-04-08 08:04:33+00:00",
                "reopened"
            ],
            [
                "2014-04-08 20:33:28+00:00",
                "closed"
            ],
            [
                "2014-04-08 20:33:28+00:00",
                "commit"
            ],
            [
                "2014-04-09 16:15:31+00:00",
                "commit"
            ]
        ],
        "status": false,
        "strategy": true,
        "total_changes": 272
    }
}