{
    "covered_issues": [
        408,
        407,
        406,
        404,
        403,
        402,
        401,
        400,
        399,
        398,
        397,
        396,
        395,
        394,
        393,
        392,
        388,
        387,
        386,
        384,
        381,
        378,
        377,
        376,
        375,
        369,
        366,
        362,
        361,
        355,
        353,
        352,
        350,
        346,
        345,
        344,
        343,
        342,
        341,
        339,
        337,
        336,
        335,
        334,
        333,
        332,
        331,
        329,
        327,
        326,
        323,
        321,
        320,
        317,
        314,
        313,
        310,
        308,
        307,
        305,
        302,
        301,
        299,
        298,
        296,
        295,
        293,
        291,
        288,
        287,
        284,
        283,
        282,
        281,
        280,
        279,
        278,
        275,
        274,
        273,
        272,
        271,
        270,
        269,
        266,
        265,
        264,
        263,
        262,
        261,
        260,
        259,
        258,
        257,
        256,
        255,
        254,
        253,
        251,
        248,
        247,
        246,
        244,
        243,
        242,
        241,
        240,
        238,
        236,
        235,
        234,
        231,
        230,
        228,
        227,
        226,
        225,
        223,
        222,
        220,
        219,
        218,
        217,
        216,
        215,
        214,
        210,
        209,
        208,
        207,
        204,
        203,
        201,
        200,
        199,
        196,
        195,
        194,
        193,
        192,
        191,
        190,
        189,
        188,
        187,
        186,
        185,
        184,
        182,
        179,
        178,
        177,
        176,
        175,
        174,
        173,
        172,
        171,
        168,
        167,
        166,
        165,
        164,
        163,
        161,
        160,
        159,
        158,
        157,
        156,
        155,
        154,
        153,
        152,
        151,
        150,
        149,
        148,
        147,
        145,
        144,
        143,
        142,
        141,
        140,
        139,
        137,
        136,
        135,
        134,
        133,
        132,
        131,
        130,
        129,
        128,
        127,
        126,
        125,
        124,
        123,
        122,
        121,
        119,
        117,
        116,
        115,
        114,
        113,
        111,
        110,
        109,
        106,
        105,
        104,
        102,
        101,
        100,
        99,
        98,
        97,
        96,
        95,
        92,
        90,
        89,
        88,
        87,
        86,
        85,
        84,
        81,
        80,
        79,
        78,
        77,
        76,
        74,
        72,
        70,
        69,
        68,
        67,
        66,
        65,
        64,
        63,
        62,
        61,
        59,
        58,
        57,
        56,
        55,
        53,
        52,
        51,
        50,
        48,
        46,
        45,
        44,
        41,
        40,
        39,
        37,
        36,
        35,
        34,
        33,
        32,
        31,
        30,
        29,
        28,
        27,
        26,
        25,
        24,
        23,
        22,
        20,
        19,
        17,
        16,
        15,
        14,
        13,
        12,
        10,
        7,
        6,
        4,
        3,
        2,
        1
    ],
    "finished": true
}