{
    "covered_issues": [
        117,
        111,
        110,
        109,
        108,
        106,
        105,
        101,
        97,
        95,
        94,
        93,
        92,
        91,
        90,
        89,
        86,
        85,
        83,
        82,
        80,
        78,
        77,
        76,
        75,
        73,
        72,
        71,
        70,
        69,
        68,
        67,
        66,
        63,
        62,
        61,
        60,
        59,
        56,
        54,
        50,
        49,
        48,
        45,
        43,
        42,
        41,
        40,
        38,
        37,
        33,
        31,
        30,
        29,
        28,
        27,
        26,
        25,
        24,
        23,
        22,
        21,
        20,
        19,
        18,
        17,
        15,
        14,
        13,
        12,
        9,
        4,
        2
    ],
    "finished": true
}