{
    "covered_issues": [
        1506,
        1501,
        1495,
        1494,
        1492,
        1486,
        1483,
        1477,
        1473,
        1467,
        1466,
        1464,
        1463,
        1461,
        1458,
        1457,
        1454,
        1436,
        1432,
        1420,
        1411,
        1402,
        1400,
        1390,
        1378,
        1369,
        1346,
        1345,
        1339,
        1329,
        1325,
        1315,
        1259,
        1238,
        1227,
        1221,
        1217,
        1216,
        1215,
        1194,
        1190,
        1183,
        1181,
        1180,
        1179,
        1178,
        1173,
        1171,
        1169,
        1168,
        1167,
        1165,
        1164,
        1155,
        1154,
        1153,
        1148,
        1132,
        1131,
        1128,
        1127,
        1126,
        1107,
        1106,
        1103,
        1102,
        1098,
        1095,
        1093,
        1091,
        1081,
        1078,
        1077,
        1075,
        1073,
        1070,
        1064,
        1061,
        1057,
        1051,
        1050,
        1045,
        1043,
        1042,
        1038,
        1036,
        1023,
        1022,
        1009,
        1005,
        964,
        955,
        949,
        947,
        945,
        942,
        938,
        935,
        928,
        918,
        914,
        903,
        898,
        897,
        894,
        891,
        884,
        862,
        851,
        850,
        848,
        842,
        826,
        823,
        820,
        815,
        802,
        800,
        799,
        797,
        794,
        775,
        768,
        764,
        761,
        755,
        742,
        739,
        738,
        736,
        728,
        726,
        713,
        711,
        707,
        703,
        702,
        699,
        691,
        689,
        681,
        668,
        667,
        666,
        663,
        656,
        644,
        643,
        634,
        629,
        626,
        614,
        603,
        601,
        600,
        598,
        597,
        595,
        584,
        580,
        576,
        573,
        572,
        571,
        566,
        563,
        560,
        559,
        557,
        548,
        541,
        535,
        531,
        527,
        525,
        518,
        517,
        516,
        490,
        485,
        478,
        471,
        470,
        459,
        458,
        453,
        449,
        448,
        445,
        440,
        438,
        436,
        435,
        434,
        431,
        429,
        427,
        424,
        421,
        416,
        414,
        411,
        409,
        405,
        404,
        403,
        402,
        401,
        399,
        396,
        395,
        388,
        385,
        382,
        380,
        370,
        368,
        367,
        365,
        364,
        360,
        359,
        358,
        357,
        349,
        348,
        347,
        344,
        342,
        339,
        337,
        335,
        333,
        332,
        330,
        327,
        326,
        324,
        323,
        322,
        321,
        319,
        315,
        313,
        312,
        308,
        306,
        300,
        294,
        291,
        289,
        287,
        286,
        285,
        283,
        282,
        281,
        279,
        278,
        276,
        273,
        257,
        256,
        243,
        234,
        228,
        225,
        223,
        222,
        220,
        212,
        206,
        205,
        203,
        200,
        196,
        192,
        190,
        189,
        184,
        183,
        180,
        178,
        176,
        174,
        173,
        171,
        168,
        166,
        165,
        163,
        162,
        157,
        153,
        149,
        147,
        146,
        145,
        143,
        141,
        139,
        136,
        134,
        133,
        128,
        126,
        115,
        102,
        95,
        91,
        84,
        83,
        82,
        78,
        68,
        67,
        65,
        61,
        60,
        59,
        57,
        54,
        53,
        51,
        50,
        49,
        48,
        44,
        43,
        42,
        30,
        29,
        21,
        18,
        17,
        13,
        12,
        10
    ],
    "finished": true
}