{
    "category": [
        "hardware/OS",
        "network/protocol"
    ],
    "commits": [
        {
            "associated_pull_request": [
                "https://github.com/DynamoRIO/dynamorio/pull/3461"
            ],
            "date": "2019-03-19 23:24:31",
            "diff": "",
            "diff_additions": 0,
            "diff_deletions": 0,
            "diff_file_size": 0,
            "diff_url": "https://github.com/DynamoRIO/dynamorio/commit/9953ebce6e4c3546fe895f9e340d562c564e89aa.diff",
            "exists": true,
            "files": [],
            "interesting": {
                "reopen": false,
                "status": true
            },
            "is_parent": true,
            "sha": "9953ebce6e4c3546fe895f9e340d562c564e89aa"
        },
        {
            "associated_pull_request": [
                "https://github.com/DynamoRIO/dynamorio/pull/3463"
            ],
            "date": "2019-03-22 03:12:50",
            "diff": "dynamorio_dynamorio/issue_2946/commit_7db49cca5651b809840155b278ca3911018e0302.diff",
            "diff_additions": 72,
            "diff_deletions": 1,
            "diff_file_size": 29383,
            "diff_url": "https://github.com/DynamoRIO/dynamorio/commit/7db49cca5651b809840155b278ca3911018e0302.diff",
            "exists": true,
            "files": [
                {
                    "file_additions": 10,
                    "file_deletions": 0,
                    "file_exists": false,
                    "file_name": "core/arch/instr_shared.c",
                    "file_size": 0
                },
                {
                    "file_additions": 2,
                    "file_deletions": 1,
                    "file_exists": false,
                    "file_name": "core/arch/opnd_shared.c",
                    "file_size": 0
                },
                {
                    "file_additions": 60,
                    "file_deletions": 0,
                    "file_exists": true,
                    "file_name": "ext/drutil/drutil.c",
                    "file_size": 29383
                }
            ],
            "interesting": {
                "reopen": false,
                "status": true
            },
            "is_parent": false,
            "sha": "7db49cca5651b809840155b278ca3911018e0302"
        },
        {
            "associated_pull_request": [
                "https://github.com/DynamoRIO/dynamorio/pull/3463"
            ],
            "date": "2019-03-25 23:47:33",
            "diff": "dynamorio_dynamorio/issue_2946/commit_fe51002f4cfabb8732d6e9b76ac1b8bfe0fcbf4c.diff",
            "diff_additions": 106,
            "diff_deletions": 2,
            "diff_file_size": 52760,
            "diff_url": "https://github.com/DynamoRIO/dynamorio/commit/fe51002f4cfabb8732d6e9b76ac1b8bfe0fcbf4c.diff",
            "exists": true,
            "files": [
                {
                    "file_additions": 10,
                    "file_deletions": 0,
                    "file_exists": false,
                    "file_name": "core/arch/instr_shared.c",
                    "file_size": 0
                },
                {
                    "file_additions": 2,
                    "file_deletions": 1,
                    "file_exists": false,
                    "file_name": "core/arch/opnd_shared.c",
                    "file_size": 0
                },
                {
                    "file_additions": 65,
                    "file_deletions": 0,
                    "file_exists": true,
                    "file_name": "ext/drutil/drutil.c",
                    "file_size": 29383
                },
                {
                    "file_additions": 18,
                    "file_deletions": 1,
                    "file_exists": true,
                    "file_name": "suite/tests/client-interface/drmgr-test.c",
                    "file_size": 13699
                },
                {
                    "file_additions": 11,
                    "file_deletions": 0,
                    "file_exists": true,
                    "file_name": "suite/tests/client-interface/drutil-test.dll.c",
                    "file_size": 9678
                }
            ],
            "interesting": {
                "reopen": true,
                "status": false
            },
            "is_parent": false,
            "sha": "fe51002f4cfabb8732d6e9b76ac1b8bfe0fcbf4c"
        },
        {
            "associated_pull_request": [
                "https://github.com/DynamoRIO/dynamorio/pull/3495"
            ],
            "date": "2019-04-01 22:41:02",
            "diff": "dynamorio_dynamorio/issue_2946/commit_9dead0b86d18919ee21789666ebc9e5068251deb.diff",
            "diff_additions": 1,
            "diff_deletions": 1,
            "diff_file_size": 9678,
            "diff_url": "https://github.com/DynamoRIO/dynamorio/commit/9dead0b86d18919ee21789666ebc9e5068251deb.diff",
            "exists": true,
            "files": [
                {
                    "file_additions": 1,
                    "file_deletions": 1,
                    "file_exists": true,
                    "file_name": "suite/tests/client-interface/drutil-test.dll.c",
                    "file_size": 9678
                }
            ],
            "interesting": {
                "reopen": false,
                "status": false
            },
            "is_parent": false,
            "sha": "9dead0b86d18919ee21789666ebc9e5068251deb"
        },
        {
            "associated_pull_request": [
                "https://github.com/DynamoRIO/dynamorio/pull/3495"
            ],
            "date": "2019-04-02 18:30:40",
            "diff": "dynamorio_dynamorio/issue_2946/commit_678641671c6dafdf99dd6cfde313456baf18ca46.diff",
            "diff_additions": 2,
            "diff_deletions": 2,
            "diff_file_size": 9678,
            "diff_url": "https://github.com/DynamoRIO/dynamorio/commit/678641671c6dafdf99dd6cfde313456baf18ca46.diff",
            "exists": true,
            "files": [
                {
                    "file_additions": 2,
                    "file_deletions": 2,
                    "file_exists": true,
                    "file_name": "suite/tests/client-interface/drutil-test.dll.c",
                    "file_size": 9678
                }
            ],
            "interesting": {
                "reopen": false,
                "status": false
            },
            "is_parent": false,
            "sha": "678641671c6dafdf99dd6cfde313456baf18ca46"
        },
        {
            "associated_pull_request": [],
            "date": "2019-04-02 18:30:40",
            "diff": "dynamorio_dynamorio/issue_2946/commit_2f4d0de1c3cc812880ef878f2a0d23c51926c124.diff",
            "diff_additions": 2,
            "diff_deletions": 2,
            "diff_file_size": 9678,
            "diff_url": "https://github.com/DynamoRIO/dynamorio/commit/2f4d0de1c3cc812880ef878f2a0d23c51926c124.diff",
            "exists": true,
            "files": [
                {
                    "file_additions": 2,
                    "file_deletions": 2,
                    "file_exists": true,
                    "file_name": "suite/tests/client-interface/drutil-test.dll.c",
                    "file_size": 9678
                }
            ],
            "interesting": {
                "reopen": false,
                "status": false
            },
            "is_parent": false,
            "sha": "2f4d0de1c3cc812880ef878f2a0d23c51926c124"
        }
    ],
    "first_commit": "2019-03-19 23:24:31",
    "last_commit": "2019-04-22 17:26:56",
    "number": 2946,
    "pull_request": "None",
    "score": {
        "accidental_reopen_likely": false,
        "all_labels": [
            "Bug-Assert",
            "Component-DRTool",
            "Hotlist-Release",
            "OpSys-Linux",
            "Priority-High"
        ],
        "contains_keywords": [
            "fail",
            "chang",
            "error",
            "problem",
            "crash",
            "test",
            "fix",
            "patch",
            "issu",
            "work"
        ],
        "fix_size": 166,
        "has_labels": [],
        "intersecting": {
            "computed_score": 1.0,
            "final_commit_size": 3,
            "intersection_size": 3,
            "previous_commits_size": 166
        },
        "is_makefile_based": true,
        "no_new_files": [],
        "no_other_files": false,
        "num_prohibited_files": 26527,
        "prohibited_files": [
            "hal/inc/pinmap_hal.h",
            "Debug/marvin.bin",
            "Debug/marvin.elf",
            "Debug/marvin.hex",
            "Debug/marvin.bin",
            "Debug/marvin.elf",
            "Debug/marvin.hex",
            "inc/spark_utilities.h",
            "Debug/marvin.bin",
            "Debug/marvin.elf"
        ],
        "reopen": true,
        "reopen_events": [
            [
                "2019-03-22 03:25:13",
                "commit"
            ],
            [
                "2019-03-25 23:47:38",
                "commit"
            ],
            [
                "2019-03-25 23:50:00",
                "closed"
            ],
            [
                "2019-03-26 00:03:51",
                "reopened"
            ],
            [
                "2019-03-26 03:57:35",
                "closed"
            ],
            [
                "2019-04-01 22:43:11",
                "commit"
            ],
            [
                "2019-04-02 18:30:45",
                "commit"
            ],
            [
                "2019-04-22 17:27:09",
                "commit"
            ]
        ],
        "status": false,
        "strategy": true,
        "total_changes": 191
    }
}