{
    "covered_issues": [
        139,
        137,
        135,
        129,
        121,
        109,
        103,
        93,
        86,
        83,
        76,
        75,
        58,
        37,
        36,
        35,
        33,
        32,
        31,
        14,
        12,
        11,
        10,
        9,
        7,
        6,
        5,
        4,
        2,
        1
    ],
    "finished": true
}