{
    "commits": [
        {
            "associated_pull_request": [
                "https://github.com/DynamoRIO/dynamorio/pull/2309"
            ],
            "date": "2017-03-28 07:37:06+00:00",
            "diff": "",
            "diff_additions": 0,
            "diff_deletions": 0,
            "diff_file_size": 0,
            "diff_url": "https://github.com/DynamoRIO/dynamorio/commit/2c4c19c4645d4d228f50bc7b5e9131689a54de6c.diff",
            "exists": true,
            "files": [],
            "interesting": {
                "reopen": false,
                "status": false
            },
            "is_parent": true,
            "sha": "2c4c19c4645d4d228f50bc7b5e9131689a54de6c"
        },
        {
            "associated_pull_request": [
                "https://github.com/DynamoRIO/dynamorio/pull/2313"
            ],
            "date": "2017-03-28 23:13:27+00:00",
            "diff": "dynamorio_dynamorio/issue_2270/commit_d6d4faa417f5dc7b78c574bc5517d95ab33bfa3c.diff",
            "diff_additions": 134,
            "diff_deletions": 24,
            "diff_file_size": 1430687,
            "diff_url": "https://github.com/DynamoRIO/dynamorio/commit/d6d4faa417f5dc7b78c574bc5517d95ab33bfa3c.diff",
            "exists": true,
            "files": [
                {
                    "file_additions": 4,
                    "file_deletions": 2,
                    "file_exists": true,
                    "file_name": "core/dynamo.c",
                    "file_size": 131111
                },
                {
                    "file_additions": 3,
                    "file_deletions": 0,
                    "file_exists": true,
                    "file_name": "core/synch.c",
                    "file_size": 103417
                },
                {
                    "file_additions": 10,
                    "file_deletions": 2,
                    "file_exists": true,
                    "file_name": "core/unix/os.c",
                    "file_size": 435916
                },
                {
                    "file_additions": 86,
                    "file_deletions": 17,
                    "file_exists": true,
                    "file_name": "core/unix/signal.c",
                    "file_size": 362791
                },
                {
                    "file_additions": 7,
                    "file_deletions": 1,
                    "file_exists": true,
                    "file_name": "core/win32/os.c",
                    "file_size": 388839
                },
                {
                    "file_additions": 24,
                    "file_deletions": 2,
                    "file_exists": true,
                    "file_name": "suite/tests/api/static_signal.c",
                    "file_size": 8613
                }
            ],
            "interesting": {
                "reopen": true,
                "status": false
            },
            "is_parent": false,
            "sha": "d6d4faa417f5dc7b78c574bc5517d95ab33bfa3c"
        },
        {
            "associated_pull_request": [
                "https://github.com/DynamoRIO/dynamorio/pull/2943"
            ],
            "date": "2018-04-19 02:58:27+00:00",
            "diff": "dynamorio_dynamorio/issue_2270/commit_ec9ddb7d93b23b13a9144a83ff8f05bc4572946f.diff",
            "diff_additions": 80,
            "diff_deletions": 15,
            "diff_file_size": 371404,
            "diff_url": "https://github.com/DynamoRIO/dynamorio/commit/ec9ddb7d93b23b13a9144a83ff8f05bc4572946f.diff",
            "exists": true,
            "files": [
                {
                    "file_additions": 49,
                    "file_deletions": 14,
                    "file_exists": true,
                    "file_name": "core/unix/signal.c",
                    "file_size": 362791
                },
                {
                    "file_additions": 31,
                    "file_deletions": 1,
                    "file_exists": true,
                    "file_name": "suite/tests/api/static_signal.c",
                    "file_size": 8613
                }
            ],
            "interesting": {
                "reopen": false,
                "status": false
            },
            "is_parent": false,
            "sha": "ec9ddb7d93b23b13a9144a83ff8f05bc4572946f"
        },
        {
            "associated_pull_request": [
                "https://github.com/DynamoRIO/dynamorio/pull/2943"
            ],
            "date": "2018-04-19 03:32:25+00:00",
            "diff": "dynamorio_dynamorio/issue_2270/commit_0d1e64bcad3a5aa0127e3cbfa2395718954ec7e0.diff",
            "diff_additions": 80,
            "diff_deletions": 15,
            "diff_file_size": 371404,
            "diff_url": "https://github.com/DynamoRIO/dynamorio/commit/0d1e64bcad3a5aa0127e3cbfa2395718954ec7e0.diff",
            "exists": true,
            "files": [
                {
                    "file_additions": 49,
                    "file_deletions": 14,
                    "file_exists": true,
                    "file_name": "core/unix/signal.c",
                    "file_size": 362791
                },
                {
                    "file_additions": 31,
                    "file_deletions": 1,
                    "file_exists": true,
                    "file_name": "suite/tests/api/static_signal.c",
                    "file_size": 8613
                }
            ],
            "interesting": {
                "reopen": false,
                "status": false
            },
            "is_parent": false,
            "sha": "0d1e64bcad3a5aa0127e3cbfa2395718954ec7e0"
        },
        {
            "associated_pull_request": [
                "https://github.com/DynamoRIO/dynamorio/pull/3249"
            ],
            "date": "2018-11-05 21:56:16+00:00",
            "diff": "dynamorio_dynamorio/issue_2270/commit_fabcbcbe8b2a7485189ce703388d1a8573b9975e.diff",
            "diff_additions": 5,
            "diff_deletions": 3,
            "diff_file_size": 103417,
            "diff_url": "https://github.com/DynamoRIO/dynamorio/commit/fabcbcbe8b2a7485189ce703388d1a8573b9975e.diff",
            "exists": true,
            "files": [
                {
                    "file_additions": 5,
                    "file_deletions": 3,
                    "file_exists": true,
                    "file_name": "core/synch.c",
                    "file_size": 103417
                }
            ],
            "interesting": {
                "reopen": false,
                "status": false
            },
            "is_parent": false,
            "sha": "fabcbcbe8b2a7485189ce703388d1a8573b9975e"
        },
        {
            "associated_pull_request": [
                "https://github.com/DynamoRIO/dynamorio/pull/3249"
            ],
            "date": "2018-11-06 16:26:27+00:00",
            "diff": "dynamorio_dynamorio/issue_2270/commit_d1291019dcd621cbc69d76dded361a6a418890bd.diff",
            "diff_additions": 5,
            "diff_deletions": 3,
            "diff_file_size": 103417,
            "diff_url": "https://github.com/DynamoRIO/dynamorio/commit/d1291019dcd621cbc69d76dded361a6a418890bd.diff",
            "exists": true,
            "files": [
                {
                    "file_additions": 5,
                    "file_deletions": 3,
                    "file_exists": true,
                    "file_name": "core/synch.c",
                    "file_size": 103417
                }
            ],
            "interesting": {
                "reopen": false,
                "status": false
            },
            "is_parent": false,
            "sha": "d1291019dcd621cbc69d76dded361a6a418890bd"
        }
    ],
    "first_commit": "2017-03-28 07:37:06+00:00",
    "last_commit": "2018-11-06 16:26:27+00:00",
    "number": 2270,
    "pull_request": "None",
    "score": {
        "accidental_reopen_likely": false,
        "all_labels": [
            "OpSys-Linux",
            "Bug-AppCrash"
        ],
        "contains_keywords": [
            "chang",
            "fix",
            "issu",
            "test",
            "fault",
            "problem",
            "crash"
        ],
        "fix_size": 241,
        "has_labels": [],
        "intersecting": {
            "computed_score": 1.0,
            "final_commit_size": 9,
            "intersection_size": 9,
            "previous_commits_size": 241
        },
        "is_makefile_based": true,
        "no_new_files": [],
        "no_other_files": false,
        "num_prohibited_files": 249116,
        "prohibited_files": [
            "server/src/main/java/com/genymobile/scrcpy/Device.java",
            "server/src/main/java/com/genymobile/scrcpy/wrappers/SurfaceControl.java",
            "server/src/main/java/com/genymobile/scrcpy/Device.java",
            "server/src/main/java/com/genymobile/scrcpy/wrappers/SurfaceControl.java",
            "app/meson.build",
            "app/scrcpy.1",
            "app/src/common.h",
            "app/src/scrcpy.h",
            "app/src/server.h",
            "server/src/main/java/com/genymobile/scrcpy/Workarounds.java"
        ],
        "reopen": true,
        "reopen_events": [
            [
                "2017-03-28 22:12:00+00:00",
                "commit"
            ],
            [
                "2017-03-28 23:13:28+00:00",
                "closed"
            ],
            [
                "2017-03-28 23:13:29+00:00",
                "commit"
            ],
            [
                "2018-04-19 02:27:56+00:00",
                "reopened"
            ],
            [
                "2018-04-19 03:01:59+00:00",
                "commit"
            ],
            [
                "2018-04-19 03:32:26+00:00",
                "closed"
            ],
            [
                "2018-04-19 03:32:29+00:00",
                "commit"
            ],
            [
                "2018-11-05 22:00:43+00:00",
                "commit"
            ],
            [
                "2018-11-06 16:26:33+00:00",
                "commit"
            ]
        ],
        "status": false,
        "strategy": true,
        "total_changes": 364
    }
}