{
    "category": [
        "memory",
        "build/refactor/preprocessing"
    ],
    "commits": [
        {
            "associated_pull_request": [
                "https://github.com/zephyrproject-rtos/zephyr/pull/4411"
            ],
            "date": "2017-10-18 14:37:08",
            "diff": "zephyrproject-rtos_zephyr/issue_4591/commit_dc3f2455d7a69db2e1b53fd24f4594d413aff867.diff",
            "diff_additions": 3,
            "diff_deletions": 8,
            "diff_file_size": 8827,
            "diff_url": "https://github.com/zephyrproject-rtos/zephyr/commit/dc3f2455d7a69db2e1b53fd24f4594d413aff867.diff",
            "exists": true,
            "files": [
                {
                    "file_additions": 3,
                    "file_deletions": 8,
                    "file_exists": true,
                    "file_name": "drivers/ieee802154/ieee802154_uart_pipe.c",
                    "file_size": 8827
                }
            ],
            "interesting": {
                "reopen": false,
                "status": false
            },
            "is_parent": true,
            "sha": "dc3f2455d7a69db2e1b53fd24f4594d413aff867"
        },
        {
            "associated_pull_request": [],
            "date": "2017-10-26 19:15:08",
            "diff": "zephyrproject-rtos_zephyr/issue_4591/commit_98efd2a62538d2aca1bccca47796b771ef30c22f.diff",
            "diff_additions": 8,
            "diff_deletions": 6,
            "diff_file_size": 34424,
            "diff_url": "https://github.com/zephyrproject-rtos/zephyr/commit/98efd2a62538d2aca1bccca47796b771ef30c22f.diff",
            "exists": true,
            "files": [
                {
                    "file_additions": 8,
                    "file_deletions": 6,
                    "file_exists": true,
                    "file_name": "drivers/ieee802154/ieee802154_mcr20a.c",
                    "file_size": 34424
                }
            ],
            "interesting": {
                "reopen": false,
                "status": true
            },
            "is_parent": false,
            "sha": "98efd2a62538d2aca1bccca47796b771ef30c22f"
        },
        {
            "associated_pull_request": [],
            "date": "2017-10-26 19:15:08",
            "diff": "zephyrproject-rtos_zephyr/issue_4591/commit_61c26f26508c5b20463f2beb1194b6246afc9080.diff",
            "diff_additions": 2,
            "diff_deletions": 2,
            "diff_file_size": 34424,
            "diff_url": "https://github.com/zephyrproject-rtos/zephyr/commit/61c26f26508c5b20463f2beb1194b6246afc9080.diff",
            "exists": true,
            "files": [
                {
                    "file_additions": 2,
                    "file_deletions": 2,
                    "file_exists": true,
                    "file_name": "drivers/ieee802154/ieee802154_mcr20a.c",
                    "file_size": 34424
                }
            ],
            "interesting": {
                "reopen": false,
                "status": false
            },
            "is_parent": false,
            "sha": "61c26f26508c5b20463f2beb1194b6246afc9080"
        }
    ],
    "first_commit": "2017-10-26 11:51:56",
    "last_commit": "2017-10-30 13:13:11",
    "number": 4591,
    "pull_request": "None",
    "score": {
        "accidental_reopen_likely": false,
        "all_labels": [
            "Coverity",
            "area: Drivers",
            "bug",
            "priority: medium"
        ],
        "contains_keywords": [
            "chang",
            "confirm",
            "test",
            "issu",
            "CI"
        ],
        "fix_size": 14,
        "has_labels": [
            "bug"
        ],
        "intersecting": {
            "computed_score": 0.3333333333333333,
            "final_commit_size": 3,
            "intersection_size": 1,
            "previous_commits_size": 12
        },
        "is_makefile_based": true,
        "no_new_files": [],
        "no_other_files": true,
        "num_prohibited_files": 45064,
        "prohibited_files": [
            "hal/inc/pinmap_hal.h",
            "Debug/marvin.bin",
            "Debug/marvin.elf",
            "Debug/marvin.hex",
            "Debug/marvin.bin",
            "Debug/marvin.elf",
            "Debug/marvin.hex",
            "inc/spark_utilities.h",
            "Debug/marvin.bin",
            "Debug/marvin.elf"
        ],
        "reopen": false,
        "reopen_events": [
            [
                "2017-10-27 14:49:11",
                "commit"
            ],
            [
                "2017-10-27 18:10:40",
                "commit"
            ],
            [
                "2017-10-30 13:14:43",
                "commit"
            ],
            [
                "2017-11-15 17:44:52",
                "closed"
            ]
        ],
        "status": true,
        "strategy": true,
        "total_changes": 29
    }
}