{
    "all_issues": 503,
    "interesting_issues": 1,
    "last_update": "2023-10-31 14:58:27.809225",
    "license": {
        "download": "https://raw.githubusercontent.com/djpohly/dwl/main/LICENSE",
        "name": "Other"
    },
    "ratio": 0.0019880715705765406,
    "size": 1075,
    "stars": 1848,
    "url": "https://github.com/djpohly/dwl"
}