{
    "commits": [
        {
            "associated_pull_request": [],
            "date": "2023-03-30 07:41:32+00:00",
            "diff": "libredwg_libredwg/issue_677/commit_d7bab7f3fed6cade62dec763c2c6c6c0cdf0507a.diff",
            "diff_additions": 1,
            "diff_deletions": 1,
            "diff_file_size": 286856,
            "diff_url": "https://github.com/LibreDWG/libredwg/commit/d7bab7f3fed6cade62dec763c2c6c6c0cdf0507a.diff",
            "exists": true,
            "files": [
                {
                    "file_additions": 1,
                    "file_deletions": 1,
                    "file_exists": true,
                    "file_name": "src/encode.c",
                    "file_size": 286856
                }
            ],
            "interesting": {
                "reopen": false,
                "status": false
            },
            "is_parent": true,
            "sha": "d7bab7f3fed6cade62dec763c2c6c6c0cdf0507a"
        },
        {
            "associated_pull_request": [],
            "date": "2023-03-30 08:20:19+00:00",
            "diff": "libredwg_libredwg/issue_677/commit_6b22121098e77bc24c08eca08735866d47c9bd7d.diff",
            "diff_additions": 27,
            "diff_deletions": 9,
            "diff_file_size": 235783,
            "diff_url": "https://github.com/LibreDWG/libredwg/commit/6b22121098e77bc24c08eca08735866d47c9bd7d.diff",
            "exists": true,
            "files": [
                {
                    "file_additions": 27,
                    "file_deletions": 9,
                    "file_exists": true,
                    "file_name": "src/decode.c",
                    "file_size": 235783
                }
            ],
            "interesting": {
                "reopen": false,
                "status": true
            },
            "is_parent": false,
            "sha": "6b22121098e77bc24c08eca08735866d47c9bd7d"
        },
        {
            "associated_pull_request": [],
            "date": "2023-03-30 08:30:18+00:00",
            "diff": "libredwg_libredwg/issue_677/commit_f00d6d02f911f4dbd8239df6f8be93d983abbf2e.diff",
            "diff_additions": 3,
            "diff_deletions": 3,
            "diff_file_size": 165703,
            "diff_url": "https://github.com/LibreDWG/libredwg/commit/f00d6d02f911f4dbd8239df6f8be93d983abbf2e.diff",
            "exists": true,
            "files": [
                {
                    "file_additions": 3,
                    "file_deletions": 3,
                    "file_exists": true,
                    "file_name": "src/out_dxf.c",
                    "file_size": 165703
                }
            ],
            "interesting": {
                "reopen": false,
                "status": true
            },
            "is_parent": false,
            "sha": "f00d6d02f911f4dbd8239df6f8be93d983abbf2e"
        },
        {
            "associated_pull_request": [],
            "date": "2023-03-30 08:30:18+00:00",
            "diff": "libredwg_libredwg/issue_677/commit_e04b89578882bab6e5ca94bd70519b5f25c36d4b.diff",
            "diff_additions": 3,
            "diff_deletions": 3,
            "diff_file_size": 165703,
            "diff_url": "https://github.com/LibreDWG/libredwg/commit/e04b89578882bab6e5ca94bd70519b5f25c36d4b.diff",
            "exists": true,
            "files": [
                {
                    "file_additions": 3,
                    "file_deletions": 3,
                    "file_exists": true,
                    "file_name": "src/out_dxf.c",
                    "file_size": 165703
                }
            ],
            "interesting": {
                "reopen": false,
                "status": false
            },
            "is_parent": false,
            "sha": "e04b89578882bab6e5ca94bd70519b5f25c36d4b"
        },
        {
            "associated_pull_request": [],
            "date": "2023-03-30 08:30:18+00:00",
            "diff": "libredwg_libredwg/issue_677/commit_5a4c9abde7a3eaac168c1651a2949598e87bedcb.diff",
            "diff_additions": 3,
            "diff_deletions": 3,
            "diff_file_size": 165703,
            "diff_url": "https://github.com/LibreDWG/libredwg/commit/5a4c9abde7a3eaac168c1651a2949598e87bedcb.diff",
            "exists": true,
            "files": [
                {
                    "file_additions": 3,
                    "file_deletions": 3,
                    "file_exists": true,
                    "file_name": "src/out_dxf.c",
                    "file_size": 165703
                }
            ],
            "interesting": {
                "reopen": true,
                "status": false
            },
            "is_parent": false,
            "sha": "5a4c9abde7a3eaac168c1651a2949598e87bedcb"
        },
        {
            "associated_pull_request": [],
            "date": "2023-03-31 06:52:14+00:00",
            "diff": "libredwg_libredwg/issue_677/commit_e30686bed32c20915fb789cb49dcc09e7512a56f.diff",
            "diff_additions": 6,
            "diff_deletions": 3,
            "diff_file_size": 235783,
            "diff_url": "https://github.com/LibreDWG/libredwg/commit/e30686bed32c20915fb789cb49dcc09e7512a56f.diff",
            "exists": true,
            "files": [
                {
                    "file_additions": 6,
                    "file_deletions": 3,
                    "file_exists": true,
                    "file_name": "src/decode.c",
                    "file_size": 235783
                }
            ],
            "interesting": {
                "reopen": false,
                "status": false
            },
            "is_parent": false,
            "sha": "e30686bed32c20915fb789cb49dcc09e7512a56f"
        }
    ],
    "first_commit": "2023-03-30 07:48:49+00:00",
    "last_commit": "2023-03-31 07:05:43+00:00",
    "number": 677,
    "pull_request": "None",
    "score": {
        "accidental_reopen_likely": false,
        "all_labels": [
            "fuzzing"
        ],
        "contains_keywords": [
            "fix",
            "test",
            "bug",
            "error"
        ],
        "fix_size": 39,
        "has_labels": [],
        "intersecting": {
            "computed_score": 0.14285714285714285,
            "final_commit_size": 7,
            "intersection_size": 1,
            "previous_commits_size": 33
        },
        "is_makefile_based": true,
        "no_new_files": [],
        "no_other_files": true,
        "num_prohibited_files": 492528,
        "prohibited_files": [
            "server/src/main/java/com/genymobile/scrcpy/Device.java",
            "server/src/main/java/com/genymobile/scrcpy/wrappers/SurfaceControl.java",
            "server/src/main/java/com/genymobile/scrcpy/Device.java",
            "server/src/main/java/com/genymobile/scrcpy/wrappers/SurfaceControl.java",
            "app/meson.build",
            "app/scrcpy.1",
            "app/src/common.h",
            "app/src/scrcpy.h",
            "app/src/server.h",
            "server/src/main/java/com/genymobile/scrcpy/Workarounds.java"
        ],
        "reopen": true,
        "reopen_events": [
            [
                "2023-03-30 08:21:29+00:00",
                "commit"
            ],
            [
                "2023-03-30 08:30:28+00:00",
                "commit"
            ],
            [
                "2023-03-30 08:36:15+00:00",
                "commit"
            ],
            [
                "2023-03-30 08:36:15+00:00",
                "commit"
            ],
            [
                "2023-03-30 10:21:21+00:00",
                "closed"
            ],
            [
                "2023-03-30 11:12:20+00:00",
                "commit"
            ],
            [
                "2023-03-30 11:12:20+00:00",
                "commit"
            ],
            [
                "2023-03-31 04:30:58+00:00",
                "reopened"
            ],
            [
                "2023-03-31 07:06:12+00:00",
                "commit"
            ],
            [
                "2023-04-04 14:03:23+00:00",
                "closed"
            ]
        ],
        "status": true,
        "strategy": true,
        "total_changes": 65
    }
}