{
    "category": [
        "hardware/OS",
        "network/protocols"
    ],
    "commits": [
        {
            "associated_pull_request": [],
            "date": "2020-05-25 15:55:16",
            "diff": "curl_curl/issue_5454/commit_96a822f6e2de3df00c94bd74a5981032678da70a.diff",
            "diff_additions": 14,
            "diff_deletions": 6,
            "diff_file_size": 55423,
            "diff_url": "https://github.com/curl/curl/commit/96a822f6e2de3df00c94bd74a5981032678da70a.diff",
            "exists": true,
            "files": [
                {
                    "file_additions": 14,
                    "file_deletions": 6,
                    "file_exists": true,
                    "file_name": "lib/vquic/ngtcp2.c",
                    "file_size": 55423
                }
            ],
            "interesting": {
                "reopen": false,
                "status": false
            },
            "is_parent": true,
            "sha": "96a822f6e2de3df00c94bd74a5981032678da70a"
        },
        {
            "associated_pull_request": [],
            "date": "2020-05-26 09:07:06",
            "diff": "curl_curl/issue_5454/commit_9d0a566d8f589e241f4a040801099c0b763654a1.diff",
            "diff_additions": 13,
            "diff_deletions": 4,
            "diff_file_size": 33883,
            "diff_url": "https://github.com/curl/curl/commit/9d0a566d8f589e241f4a040801099c0b763654a1.diff",
            "exists": true,
            "files": [
                {
                    "file_additions": 13,
                    "file_deletions": 4,
                    "file_exists": true,
                    "file_name": "lib/hostip.c",
                    "file_size": 33883
                }
            ],
            "interesting": {
                "reopen": false,
                "status": true
            },
            "is_parent": false,
            "sha": "9d0a566d8f589e241f4a040801099c0b763654a1"
        },
        {
            "associated_pull_request": [],
            "date": "2020-05-26 09:07:06",
            "diff": "curl_curl/issue_5454/commit_67d2802deabd179552bf957d344b7dd74cbb64d8.diff",
            "diff_additions": 17,
            "diff_deletions": 6,
            "diff_file_size": 63273,
            "diff_url": "https://github.com/curl/curl/commit/67d2802deabd179552bf957d344b7dd74cbb64d8.diff",
            "exists": true,
            "files": [
                {
                    "file_additions": 1,
                    "file_deletions": 0,
                    "file_exists": true,
                    "file_name": "lib/doh.c",
                    "file_size": 29390
                },
                {
                    "file_additions": 16,
                    "file_deletions": 6,
                    "file_exists": true,
                    "file_name": "lib/hostip.c",
                    "file_size": 33883
                }
            ],
            "interesting": {
                "reopen": false,
                "status": false
            },
            "is_parent": false,
            "sha": "67d2802deabd179552bf957d344b7dd74cbb64d8"
        }
    ],
    "first_commit": "2020-05-26 08:16:32",
    "last_commit": "2020-05-26 15:37:39",
    "number": 5454,
    "pull_request": "None",
    "score": {
        "accidental_reopen_likely": false,
        "all_labels": [
            "name lookup"
        ],
        "contains_keywords": [
            "work",
            "issu",
            "fail"
        ],
        "fix_size": 28,
        "has_labels": [],
        "intersecting": {
            "computed_score": 0.5416666666666666,
            "final_commit_size": 24,
            "intersection_size": 13,
            "previous_commits_size": 17
        },
        "is_makefile_based": true,
        "no_new_files": [
            "lib/doh.c"
        ],
        "no_other_files": false,
        "num_prohibited_files": 20809,
        "prohibited_files": [
            "kill.h",
            "meminfo.h",
            "kill.h",
            "meminfo.h",
            "kill.h",
            "meminfo.h",
            "testsuite_cli_test.go",
            "testsuite_cli_test.go",
            "common.mk",
            "i3bar/include/draw_util.h"
        ],
        "reopen": false,
        "reopen_events": [
            [
                "2020-05-26 09:09:02",
                "commit"
            ],
            [
                "2020-05-26 15:40:40",
                "closed"
            ],
            [
                "2020-05-26 15:40:40",
                "commit"
            ]
        ],
        "status": true,
        "strategy": true,
        "total_changes": 60
    }
}