{
    "all_issues": 4814,
    "interesting_issues": 1,
    "last_update": "2021-05-16 11:01:11.238592",
    "license": {
        "download": "https://raw.githubusercontent.com/urbit/urbit/master/LICENSE.txt",
        "name": "MIT License"
    },
    "ratio": 0.0002077274615704196,
    "size": 141123,
    "stars": 2768,
    "url": "https://github.com/urbit/urbit"
}