{
    "commits": [
        {
            "associated_pull_request": [],
            "date": "2015-01-04 12:53:15+00:00",
            "diff": "dvorka_hstr/issue_97/commit_5691623b133910bbc52efdd544d3026ce47cb622.diff",
            "diff_additions": 7,
            "diff_deletions": 1,
            "diff_file_size": 61307,
            "diff_url": "https://github.com/dvorka/hstr/commit/5691623b133910bbc52efdd544d3026ce47cb622.diff",
            "exists": true,
            "files": [
                {
                    "file_additions": 7,
                    "file_deletions": 1,
                    "file_exists": true,
                    "file_name": "src/hstr.c",
                    "file_size": 61307
                }
            ],
            "interesting": {
                "reopen": false,
                "status": false
            },
            "is_parent": true,
            "sha": "5691623b133910bbc52efdd544d3026ce47cb622"
        },
        {
            "associated_pull_request": [],
            "date": "2015-01-04 20:51:21+00:00",
            "diff": "dvorka_hstr/issue_97/commit_4084b3f9da2d99fade6961b7f654d2dd2da75d1d.diff",
            "diff_additions": 6,
            "diff_deletions": 2,
            "diff_file_size": 68689,
            "diff_url": "https://github.com/dvorka/hstr/commit/4084b3f9da2d99fade6961b7f654d2dd2da75d1d.diff",
            "exists": true,
            "files": [
                {
                    "file_additions": 4,
                    "file_deletions": 0,
                    "file_exists": true,
                    "file_name": "src/hstr.c",
                    "file_size": 61307
                },
                {
                    "file_additions": 2,
                    "file_deletions": 2,
                    "file_exists": true,
                    "file_name": "src/hstr_utils.c",
                    "file_size": 7382
                }
            ],
            "interesting": {
                "reopen": true,
                "status": false
            },
            "is_parent": false,
            "sha": "4084b3f9da2d99fade6961b7f654d2dd2da75d1d"
        },
        {
            "associated_pull_request": [],
            "date": "2015-06-06 04:04:09+00:00",
            "diff": "dvorka_hstr/issue_97/commit_79781c138b972f553303d2b6d045ae215391a014.diff",
            "diff_additions": 0,
            "diff_deletions": 4,
            "diff_file_size": 61307,
            "diff_url": "https://github.com/dvorka/hstr/commit/79781c138b972f553303d2b6d045ae215391a014.diff",
            "exists": true,
            "files": [
                {
                    "file_additions": 0,
                    "file_deletions": 4,
                    "file_exists": true,
                    "file_name": "src/hstr.c",
                    "file_size": 61307
                }
            ],
            "interesting": {
                "reopen": false,
                "status": false
            },
            "is_parent": false,
            "sha": "79781c138b972f553303d2b6d045ae215391a014"
        }
    ],
    "first_commit": "2015-01-04 12:53:15+00:00",
    "last_commit": "2015-06-06 04:04:09+00:00",
    "number": 97,
    "pull_request": "None",
    "score": {
        "accidental_reopen_likely": false,
        "all_labels": [
            ":beetle: bug",
            ":white_square_button: cygwin",
            ":hurtrealbad: medium"
        ],
        "contains_keywords": [
            "work",
            "fail",
            "chang",
            "fix",
            "issu",
            "warn",
            "error",
            "problem",
            "report"
        ],
        "fix_size": 12,
        "has_labels": [],
        "intersecting": {
            "computed_score": 0.2,
            "final_commit_size": 5,
            "intersection_size": 1,
            "previous_commits_size": 8
        },
        "is_makefile_based": true,
        "no_new_files": [],
        "no_other_files": false,
        "num_prohibited_files": 98953,
        "prohibited_files": [
            "server/src/main/java/com/genymobile/scrcpy/Device.java",
            "server/src/main/java/com/genymobile/scrcpy/wrappers/SurfaceControl.java",
            "server/src/main/java/com/genymobile/scrcpy/Device.java",
            "server/src/main/java/com/genymobile/scrcpy/wrappers/SurfaceControl.java",
            "app/meson.build",
            "app/scrcpy.1",
            "app/src/common.h",
            "app/src/scrcpy.h",
            "app/src/server.h",
            "server/src/main/java/com/genymobile/scrcpy/Workarounds.java"
        ],
        "reopen": true,
        "reopen_events": [
            [
                "2015-01-04 21:11:31+00:00",
                "closed"
            ],
            [
                "2015-01-04 21:11:31+00:00",
                "commit"
            ],
            [
                "2015-06-04 07:40:16+00:00",
                "reopened"
            ],
            [
                "2015-06-06 04:17:09+00:00",
                "closed"
            ],
            [
                "2015-06-06 04:17:09+00:00",
                "commit"
            ]
        ],
        "status": false,
        "strategy": true,
        "total_changes": 20
    }
}