{
    "commits": [
        {
            "diff": "spring-projects_spring-boot/issue_4064/commit_e272b3a95787b61b2a9a71ecc17cbadb69cc172a.diff",
            "diff_additions": 107,
            "diff_deletions": 94,
            "diff_file_size": 0,
            "files": [
                {
                    "file_additions": 96,
                    "file_deletions": 0,
                    "file_exists": false,
                    "file_name": "spring-boot-actuator/src/main/java/org/springframework/boot/actuate/endpoint/mvc/AbstractEndpointMvcAdapter.java",
                    "file_size": 0
                },
                {
                    "file_additions": 4,
                    "file_deletions": 54,
                    "file_exists": false,
                    "file_name": "spring-boot-actuator/src/main/java/org/springframework/boot/actuate/endpoint/mvc/EndpointMvcAdapter.java",
                    "file_size": 0
                },
                {
                    "file_additions": 7,
                    "file_deletions": 40,
                    "file_exists": false,
                    "file_name": "spring-boot-actuator/src/main/java/org/springframework/boot/actuate/endpoint/mvc/HealthMvcEndpoint.java",
                    "file_size": 0
                }
            ],
            "interesting": {
                "reopened": false,
                "status": false
            },
            "sha": "e272b3a95787b61b2a9a71ecc17cbadb69cc172a"
        },
        {
            "diff": "spring-projects_spring-boot/issue_4064/commit_6a31c1dda16ae06b4d2da2772ad0a1a822780f23.diff",
            "diff_additions": 3,
            "diff_deletions": 1,
            "diff_file_size": 0,
            "files": [
                {
                    "file_additions": 3,
                    "file_deletions": 1,
                    "file_exists": false,
                    "file_name": "spring-boot-actuator/src/main/java/org/springframework/boot/actuate/autoconfigure/EndpointWebMvcAutoConfiguration.java",
                    "file_size": 0
                }
            ],
            "interesting": {
                "reopened": false,
                "status": true
            },
            "sha": "6a31c1dda16ae06b4d2da2772ad0a1a822780f23"
        },
        {
            "diff": "spring-projects_spring-boot/issue_4064/commit_7e99d08473cafb36a4640d1a360c8d0364aa4430.diff",
            "diff_additions": 43,
            "diff_deletions": 24,
            "diff_file_size": 0,
            "files": [
                {
                    "file_additions": 13,
                    "file_deletions": 24,
                    "file_exists": false,
                    "file_name": "spring-boot-actuator/src/main/java/org/springframework/boot/actuate/autoconfigure/EndpointWebMvcAutoConfiguration.java",
                    "file_size": 0
                },
                {
                    "file_additions": 30,
                    "file_deletions": 0,
                    "file_exists": false,
                    "file_name": "spring-boot-actuator/src/test/java/org/springframework/boot/actuate/autoconfigure/EndpointWebMvcAutoConfigurationTests.java",
                    "file_size": 0
                }
            ],
            "interesting": {
                "reopened": false,
                "status": false
            },
            "sha": "7e99d08473cafb36a4640d1a360c8d0364aa4430"
        }
    ],
    "first_commit": "2015-10-02 18:26:03",
    "last_commit": "2015-10-16 00:52:51",
    "number": 4064,
    "score": 304.0147058823529
}