{
    "covered_issues": [
        1468,
        1466,
        1460,
        1457,
        1454,
        1451,
        1449,
        1447,
        1444,
        1441,
        1439,
        1437,
        1430,
        1426,
        1423,
        1419,
        1418,
        1412,
        1409,
        1406,
        1399,
        1395,
        1394,
        1391,
        1390,
        1386,
        1383,
        1378,
        1377,
        1375,
        1370,
        1365,
        1360,
        1356,
        1350,
        1349,
        1344,
        1339,
        1337,
        1335,
        1333,
        1331,
        1329,
        1328,
        1325,
        1324,
        1323,
        1322,
        1321,
        1320,
        1313,
        1312,
        1310,
        1306,
        1305,
        1301,
        1300,
        1299,
        1298,
        1294,
        1293,
        1292,
        1285,
        1281,
        1280,
        1279,
        1278,
        1277,
        1273,
        1272,
        1268,
        1267,
        1262,
        1261,
        1259,
        1258,
        1256,
        1255,
        1254,
        1249,
        1244,
        1242,
        1240,
        1239,
        1238,
        1237,
        1236,
        1235,
        1234,
        1231,
        1230,
        1229,
        1228,
        1226,
        1225,
        1224,
        1222,
        1221,
        1220,
        1218,
        1217,
        1216,
        1213,
        1212,
        1210,
        1208,
        1207,
        1206,
        1204,
        1200,
        1199,
        1198,
        1196,
        1193,
        1191,
        1190,
        1189,
        1188,
        1187,
        1184,
        1182,
        1179,
        1178,
        1177,
        1174,
        1173,
        1172,
        1171,
        1169,
        1168,
        1167,
        1165,
        1164,
        1163,
        1162,
        1160,
        1158,
        1157,
        1155,
        1152,
        1150,
        1149,
        1145,
        1144,
        1143,
        1142,
        1141,
        1138,
        1137,
        1134,
        1128,
        1125,
        1124,
        1123,
        1122,
        1121,
        1119,
        1117,
        1115,
        1114,
        1113,
        1111,
        1110,
        1107,
        1106,
        1104,
        1102,
        1101,
        1100,
        1099,
        1098,
        1096,
        1094,
        1092,
        1090,
        1089,
        1087,
        1084,
        1083,
        1080,
        1078,
        1075,
        1074,
        1071,
        1068,
        1067,
        1063,
        1062,
        1060,
        1059,
        1057,
        1056,
        1052,
        1050,
        1047,
        1044,
        1041,
        1040,
        1039,
        1037,
        1036,
        1034,
        1031,
        1030,
        1027,
        1025,
        1024,
        1023,
        1020,
        1019,
        1018,
        1016,
        1012,
        1011,
        1010,
        1009,
        1008,
        1004,
        1003,
        1002,
        1000,
        999,
        996,
        995,
        994,
        993,
        990,
        989,
        988,
        987,
        986,
        983,
        981,
        980,
        979,
        978,
        977,
        976,
        973,
        972,
        971,
        970,
        969,
        968,
        966,
        963,
        962,
        961,
        960,
        957,
        955,
        954,
        953,
        952,
        949,
        947,
        946,
        944,
        942,
        940,
        939,
        937,
        936,
        935,
        934,
        933,
        932,
        930,
        929,
        928,
        927,
        925,
        924,
        923,
        922,
        921,
        920,
        914,
        913,
        911,
        910,
        907,
        906,
        905,
        903,
        902,
        901,
        899,
        897,
        894,
        893,
        892,
        891,
        890,
        889,
        888,
        887,
        886,
        885,
        884,
        882,
        881,
        878,
        877,
        876,
        875,
        873,
        872,
        871,
        870,
        869,
        868,
        867,
        866,
        865,
        863,
        858,
        857,
        855,
        853,
        850,
        848,
        847,
        845,
        844,
        841,
        840,
        837,
        833,
        832,
        831,
        830,
        827,
        825,
        822,
        820,
        819,
        818,
        816,
        815,
        814,
        813,
        812,
        810,
        807,
        805,
        804,
        803,
        800,
        799,
        798,
        797,
        796,
        795,
        794,
        791,
        790,
        789,
        788,
        787,
        786,
        784,
        783,
        782,
        781,
        778,
        775,
        773,
        772,
        771,
        769,
        768,
        767,
        766,
        765,
        764,
        761,
        760,
        758,
        757,
        755,
        754,
        753,
        752,
        751,
        750,
        749,
        748,
        747,
        746,
        743,
        742,
        741,
        740,
        738,
        736,
        735,
        731,
        730,
        729,
        728,
        724,
        723,
        721,
        720,
        719,
        715,
        714,
        713,
        712,
        711,
        708,
        707,
        706,
        705,
        704,
        702,
        701,
        698,
        696,
        692,
        691,
        690,
        689,
        687,
        686,
        685,
        684,
        683,
        682,
        681,
        679,
        678,
        676,
        673,
        672,
        671,
        670,
        669,
        668,
        667,
        666,
        664,
        662,
        660,
        659,
        656,
        654,
        649,
        647,
        644,
        643,
        642,
        641,
        640,
        639,
        638,
        635,
        634,
        633,
        632,
        631,
        630,
        628,
        625,
        624,
        623,
        622,
        621,
        620,
        618,
        617,
        616,
        615,
        614,
        613,
        612,
        609,
        608,
        605,
        604,
        603,
        601,
        599,
        595,
        594,
        592,
        591,
        590,
        589,
        588,
        585,
        582,
        581,
        579,
        578,
        576,
        575,
        574,
        571,
        570,
        568,
        567,
        566,
        565,
        564,
        563,
        562,
        560,
        559,
        557,
        555,
        554,
        553,
        552,
        550,
        547,
        545,
        544,
        543,
        541,
        540,
        539,
        536,
        535,
        534,
        533,
        532,
        528,
        527,
        525,
        523,
        521,
        520,
        519,
        518,
        517,
        516,
        514,
        513,
        512,
        511,
        509,
        508,
        507,
        506,
        505,
        504,
        503,
        502,
        501,
        500,
        499,
        498,
        497,
        495,
        494,
        493,
        491,
        490,
        489,
        488,
        487,
        486,
        485,
        483,
        482,
        481,
        480,
        479,
        476,
        475,
        474,
        473,
        472,
        471,
        470,
        469,
        468,
        467,
        466,
        465,
        464,
        463,
        462,
        461,
        460,
        459,
        458,
        456,
        455,
        454,
        453,
        451,
        450,
        448,
        447,
        446,
        443,
        442,
        441,
        440,
        439,
        438,
        437,
        436,
        435,
        434,
        432,
        431,
        430,
        429,
        428,
        427,
        426,
        425,
        424,
        423,
        422,
        421,
        420,
        419,
        418,
        417,
        416,
        415,
        414,
        413,
        412,
        411,
        410,
        409,
        408,
        407,
        406,
        405,
        404,
        402,
        401,
        400,
        399,
        398,
        397,
        396,
        395,
        394,
        393,
        392,
        391,
        390,
        388,
        387,
        386,
        385,
        384,
        383,
        382,
        381,
        380,
        379,
        378,
        377,
        376,
        375,
        374,
        373,
        372,
        371,
        370,
        369,
        367,
        366,
        365,
        364,
        363,
        362,
        361,
        359,
        358,
        357,
        356,
        355,
        354,
        353,
        352,
        351,
        350,
        349,
        348,
        347,
        345,
        344,
        343,
        342,
        341,
        340,
        339,
        337,
        335,
        333,
        332,
        331,
        330,
        329,
        328,
        327,
        326,
        325,
        324,
        323,
        322,
        321,
        320,
        319,
        318,
        316,
        315,
        314,
        312,
        311,
        310,
        309,
        308,
        307,
        306,
        304,
        303,
        302,
        301,
        300,
        299,
        298,
        297,
        296,
        294,
        293,
        292,
        291,
        290,
        289,
        287,
        286,
        285,
        284,
        282,
        280,
        279,
        277,
        276,
        275,
        274,
        273,
        272,
        271,
        270,
        269,
        268,
        266,
        265,
        264,
        263,
        262,
        260,
        259,
        258,
        257,
        255,
        254,
        253,
        252,
        250,
        249,
        248,
        247,
        246,
        244,
        242,
        241,
        240,
        239,
        238,
        237,
        236,
        235,
        233,
        232,
        231,
        230,
        229,
        227,
        226,
        224,
        222,
        221,
        220,
        219,
        218,
        217,
        216,
        215,
        214,
        213,
        212,
        211,
        210,
        209,
        208,
        206,
        203,
        202,
        201,
        200,
        198,
        197,
        196,
        194,
        193,
        191,
        190,
        189,
        188,
        186,
        184,
        183,
        182,
        180,
        179,
        178,
        177,
        176,
        175,
        174,
        173,
        172,
        171,
        170,
        169,
        168,
        167,
        166,
        165,
        163,
        162,
        159,
        158,
        156,
        155,
        154,
        153,
        152,
        150,
        149,
        148,
        147,
        146,
        145,
        144,
        143,
        142,
        141,
        140,
        138,
        137,
        133,
        132,
        131,
        129,
        128,
        127,
        126,
        125,
        124,
        123,
        122,
        121,
        119,
        118,
        116,
        115,
        114,
        113,
        112,
        111,
        110,
        109,
        108,
        107,
        106,
        105,
        103,
        101,
        99,
        98,
        97,
        96,
        95,
        93,
        92,
        91,
        90,
        88,
        87,
        85,
        84,
        83,
        80,
        79,
        78,
        77,
        76,
        75,
        74,
        73,
        72,
        71,
        70,
        69,
        68,
        67,
        66,
        65,
        64,
        63,
        62,
        61,
        60,
        57,
        56,
        54,
        53,
        52,
        51,
        50,
        49,
        48,
        47,
        46,
        45,
        44,
        41,
        32,
        28,
        27,
        25,
        24,
        23,
        22,
        17,
        16,
        15,
        12,
        11,
        10,
        9,
        7,
        2,
        1
    ],
    "finished": true
}