{
    "commits": [
        {
            "diff": "elastic_elasticsearch/issue_37687/commit_e82e6e56259545b2a095b34e8c55bc9c2d764e7b.diff",
            "diff_additions": 2,
            "diff_deletions": 0,
            "diff_file_size": 0,
            "files": [
                {
                    "file_additions": 2,
                    "file_deletions": 0,
                    "file_exists": false,
                    "file_name": "server/src/test/java/org/elasticsearch/discovery/DiscoveryDisruptionIT.java",
                    "file_size": 0
                }
            ],
            "interesting": {
                "reopened": false,
                "status": false
            },
            "sha": "e82e6e56259545b2a095b34e8c55bc9c2d764e7b"
        },
        {
            "diff": "elastic_elasticsearch/issue_37687/commit_d8bc96f8211483519da5a0530ddc073d1c7856f3.diff",
            "diff_additions": 1,
            "diff_deletions": 0,
            "diff_file_size": 0,
            "files": [
                {
                    "file_additions": 1,
                    "file_deletions": 0,
                    "file_exists": false,
                    "file_name": "server/src/test/java/org/elasticsearch/discovery/DiscoveryDisruptionIT.java",
                    "file_size": 0
                }
            ],
            "interesting": {
                "reopened": false,
                "status": false
            },
            "sha": "d8bc96f8211483519da5a0530ddc073d1c7856f3"
        },
        {
            "diff": "elastic_elasticsearch/issue_37687/commit_74d1cfbf7e748868fed35bd2fe55f2788cded7b8.diff",
            "diff_additions": 1,
            "diff_deletions": 0,
            "diff_file_size": 0,
            "files": [
                {
                    "file_additions": 1,
                    "file_deletions": 0,
                    "file_exists": false,
                    "file_name": "server/src/test/java/org/elasticsearch/discovery/DiscoveryDisruptionIT.java",
                    "file_size": 0
                }
            ],
            "interesting": {
                "reopened": false,
                "status": false
            },
            "sha": "74d1cfbf7e748868fed35bd2fe55f2788cded7b8"
        },
        {
            "diff": "elastic_elasticsearch/issue_37687/commit_0743bb735f3710dfa7ef63ac46b8a8e9a1daa48a.diff",
            "diff_additions": 106,
            "diff_deletions": 149,
            "diff_file_size": 349842,
            "files": [
                {
                    "file_additions": 2,
                    "file_deletions": 2,
                    "file_exists": true,
                    "file_name": "server/src/main/java/org/elasticsearch/cluster/coordination/Coordinator.java",
                    "file_size": 79533
                },
                {
                    "file_additions": 12,
                    "file_deletions": 3,
                    "file_exists": true,
                    "file_name": "server/src/main/java/org/elasticsearch/transport/TransportService.java",
                    "file_size": 61002
                },
                {
                    "file_additions": 51,
                    "file_deletions": 12,
                    "file_exists": true,
                    "file_name": "server/src/test/java/org/elasticsearch/cluster/coordination/CoordinatorTests.java",
                    "file_size": 86891
                },
                {
                    "file_additions": 1,
                    "file_deletions": 75,
                    "file_exists": false,
                    "file_name": "server/src/test/java/org/elasticsearch/discovery/DiscoveryDisruptionIT.java",
                    "file_size": 0
                },
                {
                    "file_additions": 26,
                    "file_deletions": 41,
                    "file_exists": false,
                    "file_name": "server/src/test/java/org/elasticsearch/discovery/StableMasterDisruptionIT.java",
                    "file_size": 0
                },
                {
                    "file_additions": 13,
                    "file_deletions": 5,
                    "file_exists": true,
                    "file_name": "test/framework/src/main/java/org/elasticsearch/cluster/coordination/MockSinglePrioritizingExecutor.java",
                    "file_size": 2505
                },
                {
                    "file_additions": 0,
                    "file_deletions": 10,
                    "file_exists": true,
                    "file_name": "test/framework/src/main/java/org/elasticsearch/test/InternalTestCluster.java",
                    "file_size": 107186
                },
                {
                    "file_additions": 1,
                    "file_deletions": 1,
                    "file_exists": true,
                    "file_name": "test/framework/src/main/java/org/elasticsearch/test/disruption/DisruptableMockTransport.java",
                    "file_size": 12725
                }
            ],
            "interesting": {
                "reopened": false,
                "status": true
            },
            "sha": "0743bb735f3710dfa7ef63ac46b8a8e9a1daa48a"
        },
        {
            "diff": "elastic_elasticsearch/issue_37687/commit_125309bf9266f7b492ffac266f27bbc0cbe65d58.diff",
            "diff_additions": 106,
            "diff_deletions": 149,
            "diff_file_size": 349842,
            "files": [
                {
                    "file_additions": 2,
                    "file_deletions": 2,
                    "file_exists": true,
                    "file_name": "server/src/main/java/org/elasticsearch/cluster/coordination/Coordinator.java",
                    "file_size": 79533
                },
                {
                    "file_additions": 12,
                    "file_deletions": 3,
                    "file_exists": true,
                    "file_name": "server/src/main/java/org/elasticsearch/transport/TransportService.java",
                    "file_size": 61002
                },
                {
                    "file_additions": 51,
                    "file_deletions": 12,
                    "file_exists": true,
                    "file_name": "server/src/test/java/org/elasticsearch/cluster/coordination/CoordinatorTests.java",
                    "file_size": 86891
                },
                {
                    "file_additions": 1,
                    "file_deletions": 75,
                    "file_exists": false,
                    "file_name": "server/src/test/java/org/elasticsearch/discovery/DiscoveryDisruptionIT.java",
                    "file_size": 0
                },
                {
                    "file_additions": 26,
                    "file_deletions": 41,
                    "file_exists": false,
                    "file_name": "server/src/test/java/org/elasticsearch/discovery/StableMasterDisruptionIT.java",
                    "file_size": 0
                },
                {
                    "file_additions": 13,
                    "file_deletions": 5,
                    "file_exists": true,
                    "file_name": "test/framework/src/main/java/org/elasticsearch/cluster/coordination/MockSinglePrioritizingExecutor.java",
                    "file_size": 2505
                },
                {
                    "file_additions": 0,
                    "file_deletions": 10,
                    "file_exists": true,
                    "file_name": "test/framework/src/main/java/org/elasticsearch/test/InternalTestCluster.java",
                    "file_size": 107186
                },
                {
                    "file_additions": 1,
                    "file_deletions": 1,
                    "file_exists": true,
                    "file_name": "test/framework/src/main/java/org/elasticsearch/test/disruption/DisruptableMockTransport.java",
                    "file_size": 12725
                }
            ],
            "interesting": {
                "reopened": false,
                "status": false
            },
            "sha": "125309bf9266f7b492ffac266f27bbc0cbe65d58"
        }
    ],
    "first_commit": "2019-01-22 08:42:18",
    "last_commit": "2019-02-02 14:26:07",
    "number": 37687,
    "score": 320.0077821011673
}