{
    "commits": [
        {
            "diff": "elastic_elasticsearch/issue_49261/commit_4013e814e8aa7c8781d9e7af7e1fd70db7991227.diff",
            "diff_additions": 124,
            "diff_deletions": 42,
            "diff_file_size": 113705,
            "files": [
                {
                    "file_additions": 6,
                    "file_deletions": 0,
                    "file_exists": true,
                    "file_name": "server/src/main/java/org/elasticsearch/ingest/ConfigurationUtils.java",
                    "file_size": 24616
                },
                {
                    "file_additions": 14,
                    "file_deletions": 9,
                    "file_exists": true,
                    "file_name": "x-pack/plugin/enrich/src/main/java/org/elasticsearch/xpack/enrich/AbstractEnrichProcessor.java",
                    "file_size": 7463
                },
                {
                    "file_additions": 1,
                    "file_deletions": 1,
                    "file_exists": true,
                    "file_name": "x-pack/plugin/enrich/src/main/java/org/elasticsearch/xpack/enrich/EnrichPlugin.java",
                    "file_size": 11218
                },
                {
                    "file_additions": 7,
                    "file_deletions": 3,
                    "file_exists": true,
                    "file_name": "x-pack/plugin/enrich/src/main/java/org/elasticsearch/xpack/enrich/EnrichProcessorFactory.java",
                    "file_size": 5188
                },
                {
                    "file_additions": 5,
                    "file_deletions": 4,
                    "file_exists": true,
                    "file_name": "x-pack/plugin/enrich/src/main/java/org/elasticsearch/xpack/enrich/GeoMatchProcessor.java",
                    "file_size": 2839
                },
                {
                    "file_additions": 5,
                    "file_deletions": 4,
                    "file_exists": true,
                    "file_name": "x-pack/plugin/enrich/src/main/java/org/elasticsearch/xpack/enrich/MatchProcessor.java",
                    "file_size": 2090
                },
                {
                    "file_additions": 39,
                    "file_deletions": 1,
                    "file_exists": true,
                    "file_name": "x-pack/plugin/enrich/src/test/java/org/elasticsearch/xpack/enrich/BasicEnrichTests.java",
                    "file_size": 18659
                },
                {
                    "file_additions": 17,
                    "file_deletions": 7,
                    "file_exists": true,
                    "file_name": "x-pack/plugin/enrich/src/test/java/org/elasticsearch/xpack/enrich/EnrichProcessorFactoryTests.java",
                    "file_size": 11445
                },
                {
                    "file_additions": 3,
                    "file_deletions": 2,
                    "file_exists": true,
                    "file_name": "x-pack/plugin/enrich/src/test/java/org/elasticsearch/xpack/enrich/GeoMatchProcessorTests.java",
                    "file_size": 10070
                },
                {
                    "file_additions": 27,
                    "file_deletions": 11,
                    "file_exists": true,
                    "file_name": "x-pack/plugin/enrich/src/test/java/org/elasticsearch/xpack/enrich/MatchProcessorTests.java",
                    "file_size": 20117
                }
            ],
            "interesting": {
                "reopened": false,
                "status": false
            },
            "sha": "4013e814e8aa7c8781d9e7af7e1fd70db7991227"
        },
        {
            "diff": "elastic_elasticsearch/issue_49261/commit_eefada0fbe18a5cad5cb798b6f7187073156a82c.diff",
            "diff_additions": 7,
            "diff_deletions": 4,
            "diff_file_size": 38350,
            "files": [
                {
                    "file_additions": 7,
                    "file_deletions": 4,
                    "file_exists": true,
                    "file_name": "x-pack/plugin/core/src/test/java/org/elasticsearch/xpack/core/ssl/SSLConfigurationReloaderTests.java",
                    "file_size": 38350
                }
            ],
            "interesting": {
                "reopened": false,
                "status": true
            },
            "sha": "eefada0fbe18a5cad5cb798b6f7187073156a82c"
        },
        {
            "diff": "elastic_elasticsearch/issue_49261/commit_ec8553f65e822cbcfc9f35dfcd9ced1c5cb71138.diff",
            "diff_additions": 7,
            "diff_deletions": 4,
            "diff_file_size": 38350,
            "files": [
                {
                    "file_additions": 7,
                    "file_deletions": 4,
                    "file_exists": true,
                    "file_name": "x-pack/plugin/core/src/test/java/org/elasticsearch/xpack/core/ssl/SSLConfigurationReloaderTests.java",
                    "file_size": 38350
                }
            ],
            "interesting": {
                "reopened": false,
                "status": false
            },
            "sha": "ec8553f65e822cbcfc9f35dfcd9ced1c5cb71138"
        },
        {
            "diff": "elastic_elasticsearch/issue_49261/commit_a59b7e07f15e1509e78f887f1b6e0b76f9a6953c.diff",
            "diff_additions": 7,
            "diff_deletions": 4,
            "diff_file_size": 38350,
            "files": [
                {
                    "file_additions": 7,
                    "file_deletions": 4,
                    "file_exists": true,
                    "file_name": "x-pack/plugin/core/src/test/java/org/elasticsearch/xpack/core/ssl/SSLConfigurationReloaderTests.java",
                    "file_size": 38350
                }
            ],
            "interesting": {
                "reopened": true,
                "status": false
            },
            "sha": "a59b7e07f15e1509e78f887f1b6e0b76f9a6953c"
        }
    ],
    "first_commit": "2019-11-27 06:52:42",
    "last_commit": "2019-11-29 07:43:55",
    "number": 49261,
    "score": 320.02010050251255
}