{
    "covered_issues": [
        88,
        87,
        86,
        83,
        82,
        81,
        80,
        79,
        77,
        75,
        74,
        73,
        70,
        69,
        68,
        67,
        64,
        59,
        57,
        51,
        49,
        45,
        38,
        37,
        36,
        34,
        33,
        30,
        29,
        27,
        25,
        24,
        23,
        22,
        20,
        15,
        14,
        12,
        9,
        8,
        7,
        6,
        5,
        4,
        3,
        2
    ],
    "finished": true
}