{
    "commits": [
        {
            "diff": "spring-projects_spring-boot/issue_15166/commit_3fac0f03601a9fdc8cf4eb43908c8592d063ebf5.diff",
            "diff_additions": 1,
            "diff_deletions": 1,
            "diff_file_size": 12468,
            "files": [
                {
                    "file_additions": 1,
                    "file_deletions": 1,
                    "file_exists": true,
                    "file_name": "spring-boot-project/spring-boot-tools/spring-boot-loader/src/main/java/org/springframework/boot/loader/jar/JarFileEntries.java",
                    "file_size": 12468
                }
            ],
            "interesting": {
                "reopened": false,
                "status": false
            },
            "sha": "3fac0f03601a9fdc8cf4eb43908c8592d063ebf5"
        },
        {
            "diff": "spring-projects_spring-boot/issue_15166/commit_d52b599eee5193502e27a3f5805c18cba37ddbda.diff",
            "diff_additions": 59,
            "diff_deletions": 11,
            "diff_file_size": 73569,
            "files": [
                {
                    "file_additions": 2,
                    "file_deletions": 0,
                    "file_exists": true,
                    "file_name": "spring-boot-project/spring-boot/src/main/java/org/springframework/boot/context/logging/LoggingApplicationListener.java",
                    "file_size": 17196
                },
                {
                    "file_additions": 18,
                    "file_deletions": 6,
                    "file_exists": true,
                    "file_name": "spring-boot-project/spring-boot/src/main/java/org/springframework/boot/web/servlet/AbstractFilterRegistrationBean.java",
                    "file_size": 9501
                },
                {
                    "file_additions": 36,
                    "file_deletions": 4,
                    "file_exists": true,
                    "file_name": "spring-boot-project/spring-boot/src/main/java/org/springframework/boot/web/servlet/ServletContextInitializerBeans.java",
                    "file_size": 12417
                },
                {
                    "file_additions": 0,
                    "file_deletions": 1,
                    "file_exists": true,
                    "file_name": "spring-boot-project/spring-boot/src/main/java/org/springframework/boot/web/servlet/ServletRegistrationBean.java",
                    "file_size": 6782
                },
                {
                    "file_additions": 3,
                    "file_deletions": 0,
                    "file_exists": true,
                    "file_name": "spring-boot-project/spring-boot/src/test/java/org/springframework/boot/context/logging/LoggingApplicationListenerTests.java",
                    "file_size": 27673
                }
            ],
            "interesting": {
                "reopened": false,
                "status": true
            },
            "sha": "d52b599eee5193502e27a3f5805c18cba37ddbda"
        },
        {
            "diff": "spring-projects_spring-boot/issue_15166/commit_5bb7b24d7c6a389e4d33660e88c12634c846af3e.diff",
            "diff_additions": 2,
            "diff_deletions": 2,
            "diff_file_size": 12417,
            "files": [
                {
                    "file_additions": 2,
                    "file_deletions": 2,
                    "file_exists": true,
                    "file_name": "spring-boot-project/spring-boot/src/main/java/org/springframework/boot/web/servlet/ServletContextInitializerBeans.java",
                    "file_size": 12417
                }
            ],
            "interesting": {
                "reopened": false,
                "status": false
            },
            "sha": "5bb7b24d7c6a389e4d33660e88c12634c846af3e"
        }
    ],
    "first_commit": "2018-11-20 17:26:28",
    "last_commit": "2018-11-21 10:50:41",
    "number": 15166,
    "score": 288.05263157894734
}