{
    "commits": [
        {
            "diff": "spring-projects_spring-boot/issue_3124/commit_f8f4bd6c9531367b982f9ac35b0337782a8a6484.diff",
            "diff_additions": 0,
            "diff_deletions": 1,
            "diff_file_size": 0,
            "files": [
                {
                    "file_additions": 0,
                    "file_deletions": 1,
                    "file_exists": false,
                    "file_name": "spring-boot/src/main/java/org/springframework/boot/SpringApplication.java",
                    "file_size": 0
                }
            ],
            "interesting": {
                "reopened": false,
                "status": false
            },
            "sha": "f8f4bd6c9531367b982f9ac35b0337782a8a6484"
        },
        {
            "diff": "spring-projects_spring-boot/issue_3124/commit_105039cdb206718ff020ffc9a52f60395ff223a9.diff",
            "diff_additions": 91,
            "diff_deletions": 69,
            "diff_file_size": 0,
            "files": [
                {
                    "file_additions": 9,
                    "file_deletions": 9,
                    "file_exists": false,
                    "file_name": "spring-boot-autoconfigure/src/main/java/org/springframework/boot/autoconfigure/admin/SpringApplicationAdminJmxAutoConfiguration.java",
                    "file_size": 0
                },
                {
                    "file_additions": 11,
                    "file_deletions": 8,
                    "file_exists": false,
                    "file_name": "spring-boot-autoconfigure/src/test/java/org/springframework/boot/autoconfigure/admin/SpringApplicationLifecycleAutoConfigurationTests.java",
                    "file_size": 0
                },
                {
                    "file_additions": 4,
                    "file_deletions": 4,
                    "file_exists": false,
                    "file_name": "spring-boot-tools/spring-boot-maven-plugin/src/it/start-stop-fork/src/main/java/org/test/SampleApplication.java",
                    "file_size": 0
                },
                {
                    "file_additions": 4,
                    "file_deletions": 4,
                    "file_exists": false,
                    "file_name": "spring-boot-tools/spring-boot-maven-plugin/src/it/start-stop/src/main/java/org/test/SampleApplication.java",
                    "file_size": 0
                },
                {
                    "file_additions": 19,
                    "file_deletions": 20,
                    "file_exists": false,
                    "file_name": "spring-boot-tools/spring-boot-maven-plugin/src/main/java/org/springframework/boot/maven/SpringApplicationAdminClient.java",
                    "file_size": 0
                },
                {
                    "file_additions": 5,
                    "file_deletions": 6,
                    "file_exists": false,
                    "file_name": "spring-boot-tools/spring-boot-maven-plugin/src/main/java/org/springframework/boot/maven/StartMojo.java",
                    "file_size": 0
                },
                {
                    "file_additions": 3,
                    "file_deletions": 4,
                    "file_exists": false,
                    "file_name": "spring-boot-tools/spring-boot-maven-plugin/src/main/java/org/springframework/boot/maven/StopMojo.java",
                    "file_size": 0
                },
                {
                    "file_additions": 4,
                    "file_deletions": 4,
                    "file_exists": false,
                    "file_name": "spring-boot/src/main/java/org/springframework/boot/admin/SpringApplicationAdminMXBean.java",
                    "file_size": 0
                },
                {
                    "file_additions": 7,
                    "file_deletions": 7,
                    "file_exists": false,
                    "file_name": "spring-boot/src/main/java/org/springframework/boot/admin/SpringApplicationAdminMXBeanRegistrar.java",
                    "file_size": 0
                },
                {
                    "file_additions": 21,
                    "file_deletions": 0,
                    "file_exists": false,
                    "file_name": "spring-boot/src/main/java/org/springframework/boot/admin/package-info.java",
                    "file_size": 0
                },
                {
                    "file_additions": 4,
                    "file_deletions": 3,
                    "file_exists": false,
                    "file_name": "spring-boot/src/test/java/org/springframework/boot/context/SpringApplicationLifecycleRegistrarTests.java",
                    "file_size": 0
                }
            ],
            "interesting": {
                "reopened": true,
                "status": false
            },
            "sha": "105039cdb206718ff020ffc9a52f60395ff223a9"
        },
        {
            "diff": "spring-projects_spring-boot/issue_3124/commit_e0787cbaf0fd9b125cc56aefc67fb5bc98a94ed3.diff",
            "diff_additions": 21,
            "diff_deletions": 21,
            "diff_file_size": 0,
            "files": [
                {
                    "file_additions": 7,
                    "file_deletions": 7,
                    "file_exists": false,
                    "file_name": "spring-boot-autoconfigure/src/main/java/org/springframework/boot/autoconfigure/admin/SpringApplicationAdminJmxAutoConfiguration.java",
                    "file_size": 0
                },
                {
                    "file_additions": 3,
                    "file_deletions": 3,
                    "file_exists": false,
                    "file_name": "spring-boot-autoconfigure/src/test/java/org/springframework/boot/autoconfigure/admin/SpringApplicationLifecycleAutoConfigurationTests.java",
                    "file_size": 0
                },
                {
                    "file_additions": 2,
                    "file_deletions": 2,
                    "file_exists": false,
                    "file_name": "spring-boot-tools/spring-boot-maven-plugin/src/main/java/org/springframework/boot/maven/StartMojo.java",
                    "file_size": 0
                },
                {
                    "file_additions": 4,
                    "file_deletions": 4,
                    "file_exists": false,
                    "file_name": "spring-boot/src/main/java/org/springframework/boot/admin/SpringApplicationAdminMXBeanRegistrar.java",
                    "file_size": 0
                },
                {
                    "file_additions": 5,
                    "file_deletions": 5,
                    "file_exists": false,
                    "file_name": "spring-boot/src/main/java/org/springframework/boot/admin/SpringApplicationAdminMXBeanRegistrarTests.java",
                    "file_size": 0
                }
            ],
            "interesting": {
                "reopened": true,
                "status": true
            },
            "sha": "e0787cbaf0fd9b125cc56aefc67fb5bc98a94ed3"
        },
        {
            "diff": "spring-projects_spring-boot/issue_3124/commit_f87b2be2f93495a243544a1b38fef83adcc5a92f.diff",
            "diff_additions": 3,
            "diff_deletions": 3,
            "diff_file_size": 0,
            "files": [
                {
                    "file_additions": 1,
                    "file_deletions": 1,
                    "file_exists": false,
                    "file_name": "spring-boot-tools/spring-boot-maven-plugin/src/it/start-stop-fork/src/main/java/org/test/SampleApplication.java",
                    "file_size": 0
                },
                {
                    "file_additions": 1,
                    "file_deletions": 1,
                    "file_exists": false,
                    "file_name": "spring-boot-tools/spring-boot-maven-plugin/src/it/start-stop/src/main/java/org/test/SampleApplication.java",
                    "file_size": 0
                },
                {
                    "file_additions": 1,
                    "file_deletions": 1,
                    "file_exists": false,
                    "file_name": "spring-boot-tools/spring-boot-maven-plugin/src/main/java/org/springframework/boot/maven/SpringApplicationAdminClient.java",
                    "file_size": 0
                }
            ],
            "interesting": {
                "reopened": false,
                "status": false
            },
            "sha": "f87b2be2f93495a243544a1b38fef83adcc5a92f"
        }
    ],
    "first_commit": "2015-06-09 22:42:34",
    "last_commit": "2015-06-10 15:31:06",
    "number": 3124,
    "score": 384.01913875598086
}