{
    "all_issues": 456,
    "interesting_issues": 1,
    "last_update": "2021-05-16 16:50:55.840808",
    "license": {
        "download": "https://raw.githubusercontent.com/arnaud-lb/php-rdkafka/5.x/LICENSE",
        "name": "MIT License"
    },
    "ratio": 0.0021929824561403508,
    "size": 777,
    "stars": 1583,
    "url": "https://github.com/arnaud-lb/php-rdkafka"
}