{
    "covered_issues": [
        46,
        44,
        43,
        42,
        40,
        37,
        36,
        35,
        34,
        31,
        29,
        28,
        24,
        23,
        20,
        17,
        16,
        14,
        13,
        11,
        10,
        8,
        6,
        5,
        3,
        1
    ],
    "finished": true
}