{
    "covered_issues": [
        326,
        325,
        323,
        319,
        316,
        313,
        308,
        307,
        304,
        301,
        299,
        297,
        296,
        295,
        294,
        293,
        286,
        285,
        284,
        281,
        280,
        279,
        278,
        277,
        276,
        272,
        270,
        264,
        259,
        256,
        255,
        254,
        253,
        251,
        244,
        239,
        238,
        237,
        234,
        233,
        232,
        231,
        229,
        228,
        227,
        225,
        222,
        214,
        210,
        208,
        205,
        204,
        202,
        201,
        200,
        196,
        194,
        190,
        186,
        183,
        182,
        174,
        169,
        167,
        164,
        161,
        158,
        157,
        156,
        147,
        144,
        143,
        134,
        133,
        132,
        131,
        129,
        128,
        126,
        122,
        120,
        119,
        118,
        117,
        115,
        113,
        111,
        107,
        104,
        102,
        101,
        100,
        99,
        91,
        90,
        89,
        88,
        87,
        86,
        83,
        81,
        78,
        77,
        75,
        74,
        72,
        70,
        67,
        66,
        62,
        61,
        60,
        59,
        58,
        56,
        55,
        54,
        53,
        52,
        51,
        46,
        45,
        44,
        43,
        42,
        41,
        40,
        39,
        37,
        35,
        34,
        32,
        31,
        30,
        27,
        25,
        24,
        23,
        22,
        20,
        18,
        17,
        16,
        14,
        13,
        12,
        11,
        10,
        9,
        8,
        6,
        5,
        4,
        3,
        2,
        1
    ],
    "finished": true
}