{
    "category": [
        "multithreading",
        "wrong API usage"
    ],
    "commits": [
        {
            "associated_pull_request": [],
            "date": "2020-04-02 07:33:35",
            "diff": "gluster_glusterfs/issue_1146/commit_e1ad1483e0e82d70fcc32311b7842bc9a77c04aa.diff",
            "diff_additions": 4,
            "diff_deletions": 23,
            "diff_file_size": 513740,
            "diff_url": "https://github.com/gluster/glusterfs/commit/e1ad1483e0e82d70fcc32311b7842bc9a77c04aa.diff",
            "exists": true,
            "files": [
                {
                    "file_additions": 0,
                    "file_deletions": 2,
                    "file_exists": true,
                    "file_name": "cli/src/cli-cmd-parser.c",
                    "file_size": 162972
                },
                {
                    "file_additions": 4,
                    "file_deletions": 12,
                    "file_exists": true,
                    "file_name": "cli/src/cli-rpc-ops.c",
                    "file_size": 304948
                },
                {
                    "file_additions": 0,
                    "file_deletions": 9,
                    "file_exists": true,
                    "file_name": "xlators/cluster/afr/src/afr-self-heald.c",
                    "file_size": 45820
                }
            ],
            "interesting": {
                "reopen": false,
                "status": false
            },
            "is_parent": true,
            "sha": "e1ad1483e0e82d70fcc32311b7842bc9a77c04aa"
        },
        {
            "associated_pull_request": [],
            "date": "2020-04-06 07:06:44",
            "diff": "gluster_glusterfs/issue_1146/commit_55914f968d907ed747774da15285b42653afda61.diff",
            "diff_additions": 18,
            "diff_deletions": 0,
            "diff_file_size": 74820,
            "diff_url": "https://github.com/gluster/glusterfs/commit/55914f968d907ed747774da15285b42653afda61.diff",
            "exists": true,
            "files": [
                {
                    "file_additions": 9,
                    "file_deletions": 0,
                    "file_exists": true,
                    "file_name": "api/src/glfs-resolve.c",
                    "file_size": 31594
                },
                {
                    "file_additions": 9,
                    "file_deletions": 0,
                    "file_exists": true,
                    "file_name": "api/src/glfs.c",
                    "file_size": 43226
                }
            ],
            "interesting": {
                "reopen": true,
                "status": false
            },
            "is_parent": false,
            "sha": "55914f968d907ed747774da15285b42653afda61"
        },
        {
            "associated_pull_request": [],
            "date": "2020-04-06 07:06:44",
            "diff": "gluster_glusterfs/issue_1146/commit_7f4b42e7ae9c75fe405b7682299222bbd88f524f.diff",
            "diff_additions": 18,
            "diff_deletions": 0,
            "diff_file_size": 74820,
            "diff_url": "https://github.com/gluster/glusterfs/commit/7f4b42e7ae9c75fe405b7682299222bbd88f524f.diff",
            "exists": true,
            "files": [
                {
                    "file_additions": 9,
                    "file_deletions": 0,
                    "file_exists": true,
                    "file_name": "api/src/glfs-resolve.c",
                    "file_size": 31594
                },
                {
                    "file_additions": 9,
                    "file_deletions": 0,
                    "file_exists": true,
                    "file_name": "api/src/glfs.c",
                    "file_size": 43226
                }
            ],
            "interesting": {
                "reopen": false,
                "status": false
            },
            "is_parent": false,
            "sha": "7f4b42e7ae9c75fe405b7682299222bbd88f524f"
        },
        {
            "associated_pull_request": [],
            "date": "2020-04-06 07:06:44",
            "diff": "gluster_glusterfs/issue_1146/commit_d48de09adaffdf6b75f30d78f8a1cd287e6fa8ae.diff",
            "diff_additions": 18,
            "diff_deletions": 0,
            "diff_file_size": 74820,
            "diff_url": "https://github.com/gluster/glusterfs/commit/d48de09adaffdf6b75f30d78f8a1cd287e6fa8ae.diff",
            "exists": true,
            "files": [
                {
                    "file_additions": 9,
                    "file_deletions": 0,
                    "file_exists": true,
                    "file_name": "api/src/glfs-resolve.c",
                    "file_size": 31594
                },
                {
                    "file_additions": 9,
                    "file_deletions": 0,
                    "file_exists": true,
                    "file_name": "api/src/glfs.c",
                    "file_size": 43226
                }
            ],
            "interesting": {
                "reopen": false,
                "status": false
            },
            "is_parent": false,
            "sha": "d48de09adaffdf6b75f30d78f8a1cd287e6fa8ae"
        }
    ],
    "first_commit": "2020-04-07 04:26:33",
    "last_commit": "2020-05-09 12:01:07",
    "number": 1146,
    "pull_request": "None",
    "score": {
        "accidental_reopen_likely": false,
        "all_labels": [
            "DocApproved",
            "SpecApproved",
            "release-6",
            "wontfix"
        ],
        "contains_keywords": [
            "fail",
            "chang",
            "test",
            "fix",
            "patch",
            "remov",
            "issu"
        ],
        "fix_size": 35,
        "has_labels": [],
        "intersecting": {
            "computed_score": 0.8,
            "final_commit_size": 20,
            "intersection_size": 16,
            "previous_commits_size": 31
        },
        "is_makefile_based": true,
        "no_new_files": [],
        "no_other_files": false,
        "num_prohibited_files": 72354,
        "prohibited_files": [
            "hal/inc/pinmap_hal.h",
            "Debug/marvin.bin",
            "Debug/marvin.elf",
            "Debug/marvin.hex",
            "Debug/marvin.bin",
            "Debug/marvin.elf",
            "Debug/marvin.hex",
            "inc/spark_utilities.h",
            "Debug/marvin.bin",
            "Debug/marvin.elf"
        ],
        "reopen": true,
        "reopen_events": [
            [
                "2020-04-07 11:49:03",
                "closed"
            ],
            [
                "2020-04-07 11:49:03",
                "commit"
            ],
            [
                "2020-04-16 06:43:20",
                "reopened"
            ],
            [
                "2020-04-20 07:34:41",
                "commit"
            ],
            [
                "2020-05-09 12:01:28",
                "commit"
            ],
            [
                "2020-12-01 12:07:48",
                "closed"
            ]
        ],
        "status": false,
        "strategy": true,
        "total_changes": 81
    }
}