{
    "commits": [
        {
            "associated_pull_request": [
                "https://github.com/stlink-org/stlink/pull/664"
            ],
            "date": "2018-02-06 13:45:57+00:00",
            "diff": "",
            "diff_additions": 0,
            "diff_deletions": 0,
            "diff_file_size": 0,
            "diff_url": "https://github.com/stlink-org/stlink/commit/fbd55d9f1b00b84512d1144dfbbe507a3e5e10c0.diff",
            "exists": true,
            "files": [],
            "interesting": {
                "reopen": false,
                "status": false
            },
            "is_parent": true,
            "sha": "fbd55d9f1b00b84512d1144dfbbe507a3e5e10c0"
        },
        {
            "associated_pull_request": [
                "https://github.com/stlink-org/stlink/pull/667"
            ],
            "date": "2018-02-15 18:18:05+00:00",
            "diff": "stlink-org_stlink/issue_666/commit_247b7eb9ba7a96275425469c1d433868cb6d45d5.diff",
            "diff_additions": 4,
            "diff_deletions": 1,
            "diff_file_size": 0,
            "diff_url": "https://github.com/stlink-org/stlink/commit/247b7eb9ba7a96275425469c1d433868cb6d45d5.diff",
            "exists": true,
            "files": [
                {
                    "file_additions": 4,
                    "file_deletions": 1,
                    "file_exists": false,
                    "file_name": "src/tools/gui/stlink-gui.c",
                    "file_size": 0
                }
            ],
            "interesting": {
                "reopen": true,
                "status": false
            },
            "is_parent": false,
            "sha": "247b7eb9ba7a96275425469c1d433868cb6d45d5"
        },
        {
            "associated_pull_request": [
                "https://github.com/stlink-org/stlink/pull/668"
            ],
            "date": "2018-02-16 12:01:08+00:00",
            "diff": "stlink-org_stlink/issue_666/commit_d9a114a6411345d5e27d3458b1ec7f970dab162b.diff",
            "diff_additions": 20,
            "diff_deletions": 10,
            "diff_file_size": 0,
            "diff_url": "https://github.com/stlink-org/stlink/commit/d9a114a6411345d5e27d3458b1ec7f970dab162b.diff",
            "exists": true,
            "files": [
                {
                    "file_additions": 20,
                    "file_deletions": 10,
                    "file_exists": false,
                    "file_name": "src/tools/gui/stlink-gui.c",
                    "file_size": 0
                }
            ],
            "interesting": {
                "reopen": true,
                "status": false
            },
            "is_parent": false,
            "sha": "d9a114a6411345d5e27d3458b1ec7f970dab162b"
        }
    ],
    "first_commit": "2018-02-06 13:45:57+00:00",
    "last_commit": "2018-02-16 12:01:08+00:00",
    "number": 666,
    "pull_request": "None",
    "score": {
        "accidental_reopen_likely": true,
        "all_labels": [
            "os/linux",
            "component/stlink-gui",
            "bug/compilation",
            "status/resolved",
            "bug/fixed",
            "error/compilation"
        ],
        "contains_keywords": [
            "work",
            "fail",
            "fix",
            "issu",
            "patch",
            "reason",
            "test",
            "warn",
            "error",
            "problem"
        ],
        "fix_size": 30,
        "has_labels": [],
        "intersecting": {
            "computed_score": 0.13793103448275862,
            "final_commit_size": 29,
            "intersection_size": 4,
            "previous_commits_size": 5
        },
        "is_makefile_based": true,
        "no_new_files": [],
        "no_other_files": true,
        "num_prohibited_files": 98019,
        "prohibited_files": [
            "server/src/main/java/com/genymobile/scrcpy/Device.java",
            "server/src/main/java/com/genymobile/scrcpy/wrappers/SurfaceControl.java",
            "server/src/main/java/com/genymobile/scrcpy/Device.java",
            "server/src/main/java/com/genymobile/scrcpy/wrappers/SurfaceControl.java",
            "app/meson.build",
            "app/scrcpy.1",
            "app/src/common.h",
            "app/src/scrcpy.h",
            "app/src/server.h",
            "server/src/main/java/com/genymobile/scrcpy/Workarounds.java"
        ],
        "reopen": true,
        "reopen_events": [
            [
                "2018-02-15 10:35:16+00:00",
                "commit"
            ],
            [
                "2018-02-15 18:18:07+00:00",
                "closed"
            ],
            [
                "2018-02-15 18:18:07+00:00",
                "commit"
            ],
            [
                "2018-02-15 18:18:23+00:00",
                "reopened"
            ],
            [
                "2018-02-16 12:01:10+00:00",
                "closed"
            ],
            [
                "2018-02-16 12:01:10+00:00",
                "commit"
            ],
            [
                "2020-03-18 13:07:09+00:00",
                "reopened"
            ],
            [
                "2020-03-18 13:07:48+00:00",
                "closed"
            ]
        ],
        "status": false,
        "strategy": true,
        "total_changes": 35
    }
}