{
    "category": [
        "wrong API usage",
        "feature request"
    ],
    "commits": [
        {
            "associated_pull_request": [],
            "date": "2020-10-22 12:37:47",
            "diff": "erthink_libmdbx/issue_123/commit_8a7caec54ad3895d454ade0a390f1cf90b66a127.diff",
            "diff_additions": 8,
            "diff_deletions": 41,
            "diff_file_size": 853827,
            "diff_url": "https://github.com/erthink/libmdbx/commit/8a7caec54ad3895d454ade0a390f1cf90b66a127.diff",
            "exists": true,
            "files": [
                {
                    "file_additions": 8,
                    "file_deletions": 41,
                    "file_exists": true,
                    "file_name": "src/core.c",
                    "file_size": 853827
                }
            ],
            "interesting": {
                "reopen": false,
                "status": false
            },
            "is_parent": true,
            "sha": "8a7caec54ad3895d454ade0a390f1cf90b66a127"
        },
        {
            "associated_pull_request": [],
            "date": "2020-10-22 14:49:13",
            "diff": "erthink_libmdbx/issue_123/commit_55d190bad9723fd9766466005b1a14e70779fc89.diff",
            "diff_additions": 20,
            "diff_deletions": 6,
            "diff_file_size": 853827,
            "diff_url": "https://github.com/erthink/libmdbx/commit/55d190bad9723fd9766466005b1a14e70779fc89.diff",
            "exists": true,
            "files": [
                {
                    "file_additions": 20,
                    "file_deletions": 6,
                    "file_exists": true,
                    "file_name": "src/core.c",
                    "file_size": 853827
                }
            ],
            "interesting": {
                "reopen": true,
                "status": false
            },
            "is_parent": false,
            "sha": "55d190bad9723fd9766466005b1a14e70779fc89"
        },
        {
            "associated_pull_request": [],
            "date": "2020-10-30 16:22:37",
            "diff": "erthink_libmdbx/issue_123/commit_70241e25db0efd7d42a8fb8af2ab552b59e92cc1.diff",
            "diff_additions": 5,
            "diff_deletions": 2,
            "diff_file_size": 853827,
            "diff_url": "https://github.com/erthink/libmdbx/commit/70241e25db0efd7d42a8fb8af2ab552b59e92cc1.diff",
            "exists": true,
            "files": [
                {
                    "file_additions": 5,
                    "file_deletions": 2,
                    "file_exists": true,
                    "file_name": "src/core.c",
                    "file_size": 853827
                }
            ],
            "interesting": {
                "reopen": false,
                "status": false
            },
            "is_parent": false,
            "sha": "70241e25db0efd7d42a8fb8af2ab552b59e92cc1"
        },
        {
            "associated_pull_request": [],
            "date": "2020-12-02 12:18:54",
            "diff": "erthink_libmdbx/issue_123/commit_c5061f928930c1f650e2611d8992694135d9e017.diff",
            "diff_additions": 70,
            "diff_deletions": 36,
            "diff_file_size": 853827,
            "diff_url": "https://github.com/erthink/libmdbx/commit/c5061f928930c1f650e2611d8992694135d9e017.diff",
            "exists": true,
            "files": [
                {
                    "file_additions": 70,
                    "file_deletions": 36,
                    "file_exists": true,
                    "file_name": "src/core.c",
                    "file_size": 853827
                }
            ],
            "interesting": {
                "reopen": false,
                "status": false
            },
            "is_parent": false,
            "sha": "c5061f928930c1f650e2611d8992694135d9e017"
        },
        {
            "associated_pull_request": [],
            "date": "2021-01-25 19:21:13",
            "diff": "erthink_libmdbx/issue_123/commit_5f1b6847195c8e2587c891537e82a72db9937800.diff",
            "diff_additions": 46,
            "diff_deletions": 5,
            "diff_file_size": 853827,
            "diff_url": "https://github.com/erthink/libmdbx/commit/5f1b6847195c8e2587c891537e82a72db9937800.diff",
            "exists": true,
            "files": [
                {
                    "file_additions": 46,
                    "file_deletions": 5,
                    "file_exists": true,
                    "file_name": "src/core.c",
                    "file_size": 853827
                }
            ],
            "interesting": {
                "reopen": false,
                "status": false
            },
            "is_parent": false,
            "sha": "5f1b6847195c8e2587c891537e82a72db9937800"
        },
        {
            "associated_pull_request": [],
            "date": "2021-01-26 07:28:39",
            "diff": "erthink_libmdbx/issue_123/commit_943bb552a25f7f7c6cc16db5774bd170ff001a13.diff",
            "diff_additions": 3,
            "diff_deletions": 1,
            "diff_file_size": 853827,
            "diff_url": "https://github.com/erthink/libmdbx/commit/943bb552a25f7f7c6cc16db5774bd170ff001a13.diff",
            "exists": true,
            "files": [
                {
                    "file_additions": 3,
                    "file_deletions": 1,
                    "file_exists": true,
                    "file_name": "src/core.c",
                    "file_size": 853827
                }
            ],
            "interesting": {
                "reopen": false,
                "status": false
            },
            "is_parent": false,
            "sha": "943bb552a25f7f7c6cc16db5774bd170ff001a13"
        }
    ],
    "first_commit": "2020-10-22 13:28:44",
    "last_commit": "2021-02-02 19:18:21",
    "number": 123,
    "pull_request": "None",
    "score": {
        "accidental_reopen_likely": false,
        "all_labels": [
            "enhancement"
        ],
        "contains_keywords": [
            "leak",
            "workaround",
            "patch",
            "fault",
            "issu",
            "warn",
            "problem",
            "attempt",
            "chang",
            "work",
            "debug",
            "error",
            "fix",
            "reason",
            "report",
            "test",
            "bug"
        ],
        "fix_size": 177,
        "has_labels": [],
        "intersecting": {
            "computed_score": 0.25,
            "final_commit_size": 4,
            "intersection_size": 1,
            "previous_commits_size": 174
        },
        "is_makefile_based": true,
        "no_new_files": [],
        "no_other_files": false,
        "num_prohibited_files": 68712,
        "prohibited_files": [
            "tools/building.py",
            "tools/building.py",
            "tools/building.py",
            "emcc.py",
            "src/library_emmalloc.js",
            "src/shell.js",
            "tests/test_core.py",
            "src/shell.js",
            "tests/test_core.py",
            "src/library.js"
        ],
        "reopen": true,
        "reopen_events": [
            [
                "2020-10-22 15:10:42",
                "commit"
            ],
            [
                "2020-10-23 00:18:58",
                "closed"
            ],
            [
                "2020-10-23 00:26:48",
                "reopened"
            ],
            [
                "2020-10-30 17:41:00",
                "commit"
            ],
            [
                "2020-11-27 08:42:22",
                "commit"
            ],
            [
                "2020-12-03 15:42:31",
                "commit"
            ],
            [
                "2021-01-25 20:24:58",
                "commit"
            ],
            [
                "2021-01-25 23:58:01",
                "closed"
            ],
            [
                "2021-01-26 07:30:36",
                "commit"
            ],
            [
                "2021-02-02 19:24:46",
                "commit"
            ]
        ],
        "status": false,
        "strategy": true,
        "total_changes": 243
    }
}