{
    "commits": [
        {
            "associated_pull_request": [],
            "date": "2023-04-04 19:50:50+00:00",
            "diff": "",
            "diff_additions": 0,
            "diff_deletions": 0,
            "diff_file_size": 0,
            "diff_url": "https://github.com/php/php-src/commit/c796ce5713f21a3de77e710f4028c62f45bc0fff.diff",
            "exists": true,
            "files": [],
            "interesting": {
                "reopen": false,
                "status": false
            },
            "is_parent": true,
            "sha": "c796ce5713f21a3de77e710f4028c62f45bc0fff"
        },
        {
            "associated_pull_request": [],
            "date": "2023-04-05 19:19:21+00:00",
            "diff": "php_php-src/issue_11016/commit_b6dd6fd9703982a6a5943c67f4ae98c4f1905a0a.diff",
            "diff_additions": 23,
            "diff_deletions": 0,
            "diff_file_size": 33500,
            "diff_url": "https://github.com/php/php-src/commit/b6dd6fd9703982a6a5943c67f4ae98c4f1905a0a.diff",
            "exists": true,
            "files": [
                {
                    "file_additions": 23,
                    "file_deletions": 0,
                    "file_exists": true,
                    "file_name": "ext/zend_test/test.c",
                    "file_size": 33500
                }
            ],
            "interesting": {
                "reopen": false,
                "status": false
            },
            "is_parent": false,
            "sha": "b6dd6fd9703982a6a5943c67f4ae98c4f1905a0a"
        },
        {
            "associated_pull_request": [
                "https://github.com/php/php-src/pull/11022"
            ],
            "date": "2023-04-06 17:38:02+00:00",
            "diff": "php_php-src/issue_11016/commit_9b6ab08657aeef4a2c66b308011d9a898b606992.diff",
            "diff_additions": 23,
            "diff_deletions": 0,
            "diff_file_size": 33500,
            "diff_url": "https://github.com/php/php-src/commit/9b6ab08657aeef4a2c66b308011d9a898b606992.diff",
            "exists": true,
            "files": [
                {
                    "file_additions": 23,
                    "file_deletions": 0,
                    "file_exists": true,
                    "file_name": "ext/zend_test/test.c",
                    "file_size": 33500
                }
            ],
            "interesting": {
                "reopen": false,
                "status": false
            },
            "is_parent": false,
            "sha": "9b6ab08657aeef4a2c66b308011d9a898b606992"
        },
        {
            "associated_pull_request": [
                "https://github.com/php/php-src/pull/11022"
            ],
            "date": "2023-04-06 19:54:59+00:00",
            "diff": "php_php-src/issue_11016/commit_2ef1930ad35ea989f8eea7b8f398bd6c02c2364a.diff",
            "diff_additions": 23,
            "diff_deletions": 0,
            "diff_file_size": 33500,
            "diff_url": "https://github.com/php/php-src/commit/2ef1930ad35ea989f8eea7b8f398bd6c02c2364a.diff",
            "exists": true,
            "files": [
                {
                    "file_additions": 23,
                    "file_deletions": 0,
                    "file_exists": true,
                    "file_name": "ext/zend_test/test.c",
                    "file_size": 33500
                }
            ],
            "interesting": {
                "reopen": false,
                "status": true
            },
            "is_parent": false,
            "sha": "2ef1930ad35ea989f8eea7b8f398bd6c02c2364a"
        }
    ],
    "first_commit": "2023-04-04 19:51:26+00:00",
    "last_commit": "2023-04-06 19:55:11+00:00",
    "number": 11016,
    "pull_request": "None",
    "score": {
        "accidental_reopen_likely": false,
        "all_labels": [
            "Bug",
            "Category: Engine",
            "Status: Verified"
        ],
        "contains_keywords": [
            "confirm",
            "fix",
            "reason",
            "test",
            "remov",
            "problem"
        ],
        "fix_size": 47,
        "has_labels": [],
        "intersecting": {
            "computed_score": 1.0,
            "final_commit_size": 24,
            "intersection_size": 24,
            "previous_commits_size": 47
        },
        "is_makefile_based": false,
        "no_new_files": [],
        "no_other_files": false,
        "num_prohibited_files": 1743,
        "prohibited_files": [
            "server/src/main/java/com/genymobile/scrcpy/Device.java",
            "server/src/main/java/com/genymobile/scrcpy/wrappers/SurfaceControl.java",
            "server/src/main/java/com/genymobile/scrcpy/Device.java",
            "server/src/main/java/com/genymobile/scrcpy/wrappers/SurfaceControl.java",
            "app/meson.build",
            "app/scrcpy.1",
            "app/src/common.h",
            "app/src/scrcpy.h",
            "app/src/server.h",
            "server/src/main/java/com/genymobile/scrcpy/Workarounds.java"
        ],
        "reopen": false,
        "reopen_events": [
            [
                "2023-04-05 18:31:57+00:00",
                "commit"
            ],
            [
                "2023-04-05 18:33:22+00:00",
                "commit"
            ],
            [
                "2023-04-05 18:37:37+00:00",
                "commit"
            ],
            [
                "2023-04-05 19:25:46+00:00",
                "commit"
            ],
            [
                "2023-04-06 17:41:54+00:00",
                "commit"
            ],
            [
                "2023-04-06 19:55:02+00:00",
                "commit"
            ],
            [
                "2023-04-06 19:55:13+00:00",
                "closed"
            ],
            [
                "2023-04-06 19:55:14+00:00",
                "commit"
            ]
        ],
        "status": true,
        "strategy": true,
        "total_changes": 69
    }
}