{
    "covered_issues": [
        313,
        302,
        299,
        298,
        295,
        293,
        292,
        290,
        289,
        286,
        284,
        283,
        281,
        280,
        277,
        275,
        273,
        269,
        267,
        266,
        264,
        258,
        257,
        255,
        253,
        252,
        251,
        250,
        249,
        244,
        242,
        241,
        239,
        238,
        234,
        230,
        225,
        224,
        222,
        220,
        212,
        211,
        209,
        207,
        206,
        198,
        196,
        194,
        193,
        192,
        191,
        188,
        186,
        185,
        184,
        182,
        176,
        175,
        173,
        172,
        170,
        169,
        168,
        166,
        165,
        164,
        163,
        162,
        161,
        159,
        157,
        156,
        154,
        153,
        152,
        151,
        150,
        147,
        145,
        142,
        141,
        140,
        139,
        137,
        136,
        135,
        133,
        132,
        131,
        130,
        129,
        128,
        127,
        126,
        125,
        124,
        122,
        121,
        120,
        119,
        116,
        115,
        114,
        111,
        110,
        109,
        107,
        103,
        102,
        101,
        98,
        97,
        96,
        95,
        94,
        93,
        92,
        91,
        89,
        88,
        87,
        86,
        85,
        80,
        79,
        78,
        76,
        75,
        74,
        73,
        72,
        71,
        70,
        68,
        63,
        62,
        61,
        59,
        58,
        57,
        56,
        52,
        51,
        50,
        49,
        48,
        46,
        44,
        43,
        41,
        40,
        39,
        37,
        35,
        33,
        32,
        31,
        30,
        29,
        27,
        26,
        25,
        24,
        23,
        22,
        21,
        20,
        19,
        18,
        17,
        16,
        15,
        13,
        11,
        10,
        8,
        7,
        5,
        4,
        2,
        1
    ],
    "finished": true
}