{
    "covered_issues": [
        621,
        617,
        608,
        607,
        605,
        604,
        597,
        596,
        595,
        594,
        593,
        589,
        588,
        587,
        586,
        576,
        573,
        572,
        570,
        569,
        566,
        563,
        562,
        561,
        551,
        549,
        547,
        546,
        545,
        544,
        541,
        540,
        539,
        537,
        535,
        532,
        530,
        526,
        525,
        520,
        512,
        511,
        510,
        508,
        507,
        496,
        495,
        494,
        492,
        491,
        489,
        475,
        465,
        464,
        460,
        459,
        456,
        448,
        439,
        430,
        429,
        427,
        419,
        417,
        412,
        410,
        408,
        406,
        405,
        404,
        401,
        399,
        398,
        395,
        389,
        388,
        381,
        379,
        377,
        375,
        372,
        371,
        370,
        368,
        365,
        362,
        361,
        343,
        340,
        335,
        334,
        333,
        325,
        323,
        322,
        321,
        316,
        313,
        310,
        308,
        306,
        303,
        301,
        300,
        299,
        298,
        297,
        296,
        295,
        294,
        292,
        290,
        289,
        288,
        282,
        277,
        273,
        271,
        268,
        263,
        260,
        257,
        256,
        254,
        250,
        224,
        221,
        220,
        210,
        205,
        204,
        203,
        202,
        200,
        199,
        198,
        197,
        196,
        194,
        192,
        191,
        190,
        167,
        164,
        161,
        159,
        158,
        157,
        154,
        153,
        145,
        142,
        140,
        116,
        115,
        114,
        111,
        93,
        90,
        18,
        10,
        6,
        5,
        3
    ],
    "finished": true
}