{
    "all_issues": 347,
    "interesting_issues": 2,
    "last_update": "2023-11-01 03:13:26.635088",
    "license": {
        "download": "https://raw.githubusercontent.com/cgdb/cgdb/master/COPYING",
        "name": "GNU General Public License v2.0"
    },
    "ratio": 0.005763688760806916,
    "size": 8225,
    "stars": 1661,
    "url": "https://github.com/cgdb/cgdb"
}