{
    "category": [
        "memory"
    ],
    "commits": [
        {
            "associated_pull_request": [
                "https://github.com/jerryscript-project/iotjs/pull/945"
            ],
            "date": "2017-06-15 05:04:45",
            "diff": "jerryscript-project_iotjs/issue_816/commit_7a7e8450f204fa6861bca2b3861ba24a4ff8b46a.diff",
            "diff_additions": 19,
            "diff_deletions": 10,
            "diff_file_size": 0,
            "diff_url": "https://github.com/jerryscript-project/iotjs/commit/7a7e8450f204fa6861bca2b3861ba24a4ff8b46a.diff",
            "exists": true,
            "files": [
                {
                    "file_additions": 19,
                    "file_deletions": 10,
                    "file_exists": false,
                    "file_name": "src/platform/nuttx/iotjs_module_stm32f4dis-nuttx.c",
                    "file_size": 0
                }
            ],
            "interesting": {
                "reopen": false,
                "status": false
            },
            "is_parent": true,
            "sha": "7a7e8450f204fa6861bca2b3861ba24a4ff8b46a"
        },
        {
            "associated_pull_request": [
                "https://github.com/jerryscript-project/iotjs/pull/911"
            ],
            "date": "2017-06-15 10:08:24",
            "diff": "jerryscript-project_iotjs/issue_816/commit_75829d8bf666803bb971e8372882652fc490a6ad.diff",
            "diff_additions": 36,
            "diff_deletions": 39,
            "diff_file_size": 31237,
            "diff_url": "https://github.com/jerryscript-project/iotjs/commit/75829d8bf666803bb971e8372882652fc490a6ad.diff",
            "exists": true,
            "files": [
                {
                    "file_additions": 25,
                    "file_deletions": 0,
                    "file_exists": true,
                    "file_name": "src/iotjs_binding.c",
                    "file_size": 10496
                },
                {
                    "file_additions": 11,
                    "file_deletions": 39,
                    "file_exists": true,
                    "file_name": "src/modules/iotjs_module_buffer.c",
                    "file_size": 20741
                }
            ],
            "interesting": {
                "reopen": false,
                "status": false
            },
            "is_parent": false,
            "sha": "75829d8bf666803bb971e8372882652fc490a6ad"
        },
        {
            "associated_pull_request": [
                "https://github.com/jerryscript-project/iotjs/pull/975"
            ],
            "date": "2017-06-21 10:31:28",
            "diff": "jerryscript-project_iotjs/issue_816/commit_d21e47c2f2ab07ff74942072483bf027b071a389.diff",
            "diff_additions": 9,
            "diff_deletions": 29,
            "diff_file_size": 0,
            "diff_url": "https://github.com/jerryscript-project/iotjs/commit/d21e47c2f2ab07ff74942072483bf027b071a389.diff",
            "exists": true,
            "files": [
                {
                    "file_additions": 9,
                    "file_deletions": 29,
                    "file_exists": false,
                    "file_name": "src/modules/iotjs_module_httpparser.c",
                    "file_size": 0
                }
            ],
            "interesting": {
                "reopen": false,
                "status": false
            },
            "is_parent": false,
            "sha": "d21e47c2f2ab07ff74942072483bf027b071a389"
        },
        {
            "associated_pull_request": [
                "https://github.com/jerryscript-project/iotjs/pull/978"
            ],
            "date": "2017-06-21 10:58:37",
            "diff": "jerryscript-project_iotjs/issue_816/commit_5cee48fd7c317ac2190b4ee81eb7e12b6982a32c.diff",
            "diff_additions": 10,
            "diff_deletions": 47,
            "diff_file_size": 6063,
            "diff_url": "https://github.com/jerryscript-project/iotjs/commit/5cee48fd7c317ac2190b4ee81eb7e12b6982a32c.diff",
            "exists": true,
            "files": [
                {
                    "file_additions": 10,
                    "file_deletions": 47,
                    "file_exists": true,
                    "file_name": "src/modules/iotjs_module_blehcisocket.c",
                    "file_size": 6063
                }
            ],
            "interesting": {
                "reopen": false,
                "status": false
            },
            "is_parent": false,
            "sha": "5cee48fd7c317ac2190b4ee81eb7e12b6982a32c"
        },
        {
            "associated_pull_request": [],
            "date": "2017-06-21 13:35:45",
            "diff": "jerryscript-project_iotjs/issue_816/commit_0ec910d72dc78a7b3c7f406ff4d921df6f5e2f73.diff",
            "diff_additions": 8,
            "diff_deletions": 11,
            "diff_file_size": 6385,
            "diff_url": "https://github.com/jerryscript-project/iotjs/commit/0ec910d72dc78a7b3c7f406ff4d921df6f5e2f73.diff",
            "exists": true,
            "files": [
                {
                    "file_additions": 8,
                    "file_deletions": 11,
                    "file_exists": true,
                    "file_name": "src/modules/iotjs_module_i2c.c",
                    "file_size": 6385
                }
            ],
            "interesting": {
                "reopen": false,
                "status": true
            },
            "is_parent": false,
            "sha": "0ec910d72dc78a7b3c7f406ff4d921df6f5e2f73"
        },
        {
            "associated_pull_request": [
                "https://github.com/jerryscript-project/iotjs/pull/983"
            ],
            "date": "2017-06-21 13:35:45",
            "diff": "jerryscript-project_iotjs/issue_816/commit_804ad803ac3eefcaca53306047f496c88f96adf5.diff",
            "diff_additions": 9,
            "diff_deletions": 11,
            "diff_file_size": 6385,
            "diff_url": "https://github.com/jerryscript-project/iotjs/commit/804ad803ac3eefcaca53306047f496c88f96adf5.diff",
            "exists": true,
            "files": [
                {
                    "file_additions": 9,
                    "file_deletions": 11,
                    "file_exists": true,
                    "file_name": "src/modules/iotjs_module_i2c.c",
                    "file_size": 6385
                }
            ],
            "interesting": {
                "reopen": false,
                "status": false
            },
            "is_parent": false,
            "sha": "804ad803ac3eefcaca53306047f496c88f96adf5"
        },
        {
            "associated_pull_request": [
                "https://github.com/jerryscript-project/iotjs/pull/975"
            ],
            "date": "2017-06-21 14:11:32",
            "diff": "jerryscript-project_iotjs/issue_816/commit_37db06d1f0f7a94c51365de479259378cbdaeb91.diff",
            "diff_additions": 9,
            "diff_deletions": 29,
            "diff_file_size": 0,
            "diff_url": "https://github.com/jerryscript-project/iotjs/commit/37db06d1f0f7a94c51365de479259378cbdaeb91.diff",
            "exists": true,
            "files": [
                {
                    "file_additions": 9,
                    "file_deletions": 29,
                    "file_exists": false,
                    "file_name": "src/modules/iotjs_module_httpparser.c",
                    "file_size": 0
                }
            ],
            "interesting": {
                "reopen": false,
                "status": false
            },
            "is_parent": false,
            "sha": "37db06d1f0f7a94c51365de479259378cbdaeb91"
        },
        {
            "associated_pull_request": [
                "https://github.com/jerryscript-project/iotjs/pull/978"
            ],
            "date": "2017-06-23 06:52:46",
            "diff": "jerryscript-project_iotjs/issue_816/commit_71e31c5d01bbff91032dae585eaa5a3bf7918467.diff",
            "diff_additions": 10,
            "diff_deletions": 47,
            "diff_file_size": 6063,
            "diff_url": "https://github.com/jerryscript-project/iotjs/commit/71e31c5d01bbff91032dae585eaa5a3bf7918467.diff",
            "exists": true,
            "files": [
                {
                    "file_additions": 10,
                    "file_deletions": 47,
                    "file_exists": true,
                    "file_name": "src/modules/iotjs_module_blehcisocket.c",
                    "file_size": 6063
                }
            ],
            "interesting": {
                "reopen": false,
                "status": false
            },
            "is_parent": false,
            "sha": "71e31c5d01bbff91032dae585eaa5a3bf7918467"
        },
        {
            "associated_pull_request": [
                "https://github.com/jerryscript-project/iotjs/pull/983"
            ],
            "date": "2017-06-23 06:53:08",
            "diff": "jerryscript-project_iotjs/issue_816/commit_8943ad0ed4524af82488d6082431eed0a4fba27e.diff",
            "diff_additions": 9,
            "diff_deletions": 11,
            "diff_file_size": 6385,
            "diff_url": "https://github.com/jerryscript-project/iotjs/commit/8943ad0ed4524af82488d6082431eed0a4fba27e.diff",
            "exists": true,
            "files": [
                {
                    "file_additions": 9,
                    "file_deletions": 11,
                    "file_exists": true,
                    "file_name": "src/modules/iotjs_module_i2c.c",
                    "file_size": 6385
                }
            ],
            "interesting": {
                "reopen": false,
                "status": false
            },
            "is_parent": false,
            "sha": "8943ad0ed4524af82488d6082431eed0a4fba27e"
        }
    ],
    "first_commit": "2017-06-15 05:04:45",
    "last_commit": "2017-06-23 06:53:08",
    "number": 816,
    "pull_request": "None",
    "score": {
        "accidental_reopen_likely": false,
        "all_labels": [
            "bug"
        ],
        "contains_keywords": [
            "fix",
            "patch",
            "bug",
            "remov",
            "issu",
            "error",
            "chang",
            "problem"
        ],
        "fix_size": 191,
        "has_labels": [
            "bug"
        ],
        "intersecting": {
            "computed_score": 1.0,
            "final_commit_size": 18,
            "intersection_size": 18,
            "previous_commits_size": 191
        },
        "is_makefile_based": true,
        "no_new_files": [],
        "no_other_files": false,
        "num_prohibited_files": 47292,
        "prohibited_files": [
            "kill.h",
            "meminfo.h",
            "kill.h",
            "meminfo.h",
            "kill.h",
            "meminfo.h",
            "testsuite_cli_test.go",
            "testsuite_cli_test.go",
            "common.mk",
            "i3bar/include/draw_util.h"
        ],
        "reopen": false,
        "reopen_events": [
            [
                "2017-06-15 10:08:26",
                "commit"
            ],
            [
                "2017-06-21 10:32:49",
                "commit"
            ],
            [
                "2017-06-21 10:59:28",
                "commit"
            ],
            [
                "2017-06-21 13:37:09",
                "commit"
            ],
            [
                "2017-06-21 13:52:12",
                "commit"
            ],
            [
                "2017-06-21 14:11:37",
                "commit"
            ],
            [
                "2017-06-23 06:52:47",
                "commit"
            ],
            [
                "2017-06-23 06:53:11",
                "commit"
            ],
            [
                "2017-06-28 12:16:12",
                "closed"
            ]
        ],
        "status": true,
        "strategy": true,
        "total_changes": 353
    }
}