{
    "commits": [
        {
            "associated_pull_request": [],
            "date": "2014-04-15 09:51:54+00:00",
            "diff": "esnet_iperf/issue_125/commit_9ac254da7dc4cc95a3f3aad5eb53bfa881e52ae6.diff",
            "diff_additions": 4,
            "diff_deletions": 1,
            "diff_file_size": 15675,
            "diff_url": "https://github.com/esnet/iperf/commit/9ac254da7dc4cc95a3f3aad5eb53bfa881e52ae6.diff",
            "exists": true,
            "files": [
                {
                    "file_additions": 4,
                    "file_deletions": 1,
                    "file_exists": true,
                    "file_name": "src/net.c",
                    "file_size": 15675
                }
            ],
            "interesting": {
                "reopen": false,
                "status": false
            },
            "is_parent": true,
            "sha": "9ac254da7dc4cc95a3f3aad5eb53bfa881e52ae6"
        },
        {
            "associated_pull_request": [],
            "date": "2014-04-16 23:23:13+00:00",
            "diff": "esnet_iperf/issue_125/commit_081ba8e4e9ddeaa7991728ce12f0a9ee88f00a32.diff",
            "diff_additions": 33,
            "diff_deletions": 92,
            "diff_file_size": 241116,
            "diff_url": "https://github.com/esnet/iperf/commit/081ba8e4e9ddeaa7991728ce12f0a9ee88f00a32.diff",
            "exists": true,
            "files": [
                {
                    "file_additions": 0,
                    "file_deletions": 3,
                    "file_exists": true,
                    "file_name": "examples/mic.c",
                    "file_size": 1542
                },
                {
                    "file_additions": 0,
                    "file_deletions": 13,
                    "file_exists": true,
                    "file_name": "src/iperf_api.c",
                    "file_size": 169127
                },
                {
                    "file_additions": 27,
                    "file_deletions": 69,
                    "file_exists": true,
                    "file_name": "src/iperf_client_api.c",
                    "file_size": 20581
                },
                {
                    "file_additions": 2,
                    "file_deletions": 0,
                    "file_exists": true,
                    "file_name": "src/iperf_server_api.c",
                    "file_size": 28647
                },
                {
                    "file_additions": 0,
                    "file_deletions": 3,
                    "file_exists": true,
                    "file_name": "src/main.c",
                    "file_size": 5544
                },
                {
                    "file_additions": 4,
                    "file_deletions": 4,
                    "file_exists": true,
                    "file_name": "src/net.c",
                    "file_size": 15675
                }
            ],
            "interesting": {
                "reopen": true,
                "status": false
            },
            "is_parent": false,
            "sha": "081ba8e4e9ddeaa7991728ce12f0a9ee88f00a32"
        },
        {
            "associated_pull_request": [],
            "date": "2014-04-23 22:01:27+00:00",
            "diff": "esnet_iperf/issue_125/commit_cbacc1d670afa463f76ca60fbc57e438e4e91298.diff",
            "diff_additions": 16,
            "diff_deletions": 7,
            "diff_file_size": 49228,
            "diff_url": "https://github.com/esnet/iperf/commit/cbacc1d670afa463f76ca60fbc57e438e4e91298.diff",
            "exists": true,
            "files": [
                {
                    "file_additions": 12,
                    "file_deletions": 6,
                    "file_exists": true,
                    "file_name": "src/iperf_client_api.c",
                    "file_size": 20581
                },
                {
                    "file_additions": 4,
                    "file_deletions": 1,
                    "file_exists": true,
                    "file_name": "src/iperf_server_api.c",
                    "file_size": 28647
                }
            ],
            "interesting": {
                "reopen": false,
                "status": false
            },
            "is_parent": false,
            "sha": "cbacc1d670afa463f76ca60fbc57e438e4e91298"
        },
        {
            "associated_pull_request": [],
            "date": "2014-04-25 20:23:13+00:00",
            "diff": "esnet_iperf/issue_125/commit_6b16244baa9d1b58cb3de93a4694643597e9f1b0.diff",
            "diff_additions": 6,
            "diff_deletions": 6,
            "diff_file_size": 49228,
            "diff_url": "https://github.com/esnet/iperf/commit/6b16244baa9d1b58cb3de93a4694643597e9f1b0.diff",
            "exists": true,
            "files": [
                {
                    "file_additions": 4,
                    "file_deletions": 4,
                    "file_exists": true,
                    "file_name": "src/iperf_client_api.c",
                    "file_size": 20581
                },
                {
                    "file_additions": 2,
                    "file_deletions": 2,
                    "file_exists": true,
                    "file_name": "src/iperf_server_api.c",
                    "file_size": 28647
                }
            ],
            "interesting": {
                "reopen": false,
                "status": false
            },
            "is_parent": false,
            "sha": "6b16244baa9d1b58cb3de93a4694643597e9f1b0"
        },
        {
            "associated_pull_request": [],
            "date": "2014-04-23 22:01:27+00:00",
            "diff": "esnet_iperf/issue_125/commit_4ff33cf1b5a98818512acf5c2e520bb4f3938340.diff",
            "diff_additions": 16,
            "diff_deletions": 7,
            "diff_file_size": 49228,
            "diff_url": "https://github.com/esnet/iperf/commit/4ff33cf1b5a98818512acf5c2e520bb4f3938340.diff",
            "exists": true,
            "files": [
                {
                    "file_additions": 12,
                    "file_deletions": 6,
                    "file_exists": true,
                    "file_name": "src/iperf_client_api.c",
                    "file_size": 20581
                },
                {
                    "file_additions": 4,
                    "file_deletions": 1,
                    "file_exists": true,
                    "file_name": "src/iperf_server_api.c",
                    "file_size": 28647
                }
            ],
            "interesting": {
                "reopen": false,
                "status": false
            },
            "is_parent": false,
            "sha": "4ff33cf1b5a98818512acf5c2e520bb4f3938340"
        },
        {
            "associated_pull_request": [],
            "date": "2014-04-25 20:23:13+00:00",
            "diff": "esnet_iperf/issue_125/commit_58492bf910d867bf6d778e89198f7ed256174cf9.diff",
            "diff_additions": 6,
            "diff_deletions": 6,
            "diff_file_size": 49228,
            "diff_url": "https://github.com/esnet/iperf/commit/58492bf910d867bf6d778e89198f7ed256174cf9.diff",
            "exists": true,
            "files": [
                {
                    "file_additions": 4,
                    "file_deletions": 4,
                    "file_exists": true,
                    "file_name": "src/iperf_client_api.c",
                    "file_size": 20581
                },
                {
                    "file_additions": 2,
                    "file_deletions": 2,
                    "file_exists": true,
                    "file_name": "src/iperf_server_api.c",
                    "file_size": 28647
                }
            ],
            "interesting": {
                "reopen": false,
                "status": false
            },
            "is_parent": false,
            "sha": "58492bf910d867bf6d778e89198f7ed256174cf9"
        },
        {
            "associated_pull_request": [],
            "date": "2014-10-13 11:28:58+00:00",
            "diff": "esnet_iperf/issue_125/commit_8694d1db0d0b95ea76ca2bfce79a01e48290bfce.diff",
            "diff_additions": 14,
            "diff_deletions": 3,
            "diff_file_size": 47127,
            "diff_url": "https://github.com/esnet/iperf/commit/8694d1db0d0b95ea76ca2bfce79a01e48290bfce.diff",
            "exists": true,
            "files": [
                {
                    "file_additions": 8,
                    "file_deletions": 2,
                    "file_exists": true,
                    "file_name": "src/iperf_server_api.c",
                    "file_size": 28647
                },
                {
                    "file_additions": 6,
                    "file_deletions": 1,
                    "file_exists": true,
                    "file_name": "src/iperf_udp.c",
                    "file_size": 18480
                }
            ],
            "interesting": {
                "reopen": false,
                "status": false
            },
            "is_parent": false,
            "sha": "8694d1db0d0b95ea76ca2bfce79a01e48290bfce"
        },
        {
            "associated_pull_request": [],
            "date": "2014-10-13 11:28:58+00:00",
            "diff": "esnet_iperf/issue_125/commit_6a35e2b1691f77317f4636f201801c3657628e1c.diff",
            "diff_additions": 14,
            "diff_deletions": 3,
            "diff_file_size": 47127,
            "diff_url": "https://github.com/esnet/iperf/commit/6a35e2b1691f77317f4636f201801c3657628e1c.diff",
            "exists": true,
            "files": [
                {
                    "file_additions": 8,
                    "file_deletions": 2,
                    "file_exists": true,
                    "file_name": "src/iperf_server_api.c",
                    "file_size": 28647
                },
                {
                    "file_additions": 6,
                    "file_deletions": 1,
                    "file_exists": true,
                    "file_name": "src/iperf_udp.c",
                    "file_size": 18480
                }
            ],
            "interesting": {
                "reopen": false,
                "status": false
            },
            "is_parent": false,
            "sha": "6a35e2b1691f77317f4636f201801c3657628e1c"
        },
        {
            "associated_pull_request": [
                "https://github.com/esnet/iperf/pull/588"
            ],
            "date": "2017-05-30 19:39:38+00:00",
            "diff": "esnet_iperf/issue_125/commit_bd972dc4dfcae7cd4614227741db6227cc7ce092.diff",
            "diff_additions": 54,
            "diff_deletions": 9,
            "diff_file_size": 204454,
            "diff_url": "https://github.com/esnet/iperf/commit/bd972dc4dfcae7cd4614227741db6227cc7ce092.diff",
            "exists": true,
            "files": [
                {
                    "file_additions": 48,
                    "file_deletions": 9,
                    "file_exists": true,
                    "file_name": "src/iperf_api.c",
                    "file_size": 169127
                },
                {
                    "file_additions": 3,
                    "file_deletions": 0,
                    "file_exists": true,
                    "file_name": "src/iperf_tcp.c",
                    "file_size": 16847
                },
                {
                    "file_additions": 3,
                    "file_deletions": 0,
                    "file_exists": true,
                    "file_name": "src/iperf_udp.c",
                    "file_size": 18480
                }
            ],
            "interesting": {
                "reopen": false,
                "status": false
            },
            "is_parent": false,
            "sha": "bd972dc4dfcae7cd4614227741db6227cc7ce092"
        },
        {
            "associated_pull_request": [
                "https://github.com/esnet/iperf/pull/588"
            ],
            "date": "2017-05-30 21:15:28+00:00",
            "diff": "esnet_iperf/issue_125/commit_c458a115b7cbe057c8507a3f37702cf70ea10563.diff",
            "diff_additions": 54,
            "diff_deletions": 9,
            "diff_file_size": 204454,
            "diff_url": "https://github.com/esnet/iperf/commit/c458a115b7cbe057c8507a3f37702cf70ea10563.diff",
            "exists": true,
            "files": [
                {
                    "file_additions": 48,
                    "file_deletions": 9,
                    "file_exists": true,
                    "file_name": "src/iperf_api.c",
                    "file_size": 169127
                },
                {
                    "file_additions": 3,
                    "file_deletions": 0,
                    "file_exists": true,
                    "file_name": "src/iperf_tcp.c",
                    "file_size": 16847
                },
                {
                    "file_additions": 3,
                    "file_deletions": 0,
                    "file_exists": true,
                    "file_name": "src/iperf_udp.c",
                    "file_size": 18480
                }
            ],
            "interesting": {
                "reopen": false,
                "status": false
            },
            "is_parent": false,
            "sha": "c458a115b7cbe057c8507a3f37702cf70ea10563"
        }
    ],
    "first_commit": "2014-04-15 09:51:54+00:00",
    "last_commit": "2017-05-30 21:15:28+00:00",
    "number": 125,
    "pull_request": "None",
    "score": {
        "accidental_reopen_likely": false,
        "all_labels": [
            "bug",
            "imported"
        ],
        "contains_keywords": [
            "work",
            "fail",
            "chang",
            "fix",
            "issu",
            "patch",
            "perform",
            "debug",
            "test",
            "attempt",
            "bug",
            "error",
            "problem",
            "report"
        ],
        "fix_size": 200,
        "has_labels": [
            "bug"
        ],
        "intersecting": {
            "computed_score": 1.0,
            "final_commit_size": 64,
            "intersection_size": 64,
            "previous_commits_size": 200
        },
        "is_makefile_based": true,
        "no_new_files": [],
        "no_other_files": false,
        "num_prohibited_files": 216750,
        "prohibited_files": [
            "server/src/main/java/com/genymobile/scrcpy/Device.java",
            "server/src/main/java/com/genymobile/scrcpy/wrappers/SurfaceControl.java",
            "server/src/main/java/com/genymobile/scrcpy/Device.java",
            "server/src/main/java/com/genymobile/scrcpy/wrappers/SurfaceControl.java",
            "app/meson.build",
            "app/scrcpy.1",
            "app/src/common.h",
            "app/src/scrcpy.h",
            "app/src/server.h",
            "server/src/main/java/com/genymobile/scrcpy/Workarounds.java"
        ],
        "reopen": true,
        "reopen_events": [
            [
                "2014-04-16 23:25:28+00:00",
                "commit"
            ],
            [
                "2014-04-17 19:18:35+00:00",
                "closed"
            ],
            [
                "2014-04-21 22:15:15+00:00",
                "reopened"
            ],
            [
                "2014-04-23 22:05:08+00:00",
                "commit"
            ],
            [
                "2014-04-25 20:25:06+00:00",
                "commit"
            ],
            [
                "2014-05-01 20:33:10+00:00",
                "commit"
            ],
            [
                "2014-05-30 21:33:30+00:00",
                "commit"
            ],
            [
                "2014-05-30 21:33:30+00:00",
                "commit"
            ],
            [
                "2014-05-30 21:35:05+00:00",
                "closed"
            ],
            [
                "2014-10-13 18:35:30+00:00",
                "commit"
            ],
            [
                "2014-10-14 20:48:50+00:00",
                "commit"
            ],
            [
                "2017-05-30 19:40:08+00:00",
                "commit"
            ],
            [
                "2017-05-30 21:15:29+00:00",
                "commit"
            ]
        ],
        "status": false,
        "strategy": true,
        "total_changes": 360
    }
}