{
    "commits": [
        {
            "associated_pull_request": [],
            "date": "2018-07-19 00:05:00+00:00",
            "diff": "",
            "diff_additions": 0,
            "diff_deletions": 0,
            "diff_file_size": 0,
            "diff_url": "https://github.com/espressif/esp-idf/commit/a7d00f44ab0b8ec89b3898b81050f2ac51cb7510.diff",
            "exists": true,
            "files": [],
            "interesting": {
                "reopen": false,
                "status": false
            },
            "is_parent": true,
            "sha": "a7d00f44ab0b8ec89b3898b81050f2ac51cb7510"
        },
        {
            "associated_pull_request": [],
            "date": "2018-07-19 05:27:35+00:00",
            "diff": "espressif_esp-idf/issue_1814/commit_f0d74b1c64138d24997df6d30cef25cfc850bab9.diff",
            "diff_additions": 21,
            "diff_deletions": 6,
            "diff_file_size": 44518,
            "diff_url": "https://github.com/espressif/esp-idf/commit/f0d74b1c64138d24997df6d30cef25cfc850bab9.diff",
            "exists": true,
            "files": [
                {
                    "file_additions": 3,
                    "file_deletions": 3,
                    "file_exists": true,
                    "file_name": "components/bootloader/subproject/main/bootloader_start.c",
                    "file_size": 4855
                },
                {
                    "file_additions": 18,
                    "file_deletions": 3,
                    "file_exists": true,
                    "file_name": "components/bootloader_support/src/bootloader_utility.c",
                    "file_size": 39663
                }
            ],
            "interesting": {
                "reopen": false,
                "status": false
            },
            "is_parent": false,
            "sha": "f0d74b1c64138d24997df6d30cef25cfc850bab9"
        },
        {
            "associated_pull_request": [],
            "date": "2018-07-26 09:07:36+00:00",
            "diff": "espressif_esp-idf/issue_1814/commit_9c715d7946a9595bad53307cf0a141d4226d0a5a.diff",
            "diff_additions": 63,
            "diff_deletions": 3,
            "diff_file_size": 21033,
            "diff_url": "https://github.com/espressif/esp-idf/commit/9c715d7946a9595bad53307cf0a141d4226d0a5a.diff",
            "exists": true,
            "files": [
                {
                    "file_additions": 13,
                    "file_deletions": 0,
                    "file_exists": true,
                    "file_name": "components/bootloader_support/src/bootloader_init.c",
                    "file_size": 3828
                },
                {
                    "file_additions": 2,
                    "file_deletions": 0,
                    "file_exists": true,
                    "file_name": "components/bootloader_support/src/flash_encrypt.c",
                    "file_size": 17205
                },
                {
                    "file_additions": 21,
                    "file_deletions": 0,
                    "file_exists": false,
                    "file_name": "components/esp32/clk.c",
                    "file_size": 0
                },
                {
                    "file_additions": 6,
                    "file_deletions": 3,
                    "file_exists": false,
                    "file_name": "components/esp32/cpu_start.c",
                    "file_size": 0
                },
                {
                    "file_additions": 21,
                    "file_deletions": 0,
                    "file_exists": false,
                    "file_name": "components/soc/esp32/rtc_wdt.c",
                    "file_size": 0
                }
            ],
            "interesting": {
                "reopen": true,
                "status": false
            },
            "is_parent": false,
            "sha": "9c715d7946a9595bad53307cf0a141d4226d0a5a"
        }
    ],
    "first_commit": "2018-07-19 00:05:00+00:00",
    "last_commit": "2018-09-03 05:43:01+00:00",
    "number": 1814,
    "pull_request": "None",
    "score": {
        "accidental_reopen_likely": true,
        "all_labels": [],
        "contains_keywords": [
            "confirm",
            "work",
            "fail",
            "chang",
            "fix",
            "issu",
            "patch",
            "test",
            "fault",
            "remov",
            "bug",
            "problem"
        ],
        "fix_size": 97,
        "has_labels": [],
        "intersecting": {
            "computed_score": 0.0,
            "final_commit_size": 71,
            "intersection_size": 0,
            "previous_commits_size": 26
        },
        "is_makefile_based": true,
        "no_new_files": [
            "components/bootloader_support/src/bootloader_init.c",
            "components/bootloader_support/src/flash_encrypt.c",
            "components/esp32/clk.c",
            "components/esp32/cpu_start.c",
            "components/soc/esp32/rtc_wdt.c"
        ],
        "no_other_files": false,
        "num_prohibited_files": 14975,
        "prohibited_files": [
            "server/src/main/java/com/genymobile/scrcpy/Device.java",
            "server/src/main/java/com/genymobile/scrcpy/wrappers/SurfaceControl.java",
            "server/src/main/java/com/genymobile/scrcpy/Device.java",
            "server/src/main/java/com/genymobile/scrcpy/wrappers/SurfaceControl.java",
            "app/meson.build",
            "app/scrcpy.1",
            "app/src/common.h",
            "app/src/scrcpy.h",
            "app/src/server.h",
            "server/src/main/java/com/genymobile/scrcpy/Workarounds.java"
        ],
        "reopen": true,
        "reopen_events": [
            [
                "2018-07-28 05:52:21+00:00",
                "commit"
            ],
            [
                "2018-09-04 07:59:21+00:00",
                "closed"
            ],
            [
                "2018-09-04 07:59:21+00:00",
                "commit"
            ],
            [
                "2018-10-07 22:43:27+00:00",
                "reopened"
            ],
            [
                "2018-10-07 22:43:31+00:00",
                "closed"
            ],
            [
                "2019-06-28 13:16:15+00:00",
                "commit"
            ],
            [
                "2019-06-28 13:16:18+00:00",
                "commit"
            ]
        ],
        "status": false,
        "strategy": true,
        "total_changes": 93
    }
}