{
    "covered_issues": [
        159,
        157,
        155,
        153,
        148,
        138,
        136,
        135,
        134,
        129,
        125,
        124,
        123,
        122,
        119,
        118,
        117,
        116,
        115,
        113,
        112,
        108,
        107,
        106,
        105,
        103,
        101,
        100,
        98,
        97,
        96,
        94,
        92,
        89,
        88,
        87,
        84,
        83,
        82,
        81,
        80,
        78,
        75,
        73,
        72,
        71,
        70,
        69,
        67,
        66,
        65,
        64,
        60,
        55,
        54,
        53,
        51,
        50,
        49,
        47,
        45,
        40,
        37,
        36,
        35,
        34,
        30,
        28,
        27,
        26,
        25,
        24,
        22,
        19,
        17,
        16,
        14,
        12,
        11,
        10,
        9,
        8,
        5,
        3,
        2,
        1
    ],
    "finished": true
}