{
    "category": [
        "network/protocols",
        "network/protocol"
    ],
    "commits": [
        {
            "associated_pull_request": [
                "https://github.com/aws/s2n-tls/pull/747"
            ],
            "date": "2018-03-06 21:59:15",
            "diff": "aws_s2n-tls/issue_746/commit_6aef59c83798313fd5069293e54f190e1febd8c3.diff",
            "diff_additions": 1,
            "diff_deletions": 2,
            "diff_file_size": 11381,
            "diff_url": "https://github.com/aws/s2n-tls/commit/6aef59c83798313fd5069293e54f190e1febd8c3.diff",
            "exists": true,
            "files": [
                {
                    "file_additions": 1,
                    "file_deletions": 2,
                    "file_exists": true,
                    "file_name": "tls/s2n_server_hello.c",
                    "file_size": 11381
                }
            ],
            "interesting": {
                "reopen": false,
                "status": false
            },
            "is_parent": true,
            "sha": "6aef59c83798313fd5069293e54f190e1febd8c3"
        },
        {
            "associated_pull_request": [
                "https://github.com/aws/s2n-tls/pull/747"
            ],
            "date": "2018-03-06 21:33:26",
            "diff": "aws_s2n-tls/issue_746/commit_a5b4f5747e70fc693523be29d94b1d52bbbc8a71.diff",
            "diff_additions": 175,
            "diff_deletions": 2,
            "diff_file_size": 87361,
            "diff_url": "https://github.com/aws/s2n-tls/commit/a5b4f5747e70fc693523be29d94b1d52bbbc8a71.diff",
            "exists": true,
            "files": [
                {
                    "file_additions": 168,
                    "file_deletions": 0,
                    "file_exists": true,
                    "file_name": "tests/unit/s2n_self_talk_session_resumption_test.c",
                    "file_size": 27320
                },
                {
                    "file_additions": 7,
                    "file_deletions": 2,
                    "file_exists": true,
                    "file_name": "tls/s2n_handshake_io.c",
                    "file_size": 60041
                }
            ],
            "interesting": {
                "reopen": false,
                "status": true
            },
            "is_parent": false,
            "sha": "a5b4f5747e70fc693523be29d94b1d52bbbc8a71"
        },
        {
            "associated_pull_request": [
                "https://github.com/aws/s2n-tls/pull/747"
            ],
            "date": "2018-03-06 23:32:23",
            "diff": "aws_s2n-tls/issue_746/commit_0982aed27737d311750efd042627c6d1339535f1.diff",
            "diff_additions": 176,
            "diff_deletions": 10,
            "diff_file_size": 98742,
            "diff_url": "https://github.com/aws/s2n-tls/commit/0982aed27737d311750efd042627c6d1339535f1.diff",
            "exists": true,
            "files": [
                {
                    "file_additions": 168,
                    "file_deletions": 0,
                    "file_exists": true,
                    "file_name": "tests/unit/s2n_self_talk_session_resumption_test.c",
                    "file_size": 27320
                },
                {
                    "file_additions": 7,
                    "file_deletions": 8,
                    "file_exists": true,
                    "file_name": "tls/s2n_handshake_io.c",
                    "file_size": 60041
                },
                {
                    "file_additions": 1,
                    "file_deletions": 2,
                    "file_exists": true,
                    "file_name": "tls/s2n_server_hello.c",
                    "file_size": 11381
                }
            ],
            "interesting": {
                "reopen": false,
                "status": false
            },
            "is_parent": false,
            "sha": "0982aed27737d311750efd042627c6d1339535f1"
        }
    ],
    "first_commit": "2018-03-06 22:00:09",
    "last_commit": "2018-03-06 23:32:23",
    "number": 746,
    "pull_request": "None",
    "score": {
        "accidental_reopen_likely": false,
        "all_labels": [
            "difficulty/beginner",
            "good first issue",
            "priority/high",
            "size/small",
            "type/bug"
        ],
        "contains_keywords": [
            "report",
            "fix",
            "bug",
            "fail"
        ],
        "fix_size": 18,
        "has_labels": [],
        "intersecting": {
            "computed_score": 0.35714285714285715,
            "final_commit_size": 14,
            "intersection_size": 5,
            "previous_commits_size": 9
        },
        "is_makefile_based": true,
        "no_new_files": [
            "tls/s2n_server_hello.c"
        ],
        "no_other_files": true,
        "num_prohibited_files": 24906,
        "prohibited_files": [
            "kill.h",
            "meminfo.h",
            "kill.h",
            "meminfo.h",
            "kill.h",
            "meminfo.h",
            "testsuite_cli_test.go",
            "testsuite_cli_test.go",
            "common.mk",
            "i3bar/include/draw_util.h"
        ],
        "reopen": false,
        "reopen_events": [
            [
                "2018-03-06 22:02:03",
                "commit"
            ],
            [
                "2018-03-06 23:32:24",
                "closed"
            ],
            [
                "2018-03-06 23:32:25",
                "commit"
            ]
        ],
        "status": true,
        "strategy": true,
        "total_changes": 366
    }
}