{
    "commits": [
        {
            "associated_pull_request": [],
            "date": "2022-07-17 16:25:29+00:00",
            "diff": "hamlib_hamlib/issue_1087/commit_946408e0de1db9436ff46ccd9f985be28d3964c2.diff",
            "diff_additions": 1,
            "diff_deletions": 1,
            "diff_file_size": 15282,
            "diff_url": "https://github.com/Hamlib/Hamlib/commit/946408e0de1db9436ff46ccd9f985be28d3964c2.diff",
            "exists": true,
            "files": [
                {
                    "file_additions": 1,
                    "file_deletions": 1,
                    "file_exists": true,
                    "file_name": "rigs/elad/fdm_duo.c",
                    "file_size": 15282
                }
            ],
            "interesting": {
                "reopen": false,
                "status": false
            },
            "is_parent": true,
            "sha": "946408e0de1db9436ff46ccd9f985be28d3964c2"
        },
        {
            "associated_pull_request": [],
            "date": "2022-07-18 04:39:14+00:00",
            "diff": "hamlib_hamlib/issue_1087/commit_6d329131afb4fa1db43094f670dddbc2d4203da4.diff",
            "diff_additions": 9,
            "diff_deletions": 1,
            "diff_file_size": 47884,
            "diff_url": "https://github.com/Hamlib/Hamlib/commit/6d329131afb4fa1db43094f670dddbc2d4203da4.diff",
            "exists": true,
            "files": [
                {
                    "file_additions": 5,
                    "file_deletions": 1,
                    "file_exists": true,
                    "file_name": "src/debug.c",
                    "file_size": 8502
                },
                {
                    "file_additions": 4,
                    "file_deletions": 0,
                    "file_exists": true,
                    "file_name": "tests/rigctld.c",
                    "file_size": 39382
                }
            ],
            "interesting": {
                "reopen": true,
                "status": false
            },
            "is_parent": false,
            "sha": "6d329131afb4fa1db43094f670dddbc2d4203da4"
        },
        {
            "associated_pull_request": [],
            "date": "2022-07-18 13:01:51+00:00",
            "diff": "hamlib_hamlib/issue_1087/commit_bceac4b40146b0087e8d518d181b4ce541f4f87e.diff",
            "diff_additions": 0,
            "diff_deletions": 2,
            "diff_file_size": 8502,
            "diff_url": "https://github.com/Hamlib/Hamlib/commit/bceac4b40146b0087e8d518d181b4ce541f4f87e.diff",
            "exists": true,
            "files": [
                {
                    "file_additions": 0,
                    "file_deletions": 2,
                    "file_exists": true,
                    "file_name": "src/debug.c",
                    "file_size": 8502
                }
            ],
            "interesting": {
                "reopen": false,
                "status": false
            },
            "is_parent": false,
            "sha": "bceac4b40146b0087e8d518d181b4ce541f4f87e"
        },
        {
            "associated_pull_request": [],
            "date": "2022-07-18 14:51:00+00:00",
            "diff": "hamlib_hamlib/issue_1087/commit_67248edfb819aa971d515e7cf9093cbcba7e704b.diff",
            "diff_additions": 2,
            "diff_deletions": 1,
            "diff_file_size": 43453,
            "diff_url": "https://github.com/Hamlib/Hamlib/commit/67248edfb819aa971d515e7cf9093cbcba7e704b.diff",
            "exists": true,
            "files": [
                {
                    "file_additions": 2,
                    "file_deletions": 1,
                    "file_exists": true,
                    "file_name": "rigs/tentec/omnivii.c",
                    "file_size": 43453
                }
            ],
            "interesting": {
                "reopen": false,
                "status": false
            },
            "is_parent": false,
            "sha": "67248edfb819aa971d515e7cf9093cbcba7e704b"
        },
        {
            "associated_pull_request": [],
            "date": "2022-07-18 14:51:45+00:00",
            "diff": "hamlib_hamlib/issue_1087/commit_f4f7bc90814c14747aba264863ccc953413f4481.diff",
            "diff_additions": 16,
            "diff_deletions": 6,
            "diff_file_size": 269545,
            "diff_url": "https://github.com/Hamlib/Hamlib/commit/f4f7bc90814c14747aba264863ccc953413f4481.diff",
            "exists": true,
            "files": [
                {
                    "file_additions": 15,
                    "file_deletions": 6,
                    "file_exists": true,
                    "file_name": "src/rig.c",
                    "file_size": 230163
                },
                {
                    "file_additions": 1,
                    "file_deletions": 0,
                    "file_exists": true,
                    "file_name": "tests/rigctld.c",
                    "file_size": 39382
                }
            ],
            "interesting": {
                "reopen": false,
                "status": false
            },
            "is_parent": false,
            "sha": "f4f7bc90814c14747aba264863ccc953413f4481"
        }
    ],
    "first_commit": "2022-07-17 16:25:29+00:00",
    "last_commit": "2022-07-18 14:51:45+00:00",
    "number": 1087,
    "pull_request": "None",
    "score": {
        "accidental_reopen_likely": false,
        "all_labels": [
            "bug",
            "critical",
            "fixed"
        ],
        "contains_keywords": [
            "work",
            "issu",
            "debug",
            "bug"
        ],
        "fix_size": 33,
        "has_labels": [
            "bug"
        ],
        "intersecting": {
            "computed_score": 0.05263157894736842,
            "final_commit_size": 19,
            "intersection_size": 1,
            "previous_commits_size": 15
        },
        "is_makefile_based": true,
        "no_new_files": [
            "src/rig.c"
        ],
        "no_other_files": true,
        "num_prohibited_files": 337075,
        "prohibited_files": [
            "server/src/main/java/com/genymobile/scrcpy/Device.java",
            "server/src/main/java/com/genymobile/scrcpy/wrappers/SurfaceControl.java",
            "server/src/main/java/com/genymobile/scrcpy/Device.java",
            "server/src/main/java/com/genymobile/scrcpy/wrappers/SurfaceControl.java",
            "app/meson.build",
            "app/scrcpy.1",
            "app/src/common.h",
            "app/src/scrcpy.h",
            "app/src/server.h",
            "server/src/main/java/com/genymobile/scrcpy/Workarounds.java"
        ],
        "reopen": true,
        "reopen_events": [
            [
                "2022-07-18 04:39:29+00:00",
                "commit"
            ],
            [
                "2022-07-18 04:39:44+00:00",
                "closed"
            ],
            [
                "2022-07-18 13:02:34+00:00",
                "reopened"
            ],
            [
                "2022-07-18 13:07:18+00:00",
                "commit"
            ],
            [
                "2022-07-18 14:52:11+00:00",
                "commit"
            ],
            [
                "2022-07-18 14:52:11+00:00",
                "commit"
            ],
            [
                "2022-07-26 15:07:56+00:00",
                "closed"
            ]
        ],
        "status": false,
        "strategy": true,
        "total_changes": 39
    }
}