{
    "commits": [
        {
            "diff": "elastic_elasticsearch/issue_41811/commit_ae7fa953d9f32139d9603164fe7c28116c0dea54.diff",
            "diff_additions": 62,
            "diff_deletions": 2,
            "diff_file_size": 25149,
            "files": [
                {
                    "file_additions": 4,
                    "file_deletions": 2,
                    "file_exists": true,
                    "file_name": "x-pack/plugin/sql/src/main/java/org/elasticsearch/xpack/sql/querydsl/container/QueryContainer.java",
                    "file_size": 19843
                },
                {
                    "file_additions": 58,
                    "file_deletions": 0,
                    "file_exists": true,
                    "file_name": "x-pack/plugin/sql/src/test/java/org/elasticsearch/xpack/sql/querydsl/container/QueryContainerTests.java",
                    "file_size": 5306
                }
            ],
            "interesting": {
                "reopened": false,
                "status": true
            },
            "sha": "ae7fa953d9f32139d9603164fe7c28116c0dea54"
        },
        {
            "diff": "elastic_elasticsearch/issue_41811/commit_46d77939f68f6d6572ca275cbba9d33d0a9458e9.diff",
            "diff_additions": 59,
            "diff_deletions": 2,
            "diff_file_size": 25149,
            "files": [
                {
                    "file_additions": 4,
                    "file_deletions": 2,
                    "file_exists": true,
                    "file_name": "x-pack/plugin/sql/src/main/java/org/elasticsearch/xpack/sql/querydsl/container/QueryContainer.java",
                    "file_size": 19843
                },
                {
                    "file_additions": 55,
                    "file_deletions": 0,
                    "file_exists": true,
                    "file_name": "x-pack/plugin/sql/src/test/java/org/elasticsearch/xpack/sql/querydsl/container/QueryContainerTests.java",
                    "file_size": 5306
                }
            ],
            "interesting": {
                "reopened": false,
                "status": false
            },
            "sha": "46d77939f68f6d6572ca275cbba9d33d0a9458e9"
        },
        {
            "diff": "elastic_elasticsearch/issue_41811/commit_d110180807b7ca22a66afc5556d1114a77135884.diff",
            "diff_additions": 59,
            "diff_deletions": 2,
            "diff_file_size": 25149,
            "files": [
                {
                    "file_additions": 4,
                    "file_deletions": 2,
                    "file_exists": true,
                    "file_name": "x-pack/plugin/sql/src/main/java/org/elasticsearch/xpack/sql/querydsl/container/QueryContainer.java",
                    "file_size": 19843
                },
                {
                    "file_additions": 55,
                    "file_deletions": 0,
                    "file_exists": true,
                    "file_name": "x-pack/plugin/sql/src/test/java/org/elasticsearch/xpack/sql/querydsl/container/QueryContainerTests.java",
                    "file_size": 5306
                }
            ],
            "interesting": {
                "reopened": false,
                "status": false
            },
            "sha": "d110180807b7ca22a66afc5556d1114a77135884"
        },
        {
            "diff": "elastic_elasticsearch/issue_41811/commit_0016c23987c74c99bb6d32361cd22775bbe4d808.diff",
            "diff_additions": 59,
            "diff_deletions": 2,
            "diff_file_size": 25149,
            "files": [
                {
                    "file_additions": 4,
                    "file_deletions": 2,
                    "file_exists": true,
                    "file_name": "x-pack/plugin/sql/src/main/java/org/elasticsearch/xpack/sql/querydsl/container/QueryContainer.java",
                    "file_size": 19843
                },
                {
                    "file_additions": 55,
                    "file_deletions": 0,
                    "file_exists": true,
                    "file_name": "x-pack/plugin/sql/src/test/java/org/elasticsearch/xpack/sql/querydsl/container/QueryContainerTests.java",
                    "file_size": 5306
                }
            ],
            "interesting": {
                "reopened": false,
                "status": false
            },
            "sha": "0016c23987c74c99bb6d32361cd22775bbe4d808"
        },
        {
            "diff": "elastic_elasticsearch/issue_41811/commit_87156ad93badeaa9af0ba90252eef7ef2b561ce2.diff",
            "diff_additions": 58,
            "diff_deletions": 2,
            "diff_file_size": 25149,
            "files": [
                {
                    "file_additions": 4,
                    "file_deletions": 2,
                    "file_exists": true,
                    "file_name": "x-pack/plugin/sql/src/main/java/org/elasticsearch/xpack/sql/querydsl/container/QueryContainer.java",
                    "file_size": 19843
                },
                {
                    "file_additions": 54,
                    "file_deletions": 0,
                    "file_exists": true,
                    "file_name": "x-pack/plugin/sql/src/test/java/org/elasticsearch/xpack/sql/querydsl/container/QueryContainerTests.java",
                    "file_size": 5306
                }
            ],
            "interesting": {
                "reopened": false,
                "status": false
            },
            "sha": "87156ad93badeaa9af0ba90252eef7ef2b561ce2"
        },
        {
            "diff": "elastic_elasticsearch/issue_41811/commit_79f1e536a117bde8e6c3dd297a2f69b0e805f131.diff",
            "diff_additions": 58,
            "diff_deletions": 2,
            "diff_file_size": 25149,
            "files": [
                {
                    "file_additions": 4,
                    "file_deletions": 2,
                    "file_exists": true,
                    "file_name": "x-pack/plugin/sql/src/main/java/org/elasticsearch/xpack/sql/querydsl/container/QueryContainer.java",
                    "file_size": 19843
                },
                {
                    "file_additions": 54,
                    "file_deletions": 0,
                    "file_exists": true,
                    "file_name": "x-pack/plugin/sql/src/test/java/org/elasticsearch/xpack/sql/querydsl/container/QueryContainerTests.java",
                    "file_size": 5306
                }
            ],
            "interesting": {
                "reopened": false,
                "status": false
            },
            "sha": "79f1e536a117bde8e6c3dd297a2f69b0e805f131"
        },
        {
            "diff": "elastic_elasticsearch/issue_41811/commit_b3c48546c78c325952e8405fc60b7e6a7f590ca8.diff",
            "diff_additions": 58,
            "diff_deletions": 1,
            "diff_file_size": 25149,
            "files": [
                {
                    "file_additions": 3,
                    "file_deletions": 1,
                    "file_exists": true,
                    "file_name": "x-pack/plugin/sql/src/main/java/org/elasticsearch/xpack/sql/querydsl/container/QueryContainer.java",
                    "file_size": 19843
                },
                {
                    "file_additions": 55,
                    "file_deletions": 0,
                    "file_exists": true,
                    "file_name": "x-pack/plugin/sql/src/test/java/org/elasticsearch/xpack/sql/querydsl/container/QueryContainerTests.java",
                    "file_size": 5306
                }
            ],
            "interesting": {
                "reopened": false,
                "status": false
            },
            "sha": "b3c48546c78c325952e8405fc60b7e6a7f590ca8"
        },
        {
            "diff": "elastic_elasticsearch/issue_41811/commit_a63524b85304001f33c247a9e0a534e075c110d4.diff",
            "diff_additions": 58,
            "diff_deletions": 2,
            "diff_file_size": 25149,
            "files": [
                {
                    "file_additions": 4,
                    "file_deletions": 2,
                    "file_exists": true,
                    "file_name": "x-pack/plugin/sql/src/main/java/org/elasticsearch/xpack/sql/querydsl/container/QueryContainer.java",
                    "file_size": 19843
                },
                {
                    "file_additions": 54,
                    "file_deletions": 0,
                    "file_exists": true,
                    "file_name": "x-pack/plugin/sql/src/test/java/org/elasticsearch/xpack/sql/querydsl/container/QueryContainerTests.java",
                    "file_size": 5306
                }
            ],
            "interesting": {
                "reopened": false,
                "status": false
            },
            "sha": "a63524b85304001f33c247a9e0a534e075c110d4"
        }
    ],
    "first_commit": "2019-05-12 04:38:56",
    "last_commit": "2019-09-30 19:38:08",
    "number": 41811,
    "score": 320.0082304526749
}