{
    "category": [
        "wrong API usage"
    ],
    "commits": [
        {
            "associated_pull_request": [
                "https://github.com/facebook/zstd/pull/1368"
            ],
            "date": "2018-10-19 23:31:10",
            "diff": "facebook_zstd/issue_1379/commit_f2cff22804e3d86327b06d51458003b40b455afc.diff",
            "diff_additions": 654,
            "diff_deletions": 0,
            "diff_file_size": 39814,
            "diff_url": "https://github.com/facebook/zstd/commit/f2cff22804e3d86327b06d51458003b40b455afc.diff",
            "exists": true,
            "files": [
                {
                    "file_additions": 654,
                    "file_deletions": 0,
                    "file_exists": true,
                    "file_name": "programs/util.c",
                    "file_size": 39814
                }
            ],
            "interesting": {
                "reopen": false,
                "status": false
            },
            "is_parent": true,
            "sha": "f2cff22804e3d86327b06d51458003b40b455afc"
        },
        {
            "associated_pull_request": [],
            "date": "2018-10-21 01:53:02",
            "diff": "facebook_zstd/issue_1379/commit_22aa845851e0391a3121143cfe6961fd145da85a.diff",
            "diff_additions": 3,
            "diff_deletions": 4,
            "diff_file_size": 69924,
            "diff_url": "https://github.com/facebook/zstd/commit/22aa845851e0391a3121143cfe6961fd145da85a.diff",
            "exists": true,
            "files": [
                {
                    "file_additions": 3,
                    "file_deletions": 4,
                    "file_exists": true,
                    "file_name": "tests/decodecorpus.c",
                    "file_size": 69924
                }
            ],
            "interesting": {
                "reopen": false,
                "status": true
            },
            "is_parent": false,
            "sha": "22aa845851e0391a3121143cfe6961fd145da85a"
        },
        {
            "associated_pull_request": [
                "https://github.com/facebook/zstd/pull/1380"
            ],
            "date": "2018-10-21 01:53:02",
            "diff": "facebook_zstd/issue_1379/commit_f181799082c65a7f532dbcccb027dd7618f551d4.diff",
            "diff_additions": 9,
            "diff_deletions": 6,
            "diff_file_size": 161180,
            "diff_url": "https://github.com/facebook/zstd/commit/f181799082c65a7f532dbcccb027dd7618f551d4.diff",
            "exists": true,
            "files": [
                {
                    "file_additions": 6,
                    "file_deletions": 2,
                    "file_exists": true,
                    "file_name": "lib/decompress/zstd_decompress.c",
                    "file_size": 91256
                },
                {
                    "file_additions": 3,
                    "file_deletions": 4,
                    "file_exists": true,
                    "file_name": "tests/decodecorpus.c",
                    "file_size": 69924
                }
            ],
            "interesting": {
                "reopen": false,
                "status": false
            },
            "is_parent": false,
            "sha": "f181799082c65a7f532dbcccb027dd7618f551d4"
        }
    ],
    "first_commit": "2018-10-19 23:31:10",
    "last_commit": "2018-10-21 01:56:21",
    "number": 1379,
    "pull_request": "None",
    "score": {
        "accidental_reopen_likely": false,
        "all_labels": [
            "bug"
        ],
        "contains_keywords": [
            "fix",
            "bug",
            "test",
            "issu",
            "error"
        ],
        "fix_size": 14,
        "has_labels": [
            "bug"
        ],
        "intersecting": {
            "computed_score": 0.5,
            "final_commit_size": 14,
            "intersection_size": 7,
            "previous_commits_size": 7
        },
        "is_makefile_based": true,
        "no_new_files": [
            "lib/decompress/zstd_decompress.c"
        ],
        "no_other_files": false,
        "num_prohibited_files": 28103,
        "prohibited_files": [
            "kill.h",
            "meminfo.h",
            "kill.h",
            "meminfo.h",
            "kill.h",
            "meminfo.h",
            "testsuite_cli_test.go",
            "testsuite_cli_test.go",
            "common.mk",
            "i3bar/include/draw_util.h"
        ],
        "reopen": false,
        "reopen_events": [
            [
                "2018-10-21 01:55:01",
                "commit"
            ],
            [
                "2018-10-21 01:56:34",
                "commit"
            ],
            [
                "2018-10-22 18:57:13",
                "closed"
            ]
        ],
        "status": true,
        "strategy": true,
        "total_changes": 676
    }
}