{
    "covered_issues": [
        142,
        137,
        135,
        134,
        133,
        122,
        121,
        120,
        119,
        118,
        117,
        116,
        115,
        114,
        113,
        112,
        110,
        104,
        103,
        101,
        100,
        99,
        98,
        97,
        96,
        95,
        94,
        93,
        92,
        91,
        90,
        89,
        88,
        87,
        86,
        85,
        84,
        83,
        81,
        80,
        77,
        75,
        74,
        72,
        71,
        70,
        69,
        68,
        67,
        66,
        65,
        64,
        63,
        62,
        61,
        59,
        57,
        56,
        55,
        53,
        52,
        49,
        48,
        47,
        46,
        45,
        44,
        42,
        41,
        40,
        39,
        38,
        37,
        36,
        34,
        33,
        32,
        31,
        29,
        28,
        26,
        25,
        24,
        23,
        22,
        21,
        20,
        18,
        17,
        16,
        15,
        14,
        13,
        12,
        9,
        8,
        7,
        6,
        4,
        3,
        2,
        1
    ],
    "finished": true
}