{
    "commits": [
        {
            "associated_pull_request": [
                "https://github.com/wolfSSL/wolfssl/pull/3086"
            ],
            "date": "2020-07-01 16:02:29+00:00",
            "diff": "wolfssl_wolfssl/issue_3070/commit_f89686a1ec3638a48bb50b670d212c893a5030f1.diff",
            "diff_additions": 9,
            "diff_deletions": 9,
            "diff_file_size": 3778769,
            "diff_url": "https://github.com/wolfSSL/wolfssl/commit/f89686a1ec3638a48bb50b670d212c893a5030f1.diff",
            "exists": true,
            "files": [
                {
                    "file_additions": 3,
                    "file_deletions": 3,
                    "file_exists": true,
                    "file_name": "wolfcrypt/src/sp_c32.c",
                    "file_size": 1953590
                },
                {
                    "file_additions": 6,
                    "file_deletions": 6,
                    "file_exists": true,
                    "file_name": "wolfcrypt/src/sp_c64.c",
                    "file_size": 1825179
                }
            ],
            "interesting": {
                "reopen": false,
                "status": false
            },
            "is_parent": true,
            "sha": "f89686a1ec3638a48bb50b670d212c893a5030f1"
        },
        {
            "associated_pull_request": [],
            "date": "2020-07-01 16:36:35+00:00",
            "diff": "wolfssl_wolfssl/issue_3070/commit_42a1e484ed01748a151e81ef2dee033c5a65fa3e.diff",
            "diff_additions": 8,
            "diff_deletions": 2,
            "diff_file_size": 1382481,
            "diff_url": "https://github.com/wolfSSL/wolfssl/commit/42a1e484ed01748a151e81ef2dee033c5a65fa3e.diff",
            "exists": true,
            "files": [
                {
                    "file_additions": 8,
                    "file_deletions": 2,
                    "file_exists": true,
                    "file_name": "src/internal.c",
                    "file_size": 1382481
                }
            ],
            "interesting": {
                "reopen": true,
                "status": false
            },
            "is_parent": false,
            "sha": "42a1e484ed01748a151e81ef2dee033c5a65fa3e"
        },
        {
            "associated_pull_request": [],
            "date": "2020-07-01 16:36:35+00:00",
            "diff": "wolfssl_wolfssl/issue_3070/commit_bfb769f49ad8c8139d7ae0f9fef4e99d3e8e803e.diff",
            "diff_additions": 8,
            "diff_deletions": 2,
            "diff_file_size": 1382481,
            "diff_url": "https://github.com/wolfSSL/wolfssl/commit/bfb769f49ad8c8139d7ae0f9fef4e99d3e8e803e.diff",
            "exists": true,
            "files": [
                {
                    "file_additions": 8,
                    "file_deletions": 2,
                    "file_exists": true,
                    "file_name": "src/internal.c",
                    "file_size": 1382481
                }
            ],
            "interesting": {
                "reopen": false,
                "status": false
            },
            "is_parent": false,
            "sha": "bfb769f49ad8c8139d7ae0f9fef4e99d3e8e803e"
        },
        {
            "associated_pull_request": [],
            "date": "2020-07-01 16:36:35+00:00",
            "diff": "wolfssl_wolfssl/issue_3070/commit_926cc58a918fe89bbf76603f1e4c01659e61321a.diff",
            "diff_additions": 8,
            "diff_deletions": 2,
            "diff_file_size": 1382481,
            "diff_url": "https://github.com/wolfSSL/wolfssl/commit/926cc58a918fe89bbf76603f1e4c01659e61321a.diff",
            "exists": true,
            "files": [
                {
                    "file_additions": 8,
                    "file_deletions": 2,
                    "file_exists": true,
                    "file_name": "src/internal.c",
                    "file_size": 1382481
                }
            ],
            "interesting": {
                "reopen": false,
                "status": false
            },
            "is_parent": false,
            "sha": "926cc58a918fe89bbf76603f1e4c01659e61321a"
        },
        {
            "associated_pull_request": [],
            "date": "2020-07-01 16:36:35+00:00",
            "diff": "wolfssl_wolfssl/issue_3070/commit_64dea93aa200ac7c35093ccf6766d33fad9727ce.diff",
            "diff_additions": 8,
            "diff_deletions": 2,
            "diff_file_size": 1382481,
            "diff_url": "https://github.com/wolfSSL/wolfssl/commit/64dea93aa200ac7c35093ccf6766d33fad9727ce.diff",
            "exists": true,
            "files": [
                {
                    "file_additions": 8,
                    "file_deletions": 2,
                    "file_exists": true,
                    "file_name": "src/internal.c",
                    "file_size": 1382481
                }
            ],
            "interesting": {
                "reopen": false,
                "status": false
            },
            "is_parent": false,
            "sha": "64dea93aa200ac7c35093ccf6766d33fad9727ce"
        },
        {
            "associated_pull_request": [
                "https://github.com/wolfSSL/wolfssl/pull/5812"
            ],
            "date": "2020-07-01 16:36:35+00:00",
            "diff": "wolfssl_wolfssl/issue_3070/commit_909fd726cda207eb0a7335f35d02e1cee9362a94.diff",
            "diff_additions": 28,
            "diff_deletions": 19,
            "diff_file_size": 1382481,
            "diff_url": "https://github.com/wolfSSL/wolfssl/commit/909fd726cda207eb0a7335f35d02e1cee9362a94.diff",
            "exists": true,
            "files": [
                {
                    "file_additions": 28,
                    "file_deletions": 19,
                    "file_exists": true,
                    "file_name": "src/internal.c",
                    "file_size": 1382481
                }
            ],
            "interesting": {
                "reopen": false,
                "status": false
            },
            "is_parent": false,
            "sha": "909fd726cda207eb0a7335f35d02e1cee9362a94"
        }
    ],
    "first_commit": "2020-07-01 16:02:29+00:00",
    "last_commit": "2022-11-23 18:50:12+00:00",
    "number": 3070,
    "pull_request": "None",
    "score": {
        "accidental_reopen_likely": false,
        "all_labels": [
            "bug",
            "Maintenance Item"
        ],
        "contains_keywords": [
            "fail",
            "fix",
            "issu",
            "test",
            "bug",
            "report"
        ],
        "fix_size": 64,
        "has_labels": [
            "bug"
        ],
        "intersecting": {
            "computed_score": 0.23529411764705882,
            "final_commit_size": 34,
            "intersection_size": 8,
            "previous_commits_size": 38
        },
        "is_makefile_based": true,
        "no_new_files": [],
        "no_other_files": true,
        "num_prohibited_files": 258966,
        "prohibited_files": [
            "server/src/main/java/com/genymobile/scrcpy/Device.java",
            "server/src/main/java/com/genymobile/scrcpy/wrappers/SurfaceControl.java",
            "server/src/main/java/com/genymobile/scrcpy/Device.java",
            "server/src/main/java/com/genymobile/scrcpy/wrappers/SurfaceControl.java",
            "app/meson.build",
            "app/scrcpy.1",
            "app/src/common.h",
            "app/src/scrcpy.h",
            "app/src/server.h",
            "server/src/main/java/com/genymobile/scrcpy/Workarounds.java"
        ],
        "reopen": true,
        "reopen_events": [
            [
                "2020-07-01 16:42:29+00:00",
                "commit"
            ],
            [
                "2020-07-22 18:26:47+00:00",
                "closed"
            ],
            [
                "2020-07-22 18:27:35+00:00",
                "reopened"
            ],
            [
                "2020-07-24 21:04:02+00:00",
                "commit"
            ],
            [
                "2021-01-14 20:29:47+00:00",
                "commit"
            ],
            [
                "2022-11-23 02:09:26+00:00",
                "commit"
            ],
            [
                "2022-11-23 18:50:32+00:00",
                "commit"
            ],
            [
                "2022-11-24 00:41:29+00:00",
                "closed"
            ]
        ],
        "status": false,
        "strategy": true,
        "total_changes": 105
    }
}