{
    "covered_issues": [
        22,
        20,
        19,
        18,
        17,
        16,
        15,
        11,
        9,
        8,
        7,
        6,
        5,
        4,
        3,
        1
    ],
    "finished": true
}