{
    "covered_issues": [
        396,
        390,
        386,
        384,
        379,
        378,
        376,
        373,
        367,
        362,
        358,
        354,
        352,
        349,
        348,
        345,
        340,
        337,
        335,
        325,
        322,
        321,
        319,
        316,
        315,
        308,
        304,
        303,
        301,
        299,
        298,
        296,
        294,
        289,
        286,
        281,
        277,
        275,
        274,
        267,
        265,
        263,
        260,
        255,
        253,
        240,
        234,
        233,
        230,
        229,
        226,
        224,
        221,
        213,
        208,
        205,
        202,
        200,
        194,
        193,
        189,
        188,
        186,
        183,
        181,
        180,
        179,
        176,
        174,
        170,
        167,
        166,
        164,
        162,
        158,
        155,
        149,
        147,
        145,
        143,
        139,
        136,
        133,
        132,
        129,
        125,
        122,
        120,
        118,
        117,
        116,
        110,
        108,
        104,
        102,
        100,
        98,
        96,
        94,
        93,
        91,
        89,
        87,
        81,
        78,
        73,
        71,
        66,
        65,
        64,
        63,
        55,
        52,
        50,
        48,
        45,
        43,
        41,
        39,
        37,
        35
    ],
    "finished": true
}