{
    "commits": [
        {
            "associated_pull_request": [],
            "date": "2021-09-30 00:23:01+00:00",
            "diff": "",
            "diff_additions": 0,
            "diff_deletions": 0,
            "diff_file_size": 0,
            "diff_url": "https://github.com/yugabyte/yugabyte-db/commit/4f13b2d48abb08aaa1e1d7ac35d196af1afa35ec.diff",
            "exists": true,
            "files": [],
            "interesting": {
                "reopen": false,
                "status": false
            },
            "is_parent": true,
            "sha": "4f13b2d48abb08aaa1e1d7ac35d196af1afa35ec"
        },
        {
            "associated_pull_request": [],
            "date": "2021-10-07 18:47:06+00:00",
            "diff": "yugabyte_yugabyte-db/issue_10116/commit_4133db6da0c84bed9b2487c250ae935e1abbbb4a.diff",
            "diff_additions": 2,
            "diff_deletions": 0,
            "diff_file_size": 11024,
            "diff_url": "https://github.com/yugabyte/yugabyte-db/commit/4133db6da0c84bed9b2487c250ae935e1abbbb4a.diff",
            "exists": true,
            "files": [
                {
                    "file_additions": 2,
                    "file_deletions": 0,
                    "file_exists": true,
                    "file_name": "src/yb/master/sys_catalog_writer.cc",
                    "file_size": 11024
                }
            ],
            "interesting": {
                "reopen": false,
                "status": false
            },
            "is_parent": false,
            "sha": "4133db6da0c84bed9b2487c250ae935e1abbbb4a"
        },
        {
            "associated_pull_request": [],
            "date": "2022-08-24 19:20:03+00:00",
            "diff": "yugabyte_yugabyte-db/issue_10116/commit_aca442b37c068e22f600cf3af1f5e94aef207622.diff",
            "diff_additions": 20,
            "diff_deletions": 10,
            "diff_file_size": 11024,
            "diff_url": "https://github.com/yugabyte/yugabyte-db/commit/aca442b37c068e22f600cf3af1f5e94aef207622.diff",
            "exists": true,
            "files": [
                {
                    "file_additions": 20,
                    "file_deletions": 10,
                    "file_exists": true,
                    "file_name": "src/yb/master/sys_catalog_writer.cc",
                    "file_size": 11024
                }
            ],
            "interesting": {
                "reopen": false,
                "status": false
            },
            "is_parent": false,
            "sha": "aca442b37c068e22f600cf3af1f5e94aef207622"
        }
    ],
    "first_commit": "2021-09-30 17:23:25+00:00",
    "last_commit": "2022-08-26 00:21:13+00:00",
    "number": 10116,
    "pull_request": "None",
    "score": {
        "accidental_reopen_likely": false,
        "all_labels": [
            "kind/bug"
        ],
        "contains_keywords": [
            "work",
            "fail",
            "chang",
            "fix",
            "issu",
            "debug",
            "test",
            "fault",
            "bug",
            "error",
            "problem",
            "crash"
        ],
        "fix_size": 24,
        "has_labels": [],
        "intersecting": {
            "computed_score": 0.125,
            "final_commit_size": 24,
            "intersection_size": 3,
            "previous_commits_size": 3
        },
        "is_makefile_based": true,
        "no_new_files": [],
        "no_other_files": false,
        "num_prohibited_files": 31905,
        "prohibited_files": [
            "server/src/main/java/com/genymobile/scrcpy/Device.java",
            "server/src/main/java/com/genymobile/scrcpy/wrappers/SurfaceControl.java",
            "server/src/main/java/com/genymobile/scrcpy/Device.java",
            "server/src/main/java/com/genymobile/scrcpy/wrappers/SurfaceControl.java",
            "app/meson.build",
            "app/scrcpy.1",
            "app/src/common.h",
            "app/src/scrcpy.h",
            "app/src/server.h",
            "server/src/main/java/com/genymobile/scrcpy/Workarounds.java"
        ],
        "reopen": true,
        "reopen_events": [
            [
                "2021-09-30 18:03:58+00:00",
                "commit"
            ],
            [
                "2021-10-21 01:17:48+00:00",
                "commit"
            ],
            [
                "2021-10-26 19:39:37+00:00",
                "closed"
            ],
            [
                "2021-10-26 19:39:37+00:00",
                "commit"
            ],
            [
                "2022-08-24 18:59:50+00:00",
                "reopened"
            ],
            [
                "2022-08-26 00:21:16+00:00",
                "commit"
            ],
            [
                "2022-08-29 16:33:36+00:00",
                "closed"
            ]
        ],
        "status": false,
        "strategy": true,
        "total_changes": 32
    }
}