{
    "all_issues": 356,
    "interesting_issues": 1,
    "last_update": "2023-10-31 23:54:12.169135",
    "license": {
        "download": "https://raw.githubusercontent.com/proot-me/proot/master/COPYING",
        "name": "GNU General Public License v2.0"
    },
    "ratio": 0.0028089887640449437,
    "size": 3885,
    "stars": 1714,
    "url": "https://github.com/proot-me/proot"
}