Merge branch 'master' of github.com:krakjoe/pthreads
fix #658 #659
Revert "fix #658 #659"

This reverts commit bd1ddc450e47635810bc2d8b9034150b9c255115.
anonymous class support, fix #505 #658 #659
anonymous class support, fix #505 #658 #659
anonymous class support, fix #505 #658 #659
anonymous class support, fix #505 #658 #659
anonymous class support, fix #505 #658 #659
anonymous class support, fix #505 #658 #659
anonymous class support, fix #505 #658 #659
