{
    "covered_issues": [
        33,
        29,
        27,
        26,
        23,
        20,
        19,
        18,
        14,
        13,
        12,
        11,
        10,
        9,
        8,
        7,
        5,
        4,
        3,
        2,
        1
    ],
    "finished": true
}