{
    "all_issues": 2590,
    "interesting_issues": 17,
    "last_update": "2021-05-17 01:51:24.178417",
    "license": {
        "download": "https://raw.githubusercontent.com/DeaDBeeF-Player/deadbeef/master/COPYING",
        "name": "Other"
    },
    "ratio": 0.006563706563706564,
    "size": 76033,
    "stars": 1137,
    "url": "https://github.com/DeaDBeeF-Player/deadbeef"
}