{
    "commits": [
        {
            "associated_pull_request": [
                "https://github.com/GenericMappingTools/gmt/pull/6305"
            ],
            "date": "2022-02-07 19:26:10+00:00",
            "diff": "genericmappingtools_gmt/issue_6306/commit_bbb2b607031c0707bd8eeb271d26972c9ef4b01a.diff",
            "diff_additions": 28,
            "diff_deletions": 10,
            "diff_file_size": 952294,
            "diff_url": "https://github.com/GenericMappingTools/gmt/commit/bbb2b607031c0707bd8eeb271d26972c9ef4b01a.diff",
            "exists": true,
            "files": [
                {
                    "file_additions": 28,
                    "file_deletions": 10,
                    "file_exists": true,
                    "file_name": "src/gmt_init.c",
                    "file_size": 952294
                }
            ],
            "interesting": {
                "reopen": false,
                "status": false
            },
            "is_parent": true,
            "sha": "bbb2b607031c0707bd8eeb271d26972c9ef4b01a"
        },
        {
            "associated_pull_request": [
                "https://github.com/GenericMappingTools/gmt/pull/6310"
            ],
            "date": "2022-02-07 20:19:16+00:00",
            "diff": "genericmappingtools_gmt/issue_6306/commit_2d4c87b44751dd48fb8e9d9c8e2295b012dcff44.diff",
            "diff_additions": 2,
            "diff_deletions": 2,
            "diff_file_size": 818869,
            "diff_url": "https://github.com/GenericMappingTools/gmt/commit/2d4c87b44751dd48fb8e9d9c8e2295b012dcff44.diff",
            "exists": true,
            "files": [
                {
                    "file_additions": 2,
                    "file_deletions": 2,
                    "file_exists": true,
                    "file_name": "src/gmt_support.c",
                    "file_size": 818869
                }
            ],
            "interesting": {
                "reopen": false,
                "status": false
            },
            "is_parent": false,
            "sha": "2d4c87b44751dd48fb8e9d9c8e2295b012dcff44"
        },
        {
            "associated_pull_request": [
                "https://github.com/GenericMappingTools/gmt/pull/6310"
            ],
            "date": "2022-02-07 22:46:52+00:00",
            "diff": "genericmappingtools_gmt/issue_6306/commit_7823eba433e08bd6b14a54d003c45944ea00bfbf.diff",
            "diff_additions": 3,
            "diff_deletions": 2,
            "diff_file_size": 818869,
            "diff_url": "https://github.com/GenericMappingTools/gmt/commit/7823eba433e08bd6b14a54d003c45944ea00bfbf.diff",
            "exists": true,
            "files": [
                {
                    "file_additions": 3,
                    "file_deletions": 2,
                    "file_exists": true,
                    "file_name": "src/gmt_support.c",
                    "file_size": 818869
                }
            ],
            "interesting": {
                "reopen": true,
                "status": false
            },
            "is_parent": false,
            "sha": "7823eba433e08bd6b14a54d003c45944ea00bfbf"
        },
        {
            "associated_pull_request": [
                "https://github.com/GenericMappingTools/gmt/pull/6331"
            ],
            "date": "2022-02-11 02:33:17+00:00",
            "diff": "genericmappingtools_gmt/issue_6306/commit_acfecf9140f1f7e83543b55612f4d965ba6d4822.diff",
            "diff_additions": 5,
            "diff_deletions": 4,
            "diff_file_size": 818869,
            "diff_url": "https://github.com/GenericMappingTools/gmt/commit/acfecf9140f1f7e83543b55612f4d965ba6d4822.diff",
            "exists": true,
            "files": [
                {
                    "file_additions": 5,
                    "file_deletions": 4,
                    "file_exists": true,
                    "file_name": "src/gmt_support.c",
                    "file_size": 818869
                }
            ],
            "interesting": {
                "reopen": false,
                "status": false
            },
            "is_parent": false,
            "sha": "acfecf9140f1f7e83543b55612f4d965ba6d4822"
        },
        {
            "associated_pull_request": [
                "https://github.com/GenericMappingTools/gmt/pull/6331"
            ],
            "date": "2022-02-11 04:15:27+00:00",
            "diff": "genericmappingtools_gmt/issue_6306/commit_fd703d01f7628ca831fdc73cfa5156e6448515c0.diff",
            "diff_additions": 5,
            "diff_deletions": 4,
            "diff_file_size": 818869,
            "diff_url": "https://github.com/GenericMappingTools/gmt/commit/fd703d01f7628ca831fdc73cfa5156e6448515c0.diff",
            "exists": true,
            "files": [
                {
                    "file_additions": 5,
                    "file_deletions": 4,
                    "file_exists": true,
                    "file_name": "src/gmt_support.c",
                    "file_size": 818869
                }
            ],
            "interesting": {
                "reopen": false,
                "status": false
            },
            "is_parent": false,
            "sha": "fd703d01f7628ca831fdc73cfa5156e6448515c0"
        },
        {
            "associated_pull_request": [
                "https://github.com/GenericMappingTools/gmt/pull/6334"
            ],
            "date": "2022-02-11 04:16:28+00:00",
            "diff": "genericmappingtools_gmt/issue_6306/commit_109f9d67b382fc146fabd31a3ccd620cb72a3ea2.diff",
            "diff_additions": 36,
            "diff_deletions": 25,
            "diff_file_size": 818869,
            "diff_url": "https://github.com/GenericMappingTools/gmt/commit/109f9d67b382fc146fabd31a3ccd620cb72a3ea2.diff",
            "exists": true,
            "files": [
                {
                    "file_additions": 36,
                    "file_deletions": 25,
                    "file_exists": true,
                    "file_name": "src/gmt_support.c",
                    "file_size": 818869
                }
            ],
            "interesting": {
                "reopen": false,
                "status": false
            },
            "is_parent": false,
            "sha": "109f9d67b382fc146fabd31a3ccd620cb72a3ea2"
        },
        {
            "associated_pull_request": [
                "https://github.com/GenericMappingTools/gmt/pull/6334"
            ],
            "date": "2022-02-13 21:33:23+00:00",
            "diff": "genericmappingtools_gmt/issue_6306/commit_4e0b1cbbbe2d9ced559935098bf0f1378f045041.diff",
            "diff_additions": 76,
            "diff_deletions": 102,
            "diff_file_size": 866500,
            "diff_url": "https://github.com/GenericMappingTools/gmt/commit/4e0b1cbbbe2d9ced559935098bf0f1378f045041.diff",
            "exists": true,
            "files": [
                {
                    "file_additions": 75,
                    "file_deletions": 101,
                    "file_exists": true,
                    "file_name": "src/gmt_support.c",
                    "file_size": 818869
                },
                {
                    "file_additions": 1,
                    "file_deletions": 1,
                    "file_exists": true,
                    "file_name": "src/triangulate.c",
                    "file_size": 47631
                }
            ],
            "interesting": {
                "reopen": false,
                "status": false
            },
            "is_parent": false,
            "sha": "4e0b1cbbbe2d9ced559935098bf0f1378f045041"
        }
    ],
    "first_commit": "2022-02-07 19:26:10+00:00",
    "last_commit": "2022-02-13 21:33:23+00:00",
    "number": 6306,
    "pull_request": "None",
    "score": {
        "accidental_reopen_likely": false,
        "all_labels": [
            "bug"
        ],
        "contains_keywords": [
            "work",
            "chang",
            "fix",
            "issu",
            "debug",
            "test",
            "bug",
            "problem",
            "crash"
        ],
        "fix_size": 177,
        "has_labels": [
            "bug"
        ],
        "intersecting": {
            "computed_score": 0.2549019607843137,
            "final_commit_size": 153,
            "intersection_size": 39,
            "previous_commits_size": 63
        },
        "is_makefile_based": true,
        "no_new_files": [
            "src/triangulate.c"
        ],
        "no_other_files": false,
        "num_prohibited_files": 426237,
        "prohibited_files": [
            "server/src/main/java/com/genymobile/scrcpy/Device.java",
            "server/src/main/java/com/genymobile/scrcpy/wrappers/SurfaceControl.java",
            "server/src/main/java/com/genymobile/scrcpy/Device.java",
            "server/src/main/java/com/genymobile/scrcpy/wrappers/SurfaceControl.java",
            "app/meson.build",
            "app/scrcpy.1",
            "app/src/common.h",
            "app/src/scrcpy.h",
            "app/src/server.h",
            "server/src/main/java/com/genymobile/scrcpy/Workarounds.java"
        ],
        "reopen": true,
        "reopen_events": [
            [
                "2022-02-07 20:19:23+00:00",
                "commit"
            ],
            [
                "2022-02-07 22:46:54+00:00",
                "commit"
            ],
            [
                "2022-02-08 01:05:30+00:00",
                "closed"
            ],
            [
                "2022-02-11 01:18:19+00:00",
                "reopened"
            ],
            [
                "2022-02-11 02:33:21+00:00",
                "commit"
            ],
            [
                "2022-02-11 04:15:29+00:00",
                "commit"
            ],
            [
                "2022-02-11 04:16:32+00:00",
                "commit"
            ],
            [
                "2022-02-13 21:33:25+00:00",
                "commit"
            ],
            [
                "2022-02-14 02:18:46+00:00",
                "closed"
            ]
        ],
        "status": false,
        "strategy": true,
        "total_changes": 304
    }
}