{
    "commits": [
        {
            "diff": "spring-projects_spring-boot/issue_16659/commit_930186e5053ffb65482599e6f11d3a43a5fe2bb4.diff",
            "diff_additions": 8,
            "diff_deletions": 5,
            "diff_file_size": 70606,
            "files": [
                {
                    "file_additions": 4,
                    "file_deletions": 0,
                    "file_exists": true,
                    "file_name": "spring-boot-project/spring-boot-autoconfigure/src/main/java/org/springframework/boot/autoconfigure/web/ResourceProperties.java",
                    "file_size": 8198
                },
                {
                    "file_additions": 1,
                    "file_deletions": 1,
                    "file_exists": true,
                    "file_name": "spring-boot-project/spring-boot-autoconfigure/src/test/java/org/springframework/boot/autoconfigure/web/ResourcePropertiesTests.java",
                    "file_size": 3471
                },
                {
                    "file_additions": 3,
                    "file_deletions": 4,
                    "file_exists": true,
                    "file_name": "spring-boot-project/spring-boot-autoconfigure/src/test/java/org/springframework/boot/autoconfigure/web/servlet/WebMvcAutoConfigurationTests.java",
                    "file_size": 58937
                }
            ],
            "interesting": {
                "reopened": false,
                "status": true
            },
            "sha": "930186e5053ffb65482599e6f11d3a43a5fe2bb4"
        },
        {
            "diff": "spring-projects_spring-boot/issue_16659/commit_3b4ff7d74641bd453554df22bc4eaa55da4522d4.diff",
            "diff_additions": 1453,
            "diff_deletions": 3,
            "diff_file_size": 70617,
            "files": [
                {
                    "file_additions": 48,
                    "file_deletions": 0,
                    "file_exists": false,
                    "file_name": "spring-boot-project/spring-boot-test-autoconfigure/src/main/java/org/springframework/boot/test/autoconfigure/OverrideConfigurationPropertiesScan.java",
                    "file_size": 0
                },
                {
                    "file_additions": 76,
                    "file_deletions": 0,
                    "file_exists": false,
                    "file_name": "spring-boot-project/spring-boot-test-autoconfigure/src/main/java/org/springframework/boot/test/autoconfigure/OverrideConfigurationPropertiesScanContextCustomizerFactory.java",
                    "file_size": 0
                },
                {
                    "file_additions": 2,
                    "file_deletions": 0,
                    "file_exists": true,
                    "file_name": "spring-boot-project/spring-boot-test-autoconfigure/src/main/java/org/springframework/boot/test/autoconfigure/data/jdbc/DataJdbcTest.java",
                    "file_size": 4522
                },
                {
                    "file_additions": 2,
                    "file_deletions": 0,
                    "file_exists": true,
                    "file_name": "spring-boot-project/spring-boot-test-autoconfigure/src/main/java/org/springframework/boot/test/autoconfigure/data/ldap/DataLdapTest.java",
                    "file_size": 3795
                },
                {
                    "file_additions": 2,
                    "file_deletions": 0,
                    "file_exists": true,
                    "file_name": "spring-boot-project/spring-boot-test-autoconfigure/src/main/java/org/springframework/boot/test/autoconfigure/data/mongo/DataMongoTest.java",
                    "file_size": 3838
                },
                {
                    "file_additions": 2,
                    "file_deletions": 0,
                    "file_exists": true,
                    "file_name": "spring-boot-project/spring-boot-test-autoconfigure/src/main/java/org/springframework/boot/test/autoconfigure/data/neo4j/DataNeo4jTest.java",
                    "file_size": 4117
                },
                {
                    "file_additions": 2,
                    "file_deletions": 0,
                    "file_exists": true,
                    "file_name": "spring-boot-project/spring-boot-test-autoconfigure/src/main/java/org/springframework/boot/test/autoconfigure/data/redis/DataRedisTest.java",
                    "file_size": 3662
                },
                {
                    "file_additions": 2,
                    "file_deletions": 0,
                    "file_exists": true,
                    "file_name": "spring-boot-project/spring-boot-test-autoconfigure/src/main/java/org/springframework/boot/test/autoconfigure/jdbc/JdbcTest.java",
                    "file_size": 4538
                },
                {
                    "file_additions": 2,
                    "file_deletions": 0,
                    "file_exists": true,
                    "file_name": "spring-boot-project/spring-boot-test-autoconfigure/src/main/java/org/springframework/boot/test/autoconfigure/jooq/JooqTest.java",
                    "file_size": 4144
                },
                {
                    "file_additions": 2,
                    "file_deletions": 0,
                    "file_exists": true,
                    "file_name": "spring-boot-project/spring-boot-test-autoconfigure/src/main/java/org/springframework/boot/test/autoconfigure/json/JsonTest.java",
                    "file_size": 4288
                },
                {
                    "file_additions": 2,
                    "file_deletions": 0,
                    "file_exists": true,
                    "file_name": "spring-boot-project/spring-boot-test-autoconfigure/src/main/java/org/springframework/boot/test/autoconfigure/orm/jpa/DataJpaTest.java",
                    "file_size": 5321
                },
                {
                    "file_additions": 2,
                    "file_deletions": 0,
                    "file_exists": true,
                    "file_name": "spring-boot-project/spring-boot-test-autoconfigure/src/main/java/org/springframework/boot/test/autoconfigure/web/client/RestClientTest.java",
                    "file_size": 5234
                },
                {
                    "file_additions": 2,
                    "file_deletions": 0,
                    "file_exists": true,
                    "file_name": "spring-boot-project/spring-boot-test-autoconfigure/src/main/java/org/springframework/boot/test/autoconfigure/web/reactive/WebFluxTest.java",
                    "file_size": 5832
                },
                {
                    "file_additions": 2,
                    "file_deletions": 0,
                    "file_exists": true,
                    "file_name": "spring-boot-project/spring-boot-test-autoconfigure/src/main/java/org/springframework/boot/test/autoconfigure/web/servlet/WebMvcTest.java",
                    "file_size": 5790
                },
                {
                    "file_additions": 90,
                    "file_deletions": 0,
                    "file_exists": false,
                    "file_name": "spring-boot-project/spring-boot-test-autoconfigure/src/test/java/org/springframework/boot/test/autoconfigure/OverrideConfigurationPropertiesScanContextCustomizerFactoryTests.java",
                    "file_size": 0
                },
                {
                    "file_additions": 48,
                    "file_deletions": 0,
                    "file_exists": false,
                    "file_name": "spring-boot-project/spring-boot-test-autoconfigure/src/test/java/org/springframework/boot/test/autoconfigure/data/jdbc/DataJdbcTestConfigurationPropertiesScanDisabledTests.java",
                    "file_size": 0
                },
                {
                    "file_additions": 30,
                    "file_deletions": 0,
                    "file_exists": false,
                    "file_name": "spring-boot-project/spring-boot-test-autoconfigure/src/test/java/org/springframework/boot/test/autoconfigure/data/jdbc/ExampleProperties.java",
                    "file_size": 0
                },
                {
                    "file_additions": 48,
                    "file_deletions": 0,
                    "file_exists": false,
                    "file_name": "spring-boot-project/spring-boot-test-autoconfigure/src/test/java/org/springframework/boot/test/autoconfigure/data/ldap/DataLdapTestConfigurationPropertiesScanDisabledTests.java",
                    "file_size": 0
                },
                {
                    "file_additions": 30,
                    "file_deletions": 0,
                    "file_exists": false,
                    "file_name": "spring-boot-project/spring-boot-test-autoconfigure/src/test/java/org/springframework/boot/test/autoconfigure/data/ldap/ExampleProperties.java",
                    "file_size": 0
                },
                {
                    "file_additions": 48,
                    "file_deletions": 0,
                    "file_exists": false,
                    "file_name": "spring-boot-project/spring-boot-test-autoconfigure/src/test/java/org/springframework/boot/test/autoconfigure/data/mongo/DataMongoTestConfigurationPropertiesScanDisabledTests.java",
                    "file_size": 0
                },
                {
                    "file_additions": 30,
                    "file_deletions": 0,
                    "file_exists": false,
                    "file_name": "spring-boot-project/spring-boot-test-autoconfigure/src/test/java/org/springframework/boot/test/autoconfigure/data/mongo/ExampleProperties.java",
                    "file_size": 0
                },
                {
                    "file_additions": 73,
                    "file_deletions": 0,
                    "file_exists": false,
                    "file_name": "spring-boot-project/spring-boot-test-autoconfigure/src/test/java/org/springframework/boot/test/autoconfigure/data/neo4j/DataNeo4jTestConfigurationPropertiesScanDisabledTests.java",
                    "file_size": 0
                },
                {
                    "file_additions": 30,
                    "file_deletions": 0,
                    "file_exists": false,
                    "file_name": "spring-boot-project/spring-boot-test-autoconfigure/src/test/java/org/springframework/boot/test/autoconfigure/data/neo4j/ExampleProperties.java",
                    "file_size": 0
                },
                {
                    "file_additions": 48,
                    "file_deletions": 0,
                    "file_exists": false,
                    "file_name": "spring-boot-project/spring-boot-test-autoconfigure/src/test/java/org/springframework/boot/test/autoconfigure/data/redis/DataRedisTestConfigurationPropertiesScanDisabledTests.java",
                    "file_size": 0
                },
                {
                    "file_additions": 30,
                    "file_deletions": 0,
                    "file_exists": false,
                    "file_name": "spring-boot-project/spring-boot-test-autoconfigure/src/test/java/org/springframework/boot/test/autoconfigure/data/redis/ExampleProperties.java",
                    "file_size": 0
                },
                {
                    "file_additions": 30,
                    "file_deletions": 0,
                    "file_exists": false,
                    "file_name": "spring-boot-project/spring-boot-test-autoconfigure/src/test/java/org/springframework/boot/test/autoconfigure/jdbc/ExampleProperties.java",
                    "file_size": 0
                },
                {
                    "file_additions": 48,
                    "file_deletions": 0,
                    "file_exists": false,
                    "file_name": "spring-boot-project/spring-boot-test-autoconfigure/src/test/java/org/springframework/boot/test/autoconfigure/jdbc/JdbcTestConfigurationPropertiesScanDisabledTests.java",
                    "file_size": 0
                },
                {
                    "file_additions": 30,
                    "file_deletions": 0,
                    "file_exists": false,
                    "file_name": "spring-boot-project/spring-boot-test-autoconfigure/src/test/java/org/springframework/boot/test/autoconfigure/jooq/ExampleProperties.java",
                    "file_size": 0
                },
                {
                    "file_additions": 48,
                    "file_deletions": 0,
                    "file_exists": false,
                    "file_name": "spring-boot-project/spring-boot-test-autoconfigure/src/test/java/org/springframework/boot/test/autoconfigure/jooq/JooqTestConfigurationPropertiesScanDisabledTests.java",
                    "file_size": 0
                },
                {
                    "file_additions": 52,
                    "file_deletions": 0,
                    "file_exists": false,
                    "file_name": "spring-boot-project/spring-boot-test-autoconfigure/src/test/java/org/springframework/boot/test/autoconfigure/json/JsonTestConfigurationPropertiesScanDisabledTests.java",
                    "file_size": 0
                },
                {
                    "file_additions": 31,
                    "file_deletions": 0,
                    "file_exists": false,
                    "file_name": "spring-boot-project/spring-boot-test-autoconfigure/src/test/java/org/springframework/boot/test/autoconfigure/json/app/ExampleProperties.java",
                    "file_size": 0
                },
                {
                    "file_additions": 48,
                    "file_deletions": 0,
                    "file_exists": false,
                    "file_name": "spring-boot-project/spring-boot-test-autoconfigure/src/test/java/org/springframework/boot/test/autoconfigure/orm/jpa/DataJpaTestConfigurationPropertiesScanDisabledTests.java",
                    "file_size": 0
                },
                {
                    "file_additions": 30,
                    "file_deletions": 0,
                    "file_exists": false,
                    "file_name": "spring-boot-project/spring-boot-test-autoconfigure/src/test/java/org/springframework/boot/test/autoconfigure/orm/jpa/ExampleProperties.java",
                    "file_size": 0
                },
                {
                    "file_additions": 31,
                    "file_deletions": 0,
                    "file_exists": false,
                    "file_name": "spring-boot-project/spring-boot-test-autoconfigure/src/test/java/org/springframework/boot/test/autoconfigure/override/ExampleTestProperties.java",
                    "file_size": 0
                },
                {
                    "file_additions": 31,
                    "file_deletions": 0,
                    "file_exists": false,
                    "file_name": "spring-boot-project/spring-boot-test-autoconfigure/src/test/java/org/springframework/boot/test/autoconfigure/override/scan/ExampleProperties.java",
                    "file_size": 0
                },
                {
                    "file_additions": 31,
                    "file_deletions": 0,
                    "file_exists": false,
                    "file_name": "spring-boot-project/spring-boot-test-autoconfigure/src/test/java/org/springframework/boot/test/autoconfigure/override/scan/OverrideConfigurationPropertiesScanApplication.java",
                    "file_size": 0
                },
                {
                    "file_additions": 67,
                    "file_deletions": 0,
                    "file_exists": false,
                    "file_name": "spring-boot-project/spring-boot-test-autoconfigure/src/test/java/org/springframework/boot/test/autoconfigure/override/scan/OverrideConfigurationPropertiesScanEnabledFalseIntegrationTests.java",
                    "file_size": 0
                },
                {
                    "file_additions": 51,
                    "file_deletions": 0,
                    "file_exists": false,
                    "file_name": "spring-boot-project/spring-boot-test-autoconfigure/src/test/java/org/springframework/boot/test/autoconfigure/override/scan/OverrideConfigurationPropertiesScanEnabledTrueIntegrationTests.java",
                    "file_size": 0
                },
                {
                    "file_additions": 30,
                    "file_deletions": 0,
                    "file_exists": true,
                    "file_name": "spring-boot-project/spring-boot-test-autoconfigure/src/test/java/org/springframework/boot/test/autoconfigure/web/client/ExampleProperties.java",
                    "file_size": 1394
                },
                {
                    "file_additions": 48,
                    "file_deletions": 0,
                    "file_exists": false,
                    "file_name": "spring-boot-project/spring-boot-test-autoconfigure/src/test/java/org/springframework/boot/test/autoconfigure/web/client/RestClientTestConfigurationPropertiesScanDisabledTests.java",
                    "file_size": 0
                },
                {
                    "file_additions": 31,
                    "file_deletions": 0,
                    "file_exists": false,
                    "file_name": "spring-boot-project/spring-boot-test-autoconfigure/src/test/java/org/springframework/boot/test/autoconfigure/web/reactive/webclient/ExampleProperties.java",
                    "file_size": 0
                },
                {
                    "file_additions": 49,
                    "file_deletions": 0,
                    "file_exists": false,
                    "file_name": "spring-boot-project/spring-boot-test-autoconfigure/src/test/java/org/springframework/boot/test/autoconfigure/web/reactive/webclient/WebFluxTestConfigurationPropertiesScanDisabledTests.java",
                    "file_size": 0
                },
                {
                    "file_additions": 31,
                    "file_deletions": 0,
                    "file_exists": false,
                    "file_name": "spring-boot-project/spring-boot-test-autoconfigure/src/test/java/org/springframework/boot/test/autoconfigure/web/servlet/mockmvc/ExampleProperties.java",
                    "file_size": 0
                },
                {
                    "file_additions": 49,
                    "file_deletions": 0,
                    "file_exists": false,
                    "file_name": "spring-boot-project/spring-boot-test-autoconfigure/src/test/java/org/springframework/boot/test/autoconfigure/web/servlet/mockmvc/WebMvcTestConfigurationPropertiesScanDisabledTests.java",
                    "file_size": 0
                },
                {
                    "file_additions": 5,
                    "file_deletions": 0,
                    "file_exists": true,
                    "file_name": "spring-boot-project/spring-boot/src/main/java/org/springframework/boot/context/properties/ConfigurationPropertiesScan.java",
                    "file_size": 2966
                },
                {
                    "file_additions": 11,
                    "file_deletions": 2,
                    "file_exists": true,
                    "file_name": "spring-boot-project/spring-boot/src/main/java/org/springframework/boot/context/properties/ConfigurationPropertiesScanRegistrar.java",
                    "file_size": 4911
                },
                {
                    "file_additions": 18,
                    "file_deletions": 1,
                    "file_exists": true,
                    "file_name": "spring-boot-project/spring-boot/src/test/java/org/springframework/boot/context/properties/ConfigurationPropertiesScanRegistrarTests.java",
                    "file_size": 6265
                }
            ],
            "interesting": {
                "reopened": true,
                "status": true
            },
            "sha": "3b4ff7d74641bd453554df22bc4eaa55da4522d4"
        },
        {
            "diff": "spring-projects_spring-boot/issue_16659/commit_a3e94f4412639949d09ba33f0dc979efb43ea5b7.diff",
            "diff_additions": 167,
            "diff_deletions": 5,
            "diff_file_size": 24450,
            "files": [
                {
                    "file_additions": 41,
                    "file_deletions": 0,
                    "file_exists": true,
                    "file_name": "spring-boot-project/spring-boot-test-autoconfigure/src/test/java/org/springframework/boot/test/autoconfigure/web/client/ExampleProperties.java",
                    "file_size": 1394
                },
                {
                    "file_additions": 6,
                    "file_deletions": 0,
                    "file_exists": true,
                    "file_name": "spring-boot-project/spring-boot-test-autoconfigure/src/test/java/org/springframework/boot/test/autoconfigure/web/client/RestClientTestNoComponentIntegrationTests.java",
                    "file_size": 2423
                },
                {
                    "file_additions": 46,
                    "file_deletions": 0,
                    "file_exists": true,
                    "file_name": "spring-boot-project/spring-boot-test-autoconfigure/src/test/java/org/springframework/boot/test/autoconfigure/web/client/RestClientTestWithConfigurationPropertiesIntegrationTests.java",
                    "file_size": 1727
                },
                {
                    "file_additions": 4,
                    "file_deletions": 0,
                    "file_exists": true,
                    "file_name": "spring-boot-project/spring-boot/src/main/java/org/springframework/boot/context/properties/ConfigurationPropertiesScanRegistrar.java",
                    "file_size": 4911
                },
                {
                    "file_additions": 6,
                    "file_deletions": 3,
                    "file_exists": true,
                    "file_name": "spring-boot-project/spring-boot/src/test/java/org/springframework/boot/context/properties/ConfigurationPropertiesScanRegistrarTests.java",
                    "file_size": 6265
                },
                {
                    "file_additions": 52,
                    "file_deletions": 0,
                    "file_exists": true,
                    "file_name": "spring-boot-project/spring-boot/src/test/java/org/springframework/boot/context/properties/ConfigurationPropertiesScanTests.java",
                    "file_size": 6210
                },
                {
                    "file_additions": 12,
                    "file_deletions": 2,
                    "file_exists": true,
                    "file_name": "spring-boot-project/spring-boot/src/test/java/org/springframework/boot/context/properties/scan/valid/b/BScanConfiguration.java",
                    "file_size": 1520
                }
            ],
            "interesting": {
                "reopened": false,
                "status": false
            },
            "sha": "a3e94f4412639949d09ba33f0dc979efb43ea5b7"
        }
    ],
    "first_commit": "2019-05-10 21:20:36",
    "last_commit": "2019-07-15 13:05:12",
    "number": 16659,
    "score": 400.00243753808655
}