{
    "covered_issues": [
        14591,
        14546,
        14544,
        14539,
        14530,
        14519,
        14516,
        14509,
        14495,
        14494,
        14492,
        14482,
        14480,
        14477,
        14476,
        14475,
        14472,
        14466,
        14463,
        14462,
        14459,
        14451,
        14447,
        14446,
        14441,
        14440,
        14438,
        14437,
        14418,
        14414,
        14410,
        14406,
        14402,
        14400,
        14399,
        14398,
        14395,
        14394,
        14391,
        14390,
        14377,
        14376,
        14375,
        14374,
        14373,
        14368,
        14365,
        14361,
        14360,
        14359,
        14358,
        14349,
        14337,
        14336,
        14335,
        14334,
        14332,
        14330,
        14327,
        14323,
        14322,
        14317,
        14315,
        14313,
        14307,
        14303,
        14298,
        14297,
        14294,
        14286,
        14285,
        14283,
        14275,
        14274,
        14272,
        14268,
        14267,
        14265,
        14263,
        14258,
        14254,
        14253,
        14251,
        14246,
        14245,
        14242,
        14230,
        14229,
        14226,
        14225,
        14216,
        14212,
        14198,
        14183,
        14177,
        14176,
        14175,
        14171,
        14170,
        14169,
        14166,
        14153,
        14143,
        14142,
        14141,
        14138,
        14131,
        14105,
        14101,
        14098,
        14097,
        14091,
        14085,
        14084,
        14079,
        14071,
        14070,
        14069,
        14068,
        14057,
        14046,
        14045,
        14041,
        14036,
        14034,
        14033,
        14027,
        14025,
        14024,
        14020,
        14011,
        14010,
        14005,
        14003,
        13997,
        13995,
        13993,
        13986,
        13981,
        13976,
        13974,
        13969,
        13959,
        13957,
        13950,
        13944,
        13943,
        13938,
        13936,
        13933,
        13931,
        13919,
        13918,
        13917,
        13914,
        13912,
        13910,
        13909,
        13896,
        13893,
        13891,
        13890,
        13883,
        13881,
        13873,
        13868,
        13865,
        13864,
        13854,
        13844,
        13840,
        13838,
        13836,
        13827,
        13826,
        13823,
        13820,
        13818,
        13815,
        13812,
        13810,
        13806,
        13795,
        13793,
        13789,
        13784,
        13782,
        13779,
        13773,
        13767,
        13766,
        13763,
        13753,
        13751,
        13747,
        13744,
        13740,
        13739,
        13727,
        13725,
        13718,
        13709,
        13708,
        13703,
        13698,
        13695,
        13688,
        13685,
        13682,
        13679,
        13674,
        13673,
        13664,
        13662,
        13659,
        13656,
        13654,
        13649,
        13636,
        13634,
        13633,
        13631,
        13628,
        13627,
        13624,
        13623,
        13622,
        13619,
        13618,
        13617,
        13616,
        13613,
        13610,
        13603,
        13602,
        13601,
        13600,
        13594,
        13582,
        13579,
        13578,
        13576,
        13572,
        13569,
        13567,
        13561,
        13559,
        13557,
        13555,
        13554,
        13553,
        13550,
        13544,
        13542,
        13539,
        13536,
        13529,
        13528,
        13527,
        13524,
        13522,
        13521,
        13518,
        13516,
        13511,
        13509,
        13506,
        13503,
        13501,
        13495,
        13494,
        13492,
        13486,
        13483,
        13482,
        13474,
        13472,
        13471,
        13469,
        13457,
        13453,
        13451,
        13449,
        13446,
        13441,
        13433,
        13430,
        13429,
        13428,
        13427,
        13425,
        13423,
        13422,
        13420,
        13419,
        13414,
        13411,
        13410,
        13407,
        13403,
        13396,
        13386,
        13383,
        13379,
        13370,
        13365,
        13364,
        13363,
        13361,
        13360,
        13354,
        13352,
        13345,
        13344,
        13343,
        13342,
        13340,
        13332,
        13330,
        13325,
        13323,
        13322,
        13314,
        13303,
        13302,
        13300,
        13299,
        13295,
        13293,
        13292,
        13291,
        13287,
        13283,
        13277,
        13275,
        13273,
        13271,
        13270,
        13265,
        13263,
        13260,
        13255,
        13244,
        13243,
        13237,
        13235,
        13222,
        13221,
        13219,
        13214,
        13211,
        13208,
        13205,
        13197,
        13192,
        13188,
        13185,
        13184,
        13183,
        13182,
        13179,
        13178,
        13177,
        13175,
        13174,
        13173,
        13168,
        13163,
        13161,
        13157,
        13154,
        13153,
        13150,
        13149,
        13148,
        13141,
        13128,
        13127,
        13126,
        13125,
        13124,
        13123,
        13122,
        13121,
        13120,
        13119,
        13118,
        13117,
        13115,
        13107,
        13102,
        13098,
        13086,
        13082,
        13081,
        13072,
        13069,
        13068,
        13066,
        13065,
        13064,
        13057,
        13049,
        13046,
        13037,
        13028,
        13020,
        13017,
        13016,
        13015,
        13009,
        13004,
        13002,
        12996,
        12994,
        12993,
        12992,
        12991,
        12990,
        12989,
        12988,
        12987,
        12985,
        12984,
        12983,
        12982,
        12980,
        12979,
        12976,
        12972,
        12969,
        12965,
        12954,
        12953,
        12946,
        12945,
        12942,
        12938,
        12937,
        12919,
        12918,
        12914,
        12912,
        12908,
        12906,
        12903,
        12892,
        12891,
        12885,
        12880,
        12879,
        12878,
        12876,
        12869,
        12868,
        12867,
        12865,
        12864,
        12862,
        12858,
        12852,
        12848,
        12842,
        12840,
        12839,
        12838,
        12837,
        12832,
        12830,
        12829,
        12828,
        12827,
        12820,
        12819,
        12815,
        12811,
        12809,
        12798,
        12797,
        12792,
        12776,
        12774,
        12768,
        12766,
        12765,
        12764,
        12763,
        12757,
        12756,
        12748,
        12746,
        12743,
        12742,
        12736,
        12734,
        12731,
        12722,
        12720,
        12714,
        12713,
        12711,
        12710,
        12709,
        12707,
        12704,
        12703,
        12702,
        12699,
        12697,
        12695,
        12686,
        12685,
        12684,
        12680,
        12674,
        12667,
        12652,
        12644,
        12640,
        12635,
        12634,
        12633,
        12630,
        12629,
        12627,
        12626,
        12619,
        12617,
        12612,
        12600,
        12598,
        12590,
        12589,
        12588,
        12584,
        12570,
        12568,
        12566,
        12565,
        12564,
        12563,
        12562,
        12558,
        12556,
        12553,
        12552,
        12551,
        12546,
        12543,
        12542,
        12541,
        12539,
        12532,
        12529,
        12528,
        12520,
        12517,
        12516,
        12514,
        12513,
        12510,
        12506,
        12504,
        12502,
        12501,
        12488,
        12487,
        12484,
        12477,
        12476,
        12471,
        12462,
        12455,
        12454,
        12453,
        12449,
        12447,
        12446,
        12445,
        12440,
        12438,
        12436,
        12432,
        12428,
        12425,
        12424,
        12423,
        12416,
        12415,
        12412,
        12409,
        12406,
        12405,
        12404,
        12403,
        12395,
        12394,
        12393,
        12388,
        12387,
        12386,
        12384,
        12382,
        12381,
        12378,
        12377,
        12376,
        12368,
        12364,
        12356,
        12355,
        12354,
        12353,
        12351,
        12350,
        12349,
        12348,
        12345,
        12341,
        12340,
        12332,
        12327,
        12324,
        12323,
        12317,
        12316,
        12315,
        12306,
        12303,
        12301,
        12298,
        12294,
        12293,
        12290,
        12287,
        12286,
        12284,
        12281,
        12278,
        12277,
        12276,
        12269,
        12268,
        12261,
        12260,
        12254,
        12249,
        12246,
        12244,
        12243,
        12240,
        12239,
        12234,
        12227,
        12225,
        12224,
        12223,
        12220,
        12219,
        12217,
        12213,
        12211,
        12210,
        12207,
        12204,
        12202,
        12199,
        12197,
        12195,
        12194,
        12193,
        12192,
        12191,
        12190,
        12189,
        12183,
        12168,
        12165,
        12157,
        12156,
        12155,
        12154,
        12152,
        12151,
        12150,
        12148,
        12147,
        12146,
        12145,
        12143,
        12139,
        12138,
        12135,
        12134,
        12133,
        12132,
        12130,
        12129,
        12120,
        12119,
        12118,
        12117,
        12116,
        12115,
        12114,
        12113,
        12105,
        12102,
        12091,
        12086,
        12084,
        12083,
        12082,
        12078,
        12077,
        12071,
        12069,
        12068,
        12066,
        12064,
        12060,
        12058,
        12056,
        12054,
        12050,
        12049,
        12047,
        12040,
        12034,
        12027,
        12025,
        12015,
        12012,
        12007,
        12006,
        12002,
        11999,
        11994,
        11990,
        11987,
        11979,
        11978,
        11975,
        11974,
        11965,
        11960,
        11957,
        11952,
        11949,
        11942,
        11940,
        11938,
        11937,
        11936,
        11931,
        11930,
        11929,
        11925,
        11924,
        11922,
        11910,
        11904,
        11903,
        11901,
        11899,
        11890,
        11882,
        11879,
        11875,
        11871,
        11870,
        11865,
        11864,
        11863,
        11862,
        11861,
        11859,
        11856,
        11854,
        11853,
        11847,
        11845,
        11844,
        11843,
        11841,
        11838,
        11836,
        11829,
        11827,
        11823,
        11822,
        11820,
        11819,
        11818,
        11814,
        11812,
        11811,
        11810,
        11805,
        11800,
        11799,
        11796,
        11791,
        11786,
        11784,
        11778,
        11776,
        11771,
        11766,
        11764,
        11761,
        11760,
        11753,
        11747,
        11743,
        11742,
        11730,
        11729,
        11727,
        11726,
        11721,
        11720,
        11719,
        11716,
        11714,
        11713,
        11711,
        11701,
        11699,
        11695,
        11694,
        11692,
        11690,
        11687,
        11686,
        11685,
        11684,
        11672,
        11671,
        11670,
        11667,
        11665,
        11664,
        11661,
        11658,
        11653,
        11650,
        11649,
        11646,
        11645,
        11642,
        11641,
        11639,
        11633,
        11632,
        11631,
        11627,
        11623,
        11622,
        11621,
        11619,
        11618,
        11611,
        11606,
        11605,
        11597,
        11594,
        11571,
        11564,
        11563,
        11559,
        11556,
        11552,
        11551,
        11549,
        11547,
        11540,
        11538,
        11533,
        11523,
        11521,
        11519,
        11510,
        11509,
        11500,
        11497,
        11492,
        11490,
        11487,
        11471,
        11469,
        11467,
        11459,
        11456,
        11455,
        11449,
        11437,
        11436,
        11433,
        11432,
        11429,
        11428,
        11424,
        11423,
        11418,
        11408,
        11397,
        11392,
        11389,
        11381,
        11376,
        11366,
        11351,
        11350,
        11333,
        11320,
        11316,
        11309,
        11306,
        11305,
        11301,
        11298,
        11297,
        11294,
        11293,
        11286,
        11284,
        11281,
        11280,
        11276,
        11274,
        11266,
        11265,
        11259,
        11256,
        11255,
        11247,
        11245,
        11244,
        11241,
        11237,
        11235,
        11233,
        11226,
        11221,
        11212,
        11211,
        11209,
        11208,
        11205,
        11201,
        11194,
        11192,
        11182,
        11179,
        11178,
        11174,
        11168,
        11163,
        11162,
        11157,
        11156,
        11153,
        11141,
        11139,
        11135,
        11132,
        11131,
        11129,
        11128,
        11121,
        11109,
        11108,
        11105,
        11098,
        11094,
        11077,
        11073,
        11066,
        11064,
        11050,
        11035,
        11032,
        11020,
        11008,
        11005,
        11002,
        11001,
        10998,
        10994,
        10979,
        10978,
        10974,
        10970,
        10962,
        10951,
        10948,
        10940,
        10938,
        10921,
        10918,
        10915,
        10914,
        10908,
        10906,
        10898,
        10896,
        10894,
        10886,
        10877,
        10869,
        10868,
        10867,
        10859,
        10853,
        10842,
        10835,
        10822,
        10817,
        10812,
        10792,
        10773,
        10770,
        10769,
        10759,
        10754,
        10749,
        10744,
        10743,
        10737,
        10735,
        10731,
        10727,
        10726,
        10717,
        10716,
        10706,
        10705,
        10704,
        10701,
        10697,
        10695,
        10694,
        10692,
        10688,
        10687,
        10682,
        10681,
        10675,
        10671,
        10670,
        10661,
        10659,
        10649,
        10648,
        10645,
        10641,
        10638,
        10634,
        10630,
        10628,
        10627,
        10624,
        10617,
        10614,
        10612,
        10600,
        10597,
        10596,
        10595,
        10592,
        10591,
        10585,
        10583,
        10581,
        10571,
        10569,
        10560,
        10554,
        10553,
        10552,
        10543,
        10542,
        10537,
        10535,
        10534,
        10532,
        10527,
        10525,
        10522,
        10513,
        10503,
        10498,
        10494,
        10492,
        10491,
        10485,
        10484,
        10482,
        10481,
        10480,
        10477,
        10470,
        10463,
        10462,
        10460,
        10458,
        10455,
        10445,
        10444,
        10438,
        10437,
        10435,
        10433,
        10427,
        10422,
        10416,
        10415,
        10413,
        10406,
        10405,
        10404,
        10401,
        10395,
        10384,
        10379,
        10373,
        10366,
        10358,
        10357,
        10356,
        10355,
        10354,
        10353,
        10352,
        10351,
        10350,
        10347,
        10345,
        10340,
        10332,
        10322,
        10315,
        10313,
        10306,
        10304,
        10299,
        10294,
        10291,
        10290,
        10288,
        10286,
        10284,
        10283,
        10282,
        10279,
        10277,
        10273,
        10272,
        10271,
        10270,
        10269,
        10267,
        10263,
        10262,
        10261,
        10260,
        10258,
        10255,
        10254,
        10250,
        10244,
        10241,
        10233,
        10226,
        10225,
        10224,
        10212,
        10210,
        10204,
        10203,
        10201,
        10200,
        10199,
        10198,
        10197,
        10193,
        10192,
        10183,
        10182,
        10181,
        10178,
        10177,
        10175,
        10172,
        10171,
        10168,
        10167,
        10166,
        10161,
        10160,
        10158,
        10157,
        10155,
        10153,
        10149,
        10145,
        10133,
        10131,
        10129,
        10115,
        10114,
        10111,
        10109,
        10106,
        10095,
        10087,
        10083,
        10075,
        10069,
        10067,
        10066,
        10060,
        10057,
        10056,
        10049,
        10040,
        10038,
        10035,
        10031,
        10030,
        10027,
        10019,
        10017,
        10016,
        10015,
        10010,
        10007,
        10003,
        10001,
        9999,
        9993,
        9990,
        9988,
        9987,
        9985,
        9984,
        9978,
        9975,
        9972,
        9968,
        9967,
        9955,
        9952,
        9951,
        9950,
        9944,
        9940,
        9936,
        9934,
        9933,
        9927,
        9925,
        9921,
        9918,
        9915,
        9911,
        9909,
        9904,
        9896,
        9893,
        9872,
        9871,
        9869,
        9867,
        9866,
        9859,
        9858,
        9855,
        9839,
        9837,
        9831,
        9829,
        9824,
        9822,
        9816,
        9803,
        9798,
        9794,
        9790,
        9789,
        9784,
        9783,
        9778,
        9773,
        9772,
        9771,
        9768,
        9767,
        9763,
        9757,
        9756,
        9754,
        9748,
        9746,
        9743,
        9739,
        9737,
        9736,
        9732,
        9730,
        9728,
        9726,
        9724,
        9722,
        9714,
        9712,
        9711,
        9709,
        9708,
        9704,
        9703,
        9701,
        9696,
        9691,
        9690,
        9685,
        9684,
        9676,
        9673,
        9671,
        9665,
        9663,
        9658,
        9657,
        9645,
        9641,
        9640,
        9622,
        9617,
        9616,
        9611,
        9610,
        9605,
        9601,
        9597,
        9594,
        9593,
        9592,
        9589,
        9588,
        9585,
        9583,
        9571,
        9568,
        9566,
        9564,
        9561,
        9560,
        9557,
        9555,
        9549,
        9548,
        9545,
        9541,
        9540,
        9538,
        9536,
        9530,
        9528,
        9526,
        9525,
        9524,
        9523,
        9522,
        9521,
        9520,
        9517,
        9515,
        9509,
        9508,
        9507,
        9503,
        9500,
        9495,
        9490,
        9489,
        9487,
        9480,
        9475,
        9468,
        9465,
        9458,
        9457,
        9455,
        9454,
        9439,
        9431,
        9426,
        9422,
        9412,
        9411,
        9392,
        9385,
        9375,
        9374,
        9368,
        9367,
        9361,
        9360,
        9359,
        9358,
        9357,
        9355,
        9354,
        9352,
        9349,
        9344,
        9338,
        9337,
        9336,
        9334,
        9330,
        9329,
        9316,
        9315,
        9314,
        9307,
        9306,
        9302,
        9300,
        9299,
        9290,
        9287,
        9276,
        9264,
        9263,
        9262,
        9259,
        9256,
        9252,
        9249,
        9245,
        9244,
        9238,
        9235,
        9222,
        9221,
        9220,
        9213,
        9211,
        9198,
        9189,
        9187,
        9183,
        9180,
        9173,
        9171,
        9167,
        9161,
        9150,
        9148,
        9147,
        9142,
        9139,
        9134,
        9128,
        9125,
        9124,
        9122,
        9119,
        9116,
        9115,
        9113,
        9105,
        9099,
        9096,
        9095,
        9092,
        9089,
        9088,
        9080,
        9078,
        9073,
        9069,
        9068,
        9061,
        9053,
        9049,
        9048,
        9046,
        9043,
        9036,
        9026,
        9025,
        9023,
        9014,
        9006,
        9003,
        8998,
        8997,
        8996,
        8989,
        8988,
        8983,
        8982,
        8980,
        8977,
        8976,
        8975,
        8974,
        8973,
        8972,
        8961,
        8960,
        8957,
        8954,
        8950,
        8949,
        8948,
        8947,
        8946,
        8941,
        8939,
        8937,
        8936,
        8935,
        8934,
        8933,
        8932,
        8931,
        8924,
        8923,
        8919,
        8918,
        8914,
        8913,
        8911,
        8907,
        8904,
        8896,
        8895,
        8885,
        8884,
        8881,
        8880,
        8879,
        8875,
        8873,
        8872,
        8870,
        8865,
        8864,
        8863,
        8859,
        8854,
        8853,
        8842,
        8841,
        8838,
        8837,
        8836,
        8833,
        8832,
        8831,
        8827,
        8824,
        8822,
        8821,
        8820,
        8817,
        8816,
        8815,
        8814,
        8809,
        8807,
        8801,
        8800,
        8798,
        8796,
        8795,
        8791,
        8787,
        8784,
        8782,
        8779,
        8777,
        8775,
        8772,
        8771,
        8769,
        8768,
        8766,
        8761,
        8760,
        8758,
        8757,
        8754,
        8752,
        8751,
        8748,
        8746,
        8744,
        8738,
        8737,
        8735,
        8732,
        8731,
        8726,
        8725,
        8724,
        8723,
        8718,
        8717,
        8712,
        8711,
        8707,
        8705,
        8702,
        8701,
        8699,
        8689,
        8688,
        8684,
        8677,
        8675,
        8673,
        8671,
        8670,
        8667,
        8655,
        8652,
        8645,
        8644,
        8643,
        8636,
        8635,
        8633,
        8631,
        8624,
        8619,
        8617,
        8613,
        8605,
        8595,
        8594,
        8592,
        8589,
        8583,
        8582,
        8579,
        8577,
        8576,
        8575,
        8573,
        8570,
        8568,
        8567,
        8565,
        8563,
        8562,
        8559,
        8551,
        8547,
        8545,
        8536,
        8528,
        8522,
        8521,
        8516,
        8515,
        8514,
        8511,
        8500,
        8495,
        8493,
        8491,
        8487,
        8484,
        8478,
        8476,
        8472,
        8471,
        8467,
        8462,
        8460,
        8456,
        8454,
        8452,
        8450,
        8448,
        8440,
        8436,
        8427,
        8426,
        8425,
        8424,
        8416,
        8414,
        8413,
        8408,
        8394,
        8386,
        8385,
        8375,
        8374,
        8373,
        8364,
        8362,
        8361,
        8360,
        8358,
        8357,
        8355,
        8353,
        8352,
        8350,
        8345,
        8339,
        8337,
        8330,
        8328,
        8324,
        8322,
        8317,
        8313,
        8312,
        8304,
        8298,
        8297,
        8296,
        8293,
        8290,
        8289,
        8284,
        8278,
        8277,
        8276,
        8271,
        8268,
        8266,
        8245,
        8243,
        8233,
        8231,
        8228,
        8215,
        8209,
        8207,
        8202,
        8201,
        8194,
        8190,
        8189,
        8182,
        8179,
        8176,
        8171,
        8170,
        8169,
        8166,
        8163,
        8159,
        8156,
        8155,
        8152,
        8143,
        8139,
        8129,
        8128,
        8124,
        8119,
        8118,
        8110,
        8107,
        8106,
        8101,
        8099,
        8091,
        8088,
        8085,
        8084,
        8083,
        8079,
        8078,
        8075,
        8072,
        8071,
        8069,
        8068,
        8067,
        8066,
        8064,
        8062,
        8060,
        8058,
        8057,
        8056,
        8055,
        8052,
        8050,
        8048,
        8046,
        8044,
        8040,
        8039,
        8035,
        8033,
        8032,
        8025,
        8022,
        8021,
        8017,
        8012,
        8011,
        8010,
        8007,
        8006,
        8005,
        8003,
        8002,
        8000,
        7998,
        7996,
        7990,
        7989,
        7987,
        7982,
        7980,
        7966,
        7963,
        7958,
        7956,
        7951,
        7950,
        7939,
        7938,
        7935,
        7932,
        7930,
        7927,
        7926,
        7925,
        7924,
        7923,
        7917,
        7909,
        7908,
        7903,
        7899,
        7898,
        7897,
        7886,
        7883,
        7879,
        7874,
        7872,
        7869,
        7864,
        7863,
        7862,
        7861,
        7851,
        7845,
        7844,
        7843,
        7842,
        7840,
        7837,
        7762,
        7761,
        7758,
        7754,
        7753,
        7751,
        7749,
        7747,
        7741,
        7739,
        7732,
        7730,
        7727,
        7725,
        7723,
        7722,
        7717,
        7715,
        7713,
        7712,
        7706,
        7702,
        7698,
        7694,
        7693,
        7690,
        7686,
        7682,
        7677,
        7675,
        7659,
        7658,
        7657,
        7655,
        7653,
        7651,
        7650,
        7649,
        7641,
        7634,
        7622,
        7618,
        7617,
        7616,
        7612,
        7605,
        7603,
        7600,
        7598,
        7592,
        7590,
        7584,
        7582,
        7578,
        7576,
        7570,
        7568,
        7567,
        7562,
        7559,
        7543,
        7542,
        7539,
        7538,
        7537,
        7536,
        7535,
        7534,
        7528,
        7527,
        7521,
        7508,
        7498,
        7497,
        7495,
        7492,
        7491,
        7490,
        7489,
        7480,
        7471,
        7468,
        7466,
        7461,
        7460,
        7449,
        7447,
        7435,
        7433,
        7428,
        7426,
        7421,
        7419,
        7418,
        7412,
        7411,
        7407,
        7406,
        7398,
        7397,
        7396,
        7395,
        7394,
        7385,
        7384,
        7381,
        7374,
        7372,
        7371,
        7370,
        7367,
        7361,
        7358,
        7357,
        7355,
        7350,
        7348,
        7346,
        7343,
        7332,
        7330,
        7325,
        7323,
        7322,
        7318,
        7315,
        7312,
        7309,
        7305,
        7302,
        7296,
        7295,
        7292,
        7288,
        7284,
        7283,
        7280,
        7278,
        7276,
        7273,
        7271,
        7266,
        7265,
        7262,
        7261,
        7254,
        7252,
        7251,
        7246,
        7244,
        7240,
        7237,
        7235,
        7231,
        7229,
        7228,
        7227,
        7226,
        7224,
        7223,
        7220,
        7216,
        7215,
        7214,
        7213,
        7212,
        7211,
        7204,
        7203,
        7202,
        7200,
        7199,
        7196,
        7186,
        7183,
        7182,
        7178,
        7173,
        7172,
        7161,
        7151,
        7150,
        7147,
        7143,
        7140,
        7137,
        7136,
        7134,
        7133,
        7131,
        7128,
        7127,
        7124,
        7119,
        7118,
        7117,
        7102,
        7093,
        7091,
        7086,
        7084,
        7081,
        7080,
        7079,
        7078,
        7076,
        7075,
        7074,
        7068,
        7067,
        7064,
        7063,
        7061,
        7060,
        7059,
        7055,
        7045,
        7037,
        7036,
        7030,
        7029,
        7025,
        7024,
        7022,
        7016,
        7014,
        7012,
        7010,
        7008,
        7006,
        6999,
        6994,
        6992,
        6989,
        6988,
        6986,
        6983,
        6982,
        6980,
        6978,
        6977,
        6973,
        6971,
        6967,
        6966,
        6964,
        6953,
        6952,
        6946,
        6941,
        6936,
        6933,
        6930,
        6927,
        6926,
        6923,
        6922,
        6921,
        6920,
        6917,
        6914,
        6913,
        6912,
        6911,
        6907,
        6904,
        6903,
        6902,
        6896,
        6884,
        6882,
        6879,
        6873,
        6871,
        6869,
        6867,
        6864,
        6863,
        6859,
        6858,
        6857,
        6856,
        6855,
        6851,
        6850,
        6848,
        6846,
        6845,
        6844,
        6841,
        6840,
        6839,
        6835,
        6834,
        6832,
        6831,
        6829,
        6826,
        6825,
        6822,
        6820,
        6818,
        6814,
        6812,
        6808,
        6805,
        6804,
        6803,
        6801,
        6800,
        6798,
        6789,
        6784,
        6781,
        6780,
        6770,
        6766,
        6765,
        6763,
        6756,
        6755,
        6751,
        6748,
        6743,
        6742,
        6736,
        6735,
        6734,
        6731,
        6727,
        6721,
        6717,
        6716,
        6714,
        6704,
        6703,
        6701,
        6700,
        6698,
        6695,
        6693,
        6692,
        6691,
        6687,
        6685,
        6679,
        6678,
        6675,
        6672,
        6665,
        6658,
        6657,
        6654,
        6649,
        6647,
        6646,
        6644,
        6641,
        6639,
        6637,
        6635,
        6631,
        6625,
        6624,
        6621,
        6620,
        6618,
        6611,
        6610,
        6609,
        6607,
        6605,
        6600,
        6599,
        6598,
        6591,
        6577,
        6576,
        6574,
        6572,
        6571,
        6569,
        6567,
        6565,
        6564,
        6544,
        6543,
        6541,
        6537,
        6534,
        6533,
        6527,
        6525,
        6519,
        6513,
        6512,
        6506,
        6498,
        6496,
        6493,
        6490,
        6489,
        6485,
        6482,
        6481,
        6478,
        6475,
        6474,
        6471,
        6464,
        6462,
        6454,
        6449,
        6447,
        6445,
        6444,
        6441,
        6434,
        6433,
        6431,
        6424,
        6423,
        6422,
        6412,
        6411,
        6403,
        6401,
        6397,
        6396,
        6395,
        6393,
        6391,
        6390,
        6389,
        6387,
        6384,
        6381,
        6377,
        6375,
        6374,
        6369,
        6368,
        6365,
        6364,
        6361,
        6359,
        6357,
        6348,
        6347,
        6345,
        6342,
        6334,
        6333,
        6332,
        6327,
        6326,
        6325,
        6320,
        6319,
        6313,
        6309,
        6307,
        6306,
        6302,
        6301,
        6300,
        6299,
        6296,
        6294,
        6292,
        6289,
        6283,
        6281,
        6263,
        6262,
        6259,
        6257,
        6254,
        6247,
        6242,
        6239,
        6234,
        6228,
        6221,
        6220,
        6213,
        6212,
        6211,
        6203,
        6202,
        6201,
        6199,
        6197,
        6194,
        6193,
        6189,
        6180,
        6166,
        6147,
        6122,
        6121,
        6120,
        6112,
        6110,
        6107,
        6098,
        6097,
        6091,
        6090,
        6086,
        6083,
        6082,
        6081,
        6077,
        6076,
        6072,
        6063,
        6061,
        6058,
        6056,
        6048,
        6046,
        6045,
        6040,
        6034,
        6030,
        6022,
        6012,
        6005,
        6004,
        5985,
        5984,
        5982,
        5979,
        5973,
        5972,
        5965,
        5962,
        5961,
        5957,
        5955,
        5954,
        5953,
        5950,
        5944,
        5940,
        5939,
        5936,
        5934,
        5931,
        5926,
        5924,
        5919,
        5917,
        5915,
        5914,
        5912,
        5902,
        5899,
        5893,
        5891,
        5890,
        5878,
        5873,
        5870,
        5869,
        5867,
        5866,
        5865,
        5864,
        5859,
        5854,
        5849,
        5848,
        5847,
        5846,
        5845,
        5841,
        5840,
        5838,
        5835,
        5830,
        5827,
        5824,
        5820,
        5810,
        5809,
        5807,
        5806,
        5802,
        5797,
        5796,
        5787,
        5786,
        5785,
        5784,
        5781,
        5778,
        5777,
        5775,
        5772,
        5768,
        5764,
        5763,
        5762,
        5751,
        5748,
        5743,
        5740,
        5739,
        5736,
        5735,
        5734,
        5724,
        5723,
        5722,
        5721,
        5718,
        5717,
        5714,
        5711,
        5707,
        5705,
        5703,
        5696,
        5693,
        5691,
        5684,
        5681,
        5671,
        5670,
        5661,
        5659,
        5656,
        5652,
        5643,
        5642,
        5637,
        5636,
        5634,
        5628,
        5614,
        5611,
        5609,
        5605,
        5594,
        5590,
        5588,
        5586,
        5585,
        5571,
        5568,
        5567,
        5559,
        5556,
        5552,
        5549,
        5543,
        5541,
        5540,
        5538,
        5536,
        5531,
        5529,
        5528,
        5527,
        5526,
        5521,
        5517,
        5512,
        5511,
        5509,
        5505,
        5500,
        5497,
        5487,
        5484,
        5480,
        5479,
        5478,
        5475,
        5474,
        5471,
        5465,
        5464,
        5457,
        5456,
        5454,
        5453,
        5440,
        5435,
        5420,
        5413,
        5409,
        5406,
        5405,
        5404,
        5403,
        5398,
        5397,
        5395,
        5394,
        5393,
        5391,
        5389,
        5387,
        5385,
        5382,
        5379,
        5378,
        5376,
        5368,
        5366,
        5362,
        5359,
        5349,
        5347,
        5346,
        5341,
        5340,
        5335,
        5331,
        5330,
        5327,
        5323,
        5317,
        5310,
        5299,
        5298,
        5297,
        5290,
        5289,
        5280,
        5277,
        5264,
        5263,
        5262,
        5261,
        5255,
        5249,
        5248,
        5245,
        5241,
        5236,
        5235,
        5233,
        5232,
        5220,
        5214,
        5213,
        5209,
        5208,
        5206,
        5204,
        5203,
        5202,
        5201,
        5195,
        5194,
        5187,
        5186,
        5183,
        5176,
        5171,
        5168,
        5167,
        5165,
        5148,
        5147,
        5146,
        5143,
        5138,
        5130,
        5129,
        5127,
        5125,
        5124,
        5120,
        5109,
        5107,
        5104,
        5101,
        5098,
        5091,
        5090,
        5087,
        5086,
        5082,
        5076,
        5075,
        5073,
        5070,
        5066,
        5065,
        5063,
        5062,
        5061,
        5059,
        5057,
        5056,
        5055,
        5054,
        5052,
        5051,
        5049,
        5042,
        5041,
        5037,
        5022,
        5015,
        5014,
        5009,
        5006,
        5005,
        5004,
        4996,
        4995,
        4991,
        4990,
        4989,
        4988,
        4987,
        4985,
        4983,
        4978,
        4977,
        4973,
        4970,
        4967,
        4963,
        4962,
        4959,
        4957,
        4954,
        4953,
        4951,
        4945,
        4938,
        4937,
        4936,
        4933,
        4929,
        4925,
        4923,
        4922,
        4915,
        4909,
        4904,
        4897,
        4886,
        4882,
        4877,
        4871,
        4865,
        4864,
        4863,
        4860,
        4859,
        4858,
        4856,
        4852,
        4851,
        4839,
        4833,
        4831,
        4827,
        4825,
        4824,
        4823,
        4822,
        4820,
        4819,
        4817,
        4811,
        4808,
        4807,
        4800,
        4799,
        4796,
        4795,
        4794,
        4788,
        4784,
        4783,
        4782,
        4781,
        4780,
        4777,
        4775,
        4772,
        4771,
        4769,
        4768,
        4764,
        4763,
        4762,
        4759,
        4756,
        4750,
        4749,
        4747,
        4740,
        4739,
        4737,
        4736,
        4734,
        4733,
        4730,
        4726,
        4725,
        4720,
        4716,
        4712,
        4711,
        4710,
        4709,
        4708,
        4707,
        4690,
        4689,
        4688,
        4683,
        4680,
        4679,
        4671,
        4663,
        4659,
        4658,
        4657,
        4656,
        4651,
        4641,
        4640,
        4638,
        4636,
        4626,
        4622,
        4615,
        4611,
        4609,
        4605,
        4601,
        4599,
        4598,
        4597,
        4590,
        4586,
        4585,
        4583,
        4575,
        4574,
        4556,
        4555,
        4554,
        4548,
        4540,
        4539,
        4538,
        4536,
        4535,
        4523,
        4522,
        4521,
        4512,
        4510,
        4508,
        4506,
        4505,
        4496,
        4489,
        4479,
        4471,
        4470,
        4459,
        4458,
        4454,
        4451,
        4446,
        4445,
        4444,
        4441,
        4432,
        4428,
        4423,
        4422,
        4419,
        4417,
        4416,
        4415,
        4413,
        4409,
        4403,
        4392,
        4391,
        4390,
        4388,
        4387,
        4380,
        4370,
        4366,
        4365,
        4360,
        4352,
        4351,
        4347,
        4345,
        4344,
        4343,
        4339,
        4335,
        4334,
        4330,
        4329,
        4324,
        4320,
        4315,
        4314,
        4306,
        4302,
        4301,
        4295,
        4293,
        4292,
        4285,
        4283,
        4280,
        4279,
        4278,
        4272,
        4271,
        4267,
        4237,
        4233,
        4232,
        4228,
        4215,
        4211,
        4200,
        4199,
        4195,
        4189,
        4184,
        4180,
        4177,
        4175,
        4170,
        4169,
        4163,
        4156,
        4155,
        4153,
        4152,
        4151,
        4148,
        4147,
        4142,
        4140,
        4135,
        4133,
        4130,
        4129,
        4127,
        4121,
        4120,
        4113,
        4109,
        4105,
        4103,
        4089,
        4085,
        4080,
        4078,
        4045,
        4042,
        4038,
        4029,
        4028,
        4027,
        4022,
        4021,
        4018,
        4010,
        4005,
        3993,
        3988,
        3980,
        3978,
        3977,
        3968,
        3967,
        3966,
        3965,
        3963,
        3962,
        3960,
        3949,
        3946,
        3945,
        3940,
        3937,
        3932,
        3931,
        3928,
        3923,
        3919,
        3916,
        3909,
        3908,
        3906,
        3903,
        3902,
        3901,
        3900,
        3897,
        3894,
        3892,
        3891,
        3889,
        3885,
        3884,
        3877,
        3876,
        3874,
        3872,
        3867,
        3857,
        3840,
        3837,
        3835,
        3826,
        3818,
        3808,
        3807,
        3806,
        3803,
        3798,
        3796,
        3795,
        3793,
        3792,
        3787,
        3786,
        3785,
        3780,
        3778,
        3777,
        3774,
        3771,
        3767,
        3765,
        3764,
        3752,
        3747,
        3737,
        3733,
        3723,
        3721,
        3719,
        3718,
        3717,
        3715,
        3706,
        3698,
        3696,
        3687,
        3680,
        3677,
        3676,
        3669,
        3665,
        3652,
        3649,
        3645,
        3638,
        3637,
        3634,
        3633,
        3632,
        3626,
        3619,
        3618,
        3616,
        3615,
        3613,
        3610,
        3604,
        3597,
        3595,
        3594,
        3593,
        3589,
        3584,
        3583,
        3582,
        3571,
        3563,
        3562,
        3561,
        3560,
        3558,
        3556,
        3543,
        3541,
        3537,
        3536,
        3534,
        3530,
        3516,
        3513,
        3509,
        3505,
        3504,
        3498,
        3497,
        3493,
        3492,
        3490,
        3486,
        3482,
        3479,
        3477,
        3466,
        3457,
        3450,
        3444,
        3429,
        3417,
        3415,
        3411,
        3407,
        3404,
        3396,
        3377,
        3376,
        3372,
        3363,
        3358,
        3356,
        3351,
        3350,
        3349,
        3341,
        3332,
        3330,
        3315,
        3312,
        3311,
        3308,
        3306,
        3303,
        3302,
        3295,
        3281,
        3280,
        3279,
        3272,
        3270,
        3258,
        3254,
        3251,
        3250,
        3249,
        3241,
        3240,
        3235,
        3232,
        3225,
        3216,
        3215,
        3214,
        3202,
        3191,
        3180,
        3178,
        3151,
        3150,
        3147,
        3143,
        3140,
        3135,
        3134,
        3133,
        3129,
        3128,
        3125,
        3116,
        3109,
        3107,
        3106,
        3102,
        3096,
        3093,
        3081,
        3078,
        3076,
        3063,
        3060,
        3043,
        3041,
        3038,
        3033,
        3031,
        3030,
        3024,
        3020,
        3016,
        3005,
        2995,
        2990,
        2987,
        2985,
        2983,
        2979,
        2978,
        2975,
        2973,
        2963,
        2959,
        2950,
        2936,
        2927,
        2925,
        2923,
        2920,
        2919,
        2913,
        2908,
        2905,
        2893,
        2891,
        2890,
        2886,
        2880,
        2879,
        2878,
        2877,
        2874,
        2873,
        2871,
        2869,
        2867,
        2865,
        2853,
        2852,
        2848,
        2847,
        2846,
        2842,
        2841,
        2833,
        2829,
        2819,
        2817,
        2809,
        2808,
        2804,
        2795,
        2767,
        2763,
        2761,
        2751,
        2740,
        2734,
        2731,
        2730,
        2729,
        2726,
        2724,
        2722,
        2720,
        2718,
        2711,
        2710,
        2708,
        2700,
        2698,
        2691,
        2690,
        2677,
        2675,
        2669,
        2658,
        2647,
        2646,
        2630,
        2622,
        2621,
        2620,
        2615,
        2613,
        2612,
        2611,
        2610,
        2602,
        2601,
        2600,
        2597,
        2593,
        2592,
        2588,
        2580,
        2578,
        2576,
        2574,
        2573,
        2572,
        2563,
        2561,
        2558,
        2555,
        2553,
        2552,
        2551,
        2548,
        2545,
        2542,
        2541,
        2540,
        2539,
        2538,
        2537,
        2536,
        2535,
        2534,
        2533,
        2532,
        2531,
        2530,
        2529,
        2528,
        2527,
        2526,
        2525,
        2524,
        2523,
        2522,
        2521,
        2520,
        2519,
        2518,
        2517,
        2516,
        2515,
        2514,
        2513,
        2512,
        2511,
        2510,
        2509,
        2508,
        2507,
        2506,
        2505,
        2504,
        2503,
        2502,
        2501,
        2499,
        2498,
        2497,
        2496,
        2495,
        2494,
        2493,
        2492,
        2491,
        2490,
        2489,
        2487,
        2486,
        2485,
        2484,
        2483,
        2482,
        2481,
        2479,
        2478,
        2477,
        2476,
        2475,
        2474,
        2473,
        2471,
        2470,
        2469,
        2468,
        2467,
        2466,
        2465,
        2464,
        2462,
        2461,
        2460,
        2459,
        2458,
        2457,
        2456,
        2455,
        2454,
        2453,
        2452,
        2451,
        2450,
        2449,
        2448,
        2447,
        2446,
        2445,
        2444,
        2443,
        2442,
        2441,
        2440,
        2439,
        2438,
        2437,
        2436,
        2435,
        2434,
        2433,
        2432,
        2431,
        2430,
        2429,
        2428,
        2427,
        2426,
        2425,
        2424,
        2423,
        2422,
        2421,
        2420,
        2419,
        2418,
        2417,
        2416,
        2415,
        2414,
        2413,
        2412,
        2411,
        2410,
        2409,
        2408,
        2407,
        2406,
        2405,
        2404,
        2403,
        2401,
        2400,
        2399,
        2398,
        2397,
        2396,
        2395,
        2394,
        2393,
        2392,
        2391,
        2390,
        2389,
        2388,
        2387,
        2386,
        2385,
        2384,
        2383,
        2382,
        2381,
        2380,
        2379,
        2377,
        2376,
        2375,
        2374,
        2373,
        2372,
        2371,
        2369,
        2368,
        2367,
        2366,
        2365,
        2364,
        2363,
        2362,
        2361,
        2360,
        2359,
        2357,
        2356,
        2355,
        2354,
        2353,
        2350,
        2348,
        2347,
        2346,
        2345,
        2336,
        2331,
        2330,
        2325,
        2322,
        2321,
        2315,
        2313,
        2311,
        2308,
        2306,
        2302,
        2296,
        2286,
        2282,
        2276,
        2273,
        2269,
        2266,
        2264,
        2263,
        2262,
        2261,
        2260,
        2258,
        2249,
        2248,
        2245,
        2239,
        2232,
        2220,
        2219,
        2214,
        2213,
        2206,
        2199,
        2197,
        2195,
        2194,
        2189,
        2188,
        2186,
        2185,
        2180,
        2178,
        2176,
        2175,
        2169,
        2168,
        2161,
        2155,
        2152,
        2147,
        2146,
        2141,
        2139,
        2135,
        2133,
        2131,
        2126,
        2125,
        2124,
        2122,
        2119,
        2118,
        2115,
        2114,
        2113,
        2112,
        2111,
        2110,
        2109,
        2108,
        2107,
        2106,
        2105,
        2104,
        2103,
        2101,
        2099,
        2097,
        2094,
        2091,
        2087,
        2085,
        2084,
        2080,
        2072,
        2058,
        2054,
        2048,
        2046,
        2042,
        2038,
        2035,
        2034,
        2033,
        2028,
        2026,
        2024,
        2019,
        2018,
        2016,
        2014,
        2012,
        2006,
        2001,
        1999,
        1998,
        1997,
        1995,
        1989,
        1986,
        1978,
        1970,
        1969,
        1960,
        1959,
        1958,
        1957,
        1955,
        1952,
        1948,
        1935,
        1934,
        1926,
        1923,
        1921,
        1920,
        1919,
        1918,
        1916,
        1915,
        1907,
        1904,
        1903,
        1899,
        1895,
        1887,
        1885,
        1872,
        1866,
        1865,
        1858,
        1855,
        1852,
        1851,
        1843,
        1833,
        1824,
        1820,
        1819,
        1818,
        1812,
        1810,
        1809,
        1800,
        1799,
        1796,
        1791,
        1786,
        1783,
        1781,
        1780,
        1779,
        1777,
        1776,
        1774,
        1771,
        1766,
        1761,
        1760,
        1757,
        1753,
        1752,
        1747,
        1746,
        1744,
        1740,
        1734,
        1733,
        1730,
        1724,
        1723,
        1715,
        1709,
        1703,
        1701,
        1689,
        1685,
        1681,
        1677,
        1675,
        1673,
        1667,
        1665,
        1663,
        1662,
        1661,
        1660,
        1655,
        1653,
        1652,
        1651,
        1649,
        1648,
        1647,
        1645,
        1641,
        1638,
        1637,
        1635,
        1631,
        1630,
        1624,
        1623,
        1621,
        1616,
        1615,
        1611,
        1609,
        1608,
        1607,
        1605,
        1604,
        1602,
        1601,
        1600,
        1599,
        1595,
        1593,
        1591,
        1587,
        1581,
        1580,
        1573,
        1568,
        1567,
        1566,
        1563,
        1556,
        1555,
        1553,
        1550,
        1546,
        1545,
        1544,
        1543,
        1542,
        1537,
        1534,
        1532,
        1531,
        1528,
        1527,
        1526,
        1525,
        1511,
        1507,
        1506,
        1505,
        1504,
        1499,
        1498,
        1497,
        1495,
        1494,
        1492,
        1491,
        1477,
        1454,
        1453,
        1452,
        1446,
        1444,
        1440,
        1437,
        1435,
        1426,
        1425,
        1418,
        1415,
        1405,
        1398,
        1396,
        1391,
        1384,
        1383,
        1381,
        1380,
        1368,
        1364,
        1363,
        1362,
        1361,
        1359,
        1354,
        1352,
        1328,
        1326,
        1309,
        1306,
        1304,
        1303,
        1298,
        1297,
        1290,
        1287,
        1278,
        1274,
        1272,
        1271,
        1268,
        1260,
        1258,
        1256,
        1254,
        1248,
        1246,
        1236,
        1221,
        1213,
        1210,
        1205,
        1202,
        1199,
        1191,
        1190,
        1183,
        1181,
        1180,
        1178,
        1176,
        1158,
        1157,
        1153,
        1152,
        1150,
        1144,
        1143,
        1138,
        1124,
        1121,
        1119,
        1116,
        1108,
        1105,
        1102,
        1101,
        1099,
        1097,
        1096,
        1093,
        1092,
        1091,
        1089,
        1088,
        1087,
        1086,
        1085,
        1082,
        1072,
        1071,
        1061,
        1047,
        1041,
        1037,
        1036,
        1026,
        1011,
        1010,
        1003,
        1002,
        1001,
        993,
        992,
        988,
        978,
        976,
        973,
        971,
        968,
        967,
        966,
        963,
        962,
        959,
        958,
        956,
        955,
        954,
        948,
        947,
        937,
        935,
        930,
        929,
        920,
        919,
        916,
        912,
        908,
        907,
        906,
        905,
        903,
        900,
        899,
        898,
        895,
        894,
        893,
        890,
        889,
        888,
        886,
        883,
        863,
        862,
        861,
        849,
        830,
        828,
        827,
        817,
        806,
        801,
        796,
        793,
        788,
        786,
        778,
        774,
        770,
        765,
        750,
        749,
        746,
        744,
        727,
        726,
        722,
        721,
        719,
        718,
        715,
        711,
        710,
        708,
        707,
        704,
        691,
        685,
        684,
        674,
        673,
        670,
        667,
        661,
        660,
        659,
        658,
        657,
        656,
        654,
        653,
        651,
        644,
        641,
        640,
        625,
        616,
        611,
        609,
        607,
        604,
        602,
        600,
        595,
        594,
        593,
        591,
        586,
        585,
        584,
        581,
        574,
        572,
        568,
        567,
        560,
        558,
        551,
        549,
        543,
        542,
        541,
        537,
        536,
        534,
        532,
        530,
        524,
        522,
        518,
        517,
        516,
        514,
        513,
        508,
        502,
        500,
        496,
        494,
        493,
        492,
        491,
        490,
        487,
        486,
        485,
        483,
        479,
        477,
        475,
        473,
        472,
        471,
        469,
        467,
        464,
        463,
        462,
        461,
        459,
        453,
        447,
        439,
        438,
        431,
        426,
        419,
        414,
        410,
        406,
        402,
        397,
        393,
        387,
        385,
        382,
        378,
        377,
        369,
        366,
        353,
        349,
        347,
        346,
        345,
        340,
        338,
        335,
        333,
        331,
        330,
        329,
        322,
        320,
        319,
        316,
        311,
        310,
        309,
        308,
        307,
        305,
        304,
        303,
        302,
        301,
        298,
        296,
        294,
        289,
        287,
        283,
        282,
        278,
        275,
        272,
        269,
        267,
        265,
        264,
        261,
        259,
        256,
        255,
        248,
        247,
        246,
        245,
        243,
        241,
        240,
        239,
        236,
        235,
        233,
        232,
        231,
        226,
        225,
        224,
        222,
        221,
        217,
        216,
        214,
        213,
        210,
        209,
        202,
        199,
        197,
        190,
        189,
        188,
        187,
        186,
        184,
        182,
        177,
        174,
        169,
        163,
        151,
        146,
        137,
        132,
        87,
        71,
        70,
        69,
        57,
        55,
        43,
        42,
        39,
        34,
        33,
        32,
        25,
        12139,
        2919,
        6977,
        13708,
        7204,
        6914,
        4496,
        4877,
        13883,
        10743,
        13002,
        5087,
        6609,
        7086,
        6302,
        11209,
        2026,
        6121,
        4933,
        11297,
        2115,
        10773,
        2103,
        7022,
        13518,
        9658,
        14466,
        7348,
        9078,
        5849,
        14177,
        2109,
        1903,
        4827,
        4929,
        13503,
        2373,
        5405,
        12225,
        13291,
        4782,
        9053,
        8923,
        2111,
        13578,
        7271,
        3041,
        2189,
        13873,
        12047,
        12306,
        1418,
        3407,
        7182,
        1381,
        9043,
        5109,
        8675,
        2104,
        6544,
        7956,
        12139,
        2919,
        6977,
        13708,
        7204,
        6914,
        4496,
        4877,
        13883,
        10743,
        13002,
        5087,
        6609,
        7086,
        6302,
        11209,
        2026,
        6121,
        4933,
        11297,
        2115,
        10773,
        2103,
        7022,
        13518,
        9658,
        14466,
        7348,
        9078,
        5849,
        14177,
        2109,
        1903,
        4827,
        4929,
        13503,
        2373,
        5405,
        12225,
        13291,
        4782,
        9053,
        8923,
        2111,
        13578,
        7271,
        3041,
        2189,
        13873,
        12047,
        12306,
        1418,
        3407,
        7182,
        1381,
        9043,
        5109,
        8675,
        2104,
        6544,
        7956
    ],
    "finished": true
}