{
    "commits": [
        {
            "associated_pull_request": [],
            "date": "2022-08-11 18:26:20+00:00",
            "diff": "yugabyte_yugabyte-db/issue_13482/commit_53886c91655d9292cc604e5fb1c1cf1a7f3b6664.diff",
            "diff_additions": 27,
            "diff_deletions": 20,
            "diff_file_size": 41231,
            "diff_url": "https://github.com/yugabyte/yugabyte-db/commit/53886c91655d9292cc604e5fb1c1cf1a7f3b6664.diff",
            "exists": true,
            "files": [
                {
                    "file_additions": 27,
                    "file_deletions": 20,
                    "file_exists": true,
                    "file_name": "src/yb/integration-tests/auto_flags-itest.cc",
                    "file_size": 41231
                }
            ],
            "interesting": {
                "reopen": false,
                "status": false
            },
            "is_parent": true,
            "sha": "53886c91655d9292cc604e5fb1c1cf1a7f3b6664"
        },
        {
            "associated_pull_request": [],
            "date": "2022-08-11 16:33:13+00:00",
            "diff": "yugabyte_yugabyte-db/issue_13482/commit_739ea8f6a4d3ce59a22af4103a0b752aa25cf00f.diff",
            "diff_additions": 168,
            "diff_deletions": 99,
            "diff_file_size": 671184,
            "diff_url": "https://github.com/yugabyte/yugabyte-db/commit/739ea8f6a4d3ce59a22af4103a0b752aa25cf00f.diff",
            "exists": true,
            "files": [
                {
                    "file_additions": 4,
                    "file_deletions": 14,
                    "file_exists": true,
                    "file_name": "src/yb/consensus/raft_consensus.cc",
                    "file_size": 161968
                },
                {
                    "file_additions": 10,
                    "file_deletions": 12,
                    "file_exists": true,
                    "file_name": "src/yb/integration-tests/raft_consensus-itest.cc",
                    "file_size": 163232
                },
                {
                    "file_additions": 153,
                    "file_deletions": 47,
                    "file_exists": true,
                    "file_name": "src/yb/integration-tests/remote_bootstrap-itest.cc",
                    "file_size": 98073
                },
                {
                    "file_additions": 1,
                    "file_deletions": 1,
                    "file_exists": true,
                    "file_name": "src/yb/integration-tests/tablet-split-itest.cc",
                    "file_size": 159683
                },
                {
                    "file_additions": 0,
                    "file_deletions": 25,
                    "file_exists": true,
                    "file_name": "src/yb/master/sys_catalog.cc",
                    "file_size": 88228
                }
            ],
            "interesting": {
                "reopen": true,
                "status": false
            },
            "is_parent": false,
            "sha": "739ea8f6a4d3ce59a22af4103a0b752aa25cf00f"
        },
        {
            "associated_pull_request": [],
            "date": "2023-04-25 00:13:54+00:00",
            "diff": "yugabyte_yugabyte-db/issue_13482/commit_d571523c53ccca8ff9db741e1682756e361343dd.diff",
            "diff_additions": 168,
            "diff_deletions": 99,
            "diff_file_size": 671184,
            "diff_url": "https://github.com/yugabyte/yugabyte-db/commit/d571523c53ccca8ff9db741e1682756e361343dd.diff",
            "exists": true,
            "files": [
                {
                    "file_additions": 4,
                    "file_deletions": 14,
                    "file_exists": true,
                    "file_name": "src/yb/consensus/raft_consensus.cc",
                    "file_size": 161968
                },
                {
                    "file_additions": 10,
                    "file_deletions": 12,
                    "file_exists": true,
                    "file_name": "src/yb/integration-tests/raft_consensus-itest.cc",
                    "file_size": 163232
                },
                {
                    "file_additions": 153,
                    "file_deletions": 47,
                    "file_exists": true,
                    "file_name": "src/yb/integration-tests/remote_bootstrap-itest.cc",
                    "file_size": 98073
                },
                {
                    "file_additions": 1,
                    "file_deletions": 1,
                    "file_exists": true,
                    "file_name": "src/yb/integration-tests/tablet-split-itest.cc",
                    "file_size": 159683
                },
                {
                    "file_additions": 0,
                    "file_deletions": 25,
                    "file_exists": true,
                    "file_name": "src/yb/master/sys_catalog.cc",
                    "file_size": 88228
                }
            ],
            "interesting": {
                "reopen": false,
                "status": false
            },
            "is_parent": false,
            "sha": "d571523c53ccca8ff9db741e1682756e361343dd"
        }
    ],
    "first_commit": "2022-08-11 23:11:22+00:00",
    "last_commit": "2023-04-25 00:15:25+00:00",
    "number": 13482,
    "pull_request": "None",
    "score": {
        "accidental_reopen_likely": false,
        "all_labels": [
            "kind/bug",
            "area/docdb",
            "priority/medium",
            "2.14 Backport Required"
        ],
        "contains_keywords": [
            "fail",
            "chang",
            "test",
            "fault",
            "remov",
            "error"
        ],
        "fix_size": 296,
        "has_labels": [],
        "intersecting": {
            "computed_score": 0.8872180451127819,
            "final_commit_size": 266,
            "intersection_size": 236,
            "previous_commits_size": 266
        },
        "is_makefile_based": true,
        "no_new_files": [],
        "no_other_files": true,
        "num_prohibited_files": 45579,
        "prohibited_files": [
            "server/src/main/java/com/genymobile/scrcpy/Device.java",
            "server/src/main/java/com/genymobile/scrcpy/wrappers/SurfaceControl.java",
            "server/src/main/java/com/genymobile/scrcpy/Device.java",
            "server/src/main/java/com/genymobile/scrcpy/wrappers/SurfaceControl.java",
            "app/meson.build",
            "app/scrcpy.1",
            "app/src/common.h",
            "app/src/scrcpy.h",
            "app/src/server.h",
            "server/src/main/java/com/genymobile/scrcpy/Workarounds.java"
        ],
        "reopen": true,
        "reopen_events": [
            [
                "2022-08-12 07:41:44+00:00",
                "commit"
            ],
            [
                "2023-02-03 16:30:40+00:00",
                "closed"
            ],
            [
                "2023-04-20 15:39:53+00:00",
                "reopened"
            ],
            [
                "2023-04-25 00:15:28+00:00",
                "commit"
            ],
            [
                "2023-04-25 00:40:19+00:00",
                "closed"
            ]
        ],
        "status": false,
        "strategy": true,
        "total_changes": 581
    }
}