{
    "category": [
        "memory",
        "feature request"
    ],
    "commits": [
        {
            "associated_pull_request": [],
            "date": "2016-03-12 13:25:20",
            "diff": "eclipse_mosquitto/issue_1/commit_fda0cb3d453874c94d109eb0fa20403ee29981cd.diff",
            "diff_additions": 2,
            "diff_deletions": 2,
            "diff_file_size": 37385,
            "diff_url": "https://github.com/eclipse/mosquitto/commit/fda0cb3d453874c94d109eb0fa20403ee29981cd.diff",
            "exists": true,
            "files": [
                {
                    "file_additions": 2,
                    "file_deletions": 2,
                    "file_exists": true,
                    "file_name": "src/security_default.c",
                    "file_size": 37385
                }
            ],
            "interesting": {
                "reopen": false,
                "status": false
            },
            "is_parent": true,
            "sha": "fda0cb3d453874c94d109eb0fa20403ee29981cd"
        },
        {
            "associated_pull_request": [],
            "date": "2016-03-13 19:07:28",
            "diff": "eclipse_mosquitto/issue_1/commit_35c4d3d59a34c0dfebe1b447a352be1e1d9a6e1c.diff",
            "diff_additions": 12,
            "diff_deletions": 0,
            "diff_file_size": 44580,
            "diff_url": "https://github.com/eclipse/mosquitto/commit/35c4d3d59a34c0dfebe1b447a352be1e1d9a6e1c.diff",
            "exists": true,
            "files": [
                {
                    "file_additions": 12,
                    "file_deletions": 0,
                    "file_exists": true,
                    "file_name": "client/client_shared.c",
                    "file_size": 44580
                }
            ],
            "interesting": {
                "reopen": false,
                "status": true
            },
            "is_parent": false,
            "sha": "35c4d3d59a34c0dfebe1b447a352be1e1d9a6e1c"
        },
        {
            "associated_pull_request": [],
            "date": "2017-06-27 21:32:10",
            "diff": "eclipse_mosquitto/issue_1/commit_8de5ed446494e20aaeceebcfdde0b1969031f3c0.diff",
            "diff_additions": 2,
            "diff_deletions": 0,
            "diff_file_size": 10228,
            "diff_url": "https://github.com/eclipse/mosquitto/commit/8de5ed446494e20aaeceebcfdde0b1969031f3c0.diff",
            "exists": true,
            "files": [
                {
                    "file_additions": 2,
                    "file_deletions": 0,
                    "file_exists": true,
                    "file_name": "src/loop.c",
                    "file_size": 10228
                }
            ],
            "interesting": {
                "reopen": false,
                "status": false
            },
            "is_parent": false,
            "sha": "8de5ed446494e20aaeceebcfdde0b1969031f3c0"
        }
    ],
    "first_commit": "2016-03-12 13:25:20",
    "last_commit": "2017-06-27 21:32:10",
    "number": 1,
    "pull_request": "None",
    "score": {
        "accidental_reopen_likely": false,
        "all_labels": [],
        "contains_keywords": [
            "report",
            "fix",
            "patch",
            "bug",
            "issu",
            "error",
            "chang",
            "fail",
            "problem"
        ],
        "fix_size": 16,
        "has_labels": [],
        "intersecting": {
            "computed_score": 0.0,
            "final_commit_size": 3,
            "intersection_size": 0,
            "previous_commits_size": 13
        },
        "is_makefile_based": true,
        "no_new_files": [
            "src/loop.c"
        ],
        "no_other_files": true,
        "num_prohibited_files": 39957,
        "prohibited_files": [
            "kill.h",
            "meminfo.h",
            "kill.h",
            "meminfo.h",
            "kill.h",
            "meminfo.h",
            "testsuite_cli_test.go",
            "testsuite_cli_test.go",
            "common.mk",
            "i3bar/include/draw_util.h"
        ],
        "reopen": false,
        "reopen_events": [
            [
                "2016-03-13 19:13:18",
                "commit"
            ],
            [
                "2016-03-13 19:14:50",
                "closed"
            ],
            [
                "2017-07-26 12:12:04",
                "commit"
            ]
        ],
        "status": true,
        "strategy": true,
        "total_changes": 18
    }
}