{
    "covered_issues": [
        287,
        284,
        279,
        278,
        275,
        272,
        270,
        269,
        268,
        267,
        266,
        264,
        263,
        262,
        261,
        258,
        255,
        252,
        250,
        249,
        248,
        247,
        246,
        241,
        240,
        238,
        236,
        235,
        234,
        233,
        231,
        230,
        229,
        227,
        226,
        225,
        222,
        220,
        218,
        216,
        215,
        214,
        212,
        205,
        203,
        201,
        200,
        199,
        196,
        192,
        191,
        189,
        188,
        187,
        186,
        183,
        182,
        180,
        178,
        176,
        175,
        174,
        173,
        169,
        167,
        165,
        161,
        158,
        157,
        153,
        149,
        148,
        147,
        146,
        144,
        142,
        141,
        140,
        139,
        138,
        134,
        133,
        131,
        130,
        128,
        125,
        121,
        120,
        119,
        118,
        117,
        116,
        115,
        111,
        109,
        108,
        102,
        100,
        99,
        98,
        96,
        94,
        93,
        91,
        87,
        83,
        77,
        75,
        72,
        69,
        68,
        59,
        58,
        52,
        51,
        49,
        48,
        45,
        43,
        28,
        26,
        21,
        20,
        19,
        18,
        17,
        16,
        13,
        4,
        3,
        2
    ],
    "finished": true
}