{
    "category": [
        "build/refactor/preprocessing",
        "wrong API usage"
    ],
    "commits": [
        {
            "associated_pull_request": [],
            "date": "2013-04-05 04:38:12",
            "diff": "",
            "diff_additions": 0,
            "diff_deletions": 0,
            "diff_file_size": 0,
            "diff_url": "https://github.com/hexchat/hexchat/commit/7746ff9a122fdecc512e560b2a0608cc949ff2b6.diff",
            "exists": true,
            "files": [],
            "interesting": {
                "reopen": false,
                "status": false
            },
            "is_parent": true,
            "sha": "7746ff9a122fdecc512e560b2a0608cc949ff2b6"
        },
        {
            "associated_pull_request": [],
            "date": "2013-04-05 14:12:33",
            "diff": "hexchat_hexchat/issue_504/commit_d964af81428a6d768aeb96906eb0538a30d919ca.diff",
            "diff_additions": 20,
            "diff_deletions": 11,
            "diff_file_size": 83120,
            "diff_url": "https://github.com/hexchat/hexchat/commit/d964af81428a6d768aeb96906eb0538a30d919ca.diff",
            "exists": true,
            "files": [
                {
                    "file_additions": 0,
                    "file_deletions": 9,
                    "file_exists": true,
                    "file_name": "src/common/cfgfiles.c",
                    "file_size": 37952
                },
                {
                    "file_additions": 9,
                    "file_deletions": 0,
                    "file_exists": true,
                    "file_name": "src/fe-gtk/fe-gtk.c",
                    "file_size": 27999
                },
                {
                    "file_additions": 11,
                    "file_deletions": 2,
                    "file_exists": true,
                    "file_name": "src/fe-text/fe-text.c",
                    "file_size": 17169
                }
            ],
            "interesting": {
                "reopen": true,
                "status": false
            },
            "is_parent": false,
            "sha": "d964af81428a6d768aeb96906eb0538a30d919ca"
        },
        {
            "associated_pull_request": [
                "https://github.com/hexchat/hexchat/pull/590"
            ],
            "date": "2013-05-12 15:37:38",
            "diff": "hexchat_hexchat/issue_504/commit_6a8cad6f9431a629129d74cd3c549d279d1dea5d.diff",
            "diff_additions": 10,
            "diff_deletions": 9,
            "diff_file_size": 63995,
            "diff_url": "https://github.com/hexchat/hexchat/commit/6a8cad6f9431a629129d74cd3c549d279d1dea5d.diff",
            "exists": true,
            "files": [
                {
                    "file_additions": 0,
                    "file_deletions": 9,
                    "file_exists": true,
                    "file_name": "src/common/cfgfiles.c",
                    "file_size": 37952
                },
                {
                    "file_additions": 10,
                    "file_deletions": 0,
                    "file_exists": true,
                    "file_name": "src/common/hexchat.c",
                    "file_size": 26043
                }
            ],
            "interesting": {
                "reopen": false,
                "status": false
            },
            "is_parent": false,
            "sha": "6a8cad6f9431a629129d74cd3c549d279d1dea5d"
        }
    ],
    "first_commit": "2013-04-05 04:38:12",
    "last_commit": "2013-05-12 15:37:38",
    "number": 504,
    "pull_request": "None",
    "score": {
        "accidental_reopen_likely": false,
        "all_labels": [],
        "contains_keywords": [
            "work",
            "fix",
            "test",
            "issu",
            "warn",
            "chang",
            "problem"
        ],
        "fix_size": 45,
        "has_labels": [],
        "intersecting": {
            "computed_score": 0.47619047619047616,
            "final_commit_size": 21,
            "intersection_size": 10,
            "previous_commits_size": 34
        },
        "is_makefile_based": false,
        "no_new_files": [
            "src/common/hexchat.c"
        ],
        "no_other_files": true,
        "num_prohibited_files": 10330,
        "prohibited_files": [
            "kill.h",
            "meminfo.h",
            "kill.h",
            "meminfo.h",
            "kill.h",
            "meminfo.h",
            "testsuite_cli_test.go",
            "testsuite_cli_test.go",
            "common.mk",
            "i3bar/include/draw_util.h"
        ],
        "reopen": true,
        "reopen_events": [
            [
                "2013-04-05 14:13:31",
                "closed"
            ],
            [
                "2013-04-05 14:13:31",
                "commit"
            ],
            [
                "2013-05-12 15:08:04",
                "reopened"
            ],
            [
                "2013-05-12 15:40:09",
                "commit"
            ],
            [
                "2013-07-01 01:15:33",
                "closed"
            ]
        ],
        "status": false,
        "strategy": true,
        "total_changes": 50
    }
}