{
    "covered_issues": [
        59,
        51,
        50,
        49,
        46,
        36,
        33,
        27,
        23,
        20,
        17,
        16,
        12,
        10,
        8,
        7,
        6,
        4,
        3,
        2,
        1
    ],
    "finished": true
}