{
    "commits": [
        {
            "associated_pull_request": [
                "https://github.com/FRRouting/frr/pull/12276"
            ],
            "date": "2022-11-08 04:08:18+00:00",
            "diff": "frrouting_frr/issue_11246/commit_473f9912cf500b0d33258288e600983eee828547.diff",
            "diff_additions": 1,
            "diff_deletions": 1,
            "diff_file_size": 372701,
            "diff_url": "https://github.com/FRRouting/frr/commit/473f9912cf500b0d33258288e600983eee828547.diff",
            "exists": true,
            "files": [
                {
                    "file_additions": 1,
                    "file_deletions": 1,
                    "file_exists": true,
                    "file_name": "ospfd/ospf_vty.c",
                    "file_size": 372701
                }
            ],
            "interesting": {
                "reopen": false,
                "status": false
            },
            "is_parent": true,
            "sha": "473f9912cf500b0d33258288e600983eee828547"
        },
        {
            "associated_pull_request": [],
            "date": "2022-11-16 08:08:05+00:00",
            "diff": "frrouting_frr/issue_11246/commit_58534e7f2b0d52ae2c26b45c1e9ef8587426d82f.diff",
            "diff_additions": 19,
            "diff_deletions": 7,
            "diff_file_size": 150501,
            "diff_url": "https://github.com/FRRouting/frr/commit/58534e7f2b0d52ae2c26b45c1e9ef8587426d82f.diff",
            "exists": true,
            "files": [
                {
                    "file_additions": 19,
                    "file_deletions": 7,
                    "file_exists": true,
                    "file_name": "pimd/pim_cmd_common.c",
                    "file_size": 150501
                }
            ],
            "interesting": {
                "reopen": false,
                "status": true
            },
            "is_parent": false,
            "sha": "58534e7f2b0d52ae2c26b45c1e9ef8587426d82f"
        },
        {
            "associated_pull_request": [],
            "date": "2022-11-16 08:08:05+00:00",
            "diff": "frrouting_frr/issue_11246/commit_793bf3194f840bc940d7b1ca7b9ff61b7954d6e3.diff",
            "diff_additions": 19,
            "diff_deletions": 7,
            "diff_file_size": 150501,
            "diff_url": "https://github.com/FRRouting/frr/commit/793bf3194f840bc940d7b1ca7b9ff61b7954d6e3.diff",
            "exists": true,
            "files": [
                {
                    "file_additions": 19,
                    "file_deletions": 7,
                    "file_exists": true,
                    "file_name": "pimd/pim_cmd_common.c",
                    "file_size": 150501
                }
            ],
            "interesting": {
                "reopen": false,
                "status": false
            },
            "is_parent": false,
            "sha": "793bf3194f840bc940d7b1ca7b9ff61b7954d6e3"
        },
        {
            "associated_pull_request": [],
            "date": "2022-11-21 05:23:23+00:00",
            "diff": "frrouting_frr/issue_11246/commit_be37a8ffe0da55690d55558c61a4c06bf385ecc2.diff",
            "diff_additions": 39,
            "diff_deletions": 9,
            "diff_file_size": 150501,
            "diff_url": "https://github.com/FRRouting/frr/commit/be37a8ffe0da55690d55558c61a4c06bf385ecc2.diff",
            "exists": true,
            "files": [
                {
                    "file_additions": 39,
                    "file_deletions": 9,
                    "file_exists": true,
                    "file_name": "pimd/pim_cmd_common.c",
                    "file_size": 150501
                }
            ],
            "interesting": {
                "reopen": false,
                "status": true
            },
            "is_parent": false,
            "sha": "be37a8ffe0da55690d55558c61a4c06bf385ecc2"
        },
        {
            "associated_pull_request": [],
            "date": "2022-11-21 05:23:23+00:00",
            "diff": "frrouting_frr/issue_11246/commit_caaf7343701cd7caf46a7cb799377e2f92b4e039.diff",
            "diff_additions": 43,
            "diff_deletions": 15,
            "diff_file_size": 150501,
            "diff_url": "https://github.com/FRRouting/frr/commit/caaf7343701cd7caf46a7cb799377e2f92b4e039.diff",
            "exists": true,
            "files": [
                {
                    "file_additions": 43,
                    "file_deletions": 15,
                    "file_exists": true,
                    "file_name": "pimd/pim_cmd_common.c",
                    "file_size": 150501
                }
            ],
            "interesting": {
                "reopen": false,
                "status": true
            },
            "is_parent": false,
            "sha": "caaf7343701cd7caf46a7cb799377e2f92b4e039"
        },
        {
            "associated_pull_request": [
                "https://github.com/FRRouting/frr/pull/12325"
            ],
            "date": "2022-11-16 08:08:05+00:00",
            "diff": "frrouting_frr/issue_11246/commit_774d8ad38b2fbc3f5bfc16e895ece2860250cf1f.diff",
            "diff_additions": 19,
            "diff_deletions": 7,
            "diff_file_size": 150501,
            "diff_url": "https://github.com/FRRouting/frr/commit/774d8ad38b2fbc3f5bfc16e895ece2860250cf1f.diff",
            "exists": true,
            "files": [
                {
                    "file_additions": 19,
                    "file_deletions": 7,
                    "file_exists": true,
                    "file_name": "pimd/pim_cmd_common.c",
                    "file_size": 150501
                }
            ],
            "interesting": {
                "reopen": false,
                "status": false
            },
            "is_parent": false,
            "sha": "774d8ad38b2fbc3f5bfc16e895ece2860250cf1f"
        },
        {
            "associated_pull_request": [],
            "date": "2022-11-21 05:23:23+00:00",
            "diff": "frrouting_frr/issue_11246/commit_c29920aabf8fce586289c1aa018ec6442edccc90.diff",
            "diff_additions": 45,
            "diff_deletions": 15,
            "diff_file_size": 150501,
            "diff_url": "https://github.com/FRRouting/frr/commit/c29920aabf8fce586289c1aa018ec6442edccc90.diff",
            "exists": true,
            "files": [
                {
                    "file_additions": 45,
                    "file_deletions": 15,
                    "file_exists": true,
                    "file_name": "pimd/pim_cmd_common.c",
                    "file_size": 150501
                }
            ],
            "interesting": {
                "reopen": false,
                "status": true
            },
            "is_parent": false,
            "sha": "c29920aabf8fce586289c1aa018ec6442edccc90"
        },
        {
            "associated_pull_request": [],
            "date": "2022-11-21 05:23:23+00:00",
            "diff": "frrouting_frr/issue_11246/commit_af7a3e05ffa227a994076991317726fd60daa071.diff",
            "diff_additions": 46,
            "diff_deletions": 15,
            "diff_file_size": 150501,
            "diff_url": "https://github.com/FRRouting/frr/commit/af7a3e05ffa227a994076991317726fd60daa071.diff",
            "exists": true,
            "files": [
                {
                    "file_additions": 46,
                    "file_deletions": 15,
                    "file_exists": true,
                    "file_name": "pimd/pim_cmd_common.c",
                    "file_size": 150501
                }
            ],
            "interesting": {
                "reopen": false,
                "status": true
            },
            "is_parent": false,
            "sha": "af7a3e05ffa227a994076991317726fd60daa071"
        },
        {
            "associated_pull_request": [
                "https://github.com/FRRouting/frr/pull/12325"
            ],
            "date": "2022-11-21 05:23:23+00:00",
            "diff": "frrouting_frr/issue_11246/commit_86fb444df60ecef0f3b5671f5a013325b71c426f.diff",
            "diff_additions": 48,
            "diff_deletions": 15,
            "diff_file_size": 150501,
            "diff_url": "https://github.com/FRRouting/frr/commit/86fb444df60ecef0f3b5671f5a013325b71c426f.diff",
            "exists": true,
            "files": [
                {
                    "file_additions": 48,
                    "file_deletions": 15,
                    "file_exists": true,
                    "file_name": "pimd/pim_cmd_common.c",
                    "file_size": 150501
                }
            ],
            "interesting": {
                "reopen": false,
                "status": false
            },
            "is_parent": false,
            "sha": "86fb444df60ecef0f3b5671f5a013325b71c426f"
        }
    ],
    "first_commit": "2022-11-08 04:08:18+00:00",
    "last_commit": "2022-11-24 07:56:33+00:00",
    "number": 11246,
    "pull_request": "None",
    "score": {
        "accidental_reopen_likely": false,
        "all_labels": [
            "triage",
            "pimv6"
        ],
        "contains_keywords": [
            "fix",
            "fault"
        ],
        "fix_size": 87,
        "has_labels": [],
        "intersecting": {
            "computed_score": 0.9074074074074074,
            "final_commit_size": 54,
            "intersection_size": 49,
            "previous_commits_size": 82
        },
        "is_makefile_based": true,
        "no_new_files": [],
        "no_other_files": true,
        "num_prohibited_files": 357430,
        "prohibited_files": [
            "server/src/main/java/com/genymobile/scrcpy/Device.java",
            "server/src/main/java/com/genymobile/scrcpy/wrappers/SurfaceControl.java",
            "server/src/main/java/com/genymobile/scrcpy/Device.java",
            "server/src/main/java/com/genymobile/scrcpy/wrappers/SurfaceControl.java",
            "app/meson.build",
            "app/scrcpy.1",
            "app/src/common.h",
            "app/src/scrcpy.h",
            "app/src/server.h",
            "server/src/main/java/com/genymobile/scrcpy/Workarounds.java"
        ],
        "reopen": false,
        "reopen_events": [
            [
                "2022-09-20 06:47:10+00:00",
                "closed"
            ],
            [
                "2022-11-16 08:22:50+00:00",
                "commit"
            ],
            [
                "2022-11-16 08:24:25+00:00",
                "commit"
            ],
            [
                "2022-11-16 08:52:41+00:00",
                "commit"
            ],
            [
                "2022-11-21 05:27:42+00:00",
                "commit"
            ],
            [
                "2022-11-21 05:29:21+00:00",
                "commit"
            ],
            [
                "2022-11-23 15:50:21+00:00",
                "commit"
            ],
            [
                "2022-11-23 15:50:21+00:00",
                "commit"
            ],
            [
                "2022-11-23 15:51:48+00:00",
                "commit"
            ],
            [
                "2022-11-24 07:57:00+00:00",
                "commit"
            ]
        ],
        "status": true,
        "strategy": true,
        "total_changes": 370
    }
}