{
    "commits": [
        {
            "associated_pull_request": [
                "https://github.com/pure-data/pure-data/pull/1848"
            ],
            "date": "2022-12-05 15:24:10+00:00",
            "diff": "",
            "diff_additions": 0,
            "diff_deletions": 0,
            "diff_file_size": 0,
            "diff_url": "https://github.com/pure-data/pure-data/commit/e0eb69204f313a52ba676582b5456bac681fd49e.diff",
            "exists": true,
            "files": [],
            "interesting": {
                "reopen": false,
                "status": false
            },
            "is_parent": true,
            "sha": "e0eb69204f313a52ba676582b5456bac681fd49e"
        },
        {
            "associated_pull_request": [],
            "date": "2022-12-09 11:52:47+00:00",
            "diff": "pure-data_pure-data/issue_1829/commit_9f9398dd0c86d3f54ef105b89c1a0ac988b34e67.diff",
            "diff_additions": 14,
            "diff_deletions": 4,
            "diff_file_size": 34001,
            "diff_url": "https://github.com/pure-data/pure-data/commit/9f9398dd0c86d3f54ef105b89c1a0ac988b34e67.diff",
            "exists": true,
            "files": [
                {
                    "file_additions": 14,
                    "file_deletions": 4,
                    "file_exists": true,
                    "file_name": "src/g_all_guis.c",
                    "file_size": 34001
                }
            ],
            "interesting": {
                "reopen": false,
                "status": true
            },
            "is_parent": false,
            "sha": "9f9398dd0c86d3f54ef105b89c1a0ac988b34e67"
        },
        {
            "associated_pull_request": [
                "https://github.com/pure-data/pure-data/pull/1853"
            ],
            "date": "2022-12-09 11:52:47+00:00",
            "diff": "pure-data_pure-data/issue_1829/commit_1d7b4dd007ef3124b0fc6429a09217b017ad58fc.diff",
            "diff_additions": 15,
            "diff_deletions": 4,
            "diff_file_size": 34001,
            "diff_url": "https://github.com/pure-data/pure-data/commit/1d7b4dd007ef3124b0fc6429a09217b017ad58fc.diff",
            "exists": true,
            "files": [
                {
                    "file_additions": 15,
                    "file_deletions": 4,
                    "file_exists": true,
                    "file_name": "src/g_all_guis.c",
                    "file_size": 34001
                }
            ],
            "interesting": {
                "reopen": false,
                "status": false
            },
            "is_parent": false,
            "sha": "1d7b4dd007ef3124b0fc6429a09217b017ad58fc"
        },
        {
            "associated_pull_request": [
                "https://github.com/pure-data/pure-data/pull/1853"
            ],
            "date": "2022-12-09 11:52:47+00:00",
            "diff": "pure-data_pure-data/issue_1829/commit_1d7b4dd007ef3124b0fc6429a09217b017ad58fc.diff",
            "diff_additions": 15,
            "diff_deletions": 4,
            "diff_file_size": 34001,
            "diff_url": "https://github.com/pure-data/pure-data/commit/1d7b4dd007ef3124b0fc6429a09217b017ad58fc.diff",
            "exists": true,
            "files": [
                {
                    "file_additions": 15,
                    "file_deletions": 4,
                    "file_exists": true,
                    "file_name": "src/g_all_guis.c",
                    "file_size": 34001
                }
            ],
            "interesting": {
                "reopen": false,
                "status": false
            },
            "is_parent": false,
            "sha": "1d7b4dd007ef3124b0fc6429a09217b017ad58fc"
        }
    ],
    "first_commit": "2022-12-05 15:24:10+00:00",
    "last_commit": "2022-12-09 19:25:32+00:00",
    "number": 1829,
    "pull_request": "None",
    "score": {
        "accidental_reopen_likely": false,
        "all_labels": [
            "bug/fix",
            "pending",
            "subject:GUI"
        ],
        "contains_keywords": [
            "work",
            "chang",
            "fix",
            "issu",
            "patch",
            "test",
            "bug"
        ],
        "fix_size": 18,
        "has_labels": [],
        "intersecting": {
            "computed_score": 1.0,
            "final_commit_size": 16,
            "intersection_size": 16,
            "previous_commits_size": 18
        },
        "is_makefile_based": true,
        "no_new_files": [],
        "no_other_files": true,
        "num_prohibited_files": 152172,
        "prohibited_files": [
            "server/src/main/java/com/genymobile/scrcpy/Device.java",
            "server/src/main/java/com/genymobile/scrcpy/wrappers/SurfaceControl.java",
            "server/src/main/java/com/genymobile/scrcpy/Device.java",
            "server/src/main/java/com/genymobile/scrcpy/wrappers/SurfaceControl.java",
            "app/meson.build",
            "app/scrcpy.1",
            "app/src/common.h",
            "app/src/scrcpy.h",
            "app/src/server.h",
            "server/src/main/java/com/genymobile/scrcpy/Workarounds.java"
        ],
        "reopen": false,
        "reopen_events": [
            [
                "2022-12-09 11:53:25+00:00",
                "commit"
            ],
            [
                "2022-12-09 19:25:44+00:00",
                "commit"
            ],
            [
                "2022-12-12 02:52:37+00:00",
                "closed"
            ],
            [
                "2022-12-12 02:52:37+00:00",
                "commit"
            ]
        ],
        "status": true,
        "strategy": true,
        "total_changes": 56
    }
}