{
    "covered_issues": [
        136,
        134,
        132,
        130,
        129,
        125,
        124,
        123,
        122,
        121,
        116,
        110,
        108,
        101,
        99,
        98,
        97,
        92,
        91,
        83,
        81,
        79,
        78,
        76,
        73,
        72,
        71,
        70,
        69,
        62,
        58,
        57,
        56,
        53,
        52,
        51,
        49,
        47,
        46,
        45,
        42,
        35,
        34,
        31,
        25,
        22,
        21,
        19,
        17,
        16,
        14,
        13,
        11,
        8,
        5,
        3,
        2,
        1
    ],
    "finished": true
}