{
    "commits": [
        {
            "diff": "spring-projects_spring-boot/issue_23213/commit_6be4409fde51e6a234af8bbc8d693e0af460cd96.diff",
            "diff_additions": 7,
            "diff_deletions": 3,
            "diff_file_size": 55797,
            "files": [
                {
                    "file_additions": 1,
                    "file_deletions": 1,
                    "file_exists": true,
                    "file_name": "spring-boot-project/spring-boot/src/main/java/org/springframework/boot/SpringApplication.java",
                    "file_size": 51492
                },
                {
                    "file_additions": 6,
                    "file_deletions": 2,
                    "file_exists": true,
                    "file_name": "spring-boot-project/spring-boot/src/main/java/org/springframework/boot/SpringApplicationRunListeners.java",
                    "file_size": 4305
                }
            ],
            "interesting": {
                "reopened": false,
                "status": false
            },
            "sha": "6be4409fde51e6a234af8bbc8d693e0af460cd96"
        },
        {
            "diff": "spring-projects_spring-boot/issue_23213/commit_676e1809fbb40936c905462a8c3106b298bdc724.diff",
            "diff_additions": 424,
            "diff_deletions": 0,
            "diff_file_size": 18073,
            "files": [
                {
                    "file_additions": 74,
                    "file_deletions": 0,
                    "file_exists": true,
                    "file_name": "spring-boot-project/spring-boot-actuator-autoconfigure/src/main/java/org/springframework/boot/actuate/autoconfigure/startup/StartupEndpointAutoConfiguration.java",
                    "file_size": 3244
                },
                {
                    "file_additions": 20,
                    "file_deletions": 0,
                    "file_exists": true,
                    "file_name": "spring-boot-project/spring-boot-actuator-autoconfigure/src/main/java/org/springframework/boot/actuate/autoconfigure/startup/package-info.java",
                    "file_size": 759
                },
                {
                    "file_additions": 98,
                    "file_deletions": 0,
                    "file_exists": true,
                    "file_name": "spring-boot-project/spring-boot-actuator-autoconfigure/src/test/java/org/springframework/boot/actuate/autoconfigure/endpoint/web/documentation/StartupEndpointDocumentationTests.java",
                    "file_size": 4775
                },
                {
                    "file_additions": 61,
                    "file_deletions": 0,
                    "file_exists": true,
                    "file_name": "spring-boot-project/spring-boot-actuator-autoconfigure/src/test/java/org/springframework/boot/actuate/autoconfigure/startup/StartupEndpointAutoConfigurationTests.java",
                    "file_size": 2388
                },
                {
                    "file_additions": 78,
                    "file_deletions": 0,
                    "file_exists": true,
                    "file_name": "spring-boot-project/spring-boot-actuator/src/main/java/org/springframework/boot/actuate/startup/StartupEndpoint.java",
                    "file_size": 2711
                },
                {
                    "file_additions": 20,
                    "file_deletions": 0,
                    "file_exists": true,
                    "file_name": "spring-boot-project/spring-boot-actuator/src/main/java/org/springframework/boot/actuate/startup/package-info.java",
                    "file_size": 766
                },
                {
                    "file_additions": 73,
                    "file_deletions": 0,
                    "file_exists": true,
                    "file_name": "spring-boot-project/spring-boot-actuator/src/test/java/org/springframework/boot/actuate/startup/StartupEndpointTests.java",
                    "file_size": 3430
                }
            ],
            "interesting": {
                "reopened": true,
                "status": true
            },
            "sha": "676e1809fbb40936c905462a8c3106b298bdc724"
        },
        {
            "diff": "spring-projects_spring-boot/issue_23213/commit_8dcb3312f28082d5f1184d5fb02c8591f91c8c0f.diff",
            "diff_additions": 4,
            "diff_deletions": 4,
            "diff_file_size": 7486,
            "files": [
                {
                    "file_additions": 2,
                    "file_deletions": 2,
                    "file_exists": true,
                    "file_name": "spring-boot-project/spring-boot-actuator-autoconfigure/src/test/java/org/springframework/boot/actuate/autoconfigure/endpoint/web/documentation/StartupEndpointDocumentationTests.java",
                    "file_size": 4775
                },
                {
                    "file_additions": 2,
                    "file_deletions": 2,
                    "file_exists": true,
                    "file_name": "spring-boot-project/spring-boot-actuator/src/main/java/org/springframework/boot/actuate/startup/StartupEndpoint.java",
                    "file_size": 2711
                }
            ],
            "interesting": {
                "reopened": false,
                "status": true
            },
            "sha": "8dcb3312f28082d5f1184d5fb02c8591f91c8c0f"
        }
    ],
    "first_commit": "2020-09-07 16:04:42",
    "last_commit": "2020-09-07 18:32:26",
    "number": 23213,
    "score": 128.00904977375566
}