{
    "all_issues": 382,
    "interesting_issues": 2,
    "last_update": "2023-11-01 16:10:05.594931",
    "license": {
        "download": "https://raw.githubusercontent.com/OpenDUNE/OpenDUNE/master/COPYING",
        "name": "GNU General Public License v2.0"
    },
    "ratio": 0.005235602094240838,
    "size": 13237,
    "stars": 1524,
    "url": "https://github.com/OpenDUNE/OpenDUNE"
}