{
    "commits": [
        {
            "associated_pull_request": [
                "https://github.com/RIOT-OS/RIOT/pull/12481"
            ],
            "date": "2019-10-20 06:00:40+00:00",
            "diff": "riot-os_riot/issue_11980/commit_5db4310b454e4c0d3c418dde5575af37ea350b22.diff",
            "diff_additions": 18,
            "diff_deletions": 12,
            "diff_file_size": 18642,
            "diff_url": "https://github.com/RIOT-OS/RIOT/commit/5db4310b454e4c0d3c418dde5575af37ea350b22.diff",
            "exists": true,
            "files": [
                {
                    "file_additions": 16,
                    "file_deletions": 2,
                    "file_exists": true,
                    "file_name": "drivers/rn2xx3/rn2xx3.c",
                    "file_size": 9789
                },
                {
                    "file_additions": 2,
                    "file_deletions": 10,
                    "file_exists": true,
                    "file_name": "drivers/rn2xx3/rn2xx3_internal.c",
                    "file_size": 8853
                }
            ],
            "interesting": {
                "reopen": false,
                "status": false
            },
            "is_parent": true,
            "sha": "5db4310b454e4c0d3c418dde5575af37ea350b22"
        },
        {
            "associated_pull_request": [],
            "date": "2019-10-20 10:37:55+00:00",
            "diff": "riot-os_riot/issue_11980/commit_25a6782fdfabdc7e9c29984798da17b4d8b374d8.diff",
            "diff_additions": 8,
            "diff_deletions": 6,
            "diff_file_size": 32128,
            "diff_url": "https://github.com/RIOT-OS/RIOT/commit/25a6782fdfabdc7e9c29984798da17b4d8b374d8.diff",
            "exists": true,
            "files": [
                {
                    "file_additions": 8,
                    "file_deletions": 6,
                    "file_exists": true,
                    "file_name": "sys/net/gnrc/network_layer/ipv6/gnrc_ipv6.c",
                    "file_size": 32128
                }
            ],
            "interesting": {
                "reopen": false,
                "status": false
            },
            "is_parent": false,
            "sha": "25a6782fdfabdc7e9c29984798da17b4d8b374d8"
        },
        {
            "associated_pull_request": [
                "https://github.com/RIOT-OS/RIOT/pull/12512"
            ],
            "date": "2019-10-20 10:37:55+00:00",
            "diff": "riot-os_riot/issue_11980/commit_ce14ee1f7702fec43b682c850da66285ca164ff0.diff",
            "diff_additions": 12,
            "diff_deletions": 7,
            "diff_file_size": 32128,
            "diff_url": "https://github.com/RIOT-OS/RIOT/commit/ce14ee1f7702fec43b682c850da66285ca164ff0.diff",
            "exists": true,
            "files": [
                {
                    "file_additions": 12,
                    "file_deletions": 7,
                    "file_exists": true,
                    "file_name": "sys/net/gnrc/network_layer/ipv6/gnrc_ipv6.c",
                    "file_size": 32128
                }
            ],
            "interesting": {
                "reopen": false,
                "status": false
            },
            "is_parent": false,
            "sha": "ce14ee1f7702fec43b682c850da66285ca164ff0"
        },
        {
            "associated_pull_request": [],
            "date": "2019-10-20 10:37:55+00:00",
            "diff": "riot-os_riot/issue_11980/commit_288b75f2f8574f0d50b09f1e27d7ca0957ac2b05.diff",
            "diff_additions": 12,
            "diff_deletions": 7,
            "diff_file_size": 32128,
            "diff_url": "https://github.com/RIOT-OS/RIOT/commit/288b75f2f8574f0d50b09f1e27d7ca0957ac2b05.diff",
            "exists": true,
            "files": [
                {
                    "file_additions": 12,
                    "file_deletions": 7,
                    "file_exists": true,
                    "file_name": "sys/net/gnrc/network_layer/ipv6/gnrc_ipv6.c",
                    "file_size": 32128
                }
            ],
            "interesting": {
                "reopen": true,
                "status": false
            },
            "is_parent": false,
            "sha": "288b75f2f8574f0d50b09f1e27d7ca0957ac2b05"
        },
        {
            "associated_pull_request": [
                "https://github.com/RIOT-OS/RIOT/pull/12521"
            ],
            "date": "2019-10-20 10:37:55+00:00",
            "diff": "riot-os_riot/issue_11980/commit_e95bb1762e1efdfba5f95acff78e959d8cca6132.diff",
            "diff_additions": 12,
            "diff_deletions": 7,
            "diff_file_size": 32128,
            "diff_url": "https://github.com/RIOT-OS/RIOT/commit/e95bb1762e1efdfba5f95acff78e959d8cca6132.diff",
            "exists": true,
            "files": [
                {
                    "file_additions": 12,
                    "file_deletions": 7,
                    "file_exists": true,
                    "file_name": "sys/net/gnrc/network_layer/ipv6/gnrc_ipv6.c",
                    "file_size": 32128
                }
            ],
            "interesting": {
                "reopen": false,
                "status": false
            },
            "is_parent": false,
            "sha": "e95bb1762e1efdfba5f95acff78e959d8cca6132"
        },
        {
            "associated_pull_request": [],
            "date": "2019-10-20 10:37:55+00:00",
            "diff": "riot-os_riot/issue_11980/commit_89bedfc9eeda4ff7da7efa75afe115f0c40fdf75.diff",
            "diff_additions": 12,
            "diff_deletions": 7,
            "diff_file_size": 32128,
            "diff_url": "https://github.com/RIOT-OS/RIOT/commit/89bedfc9eeda4ff7da7efa75afe115f0c40fdf75.diff",
            "exists": true,
            "files": [
                {
                    "file_additions": 12,
                    "file_deletions": 7,
                    "file_exists": true,
                    "file_name": "sys/net/gnrc/network_layer/ipv6/gnrc_ipv6.c",
                    "file_size": 32128
                }
            ],
            "interesting": {
                "reopen": false,
                "status": false
            },
            "is_parent": false,
            "sha": "89bedfc9eeda4ff7da7efa75afe115f0c40fdf75"
        },
        {
            "associated_pull_request": [],
            "date": "2019-10-20 10:37:55+00:00",
            "diff": "riot-os_riot/issue_11980/commit_30322f555907f20f0c08071515202fb41dd21f3d.diff",
            "diff_additions": 12,
            "diff_deletions": 7,
            "diff_file_size": 32128,
            "diff_url": "https://github.com/RIOT-OS/RIOT/commit/30322f555907f20f0c08071515202fb41dd21f3d.diff",
            "exists": true,
            "files": [
                {
                    "file_additions": 12,
                    "file_deletions": 7,
                    "file_exists": true,
                    "file_name": "sys/net/gnrc/network_layer/ipv6/gnrc_ipv6.c",
                    "file_size": 32128
                }
            ],
            "interesting": {
                "reopen": false,
                "status": false
            },
            "is_parent": false,
            "sha": "30322f555907f20f0c08071515202fb41dd21f3d"
        }
    ],
    "first_commit": "2019-10-20 06:00:40+00:00",
    "last_commit": "2019-12-16 22:22:51+00:00",
    "number": 11980,
    "pull_request": "None",
    "score": {
        "accidental_reopen_likely": false,
        "all_labels": [
            "Type: bug",
            "Area: network"
        ],
        "contains_keywords": [
            "fix",
            "issu",
            "fault",
            "crash"
        ],
        "fix_size": 23,
        "has_labels": [],
        "intersecting": {
            "computed_score": 1.0,
            "final_commit_size": 19,
            "intersection_size": 19,
            "previous_commits_size": 23
        },
        "is_makefile_based": true,
        "no_new_files": [],
        "no_other_files": false,
        "num_prohibited_files": 190512,
        "prohibited_files": [
            "server/src/main/java/com/genymobile/scrcpy/Device.java",
            "server/src/main/java/com/genymobile/scrcpy/wrappers/SurfaceControl.java",
            "server/src/main/java/com/genymobile/scrcpy/Device.java",
            "server/src/main/java/com/genymobile/scrcpy/wrappers/SurfaceControl.java",
            "app/meson.build",
            "app/scrcpy.1",
            "app/src/common.h",
            "app/src/scrcpy.h",
            "app/src/server.h",
            "server/src/main/java/com/genymobile/scrcpy/Workarounds.java"
        ],
        "reopen": true,
        "reopen_events": [
            [
                "2019-10-20 10:41:32+00:00",
                "commit"
            ],
            [
                "2019-10-20 12:25:48+00:00",
                "commit"
            ],
            [
                "2019-10-21 07:44:45+00:00",
                "closed"
            ],
            [
                "2019-10-21 07:45:38+00:00",
                "commit"
            ],
            [
                "2019-10-21 07:48:06+00:00",
                "reopened"
            ],
            [
                "2019-10-21 10:09:03+00:00",
                "closed"
            ],
            [
                "2019-10-21 10:09:49+00:00",
                "reopened"
            ],
            [
                "2019-10-21 10:10:05+00:00",
                "commit"
            ],
            [
                "2019-10-24 09:59:22+00:00",
                "commit"
            ],
            [
                "2019-10-24 15:38:25+00:00",
                "closed"
            ],
            [
                "2019-12-17 02:46:53+00:00",
                "commit"
            ]
        ],
        "status": false,
        "strategy": true,
        "total_changes": 139
    }
}