{
    "covered_issues": [
        111,
        101,
        100,
        99,
        98,
        97,
        96,
        92,
        90,
        88,
        87,
        86,
        85,
        84,
        82,
        81,
        80,
        73,
        70,
        69,
        68,
        66,
        65,
        64,
        63,
        62,
        61,
        60,
        57,
        55,
        53,
        48,
        44,
        41,
        39,
        31,
        26,
        24,
        23,
        22,
        21,
        20,
        19,
        16,
        15,
        13,
        11,
        6,
        5,
        4,
        3,
        2,
        1
    ],
    "finished": true
}