{
    "commits": [
        {
            "associated_pull_request": [],
            "date": "2022-12-10 20:37:41+00:00",
            "diff": "pawelsalawa_sqlitestudio/issue_4607/commit_e7809e403b541d50d3605a8dc2ef3b7703cd9699.diff",
            "diff_additions": 14,
            "diff_deletions": 11,
            "diff_file_size": 152564,
            "diff_url": "https://github.com/pawelsalawa/sqlitestudio/commit/e7809e403b541d50d3605a8dc2ef3b7703cd9699.diff",
            "exists": true,
            "files": [
                {
                    "file_additions": 1,
                    "file_deletions": 1,
                    "file_exists": true,
                    "file_name": "SQLiteStudio3/guiSQLiteStudio/windows/codesnippeteditor.cpp",
                    "file_size": 10316
                },
                {
                    "file_additions": 1,
                    "file_deletions": 1,
                    "file_exists": true,
                    "file_name": "SQLiteStudio3/guiSQLiteStudio/windows/collationseditor.cpp",
                    "file_size": 12165
                },
                {
                    "file_additions": 1,
                    "file_deletions": 1,
                    "file_exists": true,
                    "file_name": "SQLiteStudio3/guiSQLiteStudio/windows/functionseditor.cpp",
                    "file_size": 22164
                },
                {
                    "file_additions": 1,
                    "file_deletions": 1,
                    "file_exists": true,
                    "file_name": "SQLiteStudio3/guiSQLiteStudio/windows/sqliteextensioneditor.cpp",
                    "file_size": 13833
                },
                {
                    "file_additions": 5,
                    "file_deletions": 4,
                    "file_exists": true,
                    "file_name": "SQLiteStudio3/guiSQLiteStudio/windows/tablewindow.cpp",
                    "file_size": 58584
                },
                {
                    "file_additions": 5,
                    "file_deletions": 3,
                    "file_exists": true,
                    "file_name": "SQLiteStudio3/guiSQLiteStudio/windows/viewwindow.cpp",
                    "file_size": 35502
                }
            ],
            "interesting": {
                "reopen": false,
                "status": false
            },
            "is_parent": true,
            "sha": "e7809e403b541d50d3605a8dc2ef3b7703cd9699"
        },
        {
            "associated_pull_request": [],
            "date": "2022-12-13 22:05:40+00:00",
            "diff": "pawelsalawa_sqlitestudio/issue_4607/commit_53c29e566672028f2e65003eb4f7056d07ebfb2c.diff",
            "diff_additions": 58,
            "diff_deletions": 32,
            "diff_file_size": 45485,
            "diff_url": "https://github.com/pawelsalawa/sqlitestudio/commit/53c29e566672028f2e65003eb4f7056d07ebfb2c.diff",
            "exists": true,
            "files": [
                {
                    "file_additions": 7,
                    "file_deletions": 1,
                    "file_exists": true,
                    "file_name": "SQLiteStudio3/coreSQLiteStudio/db/queryexecutorsteps/queryexecutoraddrowids.cpp",
                    "file_size": 9898
                },
                {
                    "file_additions": 2,
                    "file_deletions": 1,
                    "file_exists": true,
                    "file_name": "SQLiteStudio3/coreSQLiteStudio/db/queryexecutorsteps/queryexecutordatasources.cpp",
                    "file_size": 1235
                },
                {
                    "file_additions": 45,
                    "file_deletions": 29,
                    "file_exists": true,
                    "file_name": "SQLiteStudio3/coreSQLiteStudio/db/queryexecutorsteps/queryexecutorreplaceviews.cpp",
                    "file_size": 4636
                },
                {
                    "file_additions": 4,
                    "file_deletions": 1,
                    "file_exists": true,
                    "file_name": "SQLiteStudio3/coreSQLiteStudio/selectresolver.cpp",
                    "file_size": 29716
                }
            ],
            "interesting": {
                "reopen": false,
                "status": false
            },
            "is_parent": false,
            "sha": "53c29e566672028f2e65003eb4f7056d07ebfb2c"
        },
        {
            "associated_pull_request": [],
            "date": "2022-12-13 22:45:07+00:00",
            "diff": "pawelsalawa_sqlitestudio/issue_4607/commit_bd0ba614c32bff1002760e34ecd55d9e60c696a9.diff",
            "diff_additions": 8,
            "diff_deletions": 1,
            "diff_file_size": 58310,
            "diff_url": "https://github.com/pawelsalawa/sqlitestudio/commit/bd0ba614c32bff1002760e34ecd55d9e60c696a9.diff",
            "exists": true,
            "files": [
                {
                    "file_additions": 3,
                    "file_deletions": 0,
                    "file_exists": true,
                    "file_name": "SQLiteStudio3/coreSQLiteStudio/db/queryexecutorsteps/queryexecutorcolumns.cpp",
                    "file_size": 11349
                },
                {
                    "file_additions": 4,
                    "file_deletions": 0,
                    "file_exists": true,
                    "file_name": "SQLiteStudio3/guiSQLiteStudio/datagrid/sqlquerymodelcolumn.cpp",
                    "file_size": 18097
                },
                {
                    "file_additions": 1,
                    "file_deletions": 1,
                    "file_exists": true,
                    "file_name": "SQLiteStudio3/guiSQLiteStudio/datagrid/sqlqueryview.cpp",
                    "file_size": 28864
                }
            ],
            "interesting": {
                "reopen": false,
                "status": false
            },
            "is_parent": false,
            "sha": "bd0ba614c32bff1002760e34ecd55d9e60c696a9"
        },
        {
            "associated_pull_request": [],
            "date": "2022-12-16 22:01:20+00:00",
            "diff": "pawelsalawa_sqlitestudio/issue_4607/commit_ab1bf8c1a976b093033a7afc482159b529530c43.diff",
            "diff_additions": 46,
            "diff_deletions": 14,
            "diff_file_size": 30923,
            "diff_url": "https://github.com/pawelsalawa/sqlitestudio/commit/ab1bf8c1a976b093033a7afc482159b529530c43.diff",
            "exists": true,
            "files": [
                {
                    "file_additions": 41,
                    "file_deletions": 14,
                    "file_exists": true,
                    "file_name": "SQLiteStudio3/coreSQLiteStudio/db/queryexecutor.cpp",
                    "file_size": 28999
                },
                {
                    "file_additions": 5,
                    "file_deletions": 0,
                    "file_exists": true,
                    "file_name": "SQLiteStudio3/coreSQLiteStudio/log.cpp",
                    "file_size": 1924
                }
            ],
            "interesting": {
                "reopen": true,
                "status": false
            },
            "is_parent": false,
            "sha": "ab1bf8c1a976b093033a7afc482159b529530c43"
        },
        {
            "associated_pull_request": [],
            "date": "2022-12-20 22:23:49+00:00",
            "diff": "pawelsalawa_sqlitestudio/issue_4607/commit_ab8c0b251394b78e81d609b6020342ba4800729f.diff",
            "diff_additions": 97,
            "diff_deletions": 46,
            "diff_file_size": 99089,
            "diff_url": "https://github.com/pawelsalawa/sqlitestudio/commit/ab8c0b251394b78e81d609b6020342ba4800729f.diff",
            "exists": true,
            "files": [
                {
                    "file_additions": 44,
                    "file_deletions": 0,
                    "file_exists": true,
                    "file_name": "SQLiteStudio3/Tests/SelectResolverTest/tst_selectresolvertest.cpp",
                    "file_size": 14123
                },
                {
                    "file_additions": 9,
                    "file_deletions": 0,
                    "file_exists": true,
                    "file_name": "SQLiteStudio3/coreSQLiteStudio/common/bistrhash.cpp",
                    "file_size": 5637
                },
                {
                    "file_additions": 2,
                    "file_deletions": 2,
                    "file_exists": true,
                    "file_name": "SQLiteStudio3/coreSQLiteStudio/completionhelper.cpp",
                    "file_size": 49613
                },
                {
                    "file_additions": 42,
                    "file_deletions": 44,
                    "file_exists": true,
                    "file_name": "SQLiteStudio3/coreSQLiteStudio/selectresolver.cpp",
                    "file_size": 29716
                }
            ],
            "interesting": {
                "reopen": false,
                "status": false
            },
            "is_parent": false,
            "sha": "ab8c0b251394b78e81d609b6020342ba4800729f"
        }
    ],
    "first_commit": "2022-12-10 20:37:41+00:00",
    "last_commit": "2022-12-20 22:23:49+00:00",
    "number": 4607,
    "pull_request": "None",
    "score": {
        "accidental_reopen_likely": false,
        "all_labels": [
            "bug"
        ],
        "contains_keywords": [
            "confirm",
            "work",
            "fail",
            "chang",
            "fix",
            "issu",
            "debug",
            "test",
            "attempt",
            "fault",
            "bug",
            "error",
            "problem"
        ],
        "fix_size": 276,
        "has_labels": [
            "bug"
        ],
        "intersecting": {
            "computed_score": 0.007575757575757576,
            "final_commit_size": 132,
            "intersection_size": 1,
            "previous_commits_size": 145
        },
        "is_makefile_based": false,
        "no_new_files": [
            "SQLiteStudio3/Tests/SelectResolverTest/tst_selectresolvertest.cpp",
            "SQLiteStudio3/coreSQLiteStudio/common/bistrhash.cpp",
            "SQLiteStudio3/coreSQLiteStudio/completionhelper.cpp"
        ],
        "no_other_files": false,
        "num_prohibited_files": 163704,
        "prohibited_files": [
            "server/src/main/java/com/genymobile/scrcpy/Device.java",
            "server/src/main/java/com/genymobile/scrcpy/wrappers/SurfaceControl.java",
            "server/src/main/java/com/genymobile/scrcpy/Device.java",
            "server/src/main/java/com/genymobile/scrcpy/wrappers/SurfaceControl.java",
            "app/meson.build",
            "app/scrcpy.1",
            "app/src/common.h",
            "app/src/scrcpy.h",
            "app/src/server.h",
            "server/src/main/java/com/genymobile/scrcpy/Workarounds.java"
        ],
        "reopen": true,
        "reopen_events": [
            [
                "2022-12-13 22:05:45+00:00",
                "commit"
            ],
            [
                "2022-12-13 22:45:10+00:00",
                "commit"
            ],
            [
                "2022-12-16 22:01:25+00:00",
                "commit"
            ],
            [
                "2022-12-18 21:40:56+00:00",
                "closed"
            ],
            [
                "2022-12-19 18:35:44+00:00",
                "reopened"
            ],
            [
                "2022-12-20 22:23:55+00:00",
                "commit"
            ],
            [
                "2022-12-21 21:06:10+00:00",
                "closed"
            ]
        ],
        "status": false,
        "strategy": true,
        "total_changes": 327
    }
}