{
    "category": [
        "build/refactor/preprocessing",
        "GUI"
    ],
    "commits": [
        {
            "associated_pull_request": [
                "https://github.com/pure-data/pure-data/pull/468"
            ],
            "date": "2018-09-17 10:48:49",
            "diff": "",
            "diff_additions": 0,
            "diff_deletions": 0,
            "diff_file_size": 0,
            "diff_url": "https://github.com/pure-data/pure-data/commit/18067e2962b68c7321f5f312f1b4be79cea34df5.diff",
            "exists": true,
            "files": [],
            "interesting": {
                "reopen": false,
                "status": false
            },
            "is_parent": true,
            "sha": "18067e2962b68c7321f5f312f1b4be79cea34df5"
        },
        {
            "associated_pull_request": [
                "https://github.com/pure-data/pure-data/pull/468"
            ],
            "date": "2018-09-20 21:35:17",
            "diff": "pure-data_pure-data/issue_477/commit_8b01a9f995e34c4ed8fc780f3458868744c2ef38.diff",
            "diff_additions": 19,
            "diff_deletions": 5,
            "diff_file_size": 22833,
            "diff_url": "https://github.com/pure-data/pure-data/commit/8b01a9f995e34c4ed8fc780f3458868744c2ef38.diff",
            "exists": true,
            "files": [
                {
                    "file_additions": 19,
                    "file_deletions": 5,
                    "file_exists": true,
                    "file_name": "src/g_all_guis.c",
                    "file_size": 22833
                }
            ],
            "interesting": {
                "reopen": true,
                "status": false
            },
            "is_parent": false,
            "sha": "8b01a9f995e34c4ed8fc780f3458868744c2ef38"
        },
        {
            "associated_pull_request": [],
            "date": "2018-09-23 01:44:02",
            "diff": "pure-data_pure-data/issue_477/commit_418428350f6a3f4aebf8b378dbefea39c38b4ee5.diff",
            "diff_additions": 5,
            "diff_deletions": 19,
            "diff_file_size": 22833,
            "diff_url": "https://github.com/pure-data/pure-data/commit/418428350f6a3f4aebf8b378dbefea39c38b4ee5.diff",
            "exists": true,
            "files": [
                {
                    "file_additions": 5,
                    "file_deletions": 19,
                    "file_exists": true,
                    "file_name": "src/g_all_guis.c",
                    "file_size": 22833
                }
            ],
            "interesting": {
                "reopen": false,
                "status": false
            },
            "is_parent": false,
            "sha": "418428350f6a3f4aebf8b378dbefea39c38b4ee5"
        }
    ],
    "first_commit": "2018-09-17 10:48:49",
    "last_commit": "2018-09-23 01:44:02",
    "number": 477,
    "pull_request": "None",
    "score": {
        "accidental_reopen_likely": false,
        "all_labels": [
            "bug/fix"
        ],
        "contains_keywords": [
            "patch",
            "fault",
            "issu",
            "problem",
            "chang",
            "confirm",
            "work",
            "error",
            "fix",
            "reason"
        ],
        "fix_size": 23,
        "has_labels": [],
        "intersecting": {
            "computed_score": 1.0,
            "final_commit_size": 23,
            "intersection_size": 23,
            "previous_commits_size": 23
        },
        "is_makefile_based": true,
        "no_new_files": [],
        "no_other_files": true,
        "num_prohibited_files": 33642,
        "prohibited_files": [
            "tools/building.py",
            "tools/building.py",
            "tools/building.py",
            "emcc.py",
            "src/library_emmalloc.js",
            "src/shell.js",
            "tests/test_core.py",
            "src/shell.js",
            "tests/test_core.py",
            "src/library.js"
        ],
        "reopen": true,
        "reopen_events": [
            [
                "2018-09-20 21:35:40",
                "commit"
            ],
            [
                "2018-09-21 16:32:49",
                "closed"
            ],
            [
                "2018-09-21 16:32:49",
                "commit"
            ],
            [
                "2018-09-23 00:01:41",
                "reopened"
            ],
            [
                "2018-09-23 13:14:56",
                "commit"
            ],
            [
                "2019-12-01 00:28:24",
                "closed"
            ]
        ],
        "status": false,
        "strategy": true,
        "total_changes": 48
    }
}