{
    "covered_issues": [
        207,
        204,
        192,
        180,
        179,
        173,
        162,
        149,
        145,
        144,
        133,
        132,
        128,
        126,
        123,
        120,
        118,
        115,
        114,
        112,
        106,
        105,
        97,
        96,
        94,
        90,
        86,
        84,
        83,
        82,
        81,
        80,
        77,
        76,
        75,
        69,
        67,
        65,
        64,
        62,
        54,
        52,
        51,
        49,
        48,
        47,
        43,
        42,
        41,
        39,
        38,
        37,
        36,
        35,
        34,
        33,
        32,
        30,
        26,
        24,
        23,
        22,
        21,
        20,
        18,
        17,
        16,
        13,
        11,
        10,
        9,
        7,
        6,
        5,
        3,
        2,
        1
    ],
    "finished": true
}