{
    "all_issues": 319,
    "interesting_issues": 4,
    "last_update": "2023-11-04 15:16:22.627943",
    "license": {
        "download": "https://raw.githubusercontent.com/bakkeby/dwm-flexipatch/master/LICENSE",
        "name": "MIT License"
    },
    "ratio": 0.012539184952978056,
    "size": 1132,
    "stars": 1012,
    "url": "https://github.com/bakkeby/dwm-flexipatch"
}