{
    "category": [
        "memory",
        "feature request"
    ],
    "commits": [
        {
            "associated_pull_request": [
                "https://github.com/netdata/netdata/pull/3769"
            ],
            "date": "2018-05-29 23:50:40",
            "diff": "netdata_netdata/issue_2956/commit_3700c70563f8adbb7d5cee1959c7f3355e750571.diff",
            "diff_additions": 1,
            "diff_deletions": 1,
            "diff_file_size": 0,
            "diff_url": "https://github.com/netdata/netdata/commit/3700c70563f8adbb7d5cee1959c7f3355e750571.diff",
            "exists": true,
            "files": [
                {
                    "file_additions": 1,
                    "file_deletions": 1,
                    "file_exists": false,
                    "file_name": "src/rrdset.c",
                    "file_size": 0
                }
            ],
            "interesting": {
                "reopen": false,
                "status": false
            },
            "is_parent": true,
            "sha": "3700c70563f8adbb7d5cee1959c7f3355e750571"
        },
        {
            "associated_pull_request": [],
            "date": "2018-05-30 20:53:53",
            "diff": "netdata_netdata/issue_2956/commit_dec412345838b4f7d613f2025c4de638cf9fe414.diff",
            "diff_additions": 173,
            "diff_deletions": 57,
            "diff_file_size": 0,
            "diff_url": "https://github.com/netdata/netdata/commit/dec412345838b4f7d613f2025c4de638cf9fe414.diff",
            "exists": true,
            "files": [
                {
                    "file_additions": 75,
                    "file_deletions": 0,
                    "file_exists": false,
                    "file_name": "src/appconfig.c",
                    "file_size": 0
                },
                {
                    "file_additions": 87,
                    "file_deletions": 55,
                    "file_exists": false,
                    "file_name": "src/health_config.c",
                    "file_size": 0
                },
                {
                    "file_additions": 4,
                    "file_deletions": 0,
                    "file_exists": false,
                    "file_name": "src/health_json.c",
                    "file_size": 0
                },
                {
                    "file_additions": 4,
                    "file_deletions": 1,
                    "file_exists": false,
                    "file_name": "src/rrdcalc.c",
                    "file_size": 0
                },
                {
                    "file_additions": 1,
                    "file_deletions": 1,
                    "file_exists": false,
                    "file_name": "src/rrdcalctemplate.c",
                    "file_size": 0
                },
                {
                    "file_additions": 2,
                    "file_deletions": 0,
                    "file_exists": false,
                    "file_name": "src/rrdhost.c",
                    "file_size": 0
                }
            ],
            "interesting": {
                "reopen": false,
                "status": false
            },
            "is_parent": false,
            "sha": "dec412345838b4f7d613f2025c4de638cf9fe414"
        },
        {
            "associated_pull_request": [],
            "date": "2019-02-19 11:27:33",
            "diff": "netdata_netdata/issue_2956/commit_4bd7b7d357d3976b9ab71c6d52283a0e082f4577.diff",
            "diff_additions": 176,
            "diff_deletions": 62,
            "diff_file_size": 181949,
            "diff_url": "https://github.com/netdata/netdata/commit/4bd7b7d357d3976b9ab71c6d52283a0e082f4577.diff",
            "exists": true,
            "files": [
                {
                    "file_additions": 10,
                    "file_deletions": 5,
                    "file_exists": true,
                    "file_name": "database/rrdcalc.c",
                    "file_size": 25397
                },
                {
                    "file_additions": 1,
                    "file_deletions": 1,
                    "file_exists": true,
                    "file_name": "database/rrdcalctemplate.c",
                    "file_size": 4866
                },
                {
                    "file_additions": 2,
                    "file_deletions": 0,
                    "file_exists": true,
                    "file_name": "database/rrdhost.c",
                    "file_size": 58967
                },
                {
                    "file_additions": 86,
                    "file_deletions": 56,
                    "file_exists": true,
                    "file_name": "health/health_config.c",
                    "file_size": 47154
                },
                {
                    "file_additions": 4,
                    "file_deletions": 0,
                    "file_exists": true,
                    "file_name": "health/health_json.c",
                    "file_size": 16734
                },
                {
                    "file_additions": 73,
                    "file_deletions": 0,
                    "file_exists": true,
                    "file_name": "libnetdata/config/appconfig.c",
                    "file_size": 28831
                }
            ],
            "interesting": {
                "reopen": false,
                "status": false
            },
            "is_parent": false,
            "sha": "4bd7b7d357d3976b9ab71c6d52283a0e082f4577"
        },
        {
            "associated_pull_request": [],
            "date": "2019-02-19 14:05:51",
            "diff": "netdata_netdata/issue_2956/commit_6c03a9f9e9c8e909a51f2a1d5e446ab88af053e2.diff",
            "diff_additions": 37,
            "diff_deletions": 8,
            "diff_file_size": 197974,
            "diff_url": "https://github.com/netdata/netdata/commit/6c03a9f9e9c8e909a51f2a1d5e446ab88af053e2.diff",
            "exists": true,
            "files": [
                {
                    "file_additions": 8,
                    "file_deletions": 4,
                    "file_exists": true,
                    "file_name": "database/rrdcalc.c",
                    "file_size": 25397
                },
                {
                    "file_additions": 1,
                    "file_deletions": 0,
                    "file_exists": true,
                    "file_name": "database/rrdhost.c",
                    "file_size": 58967
                },
                {
                    "file_additions": 20,
                    "file_deletions": 2,
                    "file_exists": true,
                    "file_name": "health/health.c",
                    "file_size": 42803
                },
                {
                    "file_additions": 1,
                    "file_deletions": 1,
                    "file_exists": true,
                    "file_name": "health/health_config.c",
                    "file_size": 47154
                },
                {
                    "file_additions": 7,
                    "file_deletions": 1,
                    "file_exists": true,
                    "file_name": "health/health_log.c",
                    "file_size": 23653
                }
            ],
            "interesting": {
                "reopen": false,
                "status": false
            },
            "is_parent": false,
            "sha": "6c03a9f9e9c8e909a51f2a1d5e446ab88af053e2"
        },
        {
            "associated_pull_request": [],
            "date": "2019-02-21 11:24:05",
            "diff": "netdata_netdata/issue_2956/commit_5bd3873011b828c5c40da2b2d03f4df324465d20.diff",
            "diff_additions": 50,
            "diff_deletions": 49,
            "diff_file_size": 214708,
            "diff_url": "https://github.com/netdata/netdata/commit/5bd3873011b828c5c40da2b2d03f4df324465d20.diff",
            "exists": true,
            "files": [
                {
                    "file_additions": 3,
                    "file_deletions": 6,
                    "file_exists": true,
                    "file_name": "database/rrdcalc.c",
                    "file_size": 25397
                },
                {
                    "file_additions": 1,
                    "file_deletions": 2,
                    "file_exists": true,
                    "file_name": "database/rrdhost.c",
                    "file_size": 58967
                },
                {
                    "file_additions": 27,
                    "file_deletions": 6,
                    "file_exists": true,
                    "file_name": "health/health.c",
                    "file_size": 42803
                },
                {
                    "file_additions": 14,
                    "file_deletions": 26,
                    "file_exists": true,
                    "file_name": "health/health_config.c",
                    "file_size": 47154
                },
                {
                    "file_additions": 2,
                    "file_deletions": 4,
                    "file_exists": true,
                    "file_name": "health/health_json.c",
                    "file_size": 16734
                },
                {
                    "file_additions": 3,
                    "file_deletions": 5,
                    "file_exists": true,
                    "file_name": "health/health_log.c",
                    "file_size": 23653
                }
            ],
            "interesting": {
                "reopen": false,
                "status": false
            },
            "is_parent": false,
            "sha": "5bd3873011b828c5c40da2b2d03f4df324465d20"
        },
        {
            "associated_pull_request": [],
            "date": "2019-02-26 01:06:37",
            "diff": "netdata_netdata/issue_2956/commit_01ae61257544854d3348bfe8029800e54cb7b59d.diff",
            "diff_additions": 186,
            "diff_deletions": 105,
            "diff_file_size": 214708,
            "diff_url": "https://github.com/netdata/netdata/commit/01ae61257544854d3348bfe8029800e54cb7b59d.diff",
            "exists": true,
            "files": [
                {
                    "file_additions": 9,
                    "file_deletions": 6,
                    "file_exists": true,
                    "file_name": "database/rrdcalc.c",
                    "file_size": 25397
                },
                {
                    "file_additions": 10,
                    "file_deletions": 2,
                    "file_exists": true,
                    "file_name": "database/rrdhost.c",
                    "file_size": 58967
                },
                {
                    "file_additions": 45,
                    "file_deletions": 36,
                    "file_exists": true,
                    "file_name": "health/health.c",
                    "file_size": 42803
                },
                {
                    "file_additions": 32,
                    "file_deletions": 18,
                    "file_exists": true,
                    "file_name": "health/health_config.c",
                    "file_size": 47154
                },
                {
                    "file_additions": 4,
                    "file_deletions": 2,
                    "file_exists": true,
                    "file_name": "health/health_json.c",
                    "file_size": 16734
                },
                {
                    "file_additions": 86,
                    "file_deletions": 41,
                    "file_exists": true,
                    "file_name": "health/health_log.c",
                    "file_size": 23653
                }
            ],
            "interesting": {
                "reopen": false,
                "status": false
            },
            "is_parent": false,
            "sha": "01ae61257544854d3348bfe8029800e54cb7b59d"
        },
        {
            "associated_pull_request": [],
            "date": "2019-02-26 01:43:58",
            "diff": "netdata_netdata/issue_2956/commit_ac011437ecb72b40dcbb3b349f0343b94d707430.diff",
            "diff_additions": 8,
            "diff_deletions": 13,
            "diff_file_size": 66456,
            "diff_url": "https://github.com/netdata/netdata/commit/ac011437ecb72b40dcbb3b349f0343b94d707430.diff",
            "exists": true,
            "files": [
                {
                    "file_additions": 6,
                    "file_deletions": 11,
                    "file_exists": true,
                    "file_name": "health/health.c",
                    "file_size": 42803
                },
                {
                    "file_additions": 2,
                    "file_deletions": 2,
                    "file_exists": true,
                    "file_name": "health/health_log.c",
                    "file_size": 23653
                }
            ],
            "interesting": {
                "reopen": false,
                "status": false
            },
            "is_parent": false,
            "sha": "ac011437ecb72b40dcbb3b349f0343b94d707430"
        },
        {
            "associated_pull_request": [],
            "date": "2019-03-22 13:36:26",
            "diff": "netdata_netdata/issue_2956/commit_b727cf0d617d752d47cf3999db1bcb86e78f7d0c.diff",
            "diff_additions": 197,
            "diff_deletions": 214,
            "diff_file_size": 202685,
            "diff_url": "https://github.com/netdata/netdata/commit/b727cf0d617d752d47cf3999db1bcb86e78f7d0c.diff",
            "exists": true,
            "files": [
                {
                    "file_additions": 16,
                    "file_deletions": 0,
                    "file_exists": true,
                    "file_name": "database/rrd.c",
                    "file_size": 4711
                },
                {
                    "file_additions": 9,
                    "file_deletions": 10,
                    "file_exists": true,
                    "file_name": "database/rrdcalc.c",
                    "file_size": 25397
                },
                {
                    "file_additions": 2,
                    "file_deletions": 10,
                    "file_exists": true,
                    "file_name": "database/rrdhost.c",
                    "file_size": 58967
                },
                {
                    "file_additions": 65,
                    "file_deletions": 66,
                    "file_exists": true,
                    "file_name": "health/health.c",
                    "file_size": 42803
                },
                {
                    "file_additions": 7,
                    "file_deletions": 22,
                    "file_exists": true,
                    "file_name": "health/health_config.c",
                    "file_size": 47154
                },
                {
                    "file_additions": 98,
                    "file_deletions": 106,
                    "file_exists": true,
                    "file_name": "health/health_log.c",
                    "file_size": 23653
                }
            ],
            "interesting": {
                "reopen": false,
                "status": true
            },
            "is_parent": false,
            "sha": "b727cf0d617d752d47cf3999db1bcb86e78f7d0c"
        },
        {
            "associated_pull_request": [],
            "date": "2019-03-22 16:13:25",
            "diff": "netdata_netdata/issue_2956/commit_5fe424fb2c8afcbbe7061adef4a9f3d1fd39efde.diff",
            "diff_additions": 5,
            "diff_deletions": 0,
            "diff_file_size": 47154,
            "diff_url": "https://github.com/netdata/netdata/commit/5fe424fb2c8afcbbe7061adef4a9f3d1fd39efde.diff",
            "exists": true,
            "files": [
                {
                    "file_additions": 5,
                    "file_deletions": 0,
                    "file_exists": true,
                    "file_name": "health/health_config.c",
                    "file_size": 47154
                }
            ],
            "interesting": {
                "reopen": false,
                "status": true
            },
            "is_parent": false,
            "sha": "5fe424fb2c8afcbbe7061adef4a9f3d1fd39efde"
        },
        {
            "associated_pull_request": [],
            "date": "2019-03-22 23:21:36",
            "diff": "netdata_netdata/issue_2956/commit_113aca7c1c80cb350d74a1591b74f1f5950cad10.diff",
            "diff_additions": 11,
            "diff_deletions": 14,
            "diff_file_size": 71167,
            "diff_url": "https://github.com/netdata/netdata/commit/113aca7c1c80cb350d74a1591b74f1f5950cad10.diff",
            "exists": true,
            "files": [
                {
                    "file_additions": 5,
                    "file_deletions": 4,
                    "file_exists": true,
                    "file_name": "database/rrd.c",
                    "file_size": 4711
                },
                {
                    "file_additions": 4,
                    "file_deletions": 5,
                    "file_exists": true,
                    "file_name": "health/health.c",
                    "file_size": 42803
                },
                {
                    "file_additions": 2,
                    "file_deletions": 5,
                    "file_exists": true,
                    "file_name": "health/health_log.c",
                    "file_size": 23653
                }
            ],
            "interesting": {
                "reopen": false,
                "status": false
            },
            "is_parent": false,
            "sha": "113aca7c1c80cb350d74a1591b74f1f5950cad10"
        },
        {
            "associated_pull_request": [],
            "date": "2019-03-23 00:00:36",
            "diff": "netdata_netdata/issue_2956/commit_03cecf05a045b4cf6b8564e66c5860b468bf5e25.diff",
            "diff_additions": 7,
            "diff_deletions": 4,
            "diff_file_size": 28364,
            "diff_url": "https://github.com/netdata/netdata/commit/03cecf05a045b4cf6b8564e66c5860b468bf5e25.diff",
            "exists": true,
            "files": [
                {
                    "file_additions": 6,
                    "file_deletions": 3,
                    "file_exists": true,
                    "file_name": "database/rrd.c",
                    "file_size": 4711
                },
                {
                    "file_additions": 1,
                    "file_deletions": 1,
                    "file_exists": true,
                    "file_name": "health/health_log.c",
                    "file_size": 23653
                }
            ],
            "interesting": {
                "reopen": false,
                "status": false
            },
            "is_parent": false,
            "sha": "03cecf05a045b4cf6b8564e66c5860b468bf5e25"
        },
        {
            "associated_pull_request": [],
            "date": "2019-03-23 01:08:07",
            "diff": "netdata_netdata/issue_2956/commit_26dc42924968b29848cdd0dfd33672ec49449208.diff",
            "diff_additions": 3,
            "diff_deletions": 9,
            "diff_file_size": 71167,
            "diff_url": "https://github.com/netdata/netdata/commit/26dc42924968b29848cdd0dfd33672ec49449208.diff",
            "exists": true,
            "files": [
                {
                    "file_additions": 2,
                    "file_deletions": 2,
                    "file_exists": true,
                    "file_name": "database/rrd.c",
                    "file_size": 4711
                },
                {
                    "file_additions": 0,
                    "file_deletions": 6,
                    "file_exists": true,
                    "file_name": "health/health.c",
                    "file_size": 42803
                },
                {
                    "file_additions": 1,
                    "file_deletions": 1,
                    "file_exists": true,
                    "file_name": "health/health_log.c",
                    "file_size": 23653
                }
            ],
            "interesting": {
                "reopen": false,
                "status": false
            },
            "is_parent": false,
            "sha": "26dc42924968b29848cdd0dfd33672ec49449208"
        },
        {
            "associated_pull_request": [],
            "date": "2019-03-27 00:03:07",
            "diff": "netdata_netdata/issue_2956/commit_b1987a0e982de5739584c97594c0a8d823ff125e.diff",
            "diff_additions": 30,
            "diff_deletions": 22,
            "diff_file_size": 186414,
            "diff_url": "https://github.com/netdata/netdata/commit/b1987a0e982de5739584c97594c0a8d823ff125e.diff",
            "exists": true,
            "files": [
                {
                    "file_additions": 2,
                    "file_deletions": 2,
                    "file_exists": true,
                    "file_name": "daemon/main.c",
                    "file_size": 60991
                },
                {
                    "file_additions": 3,
                    "file_deletions": 3,
                    "file_exists": true,
                    "file_name": "database/rrdhost.c",
                    "file_size": 58967
                },
                {
                    "file_additions": 1,
                    "file_deletions": 1,
                    "file_exists": true,
                    "file_name": "health/health.c",
                    "file_size": 42803
                },
                {
                    "file_additions": 24,
                    "file_deletions": 16,
                    "file_exists": true,
                    "file_name": "health/health_log.c",
                    "file_size": 23653
                }
            ],
            "interesting": {
                "reopen": false,
                "status": false
            },
            "is_parent": false,
            "sha": "b1987a0e982de5739584c97594c0a8d823ff125e"
        }
    ],
    "first_commit": "2018-05-29 23:50:40",
    "last_commit": "2019-03-27 00:03:07",
    "number": 2956,
    "pull_request": "None",
    "score": {
        "accidental_reopen_likely": false,
        "all_labels": [
            "area/health",
            "feature request",
            "priority/high"
        ],
        "contains_keywords": [
            "warn",
            "chang",
            "reason",
            "error",
            "workaround",
            "bug",
            "problem",
            "test",
            "fix",
            "patch",
            "remov",
            "issu",
            "work",
            "fault"
        ],
        "fix_size": 828,
        "has_labels": [],
        "intersecting": {
            "computed_score": 0.5909090909090909,
            "final_commit_size": 44,
            "intersection_size": 26,
            "previous_commits_size": 810
        },
        "is_makefile_based": true,
        "no_new_files": [
            "daemon/main.c"
        ],
        "no_other_files": false,
        "num_prohibited_files": 133501,
        "prohibited_files": [
            "hal/inc/pinmap_hal.h",
            "Debug/marvin.bin",
            "Debug/marvin.elf",
            "Debug/marvin.hex",
            "Debug/marvin.bin",
            "Debug/marvin.elf",
            "Debug/marvin.hex",
            "inc/spark_utilities.h",
            "Debug/marvin.bin",
            "Debug/marvin.elf"
        ],
        "reopen": false,
        "reopen_events": [
            [
                "2018-05-30 20:54:10",
                "commit"
            ],
            [
                "2019-02-19 11:27:50",
                "commit"
            ],
            [
                "2019-02-19 14:06:19",
                "commit"
            ],
            [
                "2019-02-21 11:24:25",
                "commit"
            ],
            [
                "2019-02-26 01:06:57",
                "commit"
            ],
            [
                "2019-02-26 01:44:10",
                "commit"
            ],
            [
                "2019-03-22 14:56:57",
                "commit"
            ],
            [
                "2019-03-22 16:17:13",
                "commit"
            ],
            [
                "2019-03-22 23:22:53",
                "commit"
            ],
            [
                "2019-03-22 23:32:18",
                "commit"
            ],
            [
                "2019-03-23 00:00:46",
                "commit"
            ],
            [
                "2019-03-23 01:08:16",
                "commit"
            ],
            [
                "2019-03-27 00:19:27",
                "commit"
            ],
            [
                "2019-07-02 16:26:22",
                "closed"
            ]
        ],
        "status": true,
        "strategy": true,
        "total_changes": 1442
    }
}