{
    "commits": [
        {
            "diff": "spring-projects_spring-boot/issue_15171/commit_c1b1f14f5a2c0c81da5ac85623659d182c349241.diff",
            "diff_additions": 31,
            "diff_deletions": 4,
            "diff_file_size": 19310,
            "files": [
                {
                    "file_additions": 0,
                    "file_deletions": 4,
                    "file_exists": true,
                    "file_name": "spring-boot-project/spring-boot-autoconfigure/src/main/java/org/springframework/boot/autoconfigure/web/servlet/MultipartProperties.java",
                    "file_size": 4383
                },
                {
                    "file_additions": 31,
                    "file_deletions": 0,
                    "file_exists": true,
                    "file_name": "spring-boot-project/spring-boot-autoconfigure/src/test/java/org/springframework/boot/autoconfigure/web/servlet/MultipartAutoConfigurationTests.java",
                    "file_size": 14927
                }
            ],
            "interesting": {
                "reopened": false,
                "status": false
            },
            "sha": "c1b1f14f5a2c0c81da5ac85623659d182c349241"
        },
        {
            "diff": "spring-projects_spring-boot/issue_15171/commit_fe9d9ec4e2eefd3ec29d9fa9288531ea10b237f7.diff",
            "diff_additions": 1,
            "diff_deletions": 1,
            "diff_file_size": 0,
            "files": [
                {
                    "file_additions": 1,
                    "file_deletions": 1,
                    "file_exists": false,
                    "file_name": "spring-boot-project/spring-boot-tools/spring-boot-gradle-plugin/src/test/java/org/springframework/boot/gradle/junit/GradleCompatibilitySuite.java",
                    "file_size": 0
                }
            ],
            "interesting": {
                "reopened": true,
                "status": false
            },
            "sha": "fe9d9ec4e2eefd3ec29d9fa9288531ea10b237f7"
        },
        {
            "diff": "spring-projects_spring-boot/issue_15171/commit_c0e286b96b86e0816ae456489ab93a14be1ab237.diff",
            "diff_additions": 1,
            "diff_deletions": 1,
            "diff_file_size": 0,
            "files": [
                {
                    "file_additions": 1,
                    "file_deletions": 1,
                    "file_exists": false,
                    "file_name": "spring-boot-project/spring-boot-tools/spring-boot-gradle-plugin/src/test/java/org/springframework/boot/gradle/junit/GradleCompatibilitySuite.java",
                    "file_size": 0
                }
            ],
            "interesting": {
                "reopened": true,
                "status": false
            },
            "sha": "c0e286b96b86e0816ae456489ab93a14be1ab237"
        },
        {
            "diff": "spring-projects_spring-boot/issue_15171/commit_a0d0ecf9d408d2bd0d84a67d4698b3edde9158ad.diff",
            "diff_additions": 1,
            "diff_deletions": 1,
            "diff_file_size": 0,
            "files": [
                {
                    "file_additions": 1,
                    "file_deletions": 1,
                    "file_exists": false,
                    "file_name": "spring-boot-project/spring-boot-tools/spring-boot-gradle-plugin/src/test/java/org/springframework/boot/gradle/junit/GradleCompatibilitySuite.java",
                    "file_size": 0
                }
            ],
            "interesting": {
                "reopened": false,
                "status": false
            },
            "sha": "a0d0ecf9d408d2bd0d84a67d4698b3edde9158ad"
        }
    ],
    "first_commit": "2018-11-15 08:17:26",
    "last_commit": "2018-11-26 16:02:54",
    "number": 15171,
    "score": 224.09756097560975
}