{
    "category": [
        "network/protocols",
        "network/protocol"
    ],
    "commits": [
        {
            "associated_pull_request": [],
            "date": "2014-09-23 14:34:58",
            "diff": "tass-belgium_picotcp/issue_182/commit_3816c2a7eed895e0a01ee6dfa673093a4c8847b4.diff",
            "diff_additions": 2,
            "diff_deletions": 2,
            "diff_file_size": 45397,
            "diff_url": "https://github.com/tass-belgium/picotcp/commit/3816c2a7eed895e0a01ee6dfa673093a4c8847b4.diff",
            "exists": true,
            "files": [
                {
                    "file_additions": 1,
                    "file_deletions": 1,
                    "file_exists": true,
                    "file_name": "modules/pico_dhcp_client.c",
                    "file_size": 32369
                },
                {
                    "file_additions": 1,
                    "file_deletions": 1,
                    "file_exists": true,
                    "file_name": "modules/pico_dhcp_server.c",
                    "file_size": 13028
                }
            ],
            "interesting": {
                "reopen": false,
                "status": false
            },
            "is_parent": true,
            "sha": "3816c2a7eed895e0a01ee6dfa673093a4c8847b4"
        },
        {
            "associated_pull_request": [],
            "date": "2014-09-23 15:19:56",
            "diff": "tass-belgium_picotcp/issue_182/commit_d4412eef3bc60af2f209c83e49c50b3b1ba5f582.diff",
            "diff_additions": 13,
            "diff_deletions": 0,
            "diff_file_size": 57514,
            "diff_url": "https://github.com/tass-belgium/picotcp/commit/d4412eef3bc60af2f209c83e49c50b3b1ba5f582.diff",
            "exists": true,
            "files": [
                {
                    "file_additions": 5,
                    "file_deletions": 0,
                    "file_exists": true,
                    "file_name": "modules/pico_icmp4.c",
                    "file_size": 12238
                },
                {
                    "file_additions": 8,
                    "file_deletions": 0,
                    "file_exists": true,
                    "file_name": "modules/pico_ipv4.c",
                    "file_size": 45276
                }
            ],
            "interesting": {
                "reopen": true,
                "status": false
            },
            "is_parent": false,
            "sha": "d4412eef3bc60af2f209c83e49c50b3b1ba5f582"
        },
        {
            "associated_pull_request": [],
            "date": "2014-09-23 23:49:35",
            "diff": "tass-belgium_picotcp/issue_182/commit_ad244fef83261e0dec74830b5999e0b43e3d0846.diff",
            "diff_additions": 82,
            "diff_deletions": 76,
            "diff_file_size": 88071,
            "diff_url": "https://github.com/tass-belgium/picotcp/commit/ad244fef83261e0dec74830b5999e0b43e3d0846.diff",
            "exists": true,
            "files": [
                {
                    "file_additions": 1,
                    "file_deletions": 1,
                    "file_exists": true,
                    "file_name": "modules/pico_ipv6_nd.c",
                    "file_size": 50655
                },
                {
                    "file_additions": 1,
                    "file_deletions": 1,
                    "file_exists": true,
                    "file_name": "stack/pico_device.c",
                    "file_size": 14176
                },
                {
                    "file_additions": 80,
                    "file_deletions": 74,
                    "file_exists": true,
                    "file_name": "stack/pico_stack.c",
                    "file_size": 23240
                }
            ],
            "interesting": {
                "reopen": false,
                "status": false
            },
            "is_parent": false,
            "sha": "ad244fef83261e0dec74830b5999e0b43e3d0846"
        }
    ],
    "first_commit": "2014-09-23 14:34:58",
    "last_commit": "2014-09-23 23:49:35",
    "number": 182,
    "pull_request": "None",
    "score": {
        "accidental_reopen_likely": false,
        "all_labels": [
            "RFC Violation",
            "bug"
        ],
        "contains_keywords": [
            "report",
            "confirm",
            "bug",
            "problem",
            "test",
            "fix",
            "issu",
            "work"
        ],
        "fix_size": 169,
        "has_labels": [
            "bug"
        ],
        "intersecting": {
            "computed_score": 0.0,
            "final_commit_size": 154,
            "intersection_size": 0,
            "previous_commits_size": 15
        },
        "is_makefile_based": true,
        "no_new_files": [
            "modules/pico_ipv6_nd.c",
            "stack/pico_device.c",
            "stack/pico_stack.c"
        ],
        "no_other_files": false,
        "num_prohibited_files": 12870,
        "prohibited_files": [
            "hal/inc/pinmap_hal.h",
            "Debug/marvin.bin",
            "Debug/marvin.elf",
            "Debug/marvin.hex",
            "Debug/marvin.bin",
            "Debug/marvin.elf",
            "Debug/marvin.hex",
            "inc/spark_utilities.h",
            "Debug/marvin.bin",
            "Debug/marvin.elf"
        ],
        "reopen": true,
        "reopen_events": [
            [
                "2014-09-23 15:21:47",
                "closed"
            ],
            [
                "2014-09-23 15:21:47",
                "commit"
            ],
            [
                "2014-09-23 15:22:02",
                "reopened"
            ],
            [
                "2014-09-24 00:00:12",
                "commit"
            ],
            [
                "2014-09-25 10:05:10",
                "closed"
            ]
        ],
        "status": false,
        "strategy": true,
        "total_changes": 175
    }
}