{
    "covered_issues": [
        159,
        155,
        144,
        141,
        140,
        137,
        132,
        118,
        117,
        105,
        104,
        101,
        94,
        90,
        88,
        87,
        85,
        82,
        80,
        77,
        73,
        68,
        66,
        62,
        58,
        57,
        56,
        54,
        52,
        51,
        48,
        47,
        45,
        44,
        43,
        42,
        40,
        38,
        37,
        30,
        26,
        24,
        23,
        18,
        16,
        14,
        13,
        11,
        10,
        8,
        7,
        4,
        3,
        2,
        1
    ],
    "finished": true
}