{
    "commits": [
        {
            "associated_pull_request": [
                "https://github.com/jtheoof/swappy/pull/18"
            ],
            "date": "2020-05-31 02:36:35+00:00",
            "diff": "",
            "diff_additions": 0,
            "diff_deletions": 0,
            "diff_file_size": 0,
            "diff_url": "https://github.com/jtheoof/swappy/commit/f6c894a39f08462d3012e8278ab0c12cc143e5eb.diff",
            "exists": true,
            "files": [],
            "interesting": {
                "reopen": false,
                "status": false
            },
            "is_parent": true,
            "sha": "f6c894a39f08462d3012e8278ab0c12cc143e5eb"
        },
        {
            "associated_pull_request": [],
            "date": "2020-05-31 03:18:58+00:00",
            "diff": "jtheoof_swappy/issue_17/commit_798224762632f2e7acc9016650d291b34cf1db30.diff",
            "diff_additions": 283,
            "diff_deletions": 13,
            "diff_file_size": 62073,
            "diff_url": "https://github.com/jtheoof/swappy/commit/798224762632f2e7acc9016650d291b34cf1db30.diff",
            "exists": true,
            "files": [
                {
                    "file_additions": 69,
                    "file_deletions": 0,
                    "file_exists": true,
                    "file_name": "src/application.c",
                    "file_size": 30824
                },
                {
                    "file_additions": 20,
                    "file_deletions": 2,
                    "file_exists": true,
                    "file_name": "src/config.c",
                    "file_size": 7980
                },
                {
                    "file_additions": 1,
                    "file_deletions": 1,
                    "file_exists": true,
                    "file_name": "src/main.c",
                    "file_size": 485
                },
                {
                    "file_additions": 31,
                    "file_deletions": 10,
                    "file_exists": true,
                    "file_name": "src/paint.c",
                    "file_size": 7750
                },
                {
                    "file_additions": 162,
                    "file_deletions": 0,
                    "file_exists": true,
                    "file_name": "src/render.c",
                    "file_size": 15034
                }
            ],
            "interesting": {
                "reopen": false,
                "status": false
            },
            "is_parent": false,
            "sha": "798224762632f2e7acc9016650d291b34cf1db30"
        },
        {
            "associated_pull_request": [],
            "date": "2020-05-31 03:18:58+00:00",
            "diff": "jtheoof_swappy/issue_17/commit_4b2921d1788703caec974df31947cb807a0164ed.diff",
            "diff_additions": 273,
            "diff_deletions": 13,
            "diff_file_size": 62073,
            "diff_url": "https://github.com/jtheoof/swappy/commit/4b2921d1788703caec974df31947cb807a0164ed.diff",
            "exists": true,
            "files": [
                {
                    "file_additions": 69,
                    "file_deletions": 0,
                    "file_exists": true,
                    "file_name": "src/application.c",
                    "file_size": 30824
                },
                {
                    "file_additions": 20,
                    "file_deletions": 2,
                    "file_exists": true,
                    "file_name": "src/config.c",
                    "file_size": 7980
                },
                {
                    "file_additions": 1,
                    "file_deletions": 1,
                    "file_exists": true,
                    "file_name": "src/main.c",
                    "file_size": 485
                },
                {
                    "file_additions": 31,
                    "file_deletions": 10,
                    "file_exists": true,
                    "file_name": "src/paint.c",
                    "file_size": 7750
                },
                {
                    "file_additions": 152,
                    "file_deletions": 0,
                    "file_exists": true,
                    "file_name": "src/render.c",
                    "file_size": 15034
                }
            ],
            "interesting": {
                "reopen": false,
                "status": false
            },
            "is_parent": false,
            "sha": "4b2921d1788703caec974df31947cb807a0164ed"
        },
        {
            "associated_pull_request": [],
            "date": "2020-05-31 03:18:58+00:00",
            "diff": "jtheoof_swappy/issue_17/commit_d018332004e8ebdb311570af79f2b78715dca74a.diff",
            "diff_additions": 271,
            "diff_deletions": 13,
            "diff_file_size": 62073,
            "diff_url": "https://github.com/jtheoof/swappy/commit/d018332004e8ebdb311570af79f2b78715dca74a.diff",
            "exists": true,
            "files": [
                {
                    "file_additions": 69,
                    "file_deletions": 0,
                    "file_exists": true,
                    "file_name": "src/application.c",
                    "file_size": 30824
                },
                {
                    "file_additions": 20,
                    "file_deletions": 2,
                    "file_exists": true,
                    "file_name": "src/config.c",
                    "file_size": 7980
                },
                {
                    "file_additions": 1,
                    "file_deletions": 1,
                    "file_exists": true,
                    "file_name": "src/main.c",
                    "file_size": 485
                },
                {
                    "file_additions": 31,
                    "file_deletions": 10,
                    "file_exists": true,
                    "file_name": "src/paint.c",
                    "file_size": 7750
                },
                {
                    "file_additions": 150,
                    "file_deletions": 0,
                    "file_exists": true,
                    "file_name": "src/render.c",
                    "file_size": 15034
                }
            ],
            "interesting": {
                "reopen": false,
                "status": false
            },
            "is_parent": false,
            "sha": "d018332004e8ebdb311570af79f2b78715dca74a"
        },
        {
            "associated_pull_request": [
                "https://github.com/jtheoof/swappy/pull/18"
            ],
            "date": "2020-05-31 03:18:58+00:00",
            "diff": "jtheoof_swappy/issue_17/commit_31c1392ebf5b233ef9c838f226ad0f21d76ddee0.diff",
            "diff_additions": 270,
            "diff_deletions": 12,
            "diff_file_size": 61588,
            "diff_url": "https://github.com/jtheoof/swappy/commit/31c1392ebf5b233ef9c838f226ad0f21d76ddee0.diff",
            "exists": true,
            "files": [
                {
                    "file_additions": 69,
                    "file_deletions": 0,
                    "file_exists": true,
                    "file_name": "src/application.c",
                    "file_size": 30824
                },
                {
                    "file_additions": 20,
                    "file_deletions": 2,
                    "file_exists": true,
                    "file_name": "src/config.c",
                    "file_size": 7980
                },
                {
                    "file_additions": 31,
                    "file_deletions": 10,
                    "file_exists": true,
                    "file_name": "src/paint.c",
                    "file_size": 7750
                },
                {
                    "file_additions": 150,
                    "file_deletions": 0,
                    "file_exists": true,
                    "file_name": "src/render.c",
                    "file_size": 15034
                }
            ],
            "interesting": {
                "reopen": false,
                "status": false
            },
            "is_parent": false,
            "sha": "31c1392ebf5b233ef9c838f226ad0f21d76ddee0"
        },
        {
            "associated_pull_request": [
                "https://github.com/jtheoof/swappy/pull/18"
            ],
            "date": "2020-05-31 03:18:58+00:00",
            "diff": "jtheoof_swappy/issue_17/commit_fae0aeacab6fb28e17975097c8b4c5c7e5ad57fd.diff",
            "diff_additions": 270,
            "diff_deletions": 12,
            "diff_file_size": 61588,
            "diff_url": "https://github.com/jtheoof/swappy/commit/fae0aeacab6fb28e17975097c8b4c5c7e5ad57fd.diff",
            "exists": true,
            "files": [
                {
                    "file_additions": 69,
                    "file_deletions": 0,
                    "file_exists": true,
                    "file_name": "src/application.c",
                    "file_size": 30824
                },
                {
                    "file_additions": 20,
                    "file_deletions": 2,
                    "file_exists": true,
                    "file_name": "src/config.c",
                    "file_size": 7980
                },
                {
                    "file_additions": 31,
                    "file_deletions": 10,
                    "file_exists": true,
                    "file_name": "src/paint.c",
                    "file_size": 7750
                },
                {
                    "file_additions": 150,
                    "file_deletions": 0,
                    "file_exists": true,
                    "file_name": "src/render.c",
                    "file_size": 15034
                }
            ],
            "interesting": {
                "reopen": true,
                "status": false
            },
            "is_parent": false,
            "sha": "fae0aeacab6fb28e17975097c8b4c5c7e5ad57fd"
        },
        {
            "associated_pull_request": [],
            "date": "2020-06-02 03:15:49+00:00",
            "diff": "jtheoof_swappy/issue_17/commit_d9d27f436562cece9c12c53fae164ce7a4e1819f.diff",
            "diff_additions": 82,
            "diff_deletions": 89,
            "diff_file_size": 61588,
            "diff_url": "https://github.com/jtheoof/swappy/commit/d9d27f436562cece9c12c53fae164ce7a4e1819f.diff",
            "exists": true,
            "files": [
                {
                    "file_additions": 29,
                    "file_deletions": 29,
                    "file_exists": true,
                    "file_name": "src/application.c",
                    "file_size": 30824
                },
                {
                    "file_additions": 10,
                    "file_deletions": 10,
                    "file_exists": true,
                    "file_name": "src/config.c",
                    "file_size": 7980
                },
                {
                    "file_additions": 9,
                    "file_deletions": 14,
                    "file_exists": true,
                    "file_name": "src/paint.c",
                    "file_size": 7750
                },
                {
                    "file_additions": 34,
                    "file_deletions": 36,
                    "file_exists": true,
                    "file_name": "src/render.c",
                    "file_size": 15034
                }
            ],
            "interesting": {
                "reopen": false,
                "status": false
            },
            "is_parent": false,
            "sha": "d9d27f436562cece9c12c53fae164ce7a4e1819f"
        },
        {
            "associated_pull_request": [
                "https://github.com/jtheoof/swappy/pull/19"
            ],
            "date": "2020-06-02 03:15:49+00:00",
            "diff": "jtheoof_swappy/issue_17/commit_bc8895fc514f7af1f43e173418823284de33a543.diff",
            "diff_additions": 82,
            "diff_deletions": 89,
            "diff_file_size": 61588,
            "diff_url": "https://github.com/jtheoof/swappy/commit/bc8895fc514f7af1f43e173418823284de33a543.diff",
            "exists": true,
            "files": [
                {
                    "file_additions": 29,
                    "file_deletions": 29,
                    "file_exists": true,
                    "file_name": "src/application.c",
                    "file_size": 30824
                },
                {
                    "file_additions": 10,
                    "file_deletions": 10,
                    "file_exists": true,
                    "file_name": "src/config.c",
                    "file_size": 7980
                },
                {
                    "file_additions": 9,
                    "file_deletions": 14,
                    "file_exists": true,
                    "file_name": "src/paint.c",
                    "file_size": 7750
                },
                {
                    "file_additions": 34,
                    "file_deletions": 36,
                    "file_exists": true,
                    "file_name": "src/render.c",
                    "file_size": 15034
                }
            ],
            "interesting": {
                "reopen": false,
                "status": false
            },
            "is_parent": false,
            "sha": "bc8895fc514f7af1f43e173418823284de33a543"
        },
        {
            "associated_pull_request": [
                "https://github.com/jtheoof/swappy/pull/19"
            ],
            "date": "2020-06-02 03:15:49+00:00",
            "diff": "jtheoof_swappy/issue_17/commit_1be7798a8bcfc494b20489e2e1f8b0245f4b5e84.diff",
            "diff_additions": 82,
            "diff_deletions": 89,
            "diff_file_size": 61588,
            "diff_url": "https://github.com/jtheoof/swappy/commit/1be7798a8bcfc494b20489e2e1f8b0245f4b5e84.diff",
            "exists": true,
            "files": [
                {
                    "file_additions": 29,
                    "file_deletions": 29,
                    "file_exists": true,
                    "file_name": "src/application.c",
                    "file_size": 30824
                },
                {
                    "file_additions": 10,
                    "file_deletions": 10,
                    "file_exists": true,
                    "file_name": "src/config.c",
                    "file_size": 7980
                },
                {
                    "file_additions": 9,
                    "file_deletions": 14,
                    "file_exists": true,
                    "file_name": "src/paint.c",
                    "file_size": 7750
                },
                {
                    "file_additions": 34,
                    "file_deletions": 36,
                    "file_exists": true,
                    "file_name": "src/render.c",
                    "file_size": 15034
                }
            ],
            "interesting": {
                "reopen": false,
                "status": false
            },
            "is_parent": false,
            "sha": "1be7798a8bcfc494b20489e2e1f8b0245f4b5e84"
        }
    ],
    "first_commit": "2020-05-31 02:36:35+00:00",
    "last_commit": "2020-06-02 03:32:07+00:00",
    "number": 17,
    "pull_request": "None",
    "score": {
        "accidental_reopen_likely": false,
        "all_labels": [
            "enhancement"
        ],
        "contains_keywords": [
            "work",
            "chang",
            "fix",
            "issu",
            "patch",
            "perform",
            "test",
            "remov",
            "problem"
        ],
        "fix_size": 330,
        "has_labels": [],
        "intersecting": {
            "computed_score": 1.0,
            "final_commit_size": 119,
            "intersection_size": 119,
            "previous_commits_size": 330
        },
        "is_makefile_based": false,
        "no_new_files": [],
        "no_other_files": false,
        "num_prohibited_files": 491162,
        "prohibited_files": [
            "server/src/main/java/com/genymobile/scrcpy/Device.java",
            "server/src/main/java/com/genymobile/scrcpy/wrappers/SurfaceControl.java",
            "server/src/main/java/com/genymobile/scrcpy/Device.java",
            "server/src/main/java/com/genymobile/scrcpy/wrappers/SurfaceControl.java",
            "app/meson.build",
            "app/scrcpy.1",
            "app/src/common.h",
            "app/src/scrcpy.h",
            "app/src/server.h",
            "server/src/main/java/com/genymobile/scrcpy/Workarounds.java"
        ],
        "reopen": true,
        "reopen_events": [
            [
                "2020-06-01 03:14:13+00:00",
                "commit"
            ],
            [
                "2020-06-01 03:16:14+00:00",
                "commit"
            ],
            [
                "2020-06-01 03:16:52+00:00",
                "commit"
            ],
            [
                "2020-06-01 03:23:42+00:00",
                "commit"
            ],
            [
                "2020-06-01 03:25:40+00:00",
                "closed"
            ],
            [
                "2020-06-01 03:25:40+00:00",
                "commit"
            ],
            [
                "2020-06-01 15:49:35+00:00",
                "reopened"
            ],
            [
                "2020-06-02 03:29:37+00:00",
                "commit"
            ],
            [
                "2020-06-02 03:30:39+00:00",
                "commit"
            ],
            [
                "2020-06-02 03:32:08+00:00",
                "closed"
            ],
            [
                "2020-06-02 03:32:09+00:00",
                "commit"
            ]
        ],
        "status": false,
        "strategy": true,
        "total_changes": 1943
    }
}