{
    "commits": [
        {
            "associated_pull_request": [],
            "date": "2022-07-06 23:26:14+00:00",
            "diff": "apache_age/issue_240/commit_99e7c625d97782849e39bca93daca07b35c60772.diff",
            "diff_additions": 81,
            "diff_deletions": 22,
            "diff_file_size": 43532,
            "diff_url": "https://github.com/apache/age/commit/99e7c625d97782849e39bca93daca07b35c60772.diff",
            "exists": true,
            "files": [
                {
                    "file_additions": 56,
                    "file_deletions": 14,
                    "file_exists": true,
                    "file_name": "src/backend/executor/cypher_merge.c",
                    "file_size": 35133
                },
                {
                    "file_additions": 25,
                    "file_deletions": 8,
                    "file_exists": true,
                    "file_name": "src/backend/executor/cypher_utils.c",
                    "file_size": 8399
                }
            ],
            "interesting": {
                "reopen": false,
                "status": false
            },
            "is_parent": true,
            "sha": "99e7c625d97782849e39bca93daca07b35c60772"
        },
        {
            "associated_pull_request": [],
            "date": "2022-07-11 19:47:40+00:00",
            "diff": "apache_age/issue_240/commit_4b94b98936f81f68ce305ae8aeeff97b41d765ef.diff",
            "diff_additions": 8,
            "diff_deletions": 6,
            "diff_file_size": 349910,
            "diff_url": "https://github.com/apache/age/commit/4b94b98936f81f68ce305ae8aeeff97b41d765ef.diff",
            "exists": true,
            "files": [
                {
                    "file_additions": 8,
                    "file_deletions": 6,
                    "file_exists": true,
                    "file_name": "src/backend/utils/adt/agtype.c",
                    "file_size": 349910
                }
            ],
            "interesting": {
                "reopen": true,
                "status": false
            },
            "is_parent": false,
            "sha": "4b94b98936f81f68ce305ae8aeeff97b41d765ef"
        },
        {
            "associated_pull_request": [],
            "date": "2022-07-13 12:40:38+00:00",
            "diff": "apache_age/issue_240/commit_a3edc805da2897431be57ba5541275caa9996e95.diff",
            "diff_additions": 6,
            "diff_deletions": 8,
            "diff_file_size": 349910,
            "diff_url": "https://github.com/apache/age/commit/a3edc805da2897431be57ba5541275caa9996e95.diff",
            "exists": true,
            "files": [
                {
                    "file_additions": 6,
                    "file_deletions": 8,
                    "file_exists": true,
                    "file_name": "src/backend/utils/adt/agtype.c",
                    "file_size": 349910
                }
            ],
            "interesting": {
                "reopen": false,
                "status": false
            },
            "is_parent": false,
            "sha": "a3edc805da2897431be57ba5541275caa9996e95"
        },
        {
            "associated_pull_request": [],
            "date": "2022-07-12 22:51:56+00:00",
            "diff": "apache_age/issue_240/commit_5ded59fca7b43612abb9baf50cf2905deb349ebb.diff",
            "diff_additions": 152,
            "diff_deletions": 89,
            "diff_file_size": 402761,
            "diff_url": "https://github.com/apache/age/commit/5ded59fca7b43612abb9baf50cf2905deb349ebb.diff",
            "exists": true,
            "files": [
                {
                    "file_additions": 30,
                    "file_deletions": 60,
                    "file_exists": true,
                    "file_name": "src/backend/parser/cypher_expr.c",
                    "file_size": 52851
                },
                {
                    "file_additions": 122,
                    "file_deletions": 29,
                    "file_exists": true,
                    "file_name": "src/backend/utils/adt/agtype.c",
                    "file_size": 349910
                }
            ],
            "interesting": {
                "reopen": false,
                "status": false
            },
            "is_parent": false,
            "sha": "5ded59fca7b43612abb9baf50cf2905deb349ebb"
        },
        {
            "associated_pull_request": [],
            "date": "2022-07-12 22:51:56+00:00",
            "diff": "apache_age/issue_240/commit_8d7a42251a797fc795fdf78c8dc7f5d6d2ea40d3.diff",
            "diff_additions": 152,
            "diff_deletions": 89,
            "diff_file_size": 402761,
            "diff_url": "https://github.com/apache/age/commit/8d7a42251a797fc795fdf78c8dc7f5d6d2ea40d3.diff",
            "exists": true,
            "files": [
                {
                    "file_additions": 30,
                    "file_deletions": 60,
                    "file_exists": true,
                    "file_name": "src/backend/parser/cypher_expr.c",
                    "file_size": 52851
                },
                {
                    "file_additions": 122,
                    "file_deletions": 29,
                    "file_exists": true,
                    "file_name": "src/backend/utils/adt/agtype.c",
                    "file_size": 349910
                }
            ],
            "interesting": {
                "reopen": false,
                "status": false
            },
            "is_parent": false,
            "sha": "8d7a42251a797fc795fdf78c8dc7f5d6d2ea40d3"
        }
    ],
    "first_commit": "2022-07-07 16:16:17+00:00",
    "last_commit": "2022-07-13 21:24:47+00:00",
    "number": 240,
    "pull_request": "None",
    "score": {
        "accidental_reopen_likely": false,
        "all_labels": [
            "bug"
        ],
        "contains_keywords": [
            "work",
            "chang",
            "fix",
            "issu",
            "patch",
            "reason",
            "test",
            "remov",
            "error",
            "problem"
        ],
        "fix_size": 233,
        "has_labels": [
            "bug"
        ],
        "intersecting": {
            "computed_score": 1.0,
            "final_commit_size": 222,
            "intersection_size": 222,
            "previous_commits_size": 233
        },
        "is_makefile_based": true,
        "no_new_files": [],
        "no_other_files": false,
        "num_prohibited_files": 256998,
        "prohibited_files": [
            "server/src/main/java/com/genymobile/scrcpy/Device.java",
            "server/src/main/java/com/genymobile/scrcpy/wrappers/SurfaceControl.java",
            "server/src/main/java/com/genymobile/scrcpy/Device.java",
            "server/src/main/java/com/genymobile/scrcpy/wrappers/SurfaceControl.java",
            "app/meson.build",
            "app/scrcpy.1",
            "app/src/common.h",
            "app/src/scrcpy.h",
            "app/src/server.h",
            "server/src/main/java/com/genymobile/scrcpy/Workarounds.java"
        ],
        "reopen": true,
        "reopen_events": [
            [
                "2022-07-11 20:02:07+00:00",
                "commit"
            ],
            [
                "2022-07-12 07:43:23+00:00",
                "closed"
            ],
            [
                "2022-07-12 13:57:35+00:00",
                "reopened"
            ],
            [
                "2022-07-13 08:23:18+00:00",
                "commit"
            ],
            [
                "2022-07-13 15:32:50+00:00",
                "commit"
            ],
            [
                "2022-07-13 15:55:21+00:00",
                "commit"
            ],
            [
                "2022-07-13 18:41:25+00:00",
                "closed"
            ],
            [
                "2022-07-13 21:25:14+00:00",
                "commit"
            ]
        ],
        "status": false,
        "strategy": true,
        "total_changes": 613
    }
}