{
    "covered_issues": [
        2227,
        2223,
        2218,
        2217,
        2216,
        2215,
        2204,
        2201,
        2200,
        2192,
        2190,
        2189,
        2187,
        2185,
        2184,
        2183,
        2182,
        2181,
        2173,
        2169,
        2166,
        2161,
        2160,
        2158,
        2157,
        2156,
        2154,
        2151,
        2149,
        2148,
        2147,
        2145,
        2144,
        2142,
        2139,
        2138,
        2135,
        2134,
        2133,
        2129,
        2128,
        2125,
        2123,
        2121,
        2120,
        2119,
        2118,
        2117,
        2116,
        2114,
        2113,
        2104,
        2098,
        2097,
        2096,
        2093,
        2091,
        2086,
        2084,
        2083,
        2081,
        2077,
        2075,
        2074,
        2072,
        2071,
        2069,
        2068,
        2065,
        2062,
        2057,
        2049,
        2047,
        2044,
        2040,
        2038,
        2036,
        2035,
        2033,
        2029,
        2028,
        2026,
        2023,
        2022,
        2021,
        2020,
        2019,
        2018,
        2014,
        2013,
        2012,
        2011,
        2008,
        2007,
        2006,
        2005,
        2002,
        2001,
        1999,
        1998,
        1997,
        1996,
        1995,
        1994,
        1990,
        1989,
        1985,
        1983,
        1979,
        1978,
        1977,
        1976,
        1975,
        1974,
        1973,
        1972,
        1971,
        1969,
        1968,
        1967,
        1965,
        1961,
        1955,
        1952,
        1951,
        1950,
        1949,
        1948,
        1947,
        1945,
        1941,
        1938,
        1937,
        1935,
        1929,
        1928,
        1927,
        1925,
        1924,
        1921,
        1920,
        1919,
        1918,
        1917,
        1913,
        1911,
        1910,
        1909,
        1908,
        1905,
        1903,
        1902,
        1901,
        1893,
        1892,
        1888,
        1883,
        1882,
        1881,
        1876,
        1875,
        1874,
        1873,
        1872,
        1871,
        1870,
        1869,
        1867,
        1866,
        1865,
        1862,
        1861,
        1860,
        1859,
        1858,
        1854,
        1851,
        1850,
        1849,
        1846,
        1843,
        1842,
        1841,
        1837,
        1836,
        1835,
        1834,
        1833,
        1832,
        1831,
        1829,
        1828,
        1827,
        1826,
        1825,
        1823,
        1822,
        1821,
        1820,
        1819,
        1818,
        1817,
        1816,
        1814,
        1813,
        1812,
        1810,
        1809,
        1808,
        1807,
        1806,
        1805,
        1803,
        1802,
        1799,
        1798,
        1797,
        1796,
        1795,
        1794,
        1793,
        1792,
        1791,
        1789,
        1788,
        1787,
        1786,
        1785,
        1784,
        1783,
        1781,
        1778,
        1777,
        1776,
        1774,
        1773,
        1772,
        1771,
        1770,
        1769,
        1768,
        1767,
        1766,
        1765,
        1764,
        1762,
        1761,
        1760,
        1759,
        1758,
        1756,
        1755,
        1754,
        1753,
        1752,
        1751,
        1750,
        1748,
        1747,
        1745,
        1744,
        1742,
        1740,
        1739,
        1737,
        1735,
        1733,
        1730,
        1729,
        1728,
        1727,
        1726,
        1725,
        1723,
        1721,
        1720,
        1719,
        1718,
        1717,
        1716,
        1715,
        1714,
        1713,
        1712,
        1711,
        1710,
        1708,
        1707,
        1706,
        1705,
        1704,
        1703,
        1702,
        1701,
        1700,
        1699,
        1694,
        1693,
        1692,
        1691,
        1690,
        1688,
        1685,
        1684,
        1683,
        1682,
        1681,
        1680,
        1679,
        1678,
        1677,
        1676,
        1675,
        1674,
        1673,
        1672,
        1671,
        1670,
        1669,
        1667,
        1666,
        1665,
        1664,
        1663,
        1662,
        1660,
        1659,
        1658,
        1657,
        1656,
        1655,
        1654,
        1653,
        1652,
        1651,
        1650,
        1648,
        1646,
        1645,
        1644,
        1643,
        1642,
        1641,
        1640,
        1639,
        1638,
        1637,
        1636,
        1635,
        1633,
        1632,
        1629,
        1628,
        1627,
        1622,
        1621,
        1620,
        1619,
        1618,
        1617,
        1616,
        1615,
        1613,
        1612,
        1611,
        1610,
        1609,
        1606,
        1605,
        1604,
        1602,
        1601,
        1599,
        1598,
        1597,
        1596,
        1595,
        1594,
        1593,
        1592,
        1591,
        1589,
        1588,
        1587,
        1586,
        1585,
        1583,
        1582,
        1581,
        1580,
        1579,
        1576,
        1575,
        1574,
        1572,
        1568,
        1567,
        1565,
        1564,
        1562,
        1560,
        1558,
        1557,
        1554,
        1553,
        1552,
        1551,
        1550,
        1549,
        1548,
        1547,
        1546,
        1545,
        1544,
        1543,
        1542,
        1541,
        1540,
        1539,
        1538,
        1537,
        1536,
        1535,
        1534,
        1533,
        1532,
        1531,
        1530,
        1529,
        1528,
        1527,
        1526,
        1525,
        1524,
        1523,
        1522,
        1521,
        1520,
        1519,
        1518,
        1517,
        1516,
        1515,
        1514,
        1513,
        1512,
        1511,
        1510,
        1509,
        1508,
        1507,
        1506,
        1505,
        1504,
        1503,
        1502,
        1501,
        1500,
        1499,
        1498,
        1497,
        1496,
        1495,
        1494,
        1493,
        1492,
        1491,
        1490,
        1489,
        1488,
        1487,
        1486,
        1485,
        1484,
        1483,
        1482,
        1481,
        1480,
        1479,
        1478,
        1477,
        1476,
        1473,
        1472,
        1471,
        1469,
        1468,
        1467,
        1466,
        1465,
        1464,
        1463,
        1462,
        1461,
        1460,
        1459,
        1458,
        1457,
        1456,
        1455,
        1454,
        1453,
        1452,
        1451,
        1450,
        1449,
        1448,
        1447,
        1446,
        1445,
        1444,
        1443,
        1442,
        1441,
        1440,
        1439,
        1438,
        1436,
        1435,
        1434,
        1433,
        1432,
        1431,
        1430,
        1429,
        1428,
        1427,
        1426,
        1425,
        1424,
        1423,
        1422,
        1421,
        1420,
        1419,
        1418,
        1417,
        1416,
        1415,
        1414,
        1413,
        1412,
        1411,
        1410,
        1409,
        1408,
        1407,
        1406,
        1405,
        1404,
        1403,
        1402,
        1401,
        1400,
        1399,
        1398,
        1397,
        1396,
        1395,
        1394,
        1393,
        1392,
        1391,
        1390,
        1389,
        1388,
        1387,
        1386,
        1385,
        1384,
        1383,
        1382,
        1381,
        1380,
        1379,
        1378,
        1377,
        1376,
        1375,
        1374,
        1373,
        1372,
        1371,
        1370,
        1369,
        1368,
        1367,
        1366,
        1365,
        1364,
        1363,
        1362,
        1361,
        1360,
        1359,
        1358,
        1357,
        1356,
        1355,
        1354,
        1353,
        1352,
        1351,
        1350,
        1349,
        1348,
        1347,
        1346,
        1345,
        1344,
        1343,
        1342,
        1341,
        1340,
        1339,
        1338,
        1337,
        1336,
        1335,
        1334,
        1333,
        1332,
        1331,
        1330,
        1328,
        1327,
        1326,
        1325,
        1324,
        1323,
        1322,
        1321,
        1320,
        1319,
        1318,
        1316,
        1314,
        1313,
        1312,
        1311,
        1310,
        1309,
        1308,
        1307,
        1306,
        1305,
        1304,
        1303,
        1302,
        1301,
        1300,
        1299,
        1298,
        1297,
        1296,
        1295,
        1294,
        1293,
        1292,
        1291,
        1290,
        1289,
        1288,
        1287,
        1286,
        1285,
        1284,
        1283,
        1282,
        1280,
        1279,
        1278,
        1277,
        1276,
        1275,
        1274,
        1273,
        1271,
        1270,
        1269,
        1268,
        1267,
        1266,
        1265,
        1264,
        1256,
        1255,
        1253,
        1250,
        1249,
        1248,
        1247,
        1246,
        1245,
        1244,
        1241,
        1240,
        1239,
        1238,
        1237,
        1236,
        1235,
        1234,
        1233,
        1232,
        1231,
        1230,
        1229,
        1228,
        1227,
        1226,
        1225,
        1224,
        1223,
        1222,
        1221,
        1220,
        1219,
        1218,
        1217,
        1216,
        1215,
        1214,
        1213,
        1212,
        1211,
        1210,
        1209,
        1208,
        1207,
        1206,
        1205,
        1204,
        1203,
        1202,
        1201,
        1200,
        1199,
        1198,
        1197,
        1196,
        1195,
        1194,
        1193,
        1192,
        1191,
        1190,
        1189,
        1188,
        1187,
        1186,
        1185,
        1184,
        1183,
        1182,
        1181,
        1180,
        1179,
        1178,
        1177,
        1176,
        1175,
        1174,
        1173,
        1172,
        1171,
        1170,
        1169,
        1168,
        1167,
        1166,
        1165,
        1164,
        1163,
        1162,
        1161,
        1160,
        1159,
        1158,
        1157,
        1156,
        1155,
        1154,
        1153,
        1152,
        1151,
        1150,
        1149,
        1148,
        1147,
        1146,
        1145,
        1144,
        1143,
        1142,
        1141,
        1140,
        1138,
        1137,
        1136,
        1135,
        1134,
        1132,
        1131,
        1130,
        1129,
        1128,
        1127,
        1126,
        1125,
        1124,
        1123,
        1122,
        1121,
        1120,
        1119,
        1118,
        1117,
        1116,
        1115,
        1114,
        1113,
        1112,
        1111,
        1110,
        1109,
        1108,
        1107,
        1106,
        1105,
        1104,
        1103,
        1102,
        1101,
        1100,
        1099,
        1098,
        1097,
        1096,
        1095,
        1094,
        1093,
        1092,
        1091,
        1090,
        1089,
        1088,
        1087,
        1086,
        1085,
        1084,
        1083,
        1082,
        1081,
        1079,
        1078,
        1076,
        1075,
        1074,
        1073,
        1072,
        1071,
        1070,
        1069,
        1067,
        1066,
        1065,
        1062,
        1060,
        1058,
        1056,
        1055,
        1054,
        1053,
        1052,
        1051,
        1050,
        1049,
        1048,
        1047,
        1046,
        1043,
        1040,
        1039,
        1038,
        1037,
        1036,
        1035,
        1031,
        1030,
        1029,
        1028,
        1027,
        1025,
        1023,
        1022,
        1021,
        1020,
        1019,
        1018,
        1017,
        1016,
        1015,
        1014,
        1013,
        1012,
        1011,
        1010,
        1008,
        1007,
        1006,
        1005,
        1004,
        1003,
        1002,
        1001,
        1000,
        998,
        997,
        995,
        994,
        993,
        992,
        991,
        990,
        989,
        988,
        987,
        986,
        985,
        984,
        982,
        981,
        980,
        978,
        977,
        976,
        975,
        974,
        973,
        972,
        971,
        970,
        969,
        968,
        966,
        965,
        963,
        962,
        960,
        959,
        958,
        957,
        956,
        955,
        954,
        953,
        952,
        951,
        950,
        949,
        946,
        945,
        944,
        943,
        942,
        941,
        940,
        939,
        938,
        937,
        936,
        935,
        934,
        933,
        932,
        931,
        930,
        929,
        928,
        927,
        926,
        925,
        924,
        923,
        922,
        921,
        920,
        919,
        918,
        917,
        916,
        915,
        914,
        913,
        912,
        911,
        910,
        909,
        908,
        907,
        906,
        905,
        904,
        903,
        902,
        901,
        900,
        899,
        898,
        897,
        896,
        895,
        894,
        893,
        891,
        890,
        889,
        888,
        887,
        886,
        885,
        884,
        883,
        881,
        880,
        879,
        878,
        877,
        876,
        875,
        874,
        873,
        872,
        871,
        870,
        869,
        868,
        867,
        866,
        865,
        864,
        862,
        861,
        860,
        859,
        858,
        857,
        856,
        855,
        854,
        852,
        851,
        850,
        849,
        848,
        847,
        846,
        845,
        844,
        843,
        842,
        841,
        838,
        836,
        835,
        834,
        833,
        832,
        831,
        830,
        829,
        828,
        827,
        826,
        824,
        823,
        821,
        820,
        819,
        817,
        816,
        815,
        814,
        813,
        812,
        811,
        809,
        808,
        807,
        806,
        805,
        804,
        802,
        801,
        800,
        799,
        798,
        797,
        795,
        794,
        792,
        791,
        790,
        788,
        785,
        783,
        780,
        779,
        778,
        777,
        776,
        775,
        774,
        773,
        772,
        771,
        770,
        769,
        768,
        767,
        766,
        764,
        763,
        762,
        761,
        760,
        759,
        756,
        754,
        753,
        752,
        751,
        750,
        749,
        748,
        747,
        746,
        744,
        742,
        741,
        740,
        739,
        737,
        735,
        732,
        731,
        730,
        729,
        728,
        727,
        726,
        725,
        722,
        721,
        720,
        719,
        718,
        717,
        716,
        715,
        714,
        713,
        712,
        711,
        710,
        709,
        708,
        707,
        706,
        704,
        703,
        702,
        701,
        700,
        699,
        698,
        697,
        695,
        694,
        693,
        692,
        689,
        688,
        687,
        686,
        685,
        683,
        681,
        680,
        679,
        678,
        677,
        676,
        675,
        674,
        673,
        671,
        670,
        669,
        667,
        666,
        665,
        663,
        661,
        660,
        659,
        658,
        657,
        656,
        655,
        654,
        653,
        652,
        650,
        648,
        647,
        646,
        645,
        643,
        641,
        640,
        639,
        638,
        637,
        636,
        635,
        633,
        632,
        631,
        630,
        629,
        628,
        627,
        626,
        625,
        624,
        623,
        622,
        621,
        620,
        619,
        618,
        617,
        616,
        614,
        612,
        610,
        608,
        607,
        606,
        605,
        604,
        603,
        602,
        601,
        600,
        599,
        598,
        597,
        596,
        595,
        592,
        591,
        590,
        589,
        588,
        587,
        586,
        583,
        582,
        581,
        580,
        579,
        578,
        577,
        576,
        575,
        573,
        572,
        571,
        570,
        569,
        568,
        567,
        566,
        565,
        564,
        563,
        562,
        560,
        559,
        558,
        557,
        556,
        555,
        553,
        552,
        551,
        550,
        548,
        547,
        546,
        545,
        544,
        543,
        542,
        541,
        540,
        539,
        538,
        537,
        536,
        535,
        534,
        533,
        531,
        529,
        527,
        523,
        522,
        521,
        518,
        516,
        515,
        512,
        511,
        509,
        507,
        506,
        505,
        504,
        503,
        502,
        501,
        500,
        499,
        498,
        497,
        495,
        494,
        493,
        492,
        491,
        490,
        489,
        486,
        485,
        484,
        483,
        482,
        481,
        479,
        478,
        476,
        475,
        474,
        473,
        472,
        471,
        470,
        469,
        468,
        467,
        466,
        465,
        464,
        463,
        462,
        461,
        460,
        459,
        458,
        457,
        456,
        455,
        454,
        450,
        447,
        446,
        441,
        439,
        438,
        437,
        436,
        434,
        433,
        432,
        431,
        429,
        428,
        427,
        423,
        422,
        421,
        420,
        419,
        418,
        417,
        416,
        415,
        414,
        413,
        412,
        410,
        408,
        407,
        406,
        405,
        404,
        403,
        402,
        401,
        400,
        399,
        398,
        393,
        392,
        391,
        390,
        389,
        388,
        387,
        386,
        385,
        384,
        382,
        381,
        379,
        378,
        377,
        375,
        374,
        373,
        371,
        370,
        367,
        366,
        365,
        364,
        363,
        362,
        361,
        360,
        359,
        358,
        357,
        355,
        354,
        353,
        352,
        351,
        350,
        349,
        348,
        347,
        346,
        345,
        343,
        342,
        341,
        340,
        339,
        338,
        337,
        336,
        335,
        334,
        333,
        332,
        331,
        330,
        329,
        328,
        327,
        326,
        325,
        324,
        323,
        322,
        320,
        319,
        317,
        316,
        314,
        313,
        312,
        311,
        310,
        309,
        308,
        307,
        306,
        305,
        304,
        303,
        302,
        301,
        300,
        298,
        297,
        296,
        294,
        293,
        292,
        291,
        289,
        288,
        287,
        286,
        285,
        284,
        283,
        282,
        281,
        280,
        279,
        278,
        277,
        276,
        275,
        274,
        273,
        272,
        271,
        269,
        268,
        267,
        266,
        265,
        264,
        263,
        260,
        258,
        256,
        255,
        254,
        253,
        252,
        250,
        249,
        248,
        247,
        246,
        244,
        241,
        240,
        238,
        237,
        236,
        235,
        234,
        233,
        232,
        231,
        230,
        229,
        228,
        227,
        226,
        225,
        224,
        222,
        221,
        220,
        219,
        218,
        217,
        216,
        215,
        214,
        213,
        212,
        211,
        210,
        209,
        208,
        207,
        206,
        205,
        204,
        202,
        201,
        200,
        199,
        198,
        197,
        196,
        195,
        194,
        193,
        192,
        190,
        189,
        188,
        187,
        186,
        185,
        184,
        183,
        182,
        181,
        180,
        179,
        178,
        177,
        176,
        175,
        174,
        173,
        172,
        171,
        170,
        169,
        168,
        167,
        166,
        165,
        164,
        163,
        162,
        161,
        160,
        159,
        158,
        156,
        155,
        154,
        153,
        152,
        151,
        150,
        149,
        148,
        147,
        146,
        145,
        144,
        143,
        142,
        141,
        139,
        138,
        136,
        134,
        133,
        129,
        128,
        127,
        125,
        122,
        121,
        120,
        119,
        118,
        117,
        116,
        115,
        114,
        113,
        112,
        111,
        110,
        109,
        107,
        106,
        105,
        104,
        103,
        101,
        100,
        99,
        98,
        97,
        96,
        95,
        94,
        93,
        92,
        91,
        90,
        88,
        87,
        86,
        85,
        84,
        83,
        81,
        80,
        79,
        78,
        77,
        76,
        73,
        72,
        71,
        70,
        69,
        68,
        66,
        65,
        64,
        63,
        62,
        61,
        60,
        59,
        56,
        55,
        54,
        51,
        50,
        49,
        47,
        45,
        44,
        43,
        42,
        41,
        40,
        39,
        38,
        37,
        36,
        35,
        34,
        33,
        32,
        31,
        30,
        29,
        28,
        27,
        26,
        25,
        24,
        22,
        17,
        16,
        15,
        14,
        13,
        12,
        11,
        9,
        8,
        7,
        6,
        5,
        4,
        3,
        2,
        1,
        1903,
        2169
    ],
    "finished": true
}