{
    "commits": [
        {
            "associated_pull_request": [],
            "date": "2017-03-20 22:58:21+00:00",
            "diff": "nm-l2tp_networkmanager-l2tp/issue_34/commit_6a8ed3ff4654d707bb7a7a2c924a3fe79300139c.diff",
            "diff_additions": 70,
            "diff_deletions": 48,
            "diff_file_size": 92052,
            "diff_url": "https://github.com/nm-l2tp/NetworkManager-l2tp/commit/6a8ed3ff4654d707bb7a7a2c924a3fe79300139c.diff",
            "exists": true,
            "files": [
                {
                    "file_additions": 70,
                    "file_deletions": 48,
                    "file_exists": true,
                    "file_name": "src/nm-l2tp-service.c",
                    "file_size": 92052
                }
            ],
            "interesting": {
                "reopen": false,
                "status": false
            },
            "is_parent": true,
            "sha": "6a8ed3ff4654d707bb7a7a2c924a3fe79300139c"
        },
        {
            "associated_pull_request": [],
            "date": "2017-03-26 11:18:08+00:00",
            "diff": "nm-l2tp_networkmanager-l2tp/issue_34/commit_b10d9c72bfc4a9b2ee5409e0e3b8a4394854ff51.diff",
            "diff_additions": 56,
            "diff_deletions": 17,
            "diff_file_size": 151118,
            "diff_url": "https://github.com/nm-l2tp/NetworkManager-l2tp/commit/b10d9c72bfc4a9b2ee5409e0e3b8a4394854ff51.diff",
            "exists": true,
            "files": [
                {
                    "file_additions": 2,
                    "file_deletions": 0,
                    "file_exists": true,
                    "file_name": "properties/import-export.c",
                    "file_size": 23629
                },
                {
                    "file_additions": 42,
                    "file_deletions": 14,
                    "file_exists": true,
                    "file_name": "properties/ipsec-dialog.c",
                    "file_size": 35437
                },
                {
                    "file_additions": 12,
                    "file_deletions": 3,
                    "file_exists": true,
                    "file_name": "src/nm-l2tp-service.c",
                    "file_size": 92052
                }
            ],
            "interesting": {
                "reopen": true,
                "status": false
            },
            "is_parent": false,
            "sha": "b10d9c72bfc4a9b2ee5409e0e3b8a4394854ff51"
        },
        {
            "associated_pull_request": [],
            "date": "2017-05-14 12:34:03+00:00",
            "diff": "nm-l2tp_networkmanager-l2tp/issue_34/commit_c2659ae2fe7fc238fb6c22a73c34d829870dbf24.diff",
            "diff_additions": 58,
            "diff_deletions": 20,
            "diff_file_size": 151118,
            "diff_url": "https://github.com/nm-l2tp/NetworkManager-l2tp/commit/c2659ae2fe7fc238fb6c22a73c34d829870dbf24.diff",
            "exists": true,
            "files": [
                {
                    "file_additions": 2,
                    "file_deletions": 0,
                    "file_exists": true,
                    "file_name": "properties/import-export.c",
                    "file_size": 23629
                },
                {
                    "file_additions": 44,
                    "file_deletions": 17,
                    "file_exists": true,
                    "file_name": "properties/ipsec-dialog.c",
                    "file_size": 35437
                },
                {
                    "file_additions": 12,
                    "file_deletions": 3,
                    "file_exists": true,
                    "file_name": "src/nm-l2tp-service.c",
                    "file_size": 92052
                }
            ],
            "interesting": {
                "reopen": false,
                "status": false
            },
            "is_parent": false,
            "sha": "c2659ae2fe7fc238fb6c22a73c34d829870dbf24"
        }
    ],
    "first_commit": "2017-03-20 22:58:21+00:00",
    "last_commit": "2019-10-17 00:27:18+00:00",
    "number": 34,
    "pull_request": "None",
    "score": {
        "accidental_reopen_likely": false,
        "all_labels": [],
        "contains_keywords": [
            "confirm",
            "work",
            "fail",
            "chang",
            "fix",
            "issu",
            "patch",
            "reason",
            "fault",
            "remov",
            "bug",
            "error",
            "problem"
        ],
        "fix_size": 131,
        "has_labels": [],
        "intersecting": {
            "computed_score": 0.3125,
            "final_commit_size": 80,
            "intersection_size": 25,
            "previous_commits_size": 76
        },
        "is_makefile_based": true,
        "no_new_files": [],
        "no_other_files": false,
        "num_prohibited_files": 287952,
        "prohibited_files": [
            "server/src/main/java/com/genymobile/scrcpy/Device.java",
            "server/src/main/java/com/genymobile/scrcpy/wrappers/SurfaceControl.java",
            "server/src/main/java/com/genymobile/scrcpy/Device.java",
            "server/src/main/java/com/genymobile/scrcpy/wrappers/SurfaceControl.java",
            "app/meson.build",
            "app/scrcpy.1",
            "app/src/common.h",
            "app/src/scrcpy.h",
            "app/src/server.h",
            "server/src/main/java/com/genymobile/scrcpy/Workarounds.java"
        ],
        "reopen": true,
        "reopen_events": [
            [
                "2017-03-26 11:28:16+00:00",
                "closed"
            ],
            [
                "2017-03-26 11:28:16+00:00",
                "commit"
            ],
            [
                "2017-03-29 00:18:38+00:00",
                "reopened"
            ],
            [
                "2017-04-13 06:32:13+00:00",
                "closed"
            ],
            [
                "2017-05-14 12:34:37+00:00",
                "commit"
            ],
            [
                "2019-10-17 00:27:19+00:00",
                "commit"
            ]
        ],
        "status": false,
        "strategy": true,
        "total_changes": 269
    }
}