{
    "category": [
        "hardware/OS",
        "GUI"
    ],
    "commits": [
        {
            "associated_pull_request": [
                "https://github.com/surge-synthesizer/surge/pull/3360"
            ],
            "date": "2020-12-06 21:43:00",
            "diff": "surge-synthesizer_surge/issue_3359/commit_02b1feca0bf8467c4af013ac96c76a46f55cc408.diff",
            "diff_additions": 4,
            "diff_deletions": 4,
            "diff_file_size": 0,
            "diff_url": "https://github.com/surge-synthesizer/surge/commit/02b1feca0bf8467c4af013ac96c76a46f55cc408.diff",
            "exists": true,
            "files": [
                {
                    "file_additions": 4,
                    "file_deletions": 4,
                    "file_exists": false,
                    "file_name": "src/common/gui/SurgeGUIEditor.cpp",
                    "file_size": 0
                }
            ],
            "interesting": {
                "reopen": false,
                "status": false
            },
            "is_parent": true,
            "sha": "02b1feca0bf8467c4af013ac96c76a46f55cc408"
        },
        {
            "associated_pull_request": [],
            "date": "2020-12-06 23:05:59",
            "diff": "surge-synthesizer_surge/issue_3359/commit_1e5bf6c019e01d735df2a35fc96330f4f70a029f.diff",
            "diff_additions": 786,
            "diff_deletions": 69,
            "diff_file_size": 363303,
            "diff_url": "https://github.com/surge-synthesizer/surge/commit/1e5bf6c019e01d735df2a35fc96330f4f70a029f.diff",
            "exists": true,
            "files": [
                {
                    "file_additions": 32,
                    "file_deletions": 0,
                    "file_exists": true,
                    "file_name": "src/common/SurgePatch.cpp",
                    "file_size": 112557
                },
                {
                    "file_additions": 313,
                    "file_deletions": 65,
                    "file_exists": true,
                    "file_name": "src/common/SurgeSynthesizer.cpp",
                    "file_size": 135414
                },
                {
                    "file_additions": 6,
                    "file_deletions": 2,
                    "file_exists": true,
                    "file_name": "src/common/dsp/SurgeVoice.cpp",
                    "file_size": 41057
                },
                {
                    "file_additions": 16,
                    "file_deletions": 0,
                    "file_exists": false,
                    "file_name": "src/common/gui/SurgeGUIEditor.cpp",
                    "file_size": 0
                },
                {
                    "file_additions": 36,
                    "file_deletions": 0,
                    "file_exists": true,
                    "file_name": "src/headless/UnitTestsIO.cpp",
                    "file_size": 28180
                },
                {
                    "file_additions": 383,
                    "file_deletions": 2,
                    "file_exists": true,
                    "file_name": "src/headless/UnitTestsMIDI.cpp",
                    "file_size": 46095
                }
            ],
            "interesting": {
                "reopen": false,
                "status": true
            },
            "is_parent": false,
            "sha": "1e5bf6c019e01d735df2a35fc96330f4f70a029f"
        },
        {
            "associated_pull_request": [
                "https://github.com/surge-synthesizer/surge/pull/3362"
            ],
            "date": "2020-12-06 23:05:59",
            "diff": "surge-synthesizer_surge/issue_3359/commit_759b2d710d301e061aadcb8ebba016ffc0765e1e.diff",
            "diff_additions": 787,
            "diff_deletions": 69,
            "diff_file_size": 363303,
            "diff_url": "https://github.com/surge-synthesizer/surge/commit/759b2d710d301e061aadcb8ebba016ffc0765e1e.diff",
            "exists": true,
            "files": [
                {
                    "file_additions": 32,
                    "file_deletions": 0,
                    "file_exists": true,
                    "file_name": "src/common/SurgePatch.cpp",
                    "file_size": 112557
                },
                {
                    "file_additions": 313,
                    "file_deletions": 65,
                    "file_exists": true,
                    "file_name": "src/common/SurgeSynthesizer.cpp",
                    "file_size": 135414
                },
                {
                    "file_additions": 6,
                    "file_deletions": 2,
                    "file_exists": true,
                    "file_name": "src/common/dsp/SurgeVoice.cpp",
                    "file_size": 41057
                },
                {
                    "file_additions": 16,
                    "file_deletions": 0,
                    "file_exists": false,
                    "file_name": "src/common/gui/SurgeGUIEditor.cpp",
                    "file_size": 0
                },
                {
                    "file_additions": 36,
                    "file_deletions": 0,
                    "file_exists": true,
                    "file_name": "src/headless/UnitTestsIO.cpp",
                    "file_size": 28180
                },
                {
                    "file_additions": 384,
                    "file_deletions": 2,
                    "file_exists": true,
                    "file_name": "src/headless/UnitTestsMIDI.cpp",
                    "file_size": 46095
                }
            ],
            "interesting": {
                "reopen": false,
                "status": false
            },
            "is_parent": false,
            "sha": "759b2d710d301e061aadcb8ebba016ffc0765e1e"
        },
        {
            "associated_pull_request": [
                "https://github.com/surge-synthesizer/surge/pull/3362"
            ],
            "date": "2020-12-07 20:34:28",
            "diff": "surge-synthesizer_surge/issue_3359/commit_3f66c2006b3e9a149cd0364fe2526cc62cd8c0a1.diff",
            "diff_additions": 787,
            "diff_deletions": 69,
            "diff_file_size": 363303,
            "diff_url": "https://github.com/surge-synthesizer/surge/commit/3f66c2006b3e9a149cd0364fe2526cc62cd8c0a1.diff",
            "exists": true,
            "files": [
                {
                    "file_additions": 32,
                    "file_deletions": 0,
                    "file_exists": true,
                    "file_name": "src/common/SurgePatch.cpp",
                    "file_size": 112557
                },
                {
                    "file_additions": 313,
                    "file_deletions": 65,
                    "file_exists": true,
                    "file_name": "src/common/SurgeSynthesizer.cpp",
                    "file_size": 135414
                },
                {
                    "file_additions": 6,
                    "file_deletions": 2,
                    "file_exists": true,
                    "file_name": "src/common/dsp/SurgeVoice.cpp",
                    "file_size": 41057
                },
                {
                    "file_additions": 16,
                    "file_deletions": 0,
                    "file_exists": false,
                    "file_name": "src/common/gui/SurgeGUIEditor.cpp",
                    "file_size": 0
                },
                {
                    "file_additions": 36,
                    "file_deletions": 0,
                    "file_exists": true,
                    "file_name": "src/headless/UnitTestsIO.cpp",
                    "file_size": 28180
                },
                {
                    "file_additions": 384,
                    "file_deletions": 2,
                    "file_exists": true,
                    "file_name": "src/headless/UnitTestsMIDI.cpp",
                    "file_size": 46095
                }
            ],
            "interesting": {
                "reopen": false,
                "status": false
            },
            "is_parent": false,
            "sha": "3f66c2006b3e9a149cd0364fe2526cc62cd8c0a1"
        }
    ],
    "first_commit": "2020-12-06 21:43:00",
    "last_commit": "2020-12-07 20:34:28",
    "number": 3359,
    "pull_request": "None",
    "score": {
        "accidental_reopen_likely": false,
        "all_labels": [
            "Feature Request",
            "MIDI"
        ],
        "contains_keywords": [
            "patch",
            "fault",
            "chang",
            "test"
        ],
        "fix_size": 824,
        "has_labels": [],
        "intersecting": {
            "computed_score": 1.0,
            "final_commit_size": 821,
            "intersection_size": 821,
            "previous_commits_size": 824
        },
        "is_makefile_based": true,
        "no_new_files": [],
        "no_other_files": false,
        "num_prohibited_files": 29166,
        "prohibited_files": [
            "tools/building.py",
            "tools/building.py",
            "tools/building.py",
            "emcc.py",
            "src/library_emmalloc.js",
            "src/shell.js",
            "tests/test_core.py",
            "src/shell.js",
            "tests/test_core.py",
            "src/library.js"
        ],
        "reopen": false,
        "reopen_events": [
            [
                "2020-12-07 19:56:10",
                "commit"
            ],
            [
                "2020-12-07 20:18:23",
                "commit"
            ],
            [
                "2020-12-07 20:34:29",
                "closed"
            ],
            [
                "2020-12-07 20:34:31",
                "commit"
            ]
        ],
        "status": true,
        "strategy": true,
        "total_changes": 2575
    }
}