{
    "commits": [
        {
            "associated_pull_request": [],
            "date": "2022-02-22 09:28:30+00:00",
            "diff": "",
            "diff_additions": 0,
            "diff_deletions": 0,
            "diff_file_size": 0,
            "diff_url": "https://github.com/raysan5/raylib/commit/296b57e1f55f27b5d1f71a5cc8d623a2fbbde20b.diff",
            "exists": true,
            "files": [],
            "interesting": {
                "reopen": false,
                "status": false
            },
            "is_parent": true,
            "sha": "296b57e1f55f27b5d1f71a5cc8d623a2fbbde20b"
        },
        {
            "associated_pull_request": [],
            "date": "2022-02-25 19:41:18+00:00",
            "diff": "raysan5_raylib/issue_2360/commit_ead8003044aab21f8d155b91ec0bce90cd193500.diff",
            "diff_additions": 2,
            "diff_deletions": 0,
            "diff_file_size": 115411,
            "diff_url": "https://github.com/raysan5/raylib/commit/ead8003044aab21f8d155b91ec0bce90cd193500.diff",
            "exists": true,
            "files": [
                {
                    "file_additions": 2,
                    "file_deletions": 0,
                    "file_exists": true,
                    "file_name": "src/rcore.c",
                    "file_size": 115411
                }
            ],
            "interesting": {
                "reopen": true,
                "status": false
            },
            "is_parent": false,
            "sha": "ead8003044aab21f8d155b91ec0bce90cd193500"
        },
        {
            "associated_pull_request": [],
            "date": "2022-04-24 09:02:50+00:00",
            "diff": "raysan5_raylib/issue_2360/commit_d433de7efaeacd1852f80690fe5fdc5b8881f665.diff",
            "diff_additions": 4,
            "diff_deletions": 3,
            "diff_file_size": 115411,
            "diff_url": "https://github.com/raysan5/raylib/commit/d433de7efaeacd1852f80690fe5fdc5b8881f665.diff",
            "exists": true,
            "files": [
                {
                    "file_additions": 4,
                    "file_deletions": 3,
                    "file_exists": true,
                    "file_name": "src/rcore.c",
                    "file_size": 115411
                }
            ],
            "interesting": {
                "reopen": false,
                "status": false
            },
            "is_parent": false,
            "sha": "d433de7efaeacd1852f80690fe5fdc5b8881f665"
        }
    ],
    "first_commit": "2022-02-22 09:28:30+00:00",
    "last_commit": "2022-04-24 09:02:50+00:00",
    "number": 2360,
    "pull_request": "None",
    "score": {
        "accidental_reopen_likely": false,
        "all_labels": [],
        "contains_keywords": [
            "fix",
            "issu",
            "report"
        ],
        "fix_size": 7,
        "has_labels": [],
        "intersecting": {
            "computed_score": 0.2,
            "final_commit_size": 5,
            "intersection_size": 1,
            "previous_commits_size": 3
        },
        "is_makefile_based": true,
        "no_new_files": [],
        "no_other_files": true,
        "num_prohibited_files": 12734,
        "prohibited_files": [
            "server/src/main/java/com/genymobile/scrcpy/Device.java",
            "server/src/main/java/com/genymobile/scrcpy/wrappers/SurfaceControl.java",
            "server/src/main/java/com/genymobile/scrcpy/Device.java",
            "server/src/main/java/com/genymobile/scrcpy/wrappers/SurfaceControl.java",
            "app/meson.build",
            "app/scrcpy.1",
            "app/src/common.h",
            "app/src/scrcpy.h",
            "app/src/server.h",
            "server/src/main/java/com/genymobile/scrcpy/Workarounds.java"
        ],
        "reopen": true,
        "reopen_events": [
            [
                "2022-02-25 19:41:27+00:00",
                "commit"
            ],
            [
                "2022-02-26 15:05:58+00:00",
                "closed"
            ],
            [
                "2022-02-27 21:36:57+00:00",
                "reopened"
            ],
            [
                "2022-04-24 09:02:59+00:00",
                "commit"
            ],
            [
                "2022-04-24 09:11:56+00:00",
                "closed"
            ]
        ],
        "status": false,
        "strategy": true,
        "total_changes": 9
    }
}