{
    "covered_issues": [
        75,
        72,
        56,
        53,
        43,
        35,
        34,
        33,
        29,
        28,
        27,
        26,
        22,
        15,
        14,
        12,
        5,
        4,
        2
    ],
    "finished": true
}