{
    "covered_issues": [
        34,
        29,
        28,
        27,
        19,
        18,
        14,
        13,
        12,
        11,
        7,
        6,
        2
    ],
    "finished": true
}