{
    "covered_issues": [
        2913,
        2908,
        2901,
        2899,
        2895,
        2888,
        2879,
        2871,
        2860,
        2854,
        2835,
        2832,
        2831,
        2827,
        2826,
        2824,
        2823,
        2821,
        2817,
        2808,
        2805,
        2800,
        2795,
        2789,
        2779,
        2776,
        2759,
        2758,
        2754,
        2749,
        2739,
        2738,
        2731,
        2730,
        2725,
        2724,
        2719,
        2717,
        2709,
        2706,
        2700,
        2691,
        2688,
        2683,
        2670,
        2665,
        2662,
        2651,
        2649,
        2641,
        2639,
        2638,
        2634,
        2633,
        2632,
        2628,
        2627,
        2626,
        2624,
        2623,
        2622,
        2619,
        2618,
        2617,
        2615,
        2610,
        2609,
        2607,
        2606,
        2604,
        2603,
        2602,
        2599,
        2598,
        2596,
        2592,
        2589,
        2585,
        2580,
        2576,
        2572,
        2569,
        2566,
        2565,
        2564,
        2560,
        2558,
        2557,
        2554,
        2547,
        2545,
        2542,
        2541,
        2538,
        2537,
        2534,
        2526,
        2525,
        2524,
        2504,
        2498,
        2490,
        2489,
        2488,
        2476,
        2474,
        2473,
        2471,
        2465,
        2463,
        2454,
        2451,
        2439,
        2434,
        2433,
        2430,
        2423,
        2422,
        2421,
        2413,
        2412,
        2410,
        2409,
        2407,
        2404,
        2402,
        2400,
        2399,
        2398,
        2396,
        2394,
        2393,
        2382,
        2374,
        2369,
        2368,
        2364,
        2358,
        2351,
        2346,
        2339,
        2330,
        2321,
        2313,
        2312,
        2303,
        2290,
        2286,
        2275,
        2269,
        2266,
        2263,
        2253,
        2244,
        2229,
        2227,
        2220,
        2215,
        2207,
        2205,
        2202,
        2195,
        2185,
        2183,
        2181,
        2180,
        2178,
        2176,
        2175,
        2174,
        2173,
        2172,
        2171,
        2169,
        2160,
        2154,
        2146,
        2144,
        2143,
        2128,
        2127,
        2118,
        2108,
        2107,
        2104,
        2103,
        2098,
        2096,
        2093,
        2092,
        2089,
        2074,
        2072,
        2068,
        2067,
        2061,
        2060,
        2057,
        2053,
        2050,
        2049,
        2048,
        2043,
        2042,
        2033,
        2029,
        2017,
        2014,
        2013,
        2000,
        1998,
        1991,
        1985,
        1981,
        1979,
        1978,
        1969,
        1967,
        1963,
        1962,
        1957,
        1956,
        1950,
        1949,
        1946,
        1942,
        1940,
        1937,
        1935,
        1932,
        1928,
        1919,
        1916,
        1912,
        1905,
        1901,
        1900,
        1897,
        1896,
        1895,
        1891,
        1890,
        1889,
        1887,
        1885,
        1877,
        1871,
        1869,
        1867,
        1865,
        1859,
        1852,
        1851,
        1846,
        1842,
        1840,
        1839,
        1837,
        1832,
        1821,
        1819,
        1816,
        1813,
        1805,
        1793,
        1788,
        1787,
        1785,
        1781,
        1777,
        1775,
        1774,
        1772,
        1767,
        1763,
        1760,
        1758,
        1754,
        1750,
        1748,
        1746,
        1741,
        1738,
        1731,
        1721,
        1716,
        1711,
        1705,
        1696,
        1687,
        1686,
        1684,
        1682,
        1681,
        1676,
        1675,
        1674,
        1672,
        1671,
        1664,
        1659,
        1658,
        1657,
        1655,
        1653,
        1652,
        1647,
        1646,
        1644,
        1642,
        1632,
        1625,
        1624,
        1623,
        1622,
        1620,
        1616,
        2792,
        1613,
        1612,
        1609,
        1608,
        1607,
        1606,
        1593,
        1588,
        1583,
        1582,
        1576,
        1575,
        1572,
        1570,
        1562,
        1558,
        1552,
        1551,
        1547,
        1546,
        1545,
        1539,
        1537,
        1536,
        1532,
        1531,
        1526,
        1517,
        1514,
        1511,
        1508,
        1502,
        1499,
        1498,
        1496,
        1493,
        1492,
        1489,
        1488,
        1487,
        1480,
        1473,
        1470,
        1467,
        1456,
        1455,
        1454,
        1453,
        1452,
        1444,
        1435,
        1431,
        1425,
        1423,
        1422,
        1417,
        1414,
        1413,
        1411,
        1409,
        1406,
        1385,
        1378,
        1377,
        1374,
        1372,
        1368,
        1362,
        1361,
        1359,
        1357,
        1350,
        1348,
        1346,
        1344,
        1340,
        1339,
        1336,
        1329,
        1325,
        1324,
        1322,
        1321,
        1319,
        1317,
        1312,
        1311,
        1310,
        1309,
        1306,
        1299,
        1297,
        1296,
        1291,
        1289,
        1288,
        1285,
        1278,
        1275,
        1272,
        1266,
        1261,
        1252,
        1249,
        1247,
        1242,
        1241,
        1236,
        1235,
        1225,
        1220,
        1218,
        1217,
        1213,
        1212,
        1206,
        1198,
        1196,
        1193,
        1188,
        1187,
        1183,
        1180,
        1178,
        1176,
        1175,
        1165,
        1159,
        1158,
        1156,
        1149,
        1146,
        1145,
        1141,
        1138,
        1135,
        1134,
        1125,
        1122,
        1121,
        1117,
        1115,
        1111,
        1103,
        1101,
        1100,
        1099,
        1096,
        1092,
        1090,
        1086,
        1085,
        1084,
        1082,
        1080,
        1072,
        1068,
        1063,
        1062,
        1060,
        1057,
        1055,
        1040,
        1035,
        1026,
        1015,
        1014,
        1012,
        1002,
        1001,
        999,
        997,
        996,
        992,
        984,
        980,
        971,
        969,
        966,
        954,
        953,
        950,
        948,
        945,
        943,
        940,
        933,
        931,
        924,
        909,
        901,
        888,
        885,
        883,
        878,
        875,
        874,
        871,
        866,
        864,
        863,
        861,
        852,
        849,
        847,
        844,
        841,
        838,
        836,
        834,
        831,
        830,
        827,
        826,
        825,
        823,
        822,
        821,
        817,
        815,
        801,
        800,
        798,
        797,
        794,
        792,
        787,
        783,
        781,
        771,
        769,
        768,
        765,
        763,
        761,
        758,
        753,
        752,
        750,
        748,
        735,
        727,
        723,
        722,
        721,
        716,
        715,
        710,
        705,
        703,
        699,
        693,
        690,
        689,
        688,
        687,
        685,
        683,
        682,
        681,
        663,
        662,
        656,
        655,
        654,
        652,
        648,
        646,
        637,
        633,
        629,
        628,
        627,
        625,
        624,
        619,
        618,
        613,
        610,
        608,
        607,
        599,
        598,
        597,
        589,
        585,
        584,
        580,
        576,
        570,
        568,
        567,
        565,
        559,
        543,
        542,
        541,
        540,
        539,
        538,
        537,
        536,
        532,
        531,
        530,
        529,
        528,
        511,
        505,
        502,
        494,
        492,
        488,
        482,
        473,
        472,
        471,
        466,
        459,
        455,
        453,
        452,
        446,
        437,
        434,
        431,
        422,
        420,
        410,
        409,
        407,
        402,
        399,
        398,
        397,
        386,
        384,
        379,
        373,
        369,
        360,
        358,
        357,
        354,
        353,
        349,
        348,
        346,
        344,
        343,
        342,
        340,
        334,
        324,
        320,
        318,
        317,
        315,
        310,
        308,
        307,
        306,
        305,
        299,
        294,
        282,
        273,
        269,
        268,
        266,
        263,
        262,
        261,
        234,
        230,
        229,
        228,
        226,
        219,
        216,
        202,
        201,
        193,
        191,
        188,
        179,
        175,
        170,
        169,
        167,
        164,
        163,
        154,
        145,
        140,
        131,
        123,
        116,
        115,
        109,
        107,
        101,
        96,
        95,
        94,
        93,
        92,
        88,
        82,
        76,
        75,
        74,
        72,
        71,
        69,
        66,
        65,
        64,
        63,
        62,
        61,
        60,
        59,
        58,
        56,
        55,
        49,
        44,
        43,
        42,
        38,
        27,
        24,
        21,
        18,
        15,
        13,
        12,
        11,
        6,
        4,
        2,
        628,
        2144,
        2382,
        2524,
        1682,
        781,
        131,
        2118,
        1588,
        1851,
        2,
        492,
        1492,
        2498,
        1311,
        2609,
        2860,
        2107,
        2413,
        2691,
        2215,
        628,
        2144,
        2382,
        2524,
        1682,
        781,
        131,
        2118,
        1588,
        1851,
        2,
        492,
        1492,
        2498,
        1311,
        2609,
        2860,
        2107,
        2413,
        2691,
        2215,
        628,
        2144,
        2382,
        2524,
        1682,
        781,
        131,
        2118,
        1588,
        1851,
        2,
        492,
        1492,
        2498,
        1311,
        2609,
        2860,
        2107,
        2413,
        2691,
        2215,
        628,
        2144,
        2382,
        2524,
        1682,
        781,
        131,
        2118,
        1588,
        1851,
        2,
        492,
        1492,
        2498,
        1311,
        2609,
        2860,
        2107,
        2413,
        2691,
        2215,
        628,
        2144,
        2382,
        2524,
        1682,
        781,
        131,
        2118,
        1588,
        1851,
        2,
        492,
        1492,
        2498,
        1311,
        2609,
        2860,
        2107,
        2413,
        2691,
        2215,
        628,
        2144,
        2382,
        2524,
        1682,
        781,
        131,
        2118,
        1588,
        1851,
        2,
        492,
        1492,
        2498,
        1311,
        2609,
        2860,
        2107,
        2413,
        2691,
        2215
    ],
    "finished": true
}