{
    "covered_issues": [
        127,
        123,
        121,
        120,
        118,
        115,
        111,
        110,
        107,
        104,
        96,
        94,
        90,
        89,
        83,
        82,
        77,
        75,
        74,
        73,
        71,
        70,
        68,
        62,
        60,
        57,
        55,
        52,
        51,
        49,
        45,
        40,
        39,
        36,
        35,
        34,
        33,
        32,
        31,
        30,
        29,
        28,
        27,
        26,
        25,
        24,
        23,
        22,
        21,
        20,
        19,
        18,
        17,
        16,
        15,
        14,
        13,
        12,
        11,
        10,
        9,
        8,
        7,
        6,
        5,
        4,
        3,
        2,
        1
    ],
    "finished": true
}