{
    "covered_issues": [
        132,
        128,
        127,
        125,
        122,
        121,
        116,
        114,
        113,
        111,
        104,
        101,
        99,
        96,
        90,
        89,
        78,
        77,
        71,
        62,
        61,
        58,
        57,
        55,
        54,
        49,
        45,
        34,
        30,
        14,
        12
    ],
    "finished": true
}