{
    "category": [
        "multithreading",
        "wrong API usage"
    ],
    "commits": [
        {
            "associated_pull_request": [],
            "date": "2018-08-05 17:33:42",
            "diff": "zlib-ng_minizip-ng/issue_294/commit_0f8d91101b56a1aa5c50b542ac99d77a7eece0e0.diff",
            "diff_additions": 18,
            "diff_deletions": 18,
            "diff_file_size": 302421,
            "diff_url": "https://github.com/zlib-ng/minizip-ng/commit/0f8d91101b56a1aa5c50b542ac99d77a7eece0e0.diff",
            "exists": true,
            "files": [
                {
                    "file_additions": 1,
                    "file_deletions": 1,
                    "file_exists": true,
                    "file_name": "minizip.c",
                    "file_size": 22906
                },
                {
                    "file_additions": 1,
                    "file_deletions": 1,
                    "file_exists": true,
                    "file_name": "mz_compat.c",
                    "file_size": 43252
                },
                {
                    "file_additions": 1,
                    "file_deletions": 1,
                    "file_exists": true,
                    "file_name": "mz_os.c",
                    "file_size": 9058
                },
                {
                    "file_additions": 1,
                    "file_deletions": 1,
                    "file_exists": true,
                    "file_name": "mz_os_posix.c",
                    "file_size": 8914
                },
                {
                    "file_additions": 1,
                    "file_deletions": 1,
                    "file_exists": true,
                    "file_name": "mz_os_win32.c",
                    "file_size": 20153
                },
                {
                    "file_additions": 1,
                    "file_deletions": 1,
                    "file_exists": true,
                    "file_name": "mz_strm.c",
                    "file_size": 16384
                },
                {
                    "file_additions": 1,
                    "file_deletions": 1,
                    "file_exists": false,
                    "file_name": "mz_strm_aes.c",
                    "file_size": 0
                },
                {
                    "file_additions": 1,
                    "file_deletions": 1,
                    "file_exists": true,
                    "file_name": "mz_strm_buf.c",
                    "file_size": 13327
                },
                {
                    "file_additions": 1,
                    "file_deletions": 1,
                    "file_exists": true,
                    "file_name": "mz_strm_bzip.c",
                    "file_size": 9995
                },
                {
                    "file_additions": 1,
                    "file_deletions": 1,
                    "file_exists": false,
                    "file_name": "mz_strm_crc32.c",
                    "file_size": 0
                },
                {
                    "file_additions": 1,
                    "file_deletions": 1,
                    "file_exists": true,
                    "file_name": "mz_strm_lzma.c",
                    "file_size": 13454
                },
                {
                    "file_additions": 1,
                    "file_deletions": 1,
                    "file_exists": true,
                    "file_name": "mz_strm_mem.c",
                    "file_size": 7226
                },
                {
                    "file_additions": 1,
                    "file_deletions": 1,
                    "file_exists": true,
                    "file_name": "mz_strm_pkcrypt.c",
                    "file_size": 10953
                },
                {
                    "file_additions": 1,
                    "file_deletions": 1,
                    "file_exists": false,
                    "file_name": "mz_strm_posix.c",
                    "file_size": 0
                },
                {
                    "file_additions": 1,
                    "file_deletions": 1,
                    "file_exists": true,
                    "file_name": "mz_strm_split.c",
                    "file_size": 13227
                },
                {
                    "file_additions": 1,
                    "file_deletions": 1,
                    "file_exists": false,
                    "file_name": "mz_strm_win32.c",
                    "file_size": 0
                },
                {
                    "file_additions": 1,
                    "file_deletions": 1,
                    "file_exists": true,
                    "file_name": "mz_strm_zlib.c",
                    "file_size": 10392
                },
                {
                    "file_additions": 1,
                    "file_deletions": 1,
                    "file_exists": true,
                    "file_name": "mz_zip.c",
                    "file_size": 103180
                }
            ],
            "interesting": {
                "reopen": false,
                "status": false
            },
            "is_parent": true,
            "sha": "0f8d91101b56a1aa5c50b542ac99d77a7eece0e0"
        },
        {
            "associated_pull_request": [],
            "date": "2018-08-08 06:50:31",
            "diff": "zlib-ng_minizip-ng/issue_294/commit_fa146ad6bd2e1b52f351e30700788201b5172f93.diff",
            "diff_additions": 40,
            "diff_deletions": 36,
            "diff_file_size": 146432,
            "diff_url": "https://github.com/zlib-ng/minizip-ng/commit/fa146ad6bd2e1b52f351e30700788201b5172f93.diff",
            "exists": true,
            "files": [
                {
                    "file_additions": 1,
                    "file_deletions": 1,
                    "file_exists": true,
                    "file_name": "mz_compat.c",
                    "file_size": 43252
                },
                {
                    "file_additions": 39,
                    "file_deletions": 35,
                    "file_exists": true,
                    "file_name": "mz_zip.c",
                    "file_size": 103180
                }
            ],
            "interesting": {
                "reopen": false,
                "status": true
            },
            "is_parent": false,
            "sha": "fa146ad6bd2e1b52f351e30700788201b5172f93"
        },
        {
            "associated_pull_request": [],
            "date": "2018-08-08 16:38:39",
            "diff": "zlib-ng_minizip-ng/issue_294/commit_0e4fe82acb950e0717d0660a4085f9ecb2496156.diff",
            "diff_additions": 3,
            "diff_deletions": 1,
            "diff_file_size": 103180,
            "diff_url": "https://github.com/zlib-ng/minizip-ng/commit/0e4fe82acb950e0717d0660a4085f9ecb2496156.diff",
            "exists": true,
            "files": [
                {
                    "file_additions": 3,
                    "file_deletions": 1,
                    "file_exists": true,
                    "file_name": "mz_zip.c",
                    "file_size": 103180
                }
            ],
            "interesting": {
                "reopen": false,
                "status": true
            },
            "is_parent": false,
            "sha": "0e4fe82acb950e0717d0660a4085f9ecb2496156"
        },
        {
            "associated_pull_request": [],
            "date": "2018-08-08 16:40:15",
            "diff": "zlib-ng_minizip-ng/issue_294/commit_26308b244ea73b20eab9bee2c6bc0051013c56ae.diff",
            "diff_additions": 6,
            "diff_deletions": 6,
            "diff_file_size": 146432,
            "diff_url": "https://github.com/zlib-ng/minizip-ng/commit/26308b244ea73b20eab9bee2c6bc0051013c56ae.diff",
            "exists": true,
            "files": [
                {
                    "file_additions": 2,
                    "file_deletions": 2,
                    "file_exists": true,
                    "file_name": "mz_compat.c",
                    "file_size": 43252
                },
                {
                    "file_additions": 4,
                    "file_deletions": 4,
                    "file_exists": true,
                    "file_name": "mz_zip.c",
                    "file_size": 103180
                }
            ],
            "interesting": {
                "reopen": false,
                "status": true
            },
            "is_parent": false,
            "sha": "26308b244ea73b20eab9bee2c6bc0051013c56ae"
        },
        {
            "associated_pull_request": [],
            "date": "2018-08-08 16:43:14",
            "diff": "zlib-ng_minizip-ng/issue_294/commit_d08e1561d93511284c5648a31d37b8f05ce108b1.diff",
            "diff_additions": 6,
            "diff_deletions": 6,
            "diff_file_size": 169338,
            "diff_url": "https://github.com/zlib-ng/minizip-ng/commit/d08e1561d93511284c5648a31d37b8f05ce108b1.diff",
            "exists": true,
            "files": [
                {
                    "file_additions": 4,
                    "file_deletions": 4,
                    "file_exists": true,
                    "file_name": "minizip.c",
                    "file_size": 22906
                },
                {
                    "file_additions": 1,
                    "file_deletions": 1,
                    "file_exists": true,
                    "file_name": "mz_compat.c",
                    "file_size": 43252
                },
                {
                    "file_additions": 1,
                    "file_deletions": 1,
                    "file_exists": true,
                    "file_name": "mz_zip.c",
                    "file_size": 103180
                }
            ],
            "interesting": {
                "reopen": false,
                "status": false
            },
            "is_parent": false,
            "sha": "d08e1561d93511284c5648a31d37b8f05ce108b1"
        }
    ],
    "first_commit": "2018-08-05 17:33:42",
    "last_commit": "2018-08-08 16:43:14",
    "number": 294,
    "pull_request": "None",
    "score": {
        "accidental_reopen_likely": false,
        "all_labels": [
            "2.0",
            "fixed",
            "raw"
        ],
        "contains_keywords": [
            "problem",
            "work",
            "fix",
            "test",
            "fail"
        ],
        "fix_size": 83,
        "has_labels": [],
        "intersecting": {
            "computed_score": 0.4444444444444444,
            "final_commit_size": 9,
            "intersection_size": 4,
            "previous_commits_size": 78
        },
        "is_makefile_based": true,
        "no_new_files": [
            "minizip.c"
        ],
        "no_other_files": false,
        "num_prohibited_files": 56796,
        "prohibited_files": [
            "tools/building.py",
            "tools/building.py",
            "tools/building.py",
            "emcc.py",
            "src/library_emmalloc.js",
            "src/shell.js",
            "tests/test_core.py",
            "src/shell.js",
            "tests/test_core.py",
            "src/library.js"
        ],
        "reopen": false,
        "reopen_events": [
            [
                "2018-08-08 06:50:38",
                "commit"
            ],
            [
                "2018-08-08 16:38:47",
                "commit"
            ],
            [
                "2018-08-08 16:40:22",
                "commit"
            ],
            [
                "2018-08-08 16:43:21",
                "commit"
            ],
            [
                "2018-08-10 15:17:21",
                "closed"
            ]
        ],
        "status": true,
        "strategy": true,
        "total_changes": 140
    }
}