{
    "commits": [
        {
            "associated_pull_request": [],
            "date": "2014-10-03 12:18:01+00:00",
            "diff": "open62541_open62541/issue_127/commit_e20243f5789fe135b8b5917e0e967f8fc0e5d1a2.diff",
            "diff_additions": 9,
            "diff_deletions": 9,
            "diff_file_size": 80511,
            "diff_url": "https://github.com/open62541/open62541/commit/e20243f5789fe135b8b5917e0e967f8fc0e5d1a2.diff",
            "exists": true,
            "files": [
                {
                    "file_additions": 0,
                    "file_deletions": 0,
                    "file_exists": false,
                    "file_name": "src/ongoing/ua_services_subscription.c",
                    "file_size": 0
                },
                {
                    "file_additions": 9,
                    "file_deletions": 9,
                    "file_exists": true,
                    "file_name": "src/server/ua_server_binary.c",
                    "file_size": 80511
                }
            ],
            "interesting": {
                "reopen": false,
                "status": false
            },
            "is_parent": true,
            "sha": "e20243f5789fe135b8b5917e0e967f8fc0e5d1a2"
        },
        {
            "associated_pull_request": [],
            "date": "2014-10-03 12:18:40+00:00",
            "diff": "open62541_open62541/issue_127/commit_fc82498d4b5ce23eb61689ccfcddf799eafa817b.diff",
            "diff_additions": 3,
            "diff_deletions": 2,
            "diff_file_size": 0,
            "diff_url": "https://github.com/open62541/open62541/commit/fc82498d4b5ce23eb61689ccfcddf799eafa817b.diff",
            "exists": true,
            "files": [
                {
                    "file_additions": 3,
                    "file_deletions": 2,
                    "file_exists": false,
                    "file_name": "src/server/ua_securechannel_manager.c",
                    "file_size": 0
                }
            ],
            "interesting": {
                "reopen": false,
                "status": false
            },
            "is_parent": false,
            "sha": "fc82498d4b5ce23eb61689ccfcddf799eafa817b"
        },
        {
            "associated_pull_request": [],
            "date": "2014-10-04 10:07:14+00:00",
            "diff": "open62541_open62541/issue_127/commit_2ee8df44f7005d88175361a731588cf9ee5a7d52.diff",
            "diff_additions": 1,
            "diff_deletions": 1,
            "diff_file_size": 0,
            "diff_url": "https://github.com/open62541/open62541/commit/2ee8df44f7005d88175361a731588cf9ee5a7d52.diff",
            "exists": true,
            "files": [
                {
                    "file_additions": 1,
                    "file_deletions": 1,
                    "file_exists": false,
                    "file_name": "examples/networklayer_tcp.c",
                    "file_size": 0
                }
            ],
            "interesting": {
                "reopen": true,
                "status": false
            },
            "is_parent": false,
            "sha": "2ee8df44f7005d88175361a731588cf9ee5a7d52"
        },
        {
            "associated_pull_request": [],
            "date": "2014-10-04 15:12:20+00:00",
            "diff": "open62541_open62541/issue_127/commit_a3065c522bb700e0ea49fcf39f30fada047b3149.diff",
            "diff_additions": 1,
            "diff_deletions": 1,
            "diff_file_size": 0,
            "diff_url": "https://github.com/open62541/open62541/commit/a3065c522bb700e0ea49fcf39f30fada047b3149.diff",
            "exists": true,
            "files": [
                {
                    "file_additions": 1,
                    "file_deletions": 1,
                    "file_exists": false,
                    "file_name": "examples/opcuaServer.c",
                    "file_size": 0
                }
            ],
            "interesting": {
                "reopen": false,
                "status": false
            },
            "is_parent": false,
            "sha": "a3065c522bb700e0ea49fcf39f30fada047b3149"
        }
    ],
    "first_commit": "2014-10-03 12:18:01+00:00",
    "last_commit": "2014-10-04 15:12:20+00:00",
    "number": 127,
    "pull_request": "None",
    "score": {
        "accidental_reopen_likely": false,
        "all_labels": [],
        "contains_keywords": [
            "work",
            "chang",
            "fix",
            "issu",
            "fault",
            "bug"
        ],
        "fix_size": 9,
        "has_labels": [],
        "intersecting": {
            "computed_score": 0.0,
            "final_commit_size": 3,
            "intersection_size": 0,
            "previous_commits_size": 6
        },
        "is_makefile_based": true,
        "no_new_files": [
            "examples/opcuaServer.c"
        ],
        "no_other_files": false,
        "num_prohibited_files": 169704,
        "prohibited_files": [
            "server/src/main/java/com/genymobile/scrcpy/Device.java",
            "server/src/main/java/com/genymobile/scrcpy/wrappers/SurfaceControl.java",
            "server/src/main/java/com/genymobile/scrcpy/Device.java",
            "server/src/main/java/com/genymobile/scrcpy/wrappers/SurfaceControl.java",
            "app/meson.build",
            "app/scrcpy.1",
            "app/src/common.h",
            "app/src/scrcpy.h",
            "app/src/server.h",
            "server/src/main/java/com/genymobile/scrcpy/Workarounds.java"
        ],
        "reopen": true,
        "reopen_events": [
            [
                "2014-10-03 12:32:22+00:00",
                "commit"
            ],
            [
                "2014-10-04 10:08:41+00:00",
                "closed"
            ],
            [
                "2014-10-04 10:08:41+00:00",
                "commit"
            ],
            [
                "2014-10-04 15:04:11+00:00",
                "reopened"
            ],
            [
                "2014-10-04 15:12:56+00:00",
                "closed"
            ],
            [
                "2014-10-04 15:12:56+00:00",
                "commit"
            ]
        ],
        "status": false,
        "strategy": true,
        "total_changes": 27
    }
}