{
    "covered_issues": [
        678,
        677,
        670,
        666,
        663,
        657,
        652,
        643,
        642,
        638,
        629,
        628,
        627,
        622,
        620,
        619,
        617,
        605,
        604,
        603,
        601,
        600,
        599,
        597,
        592,
        590,
        589,
        588,
        586,
        585,
        584,
        580,
        567,
        566,
        565,
        564,
        561,
        558,
        551,
        550,
        543,
        541,
        540,
        539,
        538,
        536,
        535,
        533,
        532,
        530,
        529,
        527,
        526,
        525,
        524,
        522,
        521,
        520,
        519,
        518,
        517,
        514,
        512,
        509,
        508,
        507,
        506,
        505,
        504,
        503,
        502,
        501,
        500,
        499,
        498,
        494,
        493,
        492,
        491,
        486,
        481,
        480,
        479,
        478,
        477,
        476,
        475,
        474,
        472,
        469,
        468,
        467,
        463,
        462,
        461,
        459,
        456,
        454,
        451,
        450,
        448,
        447,
        446,
        445,
        443,
        441,
        440,
        435,
        434,
        429,
        426,
        422,
        421,
        419,
        410,
        405,
        404,
        402,
        401,
        400,
        399,
        398,
        397,
        394,
        392,
        391,
        388,
        387,
        386,
        385,
        380,
        378,
        375,
        370,
        368,
        367,
        366,
        364,
        363,
        361,
        360,
        356,
        355,
        354,
        353,
        352,
        351,
        350,
        349,
        346,
        345,
        344,
        341,
        339,
        338,
        335,
        333,
        332,
        330,
        329,
        328,
        326,
        324,
        320,
        316,
        315,
        314,
        313,
        312,
        310,
        309,
        308,
        307,
        303,
        302,
        300,
        297,
        296,
        292,
        290,
        289,
        288,
        287,
        286,
        285,
        284,
        283,
        282,
        281,
        280,
        277,
        273,
        272,
        269,
        268,
        267,
        260,
        259,
        258,
        256,
        252,
        249,
        246,
        244,
        243,
        242,
        241,
        240,
        239,
        237,
        236,
        235,
        234,
        232,
        230,
        229,
        228,
        225,
        220,
        219,
        217,
        216,
        215,
        214,
        213,
        210,
        209,
        206,
        203,
        192,
        187,
        185,
        180,
        179,
        178,
        172,
        171,
        170,
        169,
        168,
        167,
        166,
        155,
        153,
        151,
        150,
        145,
        144,
        138,
        134,
        130,
        126,
        125,
        124,
        122,
        120,
        119,
        118,
        117,
        116,
        113,
        112,
        109,
        108,
        106,
        105,
        104,
        99,
        96,
        91,
        90,
        89,
        84,
        82,
        81,
        80,
        72,
        69,
        68,
        67,
        66,
        65,
        59,
        57,
        56,
        55,
        50,
        39,
        35,
        30,
        18,
        16
    ],
    "finished": true
}