{
    "commits": [
        {
            "associated_pull_request": [
                "https://github.com/GenericMappingTools/gmt/pull/3505"
            ],
            "date": "2020-06-20 19:32:15+00:00",
            "diff": "genericmappingtools_gmt/issue_3408/commit_1a9c97abe5358218983aefdc899c459e285f3616.diff",
            "diff_additions": 4,
            "diff_deletions": 0,
            "diff_file_size": 952294,
            "diff_url": "https://github.com/GenericMappingTools/gmt/commit/1a9c97abe5358218983aefdc899c459e285f3616.diff",
            "exists": true,
            "files": [
                {
                    "file_additions": 4,
                    "file_deletions": 0,
                    "file_exists": true,
                    "file_name": "src/gmt_init.c",
                    "file_size": 952294
                }
            ],
            "interesting": {
                "reopen": false,
                "status": false
            },
            "is_parent": true,
            "sha": "1a9c97abe5358218983aefdc899c459e285f3616"
        },
        {
            "associated_pull_request": [
                "https://github.com/GenericMappingTools/gmt/pull/3510"
            ],
            "date": "2020-06-20 21:26:48+00:00",
            "diff": "genericmappingtools_gmt/issue_3408/commit_b702581932258926955bf7414a1261065c47a0fd.diff",
            "diff_additions": 23,
            "diff_deletions": 0,
            "diff_file_size": 1189,
            "diff_url": "https://github.com/GenericMappingTools/gmt/commit/b702581932258926955bf7414a1261065c47a0fd.diff",
            "exists": true,
            "files": [
                {
                    "file_additions": 23,
                    "file_deletions": 0,
                    "file_exists": true,
                    "file_name": "src/testapi_imageshading.c",
                    "file_size": 1189
                }
            ],
            "interesting": {
                "reopen": false,
                "status": false
            },
            "is_parent": false,
            "sha": "b702581932258926955bf7414a1261065c47a0fd"
        },
        {
            "associated_pull_request": [
                "https://github.com/GenericMappingTools/gmt/pull/3510"
            ],
            "date": "2020-06-21 02:02:10+00:00",
            "diff": "genericmappingtools_gmt/issue_3408/commit_8fdd86a86558f0f74015e300f8692d1f8b7fdf48.diff",
            "diff_additions": 70,
            "diff_deletions": 17,
            "diff_file_size": 968319,
            "diff_url": "https://github.com/GenericMappingTools/gmt/commit/8fdd86a86558f0f74015e300f8692d1f8b7fdf48.diff",
            "exists": true,
            "files": [
                {
                    "file_additions": 31,
                    "file_deletions": 3,
                    "file_exists": true,
                    "file_name": "src/gmt_api.c",
                    "file_size": 845199
                },
                {
                    "file_additions": 12,
                    "file_deletions": 14,
                    "file_exists": true,
                    "file_name": "src/grdimage.c",
                    "file_size": 121931
                },
                {
                    "file_additions": 27,
                    "file_deletions": 0,
                    "file_exists": true,
                    "file_name": "src/testapi_imageshading.c",
                    "file_size": 1189
                }
            ],
            "interesting": {
                "reopen": true,
                "status": false
            },
            "is_parent": false,
            "sha": "8fdd86a86558f0f74015e300f8692d1f8b7fdf48"
        },
        {
            "associated_pull_request": [
                "https://github.com/GenericMappingTools/gmt/pull/3512"
            ],
            "date": "2020-06-21 05:22:14+00:00",
            "diff": "genericmappingtools_gmt/issue_3408/commit_e5b54a48da5cd9bdb5b85f069d9456905d4cf111.diff",
            "diff_additions": 3,
            "diff_deletions": 3,
            "diff_file_size": 121931,
            "diff_url": "https://github.com/GenericMappingTools/gmt/commit/e5b54a48da5cd9bdb5b85f069d9456905d4cf111.diff",
            "exists": true,
            "files": [
                {
                    "file_additions": 3,
                    "file_deletions": 3,
                    "file_exists": true,
                    "file_name": "src/grdimage.c",
                    "file_size": 121931
                }
            ],
            "interesting": {
                "reopen": true,
                "status": false
            },
            "is_parent": false,
            "sha": "e5b54a48da5cd9bdb5b85f069d9456905d4cf111"
        }
    ],
    "first_commit": "2020-06-20 19:32:15+00:00",
    "last_commit": "2020-06-21 05:22:14+00:00",
    "number": 3408,
    "pull_request": "None",
    "score": {
        "accidental_reopen_likely": false,
        "all_labels": [
            "bug"
        ],
        "contains_keywords": [
            "work",
            "fail",
            "chang",
            "issu",
            "debug",
            "reason",
            "test",
            "fault",
            "bug",
            "error",
            "problem",
            "crash",
            "report"
        ],
        "fix_size": 49,
        "has_labels": [
            "bug"
        ],
        "intersecting": {
            "computed_score": 1.0,
            "final_commit_size": 4,
            "intersection_size": 4,
            "previous_commits_size": 49
        },
        "is_makefile_based": true,
        "no_new_files": [],
        "no_other_files": false,
        "num_prohibited_files": 243600,
        "prohibited_files": [
            "server/src/main/java/com/genymobile/scrcpy/Device.java",
            "server/src/main/java/com/genymobile/scrcpy/wrappers/SurfaceControl.java",
            "server/src/main/java/com/genymobile/scrcpy/Device.java",
            "server/src/main/java/com/genymobile/scrcpy/wrappers/SurfaceControl.java",
            "app/meson.build",
            "app/scrcpy.1",
            "app/src/common.h",
            "app/src/scrcpy.h",
            "app/src/server.h",
            "server/src/main/java/com/genymobile/scrcpy/Workarounds.java"
        ],
        "reopen": true,
        "reopen_events": [
            [
                "2020-06-20 21:26:54+00:00",
                "commit"
            ],
            [
                "2020-06-21 02:02:11+00:00",
                "closed"
            ],
            [
                "2020-06-21 02:02:13+00:00",
                "commit"
            ],
            [
                "2020-06-21 02:26:28+00:00",
                "reopened"
            ],
            [
                "2020-06-21 05:22:16+00:00",
                "commit"
            ],
            [
                "2020-06-21 05:22:33+00:00",
                "closed"
            ],
            [
                "2020-09-29 11:28:40+00:00",
                "reopened"
            ],
            [
                "2020-10-14 22:58:49+00:00",
                "closed"
            ]
        ],
        "status": false,
        "strategy": true,
        "total_changes": 120
    }
}