{
    "commits": [
        {
            "associated_pull_request": [],
            "date": "2020-02-16 01:05:03+00:00",
            "diff": "winsiderss_systeminformer/issue_546/commit_25c003b07c9b5c16f2c729ca1c56844cd03483b5.diff",
            "diff_additions": 68,
            "diff_deletions": 13,
            "diff_file_size": 103573,
            "diff_url": "https://github.com/winsiderss/systeminformer/commit/25c003b07c9b5c16f2c729ca1c56844cd03483b5.diff",
            "exists": true,
            "files": [
                {
                    "file_additions": 68,
                    "file_deletions": 13,
                    "file_exists": true,
                    "file_name": "phlib/theme.c",
                    "file_size": 103573
                }
            ],
            "interesting": {
                "reopen": false,
                "status": false
            },
            "is_parent": true,
            "sha": "25c003b07c9b5c16f2c729ca1c56844cd03483b5"
        },
        {
            "associated_pull_request": [],
            "date": "2020-02-16 03:35:51+00:00",
            "diff": "winsiderss_systeminformer/issue_546/commit_ce4e5f4681365af58e644b18dfe40637f645597e.diff",
            "diff_additions": 433,
            "diff_deletions": 3,
            "diff_file_size": 0,
            "diff_url": "https://github.com/winsiderss/systeminformer/commit/ce4e5f4681365af58e644b18dfe40637f645597e.diff",
            "exists": true,
            "files": [
                {
                    "file_additions": 343,
                    "file_deletions": 0,
                    "file_exists": false,
                    "file_name": "ProcessHacker/appsup.c",
                    "file_size": 0
                },
                {
                    "file_additions": 16,
                    "file_deletions": 1,
                    "file_exists": false,
                    "file_name": "ProcessHacker/main.c",
                    "file_size": 0
                },
                {
                    "file_additions": 73,
                    "file_deletions": 2,
                    "file_exists": false,
                    "file_name": "ProcessHacker/options.c",
                    "file_size": 0
                },
                {
                    "file_additions": 1,
                    "file_deletions": 0,
                    "file_exists": false,
                    "file_name": "ProcessHacker/settings.c",
                    "file_size": 0
                }
            ],
            "interesting": {
                "reopen": true,
                "status": false
            },
            "is_parent": false,
            "sha": "ce4e5f4681365af58e644b18dfe40637f645597e"
        },
        {
            "associated_pull_request": [],
            "date": "2020-02-22 07:39:49+00:00",
            "diff": "winsiderss_systeminformer/issue_546/commit_d28e42cef91f118f185d125166740910997887a6.diff",
            "diff_additions": 24,
            "diff_deletions": 0,
            "diff_file_size": 0,
            "diff_url": "https://github.com/winsiderss/systeminformer/commit/d28e42cef91f118f185d125166740910997887a6.diff",
            "exists": true,
            "files": [
                {
                    "file_additions": 24,
                    "file_deletions": 0,
                    "file_exists": false,
                    "file_name": "ProcessHacker/options.c",
                    "file_size": 0
                }
            ],
            "interesting": {
                "reopen": false,
                "status": false
            },
            "is_parent": false,
            "sha": "d28e42cef91f118f185d125166740910997887a6"
        }
    ],
    "first_commit": "2020-02-16 01:05:03+00:00",
    "last_commit": "2020-02-22 07:39:49+00:00",
    "number": 546,
    "pull_request": "None",
    "score": {
        "accidental_reopen_likely": false,
        "all_labels": [
            "enhancement"
        ],
        "contains_keywords": [
            "work",
            "chang",
            "fix",
            "issu",
            "reason",
            "test",
            "fault",
            "remov",
            "warn",
            "bug"
        ],
        "fix_size": 438,
        "has_labels": [],
        "intersecting": {
            "computed_score": 1.0,
            "final_commit_size": 25,
            "intersection_size": 25,
            "previous_commits_size": 438
        },
        "is_makefile_based": false,
        "no_new_files": [],
        "no_other_files": false,
        "num_prohibited_files": 29189,
        "prohibited_files": [
            "server/src/main/java/com/genymobile/scrcpy/Device.java",
            "server/src/main/java/com/genymobile/scrcpy/wrappers/SurfaceControl.java",
            "server/src/main/java/com/genymobile/scrcpy/Device.java",
            "server/src/main/java/com/genymobile/scrcpy/wrappers/SurfaceControl.java",
            "app/meson.build",
            "app/scrcpy.1",
            "app/src/common.h",
            "app/src/scrcpy.h",
            "app/src/server.h",
            "server/src/main/java/com/genymobile/scrcpy/Workarounds.java"
        ],
        "reopen": true,
        "reopen_events": [
            [
                "2020-02-16 03:36:02+00:00",
                "commit"
            ],
            [
                "2020-02-17 08:50:45+00:00",
                "closed"
            ],
            [
                "2020-02-17 09:00:55+00:00",
                "reopened"
            ],
            [
                "2020-02-22 07:39:57+00:00",
                "commit"
            ],
            [
                "2022-05-14 11:18:52+00:00",
                "closed"
            ]
        ],
        "status": false,
        "strategy": true,
        "total_changes": 541
    }
}