{
    "category": [
        "build/refactor/preprocessing",
        "control flow"
    ],
    "commits": [
        {
            "associated_pull_request": [
                "https://github.com/sleuthkit/sleuthkit/pull/934"
            ],
            "date": "2017-08-31 15:23:56",
            "diff": "sleuthkit_sleuthkit/issue_935/commit_2ded3b730ba71acb276803c2c44feca4294a687d.diff",
            "diff_additions": 11,
            "diff_deletions": 39,
            "diff_file_size": 185478,
            "diff_url": "https://github.com/sleuthkit/sleuthkit/commit/2ded3b730ba71acb276803c2c44feca4294a687d.diff",
            "exists": true,
            "files": [
                {
                    "file_additions": 3,
                    "file_deletions": 3,
                    "file_exists": true,
                    "file_name": "tsk/fs/exfatfs_dent.c",
                    "file_size": 25958
                },
                {
                    "file_additions": 5,
                    "file_deletions": 33,
                    "file_exists": true,
                    "file_name": "tsk/fs/ext2fs.c",
                    "file_size": 129052
                },
                {
                    "file_additions": 3,
                    "file_deletions": 3,
                    "file_exists": true,
                    "file_name": "tsk/fs/fatxxfs.c",
                    "file_size": 30468
                }
            ],
            "interesting": {
                "reopen": false,
                "status": false
            },
            "is_parent": true,
            "sha": "2ded3b730ba71acb276803c2c44feca4294a687d"
        },
        {
            "associated_pull_request": [
                "https://github.com/sleuthkit/sleuthkit/pull/940"
            ],
            "date": "2017-09-03 00:19:58",
            "diff": "sleuthkit_sleuthkit/issue_935/commit_bc4ac356321ba12a25dd859ed715d58d201b2000.diff",
            "diff_additions": 15,
            "diff_deletions": 6,
            "diff_file_size": 11664,
            "diff_url": "https://github.com/sleuthkit/sleuthkit/commit/bc4ac356321ba12a25dd859ed715d58d201b2000.diff",
            "exists": true,
            "files": [
                {
                    "file_additions": 15,
                    "file_deletions": 6,
                    "file_exists": true,
                    "file_name": "tsk/vs/sun.c",
                    "file_size": 11664
                }
            ],
            "interesting": {
                "reopen": false,
                "status": true
            },
            "is_parent": false,
            "sha": "bc4ac356321ba12a25dd859ed715d58d201b2000"
        },
        {
            "associated_pull_request": [
                "https://github.com/sleuthkit/sleuthkit/pull/940"
            ],
            "date": "2017-09-03 00:19:58",
            "diff": "sleuthkit_sleuthkit/issue_935/commit_70577e0613d59b7562571299b2912a627383b747.diff",
            "diff_additions": 15,
            "diff_deletions": 6,
            "diff_file_size": 11664,
            "diff_url": "https://github.com/sleuthkit/sleuthkit/commit/70577e0613d59b7562571299b2912a627383b747.diff",
            "exists": true,
            "files": [
                {
                    "file_additions": 15,
                    "file_deletions": 6,
                    "file_exists": true,
                    "file_name": "tsk/vs/sun.c",
                    "file_size": 11664
                }
            ],
            "interesting": {
                "reopen": false,
                "status": false
            },
            "is_parent": false,
            "sha": "70577e0613d59b7562571299b2912a627383b747"
        },
        {
            "associated_pull_request": [
                "https://github.com/sleuthkit/sleuthkit/pull/940"
            ],
            "date": "2017-09-03 00:19:58",
            "diff": "sleuthkit_sleuthkit/issue_935/commit_6e0c7bc2fd813e040b5bf3a935602f219d673542.diff",
            "diff_additions": 15,
            "diff_deletions": 6,
            "diff_file_size": 11664,
            "diff_url": "https://github.com/sleuthkit/sleuthkit/commit/6e0c7bc2fd813e040b5bf3a935602f219d673542.diff",
            "exists": true,
            "files": [
                {
                    "file_additions": 15,
                    "file_deletions": 6,
                    "file_exists": true,
                    "file_name": "tsk/vs/sun.c",
                    "file_size": 11664
                }
            ],
            "interesting": {
                "reopen": false,
                "status": false
            },
            "is_parent": false,
            "sha": "6e0c7bc2fd813e040b5bf3a935602f219d673542"
        },
        {
            "associated_pull_request": [
                "https://github.com/sleuthkit/sleuthkit/pull/940"
            ],
            "date": "2017-09-05 02:42:52",
            "diff": "sleuthkit_sleuthkit/issue_935/commit_bb817925f1db39095db92a95fd103b8b2aaafc6f.diff",
            "diff_additions": 15,
            "diff_deletions": 6,
            "diff_file_size": 11664,
            "diff_url": "https://github.com/sleuthkit/sleuthkit/commit/bb817925f1db39095db92a95fd103b8b2aaafc6f.diff",
            "exists": true,
            "files": [
                {
                    "file_additions": 15,
                    "file_deletions": 6,
                    "file_exists": true,
                    "file_name": "tsk/vs/sun.c",
                    "file_size": 11664
                }
            ],
            "interesting": {
                "reopen": false,
                "status": false
            },
            "is_parent": false,
            "sha": "bb817925f1db39095db92a95fd103b8b2aaafc6f"
        }
    ],
    "first_commit": "2017-08-31 15:23:56",
    "last_commit": "2017-09-05 02:42:52",
    "number": 935,
    "pull_request": "None",
    "score": {
        "accidental_reopen_likely": false,
        "all_labels": [],
        "contains_keywords": [
            "report",
            "bug",
            "warn"
        ],
        "fix_size": 20,
        "has_labels": [],
        "intersecting": {
            "computed_score": 1.0,
            "final_commit_size": 20,
            "intersection_size": 20,
            "previous_commits_size": 20
        },
        "is_makefile_based": true,
        "no_new_files": [],
        "no_other_files": true,
        "num_prohibited_files": 105162,
        "prohibited_files": [
            "kill.h",
            "meminfo.h",
            "kill.h",
            "meminfo.h",
            "kill.h",
            "meminfo.h",
            "testsuite_cli_test.go",
            "testsuite_cli_test.go",
            "common.mk",
            "i3bar/include/draw_util.h"
        ],
        "reopen": false,
        "reopen_events": [
            [
                "2017-09-03 00:20:09",
                "commit"
            ],
            [
                "2017-09-03 00:29:06",
                "commit"
            ],
            [
                "2017-09-03 00:32:15",
                "commit"
            ],
            [
                "2017-09-05 02:42:54",
                "closed"
            ],
            [
                "2017-09-05 02:42:54",
                "commit"
            ],
            [
                "2017-09-05 02:42:54",
                "commit"
            ]
        ],
        "status": true,
        "strategy": true,
        "total_changes": 134
    }
}