{
    "covered_issues": [
        176,
        174,
        173,
        172,
        171,
        169,
        167,
        166,
        163,
        159,
        157,
        154,
        152,
        151,
        150,
        148,
        144,
        143,
        142,
        137,
        136,
        135,
        134,
        132,
        131,
        129,
        128,
        125,
        124,
        122,
        121,
        120,
        119,
        118,
        117,
        113,
        111,
        110,
        109,
        107,
        106,
        104,
        102,
        100,
        99,
        98,
        97,
        96,
        95,
        94,
        92,
        90,
        88,
        87,
        85,
        84,
        82,
        80,
        79,
        77,
        75,
        74,
        73,
        72,
        71,
        69,
        67,
        66,
        65,
        64,
        63,
        52,
        51,
        50,
        49,
        48,
        47,
        46,
        45,
        44,
        43,
        42,
        41,
        40,
        39,
        38,
        37,
        36,
        35,
        34,
        33,
        32,
        31,
        30,
        29,
        27,
        26,
        25,
        24,
        23,
        22,
        21,
        20,
        19,
        15,
        14,
        13,
        11,
        10,
        9,
        8,
        7,
        5,
        4,
        3,
        1
    ],
    "finished": true
}