{
    "commits": [
        {
            "associated_pull_request": [],
            "date": "2023-08-18 22:00:00+00:00",
            "diff": "mintty_mintty/issue_1226/commit_2f602e5024d266bee910ea1cfdd83512566751f0.diff",
            "diff_additions": 66,
            "diff_deletions": 8,
            "diff_file_size": 356247,
            "diff_url": "https://github.com/mintty/mintty/commit/2f602e5024d266bee910ea1cfdd83512566751f0.diff",
            "exists": true,
            "files": [
                {
                    "file_additions": 50,
                    "file_deletions": 4,
                    "file_exists": true,
                    "file_name": "src/term.c",
                    "file_size": 137282
                },
                {
                    "file_additions": 16,
                    "file_deletions": 4,
                    "file_exists": true,
                    "file_name": "src/winmain.c",
                    "file_size": 218965
                }
            ],
            "interesting": {
                "reopen": false,
                "status": false
            },
            "is_parent": true,
            "sha": "2f602e5024d266bee910ea1cfdd83512566751f0"
        },
        {
            "associated_pull_request": [],
            "date": "2023-08-20 22:00:00+00:00",
            "diff": "mintty_mintty/issue_1226/commit_b2c4f9000cf44e7ee3c663932af627afce3b89c0.diff",
            "diff_additions": 22,
            "diff_deletions": 2,
            "diff_file_size": 218965,
            "diff_url": "https://github.com/mintty/mintty/commit/b2c4f9000cf44e7ee3c663932af627afce3b89c0.diff",
            "exists": true,
            "files": [
                {
                    "file_additions": 22,
                    "file_deletions": 2,
                    "file_exists": true,
                    "file_name": "src/winmain.c",
                    "file_size": 218965
                }
            ],
            "interesting": {
                "reopen": true,
                "status": false
            },
            "is_parent": false,
            "sha": "b2c4f9000cf44e7ee3c663932af627afce3b89c0"
        },
        {
            "associated_pull_request": [],
            "date": "2023-09-01 22:00:00+00:00",
            "diff": "mintty_mintty/issue_1226/commit_ffe958a2bf49db1a48cd0897b632b46014db2a4d.diff",
            "diff_additions": 35,
            "diff_deletions": 4,
            "diff_file_size": 218965,
            "diff_url": "https://github.com/mintty/mintty/commit/ffe958a2bf49db1a48cd0897b632b46014db2a4d.diff",
            "exists": true,
            "files": [
                {
                    "file_additions": 35,
                    "file_deletions": 4,
                    "file_exists": true,
                    "file_name": "src/winmain.c",
                    "file_size": 218965
                }
            ],
            "interesting": {
                "reopen": false,
                "status": false
            },
            "is_parent": false,
            "sha": "ffe958a2bf49db1a48cd0897b632b46014db2a4d"
        }
    ],
    "first_commit": "2023-08-19 07:40:42+00:00",
    "last_commit": "2023-09-02 08:00:54+00:00",
    "number": 1226,
    "pull_request": "None",
    "score": {
        "accidental_reopen_likely": false,
        "all_labels": [],
        "contains_keywords": [
            "work",
            "chang",
            "fix",
            "issu",
            "reason",
            "test",
            "workaround"
        ],
        "fix_size": 63,
        "has_labels": [],
        "intersecting": {
            "computed_score": 0.02564102564102564,
            "final_commit_size": 39,
            "intersection_size": 1,
            "previous_commits_size": 25
        },
        "is_makefile_based": true,
        "no_new_files": [],
        "no_other_files": false,
        "num_prohibited_files": 144657,
        "prohibited_files": [
            "server/src/main/java/com/genymobile/scrcpy/Device.java",
            "server/src/main/java/com/genymobile/scrcpy/wrappers/SurfaceControl.java",
            "server/src/main/java/com/genymobile/scrcpy/Device.java",
            "server/src/main/java/com/genymobile/scrcpy/wrappers/SurfaceControl.java",
            "app/meson.build",
            "app/scrcpy.1",
            "app/src/common.h",
            "app/src/scrcpy.h",
            "app/src/server.h",
            "server/src/main/java/com/genymobile/scrcpy/Workarounds.java"
        ],
        "reopen": true,
        "reopen_events": [
            [
                "2023-08-02 04:31:07+00:00",
                "closed"
            ],
            [
                "2023-08-20 22:46:16+00:00",
                "commit"
            ],
            [
                "2023-08-21 10:13:47+00:00",
                "reopened"
            ],
            [
                "2023-09-02 08:01:06+00:00",
                "commit"
            ],
            [
                "2023-09-03 10:54:14+00:00",
                "closed"
            ]
        ],
        "status": false,
        "strategy": true,
        "total_changes": 137
    }
}