{
    "all_issues": 536,
    "interesting_issues": 1,
    "last_update": "2021-05-16 22:45:56.153823",
    "license": {
        "download": "https://raw.githubusercontent.com/bitnine-oss/agensgraph/master/LICENSE",
        "name": "Other"
    },
    "ratio": 0.0018656716417910447,
    "size": 41119,
    "stars": 1074,
    "url": "https://github.com/bitnine-oss/agensgraph"
}