{
    "commits": [
        {
            "associated_pull_request": [
                "https://github.com/open-mpi/ompi/pull/11024"
            ],
            "date": "2022-11-02 23:02:02+00:00",
            "diff": "open-mpi_ompi/issue_11034/commit_0edb3114b6afea1c14df13f064ce6e9a9dbb19a7.diff",
            "diff_additions": 5,
            "diff_deletions": 2,
            "diff_file_size": 17695,
            "diff_url": "https://github.com/open-mpi/ompi/commit/0edb3114b6afea1c14df13f064ce6e9a9dbb19a7.diff",
            "exists": true,
            "files": [
                {
                    "file_additions": 5,
                    "file_deletions": 2,
                    "file_exists": true,
                    "file_name": "opal/runtime/opal_init_core.c",
                    "file_size": 17695
                }
            ],
            "interesting": {
                "reopen": false,
                "status": false
            },
            "is_parent": true,
            "sha": "0edb3114b6afea1c14df13f064ce6e9a9dbb19a7"
        },
        {
            "associated_pull_request": [
                "https://github.com/open-mpi/ompi/pull/11035"
            ],
            "date": "2022-11-04 18:06:54+00:00",
            "diff": "open-mpi_ompi/issue_11034/commit_d642af133b782b857218975056a9afac8801dcc1.diff",
            "diff_additions": 4,
            "diff_deletions": 2,
            "diff_file_size": 31676,
            "diff_url": "https://github.com/open-mpi/ompi/commit/d642af133b782b857218975056a9afac8801dcc1.diff",
            "exists": true,
            "files": [
                {
                    "file_additions": 4,
                    "file_deletions": 2,
                    "file_exists": true,
                    "file_name": "opal/mca/common/ofi/common_ofi.c",
                    "file_size": 31676
                }
            ],
            "interesting": {
                "reopen": false,
                "status": false
            },
            "is_parent": false,
            "sha": "d642af133b782b857218975056a9afac8801dcc1"
        },
        {
            "associated_pull_request": [],
            "date": "2022-11-04 19:10:07+00:00",
            "diff": "open-mpi_ompi/issue_11034/commit_9f0dc74a331d8ff31db9d95333aaa0c7aedc9de1.diff",
            "diff_additions": 1,
            "diff_deletions": 1,
            "diff_file_size": 38646,
            "diff_url": "https://github.com/open-mpi/ompi/commit/9f0dc74a331d8ff31db9d95333aaa0c7aedc9de1.diff",
            "exists": true,
            "files": [
                {
                    "file_additions": 1,
                    "file_deletions": 1,
                    "file_exists": true,
                    "file_name": "ompi/runtime/ompi_rte.c",
                    "file_size": 38646
                }
            ],
            "interesting": {
                "reopen": false,
                "status": false
            },
            "is_parent": false,
            "sha": "9f0dc74a331d8ff31db9d95333aaa0c7aedc9de1"
        },
        {
            "associated_pull_request": [],
            "date": "2022-11-04 19:10:07+00:00",
            "diff": "open-mpi_ompi/issue_11034/commit_e8f4d605c7f45c50b0435dd10c63dabbecb6eb06.diff",
            "diff_additions": 28,
            "diff_deletions": 12,
            "diff_file_size": 38646,
            "diff_url": "https://github.com/open-mpi/ompi/commit/e8f4d605c7f45c50b0435dd10c63dabbecb6eb06.diff",
            "exists": true,
            "files": [
                {
                    "file_additions": 28,
                    "file_deletions": 12,
                    "file_exists": true,
                    "file_name": "ompi/runtime/ompi_rte.c",
                    "file_size": 38646
                }
            ],
            "interesting": {
                "reopen": false,
                "status": true
            },
            "is_parent": false,
            "sha": "e8f4d605c7f45c50b0435dd10c63dabbecb6eb06"
        },
        {
            "associated_pull_request": [],
            "date": "2022-11-04 19:10:07+00:00",
            "diff": "open-mpi_ompi/issue_11034/commit_bb67c5cc040c8ac5ed6bc5eaa179cb336ba6af97.diff",
            "diff_additions": 28,
            "diff_deletions": 12,
            "diff_file_size": 38646,
            "diff_url": "https://github.com/open-mpi/ompi/commit/bb67c5cc040c8ac5ed6bc5eaa179cb336ba6af97.diff",
            "exists": true,
            "files": [
                {
                    "file_additions": 28,
                    "file_deletions": 12,
                    "file_exists": true,
                    "file_name": "ompi/runtime/ompi_rte.c",
                    "file_size": 38646
                }
            ],
            "interesting": {
                "reopen": false,
                "status": false
            },
            "is_parent": false,
            "sha": "bb67c5cc040c8ac5ed6bc5eaa179cb336ba6af97"
        },
        {
            "associated_pull_request": [
                "https://github.com/open-mpi/ompi/pull/11036"
            ],
            "date": "2022-11-04 19:10:07+00:00",
            "diff": "open-mpi_ompi/issue_11034/commit_6a787fbfaca6d0b0cd0965c8b422e910ecfca010.diff",
            "diff_additions": 26,
            "diff_deletions": 12,
            "diff_file_size": 38646,
            "diff_url": "https://github.com/open-mpi/ompi/commit/6a787fbfaca6d0b0cd0965c8b422e910ecfca010.diff",
            "exists": true,
            "files": [
                {
                    "file_additions": 26,
                    "file_deletions": 12,
                    "file_exists": true,
                    "file_name": "ompi/runtime/ompi_rte.c",
                    "file_size": 38646
                }
            ],
            "interesting": {
                "reopen": false,
                "status": false
            },
            "is_parent": false,
            "sha": "6a787fbfaca6d0b0cd0965c8b422e910ecfca010"
        },
        {
            "associated_pull_request": [
                "https://github.com/open-mpi/ompi/pull/11113"
            ],
            "date": "2022-11-04 19:10:07+00:00",
            "diff": "open-mpi_ompi/issue_11034/commit_46c845c73ffad236e295249cd43d0e8169f76e11.diff",
            "diff_additions": 26,
            "diff_deletions": 12,
            "diff_file_size": 38646,
            "diff_url": "https://github.com/open-mpi/ompi/commit/46c845c73ffad236e295249cd43d0e8169f76e11.diff",
            "exists": true,
            "files": [
                {
                    "file_additions": 26,
                    "file_deletions": 12,
                    "file_exists": true,
                    "file_name": "ompi/runtime/ompi_rte.c",
                    "file_size": 38646
                }
            ],
            "interesting": {
                "reopen": false,
                "status": false
            },
            "is_parent": false,
            "sha": "46c845c73ffad236e295249cd43d0e8169f76e11"
        }
    ],
    "first_commit": "2022-11-02 23:02:02+00:00",
    "last_commit": "2022-11-23 22:01:00+00:00",
    "number": 11034,
    "pull_request": "None",
    "score": {
        "accidental_reopen_likely": false,
        "all_labels": [
            "Target: main",
            "Target: v5.0.x"
        ],
        "contains_keywords": [
            "chang",
            "fix",
            "issu",
            "patch",
            "reason",
            "fault",
            "leak",
            "problem"
        ],
        "fix_size": 38,
        "has_labels": [],
        "intersecting": {
            "computed_score": 1.0,
            "final_commit_size": 31,
            "intersection_size": 31,
            "previous_commits_size": 38
        },
        "is_makefile_based": true,
        "no_new_files": [],
        "no_other_files": true,
        "num_prohibited_files": 355504,
        "prohibited_files": [
            "server/src/main/java/com/genymobile/scrcpy/Device.java",
            "server/src/main/java/com/genymobile/scrcpy/wrappers/SurfaceControl.java",
            "server/src/main/java/com/genymobile/scrcpy/Device.java",
            "server/src/main/java/com/genymobile/scrcpy/wrappers/SurfaceControl.java",
            "app/meson.build",
            "app/scrcpy.1",
            "app/src/common.h",
            "app/src/scrcpy.h",
            "app/src/server.h",
            "server/src/main/java/com/genymobile/scrcpy/Workarounds.java"
        ],
        "reopen": false,
        "reopen_events": [
            [
                "2022-11-04 18:08:49+00:00",
                "commit"
            ],
            [
                "2022-11-04 19:15:23+00:00",
                "commit"
            ],
            [
                "2022-11-04 20:43:20+00:00",
                "commit"
            ],
            [
                "2022-11-04 21:20:11+00:00",
                "commit"
            ],
            [
                "2022-11-08 17:25:49+00:00",
                "commit"
            ],
            [
                "2022-11-16 12:54:00+00:00",
                "commit"
            ],
            [
                "2022-11-23 22:11:42+00:00",
                "commit"
            ],
            [
                "2022-12-15 22:58:55+00:00",
                "closed"
            ]
        ],
        "status": true,
        "strategy": true,
        "total_changes": 171
    }
}