{
    "commits": [
        {
            "associated_pull_request": [
                "https://github.com/RIOT-OS/RIOT/pull/12735"
            ],
            "date": "2019-11-20 00:43:26+00:00",
            "diff": "",
            "diff_additions": 0,
            "diff_deletions": 0,
            "diff_file_size": 0,
            "diff_url": "https://github.com/RIOT-OS/RIOT/commit/d91b756d0bcfece74b4dc6f0d62bb4ac173c3830.diff",
            "exists": true,
            "files": [],
            "interesting": {
                "reopen": false,
                "status": false
            },
            "is_parent": true,
            "sha": "d91b756d0bcfece74b4dc6f0d62bb4ac173c3830"
        },
        {
            "associated_pull_request": [],
            "date": "2020-05-07 14:37:33+00:00",
            "diff": "riot-os_riot/issue_12320/commit_c94573452a185584e2fb9a74ebf711e70469ff0b.diff",
            "diff_additions": 64,
            "diff_deletions": 0,
            "diff_file_size": 2350,
            "diff_url": "https://github.com/RIOT-OS/RIOT/commit/c94573452a185584e2fb9a74ebf711e70469ff0b.diff",
            "exists": true,
            "files": [
                {
                    "file_additions": 29,
                    "file_deletions": 0,
                    "file_exists": true,
                    "file_name": "boards/common/particle-mesh/board.c",
                    "file_size": 2350
                },
                {
                    "file_additions": 35,
                    "file_deletions": 0,
                    "file_exists": false,
                    "file_name": "boards/particle-xenon/bootloader.c",
                    "file_size": 0
                }
            ],
            "interesting": {
                "reopen": true,
                "status": false
            },
            "is_parent": false,
            "sha": "c94573452a185584e2fb9a74ebf711e70469ff0b"
        },
        {
            "associated_pull_request": [],
            "date": "2020-05-07 14:37:33+00:00",
            "diff": "riot-os_riot/issue_12320/commit_807e0d20cd6c6d0cff5f01c4c9544a0e03aebf8c.diff",
            "diff_additions": 118,
            "diff_deletions": 0,
            "diff_file_size": 5274,
            "diff_url": "https://github.com/RIOT-OS/RIOT/commit/807e0d20cd6c6d0cff5f01c4c9544a0e03aebf8c.diff",
            "exists": true,
            "files": [
                {
                    "file_additions": 25,
                    "file_deletions": 0,
                    "file_exists": true,
                    "file_name": "boards/common/particle-mesh/board.c",
                    "file_size": 2350
                },
                {
                    "file_additions": 93,
                    "file_deletions": 0,
                    "file_exists": true,
                    "file_name": "boards/common/particle-mesh/bootloader.c",
                    "file_size": 2924
                }
            ],
            "interesting": {
                "reopen": false,
                "status": false
            },
            "is_parent": false,
            "sha": "807e0d20cd6c6d0cff5f01c4c9544a0e03aebf8c"
        },
        {
            "associated_pull_request": [],
            "date": "2020-05-07 14:37:33+00:00",
            "diff": "riot-os_riot/issue_12320/commit_3153d746fcdc4bfead9d690bd70191c55619d145.diff",
            "diff_additions": 118,
            "diff_deletions": 0,
            "diff_file_size": 5274,
            "diff_url": "https://github.com/RIOT-OS/RIOT/commit/3153d746fcdc4bfead9d690bd70191c55619d145.diff",
            "exists": true,
            "files": [
                {
                    "file_additions": 25,
                    "file_deletions": 0,
                    "file_exists": true,
                    "file_name": "boards/common/particle-mesh/board.c",
                    "file_size": 2350
                },
                {
                    "file_additions": 93,
                    "file_deletions": 0,
                    "file_exists": true,
                    "file_name": "boards/common/particle-mesh/bootloader.c",
                    "file_size": 2924
                }
            ],
            "interesting": {
                "reopen": false,
                "status": false
            },
            "is_parent": false,
            "sha": "3153d746fcdc4bfead9d690bd70191c55619d145"
        },
        {
            "associated_pull_request": [],
            "date": "2020-05-07 14:37:33+00:00",
            "diff": "riot-os_riot/issue_12320/commit_119c664ae23365a11679ea291a345353b7694a04.diff",
            "diff_additions": 118,
            "diff_deletions": 0,
            "diff_file_size": 5274,
            "diff_url": "https://github.com/RIOT-OS/RIOT/commit/119c664ae23365a11679ea291a345353b7694a04.diff",
            "exists": true,
            "files": [
                {
                    "file_additions": 25,
                    "file_deletions": 0,
                    "file_exists": true,
                    "file_name": "boards/common/particle-mesh/board.c",
                    "file_size": 2350
                },
                {
                    "file_additions": 93,
                    "file_deletions": 0,
                    "file_exists": true,
                    "file_name": "boards/common/particle-mesh/bootloader.c",
                    "file_size": 2924
                }
            ],
            "interesting": {
                "reopen": false,
                "status": false
            },
            "is_parent": false,
            "sha": "119c664ae23365a11679ea291a345353b7694a04"
        },
        {
            "associated_pull_request": [],
            "date": "2020-05-07 14:37:33+00:00",
            "diff": "riot-os_riot/issue_12320/commit_99791a2c206e5a2c46fe44b787e0456eea0e21ec.diff",
            "diff_additions": 109,
            "diff_deletions": 0,
            "diff_file_size": 5274,
            "diff_url": "https://github.com/RIOT-OS/RIOT/commit/99791a2c206e5a2c46fe44b787e0456eea0e21ec.diff",
            "exists": true,
            "files": [
                {
                    "file_additions": 25,
                    "file_deletions": 0,
                    "file_exists": true,
                    "file_name": "boards/common/particle-mesh/board.c",
                    "file_size": 2350
                },
                {
                    "file_additions": 84,
                    "file_deletions": 0,
                    "file_exists": true,
                    "file_name": "boards/common/particle-mesh/bootloader.c",
                    "file_size": 2924
                }
            ],
            "interesting": {
                "reopen": false,
                "status": false
            },
            "is_parent": false,
            "sha": "99791a2c206e5a2c46fe44b787e0456eea0e21ec"
        },
        {
            "associated_pull_request": [
                "https://github.com/RIOT-OS/RIOT/pull/12751"
            ],
            "date": "2020-05-07 14:37:33+00:00",
            "diff": "riot-os_riot/issue_12320/commit_7582be6d5e24148be494d38d22e6ce2ad2090506.diff",
            "diff_additions": 109,
            "diff_deletions": 0,
            "diff_file_size": 5274,
            "diff_url": "https://github.com/RIOT-OS/RIOT/commit/7582be6d5e24148be494d38d22e6ce2ad2090506.diff",
            "exists": true,
            "files": [
                {
                    "file_additions": 25,
                    "file_deletions": 0,
                    "file_exists": true,
                    "file_name": "boards/common/particle-mesh/board.c",
                    "file_size": 2350
                },
                {
                    "file_additions": 84,
                    "file_deletions": 0,
                    "file_exists": true,
                    "file_name": "boards/common/particle-mesh/bootloader.c",
                    "file_size": 2924
                }
            ],
            "interesting": {
                "reopen": false,
                "status": false
            },
            "is_parent": false,
            "sha": "7582be6d5e24148be494d38d22e6ce2ad2090506"
        }
    ],
    "first_commit": "2019-11-20 00:43:26+00:00",
    "last_commit": "2020-11-06 12:43:14+00:00",
    "number": 12320,
    "pull_request": "None",
    "score": {
        "accidental_reopen_likely": false,
        "all_labels": [
            "Type: new feature",
            "Area: boards"
        ],
        "contains_keywords": [
            "confirm",
            "work",
            "fail",
            "chang",
            "fix",
            "issu",
            "fault"
        ],
        "fix_size": 30,
        "has_labels": [],
        "intersecting": {
            "computed_score": 1.0,
            "final_commit_size": 26,
            "intersection_size": 26,
            "previous_commits_size": 30
        },
        "is_makefile_based": true,
        "no_new_files": [],
        "no_other_files": false,
        "num_prohibited_files": 190347,
        "prohibited_files": [
            "server/src/main/java/com/genymobile/scrcpy/Device.java",
            "server/src/main/java/com/genymobile/scrcpy/wrappers/SurfaceControl.java",
            "server/src/main/java/com/genymobile/scrcpy/Device.java",
            "server/src/main/java/com/genymobile/scrcpy/wrappers/SurfaceControl.java",
            "app/meson.build",
            "app/scrcpy.1",
            "app/src/common.h",
            "app/src/scrcpy.h",
            "app/src/server.h",
            "server/src/main/java/com/genymobile/scrcpy/Workarounds.java"
        ],
        "reopen": true,
        "reopen_events": [
            [
                "2019-11-20 10:38:42+00:00",
                "commit"
            ],
            [
                "2020-05-07 14:47:50+00:00",
                "commit"
            ],
            [
                "2020-06-21 18:21:22+00:00",
                "closed"
            ],
            [
                "2020-09-30 13:20:42+00:00",
                "reopened"
            ],
            [
                "2020-11-06 08:05:36+00:00",
                "commit"
            ],
            [
                "2020-11-06 08:20:35+00:00",
                "commit"
            ],
            [
                "2020-11-06 09:48:50+00:00",
                "commit"
            ],
            [
                "2020-11-06 12:36:52+00:00",
                "commit"
            ],
            [
                "2020-11-06 12:43:22+00:00",
                "commit"
            ],
            [
                "2020-11-06 13:15:07+00:00",
                "closed"
            ]
        ],
        "status": false,
        "strategy": true,
        "total_changes": 636
    }
}