{
    "covered_issues": [
        335,
        321,
        311,
        310,
        307,
        298,
        292,
        291,
        288,
        281,
        280,
        277,
        273,
        269,
        267,
        266,
        261,
        255,
        251,
        246,
        245,
        242,
        241,
        240,
        236,
        234,
        233,
        229,
        225,
        224,
        218,
        216,
        215,
        213,
        211,
        208,
        207,
        206,
        203,
        202,
        197,
        193,
        188,
        187,
        186,
        184,
        180,
        179,
        177,
        176,
        175,
        172,
        170,
        167,
        165,
        162,
        160,
        158,
        155,
        154,
        153,
        151,
        146,
        145,
        143,
        140,
        137,
        133,
        131,
        122,
        121,
        120,
        113,
        103,
        98,
        93,
        90,
        82,
        81,
        78,
        77,
        74,
        72,
        70,
        69,
        67,
        66,
        65,
        63,
        62,
        61,
        58,
        53,
        51,
        46,
        44,
        40,
        38,
        34,
        26,
        25,
        24,
        23,
        22,
        21,
        16,
        15,
        14,
        6,
        4,
        1,
        103,
        103,
        103,
        103
    ],
    "finished": true
}