{
    "category": [
        "hardware/OS",
        "network/protocols"
    ],
    "commits": [
        {
            "associated_pull_request": [
                "https://github.com/openwall/john/pull/3850"
            ],
            "date": "2019-04-20 20:03:04",
            "diff": "openwall_john/issue_3852/commit_fe1db6cc2ef773299d164ca14a2f661a690afe36.diff",
            "diff_additions": 1,
            "diff_deletions": 1,
            "diff_file_size": 18913,
            "diff_url": "https://github.com/openwall/john/commit/fe1db6cc2ef773299d164ca14a2f661a690afe36.diff",
            "exists": true,
            "files": [
                {
                    "file_additions": 1,
                    "file_deletions": 1,
                    "file_exists": true,
                    "file_name": "src/opencl_hash_check_128_plug.c",
                    "file_size": 18913
                }
            ],
            "interesting": {
                "reopen": false,
                "status": false
            },
            "is_parent": true,
            "sha": "fe1db6cc2ef773299d164ca14a2f661a690afe36"
        },
        {
            "associated_pull_request": [],
            "date": "2019-04-21 19:17:57",
            "diff": "openwall_john/issue_3852/commit_eeef0fb5a00082fb273305bb8a9fefcabc17c9a9.diff",
            "diff_additions": 2,
            "diff_deletions": 0,
            "diff_file_size": 46985,
            "diff_url": "https://github.com/openwall/john/commit/eeef0fb5a00082fb273305bb8a9fefcabc17c9a9.diff",
            "exists": true,
            "files": [
                {
                    "file_additions": 2,
                    "file_deletions": 0,
                    "file_exists": true,
                    "file_name": "src/rules.c",
                    "file_size": 46985
                }
            ],
            "interesting": {
                "reopen": false,
                "status": false
            },
            "is_parent": false,
            "sha": "eeef0fb5a00082fb273305bb8a9fefcabc17c9a9"
        },
        {
            "associated_pull_request": [
                "https://github.com/openwall/john/pull/3856"
            ],
            "date": "2019-04-22 16:35:08",
            "diff": "openwall_john/issue_3852/commit_6532ff3f0d672461cf49413982de4d2207ee9fcb.diff",
            "diff_additions": 2,
            "diff_deletions": 0,
            "diff_file_size": 46985,
            "diff_url": "https://github.com/openwall/john/commit/6532ff3f0d672461cf49413982de4d2207ee9fcb.diff",
            "exists": true,
            "files": [
                {
                    "file_additions": 2,
                    "file_deletions": 0,
                    "file_exists": true,
                    "file_name": "src/rules.c",
                    "file_size": 46985
                }
            ],
            "interesting": {
                "reopen": false,
                "status": false
            },
            "is_parent": false,
            "sha": "6532ff3f0d672461cf49413982de4d2207ee9fcb"
        }
    ],
    "first_commit": "2019-04-21 09:45:22",
    "last_commit": "2019-04-22 16:35:08",
    "number": 3852,
    "pull_request": "None",
    "score": {
        "accidental_reopen_likely": false,
        "all_labels": [
            "bug"
        ],
        "contains_keywords": [
            "crash",
            "fix",
            "issu",
            "fault"
        ],
        "fix_size": 3,
        "has_labels": [
            "bug"
        ],
        "intersecting": {
            "computed_score": 1.0,
            "final_commit_size": 3,
            "intersection_size": 3,
            "previous_commits_size": 3
        },
        "is_makefile_based": false,
        "no_new_files": [],
        "no_other_files": true,
        "num_prohibited_files": 112275,
        "prohibited_files": [
            "hal/inc/pinmap_hal.h",
            "Debug/marvin.bin",
            "Debug/marvin.elf",
            "Debug/marvin.hex",
            "Debug/marvin.bin",
            "Debug/marvin.elf",
            "Debug/marvin.hex",
            "inc/spark_utilities.h",
            "Debug/marvin.bin",
            "Debug/marvin.elf"
        ],
        "reopen": false,
        "reopen_events": [
            [
                "2019-04-21 19:19:29",
                "commit"
            ],
            [
                "2019-04-21 19:22:20",
                "commit"
            ],
            [
                "2019-04-21 21:43:10",
                "commit"
            ],
            [
                "2019-04-22 16:35:09",
                "closed"
            ],
            [
                "2019-04-22 16:35:11",
                "commit"
            ]
        ],
        "status": true,
        "strategy": true,
        "total_changes": 6
    }
}