{
    "covered_issues": [
        552,
        550,
        548,
        544,
        542,
        534,
        530,
        527,
        525,
        516,
        515,
        513,
        510,
        509,
        489,
        485,
        475,
        461,
        447,
        445,
        440,
        432,
        431,
        430,
        429,
        426,
        419,
        417,
        416,
        411,
        408,
        407,
        406,
        401,
        400,
        399,
        397,
        395,
        394,
        391,
        390,
        389,
        388,
        387,
        386,
        385,
        384,
        383,
        379,
        378,
        375,
        374,
        373,
        370,
        369,
        367,
        366,
        364,
        363,
        361,
        359,
        358,
        353,
        352,
        351,
        350,
        349,
        348,
        347,
        346,
        344,
        343,
        342,
        340,
        339,
        337,
        335,
        334,
        333,
        332,
        331,
        330,
        328,
        327,
        326,
        325,
        324,
        323,
        322,
        319,
        318,
        317,
        316,
        315,
        314,
        313,
        312,
        311,
        310,
        308,
        307,
        304,
        302,
        301,
        299,
        297,
        296,
        294,
        293,
        291,
        290,
        289,
        288,
        287,
        286,
        285,
        284,
        283,
        282,
        280,
        279,
        278,
        277,
        275,
        273,
        272,
        271,
        269,
        268,
        267,
        266,
        265,
        264,
        263,
        261,
        260,
        258,
        256,
        254,
        253,
        252,
        251,
        250,
        249,
        248,
        247,
        246,
        245,
        244,
        242,
        241,
        239,
        238,
        237,
        235,
        234,
        233,
        232,
        231,
        230,
        229,
        228,
        226,
        225,
        224,
        223,
        222,
        220,
        215,
        213,
        211,
        210,
        209,
        208,
        207,
        206,
        205,
        203,
        202,
        199,
        198,
        197,
        196,
        195,
        194,
        193,
        192,
        191,
        190,
        189,
        188,
        187,
        186,
        185,
        184,
        183,
        182,
        181,
        180,
        178,
        177,
        176,
        175,
        173,
        172,
        171,
        170,
        169,
        167,
        165,
        164,
        163,
        162,
        161,
        160,
        159,
        158,
        157,
        156,
        155,
        154,
        153,
        152,
        151,
        150,
        149,
        148,
        147,
        146,
        145,
        144,
        143,
        142,
        141,
        140,
        139,
        138,
        137,
        136,
        135,
        134,
        133,
        132,
        131,
        129,
        128,
        127,
        126,
        125,
        124,
        123,
        121,
        120,
        119,
        118,
        117,
        116,
        115,
        114,
        113,
        112,
        111,
        110,
        109,
        108,
        107,
        106,
        105,
        104,
        103,
        102,
        101,
        100,
        99,
        98,
        97,
        96,
        92,
        91,
        90,
        89,
        87,
        86,
        85,
        84,
        83,
        82,
        81,
        80,
        79,
        78,
        77,
        76,
        75,
        74,
        73,
        72,
        70,
        68,
        67,
        66,
        65,
        64,
        63,
        62,
        61,
        60,
        59,
        58,
        57,
        56,
        55,
        54,
        53,
        52,
        51,
        50,
        49,
        48,
        47,
        46,
        44,
        43,
        42,
        41,
        40,
        39,
        38,
        37,
        36,
        35,
        34,
        33,
        32,
        31,
        29,
        28,
        27,
        26,
        25,
        24,
        23,
        22,
        21,
        20,
        19,
        18,
        17,
        16,
        15,
        14,
        13,
        12,
        11,
        10,
        9,
        8,
        7,
        6,
        5,
        4,
        3,
        2,
        1
    ],
    "finished": true
}