{
    "commits": [
        {
            "diff": "spring-projects_spring-boot/issue_5434/commit_6ac0ae822b366d0095508f45255e894766fcb957.diff",
            "diff_additions": 100,
            "diff_deletions": 13,
            "diff_file_size": 0,
            "files": [
                {
                    "file_additions": 2,
                    "file_deletions": 12,
                    "file_exists": false,
                    "file_name": "spring-boot-tools/spring-boot-configuration-processor/src/main/java/org/springframework/boot/configurationprocessor/ConfigurationMetadataAnnotationProcessor.java",
                    "file_size": 0
                },
                {
                    "file_additions": 32,
                    "file_deletions": 1,
                    "file_exists": false,
                    "file_name": "spring-boot-tools/spring-boot-configuration-processor/src/main/java/org/springframework/boot/configurationprocessor/TypeElementMembers.java",
                    "file_size": 0
                },
                {
                    "file_additions": 12,
                    "file_deletions": 0,
                    "file_exists": false,
                    "file_name": "spring-boot-tools/spring-boot-configuration-processor/src/test/java/org/springframework/boot/configurationprocessor/ConfigurationMetadataAnnotationProcessorTests.java",
                    "file_size": 0
                },
                {
                    "file_additions": 54,
                    "file_deletions": 0,
                    "file_exists": false,
                    "file_name": "spring-boot-tools/spring-boot-configuration-processor/src/test/java/org/springframework/boot/configurationsample/simple/ClassWithNestedProperties.java",
                    "file_size": 0
                }
            ],
            "interesting": {
                "reopened": false,
                "status": true
            },
            "sha": "6ac0ae822b366d0095508f45255e894766fcb957"
        },
        {
            "diff": "spring-projects_spring-boot/issue_5434/commit_b3220985bb8f639f4d5eaf0793c22deff222fbd8.diff",
            "diff_additions": 100,
            "diff_deletions": 13,
            "diff_file_size": 0,
            "files": [
                {
                    "file_additions": 2,
                    "file_deletions": 12,
                    "file_exists": false,
                    "file_name": "spring-boot-tools/spring-boot-configuration-processor/src/main/java/org/springframework/boot/configurationprocessor/ConfigurationMetadataAnnotationProcessor.java",
                    "file_size": 0
                },
                {
                    "file_additions": 32,
                    "file_deletions": 1,
                    "file_exists": false,
                    "file_name": "spring-boot-tools/spring-boot-configuration-processor/src/main/java/org/springframework/boot/configurationprocessor/TypeElementMembers.java",
                    "file_size": 0
                },
                {
                    "file_additions": 12,
                    "file_deletions": 0,
                    "file_exists": false,
                    "file_name": "spring-boot-tools/spring-boot-configuration-processor/src/test/java/org/springframework/boot/configurationprocessor/ConfigurationMetadataAnnotationProcessorTests.java",
                    "file_size": 0
                },
                {
                    "file_additions": 54,
                    "file_deletions": 0,
                    "file_exists": false,
                    "file_name": "spring-boot-tools/spring-boot-configuration-processor/src/test/java/org/springframework/boot/configurationsample/simple/ClassWithNestedProperties.java",
                    "file_size": 0
                }
            ],
            "interesting": {
                "reopened": false,
                "status": false
            },
            "sha": "b3220985bb8f639f4d5eaf0793c22deff222fbd8"
        },
        {
            "diff": "spring-projects_spring-boot/issue_5434/commit_06b2f1250990782e5ea2592ed08bb01ad63372cf.diff",
            "diff_additions": 94,
            "diff_deletions": 13,
            "diff_file_size": 0,
            "files": [
                {
                    "file_additions": 3,
                    "file_deletions": 12,
                    "file_exists": false,
                    "file_name": "spring-boot-tools/spring-boot-configuration-processor/src/main/java/org/springframework/boot/configurationprocessor/ConfigurationMetadataAnnotationProcessor.java",
                    "file_size": 0
                },
                {
                    "file_additions": 25,
                    "file_deletions": 1,
                    "file_exists": false,
                    "file_name": "spring-boot-tools/spring-boot-configuration-processor/src/main/java/org/springframework/boot/configurationprocessor/TypeElementMembers.java",
                    "file_size": 0
                },
                {
                    "file_additions": 12,
                    "file_deletions": 0,
                    "file_exists": false,
                    "file_name": "spring-boot-tools/spring-boot-configuration-processor/src/test/java/org/springframework/boot/configurationprocessor/ConfigurationMetadataAnnotationProcessorTests.java",
                    "file_size": 0
                },
                {
                    "file_additions": 54,
                    "file_deletions": 0,
                    "file_exists": false,
                    "file_name": "spring-boot-tools/spring-boot-configuration-processor/src/test/java/org/springframework/boot/configurationsample/simple/ClassWithNestedProperties.java",
                    "file_size": 0
                }
            ],
            "interesting": {
                "reopened": false,
                "status": false
            },
            "sha": "06b2f1250990782e5ea2592ed08bb01ad63372cf"
        }
    ],
    "first_commit": "2016-11-25 11:18:58",
    "last_commit": "2016-11-29 14:22:05",
    "number": 5434,
    "score": 288.012012012012
}