{
    "category": [
        "memory",
        "control flow"
    ],
    "commits": [
        {
            "associated_pull_request": [],
            "date": "2018-02-21 00:45:14",
            "diff": "openssl_openssl/issue_5405/commit_3da143b83074bab8ef0b847d63945c72f62e3e0e.diff",
            "diff_additions": 8,
            "diff_deletions": 0,
            "diff_file_size": 16127,
            "diff_url": "https://github.com/openssl/openssl/commit/3da143b83074bab8ef0b847d63945c72f62e3e0e.diff",
            "exists": true,
            "files": [
                {
                    "file_additions": 8,
                    "file_deletions": 0,
                    "file_exists": true,
                    "file_name": "crypto/evp/bio_b64.c",
                    "file_size": 16127
                }
            ],
            "interesting": {
                "reopen": false,
                "status": false
            },
            "is_parent": false,
            "sha": "3da143b83074bab8ef0b847d63945c72f62e3e0e"
        },
        {
            "associated_pull_request": [],
            "date": "2018-02-21 00:45:14",
            "diff": "openssl_openssl/issue_5405/commit_d070b4ae78a1280c5cb6b88df75bcbfbcef6a8f1.diff",
            "diff_additions": 8,
            "diff_deletions": 0,
            "diff_file_size": 16127,
            "diff_url": "https://github.com/openssl/openssl/commit/d070b4ae78a1280c5cb6b88df75bcbfbcef6a8f1.diff",
            "exists": true,
            "files": [
                {
                    "file_additions": 8,
                    "file_deletions": 0,
                    "file_exists": true,
                    "file_name": "crypto/evp/bio_b64.c",
                    "file_size": 16127
                }
            ],
            "interesting": {
                "reopen": false,
                "status": true
            },
            "is_parent": false,
            "sha": "d070b4ae78a1280c5cb6b88df75bcbfbcef6a8f1"
        },
        {
            "associated_pull_request": [],
            "date": "2018-02-21 00:45:14",
            "diff": "openssl_openssl/issue_5405/commit_b3f9b401ab6284e6bbde59dde06736f681f70a9d.diff",
            "diff_additions": 8,
            "diff_deletions": 0,
            "diff_file_size": 16127,
            "diff_url": "https://github.com/openssl/openssl/commit/b3f9b401ab6284e6bbde59dde06736f681f70a9d.diff",
            "exists": true,
            "files": [
                {
                    "file_additions": 8,
                    "file_deletions": 0,
                    "file_exists": true,
                    "file_name": "crypto/evp/bio_b64.c",
                    "file_size": 16127
                }
            ],
            "interesting": {
                "reopen": false,
                "status": false
            },
            "is_parent": false,
            "sha": "b3f9b401ab6284e6bbde59dde06736f681f70a9d"
        }
    ],
    "first_commit": "2018-02-21 22:31:36",
    "last_commit": "2018-02-26 18:39:43",
    "number": 5405,
    "pull_request": "None",
    "score": {
        "accidental_reopen_likely": false,
        "all_labels": [],
        "contains_keywords": [
            "report",
            "chang",
            "reason",
            "error",
            "bug",
            "problem",
            "test",
            "fix",
            "patch",
            "remov",
            "issu",
            "work",
            "CI",
            "fault",
            "debug"
        ],
        "fix_size": 17,
        "has_labels": [],
        "intersecting": {
            "computed_score": 0.1111111111111111,
            "final_commit_size": 9,
            "intersection_size": 1,
            "previous_commits_size": 9
        },
        "is_makefile_based": false,
        "no_new_files": [],
        "no_other_files": true,
        "num_prohibited_files": 102460,
        "prohibited_files": [
            "hal/inc/pinmap_hal.h",
            "Debug/marvin.bin",
            "Debug/marvin.elf",
            "Debug/marvin.hex",
            "Debug/marvin.bin",
            "Debug/marvin.elf",
            "Debug/marvin.hex",
            "inc/spark_utilities.h",
            "Debug/marvin.bin",
            "Debug/marvin.elf"
        ],
        "reopen": false,
        "reopen_events": [
            [
                "2018-02-21 00:51:10",
                "commit"
            ],
            [
                "2018-02-21 06:35:56",
                "commit"
            ],
            [
                "2018-02-21 09:46:47",
                "closed"
            ],
            [
                "2018-02-21 12:23:49",
                "commit"
            ],
            [
                "2018-02-21 22:53:24",
                "commit"
            ],
            [
                "2018-02-27 17:40:16",
                "commit"
            ],
            [
                "2018-02-27 17:40:22",
                "commit"
            ],
            [
                "2018-02-27 17:40:42",
                "commit"
            ]
        ],
        "status": true,
        "strategy": true,
        "total_changes": 24
    }
}