{
    "covered_issues": [
        164,
        162,
        156,
        154,
        144,
        143,
        141,
        138,
        135,
        134,
        132,
        131,
        130,
        127,
        122,
        115,
        109,
        107,
        106,
        101,
        95,
        94,
        93,
        91,
        90,
        88,
        86,
        79,
        75,
        73,
        69,
        59,
        54,
        53,
        51,
        50,
        49,
        48,
        47,
        46,
        45,
        44,
        38,
        37,
        36,
        35,
        34,
        33,
        32,
        31,
        30,
        29,
        28,
        27,
        26,
        25,
        24,
        23,
        22,
        21,
        20,
        19,
        18,
        17,
        16,
        15,
        14,
        13,
        12,
        11,
        10,
        9,
        8,
        7,
        6,
        5,
        4,
        3,
        2,
        1
    ],
    "finished": true
}