{
    "commits": [
        {
            "associated_pull_request": [],
            "date": "2017-12-16 09:15:01+00:00",
            "diff": "",
            "diff_additions": 0,
            "diff_deletions": 0,
            "diff_file_size": 0,
            "diff_url": "https://github.com/FluidSynth/fluidsynth/commit/07a167c737c6f1d3be4e2de000547b502bd02da0.diff",
            "exists": true,
            "files": [],
            "interesting": {
                "reopen": false,
                "status": false
            },
            "is_parent": true,
            "sha": "07a167c737c6f1d3be4e2de000547b502bd02da0"
        },
        {
            "associated_pull_request": [],
            "date": "2017-12-16 14:08:47+00:00",
            "diff": "fluidsynth_fluidsynth/issue_150/commit_4568e551b93c5c7fc90992a7edd5b8ce932c5b94.diff",
            "diff_additions": 25,
            "diff_deletions": 7,
            "diff_file_size": 76674,
            "diff_url": "https://github.com/FluidSynth/fluidsynth/commit/4568e551b93c5c7fc90992a7edd5b8ce932c5b94.diff",
            "exists": true,
            "files": [
                {
                    "file_additions": 25,
                    "file_deletions": 7,
                    "file_exists": true,
                    "file_name": "src/midi/fluid_midi.c",
                    "file_size": 76674
                }
            ],
            "interesting": {
                "reopen": false,
                "status": false
            },
            "is_parent": false,
            "sha": "4568e551b93c5c7fc90992a7edd5b8ce932c5b94"
        },
        {
            "associated_pull_request": [],
            "date": "2017-12-16 14:08:47+00:00",
            "diff": "fluidsynth_fluidsynth/issue_150/commit_521b9053a0ccad331f4cca8a2f27ef3c2a29a50d.diff",
            "diff_additions": 26,
            "diff_deletions": 9,
            "diff_file_size": 76674,
            "diff_url": "https://github.com/FluidSynth/fluidsynth/commit/521b9053a0ccad331f4cca8a2f27ef3c2a29a50d.diff",
            "exists": true,
            "files": [
                {
                    "file_additions": 26,
                    "file_deletions": 9,
                    "file_exists": true,
                    "file_name": "src/midi/fluid_midi.c",
                    "file_size": 76674
                }
            ],
            "interesting": {
                "reopen": true,
                "status": false
            },
            "is_parent": false,
            "sha": "521b9053a0ccad331f4cca8a2f27ef3c2a29a50d"
        },
        {
            "associated_pull_request": [],
            "date": "2017-12-21 13:52:06+00:00",
            "diff": "fluidsynth_fluidsynth/issue_150/commit_5f45c6d97b241ed250272e4a523d19dbc2bac414.diff",
            "diff_additions": 7,
            "diff_deletions": 25,
            "diff_file_size": 76674,
            "diff_url": "https://github.com/FluidSynth/fluidsynth/commit/5f45c6d97b241ed250272e4a523d19dbc2bac414.diff",
            "exists": true,
            "files": [
                {
                    "file_additions": 7,
                    "file_deletions": 25,
                    "file_exists": true,
                    "file_name": "src/midi/fluid_midi.c",
                    "file_size": 76674
                }
            ],
            "interesting": {
                "reopen": false,
                "status": false
            },
            "is_parent": false,
            "sha": "5f45c6d97b241ed250272e4a523d19dbc2bac414"
        }
    ],
    "first_commit": "2017-12-16 09:16:04+00:00",
    "last_commit": "2017-12-21 13:52:06+00:00",
    "number": 150,
    "pull_request": "None",
    "score": {
        "accidental_reopen_likely": false,
        "all_labels": [
            "sourceforge",
            "auto-migrated"
        ],
        "contains_keywords": [
            "work",
            "chang",
            "fix",
            "issu",
            "patch",
            "perform",
            "reason",
            "remov",
            "problem"
        ],
        "fix_size": 59,
        "has_labels": [],
        "intersecting": {
            "computed_score": 1.0,
            "final_commit_size": 30,
            "intersection_size": 30,
            "previous_commits_size": 59
        },
        "is_makefile_based": true,
        "no_new_files": [],
        "no_other_files": false,
        "num_prohibited_files": 144342,
        "prohibited_files": [
            "server/src/main/java/com/genymobile/scrcpy/Device.java",
            "server/src/main/java/com/genymobile/scrcpy/wrappers/SurfaceControl.java",
            "server/src/main/java/com/genymobile/scrcpy/Device.java",
            "server/src/main/java/com/genymobile/scrcpy/wrappers/SurfaceControl.java",
            "app/meson.build",
            "app/scrcpy.1",
            "app/src/common.h",
            "app/src/scrcpy.h",
            "app/src/server.h",
            "server/src/main/java/com/genymobile/scrcpy/Workarounds.java"
        ],
        "reopen": true,
        "reopen_events": [
            [
                "2017-12-16 14:10:23+00:00",
                "commit"
            ],
            [
                "2017-12-16 14:18:27+00:00",
                "commit"
            ],
            [
                "2017-12-17 09:30:15+00:00",
                "closed"
            ],
            [
                "2017-12-17 16:44:30+00:00",
                "reopened"
            ],
            [
                "2017-12-21 14:03:20+00:00",
                "closed"
            ],
            [
                "2017-12-21 14:03:20+00:00",
                "commit"
            ]
        ],
        "status": false,
        "strategy": true,
        "total_changes": 99
    }
}