{
    "covered_issues": [
        143,
        139,
        134,
        113,
        98,
        94,
        85,
        80,
        72,
        70,
        68,
        67,
        66,
        63,
        61,
        59,
        54,
        53,
        52,
        40,
        37,
        36,
        33,
        31,
        27,
        26,
        20,
        19,
        18,
        16,
        15,
        14,
        13,
        12,
        10,
        9,
        7,
        6,
        5,
        2,
        1
    ],
    "finished": true
}