{
    "commits": [
        {
            "associated_pull_request": [],
            "date": "2021-08-03 05:44:38+00:00",
            "diff": "",
            "diff_additions": 0,
            "diff_deletions": 0,
            "diff_file_size": 0,
            "diff_url": "https://github.com/libsdl-org/SDL/commit/7edc7d53926003f7c6dd8cd4f152a5ada3bf41be.diff",
            "exists": true,
            "files": [],
            "interesting": {
                "reopen": false,
                "status": false
            },
            "is_parent": true,
            "sha": "7edc7d53926003f7c6dd8cd4f152a5ada3bf41be"
        },
        {
            "associated_pull_request": [],
            "date": "2021-08-03 06:07:47+00:00",
            "diff": "libsdl-org_sdl/issue_4210/commit_0e16ee833060660318cc324cf99c9736f4d48499.diff",
            "diff_additions": 3,
            "diff_deletions": 2,
            "diff_file_size": 61541,
            "diff_url": "https://github.com/libsdl-org/SDL/commit/0e16ee833060660318cc324cf99c9736f4d48499.diff",
            "exists": true,
            "files": [
                {
                    "file_additions": 3,
                    "file_deletions": 2,
                    "file_exists": true,
                    "file_name": "src/render/direct3d/SDL_render_d3d.c",
                    "file_size": 61541
                }
            ],
            "interesting": {
                "reopen": true,
                "status": false
            },
            "is_parent": false,
            "sha": "0e16ee833060660318cc324cf99c9736f4d48499"
        },
        {
            "associated_pull_request": [],
            "date": "2021-08-04 11:00:17+00:00",
            "diff": "libsdl-org_sdl/issue_4210/commit_5fc13fcb2168a06c6623cf8dd237778cfb17f179.diff",
            "diff_additions": 3,
            "diff_deletions": 2,
            "diff_file_size": 61541,
            "diff_url": "https://github.com/libsdl-org/SDL/commit/5fc13fcb2168a06c6623cf8dd237778cfb17f179.diff",
            "exists": true,
            "files": [
                {
                    "file_additions": 3,
                    "file_deletions": 2,
                    "file_exists": true,
                    "file_name": "src/render/direct3d/SDL_render_d3d.c",
                    "file_size": 61541
                }
            ],
            "interesting": {
                "reopen": false,
                "status": false
            },
            "is_parent": false,
            "sha": "5fc13fcb2168a06c6623cf8dd237778cfb17f179"
        }
    ],
    "first_commit": "2021-08-03 05:45:07+00:00",
    "last_commit": "2021-08-04 11:00:17+00:00",
    "number": 4210,
    "pull_request": "None",
    "score": {
        "accidental_reopen_likely": false,
        "all_labels": [],
        "contains_keywords": [
            "confirm",
            "work",
            "chang",
            "fix",
            "issu",
            "test",
            "attempt",
            "bug",
            "problem"
        ],
        "fix_size": 6,
        "has_labels": [],
        "intersecting": {
            "computed_score": 1.0,
            "final_commit_size": 6,
            "intersection_size": 6,
            "previous_commits_size": 6
        },
        "is_makefile_based": true,
        "no_new_files": [],
        "no_other_files": true,
        "num_prohibited_files": 40750,
        "prohibited_files": [
            "server/src/main/java/com/genymobile/scrcpy/Device.java",
            "server/src/main/java/com/genymobile/scrcpy/wrappers/SurfaceControl.java",
            "server/src/main/java/com/genymobile/scrcpy/Device.java",
            "server/src/main/java/com/genymobile/scrcpy/wrappers/SurfaceControl.java",
            "app/meson.build",
            "app/scrcpy.1",
            "app/src/common.h",
            "app/src/scrcpy.h",
            "app/src/server.h",
            "server/src/main/java/com/genymobile/scrcpy/Workarounds.java"
        ],
        "reopen": true,
        "reopen_events": [
            [
                "2021-08-03 06:33:22+00:00",
                "closed"
            ],
            [
                "2021-08-03 06:33:22+00:00",
                "commit"
            ],
            [
                "2021-08-03 07:31:52+00:00",
                "reopened"
            ],
            [
                "2021-08-04 07:06:10+00:00",
                "closed"
            ],
            [
                "2021-08-04 07:06:10+00:00",
                "commit"
            ]
        ],
        "status": false,
        "strategy": true,
        "total_changes": 10
    }
}