{
    "commits": [
        {
            "associated_pull_request": [],
            "date": "2018-05-23 12:08:33+00:00",
            "diff": "samtools_bcftools/issue_801/commit_44f0d3cbf11c03853f90bd0592bcbb8a7e644ba9.diff",
            "diff_additions": 1,
            "diff_deletions": 1,
            "diff_file_size": 149512,
            "diff_url": "https://github.com/samtools/bcftools/commit/44f0d3cbf11c03853f90bd0592bcbb8a7e644ba9.diff",
            "exists": true,
            "files": [
                {
                    "file_additions": 1,
                    "file_deletions": 1,
                    "file_exists": true,
                    "file_name": "filter.c",
                    "file_size": 149512
                }
            ],
            "interesting": {
                "reopen": false,
                "status": false
            },
            "is_parent": true,
            "sha": "44f0d3cbf11c03853f90bd0592bcbb8a7e644ba9"
        },
        {
            "associated_pull_request": [],
            "date": "2018-05-23 12:41:14+00:00",
            "diff": "samtools_bcftools/issue_801/commit_b0376dff1ed70603c9490802f37883b9009215d2.diff",
            "diff_additions": 52,
            "diff_deletions": 48,
            "diff_file_size": 997603,
            "diff_url": "https://github.com/samtools/bcftools/commit/b0376dff1ed70603c9490802f37883b9009215d2.diff",
            "exists": true,
            "files": [
                {
                    "file_additions": 1,
                    "file_deletions": 1,
                    "file_exists": true,
                    "file_name": "bin.c",
                    "file_size": 3469
                },
                {
                    "file_additions": 1,
                    "file_deletions": 1,
                    "file_exists": true,
                    "file_name": "consensus.c",
                    "file_size": 50871
                },
                {
                    "file_additions": 3,
                    "file_deletions": 2,
                    "file_exists": true,
                    "file_name": "convert.c",
                    "file_size": 68481
                },
                {
                    "file_additions": 2,
                    "file_deletions": 2,
                    "file_exists": true,
                    "file_name": "csq.c",
                    "file_size": 145035
                },
                {
                    "file_additions": 1,
                    "file_deletions": 1,
                    "file_exists": true,
                    "file_name": "mpileup.c",
                    "file_size": 75382
                },
                {
                    "file_additions": 1,
                    "file_deletions": 1,
                    "file_exists": true,
                    "file_name": "plugins/check-sparsity.c",
                    "file_size": 9538
                },
                {
                    "file_additions": 1,
                    "file_deletions": 1,
                    "file_exists": true,
                    "file_name": "plugins/color-chrs.c",
                    "file_size": 20452
                },
                {
                    "file_additions": 2,
                    "file_deletions": 2,
                    "file_exists": true,
                    "file_name": "plugins/contrast.c",
                    "file_size": 24626
                },
                {
                    "file_additions": 1,
                    "file_deletions": 1,
                    "file_exists": true,
                    "file_name": "plugins/fill-tags.c",
                    "file_size": 43728
                },
                {
                    "file_additions": 1,
                    "file_deletions": 1,
                    "file_exists": true,
                    "file_name": "plugins/fixref.c",
                    "file_size": 23987
                },
                {
                    "file_additions": 2,
                    "file_deletions": 2,
                    "file_exists": true,
                    "file_name": "plugins/guess-ploidy.c",
                    "file_size": 23076
                },
                {
                    "file_additions": 1,
                    "file_deletions": 1,
                    "file_exists": true,
                    "file_name": "plugins/isecGT.c",
                    "file_size": 8679
                },
                {
                    "file_additions": 2,
                    "file_deletions": 2,
                    "file_exists": false,
                    "file_name": "plugins/mendelian.c",
                    "file_size": 0
                },
                {
                    "file_additions": 2,
                    "file_deletions": 2,
                    "file_exists": true,
                    "file_name": "plugins/prune.c",
                    "file_size": 21437
                },
                {
                    "file_additions": 2,
                    "file_deletions": 2,
                    "file_exists": true,
                    "file_name": "plugins/split.c",
                    "file_size": 29935
                },
                {
                    "file_additions": 2,
                    "file_deletions": 2,
                    "file_exists": true,
                    "file_name": "plugins/trio-stats.c",
                    "file_size": 32221
                },
                {
                    "file_additions": 4,
                    "file_deletions": 3,
                    "file_exists": true,
                    "file_name": "reheader.c",
                    "file_size": 27479
                },
                {
                    "file_additions": 8,
                    "file_deletions": 8,
                    "file_exists": true,
                    "file_name": "vcfannotate.c",
                    "file_size": 157964
                },
                {
                    "file_additions": 6,
                    "file_deletions": 5,
                    "file_exists": true,
                    "file_name": "vcfconcat.c",
                    "file_size": 51368
                },
                {
                    "file_additions": 1,
                    "file_deletions": 1,
                    "file_exists": true,
                    "file_name": "vcfquery.c",
                    "file_size": 19212
                },
                {
                    "file_additions": 5,
                    "file_deletions": 4,
                    "file_exists": true,
                    "file_name": "vcfroh.c",
                    "file_size": 51129
                },
                {
                    "file_additions": 2,
                    "file_deletions": 2,
                    "file_exists": true,
                    "file_name": "vcfsom.c",
                    "file_size": 24463
                },
                {
                    "file_additions": 1,
                    "file_deletions": 1,
                    "file_exists": true,
                    "file_name": "vcfstats.c",
                    "file_size": 85071
                }
            ],
            "interesting": {
                "reopen": true,
                "status": false
            },
            "is_parent": false,
            "sha": "b0376dff1ed70603c9490802f37883b9009215d2"
        },
        {
            "associated_pull_request": [],
            "date": "2018-07-18 04:17:06+00:00",
            "diff": "samtools_bcftools/issue_801/commit_b8e13167f0c68ee0edd7eda04c6dd3234472e445.diff",
            "diff_additions": 1,
            "diff_deletions": 1,
            "diff_file_size": 3469,
            "diff_url": "https://github.com/samtools/bcftools/commit/b8e13167f0c68ee0edd7eda04c6dd3234472e445.diff",
            "exists": true,
            "files": [
                {
                    "file_additions": 1,
                    "file_deletions": 1,
                    "file_exists": true,
                    "file_name": "bin.c",
                    "file_size": 3469
                }
            ],
            "interesting": {
                "reopen": false,
                "status": false
            },
            "is_parent": false,
            "sha": "b8e13167f0c68ee0edd7eda04c6dd3234472e445"
        }
    ],
    "first_commit": "2018-05-23 12:08:33+00:00",
    "last_commit": "2018-07-18 04:17:06+00:00",
    "number": 801,
    "pull_request": "None",
    "score": {
        "accidental_reopen_likely": false,
        "all_labels": [],
        "contains_keywords": [
            "fail",
            "fix",
            "warn",
            "error",
            "problem",
            "report"
        ],
        "fix_size": 89,
        "has_labels": [],
        "intersecting": {
            "computed_score": 0.5,
            "final_commit_size": 2,
            "intersection_size": 1,
            "previous_commits_size": 88
        },
        "is_makefile_based": true,
        "no_new_files": [],
        "no_other_files": false,
        "num_prohibited_files": 197435,
        "prohibited_files": [
            "server/src/main/java/com/genymobile/scrcpy/Device.java",
            "server/src/main/java/com/genymobile/scrcpy/wrappers/SurfaceControl.java",
            "server/src/main/java/com/genymobile/scrcpy/Device.java",
            "server/src/main/java/com/genymobile/scrcpy/wrappers/SurfaceControl.java",
            "app/meson.build",
            "app/scrcpy.1",
            "app/src/common.h",
            "app/src/scrcpy.h",
            "app/src/server.h",
            "server/src/main/java/com/genymobile/scrcpy/Workarounds.java"
        ],
        "reopen": true,
        "reopen_events": [
            [
                "2018-05-23 12:41:56+00:00",
                "closed"
            ],
            [
                "2018-05-23 12:41:56+00:00",
                "commit"
            ],
            [
                "2018-07-17 18:08:56+00:00",
                "reopened"
            ],
            [
                "2018-07-18 04:18:13+00:00",
                "closed"
            ],
            [
                "2018-07-18 04:18:13+00:00",
                "commit"
            ]
        ],
        "status": false,
        "strategy": true,
        "total_changes": 104
    }
}