{
    "covered_issues": [
        662,
        658,
        657,
        651,
        650,
        647,
        634,
        632,
        630,
        629,
        628,
        624,
        623,
        622,
        620,
        619,
        617,
        616,
        615,
        612,
        610,
        606,
        594,
        583,
        582,
        580,
        579,
        578,
        577,
        576,
        574,
        573,
        572,
        571,
        569,
        566,
        565,
        562,
        559,
        558,
        557,
        556,
        553,
        550,
        549,
        542,
        541,
        539,
        538,
        537,
        536,
        530,
        527,
        524,
        514,
        506,
        493,
        489,
        488,
        487,
        486,
        485,
        484,
        483,
        480,
        479,
        477,
        476,
        474,
        472,
        470,
        469,
        466,
        461,
        455,
        451,
        450,
        432,
        430,
        429,
        427,
        424,
        423,
        422,
        421,
        420,
        419,
        418,
        417,
        415,
        414,
        413,
        412,
        411,
        410,
        409,
        408,
        407,
        406,
        405,
        404,
        402,
        401,
        398,
        396,
        395,
        393,
        385,
        381,
        380,
        374,
        372,
        371,
        368,
        365,
        364,
        362,
        359,
        357,
        356,
        353,
        351,
        348,
        346,
        333,
        329,
        325,
        320,
        317,
        316,
        313,
        305,
        302,
        299,
        296,
        290,
        279,
        278,
        275,
        273,
        271,
        270,
        269,
        262,
        257,
        255,
        254,
        253,
        252,
        251,
        250,
        249,
        248,
        246,
        245,
        244,
        243,
        242,
        241,
        240,
        239,
        237,
        235,
        232,
        227,
        225,
        223,
        217,
        211,
        210,
        206,
        203,
        201,
        200,
        199,
        198,
        197,
        196,
        195,
        193,
        192,
        191,
        190,
        189,
        185,
        184,
        183,
        182,
        181,
        180,
        178,
        177,
        176,
        173,
        172,
        171,
        169,
        168,
        167,
        164,
        160,
        159,
        157,
        154,
        153,
        147,
        146,
        145,
        144,
        140,
        136,
        132,
        131,
        130,
        129,
        128,
        127,
        126,
        125,
        124,
        123,
        121,
        120,
        118,
        117,
        115,
        113,
        110,
        108,
        106,
        105,
        104,
        103,
        99,
        96,
        93,
        90,
        87,
        86,
        85,
        84,
        83,
        82,
        81,
        80,
        79,
        78,
        76,
        75,
        74,
        71,
        70,
        69,
        68,
        67,
        66,
        65,
        64,
        62,
        61,
        59,
        55,
        54,
        53,
        52,
        51,
        50,
        49,
        48,
        47,
        45,
        44,
        43,
        42,
        41,
        40,
        39,
        38,
        35,
        33,
        30,
        28,
        26,
        24,
        23,
        21,
        19,
        18,
        17,
        16,
        11,
        8,
        6,
        5,
        4,
        2,
        1
    ],
    "finished": true
}