{
    "category": [
        "GUI",
        "network/protocol"
    ],
    "commits": [
        {
            "associated_pull_request": [],
            "date": "2015-11-30 00:26:18",
            "diff": "openzfsonosx_zfs/issue_436/commit_507ab014d0fcbe9928b7294b7692c73ad64cf290.diff",
            "diff_additions": 3,
            "diff_deletions": 0,
            "diff_file_size": 33777,
            "diff_url": "https://github.com/openzfsonosx/zfs/commit/507ab014d0fcbe9928b7294b7692c73ad64cf290.diff",
            "exists": true,
            "files": [
                {
                    "file_additions": 3,
                    "file_deletions": 0,
                    "file_exists": true,
                    "file_name": "lib/libspl/crypto/sha2/sha2.c",
                    "file_size": 33777
                }
            ],
            "interesting": {
                "reopen": false,
                "status": false
            },
            "is_parent": true,
            "sha": "507ab014d0fcbe9928b7294b7692c73ad64cf290"
        },
        {
            "associated_pull_request": [],
            "date": "2015-12-04 22:59:27",
            "diff": "openzfsonosx_zfs/issue_436/commit_08e4cbc5938f7e14a7be458c760da3306da93c0e.diff",
            "diff_additions": 1,
            "diff_deletions": 0,
            "diff_file_size": 96446,
            "diff_url": "https://github.com/openzfsonosx/zfs/commit/08e4cbc5938f7e14a7be458c760da3306da93c0e.diff",
            "exists": true,
            "files": [
                {
                    "file_additions": 1,
                    "file_deletions": 0,
                    "file_exists": true,
                    "file_name": "module/zfs/zfs_vfsops.c",
                    "file_size": 96446
                }
            ],
            "interesting": {
                "reopen": false,
                "status": false
            },
            "is_parent": false,
            "sha": "08e4cbc5938f7e14a7be458c760da3306da93c0e"
        },
        {
            "associated_pull_request": [],
            "date": "2015-12-04 22:59:27",
            "diff": "openzfsonosx_zfs/issue_436/commit_c0145f974c0fbefa2a4e0b16f5dda8434cafb9b0.diff",
            "diff_additions": 1,
            "diff_deletions": 0,
            "diff_file_size": 96446,
            "diff_url": "https://github.com/openzfsonosx/zfs/commit/c0145f974c0fbefa2a4e0b16f5dda8434cafb9b0.diff",
            "exists": true,
            "files": [
                {
                    "file_additions": 1,
                    "file_deletions": 0,
                    "file_exists": true,
                    "file_name": "module/zfs/zfs_vfsops.c",
                    "file_size": 96446
                }
            ],
            "interesting": {
                "reopen": true,
                "status": false
            },
            "is_parent": false,
            "sha": "c0145f974c0fbefa2a4e0b16f5dda8434cafb9b0"
        },
        {
            "associated_pull_request": [],
            "date": "2015-12-04 22:59:27",
            "diff": "openzfsonosx_zfs/issue_436/commit_d072e2743f0d799c3fa812201f0734b97595abd7.diff",
            "diff_additions": 1,
            "diff_deletions": 5,
            "diff_file_size": 96446,
            "diff_url": "https://github.com/openzfsonosx/zfs/commit/d072e2743f0d799c3fa812201f0734b97595abd7.diff",
            "exists": true,
            "files": [
                {
                    "file_additions": 1,
                    "file_deletions": 5,
                    "file_exists": true,
                    "file_name": "module/zfs/zfs_vfsops.c",
                    "file_size": 96446
                }
            ],
            "interesting": {
                "reopen": false,
                "status": false
            },
            "is_parent": false,
            "sha": "d072e2743f0d799c3fa812201f0734b97595abd7"
        },
        {
            "associated_pull_request": [],
            "date": "2015-12-04 22:59:27",
            "diff": "openzfsonosx_zfs/issue_436/commit_fec2339b7e93186728cfcdfc110593431ae6b22c.diff",
            "diff_additions": 1,
            "diff_deletions": 5,
            "diff_file_size": 96446,
            "diff_url": "https://github.com/openzfsonosx/zfs/commit/fec2339b7e93186728cfcdfc110593431ae6b22c.diff",
            "exists": true,
            "files": [
                {
                    "file_additions": 1,
                    "file_deletions": 5,
                    "file_exists": true,
                    "file_name": "module/zfs/zfs_vfsops.c",
                    "file_size": 96446
                }
            ],
            "interesting": {
                "reopen": false,
                "status": false
            },
            "is_parent": false,
            "sha": "fec2339b7e93186728cfcdfc110593431ae6b22c"
        }
    ],
    "first_commit": "2015-11-30 00:26:18",
    "last_commit": "2017-01-24 11:31:29",
    "number": 436,
    "pull_request": "None",
    "score": {
        "accidental_reopen_likely": false,
        "all_labels": [
            "bug"
        ],
        "contains_keywords": [
            "report",
            "chang",
            "problem",
            "fix",
            "remov",
            "issu",
            "work"
        ],
        "fix_size": 8,
        "has_labels": [
            "bug"
        ],
        "intersecting": {
            "computed_score": 1.0,
            "final_commit_size": 6,
            "intersection_size": 6,
            "previous_commits_size": 8
        },
        "is_makefile_based": true,
        "no_new_files": [],
        "no_other_files": false,
        "num_prohibited_files": 109780,
        "prohibited_files": [
            "hal/inc/pinmap_hal.h",
            "Debug/marvin.bin",
            "Debug/marvin.elf",
            "Debug/marvin.hex",
            "Debug/marvin.bin",
            "Debug/marvin.elf",
            "Debug/marvin.hex",
            "inc/spark_utilities.h",
            "Debug/marvin.bin",
            "Debug/marvin.elf"
        ],
        "reopen": true,
        "reopen_events": [
            [
                "2015-12-04 23:00:52",
                "commit"
            ],
            [
                "2015-12-05 10:08:43",
                "commit"
            ],
            [
                "2015-12-07 05:39:34",
                "closed"
            ],
            [
                "2015-12-10 05:51:15",
                "reopened"
            ],
            [
                "2016-02-22 00:16:32",
                "closed"
            ],
            [
                "2017-01-23 05:29:22",
                "commit"
            ],
            [
                "2017-01-24 11:32:33",
                "commit"
            ]
        ],
        "status": false,
        "strategy": true,
        "total_changes": 17
    }
}