{
    "category": [
        "build/refactor/preprocessing",
        "wrong API usage"
    ],
    "commits": [
        {
            "associated_pull_request": [],
            "date": "2020-06-22 13:43:26",
            "diff": "gluster_glusterfs/issue_1324/commit_9f0beedd556daabd2ef48e05ead3fdab68598d2a.diff",
            "diff_additions": 22,
            "diff_deletions": 17,
            "diff_file_size": 233024,
            "diff_url": "https://github.com/gluster/glusterfs/commit/9f0beedd556daabd2ef48e05ead3fdab68598d2a.diff",
            "exists": true,
            "files": [
                {
                    "file_additions": 20,
                    "file_deletions": 0,
                    "file_exists": true,
                    "file_name": "libglusterfs/src/common-utils.c",
                    "file_size": 132960
                },
                {
                    "file_additions": 2,
                    "file_deletions": 17,
                    "file_exists": true,
                    "file_name": "xlators/storage/posix/src/posix-helpers.c",
                    "file_size": 100064
                }
            ],
            "interesting": {
                "reopen": false,
                "status": false
            },
            "is_parent": true,
            "sha": "9f0beedd556daabd2ef48e05ead3fdab68598d2a"
        },
        {
            "associated_pull_request": [],
            "date": "2020-06-21 11:38:56",
            "diff": "gluster_glusterfs/issue_1324/commit_620158475f462251c996901a8e24306ef6cb4c42.diff",
            "diff_additions": 63,
            "diff_deletions": 0,
            "diff_file_size": 79642,
            "diff_url": "https://github.com/gluster/glusterfs/commit/620158475f462251c996901a8e24306ef6cb4c42.diff",
            "exists": true,
            "files": [
                {
                    "file_additions": 63,
                    "file_deletions": 0,
                    "file_exists": true,
                    "file_name": "xlators/cluster/dht/src/dht-selfheal.c",
                    "file_size": 79642
                }
            ],
            "interesting": {
                "reopen": true,
                "status": false
            },
            "is_parent": false,
            "sha": "620158475f462251c996901a8e24306ef6cb4c42"
        },
        {
            "associated_pull_request": [],
            "date": "2020-06-25 09:51:04",
            "diff": "gluster_glusterfs/issue_1324/commit_cff7804a0604b1b2ab2d91920af163bd95653ae7.diff",
            "diff_additions": 0,
            "diff_deletions": 63,
            "diff_file_size": 79642,
            "diff_url": "https://github.com/gluster/glusterfs/commit/cff7804a0604b1b2ab2d91920af163bd95653ae7.diff",
            "exists": true,
            "files": [
                {
                    "file_additions": 0,
                    "file_deletions": 63,
                    "file_exists": true,
                    "file_name": "xlators/cluster/dht/src/dht-selfheal.c",
                    "file_size": 79642
                }
            ],
            "interesting": {
                "reopen": false,
                "status": false
            },
            "is_parent": false,
            "sha": "cff7804a0604b1b2ab2d91920af163bd95653ae7"
        },
        {
            "associated_pull_request": [],
            "date": "2020-07-07 17:55:35",
            "diff": "gluster_glusterfs/issue_1324/commit_76017cf65433b7f42e6bfdc2eaddfc36685e2c61.diff",
            "diff_additions": 124,
            "diff_deletions": 9,
            "diff_file_size": 911820,
            "diff_url": "https://github.com/gluster/glusterfs/commit/76017cf65433b7f42e6bfdc2eaddfc36685e2c61.diff",
            "exists": true,
            "files": [
                {
                    "file_additions": 16,
                    "file_deletions": 0,
                    "file_exists": true,
                    "file_name": "libglusterfs/src/common-utils.c",
                    "file_size": 132960
                },
                {
                    "file_additions": 5,
                    "file_deletions": 9,
                    "file_exists": true,
                    "file_name": "xlators/cluster/dht/src/dht-common.c",
                    "file_size": 358707
                },
                {
                    "file_additions": 4,
                    "file_deletions": 0,
                    "file_exists": true,
                    "file_name": "xlators/cluster/dht/src/dht-helper.c",
                    "file_size": 62075
                },
                {
                    "file_additions": 11,
                    "file_deletions": 0,
                    "file_exists": true,
                    "file_name": "xlators/cluster/dht/src/dht-selfheal.c",
                    "file_size": 79642
                },
                {
                    "file_additions": 19,
                    "file_deletions": 0,
                    "file_exists": true,
                    "file_name": "xlators/storage/posix/src/posix-helpers.c",
                    "file_size": 100064
                },
                {
                    "file_additions": 69,
                    "file_deletions": 0,
                    "file_exists": true,
                    "file_name": "xlators/storage/posix/src/posix-inode-fd-ops.c",
                    "file_size": 178372
                }
            ],
            "interesting": {
                "reopen": true,
                "status": false
            },
            "is_parent": false,
            "sha": "76017cf65433b7f42e6bfdc2eaddfc36685e2c61"
        },
        {
            "associated_pull_request": [],
            "date": "2020-07-07 17:55:35",
            "diff": "gluster_glusterfs/issue_1324/commit_c60c0fd3d4980a779764b45fe101eee64114697f.diff",
            "diff_additions": 141,
            "diff_deletions": 9,
            "diff_file_size": 911820,
            "diff_url": "https://github.com/gluster/glusterfs/commit/c60c0fd3d4980a779764b45fe101eee64114697f.diff",
            "exists": true,
            "files": [
                {
                    "file_additions": 33,
                    "file_deletions": 0,
                    "file_exists": true,
                    "file_name": "libglusterfs/src/common-utils.c",
                    "file_size": 132960
                },
                {
                    "file_additions": 5,
                    "file_deletions": 9,
                    "file_exists": true,
                    "file_name": "xlators/cluster/dht/src/dht-common.c",
                    "file_size": 358707
                },
                {
                    "file_additions": 4,
                    "file_deletions": 0,
                    "file_exists": true,
                    "file_name": "xlators/cluster/dht/src/dht-helper.c",
                    "file_size": 62075
                },
                {
                    "file_additions": 11,
                    "file_deletions": 0,
                    "file_exists": true,
                    "file_name": "xlators/cluster/dht/src/dht-selfheal.c",
                    "file_size": 79642
                },
                {
                    "file_additions": 19,
                    "file_deletions": 0,
                    "file_exists": true,
                    "file_name": "xlators/storage/posix/src/posix-helpers.c",
                    "file_size": 100064
                },
                {
                    "file_additions": 69,
                    "file_deletions": 0,
                    "file_exists": true,
                    "file_name": "xlators/storage/posix/src/posix-inode-fd-ops.c",
                    "file_size": 178372
                }
            ],
            "interesting": {
                "reopen": false,
                "status": false
            },
            "is_parent": false,
            "sha": "c60c0fd3d4980a779764b45fe101eee64114697f"
        },
        {
            "associated_pull_request": [],
            "date": "2020-07-07 17:55:35",
            "diff": "gluster_glusterfs/issue_1324/commit_fbfe7790324a3eabd59bc0ce03a30643e94fa171.diff",
            "diff_additions": 141,
            "diff_deletions": 9,
            "diff_file_size": 911820,
            "diff_url": "https://github.com/gluster/glusterfs/commit/fbfe7790324a3eabd59bc0ce03a30643e94fa171.diff",
            "exists": true,
            "files": [
                {
                    "file_additions": 33,
                    "file_deletions": 0,
                    "file_exists": true,
                    "file_name": "libglusterfs/src/common-utils.c",
                    "file_size": 132960
                },
                {
                    "file_additions": 5,
                    "file_deletions": 9,
                    "file_exists": true,
                    "file_name": "xlators/cluster/dht/src/dht-common.c",
                    "file_size": 358707
                },
                {
                    "file_additions": 4,
                    "file_deletions": 0,
                    "file_exists": true,
                    "file_name": "xlators/cluster/dht/src/dht-helper.c",
                    "file_size": 62075
                },
                {
                    "file_additions": 11,
                    "file_deletions": 0,
                    "file_exists": true,
                    "file_name": "xlators/cluster/dht/src/dht-selfheal.c",
                    "file_size": 79642
                },
                {
                    "file_additions": 19,
                    "file_deletions": 0,
                    "file_exists": true,
                    "file_name": "xlators/storage/posix/src/posix-helpers.c",
                    "file_size": 100064
                },
                {
                    "file_additions": 69,
                    "file_deletions": 0,
                    "file_exists": true,
                    "file_name": "xlators/storage/posix/src/posix-inode-fd-ops.c",
                    "file_size": 178372
                }
            ],
            "interesting": {
                "reopen": false,
                "status": false
            },
            "is_parent": false,
            "sha": "fbfe7790324a3eabd59bc0ce03a30643e94fa171"
        },
        {
            "associated_pull_request": [],
            "date": "2020-07-07 17:55:35",
            "diff": "gluster_glusterfs/issue_1324/commit_a65d85250c0d64c2aa703269d72d80ca838c7959.diff",
            "diff_additions": 141,
            "diff_deletions": 9,
            "diff_file_size": 911820,
            "diff_url": "https://github.com/gluster/glusterfs/commit/a65d85250c0d64c2aa703269d72d80ca838c7959.diff",
            "exists": true,
            "files": [
                {
                    "file_additions": 33,
                    "file_deletions": 0,
                    "file_exists": true,
                    "file_name": "libglusterfs/src/common-utils.c",
                    "file_size": 132960
                },
                {
                    "file_additions": 5,
                    "file_deletions": 9,
                    "file_exists": true,
                    "file_name": "xlators/cluster/dht/src/dht-common.c",
                    "file_size": 358707
                },
                {
                    "file_additions": 4,
                    "file_deletions": 0,
                    "file_exists": true,
                    "file_name": "xlators/cluster/dht/src/dht-helper.c",
                    "file_size": 62075
                },
                {
                    "file_additions": 11,
                    "file_deletions": 0,
                    "file_exists": true,
                    "file_name": "xlators/cluster/dht/src/dht-selfheal.c",
                    "file_size": 79642
                },
                {
                    "file_additions": 19,
                    "file_deletions": 0,
                    "file_exists": true,
                    "file_name": "xlators/storage/posix/src/posix-helpers.c",
                    "file_size": 100064
                },
                {
                    "file_additions": 69,
                    "file_deletions": 0,
                    "file_exists": true,
                    "file_name": "xlators/storage/posix/src/posix-inode-fd-ops.c",
                    "file_size": 178372
                }
            ],
            "interesting": {
                "reopen": false,
                "status": false
            },
            "is_parent": false,
            "sha": "a65d85250c0d64c2aa703269d72d80ca838c7959"
        },
        {
            "associated_pull_request": [],
            "date": "2021-04-22 06:34:04",
            "diff": "gluster_glusterfs/issue_1324/commit_2d9e93fc2ecc0d4a17d6e3026e49e952fd8c6f41.diff",
            "diff_additions": 9,
            "diff_deletions": 9,
            "diff_file_size": 212602,
            "diff_url": "https://github.com/gluster/glusterfs/commit/2d9e93fc2ecc0d4a17d6e3026e49e952fd8c6f41.diff",
            "exists": true,
            "files": [
                {
                    "file_additions": 8,
                    "file_deletions": 8,
                    "file_exists": true,
                    "file_name": "libglusterfs/src/common-utils.c",
                    "file_size": 132960
                },
                {
                    "file_additions": 1,
                    "file_deletions": 1,
                    "file_exists": true,
                    "file_name": "xlators/cluster/dht/src/dht-selfheal.c",
                    "file_size": 79642
                }
            ],
            "interesting": {
                "reopen": false,
                "status": true
            },
            "is_parent": false,
            "sha": "2d9e93fc2ecc0d4a17d6e3026e49e952fd8c6f41"
        },
        {
            "associated_pull_request": [],
            "date": "2020-07-07 17:55:35",
            "diff": "gluster_glusterfs/issue_1324/commit_d8671c9a0533d1e12349b7fdf90219ea2721a446.diff",
            "diff_additions": 141,
            "diff_deletions": 9,
            "diff_file_size": 911820,
            "diff_url": "https://github.com/gluster/glusterfs/commit/d8671c9a0533d1e12349b7fdf90219ea2721a446.diff",
            "exists": true,
            "files": [
                {
                    "file_additions": 33,
                    "file_deletions": 0,
                    "file_exists": true,
                    "file_name": "libglusterfs/src/common-utils.c",
                    "file_size": 132960
                },
                {
                    "file_additions": 5,
                    "file_deletions": 9,
                    "file_exists": true,
                    "file_name": "xlators/cluster/dht/src/dht-common.c",
                    "file_size": 358707
                },
                {
                    "file_additions": 4,
                    "file_deletions": 0,
                    "file_exists": true,
                    "file_name": "xlators/cluster/dht/src/dht-helper.c",
                    "file_size": 62075
                },
                {
                    "file_additions": 11,
                    "file_deletions": 0,
                    "file_exists": true,
                    "file_name": "xlators/cluster/dht/src/dht-selfheal.c",
                    "file_size": 79642
                },
                {
                    "file_additions": 19,
                    "file_deletions": 0,
                    "file_exists": true,
                    "file_name": "xlators/storage/posix/src/posix-helpers.c",
                    "file_size": 100064
                },
                {
                    "file_additions": 69,
                    "file_deletions": 0,
                    "file_exists": true,
                    "file_name": "xlators/storage/posix/src/posix-inode-fd-ops.c",
                    "file_size": 178372
                }
            ],
            "interesting": {
                "reopen": false,
                "status": false
            },
            "is_parent": false,
            "sha": "d8671c9a0533d1e12349b7fdf90219ea2721a446"
        },
        {
            "associated_pull_request": [],
            "date": "2021-04-22 06:34:04",
            "diff": "gluster_glusterfs/issue_1324/commit_76a496de7a97f9d357b5495f5eaa9d3985dc04ef.diff",
            "diff_additions": 1,
            "diff_deletions": 1,
            "diff_file_size": 79642,
            "diff_url": "https://github.com/gluster/glusterfs/commit/76a496de7a97f9d357b5495f5eaa9d3985dc04ef.diff",
            "exists": true,
            "files": [
                {
                    "file_additions": 1,
                    "file_deletions": 1,
                    "file_exists": true,
                    "file_name": "xlators/cluster/dht/src/dht-selfheal.c",
                    "file_size": 79642
                }
            ],
            "interesting": {
                "reopen": false,
                "status": false
            },
            "is_parent": false,
            "sha": "76a496de7a97f9d357b5495f5eaa9d3985dc04ef"
        },
        {
            "associated_pull_request": [],
            "date": "2020-07-07 17:55:35",
            "diff": "gluster_glusterfs/issue_1324/commit_e4dd48394074b38feee7310064f5e3b4d2ae76b4.diff",
            "diff_additions": 141,
            "diff_deletions": 9,
            "diff_file_size": 911820,
            "diff_url": "https://github.com/gluster/glusterfs/commit/e4dd48394074b38feee7310064f5e3b4d2ae76b4.diff",
            "exists": true,
            "files": [
                {
                    "file_additions": 33,
                    "file_deletions": 0,
                    "file_exists": true,
                    "file_name": "libglusterfs/src/common-utils.c",
                    "file_size": 132960
                },
                {
                    "file_additions": 5,
                    "file_deletions": 9,
                    "file_exists": true,
                    "file_name": "xlators/cluster/dht/src/dht-common.c",
                    "file_size": 358707
                },
                {
                    "file_additions": 4,
                    "file_deletions": 0,
                    "file_exists": true,
                    "file_name": "xlators/cluster/dht/src/dht-helper.c",
                    "file_size": 62075
                },
                {
                    "file_additions": 11,
                    "file_deletions": 0,
                    "file_exists": true,
                    "file_name": "xlators/cluster/dht/src/dht-selfheal.c",
                    "file_size": 79642
                },
                {
                    "file_additions": 19,
                    "file_deletions": 0,
                    "file_exists": true,
                    "file_name": "xlators/storage/posix/src/posix-helpers.c",
                    "file_size": 100064
                },
                {
                    "file_additions": 69,
                    "file_deletions": 0,
                    "file_exists": true,
                    "file_name": "xlators/storage/posix/src/posix-inode-fd-ops.c",
                    "file_size": 178372
                }
            ],
            "interesting": {
                "reopen": false,
                "status": false
            },
            "is_parent": false,
            "sha": "e4dd48394074b38feee7310064f5e3b4d2ae76b4"
        },
        {
            "associated_pull_request": [
                "https://github.com/gluster/glusterfs/pull/2346"
            ],
            "date": "2020-07-07 17:55:35",
            "diff": "gluster_glusterfs/issue_1324/commit_077c7ed28f7a0f6556c02a115e5300031cceb263.diff",
            "diff_additions": 124,
            "diff_deletions": 9,
            "diff_file_size": 911820,
            "diff_url": "https://github.com/gluster/glusterfs/commit/077c7ed28f7a0f6556c02a115e5300031cceb263.diff",
            "exists": true,
            "files": [
                {
                    "file_additions": 16,
                    "file_deletions": 0,
                    "file_exists": true,
                    "file_name": "libglusterfs/src/common-utils.c",
                    "file_size": 132960
                },
                {
                    "file_additions": 5,
                    "file_deletions": 9,
                    "file_exists": true,
                    "file_name": "xlators/cluster/dht/src/dht-common.c",
                    "file_size": 358707
                },
                {
                    "file_additions": 4,
                    "file_deletions": 0,
                    "file_exists": true,
                    "file_name": "xlators/cluster/dht/src/dht-helper.c",
                    "file_size": 62075
                },
                {
                    "file_additions": 11,
                    "file_deletions": 0,
                    "file_exists": true,
                    "file_name": "xlators/cluster/dht/src/dht-selfheal.c",
                    "file_size": 79642
                },
                {
                    "file_additions": 19,
                    "file_deletions": 0,
                    "file_exists": true,
                    "file_name": "xlators/storage/posix/src/posix-helpers.c",
                    "file_size": 100064
                },
                {
                    "file_additions": 69,
                    "file_deletions": 0,
                    "file_exists": true,
                    "file_name": "xlators/storage/posix/src/posix-inode-fd-ops.c",
                    "file_size": 178372
                }
            ],
            "interesting": {
                "reopen": false,
                "status": false
            },
            "is_parent": false,
            "sha": "077c7ed28f7a0f6556c02a115e5300031cceb263"
        },
        {
            "associated_pull_request": [
                "https://github.com/gluster/glusterfs/pull/2346"
            ],
            "date": "2021-05-06 04:45:37",
            "diff": "gluster_glusterfs/issue_1324/commit_c20e4b6da18cd5c472493bc7653ed779e94c8f42.diff",
            "diff_additions": 124,
            "diff_deletions": 9,
            "diff_file_size": 911820,
            "diff_url": "https://github.com/gluster/glusterfs/commit/c20e4b6da18cd5c472493bc7653ed779e94c8f42.diff",
            "exists": true,
            "files": [
                {
                    "file_additions": 16,
                    "file_deletions": 0,
                    "file_exists": true,
                    "file_name": "libglusterfs/src/common-utils.c",
                    "file_size": 132960
                },
                {
                    "file_additions": 5,
                    "file_deletions": 9,
                    "file_exists": true,
                    "file_name": "xlators/cluster/dht/src/dht-common.c",
                    "file_size": 358707
                },
                {
                    "file_additions": 4,
                    "file_deletions": 0,
                    "file_exists": true,
                    "file_name": "xlators/cluster/dht/src/dht-helper.c",
                    "file_size": 62075
                },
                {
                    "file_additions": 11,
                    "file_deletions": 0,
                    "file_exists": true,
                    "file_name": "xlators/cluster/dht/src/dht-selfheal.c",
                    "file_size": 79642
                },
                {
                    "file_additions": 19,
                    "file_deletions": 0,
                    "file_exists": true,
                    "file_name": "xlators/storage/posix/src/posix-helpers.c",
                    "file_size": 100064
                },
                {
                    "file_additions": 69,
                    "file_deletions": 0,
                    "file_exists": true,
                    "file_name": "xlators/storage/posix/src/posix-inode-fd-ops.c",
                    "file_size": 178372
                }
            ],
            "interesting": {
                "reopen": false,
                "status": false
            },
            "is_parent": false,
            "sha": "c20e4b6da18cd5c472493bc7653ed779e94c8f42"
        }
    ],
    "first_commit": "2020-06-22 14:16:26",
    "last_commit": "2021-05-06 04:45:37",
    "number": 1324,
    "pull_request": "None",
    "score": {
        "accidental_reopen_likely": false,
        "all_labels": [
            "Type:Bug"
        ],
        "contains_keywords": [
            "fix",
            "patch",
            "remov",
            "issu"
        ],
        "fix_size": 268,
        "has_labels": [],
        "intersecting": {
            "computed_score": 0.9856115107913669,
            "final_commit_size": 139,
            "intersection_size": 137,
            "previous_commits_size": 266
        },
        "is_makefile_based": true,
        "no_new_files": [],
        "no_other_files": false,
        "num_prohibited_files": 235457,
        "prohibited_files": [
            "hal/inc/pinmap_hal.h",
            "Debug/marvin.bin",
            "Debug/marvin.elf",
            "Debug/marvin.hex",
            "Debug/marvin.bin",
            "Debug/marvin.elf",
            "Debug/marvin.hex",
            "inc/spark_utilities.h",
            "Debug/marvin.bin",
            "Debug/marvin.elf"
        ],
        "reopen": true,
        "reopen_events": [
            [
                "2020-06-25 07:05:47",
                "closed"
            ],
            [
                "2020-06-25 07:05:47",
                "commit"
            ],
            [
                "2020-06-25 09:57:44",
                "reopened"
            ],
            [
                "2020-06-26 17:17:52",
                "commit"
            ],
            [
                "2020-07-22 09:10:57",
                "closed"
            ],
            [
                "2020-07-22 09:10:57",
                "commit"
            ],
            [
                "2021-04-22 06:20:09",
                "reopened"
            ],
            [
                "2021-04-22 06:20:31",
                "commit"
            ],
            [
                "2021-04-22 06:22:19",
                "commit"
            ],
            [
                "2021-04-22 07:37:50",
                "commit"
            ],
            [
                "2021-04-22 07:37:50",
                "commit"
            ],
            [
                "2021-04-22 15:13:45",
                "commit"
            ],
            [
                "2021-04-22 15:13:45",
                "commit"
            ],
            [
                "2021-04-26 05:01:23",
                "commit"
            ],
            [
                "2021-04-26 05:15:44",
                "commit"
            ],
            [
                "2021-05-06 04:45:38",
                "commit"
            ],
            [
                "2021-05-06 05:10:47",
                "closed"
            ]
        ],
        "status": false,
        "strategy": true,
        "total_changes": 1334
    }
}