{
    "category": [
        "wrong API usage",
        "feature request"
    ],
    "commits": [
        {
            "associated_pull_request": [],
            "date": "2018-12-08 14:58:29",
            "diff": "",
            "diff_additions": 0,
            "diff_deletions": 0,
            "diff_file_size": 0,
            "diff_url": "https://github.com/phpredis/phpredis/commit/bb6599e47e088d8bc0fa89eb856eed1143a71ece.diff",
            "exists": true,
            "files": [],
            "interesting": {
                "reopen": false,
                "status": false
            },
            "is_parent": true,
            "sha": "bb6599e47e088d8bc0fa89eb856eed1143a71ece"
        },
        {
            "associated_pull_request": [],
            "date": "2018-12-13 15:26:00",
            "diff": "phpredis_phpredis/issue_1477/commit_dd9a5999d97778dd316dcbb177f82fe879808f0f.diff",
            "diff_additions": 6,
            "diff_deletions": 3,
            "diff_file_size": 106977,
            "diff_url": "https://github.com/phpredis/phpredis/commit/dd9a5999d97778dd316dcbb177f82fe879808f0f.diff",
            "exists": true,
            "files": [
                {
                    "file_additions": 6,
                    "file_deletions": 3,
                    "file_exists": true,
                    "file_name": "library.c",
                    "file_size": 106977
                }
            ],
            "interesting": {
                "reopen": false,
                "status": false
            },
            "is_parent": false,
            "sha": "dd9a5999d97778dd316dcbb177f82fe879808f0f"
        },
        {
            "associated_pull_request": [],
            "date": "2018-12-13 15:26:00",
            "diff": "phpredis_phpredis/issue_1477/commit_c9c727c225466d2fe5ef8b7d9977c6c03ec9992f.diff",
            "diff_additions": 8,
            "diff_deletions": 3,
            "diff_file_size": 106977,
            "diff_url": "https://github.com/phpredis/phpredis/commit/c9c727c225466d2fe5ef8b7d9977c6c03ec9992f.diff",
            "exists": true,
            "files": [
                {
                    "file_additions": 8,
                    "file_deletions": 3,
                    "file_exists": true,
                    "file_name": "library.c",
                    "file_size": 106977
                }
            ],
            "interesting": {
                "reopen": false,
                "status": false
            },
            "is_parent": false,
            "sha": "c9c727c225466d2fe5ef8b7d9977c6c03ec9992f"
        },
        {
            "associated_pull_request": [
                "https://github.com/phpredis/phpredis/pull/1478"
            ],
            "date": "2018-12-13 15:26:00",
            "diff": "phpredis_phpredis/issue_1477/commit_bf8ceae774f51628b83d76ef79a396661928038a.diff",
            "diff_additions": 14,
            "diff_deletions": 8,
            "diff_file_size": 106977,
            "diff_url": "https://github.com/phpredis/phpredis/commit/bf8ceae774f51628b83d76ef79a396661928038a.diff",
            "exists": true,
            "files": [
                {
                    "file_additions": 14,
                    "file_deletions": 8,
                    "file_exists": true,
                    "file_name": "library.c",
                    "file_size": 106977
                }
            ],
            "interesting": {
                "reopen": false,
                "status": true
            },
            "is_parent": false,
            "sha": "bf8ceae774f51628b83d76ef79a396661928038a"
        },
        {
            "associated_pull_request": [
                "https://github.com/phpredis/phpredis/pull/1478"
            ],
            "date": "2018-12-14 07:24:56",
            "diff": "phpredis_phpredis/issue_1477/commit_eabc5ec79fc8e0d1d43804c063293963c4369384.diff",
            "diff_additions": 14,
            "diff_deletions": 8,
            "diff_file_size": 106977,
            "diff_url": "https://github.com/phpredis/phpredis/commit/eabc5ec79fc8e0d1d43804c063293963c4369384.diff",
            "exists": true,
            "files": [
                {
                    "file_additions": 14,
                    "file_deletions": 8,
                    "file_exists": true,
                    "file_name": "library.c",
                    "file_size": 106977
                }
            ],
            "interesting": {
                "reopen": false,
                "status": false
            },
            "is_parent": false,
            "sha": "eabc5ec79fc8e0d1d43804c063293963c4369384"
        },
        {
            "associated_pull_request": [],
            "date": "2018-12-19 14:33:07",
            "diff": "phpredis_phpredis/issue_1477/commit_50ad2c462b473176b9fcc572b583dcc5a30d9db6.diff",
            "diff_additions": 9,
            "diff_deletions": 13,
            "diff_file_size": 106977,
            "diff_url": "https://github.com/phpredis/phpredis/commit/50ad2c462b473176b9fcc572b583dcc5a30d9db6.diff",
            "exists": true,
            "files": [
                {
                    "file_additions": 9,
                    "file_deletions": 13,
                    "file_exists": true,
                    "file_name": "library.c",
                    "file_size": 106977
                }
            ],
            "interesting": {
                "reopen": false,
                "status": true
            },
            "is_parent": false,
            "sha": "50ad2c462b473176b9fcc572b583dcc5a30d9db6"
        },
        {
            "associated_pull_request": [],
            "date": "2018-12-19 14:33:07",
            "diff": "phpredis_phpredis/issue_1477/commit_51bf2c2ff3e3de654aad5c860ed152be4b1b14e8.diff",
            "diff_additions": 13,
            "diff_deletions": 13,
            "diff_file_size": 106977,
            "diff_url": "https://github.com/phpredis/phpredis/commit/51bf2c2ff3e3de654aad5c860ed152be4b1b14e8.diff",
            "exists": true,
            "files": [
                {
                    "file_additions": 13,
                    "file_deletions": 13,
                    "file_exists": true,
                    "file_name": "library.c",
                    "file_size": 106977
                }
            ],
            "interesting": {
                "reopen": false,
                "status": true
            },
            "is_parent": false,
            "sha": "51bf2c2ff3e3de654aad5c860ed152be4b1b14e8"
        },
        {
            "associated_pull_request": [
                "https://github.com/phpredis/phpredis/pull/1483"
            ],
            "date": "2018-12-19 14:33:07",
            "diff": "phpredis_phpredis/issue_1477/commit_b27fd43032203fa36adec5264f5e95da2fefde5e.diff",
            "diff_additions": 13,
            "diff_deletions": 13,
            "diff_file_size": 106977,
            "diff_url": "https://github.com/phpredis/phpredis/commit/b27fd43032203fa36adec5264f5e95da2fefde5e.diff",
            "exists": true,
            "files": [
                {
                    "file_additions": 13,
                    "file_deletions": 13,
                    "file_exists": true,
                    "file_name": "library.c",
                    "file_size": 106977
                }
            ],
            "interesting": {
                "reopen": false,
                "status": false
            },
            "is_parent": false,
            "sha": "b27fd43032203fa36adec5264f5e95da2fefde5e"
        },
        {
            "associated_pull_request": [
                "https://github.com/phpredis/phpredis/pull/1483"
            ],
            "date": "2018-12-20 07:28:45",
            "diff": "phpredis_phpredis/issue_1477/commit_743c7260feb554bc8a941057ccf1293c1888f962.diff",
            "diff_additions": 13,
            "diff_deletions": 13,
            "diff_file_size": 106977,
            "diff_url": "https://github.com/phpredis/phpredis/commit/743c7260feb554bc8a941057ccf1293c1888f962.diff",
            "exists": true,
            "files": [
                {
                    "file_additions": 13,
                    "file_deletions": 13,
                    "file_exists": true,
                    "file_name": "library.c",
                    "file_size": 106977
                }
            ],
            "interesting": {
                "reopen": false,
                "status": false
            },
            "is_parent": false,
            "sha": "743c7260feb554bc8a941057ccf1293c1888f962"
        }
    ],
    "first_commit": "2018-12-08 14:58:33",
    "last_commit": "2018-12-20 07:28:45",
    "number": 1477,
    "pull_request": "None",
    "score": {
        "accidental_reopen_likely": false,
        "all_labels": [],
        "contains_keywords": [
            "fail",
            "chang",
            "reason",
            "error",
            "test",
            "remov",
            "issu",
            "work",
            "CI"
        ],
        "fix_size": 21,
        "has_labels": [],
        "intersecting": {
            "computed_score": 1.0,
            "final_commit_size": 19,
            "intersection_size": 19,
            "previous_commits_size": 21
        },
        "is_makefile_based": false,
        "no_new_files": [],
        "no_other_files": true,
        "num_prohibited_files": 172872,
        "prohibited_files": [
            "hal/inc/pinmap_hal.h",
            "Debug/marvin.bin",
            "Debug/marvin.elf",
            "Debug/marvin.hex",
            "Debug/marvin.bin",
            "Debug/marvin.elf",
            "Debug/marvin.hex",
            "inc/spark_utilities.h",
            "Debug/marvin.bin",
            "Debug/marvin.elf"
        ],
        "reopen": false,
        "reopen_events": [
            [
                "2018-12-13 15:26:33",
                "commit"
            ],
            [
                "2018-12-13 18:44:24",
                "commit"
            ],
            [
                "2018-12-13 19:56:51",
                "commit"
            ],
            [
                "2018-12-14 07:25:01",
                "commit"
            ],
            [
                "2018-12-19 14:34:17",
                "commit"
            ],
            [
                "2018-12-19 15:34:05",
                "commit"
            ],
            [
                "2018-12-19 16:32:37",
                "commit"
            ],
            [
                "2018-12-20 07:28:51",
                "commit"
            ],
            [
                "2019-02-25 12:59:04",
                "closed"
            ]
        ],
        "status": true,
        "strategy": true,
        "total_changes": 164
    }
}