{
    "covered_issues": [
        64,
        53,
        51,
        50,
        49,
        45,
        44,
        43,
        38,
        37,
        36,
        32,
        31,
        28,
        27,
        26,
        25,
        22,
        20,
        14,
        11,
        9,
        8,
        7,
        6,
        2,
        1
    ],
    "finished": true
}