{
    "covered_issues": [
        19,
        18,
        17,
        16,
        14,
        13,
        12,
        11,
        10,
        9,
        6,
        3,
        2,
        1
    ],
    "finished": true
}