glusterd keep crashing when upgrading from 6.5 to 7.7
@sanjurakonde 
Can you please check and reply?
Thanks Mohit -- this issue is really urgent.
One additional data point, I found after doing additional testing - the core happens as we include the full qualified name in the peer list which is longer than n32 bytes. We need to include loner names up to 60 for AWS. 
Does that give any hint on what's causing the issue? and if confirmed, how we can include loner names?

# gluster peer status
Number of Peers: 4

Hostname: 172.26.1.24
Uuid: 9d050eea-de42-4ac6-89be-4b98715f99c2
State: Peer in Cluster (Connected)

Hostname: 172.26.1.25
Uuid: 01e28bbc-e342-495c-945f-a887b2026500
State: Peer in Cluster (Connected)

Hostname: tesla-auto-1912-os7-v2-control-01.storage.bcmt.cluster.local
Uuid: 44509161-d4cb-4731-ae8c-800523cbed1d
State: Peer in Cluster (Connected)
Other names:
tesla-auto-1912-os7-v2-control-01.storage.bcmt.cluster.local
tesla-auto-1912-os7-v2-control-01.storage.bcmt

Hostname: 172.26.1.22
Uuid: 616f2589-4e2d-4984-94aa-abfbcb115acf
State: Peer in Cluster (Connected)
Can you please share the below info
1) glusterd logs
2) Install the debug package(glusterfs-server-7.7-1.el7.x86_64) and then share the backtrace from the coredump
debug package glusterfs-server-7.7-1.el7.x86_64? is that the name? this is already installed? or it's a different name?
debug package name should be like this glusterfs-debuginfo-7.7-1.el7rhgs.x86_64.rpm 
glusterfs-debuginfo-7.7-1.el7.x86_64.rpm
https://buildlogs.centos.org/centos/7/storage/x86_64/gluster-7/Packages/g/

doesn't have it, but I have my 7.6 + patch one. Unless you have a pointer to the 7.7-1 rpm, I can use my build
you can find the debuginfo package here https://cbs.centos.org/koji/buildinfo?buildID=30430
Backtrace with debuginfo
[root@tesla-auto-1912-os7-v2-control-03 /]# gdb /usr/sbin/glusterd ./core.1871
GNU gdb (GDB) Red Hat Enterprise Linux 7.6.1-119.el7
Copyright (C) 2013 Free Software Foundation, Inc.
License GPLv3+: GNU GPL version 3 or later <http://gnu.org/licenses/gpl.html>
This is free software: you are free to change and redistribute it.
There is NO WARRANTY, to the extent permitted by law.  Type "show copying"
and "show warranty" for details.
This GDB was configured as "x86_64-redhat-linux-gnu".
For bug reporting instructions, please see:
<http://www.gnu.org/software/gdb/bugs/>...
Reading symbols from /usr/sbin/glusterfsd...Reading symbols from /usr/lib/debug/usr/sbin/glusterfsd.debug...done.
done.

warning: core file may not match specified executable file.
[New LWP 1893]
[New LWP 1872]
[New LWP 1874]
[New LWP 1871]
[New LWP 1876]
[New LWP 1873]
[New LWP 1877]
[New LWP 1875]
[New LWP 1892]
[Thread debugging using libthread_db enabled]
Using host libthread_db library "/lib64/libthread_db.so.1".
Core was generated by `/usr/sbin/glusterd -p /var/run/glusterd.pid --log-level ERROR'.
Program terminated with signal 11, Segmentation fault.
#0  0x00007f131d28f0b8 in ?? () from /lib64/libgcc_s.so.1
Missing separate debuginfos, use: debuginfo-install glibc-2.17-292.el7.x86_64 keyutils-libs-1.5.8-3.el7.x86_64 krb5-libs-1.15.1-37.el7_7.2.x86_64 libcom_err-1.42.9-16.el7.x86_64 libgcc-4.8.5-39.el7.x86_64 libselinux-2.5-14.1.el7.x86_64 libuuid-2.23.2-61.el7.x86_64 libxml2-2.9.1-6.el7_2.3.x86_64 openssl-libs-1.0.2k-19.el7.x86_64 pcre-8.32-17.el7.x86_64 userspace-rcu-0.10.0-3.el7.x86_64 xz-libs-5.2.2-1.el7.x86_64 zlib-1.2.7-18.el7.x86_64
(gdb) where
#0  0x00007f131d28f0b8 in ?? () from /lib64/libgcc_s.so.1
#1  0x00007f131d28ffb9 in _Unwind_Backtrace () from /lib64/libgcc_s.so.1
#2  0x00007f132547ea56 in backtrace () from /lib64/libc.so.6
#3  0x00007f1326d5f86f in _gf_msg_backtrace_nomem (level=level@entry=GF_LOG_ALERT, 
    stacksize=stacksize@entry=200) at logging.c:1036
#4  0x00007f1326d6a2a4 in gf_print_trace (signum=11, ctx=0x563b9d94f010) at common-utils.c:950
#5  <signal handler called>
#6  0x00007f132141fbc1 in glusterd_store_perform_peer_store (peerinfo=<optimized out>)
    at glusterd-store.c:4586
#7  0x31302d6c6f72746e in ?? ()
#8  0x656761726f74732e in ?? ()
#9  0x00000a746d63622e in ?? ()
#10 0x00007f131e096d60 in ?? ()
#11 0x0000000000000001 in ?? ()
#12 0x0000563b9dacd4f0 in ?? ()
#13 0x00007f131e096d50 in ?? ()
#14 0x00007f131e096d60 in ?? ()
#15 0x00007f13213bd398 in __glusterd_handle_friend_update (req=req@entry=0x7f1318007e28)
    at glusterd-handler.c:2703
#16 0x00007f13213b865e in glusterd_big_locked_handler (req=0x7f1318007e28, 
    actor_fn=0x7f13213bca90 <__glusterd_handle_friend_update>) at glusterd-handler.c:79
#17 0x00007f1326b03695 in rpcsvc_handle_rpc_call (svc=<optimized out>, 
    trans=trans@entry=0x7f131803c3f0, msg=<optimized out>) at rpcsvc.c:902
#18 0x00007f1326b03a0b in rpcsvc_notify (trans=0x7f131803c3f0, mydata=<optimized out>, 
    event=<optimized out>, data=<optimized out>) at rpcsvc.c:994
#19 0x00007f1326b05a93 in rpc_transport_notify (this=this@entry=0x7f131803c3f0, 
    event=event@entry=RPC_TRANSPORT_MSG_RECEIVED, data=data@entry=0x7f131803cc30)
    at rpc-transport.c:545
#20 0x00007f13205d34b8 in socket_event_poll_in_async (xl=<optimized out>, async=0x7f131803cd58)
    at socket.c:2601
#21 0x00007f13205da921 in gf_async (cbk=0x7f13205d3490 <socket_event_poll_in_async>, 
    xl=<optimized out>, async=0x7f131803cd58) at ../../../../libglusterfs/src/glusterfs/async.h:189
#22 socket_event_poll_in (notify_handled=true, this=0x7f131803c3f0) at socket.c:2642
#23 socket_event_handler (fd=<optimized out>, idx=<optimized out>, gen=<optimized out>, 
    data=0x7f131803c3f0, poll_in=<optimized out>, poll_out=<optimized out>, poll_err=0, 
---Type <return> to continue, or q <return> to quit--- 
    event_thread_died=0 '\000') at socket.c:3040
#24 0x00007f1326dc62b6 in event_dispatch_epoll_handler (event=0x7f131e097130, 
    event_pool=0x563b9d985510) at event-epoll.c:650
#25 event_dispatch_epoll_worker (data=0x563b9d9fd1a0) at event-epoll.c:763
#26 0x00007f1325ba2e65 in start_thread () from /lib64/libpthread.so.0
#27 0x00007f132546888d in clone () from /lib64/libc.so.6
(gdb) 

Uploading 2 glusterd.log  -- one from the node where cores are thrown after upgrading to 7.7 and the other two from other nodes still on 6.5 -- no cores

The badnode is a large file for the last two days, first where the problem happens with 7.6 + patch and later with 7.7 -- at the end I just did anotehr upgraed with 7.7
[](url)

[glusterd.zip](https://github.com/gluster/glusterfs/files/5004955/glusterd.zip)

The glusterd was crashing because it was not able to open a temporary file on the node due to having lack of storage space.It confirms from core also  as we can see in dump it is showing last function is glusterd_store_perform_peer_store so it is expected. 
Is your issue resolved after cleaning the space?
There's plenty of space on the machine. Where glusterd is trying to open the file "/tmp", or what?

glusterd saved the files under /var/lib/glusterd, i thought the issue is already resolved because you have closed the issue.
besides this is happening on all machines except the one that has only IPs for "gluster peer status"
# gluster peer status
Number of Peers: 4

Hostname: 172.26.1.23
Uuid: 2f412a49-d262-46ce-8669-cafcddd185c4
State: Peer in Cluster (Connected)

Hostname: 172.26.1.24
Uuid: 9d050eea-de42-4ac6-89be-4b98715f99c2
State: Peer in Cluster (Connected)

Hostname: 172.26.1.25
Uuid: 01e28bbc-e342-495c-945f-a887b2026500
State: Peer in Cluster (Connected)

Hostname: 172.26.1.22
Uuid: 616f2589-4e2d-4984-94aa-abfbcb115acf
State: Peer in Cluster (Connected)

The problem happens at all other machines that have one name as follows
# gluster peer status
Number of Peers: 4

Hostname: 172.26.1.23
Uuid: 2f412a49-d262-46ce-8669-cafcddd185c4
State: Peer in Cluster (Connected)

Hostname: 172.26.1.24
Uuid: 9d050eea-de42-4ac6-89be-4b98715f99c2
State: Peer in Cluster (Connected)

Hostname: 172.26.1.25
Uuid: 01e28bbc-e342-495c-945f-a887b2026500
State: Peer in Cluster (Connected)

Hostname: tesla-auto-1912-os7-v2-control-01
Uuid: 44509161-d4cb-4731-ae8c-800523cbed1d
State: Peer in Cluster (Connected)
Other names:


oh that was by mistake while uploading the files. Can you re-open please

# df -k /var/lib/glusterd
Filesystem     1K-blocks    Used Available Use% Mounted on
/dev/sda1      103079844 4072468  94587148   5% /
[root@tesla-auto-1912-os7-v2-control-03 glusterd]# 

in a different cluster with a shorter hosname (< 32 --- csto-bcmt-2003-a-control-01), the issue didn't happen
Can you please share the /var/lib/glusterd dump from all the nodes?
Do you mean all the "/var/lib/glusterd" directories contents? like a zip file of each?
Keep in mind, will have the bad one with 7.7 and the remaining are still on 6.5

Yes zip file of each node from the cluster.Please tag the directory like 6.5/7.7_working/7.7_non_working.
Attached a zip file includes 5 .tgz files, each per node for /var/lib/glusterd
 
[var_lib_glusterd.zip](https://github.com/gluster/glusterfs/files/5005178/var_lib_glusterd.zip)

Hi Amgads,

 Thanks for sharing the /var/lib/glusterd/ dump.You are correct it was crashing due to longer hostname.
 After checked the dump we have found glusterd is crashing because hostname is surpass the buffer length.I am seeing in 
 successful case(6.5) peerid file is having 3 entries for the same node(tesla-auto-1912-os7-v2-control-01.storage.bcmt)
 
 In successful case(6.5) peerid file is like below
 cat peers/44509161-d4cb-4731-ae8c-800523cbed1d 
uuid=44509161-d4cb-4731-ae8c-800523cbed1d
state=3
hostname1=tesla-auto-1912-os7-v2-control-01.storage.bcmt.cluster.local
hostname2=tesla-auto-1912-os7-v2-control-01
hostname3=tesla-auto-1912-os7-v2-control-01.storage.bcmt

In non_working case 7.7 peerid file is like below
cat 7.7_nonworking/glusterd/peers/44509161-d4cb-4731-ae8c-800523cbed1d 
uuid=44509161-d4cb-4731-ae8c-800523cbed1d
state=3
hostname1=tesla-auto-1912-os7-v2-control-01
hostname2=tesla-auto-1912-os7-v2-

Here we can see file is not properly populated that's why glusterd is crashed.We need to fix the same in
our code to ensure data should be correctly populated.Can you please confirm do u have multiple entries
in /etc/hosts specific to the node(tesla-auto-1912-os7-v2-control-01.storage.bcmt) that's why dns is returning
more than one entries for the same ip.

Thanks,
Mohit Agrawal
Thanks Mohit for working this out. Yes we have multiple DNS entries for the same IP -- it's a private DNS we set.
I assume if the fix is clear enough to you, we'll pick it up and build on top of 7.7 or even includes it in our previous 7.6+build
Hi,

 Yes the fix is clear to us. For as of now the only workaround is reduce the dns entries to 1 specific to this IP address.
 Whenever glusterd got a friend update request it has tried to update peer files so you will face the issue unless
 issue is not fixed in the code.

Thanks,
Mohit Agrawal

Thanks a lot Mohit!. We can build the patch on top of 7.7 and test it once available. Any projection? would it be in the next couple of days. Will be highly appreciated to make it to our release.
Thanks again!
@amgads Can you please try this patch https://review.gluster.org/#/c/glusterfs/+/24800/ in your environment and share the result.
Thanks a lot Mohit for your quick action. Will build and test.
Should I build on top of 7.7 or 7.6 + this patch (https://review.gluster.org/#/c/glusterfs/+/24544/) is enough?
Please build on top of 7.7.
Thanks. will do 7.7 then and test.
BTW - is PATH_MAX same as the linux/limits.h "PATH_MAX" (4096 bytes)?
Yes
Hi Mohit - I rebuilt 7.7 and updated the bad node. It worked fine.
I'll continue doing other tests and let you know.
Thanks a lot for your quick turn-around
Thanks for confirming it.
A patch https://review.gluster.org/24800 has been posted that references this issue.

glusterd: Increase buffer length to save multiple hostnames in peer file

Problem: At the time of handling friend update request glusterd updates peer
         file and if DNS has returned multiple hostnames for the same IP, glusterd
         saves all hostnames in peer file.In commit 1fa089e7a2b180e0bdcc1e7e09a63934a2a0c0ef
         We changed the approach to save all key value pairs in single shot.
         In case of a buffer is not having space to store the hostnames glusterd
         writes partial hostname in peer file.

Solution: To avoid the failure increase the buffer length

Change-Id: Iee969d165333e9c5ba69431d474c541b8f12d442
Fixes: #1407
Signed-off-by: Mohit Agrawal <moagrawa@redhat.com>


Hi Mohit -- I see additional change  https://review.gluster.org/24800 -- is that a final change? 

Added a comment to the code
Yes it is final change, the new change is minor and it would not impact on your previous testing.
Thanks -- rebuilding for more testing!
A patch https://review.gluster.org/24836 has been posted that references this issue.

glusterd: Increase buffer length to save multiple hostnames in peer file

Problem: At the time of handling friend update request glusterd updates peer
         file and if DNS has returned multiple hostnames for the same IP, glusterd
         saves all hostnames in peer file.In commit 1fa089e7a2b180e0bdcc1e7e09a63934a2a0c0ef
         We changed the approach to save all key value pairs in single shot.
         In case of a buffer is not having space to store the hostnames glusterd
         writes partial hostname in peer file.

Solution: To avoid the failure increase the buffer length

Change-Id: Iee969d165333e9c5ba69431d474c541b8f12d442
Fixes: #1407
Signed-off-by: Mohit Agrawal <moagrawa@redhat.com>
(cherry picked from commit 6e8e73a06d71382f8f6e3cd83fe72692d19e66ba)


A patch https://review.gluster.org/24837 has been posted that references this issue.

glusterd: Increase buffer length to save multiple hostnames in peer file

Problem: At the time of handling friend update request glusterd updates peer
         file and if DNS has returned multiple hostnames for the same IP, glusterd
         saves all hostnames in peer file.In commit 1fa089e7a2b180e0bdcc1e7e09a63934a2a0c0ef
         We changed the approach to save all key value pairs in single shot.
         In case of a buffer is not having space to store the hostnames glusterd
         writes partial hostname in peer file.

Solution: To avoid the failure increase the buffer length

Change-Id: Iee969d165333e9c5ba69431d474c541b8f12d442
Fixes: #1407
Signed-off-by: Mohit Agrawal <moagrawa@redhat.com>
(cherry picked from commit 6e8e73a06d71382f8f6e3cd83fe72692d19e66ba)


A patch https://review.gluster.org/24836 has been posted that references this issue.

glusterd: Increase buffer length to save multiple hostnames in peer file

Problem: At the time of handling friend update request glusterd updates peer
         file and if DNS has returned multiple hostnames for the same IP, glusterd
         saves all hostnames in peer file.In commit 1fa089e7a2b180e0bdcc1e7e09a63934a2a0c0ef
         We changed the approach to save all key value pairs in single shot.
         In case of a buffer is not having space to store the hostnames glusterd
         writes partial hostname in peer file.

Solution: To avoid the failure increase the buffer length

Change-Id: Iee969d165333e9c5ba69431d474c541b8f12d442
Fixes: #1407
Signed-off-by: Mohit Agrawal <moagrawa@redhat.com>
(cherry picked from commit 6e8e73a06d71382f8f6e3cd83fe72692d19e66ba)


A patch https://review.gluster.org/24837 has been posted that references this issue.

glusterd: Increase buffer length to save multiple hostnames in peer file

Problem: At the time of handling friend update request glusterd updates peer
         file and if DNS has returned multiple hostnames for the same IP, glusterd
         saves all hostnames in peer file.In commit 1fa089e7a2b180e0bdcc1e7e09a63934a2a0c0ef
         We changed the approach to save all key value pairs in single shot.
         In case of a buffer is not having space to store the hostnames glusterd
         writes partial hostname in peer file.

Solution: To avoid the failure increase the buffer length

Change-Id: Iee969d165333e9c5ba69431d474c541b8f12d442
Fixes: #1407
Signed-off-by: Mohit Agrawal <moagrawa@redhat.com>
(cherry picked from commit 6e8e73a06d71382f8f6e3cd83fe72692d19e66ba)


Thank you for your contributions.
Noticed that this issue is not having any activity in last ~6 months! We are marking this issue as stale because it has not had recent activity.
It will be closed in 2 weeks if no one responds with a comment here.

Closing this issue as there was no update since my last update on issue. If this is an issue which is still valid, feel free to open it.
