{
    "commits": [
        {
            "diff": "spring-projects_spring-boot/issue_1091/commit_6dcaec2fefeb45436d1830485796295f7e9ce815.diff",
            "diff_additions": 156,
            "diff_deletions": 6,
            "diff_file_size": 0,
            "files": [
                {
                    "file_additions": 27,
                    "file_deletions": 0,
                    "file_exists": false,
                    "file_name": "spring-boot-actuator/src/test/java/org/springframework/boot/actuate/ActuatorConfigurationClassTests.java",
                    "file_size": 0
                },
                {
                    "file_additions": 2,
                    "file_deletions": 2,
                    "file_exists": false,
                    "file_name": "spring-boot-autoconfigure/src/main/java/org/springframework/boot/autoconfigure/jackson/JacksonAutoConfiguration.java",
                    "file_size": 0
                },
                {
                    "file_additions": 6,
                    "file_deletions": 4,
                    "file_exists": false,
                    "file_name": "spring-boot-autoconfigure/src/main/java/org/springframework/boot/autoconfigure/redis/RedisAutoConfiguration.java",
                    "file_size": 0
                },
                {
                    "file_additions": 27,
                    "file_deletions": 0,
                    "file_exists": false,
                    "file_name": "spring-boot-autoconfigure/src/test/java/org/springframework/boot/autoconfigure/AutoConfigureConfigurationClassTests.java",
                    "file_size": 0
                },
                {
                    "file_additions": 94,
                    "file_deletions": 0,
                    "file_exists": false,
                    "file_name": "spring-boot/src/test/java/org/springframework/boot/test/AbstractConfigurationClassTests.java",
                    "file_size": 0
                }
            ],
            "interesting": {
                "reopened": false,
                "status": true
            },
            "sha": "6dcaec2fefeb45436d1830485796295f7e9ce815"
        },
        {
            "diff": "spring-projects_spring-boot/issue_1091/commit_bebcd60b7c81dc6069861de698fb42f32e6466ea.diff",
            "diff_additions": 1,
            "diff_deletions": 0,
            "diff_file_size": 0,
            "files": [
                {
                    "file_additions": 1,
                    "file_deletions": 0,
                    "file_exists": false,
                    "file_name": "spring-boot/src/main/java/org/springframework/boot/logging/logback/LogbackLoggingSystem.java",
                    "file_size": 0
                }
            ],
            "interesting": {
                "reopened": true,
                "status": true
            },
            "sha": "bebcd60b7c81dc6069861de698fb42f32e6466ea"
        },
        {
            "diff": "spring-projects_spring-boot/issue_1091/commit_cf24af0bfbfdd778bfb076947ea6f012a88f372d.diff",
            "diff_additions": 501,
            "diff_deletions": 347,
            "diff_file_size": 0,
            "files": [
                {
                    "file_additions": 1,
                    "file_deletions": 1,
                    "file_exists": false,
                    "file_name": "spring-boot-actuator/src/main/java/org/springframework/boot/actuate/endpoint/jmx/EndpointMBeanExporter.java",
                    "file_size": 0
                },
                {
                    "file_additions": 2,
                    "file_deletions": 2,
                    "file_exists": false,
                    "file_name": "spring-boot-samples/spring-boot-sample-actuator-log4j/src/main/java/sample/actuator/log4j/SampleActuatorLog4JApplication.java",
                    "file_size": 0
                },
                {
                    "file_additions": 1,
                    "file_deletions": 1,
                    "file_exists": false,
                    "file_name": "spring-boot-samples/spring-boot-sample-actuator-log4j/src/test/java/sample/actuator/log4j/SampleActuatorApplicationTests.java",
                    "file_size": 0
                },
                {
                    "file_additions": 2,
                    "file_deletions": 2,
                    "file_exists": false,
                    "file_name": "spring-boot-samples/spring-boot-sample-actuator-log4j2/src/main/java/sample/actuator/log4j2/SampleActuatorLog4J2Application.java",
                    "file_size": 0
                },
                {
                    "file_additions": 1,
                    "file_deletions": 1,
                    "file_exists": false,
                    "file_name": "spring-boot-samples/spring-boot-sample-actuator-log4j2/src/test/java/sample/actuator/log4j2/SampleActuatorApplicationTests.java",
                    "file_size": 0
                },
                {
                    "file_additions": 3,
                    "file_deletions": 4,
                    "file_exists": false,
                    "file_name": "spring-boot/src/main/java/org/springframework/boot/SpringApplication.java",
                    "file_size": 0
                },
                {
                    "file_additions": 51,
                    "file_deletions": 40,
                    "file_exists": false,
                    "file_name": "spring-boot/src/main/java/org/springframework/boot/logging/AbstractLoggingSystem.java",
                    "file_size": 0
                },
                {
                    "file_additions": 63,
                    "file_deletions": 107,
                    "file_exists": false,
                    "file_name": "spring-boot/src/main/java/org/springframework/boot/logging/LoggingApplicationListener.java",
                    "file_size": 0
                },
                {
                    "file_additions": 21,
                    "file_deletions": 23,
                    "file_exists": false,
                    "file_name": "spring-boot/src/main/java/org/springframework/boot/logging/LoggingSystem.java",
                    "file_size": 0
                },
                {
                    "file_additions": 5,
                    "file_deletions": 4,
                    "file_exists": false,
                    "file_name": "spring-boot/src/main/java/org/springframework/boot/logging/Slf4JLoggingSystem.java",
                    "file_size": 0
                },
                {
                    "file_additions": 33,
                    "file_deletions": 14,
                    "file_exists": false,
                    "file_name": "spring-boot/src/main/java/org/springframework/boot/logging/java/JavaLoggingSystem.java",
                    "file_size": 0
                },
                {
                    "file_additions": 26,
                    "file_deletions": 12,
                    "file_exists": false,
                    "file_name": "spring-boot/src/main/java/org/springframework/boot/logging/log4j/Log4JLoggingSystem.java",
                    "file_size": 0
                },
                {
                    "file_additions": 33,
                    "file_deletions": 25,
                    "file_exists": false,
                    "file_name": "spring-boot/src/main/java/org/springframework/boot/logging/log4j2/Log4J2LoggingSystem.java",
                    "file_size": 0
                },
                {
                    "file_additions": 52,
                    "file_deletions": 18,
                    "file_exists": false,
                    "file_name": "spring-boot/src/main/java/org/springframework/boot/logging/logback/LogbackLoggingSystem.java",
                    "file_size": 0
                },
                {
                    "file_additions": 51,
                    "file_deletions": 0,
                    "file_exists": false,
                    "file_name": "spring-boot/src/test/java/org/springframework/boot/logging/AbstractLoggingSystemTests.java",
                    "file_size": 0
                },
                {
                    "file_additions": 3,
                    "file_deletions": 13,
                    "file_exists": false,
                    "file_name": "spring-boot/src/test/java/org/springframework/boot/logging/LoggingApplicationListenerTests.java",
                    "file_size": 0
                },
                {
                    "file_additions": 54,
                    "file_deletions": 18,
                    "file_exists": false,
                    "file_name": "spring-boot/src/test/java/org/springframework/boot/logging/java/JavaLoggerSystemTests.java",
                    "file_size": 0
                },
                {
                    "file_additions": 34,
                    "file_deletions": 18,
                    "file_exists": false,
                    "file_name": "spring-boot/src/test/java/org/springframework/boot/logging/log4j/Log4JLoggingSystemTests.java",
                    "file_size": 0
                },
                {
                    "file_additions": 35,
                    "file_deletions": 18,
                    "file_exists": false,
                    "file_name": "spring-boot/src/test/java/org/springframework/boot/logging/log4j2/Log4J2LoggingSystemTests.java",
                    "file_size": 0
                },
                {
                    "file_additions": 30,
                    "file_deletions": 26,
                    "file_exists": false,
                    "file_name": "spring-boot/src/test/java/org/springframework/boot/logging/logback/LogbackLoggingSystemTests.java",
                    "file_size": 0
                }
            ],
            "interesting": {
                "reopened": false,
                "status": false
            },
            "sha": "cf24af0bfbfdd778bfb076947ea6f012a88f372d"
        },
        {
            "diff": "spring-projects_spring-boot/issue_1091/commit_6391973ed05aaf34fde02f98481101269e1a25a0.diff",
            "diff_additions": 95,
            "diff_deletions": 13,
            "diff_file_size": 0,
            "files": [
                {
                    "file_additions": 12,
                    "file_deletions": 0,
                    "file_exists": false,
                    "file_name": "spring-boot/src/main/java/org/springframework/boot/logging/AbstractLoggingSystem.java",
                    "file_size": 0
                },
                {
                    "file_additions": 11,
                    "file_deletions": 5,
                    "file_exists": false,
                    "file_name": "spring-boot/src/main/java/org/springframework/boot/logging/LoggingApplicationListener.java",
                    "file_size": 0
                },
                {
                    "file_additions": 2,
                    "file_deletions": 2,
                    "file_exists": false,
                    "file_name": "spring-boot/src/main/java/org/springframework/boot/logging/LoggingSystem.java",
                    "file_size": 0
                },
                {
                    "file_additions": 5,
                    "file_deletions": 0,
                    "file_exists": false,
                    "file_name": "spring-boot/src/main/java/org/springframework/boot/logging/log4j/Log4JLoggingSystem.java",
                    "file_size": 0
                },
                {
                    "file_additions": 59,
                    "file_deletions": 6,
                    "file_exists": false,
                    "file_name": "spring-boot/src/main/java/org/springframework/boot/logging/log4j2/Log4J2LoggingSystem.java",
                    "file_size": 0
                },
                {
                    "file_additions": 6,
                    "file_deletions": 0,
                    "file_exists": false,
                    "file_name": "spring-boot/src/main/java/org/springframework/boot/logging/logback/LogbackLoggingSystem.java",
                    "file_size": 0
                }
            ],
            "interesting": {
                "reopened": false,
                "status": false
            },
            "sha": "6391973ed05aaf34fde02f98481101269e1a25a0"
        }
    ],
    "first_commit": "2014-09-17 18:39:39",
    "last_commit": "2014-12-17 19:33:29",
    "number": 1091,
    "score": 400.0035746201966
}