{
    "category": [
        "memory",
        "multithreading"
    ],
    "commits": [
        {
            "associated_pull_request": [],
            "date": "2020-10-28 13:15:17",
            "diff": "",
            "diff_additions": 0,
            "diff_deletions": 0,
            "diff_file_size": 0,
            "diff_url": "https://github.com/OpenSIPS/opensips/commit/32f739b0d97b94f05838445fd77acb96d96047a2.diff",
            "exists": true,
            "files": [],
            "interesting": {
                "reopen": false,
                "status": true
            },
            "is_parent": true,
            "sha": "32f739b0d97b94f05838445fd77acb96d96047a2"
        },
        {
            "associated_pull_request": [],
            "date": "2020-10-28 13:35:44",
            "diff": "opensips_opensips/issue_2230/commit_ee00d1b58a6580b43de253d9636cff1106e3afc5.diff",
            "diff_additions": 1,
            "diff_deletions": 0,
            "diff_file_size": 13917,
            "diff_url": "https://github.com/OpenSIPS/opensips/commit/ee00d1b58a6580b43de253d9636cff1106e3afc5.diff",
            "exists": true,
            "files": [
                {
                    "file_additions": 1,
                    "file_deletions": 0,
                    "file_exists": true,
                    "file_name": "modules/event_rabbitmq/rabbitmq_send.c",
                    "file_size": 13917
                }
            ],
            "interesting": {
                "reopen": false,
                "status": true
            },
            "is_parent": false,
            "sha": "ee00d1b58a6580b43de253d9636cff1106e3afc5"
        },
        {
            "associated_pull_request": [],
            "date": "2020-10-28 13:35:44",
            "diff": "opensips_opensips/issue_2230/commit_0e5cdf95563560ef586349563e48a7b1975e24fa.diff",
            "diff_additions": 1,
            "diff_deletions": 0,
            "diff_file_size": 13917,
            "diff_url": "https://github.com/OpenSIPS/opensips/commit/0e5cdf95563560ef586349563e48a7b1975e24fa.diff",
            "exists": true,
            "files": [
                {
                    "file_additions": 1,
                    "file_deletions": 0,
                    "file_exists": true,
                    "file_name": "modules/event_rabbitmq/rabbitmq_send.c",
                    "file_size": 13917
                }
            ],
            "interesting": {
                "reopen": false,
                "status": true
            },
            "is_parent": false,
            "sha": "0e5cdf95563560ef586349563e48a7b1975e24fa"
        },
        {
            "associated_pull_request": [],
            "date": "2020-10-28 13:35:44",
            "diff": "opensips_opensips/issue_2230/commit_476c6f9ec5410cd100c8e941f15a191e24b09530.diff",
            "diff_additions": 1,
            "diff_deletions": 0,
            "diff_file_size": 13917,
            "diff_url": "https://github.com/OpenSIPS/opensips/commit/476c6f9ec5410cd100c8e941f15a191e24b09530.diff",
            "exists": true,
            "files": [
                {
                    "file_additions": 1,
                    "file_deletions": 0,
                    "file_exists": true,
                    "file_name": "modules/event_rabbitmq/rabbitmq_send.c",
                    "file_size": 13917
                }
            ],
            "interesting": {
                "reopen": false,
                "status": false
            },
            "is_parent": false,
            "sha": "476c6f9ec5410cd100c8e941f15a191e24b09530"
        }
    ],
    "first_commit": "2020-10-28 13:16:28",
    "last_commit": "2020-10-28 13:37:31",
    "number": 2230,
    "pull_request": "None",
    "score": {
        "accidental_reopen_likely": false,
        "all_labels": [
            "stale"
        ],
        "contains_keywords": [
            "fail",
            "error",
            "test",
            "patch",
            "issu",
            "leak"
        ],
        "fix_size": 4,
        "has_labels": [],
        "intersecting": {
            "computed_score": 0.5,
            "final_commit_size": 2,
            "intersection_size": 1,
            "previous_commits_size": 3
        },
        "is_makefile_based": true,
        "no_new_files": [],
        "no_other_files": true,
        "num_prohibited_files": 44868,
        "prohibited_files": [
            "hal/inc/pinmap_hal.h",
            "Debug/marvin.bin",
            "Debug/marvin.elf",
            "Debug/marvin.hex",
            "Debug/marvin.bin",
            "Debug/marvin.elf",
            "Debug/marvin.hex",
            "inc/spark_utilities.h",
            "Debug/marvin.bin",
            "Debug/marvin.elf"
        ],
        "reopen": false,
        "reopen_events": [
            [
                "2020-10-22 04:26:46",
                "closed"
            ],
            [
                "2020-10-28 13:36:51",
                "commit"
            ],
            [
                "2020-10-28 13:37:08",
                "commit"
            ],
            [
                "2020-10-28 13:37:24",
                "commit"
            ],
            [
                "2020-10-28 13:37:40",
                "commit"
            ]
        ],
        "status": true,
        "strategy": true,
        "total_changes": 3
    }
}