{
    "category": [
        "memory",
        "network/protocols"
    ],
    "commits": [
        {
            "associated_pull_request": [],
            "date": "2019-05-29 07:44:17",
            "diff": "simh_simh/issue_705/commit_45d8c908ba1f153522d9575e373599f1ff19bae8.diff",
            "diff_additions": 3,
            "diff_deletions": 6,
            "diff_file_size": 136759,
            "diff_url": "https://github.com/simh/simh/commit/45d8c908ba1f153522d9575e373599f1ff19bae8.diff",
            "exists": true,
            "files": [
                {
                    "file_additions": 0,
                    "file_deletions": 2,
                    "file_exists": true,
                    "file_name": "PDP10/pdp10_cpu.c",
                    "file_size": 114119
                },
                {
                    "file_additions": 3,
                    "file_deletions": 4,
                    "file_exists": true,
                    "file_name": "PDP10/pdp10_tim.c",
                    "file_size": 22640
                }
            ],
            "interesting": {
                "reopen": false,
                "status": false
            },
            "is_parent": true,
            "sha": "45d8c908ba1f153522d9575e373599f1ff19bae8"
        },
        {
            "associated_pull_request": [],
            "date": "2019-05-30 08:51:52",
            "diff": "simh_simh/issue_705/commit_0195bbda4b552531de527873734fe8b11f50c193.diff",
            "diff_additions": 8,
            "diff_deletions": 6,
            "diff_file_size": 203926,
            "diff_url": "https://github.com/simh/simh/commit/0195bbda4b552531de527873734fe8b11f50c193.diff",
            "exists": true,
            "files": [
                {
                    "file_additions": 1,
                    "file_deletions": 1,
                    "file_exists": true,
                    "file_name": "VAX/vax610_stddev.c",
                    "file_size": 16967
                },
                {
                    "file_additions": 1,
                    "file_deletions": 1,
                    "file_exists": true,
                    "file_name": "VAX/vax630_stddev.c",
                    "file_size": 14488
                },
                {
                    "file_additions": 1,
                    "file_deletions": 1,
                    "file_exists": true,
                    "file_name": "VAX/vax_stddev.c",
                    "file_size": 27141
                },
                {
                    "file_additions": 5,
                    "file_deletions": 3,
                    "file_exists": true,
                    "file_name": "sim_timer.c",
                    "file_size": 145330
                }
            ],
            "interesting": {
                "reopen": true,
                "status": false
            },
            "is_parent": false,
            "sha": "0195bbda4b552531de527873734fe8b11f50c193"
        },
        {
            "associated_pull_request": [],
            "date": "2019-06-01 09:33:02",
            "diff": "simh_simh/issue_705/commit_217463c6e2ffe75c4105a8675dc896adbd03419d.diff",
            "diff_additions": 37,
            "diff_deletions": 31,
            "diff_file_size": 145330,
            "diff_url": "https://github.com/simh/simh/commit/217463c6e2ffe75c4105a8675dc896adbd03419d.diff",
            "exists": true,
            "files": [
                {
                    "file_additions": 37,
                    "file_deletions": 31,
                    "file_exists": true,
                    "file_name": "sim_timer.c",
                    "file_size": 145330
                }
            ],
            "interesting": {
                "reopen": false,
                "status": false
            },
            "is_parent": false,
            "sha": "217463c6e2ffe75c4105a8675dc896adbd03419d"
        },
        {
            "associated_pull_request": [],
            "date": "2019-06-04 03:45:40",
            "diff": "simh_simh/issue_705/commit_9514ea5a58d9a417ecac4cd0016a7b1cd614f83d.diff",
            "diff_additions": 81,
            "diff_deletions": 54,
            "diff_file_size": 145330,
            "diff_url": "https://github.com/simh/simh/commit/9514ea5a58d9a417ecac4cd0016a7b1cd614f83d.diff",
            "exists": true,
            "files": [
                {
                    "file_additions": 81,
                    "file_deletions": 54,
                    "file_exists": true,
                    "file_name": "sim_timer.c",
                    "file_size": 145330
                }
            ],
            "interesting": {
                "reopen": false,
                "status": false
            },
            "is_parent": false,
            "sha": "9514ea5a58d9a417ecac4cd0016a7b1cd614f83d"
        }
    ],
    "first_commit": "2019-05-29 07:44:17",
    "last_commit": "2019-06-04 03:45:40",
    "number": 705,
    "pull_request": "None",
    "score": {
        "accidental_reopen_likely": false,
        "all_labels": [],
        "contains_keywords": [
            "fail",
            "report",
            "chang",
            "confirm",
            "error",
            "bug",
            "problem",
            "crash",
            "test",
            "fix",
            "patch",
            "attempt",
            "issu",
            "work",
            "perform",
            "CI",
            "fault",
            "debug"
        ],
        "fix_size": 182,
        "has_labels": [],
        "intersecting": {
            "computed_score": 0.03007518796992481,
            "final_commit_size": 133,
            "intersection_size": 4,
            "previous_commits_size": 53
        },
        "is_makefile_based": true,
        "no_new_files": [],
        "no_other_files": true,
        "num_prohibited_files": 91068,
        "prohibited_files": [
            "hal/inc/pinmap_hal.h",
            "Debug/marvin.bin",
            "Debug/marvin.elf",
            "Debug/marvin.hex",
            "Debug/marvin.bin",
            "Debug/marvin.elf",
            "Debug/marvin.hex",
            "inc/spark_utilities.h",
            "Debug/marvin.bin",
            "Debug/marvin.elf"
        ],
        "reopen": true,
        "reopen_events": [
            [
                "2019-05-30 08:52:11",
                "commit"
            ],
            [
                "2019-05-30 10:15:57",
                "closed"
            ],
            [
                "2019-05-30 11:21:39",
                "reopened"
            ],
            [
                "2019-06-01 09:33:26",
                "commit"
            ],
            [
                "2019-06-04 03:48:27",
                "commit"
            ],
            [
                "2019-06-19 23:20:32",
                "closed"
            ]
        ],
        "status": false,
        "strategy": true,
        "total_changes": 226
    }
}