{
    "commits": [
        {
            "diff": "spring-projects_spring-framework/issue_22726/commit_208a1ae0ead4e038d26b4c5b992e4372cbc8cb7a.diff",
            "diff_additions": 6,
            "diff_deletions": 1,
            "diff_file_size": 11947,
            "files": [
                {
                    "file_additions": 6,
                    "file_deletions": 1,
                    "file_exists": true,
                    "file_name": "spring-messaging/src/main/java/org/springframework/messaging/handler/invocation/reactive/ChannelSendOperator.java",
                    "file_size": 11947
                }
            ],
            "interesting": {
                "reopened": false,
                "status": false
            },
            "sha": "208a1ae0ead4e038d26b4c5b992e4372cbc8cb7a"
        },
        {
            "diff": "spring-projects_spring-framework/issue_22726/commit_3ac88bed234acf27d539397bafb659a20c1c4339.diff",
            "diff_additions": 385,
            "diff_deletions": 0,
            "diff_file_size": 17828,
            "files": [
                {
                    "file_additions": 280,
                    "file_deletions": 0,
                    "file_exists": true,
                    "file_name": "spring-core/src/main/java/org/springframework/core/log/LogAccessor.java",
                    "file_size": 8616
                },
                {
                    "file_additions": 69,
                    "file_deletions": 0,
                    "file_exists": true,
                    "file_name": "spring-core/src/main/java/org/springframework/core/log/LogMessage.java",
                    "file_size": 7076
                },
                {
                    "file_additions": 36,
                    "file_deletions": 0,
                    "file_exists": true,
                    "file_name": "spring-core/src/test/java/org/springframework/core/log/LogSupportTests.java",
                    "file_size": 2136
                }
            ],
            "interesting": {
                "reopened": true,
                "status": false
            },
            "sha": "3ac88bed234acf27d539397bafb659a20c1c4339"
        },
        {
            "diff": "spring-projects_spring-framework/issue_22726/commit_e2e91e21969ae77cc2d91f9ac3a87b49b8854c31.diff",
            "diff_additions": 36,
            "diff_deletions": 36,
            "diff_file_size": 8616,
            "files": [
                {
                    "file_additions": 36,
                    "file_deletions": 36,
                    "file_exists": true,
                    "file_name": "spring-core/src/main/java/org/springframework/core/log/LogAccessor.java",
                    "file_size": 8616
                }
            ],
            "interesting": {
                "reopened": true,
                "status": false
            },
            "sha": "e2e91e21969ae77cc2d91f9ac3a87b49b8854c31"
        },
        {
            "diff": "spring-projects_spring-framework/issue_22726/commit_9080ae24f98de6353b2582b62ee34ad590ddb95a.diff",
            "diff_additions": 263,
            "diff_deletions": 29,
            "diff_file_size": 17828,
            "files": [
                {
                    "file_additions": 12,
                    "file_deletions": 12,
                    "file_exists": true,
                    "file_name": "spring-core/src/main/java/org/springframework/core/log/LogAccessor.java",
                    "file_size": 8616
                },
                {
                    "file_additions": 213,
                    "file_deletions": 14,
                    "file_exists": true,
                    "file_name": "spring-core/src/main/java/org/springframework/core/log/LogMessage.java",
                    "file_size": 7076
                },
                {
                    "file_additions": 38,
                    "file_deletions": 3,
                    "file_exists": true,
                    "file_name": "spring-core/src/test/java/org/springframework/core/log/LogSupportTests.java",
                    "file_size": 2136
                }
            ],
            "interesting": {
                "reopened": false,
                "status": false
            },
            "sha": "9080ae24f98de6353b2582b62ee34ad590ddb95a"
        },
        {
            "diff": "spring-projects_spring-framework/issue_22726/commit_52f90c303e1960987e43b6700d1a964ea8f9f37d.diff",
            "diff_additions": 24,
            "diff_deletions": 24,
            "diff_file_size": 17828,
            "files": [
                {
                    "file_additions": 12,
                    "file_deletions": 12,
                    "file_exists": true,
                    "file_name": "spring-core/src/main/java/org/springframework/core/log/LogAccessor.java",
                    "file_size": 8616
                },
                {
                    "file_additions": 11,
                    "file_deletions": 11,
                    "file_exists": true,
                    "file_name": "spring-core/src/main/java/org/springframework/core/log/LogMessage.java",
                    "file_size": 7076
                },
                {
                    "file_additions": 1,
                    "file_deletions": 1,
                    "file_exists": true,
                    "file_name": "spring-core/src/test/java/org/springframework/core/log/LogSupportTests.java",
                    "file_size": 2136
                }
            ],
            "interesting": {
                "reopened": false,
                "status": false
            },
            "sha": "52f90c303e1960987e43b6700d1a964ea8f9f37d"
        }
    ],
    "first_commit": "2019-04-02 15:06:11",
    "last_commit": "2019-04-04 08:39:42",
    "number": 22726,
    "score": 176.00497512437812
}