{
    "category": [
        "hardware/OS",
        "build/refactor/preprocessing",
        "feature request"
    ],
    "commits": [
        {
            "associated_pull_request": [],
            "date": "2020-07-29 17:43:17",
            "diff": "surge-synthesizer_surge/issue_2181/commit_ab5762c32d604b6f84349b84b94bdcdd77516272.diff",
            "diff_additions": 36,
            "diff_deletions": 0,
            "diff_file_size": 0,
            "diff_url": "https://github.com/surge-synthesizer/surge/commit/ab5762c32d604b6f84349b84b94bdcdd77516272.diff",
            "exists": true,
            "files": [
                {
                    "file_additions": 19,
                    "file_deletions": 0,
                    "file_exists": false,
                    "file_name": "src/common/gui/CSurgeSlider.cpp",
                    "file_size": 0
                },
                {
                    "file_additions": 17,
                    "file_deletions": 0,
                    "file_exists": false,
                    "file_name": "src/common/gui/SurgeGUIEditor.cpp",
                    "file_size": 0
                }
            ],
            "interesting": {
                "reopen": false,
                "status": false
            },
            "is_parent": true,
            "sha": "ab5762c32d604b6f84349b84b94bdcdd77516272"
        },
        {
            "associated_pull_request": [],
            "date": "2020-08-04 19:14:53",
            "diff": "surge-synthesizer_surge/issue_2181/commit_044fa377540f3d93b800302dd3a3bcaac171794a.diff",
            "diff_additions": 26,
            "diff_deletions": 4,
            "diff_file_size": 0,
            "diff_url": "https://github.com/surge-synthesizer/surge/commit/044fa377540f3d93b800302dd3a3bcaac171794a.diff",
            "exists": true,
            "files": [
                {
                    "file_additions": 11,
                    "file_deletions": 1,
                    "file_exists": false,
                    "file_name": "src/common/gui/CModulationSourceButton.cpp",
                    "file_size": 0
                },
                {
                    "file_additions": 0,
                    "file_deletions": 1,
                    "file_exists": false,
                    "file_name": "src/common/gui/CSurgeSlider.cpp",
                    "file_size": 0
                },
                {
                    "file_additions": 15,
                    "file_deletions": 2,
                    "file_exists": false,
                    "file_name": "src/common/gui/SurgeGUIEditor.cpp",
                    "file_size": 0
                }
            ],
            "interesting": {
                "reopen": false,
                "status": true
            },
            "is_parent": false,
            "sha": "044fa377540f3d93b800302dd3a3bcaac171794a"
        },
        {
            "associated_pull_request": [
                "https://github.com/surge-synthesizer/surge/pull/2427"
            ],
            "date": "2020-07-29 17:43:17",
            "diff": "surge-synthesizer_surge/issue_2181/commit_8e8002e67e43aab7212a8a6a76afb255a1fdcef3.diff",
            "diff_additions": 59,
            "diff_deletions": 1,
            "diff_file_size": 0,
            "diff_url": "https://github.com/surge-synthesizer/surge/commit/8e8002e67e43aab7212a8a6a76afb255a1fdcef3.diff",
            "exists": true,
            "files": [
                {
                    "file_additions": 11,
                    "file_deletions": 1,
                    "file_exists": false,
                    "file_name": "src/common/gui/CModulationSourceButton.cpp",
                    "file_size": 0
                },
                {
                    "file_additions": 18,
                    "file_deletions": 0,
                    "file_exists": false,
                    "file_name": "src/common/gui/CSurgeSlider.cpp",
                    "file_size": 0
                },
                {
                    "file_additions": 30,
                    "file_deletions": 0,
                    "file_exists": false,
                    "file_name": "src/common/gui/SurgeGUIEditor.cpp",
                    "file_size": 0
                }
            ],
            "interesting": {
                "reopen": false,
                "status": false
            },
            "is_parent": false,
            "sha": "8e8002e67e43aab7212a8a6a76afb255a1fdcef3"
        },
        {
            "associated_pull_request": [
                "https://github.com/surge-synthesizer/surge/pull/2427"
            ],
            "date": "2020-08-04 20:27:38",
            "diff": "surge-synthesizer_surge/issue_2181/commit_0b87df17da9bba0ed145b7bca70ca4afa05230fa.diff",
            "diff_additions": 59,
            "diff_deletions": 1,
            "diff_file_size": 0,
            "diff_url": "https://github.com/surge-synthesizer/surge/commit/0b87df17da9bba0ed145b7bca70ca4afa05230fa.diff",
            "exists": true,
            "files": [
                {
                    "file_additions": 11,
                    "file_deletions": 1,
                    "file_exists": false,
                    "file_name": "src/common/gui/CModulationSourceButton.cpp",
                    "file_size": 0
                },
                {
                    "file_additions": 18,
                    "file_deletions": 0,
                    "file_exists": false,
                    "file_name": "src/common/gui/CSurgeSlider.cpp",
                    "file_size": 0
                },
                {
                    "file_additions": 30,
                    "file_deletions": 0,
                    "file_exists": false,
                    "file_name": "src/common/gui/SurgeGUIEditor.cpp",
                    "file_size": 0
                }
            ],
            "interesting": {
                "reopen": false,
                "status": false
            },
            "is_parent": false,
            "sha": "0b87df17da9bba0ed145b7bca70ca4afa05230fa"
        }
    ],
    "first_commit": "2020-08-04 15:36:36",
    "last_commit": "2020-08-04 20:27:38",
    "number": 2181,
    "pull_request": "None",
    "score": {
        "accidental_reopen_likely": false,
        "all_labels": [
            "Feature Request",
            "UI",
            "UX"
        ],
        "contains_keywords": [],
        "fix_size": 93,
        "has_labels": [],
        "intersecting": {
            "computed_score": 0.5161290322580645,
            "final_commit_size": 62,
            "intersection_size": 32,
            "previous_commits_size": 63
        },
        "is_makefile_based": true,
        "no_new_files": [],
        "no_other_files": false,
        "num_prohibited_files": 38005,
        "prohibited_files": [
            "tools/building.py",
            "tools/building.py",
            "tools/building.py",
            "emcc.py",
            "src/library_emmalloc.js",
            "src/shell.js",
            "tests/test_core.py",
            "src/shell.js",
            "tests/test_core.py",
            "src/library.js"
        ],
        "reopen": false,
        "reopen_events": [
            [
                "2020-08-04 19:20:57",
                "commit"
            ],
            [
                "2020-08-04 19:36:17",
                "commit"
            ],
            [
                "2020-08-04 20:27:39",
                "closed"
            ],
            [
                "2020-08-04 20:27:40",
                "commit"
            ]
        ],
        "status": true,
        "strategy": true,
        "total_changes": 186
    }
}