{
    "covered_issues": [
        49,
        47,
        41,
        38,
        37,
        36,
        35,
        34,
        33,
        32,
        31,
        30,
        29,
        28,
        22,
        15,
        14,
        10,
        7,
        3
    ],
    "finished": true
}