{
    "all_issues": 1309,
    "interesting_issues": 2,
    "last_update": "2021-05-18 07:00:53.452097",
    "license": {
        "download": "https://raw.githubusercontent.com/pure-data/pure-data/master/LICENSE.txt",
        "name": "Other"
    },
    "ratio": 0.0015278838808250573,
    "size": 43978,
    "stars": 803,
    "url": "https://github.com/pure-data/pure-data"
}