{
    "commits": [
        {
            "associated_pull_request": [],
            "date": "2020-08-06 13:22:28+00:00",
            "diff": "gluster_glusterfs/issue_1440/commit_fe3a83ecb06bab21b61d64f1c1bcbaa11aca7e80.diff",
            "diff_additions": 29,
            "diff_deletions": 36,
            "diff_file_size": 78964,
            "diff_url": "https://github.com/gluster/glusterfs/commit/fe3a83ecb06bab21b61d64f1c1bcbaa11aca7e80.diff",
            "exists": true,
            "files": [
                {
                    "file_additions": 29,
                    "file_deletions": 36,
                    "file_exists": true,
                    "file_name": "libglusterfs/src/dict.c",
                    "file_size": 78964
                }
            ],
            "interesting": {
                "reopen": false,
                "status": false
            },
            "is_parent": true,
            "sha": "fe3a83ecb06bab21b61d64f1c1bcbaa11aca7e80"
        },
        {
            "associated_pull_request": [],
            "date": "2020-08-19 21:27:38+00:00",
            "diff": "gluster_glusterfs/issue_1440/commit_742358ec1ab488a092d1fd9b2b47c717b627181e.diff",
            "diff_additions": 10,
            "diff_deletions": 4,
            "diff_file_size": 35471,
            "diff_url": "https://github.com/gluster/glusterfs/commit/742358ec1ab488a092d1fd9b2b47c717b627181e.diff",
            "exists": true,
            "files": [
                {
                    "file_additions": 10,
                    "file_deletions": 4,
                    "file_exists": true,
                    "file_name": "xlators/performance/open-behind/src/open-behind.c",
                    "file_size": 35471
                }
            ],
            "interesting": {
                "reopen": true,
                "status": false
            },
            "is_parent": false,
            "sha": "742358ec1ab488a092d1fd9b2b47c717b627181e"
        },
        {
            "associated_pull_request": [],
            "date": "2020-09-04 12:49:50+00:00",
            "diff": "gluster_glusterfs/issue_1440/commit_a1c89afd79a1ed08e37a4b5d17911ae29488eb8c.diff",
            "diff_additions": 52,
            "diff_deletions": 0,
            "diff_file_size": 35471,
            "diff_url": "https://github.com/gluster/glusterfs/commit/a1c89afd79a1ed08e37a4b5d17911ae29488eb8c.diff",
            "exists": true,
            "files": [
                {
                    "file_additions": 52,
                    "file_deletions": 0,
                    "file_exists": true,
                    "file_name": "xlators/performance/open-behind/src/open-behind.c",
                    "file_size": 35471
                }
            ],
            "interesting": {
                "reopen": true,
                "status": false
            },
            "is_parent": false,
            "sha": "a1c89afd79a1ed08e37a4b5d17911ae29488eb8c"
        },
        {
            "associated_pull_request": [],
            "date": "2020-09-04 12:49:50+00:00",
            "diff": "gluster_glusterfs/issue_1440/commit_a5d9edce9b59ee00d2a4027fafba126e82e2fcfd.diff",
            "diff_additions": 52,
            "diff_deletions": 0,
            "diff_file_size": 35471,
            "diff_url": "https://github.com/gluster/glusterfs/commit/a5d9edce9b59ee00d2a4027fafba126e82e2fcfd.diff",
            "exists": true,
            "files": [
                {
                    "file_additions": 52,
                    "file_deletions": 0,
                    "file_exists": true,
                    "file_name": "xlators/performance/open-behind/src/open-behind.c",
                    "file_size": 35471
                }
            ],
            "interesting": {
                "reopen": false,
                "status": false
            },
            "is_parent": false,
            "sha": "a5d9edce9b59ee00d2a4027fafba126e82e2fcfd"
        },
        {
            "associated_pull_request": [],
            "date": "2020-09-04 12:49:50+00:00",
            "diff": "gluster_glusterfs/issue_1440/commit_d8e1e89e1396176969f3fe4bc7d662d8ac5ad7a2.diff",
            "diff_additions": 52,
            "diff_deletions": 0,
            "diff_file_size": 35471,
            "diff_url": "https://github.com/gluster/glusterfs/commit/d8e1e89e1396176969f3fe4bc7d662d8ac5ad7a2.diff",
            "exists": true,
            "files": [
                {
                    "file_additions": 52,
                    "file_deletions": 0,
                    "file_exists": true,
                    "file_name": "xlators/performance/open-behind/src/open-behind.c",
                    "file_size": 35471
                }
            ],
            "interesting": {
                "reopen": false,
                "status": false
            },
            "is_parent": false,
            "sha": "d8e1e89e1396176969f3fe4bc7d662d8ac5ad7a2"
        },
        {
            "associated_pull_request": [],
            "date": "2020-09-04 12:49:50+00:00",
            "diff": "gluster_glusterfs/issue_1440/commit_41aae052b5e3afe64d3e0668643726bab0e77265.diff",
            "diff_additions": 52,
            "diff_deletions": 0,
            "diff_file_size": 35471,
            "diff_url": "https://github.com/gluster/glusterfs/commit/41aae052b5e3afe64d3e0668643726bab0e77265.diff",
            "exists": true,
            "files": [
                {
                    "file_additions": 52,
                    "file_deletions": 0,
                    "file_exists": true,
                    "file_name": "xlators/performance/open-behind/src/open-behind.c",
                    "file_size": 35471
                }
            ],
            "interesting": {
                "reopen": false,
                "status": false
            },
            "is_parent": false,
            "sha": "41aae052b5e3afe64d3e0668643726bab0e77265"
        }
    ],
    "first_commit": "2020-08-20 10:26:58+00:00",
    "last_commit": "2021-01-20 18:20:59+00:00",
    "number": 1440,
    "pull_request": "None",
    "score": {
        "accidental_reopen_likely": false,
        "all_labels": [
            "Type:Bug",
            "wontfix",
            "release 7",
            "release 8"
        ],
        "contains_keywords": [
            "confirm",
            "work",
            "chang",
            "fix",
            "issu",
            "patch",
            "perform",
            "test",
            "leak",
            "error",
            "problem"
        ],
        "fix_size": 66,
        "has_labels": [],
        "intersecting": {
            "computed_score": 1.0,
            "final_commit_size": 53,
            "intersection_size": 53,
            "previous_commits_size": 66
        },
        "is_makefile_based": true,
        "no_new_files": [],
        "no_other_files": false,
        "num_prohibited_files": 262386,
        "prohibited_files": [
            "server/src/main/java/com/genymobile/scrcpy/Device.java",
            "server/src/main/java/com/genymobile/scrcpy/wrappers/SurfaceControl.java",
            "server/src/main/java/com/genymobile/scrcpy/Device.java",
            "server/src/main/java/com/genymobile/scrcpy/wrappers/SurfaceControl.java",
            "app/meson.build",
            "app/scrcpy.1",
            "app/src/common.h",
            "app/src/scrcpy.h",
            "app/src/server.h",
            "server/src/main/java/com/genymobile/scrcpy/Workarounds.java"
        ],
        "reopen": true,
        "reopen_events": [
            [
                "2020-08-20 11:54:58+00:00",
                "closed"
            ],
            [
                "2020-08-20 11:54:58+00:00",
                "commit"
            ],
            [
                "2020-08-20 14:42:36+00:00",
                "reopened"
            ],
            [
                "2020-08-21 10:39:56+00:00",
                "commit"
            ],
            [
                "2020-08-25 02:41:50+00:00",
                "commit"
            ],
            [
                "2020-09-07 12:57:01+00:00",
                "closed"
            ],
            [
                "2020-09-07 12:57:01+00:00",
                "commit"
            ],
            [
                "2020-09-07 13:10:36+00:00",
                "reopened"
            ],
            [
                "2020-09-14 19:45:52+00:00",
                "commit"
            ],
            [
                "2020-09-27 09:13:43+00:00",
                "commit"
            ],
            [
                "2021-04-20 14:43:44+00:00",
                "closed"
            ],
            [
                "2023-03-07 18:06:55+00:00",
                "commit"
            ],
            [
                "2023-03-07 18:06:55+00:00",
                "commit"
            ]
        ],
        "status": false,
        "strategy": true,
        "total_changes": 287
    }
}