{
    "commits": [
        {
            "diff": "spring-projects_spring-boot/issue_17072/commit_20f502661b8d2a979e386bcc11d621d66419f795.diff",
            "diff_additions": 563,
            "diff_deletions": 115,
            "diff_file_size": 77588,
            "files": [
                {
                    "file_additions": 18,
                    "file_deletions": 25,
                    "file_exists": true,
                    "file_name": "spring-boot-project/spring-boot-test/src/test/java/org/springframework/boot/test/web/client/TestRestTemplateTests.java",
                    "file_size": 16302
                },
                {
                    "file_additions": 36,
                    "file_deletions": 0,
                    "file_exists": false,
                    "file_name": "spring-boot-project/spring-boot/src/main/java/org/springframework/boot/web/client/AbstractHttpHeadersDefaultingCustomizer.java",
                    "file_size": 0
                },
                {
                    "file_additions": 11,
                    "file_deletions": 11,
                    "file_exists": false,
                    "file_name": "spring-boot-project/spring-boot/src/main/java/org/springframework/boot/web/client/BasicAuthenticationHeaderDefaultingCustomizer.java",
                    "file_size": 0
                },
                {
                    "file_additions": 36,
                    "file_deletions": 0,
                    "file_exists": false,
                    "file_name": "spring-boot-project/spring-boot/src/main/java/org/springframework/boot/web/client/HttpHeadersCustomizer.java",
                    "file_size": 0
                },
                {
                    "file_additions": 15,
                    "file_deletions": 10,
                    "file_exists": false,
                    "file_name": "spring-boot-project/spring-boot/src/main/java/org/springframework/boot/web/client/HttpHeadersCustomizingClientHttpRequestFactory.java",
                    "file_size": 0
                },
                {
                    "file_additions": 240,
                    "file_deletions": 56,
                    "file_exists": true,
                    "file_name": "spring-boot-project/spring-boot/src/main/java/org/springframework/boot/web/client/RestTemplateBuilder.java",
                    "file_size": 34938
                },
                {
                    "file_additions": 96,
                    "file_deletions": 0,
                    "file_exists": false,
                    "file_name": "spring-boot-project/spring-boot/src/main/java/org/springframework/boot/web/client/SimpleHttpHeaderDefaultingCustomizer.java",
                    "file_size": 0
                },
                {
                    "file_additions": 27,
                    "file_deletions": 8,
                    "file_exists": false,
                    "file_name": "spring-boot-project/spring-boot/src/test/java/org/springframework/boot/web/client/HttpHeadersCustomizingClientHttpRequestFactoryTests.java",
                    "file_size": 0
                },
                {
                    "file_additions": 9,
                    "file_deletions": 5,
                    "file_exists": true,
                    "file_name": "spring-boot-project/spring-boot/src/test/java/org/springframework/boot/web/client/RestTemplateBuilderTests.java",
                    "file_size": 26348
                },
                {
                    "file_additions": 75,
                    "file_deletions": 0,
                    "file_exists": false,
                    "file_name": "spring-boot-project/spring-boot/src/test/java/org/springframework/boot/web/client/SimpleHttpHeaderDefaultingCustomizerTest.java",
                    "file_size": 0
                }
            ],
            "interesting": {
                "reopened": false,
                "status": true
            },
            "sha": "20f502661b8d2a979e386bcc11d621d66419f795"
        },
        {
            "diff": "spring-projects_spring-boot/issue_17072/commit_baf4021b181dd0c84b8c6f0ca6c2d6182551ef5a.diff",
            "diff_additions": 563,
            "diff_deletions": 115,
            "diff_file_size": 77588,
            "files": [
                {
                    "file_additions": 18,
                    "file_deletions": 25,
                    "file_exists": true,
                    "file_name": "spring-boot-project/spring-boot-test/src/test/java/org/springframework/boot/test/web/client/TestRestTemplateTests.java",
                    "file_size": 16302
                },
                {
                    "file_additions": 36,
                    "file_deletions": 0,
                    "file_exists": false,
                    "file_name": "spring-boot-project/spring-boot/src/main/java/org/springframework/boot/web/client/AbstractHttpHeadersDefaultingCustomizer.java",
                    "file_size": 0
                },
                {
                    "file_additions": 11,
                    "file_deletions": 11,
                    "file_exists": false,
                    "file_name": "spring-boot-project/spring-boot/src/main/java/org/springframework/boot/web/client/BasicAuthenticationHeaderDefaultingCustomizer.java",
                    "file_size": 0
                },
                {
                    "file_additions": 36,
                    "file_deletions": 0,
                    "file_exists": false,
                    "file_name": "spring-boot-project/spring-boot/src/main/java/org/springframework/boot/web/client/HttpHeadersCustomizer.java",
                    "file_size": 0
                },
                {
                    "file_additions": 15,
                    "file_deletions": 10,
                    "file_exists": false,
                    "file_name": "spring-boot-project/spring-boot/src/main/java/org/springframework/boot/web/client/HttpHeadersCustomizingClientHttpRequestFactory.java",
                    "file_size": 0
                },
                {
                    "file_additions": 240,
                    "file_deletions": 56,
                    "file_exists": true,
                    "file_name": "spring-boot-project/spring-boot/src/main/java/org/springframework/boot/web/client/RestTemplateBuilder.java",
                    "file_size": 34938
                },
                {
                    "file_additions": 96,
                    "file_deletions": 0,
                    "file_exists": false,
                    "file_name": "spring-boot-project/spring-boot/src/main/java/org/springframework/boot/web/client/SimpleHttpHeaderDefaultingCustomizer.java",
                    "file_size": 0
                },
                {
                    "file_additions": 27,
                    "file_deletions": 8,
                    "file_exists": false,
                    "file_name": "spring-boot-project/spring-boot/src/test/java/org/springframework/boot/web/client/HttpHeadersCustomizingClientHttpRequestFactoryTests.java",
                    "file_size": 0
                },
                {
                    "file_additions": 9,
                    "file_deletions": 5,
                    "file_exists": true,
                    "file_name": "spring-boot-project/spring-boot/src/test/java/org/springframework/boot/web/client/RestTemplateBuilderTests.java",
                    "file_size": 26348
                },
                {
                    "file_additions": 75,
                    "file_deletions": 0,
                    "file_exists": false,
                    "file_name": "spring-boot-project/spring-boot/src/test/java/org/springframework/boot/web/client/SimpleHttpHeaderDefaultingCustomizerTest.java",
                    "file_size": 0
                }
            ],
            "interesting": {
                "reopened": false,
                "status": true
            },
            "sha": "baf4021b181dd0c84b8c6f0ca6c2d6182551ef5a"
        },
        {
            "diff": "spring-projects_spring-boot/issue_17072/commit_d9057617d37d14d4528f5bac6893fd6e5acb1a9c.diff",
            "diff_additions": 562,
            "diff_deletions": 114,
            "diff_file_size": 77588,
            "files": [
                {
                    "file_additions": 18,
                    "file_deletions": 25,
                    "file_exists": true,
                    "file_name": "spring-boot-project/spring-boot-test/src/test/java/org/springframework/boot/test/web/client/TestRestTemplateTests.java",
                    "file_size": 16302
                },
                {
                    "file_additions": 36,
                    "file_deletions": 0,
                    "file_exists": false,
                    "file_name": "spring-boot-project/spring-boot/src/main/java/org/springframework/boot/web/client/AbstractHttpHeadersDefaultingCustomizer.java",
                    "file_size": 0
                },
                {
                    "file_additions": 11,
                    "file_deletions": 11,
                    "file_exists": false,
                    "file_name": "spring-boot-project/spring-boot/src/main/java/org/springframework/boot/web/client/BasicAuthenticationHeaderDefaultingCustomizer.java",
                    "file_size": 0
                },
                {
                    "file_additions": 36,
                    "file_deletions": 0,
                    "file_exists": false,
                    "file_name": "spring-boot-project/spring-boot/src/main/java/org/springframework/boot/web/client/HttpHeadersCustomizer.java",
                    "file_size": 0
                },
                {
                    "file_additions": 15,
                    "file_deletions": 10,
                    "file_exists": false,
                    "file_name": "spring-boot-project/spring-boot/src/main/java/org/springframework/boot/web/client/HttpHeadersCustomizingClientHttpRequestFactory.java",
                    "file_size": 0
                },
                {
                    "file_additions": 240,
                    "file_deletions": 56,
                    "file_exists": true,
                    "file_name": "spring-boot-project/spring-boot/src/main/java/org/springframework/boot/web/client/RestTemplateBuilder.java",
                    "file_size": 34938
                },
                {
                    "file_additions": 96,
                    "file_deletions": 0,
                    "file_exists": false,
                    "file_name": "spring-boot-project/spring-boot/src/main/java/org/springframework/boot/web/client/SimpleHttpHeaderDefaultingCustomizer.java",
                    "file_size": 0
                },
                {
                    "file_additions": 26,
                    "file_deletions": 7,
                    "file_exists": false,
                    "file_name": "spring-boot-project/spring-boot/src/test/java/org/springframework/boot/web/client/HttpHeadersCustomizingClientHttpRequestFactoryTests.java",
                    "file_size": 0
                },
                {
                    "file_additions": 9,
                    "file_deletions": 5,
                    "file_exists": true,
                    "file_name": "spring-boot-project/spring-boot/src/test/java/org/springframework/boot/web/client/RestTemplateBuilderTests.java",
                    "file_size": 26348
                },
                {
                    "file_additions": 75,
                    "file_deletions": 0,
                    "file_exists": false,
                    "file_name": "spring-boot-project/spring-boot/src/test/java/org/springframework/boot/web/client/SimpleHttpHeaderDefaultingCustomizerTest.java",
                    "file_size": 0
                }
            ],
            "interesting": {
                "reopened": false,
                "status": false
            },
            "sha": "d9057617d37d14d4528f5bac6893fd6e5acb1a9c"
        }
    ],
    "first_commit": "2019-06-08 07:20:21",
    "last_commit": "2019-06-11 11:34:29",
    "number": 17072,
    "score": 352.001968503937
}