{
    "covered_issues": [
        103,
        97,
        86,
        81,
        80,
        76,
        75,
        74,
        73,
        71,
        70,
        69,
        68,
        66,
        65,
        64,
        61,
        60,
        58,
        57,
        55,
        54,
        51,
        50,
        49,
        48,
        47,
        46,
        45,
        44,
        43,
        41,
        40,
        39,
        38,
        36,
        34,
        32,
        31,
        30,
        29,
        28,
        27,
        25,
        24,
        23,
        22,
        21,
        20,
        19,
        18,
        17,
        16,
        15,
        14,
        13,
        12,
        11,
        10,
        9,
        8,
        7,
        5,
        4,
        2,
        1
    ],
    "finished": true
}