{
    "commits": [
        {
            "associated_pull_request": [
                "https://github.com/appneta/tcpreplay/pull/504"
            ],
            "date": "2018-10-21 18:40:43+00:00",
            "diff": "",
            "diff_additions": 0,
            "diff_deletions": 0,
            "diff_file_size": 0,
            "diff_url": "https://github.com/appneta/tcpreplay/commit/96f588c68f75843eef50bd0d173fbfb5907f632a.diff",
            "exists": true,
            "files": [],
            "interesting": {
                "reopen": false,
                "status": false
            },
            "is_parent": true,
            "sha": "96f588c68f75843eef50bd0d173fbfb5907f632a"
        },
        {
            "associated_pull_request": [
                "https://github.com/appneta/tcpreplay/pull/505"
            ],
            "date": "2018-10-22 17:56:22+00:00",
            "diff": "appneta_tcpreplay/issue_418/commit_2a2cde585f1adf627e7d049c426fa1e06caac3e4.diff",
            "diff_additions": 42,
            "diff_deletions": 46,
            "diff_file_size": 77420,
            "diff_url": "https://github.com/appneta/tcpreplay/commit/2a2cde585f1adf627e7d049c426fa1e06caac3e4.diff",
            "exists": true,
            "files": [
                {
                    "file_additions": 41,
                    "file_deletions": 36,
                    "file_exists": true,
                    "file_name": "src/send_packets.c",
                    "file_size": 41417
                },
                {
                    "file_additions": 1,
                    "file_deletions": 10,
                    "file_exists": true,
                    "file_name": "src/tcpreplay_api.c",
                    "file_size": 36003
                }
            ],
            "interesting": {
                "reopen": false,
                "status": false
            },
            "is_parent": false,
            "sha": "2a2cde585f1adf627e7d049c426fa1e06caac3e4"
        },
        {
            "associated_pull_request": [],
            "date": "2018-10-22 23:38:08+00:00",
            "diff": "appneta_tcpreplay/issue_418/commit_5a150500289993da2e56cbf140d444b848139bc1.diff",
            "diff_additions": 361,
            "diff_deletions": 267,
            "diff_file_size": 607530,
            "diff_url": "https://github.com/appneta/tcpreplay/commit/5a150500289993da2e56cbf140d444b848139bc1.diff",
            "exists": true,
            "files": [
                {
                    "file_additions": 2,
                    "file_deletions": 1,
                    "file_exists": true,
                    "file_name": "src/bridge.c",
                    "file_size": 12406
                },
                {
                    "file_additions": 1,
                    "file_deletions": 1,
                    "file_exists": true,
                    "file_name": "src/common/cidr.c",
                    "file_size": 14520
                },
                {
                    "file_additions": 4,
                    "file_deletions": 4,
                    "file_exists": true,
                    "file_name": "src/common/flows.c",
                    "file_size": 8774
                },
                {
                    "file_additions": 1,
                    "file_deletions": 1,
                    "file_exists": true,
                    "file_name": "src/common/get.c",
                    "file_size": 26895
                },
                {
                    "file_additions": 6,
                    "file_deletions": 9,
                    "file_exists": true,
                    "file_name": "src/common/interface.c",
                    "file_size": 8606
                },
                {
                    "file_additions": 1,
                    "file_deletions": 3,
                    "file_exists": true,
                    "file_name": "src/common/list.c",
                    "file_size": 4644
                },
                {
                    "file_additions": 0,
                    "file_deletions": 1,
                    "file_exists": true,
                    "file_name": "src/common/sendpacket.c",
                    "file_size": 39273
                },
                {
                    "file_additions": 0,
                    "file_deletions": 5,
                    "file_exists": true,
                    "file_name": "src/common/services.c",
                    "file_size": 3338
                },
                {
                    "file_additions": 53,
                    "file_deletions": 1,
                    "file_exists": true,
                    "file_name": "src/common/utils.c",
                    "file_size": 12730
                },
                {
                    "file_additions": 1,
                    "file_deletions": 1,
                    "file_exists": true,
                    "file_name": "src/fragroute/bget.c",
                    "file_size": 57412
                },
                {
                    "file_additions": 0,
                    "file_deletions": 1,
                    "file_exists": true,
                    "file_name": "src/fragroute/fragroute.c",
                    "file_size": 3220
                },
                {
                    "file_additions": 2,
                    "file_deletions": 2,
                    "file_exists": true,
                    "file_name": "src/fragroute/mod_ip6_opt.c",
                    "file_size": 5107
                },
                {
                    "file_additions": 2,
                    "file_deletions": 2,
                    "file_exists": true,
                    "file_name": "src/fragroute/mod_ip6_qos.c",
                    "file_size": 1706
                },
                {
                    "file_additions": 50,
                    "file_deletions": 54,
                    "file_exists": true,
                    "file_name": "src/send_packets.c",
                    "file_size": 41417
                },
                {
                    "file_additions": 4,
                    "file_deletions": 2,
                    "file_exists": true,
                    "file_name": "src/tcpbridge.c",
                    "file_size": 7393
                },
                {
                    "file_additions": 74,
                    "file_deletions": 38,
                    "file_exists": true,
                    "file_name": "src/tcpedit/edit_packet.c",
                    "file_size": 36228
                },
                {
                    "file_additions": 3,
                    "file_deletions": 3,
                    "file_exists": true,
                    "file_name": "src/tcpedit/fuzzing.c",
                    "file_size": 8355
                },
                {
                    "file_additions": 26,
                    "file_deletions": 16,
                    "file_exists": true,
                    "file_name": "src/tcpedit/plugins/dlt_en10mb/en10mb.c",
                    "file_size": 31187
                },
                {
                    "file_additions": 3,
                    "file_deletions": 7,
                    "file_exists": true,
                    "file_name": "src/tcpedit/plugins/dlt_hdlc/hdlc.c",
                    "file_size": 11265
                },
                {
                    "file_additions": 4,
                    "file_deletions": 7,
                    "file_exists": true,
                    "file_name": "src/tcpedit/plugins/dlt_ieee80211/ieee80211.c",
                    "file_size": 12693
                },
                {
                    "file_additions": 2,
                    "file_deletions": 4,
                    "file_exists": true,
                    "file_name": "src/tcpedit/plugins/dlt_ieee80211/ieee80211_hdr.c",
                    "file_size": 5601
                },
                {
                    "file_additions": 9,
                    "file_deletions": 7,
                    "file_exists": true,
                    "file_name": "src/tcpedit/plugins/dlt_jnpr_ether/jnpr_ether.c",
                    "file_size": 13531
                },
                {
                    "file_additions": 3,
                    "file_deletions": 5,
                    "file_exists": true,
                    "file_name": "src/tcpedit/plugins/dlt_linuxsll/linuxsll.c",
                    "file_size": 9288
                },
                {
                    "file_additions": 26,
                    "file_deletions": 3,
                    "file_exists": true,
                    "file_name": "src/tcpedit/plugins/dlt_plugins.c",
                    "file_size": 13167
                },
                {
                    "file_additions": 3,
                    "file_deletions": 5,
                    "file_exists": true,
                    "file_name": "src/tcpedit/plugins/dlt_pppserial/pppserial.c",
                    "file_size": 10834
                },
                {
                    "file_additions": 10,
                    "file_deletions": 3,
                    "file_exists": true,
                    "file_name": "src/tcpedit/plugins/dlt_radiotap/radiotap.c",
                    "file_size": 11496
                },
                {
                    "file_additions": 2,
                    "file_deletions": 3,
                    "file_exists": true,
                    "file_name": "src/tcpedit/plugins/dlt_user/user.c",
                    "file_size": 11239
                },
                {
                    "file_additions": 6,
                    "file_deletions": 4,
                    "file_exists": true,
                    "file_name": "src/tcpedit/portmap.c",
                    "file_size": 11145
                },
                {
                    "file_additions": 45,
                    "file_deletions": 46,
                    "file_exists": true,
                    "file_name": "src/tcpedit/tcpedit.c",
                    "file_size": 19957
                },
                {
                    "file_additions": 10,
                    "file_deletions": 11,
                    "file_exists": true,
                    "file_name": "src/tcpliveplay.c",
                    "file_size": 46131
                },
                {
                    "file_additions": 1,
                    "file_deletions": 1,
                    "file_exists": true,
                    "file_name": "src/tcpprep.c",
                    "file_size": 20798
                },
                {
                    "file_additions": 1,
                    "file_deletions": 1,
                    "file_exists": true,
                    "file_name": "src/tcpprep_api.c",
                    "file_size": 5675
                },
                {
                    "file_additions": 2,
                    "file_deletions": 1,
                    "file_exists": true,
                    "file_name": "src/tcpreplay.c",
                    "file_size": 8415
                },
                {
                    "file_additions": 1,
                    "file_deletions": 10,
                    "file_exists": true,
                    "file_name": "src/tcpreplay_api.c",
                    "file_size": 36003
                },
                {
                    "file_additions": 1,
                    "file_deletions": 1,
                    "file_exists": true,
                    "file_name": "src/tcprewrite.c",
                    "file_size": 10925
                },
                {
                    "file_additions": 2,
                    "file_deletions": 3,
                    "file_exists": true,
                    "file_name": "src/tree.c",
                    "file_size": 26156
                }
            ],
            "interesting": {
                "reopen": false,
                "status": false
            },
            "is_parent": false,
            "sha": "5a150500289993da2e56cbf140d444b848139bc1"
        },
        {
            "associated_pull_request": [],
            "date": "2018-10-23 05:36:11+00:00",
            "diff": "appneta_tcpreplay/issue_418/commit_640fb2c0484cd36432653799005c5886b0931f96.diff",
            "diff_additions": 262,
            "diff_deletions": 259,
            "diff_file_size": 521869,
            "diff_url": "https://github.com/appneta/tcpreplay/commit/640fb2c0484cd36432653799005c5886b0931f96.diff",
            "exists": true,
            "files": [
                {
                    "file_additions": 2,
                    "file_deletions": 2,
                    "file_exists": true,
                    "file_name": "src/bridge.c",
                    "file_size": 12406
                },
                {
                    "file_additions": 6,
                    "file_deletions": 6,
                    "file_exists": true,
                    "file_name": "src/common/cache.c",
                    "file_size": 11106
                },
                {
                    "file_additions": 3,
                    "file_deletions": 2,
                    "file_exists": true,
                    "file_name": "src/common/cidr.c",
                    "file_size": 14520
                },
                {
                    "file_additions": 26,
                    "file_deletions": 30,
                    "file_exists": true,
                    "file_name": "src/common/get.c",
                    "file_size": 26895
                },
                {
                    "file_additions": 1,
                    "file_deletions": 1,
                    "file_exists": true,
                    "file_name": "src/common/interface.c",
                    "file_size": 8606
                },
                {
                    "file_additions": 16,
                    "file_deletions": 16,
                    "file_exists": true,
                    "file_name": "src/common/sendpacket.c",
                    "file_size": 39273
                },
                {
                    "file_additions": 9,
                    "file_deletions": 9,
                    "file_exists": true,
                    "file_name": "src/common/utils.c",
                    "file_size": 12730
                },
                {
                    "file_additions": 27,
                    "file_deletions": 27,
                    "file_exists": true,
                    "file_name": "src/send_packets.c",
                    "file_size": 41417
                },
                {
                    "file_additions": 4,
                    "file_deletions": 3,
                    "file_exists": true,
                    "file_name": "src/tcpcapinfo.c",
                    "file_size": 12614
                },
                {
                    "file_additions": 13,
                    "file_deletions": 12,
                    "file_exists": true,
                    "file_name": "src/tcpedit/edit_packet.c",
                    "file_size": 36228
                },
                {
                    "file_additions": 18,
                    "file_deletions": 16,
                    "file_exists": true,
                    "file_name": "src/tcpedit/plugins/dlt_en10mb/en10mb.c",
                    "file_size": 31187
                },
                {
                    "file_additions": 13,
                    "file_deletions": 11,
                    "file_exists": true,
                    "file_name": "src/tcpedit/plugins/dlt_hdlc/hdlc.c",
                    "file_size": 11265
                },
                {
                    "file_additions": 19,
                    "file_deletions": 18,
                    "file_exists": true,
                    "file_name": "src/tcpedit/plugins/dlt_ieee80211/ieee80211.c",
                    "file_size": 12693
                },
                {
                    "file_additions": 2,
                    "file_deletions": 2,
                    "file_exists": true,
                    "file_name": "src/tcpedit/plugins/dlt_ieee80211/ieee80211_hdr.c",
                    "file_size": 5601
                },
                {
                    "file_additions": 15,
                    "file_deletions": 12,
                    "file_exists": true,
                    "file_name": "src/tcpedit/plugins/dlt_jnpr_ether/jnpr_ether.c",
                    "file_size": 13531
                },
                {
                    "file_additions": 10,
                    "file_deletions": 9,
                    "file_exists": true,
                    "file_name": "src/tcpedit/plugins/dlt_linuxsll/linuxsll.c",
                    "file_size": 9288
                },
                {
                    "file_additions": 9,
                    "file_deletions": 9,
                    "file_exists": true,
                    "file_name": "src/tcpedit/plugins/dlt_null/null.c",
                    "file_size": 9157
                },
                {
                    "file_additions": 10,
                    "file_deletions": 11,
                    "file_exists": true,
                    "file_name": "src/tcpedit/plugins/dlt_pppserial/pppserial.c",
                    "file_size": 10834
                },
                {
                    "file_additions": 14,
                    "file_deletions": 14,
                    "file_exists": true,
                    "file_name": "src/tcpedit/plugins/dlt_radiotap/radiotap.c",
                    "file_size": 11496
                },
                {
                    "file_additions": 7,
                    "file_deletions": 7,
                    "file_exists": true,
                    "file_name": "src/tcpedit/plugins/dlt_raw/raw.c",
                    "file_size": 8251
                },
                {
                    "file_additions": 9,
                    "file_deletions": 9,
                    "file_exists": true,
                    "file_name": "src/tcpedit/plugins/dlt_user/user.c",
                    "file_size": 11239
                },
                {
                    "file_additions": 2,
                    "file_deletions": 1,
                    "file_exists": true,
                    "file_name": "src/tcpedit/plugins/dlt_user/user_api.c",
                    "file_size": 3147
                },
                {
                    "file_additions": 3,
                    "file_deletions": 4,
                    "file_exists": true,
                    "file_name": "src/tcpedit/tcpedit.c",
                    "file_size": 19957
                },
                {
                    "file_additions": 3,
                    "file_deletions": 7,
                    "file_exists": true,
                    "file_name": "src/tcpliveplay.c",
                    "file_size": 46131
                },
                {
                    "file_additions": 10,
                    "file_deletions": 10,
                    "file_exists": true,
                    "file_name": "src/tcpprep.c",
                    "file_size": 20798
                },
                {
                    "file_additions": 2,
                    "file_deletions": 2,
                    "file_exists": true,
                    "file_name": "src/tcpreplay.c",
                    "file_size": 8415
                },
                {
                    "file_additions": 4,
                    "file_deletions": 4,
                    "file_exists": true,
                    "file_name": "src/tcpreplay_api.c",
                    "file_size": 36003
                },
                {
                    "file_additions": 3,
                    "file_deletions": 3,
                    "file_exists": true,
                    "file_name": "src/tcprewrite.c",
                    "file_size": 10925
                },
                {
                    "file_additions": 2,
                    "file_deletions": 2,
                    "file_exists": true,
                    "file_name": "src/tree.c",
                    "file_size": 26156
                }
            ],
            "interesting": {
                "reopen": true,
                "status": false
            },
            "is_parent": false,
            "sha": "640fb2c0484cd36432653799005c5886b0931f96"
        },
        {
            "associated_pull_request": [
                "https://github.com/appneta/tcpreplay/pull/449"
            ],
            "date": "2018-10-23 17:35:15+00:00",
            "diff": "appneta_tcpreplay/issue_418/commit_e143d00903d87e0830a1ceb4b72c70420e9afa1a.diff",
            "diff_additions": 806,
            "diff_deletions": 509,
            "diff_file_size": 704287,
            "diff_url": "https://github.com/appneta/tcpreplay/commit/e143d00903d87e0830a1ceb4b72c70420e9afa1a.diff",
            "exists": true,
            "files": [
                {
                    "file_additions": 17,
                    "file_deletions": 6,
                    "file_exists": true,
                    "file_name": "libopts/nested.c",
                    "file_size": 23888
                },
                {
                    "file_additions": 2,
                    "file_deletions": 1,
                    "file_exists": true,
                    "file_name": "src/bridge.c",
                    "file_size": 12406
                },
                {
                    "file_additions": 1,
                    "file_deletions": 1,
                    "file_exists": true,
                    "file_name": "src/common/cache.c",
                    "file_size": 11106
                },
                {
                    "file_additions": 3,
                    "file_deletions": 3,
                    "file_exists": true,
                    "file_name": "src/common/cidr.c",
                    "file_size": 14520
                },
                {
                    "file_additions": 5,
                    "file_deletions": 5,
                    "file_exists": true,
                    "file_name": "src/common/flows.c",
                    "file_size": 8774
                },
                {
                    "file_additions": 25,
                    "file_deletions": 29,
                    "file_exists": true,
                    "file_name": "src/common/get.c",
                    "file_size": 26895
                },
                {
                    "file_additions": 6,
                    "file_deletions": 9,
                    "file_exists": true,
                    "file_name": "src/common/interface.c",
                    "file_size": 8606
                },
                {
                    "file_additions": 10,
                    "file_deletions": 17,
                    "file_exists": true,
                    "file_name": "src/common/list.c",
                    "file_size": 4644
                },
                {
                    "file_additions": 4,
                    "file_deletions": 5,
                    "file_exists": true,
                    "file_name": "src/common/sendpacket.c",
                    "file_size": 39273
                },
                {
                    "file_additions": 0,
                    "file_deletions": 5,
                    "file_exists": true,
                    "file_name": "src/common/services.c",
                    "file_size": 3338
                },
                {
                    "file_additions": 141,
                    "file_deletions": 91,
                    "file_exists": true,
                    "file_name": "src/common/tcpdump.c",
                    "file_size": 11994
                },
                {
                    "file_additions": 73,
                    "file_deletions": 1,
                    "file_exists": true,
                    "file_name": "src/common/utils.c",
                    "file_size": 12730
                },
                {
                    "file_additions": 1,
                    "file_deletions": 1,
                    "file_exists": true,
                    "file_name": "src/fragroute/bget.c",
                    "file_size": 57412
                },
                {
                    "file_additions": 0,
                    "file_deletions": 1,
                    "file_exists": true,
                    "file_name": "src/fragroute/fragroute.c",
                    "file_size": 3220
                },
                {
                    "file_additions": 2,
                    "file_deletions": 2,
                    "file_exists": true,
                    "file_name": "src/fragroute/mod_ip6_opt.c",
                    "file_size": 5107
                },
                {
                    "file_additions": 2,
                    "file_deletions": 2,
                    "file_exists": true,
                    "file_name": "src/fragroute/mod_ip6_qos.c",
                    "file_size": 1706
                },
                {
                    "file_additions": 1,
                    "file_deletions": 9,
                    "file_exists": true,
                    "file_name": "src/replay.c",
                    "file_size": 12322
                },
                {
                    "file_additions": 47,
                    "file_deletions": 42,
                    "file_exists": true,
                    "file_name": "src/send_packets.c",
                    "file_size": 41417
                },
                {
                    "file_additions": 5,
                    "file_deletions": 2,
                    "file_exists": true,
                    "file_name": "src/tcpbridge.c",
                    "file_size": 7393
                },
                {
                    "file_additions": 3,
                    "file_deletions": 5,
                    "file_exists": true,
                    "file_name": "src/tcpcapinfo.c",
                    "file_size": 12614
                },
                {
                    "file_additions": 91,
                    "file_deletions": 40,
                    "file_exists": true,
                    "file_name": "src/tcpedit/edit_packet.c",
                    "file_size": 36228
                },
                {
                    "file_additions": 5,
                    "file_deletions": 5,
                    "file_exists": true,
                    "file_name": "src/tcpedit/fuzzing.c",
                    "file_size": 8355
                },
                {
                    "file_additions": 49,
                    "file_deletions": 19,
                    "file_exists": true,
                    "file_name": "src/tcpedit/plugins/dlt_en10mb/en10mb.c",
                    "file_size": 31187
                },
                {
                    "file_additions": 33,
                    "file_deletions": 15,
                    "file_exists": true,
                    "file_name": "src/tcpedit/plugins/dlt_hdlc/hdlc.c",
                    "file_size": 11265
                },
                {
                    "file_additions": 13,
                    "file_deletions": 13,
                    "file_exists": true,
                    "file_name": "src/tcpedit/plugins/dlt_ieee80211/ieee80211.c",
                    "file_size": 12693
                },
                {
                    "file_additions": 2,
                    "file_deletions": 4,
                    "file_exists": true,
                    "file_name": "src/tcpedit/plugins/dlt_ieee80211/ieee80211_hdr.c",
                    "file_size": 5601
                },
                {
                    "file_additions": 13,
                    "file_deletions": 9,
                    "file_exists": true,
                    "file_name": "src/tcpedit/plugins/dlt_jnpr_ether/jnpr_ether.c",
                    "file_size": 13531
                },
                {
                    "file_additions": 12,
                    "file_deletions": 12,
                    "file_exists": true,
                    "file_name": "src/tcpedit/plugins/dlt_linuxsll/linuxsll.c",
                    "file_size": 9288
                },
                {
                    "file_additions": 6,
                    "file_deletions": 2,
                    "file_exists": true,
                    "file_name": "src/tcpedit/plugins/dlt_null/null.c",
                    "file_size": 9157
                },
                {
                    "file_additions": 27,
                    "file_deletions": 4,
                    "file_exists": true,
                    "file_name": "src/tcpedit/plugins/dlt_plugins.c",
                    "file_size": 13167
                },
                {
                    "file_additions": 7,
                    "file_deletions": 6,
                    "file_exists": true,
                    "file_name": "src/tcpedit/plugins/dlt_pppserial/pppserial.c",
                    "file_size": 10834
                },
                {
                    "file_additions": 34,
                    "file_deletions": 13,
                    "file_exists": true,
                    "file_name": "src/tcpedit/plugins/dlt_radiotap/radiotap.c",
                    "file_size": 11496
                },
                {
                    "file_additions": 15,
                    "file_deletions": 10,
                    "file_exists": true,
                    "file_name": "src/tcpedit/plugins/dlt_raw/raw.c",
                    "file_size": 8251
                },
                {
                    "file_additions": 31,
                    "file_deletions": 12,
                    "file_exists": true,
                    "file_name": "src/tcpedit/plugins/dlt_user/user.c",
                    "file_size": 11239
                },
                {
                    "file_additions": 1,
                    "file_deletions": 0,
                    "file_exists": true,
                    "file_name": "src/tcpedit/plugins/dlt_utils.c",
                    "file_size": 7425
                },
                {
                    "file_additions": 6,
                    "file_deletions": 4,
                    "file_exists": true,
                    "file_name": "src/tcpedit/portmap.c",
                    "file_size": 11145
                },
                {
                    "file_additions": 62,
                    "file_deletions": 51,
                    "file_exists": true,
                    "file_name": "src/tcpedit/tcpedit.c",
                    "file_size": 19957
                },
                {
                    "file_additions": 16,
                    "file_deletions": 20,
                    "file_exists": true,
                    "file_name": "src/tcpliveplay.c",
                    "file_size": 46131
                },
                {
                    "file_additions": 7,
                    "file_deletions": 7,
                    "file_exists": true,
                    "file_name": "src/tcpprep.c",
                    "file_size": 20798
                },
                {
                    "file_additions": 1,
                    "file_deletions": 1,
                    "file_exists": true,
                    "file_name": "src/tcpprep_api.c",
                    "file_size": 5675
                },
                {
                    "file_additions": 9,
                    "file_deletions": 1,
                    "file_exists": true,
                    "file_name": "src/tcpreplay.c",
                    "file_size": 8415
                },
                {
                    "file_additions": 10,
                    "file_deletions": 17,
                    "file_exists": true,
                    "file_name": "src/tcpreplay_api.c",
                    "file_size": 36003
                },
                {
                    "file_additions": 3,
                    "file_deletions": 1,
                    "file_exists": true,
                    "file_name": "src/tcprewrite.c",
                    "file_size": 10925
                },
                {
                    "file_additions": 5,
                    "file_deletions": 6,
                    "file_exists": true,
                    "file_name": "src/tree.c",
                    "file_size": 26156
                }
            ],
            "interesting": {
                "reopen": false,
                "status": false
            },
            "is_parent": false,
            "sha": "e143d00903d87e0830a1ceb4b72c70420e9afa1a"
        }
    ],
    "first_commit": "2018-10-21 18:40:43+00:00",
    "last_commit": "2018-10-23 17:35:15+00:00",
    "number": 418,
    "pull_request": "None",
    "score": {
        "accidental_reopen_likely": false,
        "all_labels": [
            "bug"
        ],
        "contains_keywords": [
            "work",
            "chang",
            "fix",
            "issu",
            "test",
            "warn",
            "bug",
            "error"
        ],
        "fix_size": 1492,
        "has_labels": [
            "bug"
        ],
        "intersecting": {
            "computed_score": 0.4912863070539419,
            "final_commit_size": 1205,
            "intersection_size": 592,
            "previous_commits_size": 879
        },
        "is_makefile_based": true,
        "no_new_files": [
            "libopts/nested.c",
            "src/common/tcpdump.c",
            "src/replay.c",
            "src/tcpedit/plugins/dlt_utils.c"
        ],
        "no_other_files": false,
        "num_prohibited_files": 274576,
        "prohibited_files": [
            "server/src/main/java/com/genymobile/scrcpy/Device.java",
            "server/src/main/java/com/genymobile/scrcpy/wrappers/SurfaceControl.java",
            "server/src/main/java/com/genymobile/scrcpy/Device.java",
            "server/src/main/java/com/genymobile/scrcpy/wrappers/SurfaceControl.java",
            "app/meson.build",
            "app/scrcpy.1",
            "app/src/common.h",
            "app/src/scrcpy.h",
            "app/src/server.h",
            "server/src/main/java/com/genymobile/scrcpy/Workarounds.java"
        ],
        "reopen": true,
        "reopen_events": [
            [
                "2018-10-22 17:56:28+00:00",
                "commit"
            ],
            [
                "2018-10-22 17:59:18+00:00",
                "commit"
            ],
            [
                "2018-10-22 18:02:47+00:00",
                "closed"
            ],
            [
                "2018-10-23 05:36:59+00:00",
                "commit"
            ],
            [
                "2018-10-23 05:37:00+00:00",
                "commit"
            ],
            [
                "2018-10-23 05:39:19+00:00",
                "reopened"
            ],
            [
                "2018-10-23 15:31:29+00:00",
                "closed"
            ],
            [
                "2018-10-23 17:36:01+00:00",
                "commit"
            ]
        ],
        "status": false,
        "strategy": true,
        "total_changes": 2552
    }
}