{
    "category": [
        "hardware/OS",
        "GUI"
    ],
    "commits": [
        {
            "associated_pull_request": [],
            "date": "2019-01-11 00:58:33",
            "diff": "flatpak_flatpak/issue_2085/commit_0f2c45be4d36a76dd92b89e834ee03bf0d8c77b9.diff",
            "diff_additions": 51,
            "diff_deletions": 36,
            "diff_file_size": 98999,
            "diff_url": "https://github.com/flatpak/flatpak/commit/0f2c45be4d36a76dd92b89e834ee03bf0d8c77b9.diff",
            "exists": true,
            "files": [
                {
                    "file_additions": 27,
                    "file_deletions": 3,
                    "file_exists": true,
                    "file_name": "app/flatpak-builtins-install.c",
                    "file_size": 23409
                },
                {
                    "file_additions": 9,
                    "file_deletions": 1,
                    "file_exists": true,
                    "file_name": "app/flatpak-builtins-uninstall.c",
                    "file_size": 16745
                },
                {
                    "file_additions": 9,
                    "file_deletions": 5,
                    "file_exists": true,
                    "file_name": "app/flatpak-builtins-update.c",
                    "file_size": 11375
                },
                {
                    "file_additions": 6,
                    "file_deletions": 27,
                    "file_exists": true,
                    "file_name": "app/flatpak-cli-transaction.c",
                    "file_size": 47470
                }
            ],
            "interesting": {
                "reopen": false,
                "status": false
            },
            "is_parent": true,
            "sha": "0f2c45be4d36a76dd92b89e834ee03bf0d8c77b9"
        },
        {
            "associated_pull_request": [],
            "date": "2019-01-11 14:29:53",
            "diff": "flatpak_flatpak/issue_2085/commit_e2297146053e14414283a342eee0cc21326d33bf.diff",
            "diff_additions": 23,
            "diff_deletions": 0,
            "diff_file_size": 582743,
            "diff_url": "https://github.com/flatpak/flatpak/commit/e2297146053e14414283a342eee0cc21326d33bf.diff",
            "exists": true,
            "files": [
                {
                    "file_additions": 23,
                    "file_deletions": 0,
                    "file_exists": true,
                    "file_name": "common/flatpak-dir.c",
                    "file_size": 582743
                }
            ],
            "interesting": {
                "reopen": false,
                "status": true
            },
            "is_parent": false,
            "sha": "e2297146053e14414283a342eee0cc21326d33bf"
        },
        {
            "associated_pull_request": [],
            "date": "2019-01-11 14:29:53",
            "diff": "flatpak_flatpak/issue_2085/commit_cb30e7ef4e9505437a323f43186d1cba33d764a2.diff",
            "diff_additions": 22,
            "diff_deletions": 0,
            "diff_file_size": 582743,
            "diff_url": "https://github.com/flatpak/flatpak/commit/cb30e7ef4e9505437a323f43186d1cba33d764a2.diff",
            "exists": true,
            "files": [
                {
                    "file_additions": 22,
                    "file_deletions": 0,
                    "file_exists": true,
                    "file_name": "common/flatpak-dir.c",
                    "file_size": 582743
                }
            ],
            "interesting": {
                "reopen": false,
                "status": false
            },
            "is_parent": false,
            "sha": "cb30e7ef4e9505437a323f43186d1cba33d764a2"
        },
        {
            "associated_pull_request": [],
            "date": "2019-01-11 14:29:53",
            "diff": "flatpak_flatpak/issue_2085/commit_cb30e7ef4e9505437a323f43186d1cba33d764a2.diff",
            "diff_additions": 22,
            "diff_deletions": 0,
            "diff_file_size": 582743,
            "diff_url": "https://github.com/flatpak/flatpak/commit/cb30e7ef4e9505437a323f43186d1cba33d764a2.diff",
            "exists": true,
            "files": [
                {
                    "file_additions": 22,
                    "file_deletions": 0,
                    "file_exists": true,
                    "file_name": "common/flatpak-dir.c",
                    "file_size": 582743
                }
            ],
            "interesting": {
                "reopen": false,
                "status": false
            },
            "is_parent": false,
            "sha": "cb30e7ef4e9505437a323f43186d1cba33d764a2"
        }
    ],
    "first_commit": "2019-01-11 11:42:13",
    "last_commit": "2019-01-14 11:55:12",
    "number": 2085,
    "pull_request": "None",
    "score": {
        "accidental_reopen_likely": false,
        "all_labels": [
            "bug"
        ],
        "contains_keywords": [
            "error",
            "problem",
            "test",
            "remov",
            "issu"
        ],
        "fix_size": 46,
        "has_labels": [
            "bug"
        ],
        "intersecting": {
            "computed_score": 1.0,
            "final_commit_size": 23,
            "intersection_size": 23,
            "previous_commits_size": 46
        },
        "is_makefile_based": true,
        "no_new_files": [],
        "no_other_files": false,
        "num_prohibited_files": 71432,
        "prohibited_files": [
            "hal/inc/pinmap_hal.h",
            "Debug/marvin.bin",
            "Debug/marvin.elf",
            "Debug/marvin.hex",
            "Debug/marvin.bin",
            "Debug/marvin.elf",
            "Debug/marvin.hex",
            "inc/spark_utilities.h",
            "Debug/marvin.bin",
            "Debug/marvin.elf"
        ],
        "reopen": false,
        "reopen_events": [
            [
                "2019-01-11 14:32:35",
                "commit"
            ],
            [
                "2019-01-14 11:55:15",
                "commit"
            ],
            [
                "2019-01-14 12:05:14",
                "closed"
            ],
            [
                "2019-01-14 12:05:14",
                "commit"
            ]
        ],
        "status": true,
        "strategy": true,
        "total_changes": 154
    }
}