{
    "category": [
        "control flow"
    ],
    "commits": [
        {
            "associated_pull_request": [],
            "date": "2016-06-06 22:32:01",
            "diff": "jemalloc_jemalloc/issue_390/commit_02a475d89aad1a7f94b3a102923a6527e05ca055.diff",
            "diff_additions": 2,
            "diff_deletions": 3,
            "diff_file_size": 38162,
            "diff_url": "https://github.com/jemalloc/jemalloc/commit/02a475d89aad1a7f94b3a102923a6527e05ca055.diff",
            "exists": true,
            "files": [
                {
                    "file_additions": 2,
                    "file_deletions": 3,
                    "file_exists": true,
                    "file_name": "src/extent.c",
                    "file_size": 38162
                }
            ],
            "interesting": {
                "reopen": false,
                "status": false
            },
            "is_parent": true,
            "sha": "02a475d89aad1a7f94b3a102923a6527e05ca055"
        },
        {
            "associated_pull_request": [],
            "date": "2016-06-07 20:37:22",
            "diff": "jemalloc_jemalloc/issue_390/commit_cc289f40b6e7b119566abf8a1c09c97e08597a3d.diff",
            "diff_additions": 78,
            "diff_deletions": 25,
            "diff_file_size": 38162,
            "diff_url": "https://github.com/jemalloc/jemalloc/commit/cc289f40b6e7b119566abf8a1c09c97e08597a3d.diff",
            "exists": true,
            "files": [
                {
                    "file_additions": 78,
                    "file_deletions": 25,
                    "file_exists": true,
                    "file_name": "src/extent.c",
                    "file_size": 38162
                }
            ],
            "interesting": {
                "reopen": true,
                "status": false
            },
            "is_parent": false,
            "sha": "cc289f40b6e7b119566abf8a1c09c97e08597a3d"
        },
        {
            "associated_pull_request": [],
            "date": "2016-06-07 21:00:58",
            "diff": "jemalloc_jemalloc/issue_390/commit_09d7bdb314ec4d6a8618d6958809b540f8d3cff6.diff",
            "diff_additions": 62,
            "diff_deletions": 20,
            "diff_file_size": 0,
            "diff_url": "https://github.com/jemalloc/jemalloc/commit/09d7bdb314ec4d6a8618d6958809b540f8d3cff6.diff",
            "exists": true,
            "files": [
                {
                    "file_additions": 62,
                    "file_deletions": 20,
                    "file_exists": false,
                    "file_name": "src/chunk.c",
                    "file_size": 0
                }
            ],
            "interesting": {
                "reopen": false,
                "status": false
            },
            "is_parent": false,
            "sha": "09d7bdb314ec4d6a8618d6958809b540f8d3cff6"
        }
    ],
    "first_commit": "2016-06-06 22:32:01",
    "last_commit": "2016-06-07 21:00:58",
    "number": 390,
    "pull_request": "None",
    "score": {
        "accidental_reopen_likely": false,
        "all_labels": [
            "bug",
            "portability"
        ],
        "contains_keywords": [
            "work",
            "report",
            "fix",
            "fault",
            "test",
            "issu",
            "crash"
        ],
        "fix_size": 183,
        "has_labels": [
            "bug"
        ],
        "intersecting": {
            "computed_score": 0.0,
            "final_commit_size": 81,
            "intersection_size": 0,
            "previous_commits_size": 102
        },
        "is_makefile_based": true,
        "no_new_files": [
            "src/chunk.c"
        ],
        "no_other_files": true,
        "num_prohibited_files": 12852,
        "prohibited_files": [
            "kill.h",
            "meminfo.h",
            "kill.h",
            "meminfo.h",
            "kill.h",
            "meminfo.h",
            "testsuite_cli_test.go",
            "testsuite_cli_test.go",
            "common.mk",
            "i3bar/include/draw_util.h"
        ],
        "reopen": true,
        "reopen_events": [
            [
                "2016-06-07 20:38:36",
                "closed"
            ],
            [
                "2016-06-07 20:38:36",
                "commit"
            ],
            [
                "2016-06-07 20:38:42",
                "reopened"
            ],
            [
                "2016-06-08 18:48:45",
                "commit"
            ],
            [
                "2016-06-08 19:01:39",
                "closed"
            ]
        ],
        "status": false,
        "strategy": true,
        "total_changes": 190
    }
}