{
    "commits": [
        {
            "associated_pull_request": [],
            "date": "2020-12-06 23:12:04+00:00",
            "diff": "",
            "diff_additions": 0,
            "diff_deletions": 0,
            "diff_file_size": 0,
            "diff_url": "https://github.com/eclipse/mosquitto/commit/0d747673d395b97df794d5f5b00ede67b64da005.diff",
            "exists": true,
            "files": [],
            "interesting": {
                "reopen": false,
                "status": false
            },
            "is_parent": true,
            "sha": "0d747673d395b97df794d5f5b00ede67b64da005"
        },
        {
            "associated_pull_request": [],
            "date": "2020-12-09 11:39:53+00:00",
            "diff": "eclipse_mosquitto/issue_1934/commit_9968e35981a2dae93806369f1aa8b737978e84bc.diff",
            "diff_additions": 7,
            "diff_deletions": 4,
            "diff_file_size": 7864,
            "diff_url": "https://github.com/eclipse/mosquitto/commit/9968e35981a2dae93806369f1aa8b737978e84bc.diff",
            "exists": true,
            "files": [
                {
                    "file_additions": 7,
                    "file_deletions": 4,
                    "file_exists": true,
                    "file_name": "src/mux_poll.c",
                    "file_size": 7864
                }
            ],
            "interesting": {
                "reopen": true,
                "status": false
            },
            "is_parent": false,
            "sha": "9968e35981a2dae93806369f1aa8b737978e84bc"
        },
        {
            "associated_pull_request": [],
            "date": "2020-12-22 16:48:57+00:00",
            "diff": "eclipse_mosquitto/issue_1934/commit_97d9f471c3ecbde6bdf0c2582f7cb6c37699a40e.diff",
            "diff_additions": 3,
            "diff_deletions": 6,
            "diff_file_size": 27237,
            "diff_url": "https://github.com/eclipse/mosquitto/commit/97d9f471c3ecbde6bdf0c2582f7cb6c37699a40e.diff",
            "exists": true,
            "files": [
                {
                    "file_additions": 3,
                    "file_deletions": 3,
                    "file_exists": true,
                    "file_name": "src/mux_poll.c",
                    "file_size": 7864
                },
                {
                    "file_additions": 0,
                    "file_deletions": 3,
                    "file_exists": true,
                    "file_name": "src/websockets.c",
                    "file_size": 19373
                }
            ],
            "interesting": {
                "reopen": false,
                "status": false
            },
            "is_parent": false,
            "sha": "97d9f471c3ecbde6bdf0c2582f7cb6c37699a40e"
        },
        {
            "associated_pull_request": [],
            "date": "2020-12-22 16:48:57+00:00",
            "diff": "eclipse_mosquitto/issue_1934/commit_97d9f471c3ecbde6bdf0c2582f7cb6c37699a40e.diff",
            "diff_additions": 3,
            "diff_deletions": 6,
            "diff_file_size": 27237,
            "diff_url": "https://github.com/eclipse/mosquitto/commit/97d9f471c3ecbde6bdf0c2582f7cb6c37699a40e.diff",
            "exists": true,
            "files": [
                {
                    "file_additions": 3,
                    "file_deletions": 3,
                    "file_exists": true,
                    "file_name": "src/mux_poll.c",
                    "file_size": 7864
                },
                {
                    "file_additions": 0,
                    "file_deletions": 3,
                    "file_exists": true,
                    "file_name": "src/websockets.c",
                    "file_size": 19373
                }
            ],
            "interesting": {
                "reopen": false,
                "status": false
            },
            "is_parent": false,
            "sha": "97d9f471c3ecbde6bdf0c2582f7cb6c37699a40e"
        },
        {
            "associated_pull_request": [],
            "date": "2020-12-22 16:48:57+00:00",
            "diff": "eclipse_mosquitto/issue_1934/commit_156e3c6fb0177e223af1883c78713eb3edd52487.diff",
            "diff_additions": 3,
            "diff_deletions": 6,
            "diff_file_size": 27237,
            "diff_url": "https://github.com/eclipse/mosquitto/commit/156e3c6fb0177e223af1883c78713eb3edd52487.diff",
            "exists": true,
            "files": [
                {
                    "file_additions": 3,
                    "file_deletions": 3,
                    "file_exists": true,
                    "file_name": "src/mux_poll.c",
                    "file_size": 7864
                },
                {
                    "file_additions": 0,
                    "file_deletions": 3,
                    "file_exists": true,
                    "file_name": "src/websockets.c",
                    "file_size": 19373
                }
            ],
            "interesting": {
                "reopen": false,
                "status": false
            },
            "is_parent": false,
            "sha": "156e3c6fb0177e223af1883c78713eb3edd52487"
        }
    ],
    "first_commit": "2020-12-06 23:12:04+00:00",
    "last_commit": "2021-01-04 07:47:27+00:00",
    "number": 1934,
    "pull_request": "None",
    "score": {
        "accidental_reopen_likely": false,
        "all_labels": [],
        "contains_keywords": [
            "work",
            "chang",
            "fix",
            "issu",
            "debug",
            "test",
            "bug",
            "error",
            "problem"
        ],
        "fix_size": 17,
        "has_labels": [],
        "intersecting": {
            "computed_score": 1.0,
            "final_commit_size": 8,
            "intersection_size": 8,
            "previous_commits_size": 17
        },
        "is_makefile_based": true,
        "no_new_files": [],
        "no_other_files": true,
        "num_prohibited_files": 101064,
        "prohibited_files": [
            "server/src/main/java/com/genymobile/scrcpy/Device.java",
            "server/src/main/java/com/genymobile/scrcpy/wrappers/SurfaceControl.java",
            "server/src/main/java/com/genymobile/scrcpy/Device.java",
            "server/src/main/java/com/genymobile/scrcpy/wrappers/SurfaceControl.java",
            "app/meson.build",
            "app/scrcpy.1",
            "app/src/common.h",
            "app/src/scrcpy.h",
            "app/src/server.h",
            "server/src/main/java/com/genymobile/scrcpy/Workarounds.java"
        ],
        "reopen": true,
        "reopen_events": [
            [
                "2020-12-09 11:40:08+00:00",
                "commit"
            ],
            [
                "2020-12-10 15:11:39+00:00",
                "closed"
            ],
            [
                "2020-12-10 15:11:39+00:00",
                "commit"
            ],
            [
                "2020-12-11 11:34:28+00:00",
                "reopened"
            ],
            [
                "2020-12-22 16:49:11+00:00",
                "commit"
            ],
            [
                "2020-12-22 23:01:31+00:00",
                "closed"
            ],
            [
                "2020-12-22 23:01:31+00:00",
                "commit"
            ],
            [
                "2021-01-04 07:47:32+00:00",
                "commit"
            ],
            [
                "2021-01-04 07:47:33+00:00",
                "commit"
            ]
        ],
        "status": false,
        "strategy": true,
        "total_changes": 38
    }
}