{
    "covered_issues": [
        332,
        321,
        318,
        312,
        304,
        303,
        301,
        300,
        299,
        298,
        297,
        296,
        293,
        292,
        291,
        289,
        287,
        286,
        284,
        283,
        281,
        280,
        279,
        278,
        277,
        276,
        275,
        274,
        273,
        272,
        270,
        269,
        268,
        267,
        266,
        265,
        264,
        263,
        262,
        261,
        260,
        258,
        257,
        256,
        255,
        254,
        251,
        250,
        249,
        248,
        247,
        245,
        244,
        243,
        242,
        241,
        235,
        234,
        232,
        231,
        228,
        226,
        221,
        219,
        218,
        217,
        216,
        214,
        213,
        212,
        210,
        209,
        208,
        205,
        204,
        202,
        201,
        200,
        199,
        197,
        196,
        181,
        180,
        179,
        176,
        175,
        173,
        157,
        156,
        154,
        151,
        149,
        145,
        143,
        142,
        141,
        136,
        135,
        134,
        131,
        129,
        126,
        125,
        122,
        121,
        119,
        112,
        111,
        110,
        109,
        108,
        107,
        103,
        100,
        99,
        95,
        90,
        89,
        84,
        80,
        75,
        74,
        73,
        72,
        70,
        69,
        67,
        66,
        64,
        61,
        57,
        55,
        54,
        53,
        52,
        51,
        50,
        49,
        48,
        46,
        45,
        39,
        38,
        37,
        35,
        29,
        26,
        16,
        9,
        8,
        7,
        6,
        3
    ],
    "finished": true
}