{
    "category": [
        "GUI",
        "wrong API usage"
    ],
    "commits": [
        {
            "associated_pull_request": [
                "https://github.com/dunst-project/dunst/pull/550"
            ],
            "date": "2018-10-10 14:59:30",
            "diff": "dunst-project_dunst/issue_546/commit_f12f1094edf7deb9fad831dfd48962ca9576c8c6.diff",
            "diff_additions": 164,
            "diff_deletions": 144,
            "diff_file_size": 226329,
            "diff_url": "https://github.com/dunst-project/dunst/commit/f12f1094edf7deb9fad831dfd48962ca9576c8c6.diff",
            "exists": true,
            "files": [
                {
                    "file_additions": 4,
                    "file_deletions": 6,
                    "file_exists": true,
                    "file_name": "src/dbus.c",
                    "file_size": 34788
                },
                {
                    "file_additions": 1,
                    "file_deletions": 5,
                    "file_exists": true,
                    "file_name": "src/draw.c",
                    "file_size": 28078
                },
                {
                    "file_additions": 14,
                    "file_deletions": 14,
                    "file_exists": true,
                    "file_name": "src/icon.c",
                    "file_size": 14052
                },
                {
                    "file_additions": 11,
                    "file_deletions": 9,
                    "file_exists": true,
                    "file_name": "src/log.c",
                    "file_size": 3077
                },
                {
                    "file_additions": 9,
                    "file_deletions": 12,
                    "file_exists": true,
                    "file_name": "src/notification.c",
                    "file_size": 23113
                },
                {
                    "file_additions": 11,
                    "file_deletions": 11,
                    "file_exists": true,
                    "file_name": "src/option_parser.c",
                    "file_size": 20696
                },
                {
                    "file_additions": 4,
                    "file_deletions": 4,
                    "file_exists": true,
                    "file_name": "src/queues.c",
                    "file_size": 18725
                },
                {
                    "file_additions": 92,
                    "file_deletions": 65,
                    "file_exists": true,
                    "file_name": "src/settings.c",
                    "file_size": 34357
                },
                {
                    "file_additions": 8,
                    "file_deletions": 9,
                    "file_exists": true,
                    "file_name": "src/utils.c",
                    "file_size": 6563
                },
                {
                    "file_additions": 2,
                    "file_deletions": 1,
                    "file_exists": true,
                    "file_name": "src/x11/screen.c",
                    "file_size": 12844
                },
                {
                    "file_additions": 8,
                    "file_deletions": 8,
                    "file_exists": true,
                    "file_name": "src/x11/x.c",
                    "file_size": 30036
                }
            ],
            "interesting": {
                "reopen": false,
                "status": false
            },
            "is_parent": true,
            "sha": "f12f1094edf7deb9fad831dfd48962ca9576c8c6"
        },
        {
            "associated_pull_request": [],
            "date": "2018-11-02 11:59:08",
            "diff": "dunst-project_dunst/issue_546/commit_f7b9687db30a4da622825adfade49b6e6b169800.diff",
            "diff_additions": 70,
            "diff_deletions": 0,
            "diff_file_size": 17925,
            "diff_url": "https://github.com/dunst-project/dunst/commit/f7b9687db30a4da622825adfade49b6e6b169800.diff",
            "exists": true,
            "files": [
                {
                    "file_additions": 65,
                    "file_deletions": 0,
                    "file_exists": true,
                    "file_name": "src/markup.c",
                    "file_size": 10892
                },
                {
                    "file_additions": 5,
                    "file_deletions": 0,
                    "file_exists": true,
                    "file_name": "test/markup.c",
                    "file_size": 7033
                }
            ],
            "interesting": {
                "reopen": false,
                "status": false
            },
            "is_parent": false,
            "sha": "f7b9687db30a4da622825adfade49b6e6b169800"
        },
        {
            "associated_pull_request": [],
            "date": "2018-11-02 11:59:08",
            "diff": "dunst-project_dunst/issue_546/commit_86e9f1c83974d0fb4ffe1cfdd81292d4cea8d0e3.diff",
            "diff_additions": 70,
            "diff_deletions": 0,
            "diff_file_size": 17925,
            "diff_url": "https://github.com/dunst-project/dunst/commit/86e9f1c83974d0fb4ffe1cfdd81292d4cea8d0e3.diff",
            "exists": true,
            "files": [
                {
                    "file_additions": 65,
                    "file_deletions": 0,
                    "file_exists": true,
                    "file_name": "src/markup.c",
                    "file_size": 10892
                },
                {
                    "file_additions": 5,
                    "file_deletions": 0,
                    "file_exists": true,
                    "file_name": "test/markup.c",
                    "file_size": 7033
                }
            ],
            "interesting": {
                "reopen": false,
                "status": false
            },
            "is_parent": false,
            "sha": "86e9f1c83974d0fb4ffe1cfdd81292d4cea8d0e3"
        },
        {
            "associated_pull_request": [],
            "date": "2018-11-02 11:59:08",
            "diff": "dunst-project_dunst/issue_546/commit_b0f388a0ec7c70b71b72a0366403a378a4ca648e.diff",
            "diff_additions": 68,
            "diff_deletions": 0,
            "diff_file_size": 17925,
            "diff_url": "https://github.com/dunst-project/dunst/commit/b0f388a0ec7c70b71b72a0366403a378a4ca648e.diff",
            "exists": true,
            "files": [
                {
                    "file_additions": 63,
                    "file_deletions": 0,
                    "file_exists": true,
                    "file_name": "src/markup.c",
                    "file_size": 10892
                },
                {
                    "file_additions": 5,
                    "file_deletions": 0,
                    "file_exists": true,
                    "file_name": "test/markup.c",
                    "file_size": 7033
                }
            ],
            "interesting": {
                "reopen": false,
                "status": false
            },
            "is_parent": false,
            "sha": "b0f388a0ec7c70b71b72a0366403a378a4ca648e"
        },
        {
            "associated_pull_request": [],
            "date": "2018-11-02 11:59:08",
            "diff": "dunst-project_dunst/issue_546/commit_dc8df9e20a5c96f1e3baf2f77b2514601b87d589.diff",
            "diff_additions": 78,
            "diff_deletions": 0,
            "diff_file_size": 17925,
            "diff_url": "https://github.com/dunst-project/dunst/commit/dc8df9e20a5c96f1e3baf2f77b2514601b87d589.diff",
            "exists": true,
            "files": [
                {
                    "file_additions": 69,
                    "file_deletions": 0,
                    "file_exists": true,
                    "file_name": "src/markup.c",
                    "file_size": 10892
                },
                {
                    "file_additions": 9,
                    "file_deletions": 0,
                    "file_exists": true,
                    "file_name": "test/markup.c",
                    "file_size": 7033
                }
            ],
            "interesting": {
                "reopen": false,
                "status": false
            },
            "is_parent": false,
            "sha": "dc8df9e20a5c96f1e3baf2f77b2514601b87d589"
        },
        {
            "associated_pull_request": [],
            "date": "2018-11-02 11:59:08",
            "diff": "dunst-project_dunst/issue_546/commit_5a0467008e5f69f3a8b7e40b4ee9df2a462f0bcc.diff",
            "diff_additions": 79,
            "diff_deletions": 0,
            "diff_file_size": 17925,
            "diff_url": "https://github.com/dunst-project/dunst/commit/5a0467008e5f69f3a8b7e40b4ee9df2a462f0bcc.diff",
            "exists": true,
            "files": [
                {
                    "file_additions": 68,
                    "file_deletions": 0,
                    "file_exists": true,
                    "file_name": "src/markup.c",
                    "file_size": 10892
                },
                {
                    "file_additions": 11,
                    "file_deletions": 0,
                    "file_exists": true,
                    "file_name": "test/markup.c",
                    "file_size": 7033
                }
            ],
            "interesting": {
                "reopen": false,
                "status": true
            },
            "is_parent": false,
            "sha": "5a0467008e5f69f3a8b7e40b4ee9df2a462f0bcc"
        },
        {
            "associated_pull_request": [],
            "date": "2018-11-02 11:59:08",
            "diff": "dunst-project_dunst/issue_546/commit_80d9f1ad5b77ae47d08a3be698bcf20ce58e2ac5.diff",
            "diff_additions": 85,
            "diff_deletions": 0,
            "diff_file_size": 17925,
            "diff_url": "https://github.com/dunst-project/dunst/commit/80d9f1ad5b77ae47d08a3be698bcf20ce58e2ac5.diff",
            "exists": true,
            "files": [
                {
                    "file_additions": 74,
                    "file_deletions": 0,
                    "file_exists": true,
                    "file_name": "src/markup.c",
                    "file_size": 10892
                },
                {
                    "file_additions": 11,
                    "file_deletions": 0,
                    "file_exists": true,
                    "file_name": "test/markup.c",
                    "file_size": 7033
                }
            ],
            "interesting": {
                "reopen": false,
                "status": false
            },
            "is_parent": false,
            "sha": "80d9f1ad5b77ae47d08a3be698bcf20ce58e2ac5"
        },
        {
            "associated_pull_request": [
                "https://github.com/dunst-project/dunst/pull/558"
            ],
            "date": "2018-11-02 11:59:08",
            "diff": "dunst-project_dunst/issue_546/commit_2c6cb8ebf37963e504ca2cd802382e1c643c60ea.diff",
            "diff_additions": 87,
            "diff_deletions": 0,
            "diff_file_size": 17925,
            "diff_url": "https://github.com/dunst-project/dunst/commit/2c6cb8ebf37963e504ca2cd802382e1c643c60ea.diff",
            "exists": true,
            "files": [
                {
                    "file_additions": 76,
                    "file_deletions": 0,
                    "file_exists": true,
                    "file_name": "src/markup.c",
                    "file_size": 10892
                },
                {
                    "file_additions": 11,
                    "file_deletions": 0,
                    "file_exists": true,
                    "file_name": "test/markup.c",
                    "file_size": 7033
                }
            ],
            "interesting": {
                "reopen": false,
                "status": false
            },
            "is_parent": false,
            "sha": "2c6cb8ebf37963e504ca2cd802382e1c643c60ea"
        }
    ],
    "first_commit": "2018-10-10 14:59:30",
    "last_commit": "2018-11-06 18:49:47",
    "number": 546,
    "pull_request": "None",
    "score": {
        "accidental_reopen_likely": false,
        "all_labels": [
            "Bug"
        ],
        "contains_keywords": [
            "work",
            "report",
            "fix",
            "patch",
            "bug",
            "test",
            "issu",
            "error",
            "chang",
            "fail",
            "problem"
        ],
        "fix_size": 94,
        "has_labels": [],
        "intersecting": {
            "computed_score": 0.9662921348314607,
            "final_commit_size": 89,
            "intersection_size": 86,
            "previous_commits_size": 91
        },
        "is_makefile_based": true,
        "no_new_files": [],
        "no_other_files": false,
        "num_prohibited_files": 62928,
        "prohibited_files": [
            "kill.h",
            "meminfo.h",
            "kill.h",
            "meminfo.h",
            "kill.h",
            "meminfo.h",
            "testsuite_cli_test.go",
            "testsuite_cli_test.go",
            "common.mk",
            "i3bar/include/draw_util.h"
        ],
        "reopen": false,
        "reopen_events": [
            [
                "2018-11-03 16:47:04",
                "commit"
            ],
            [
                "2018-11-03 16:54:40",
                "commit"
            ],
            [
                "2018-11-03 16:57:21",
                "commit"
            ],
            [
                "2018-11-03 19:02:35",
                "commit"
            ],
            [
                "2018-11-03 19:06:10",
                "commit"
            ],
            [
                "2018-11-03 19:11:30",
                "commit"
            ],
            [
                "2018-11-06 18:50:04",
                "commit"
            ],
            [
                "2018-11-06 19:04:36",
                "closed"
            ]
        ],
        "status": true,
        "strategy": true,
        "total_changes": 845
    }
}