{
    "all_issues": 845,
    "interesting_issues": 1,
    "last_update": "2023-10-19 05:03:06.120363",
    "license": {
        "download": "https://raw.githubusercontent.com/jart/cosmopolitan/master/LICENSE",
        "name": "ISC License"
    },
    "ratio": 0.001183431952662722,
    "size": 290573,
    "stars": 11817,
    "url": "https://github.com/jart/cosmopolitan"
}