{
    "covered_issues": [
        129,
        128,
        127,
        126,
        124,
        122,
        120,
        119,
        117,
        114,
        113,
        110,
        109,
        108,
        106,
        105,
        104,
        103,
        101,
        100,
        99,
        98,
        97,
        96,
        95,
        94,
        93,
        92,
        91,
        90,
        89,
        87,
        86,
        85,
        84,
        83,
        82,
        81,
        80,
        79,
        78,
        77,
        76,
        75,
        73,
        72,
        68,
        66,
        65,
        63,
        62,
        61,
        60,
        58,
        57,
        55,
        53,
        52,
        51,
        50,
        49,
        48,
        45,
        44,
        43,
        42,
        41,
        39,
        36,
        35,
        34,
        33,
        32,
        31,
        30,
        29,
        26,
        19,
        18,
        17,
        13,
        12,
        11,
        10,
        9,
        6,
        5,
        4,
        3,
        2,
        1
    ],
    "finished": true
}