{
    "commits": [
        {
            "diff": "spring-projects_spring-boot/issue_15701/commit_a77460c16049c2a394ef1b3ac1c20590adfc91fd.diff",
            "diff_additions": 77,
            "diff_deletions": 3,
            "diff_file_size": 0,
            "files": [
                {
                    "file_additions": 11,
                    "file_deletions": 1,
                    "file_exists": false,
                    "file_name": "spring-boot-project/spring-boot-autoconfigure/src/main/java/org/springframework/boot/autoconfigure/elasticsearch/rest/RestClientAutoConfiguration.java",
                    "file_size": 0
                },
                {
                    "file_additions": 28,
                    "file_deletions": 1,
                    "file_exists": false,
                    "file_name": "spring-boot-project/spring-boot-autoconfigure/src/main/java/org/springframework/boot/autoconfigure/elasticsearch/rest/RestClientProperties.java",
                    "file_size": 0
                },
                {
                    "file_additions": 38,
                    "file_deletions": 1,
                    "file_exists": false,
                    "file_name": "spring-boot-project/spring-boot-autoconfigure/src/test/java/org/springframework/boot/autoconfigure/elasticsearch/rest/RestClientAutoConfigurationTests.java",
                    "file_size": 0
                }
            ],
            "interesting": {
                "reopened": false,
                "status": true
            },
            "sha": "a77460c16049c2a394ef1b3ac1c20590adfc91fd"
        },
        {
            "diff": "spring-projects_spring-boot/issue_15701/commit_439d3b6aad809e891e2c16ce2ba314f3011cfed3.diff",
            "diff_additions": 77,
            "diff_deletions": 3,
            "diff_file_size": 0,
            "files": [
                {
                    "file_additions": 11,
                    "file_deletions": 1,
                    "file_exists": false,
                    "file_name": "spring-boot-project/spring-boot-autoconfigure/src/main/java/org/springframework/boot/autoconfigure/elasticsearch/rest/RestClientAutoConfiguration.java",
                    "file_size": 0
                },
                {
                    "file_additions": 28,
                    "file_deletions": 1,
                    "file_exists": false,
                    "file_name": "spring-boot-project/spring-boot-autoconfigure/src/main/java/org/springframework/boot/autoconfigure/elasticsearch/rest/RestClientProperties.java",
                    "file_size": 0
                },
                {
                    "file_additions": 38,
                    "file_deletions": 1,
                    "file_exists": false,
                    "file_name": "spring-boot-project/spring-boot-autoconfigure/src/test/java/org/springframework/boot/autoconfigure/elasticsearch/rest/RestClientAutoConfigurationTests.java",
                    "file_size": 0
                }
            ],
            "interesting": {
                "reopened": false,
                "status": false
            },
            "sha": "439d3b6aad809e891e2c16ce2ba314f3011cfed3"
        },
        {
            "diff": "spring-projects_spring-boot/issue_15701/commit_bff3d73fd64e8ae61e5dbd10cda8ec55f175f7ba.diff",
            "diff_additions": 76,
            "diff_deletions": 2,
            "diff_file_size": 0,
            "files": [
                {
                    "file_additions": 10,
                    "file_deletions": 0,
                    "file_exists": false,
                    "file_name": "spring-boot-project/spring-boot-autoconfigure/src/main/java/org/springframework/boot/autoconfigure/elasticsearch/rest/RestClientAutoConfiguration.java",
                    "file_size": 0
                },
                {
                    "file_additions": 28,
                    "file_deletions": 1,
                    "file_exists": false,
                    "file_name": "spring-boot-project/spring-boot-autoconfigure/src/main/java/org/springframework/boot/autoconfigure/elasticsearch/rest/RestClientProperties.java",
                    "file_size": 0
                },
                {
                    "file_additions": 38,
                    "file_deletions": 1,
                    "file_exists": false,
                    "file_name": "spring-boot-project/spring-boot-autoconfigure/src/test/java/org/springframework/boot/autoconfigure/elasticsearch/rest/RestClientAutoConfigurationTests.java",
                    "file_size": 0
                }
            ],
            "interesting": {
                "reopened": false,
                "status": false
            },
            "sha": "bff3d73fd64e8ae61e5dbd10cda8ec55f175f7ba"
        },
        {
            "diff": "spring-projects_spring-boot/issue_15701/commit_63d06274f17d8be54cfdd00342e8f7963f96e558.diff",
            "diff_additions": 75,
            "diff_deletions": 1,
            "diff_file_size": 0,
            "files": [
                {
                    "file_additions": 10,
                    "file_deletions": 0,
                    "file_exists": false,
                    "file_name": "spring-boot-project/spring-boot-autoconfigure/src/main/java/org/springframework/boot/autoconfigure/elasticsearch/rest/RestClientAutoConfiguration.java",
                    "file_size": 0
                },
                {
                    "file_additions": 28,
                    "file_deletions": 1,
                    "file_exists": false,
                    "file_name": "spring-boot-project/spring-boot-autoconfigure/src/main/java/org/springframework/boot/autoconfigure/elasticsearch/rest/RestClientProperties.java",
                    "file_size": 0
                },
                {
                    "file_additions": 37,
                    "file_deletions": 0,
                    "file_exists": false,
                    "file_name": "spring-boot-project/spring-boot-autoconfigure/src/test/java/org/springframework/boot/autoconfigure/elasticsearch/rest/RestClientAutoConfigurationTests.java",
                    "file_size": 0
                }
            ],
            "interesting": {
                "reopened": false,
                "status": false
            },
            "sha": "63d06274f17d8be54cfdd00342e8f7963f96e558"
        },
        {
            "diff": "spring-projects_spring-boot/issue_15701/commit_9e3a5668318707ace2514913945b49fa59bfed4b.diff",
            "diff_additions": 75,
            "diff_deletions": 1,
            "diff_file_size": 0,
            "files": [
                {
                    "file_additions": 10,
                    "file_deletions": 0,
                    "file_exists": false,
                    "file_name": "spring-boot-project/spring-boot-autoconfigure/src/main/java/org/springframework/boot/autoconfigure/elasticsearch/rest/RestClientAutoConfiguration.java",
                    "file_size": 0
                },
                {
                    "file_additions": 28,
                    "file_deletions": 1,
                    "file_exists": false,
                    "file_name": "spring-boot-project/spring-boot-autoconfigure/src/main/java/org/springframework/boot/autoconfigure/elasticsearch/rest/RestClientProperties.java",
                    "file_size": 0
                },
                {
                    "file_additions": 37,
                    "file_deletions": 0,
                    "file_exists": false,
                    "file_name": "spring-boot-project/spring-boot-autoconfigure/src/test/java/org/springframework/boot/autoconfigure/elasticsearch/rest/RestClientAutoConfigurationTests.java",
                    "file_size": 0
                }
            ],
            "interesting": {
                "reopened": false,
                "status": false
            },
            "sha": "9e3a5668318707ace2514913945b49fa59bfed4b"
        }
    ],
    "first_commit": "2019-02-15 08:39:51",
    "last_commit": "2019-04-17 13:25:21",
    "number": 15701,
    "score": 320.01025641025643
}