{
    "category": [
        "hardware/OS",
        "network/protocols",
        "feature request"
    ],
    "commits": [
        {
            "associated_pull_request": [],
            "date": "2018-02-06 15:32:06",
            "diff": "elementsproject_lightning/issue_868/commit_71fee7f868b5918ad568ab4640f8d2c85630837d.diff",
            "diff_additions": 31,
            "diff_deletions": 0,
            "diff_file_size": 108945,
            "diff_url": "https://github.com/ElementsProject/lightning/commit/71fee7f868b5918ad568ab4640f8d2c85630837d.diff",
            "exists": true,
            "files": [
                {
                    "file_additions": 17,
                    "file_deletions": 0,
                    "file_exists": false,
                    "file_name": "gossipd/gossip.c",
                    "file_size": 0
                },
                {
                    "file_additions": 13,
                    "file_deletions": 0,
                    "file_exists": true,
                    "file_name": "gossipd/routing.c",
                    "file_size": 86604
                },
                {
                    "file_additions": 1,
                    "file_deletions": 0,
                    "file_exists": true,
                    "file_name": "lightningd/gossip_control.c",
                    "file_size": 22341
                }
            ],
            "interesting": {
                "reopen": false,
                "status": false
            },
            "is_parent": true,
            "sha": "71fee7f868b5918ad568ab4640f8d2c85630837d"
        },
        {
            "associated_pull_request": [],
            "date": "2018-02-07 12:35:52",
            "diff": "elementsproject_lightning/issue_868/commit_606558af9a29d5b4c96a3300b67e5cf37d57be31.diff",
            "diff_additions": 35,
            "diff_deletions": 3,
            "diff_file_size": 52656,
            "diff_url": "https://github.com/ElementsProject/lightning/commit/606558af9a29d5b4c96a3300b67e5cf37d57be31.diff",
            "exists": true,
            "files": [
                {
                    "file_additions": 35,
                    "file_deletions": 3,
                    "file_exists": true,
                    "file_name": "lightningd/pay.c",
                    "file_size": 52656
                }
            ],
            "interesting": {
                "reopen": false,
                "status": false
            },
            "is_parent": false,
            "sha": "606558af9a29d5b4c96a3300b67e5cf37d57be31"
        },
        {
            "associated_pull_request": [],
            "date": "2018-02-07 12:35:52",
            "diff": "elementsproject_lightning/issue_868/commit_91f9f2f1b2451bbfa3c4e0dd8b41878229f38ed9.diff",
            "diff_additions": 37,
            "diff_deletions": 3,
            "diff_file_size": 52656,
            "diff_url": "https://github.com/ElementsProject/lightning/commit/91f9f2f1b2451bbfa3c4e0dd8b41878229f38ed9.diff",
            "exists": true,
            "files": [
                {
                    "file_additions": 37,
                    "file_deletions": 3,
                    "file_exists": true,
                    "file_name": "lightningd/pay.c",
                    "file_size": 52656
                }
            ],
            "interesting": {
                "reopen": false,
                "status": false
            },
            "is_parent": false,
            "sha": "91f9f2f1b2451bbfa3c4e0dd8b41878229f38ed9"
        },
        {
            "associated_pull_request": [],
            "date": "2018-02-07 12:35:52",
            "diff": "elementsproject_lightning/issue_868/commit_5e23b0aabef05569320401e8521cc6ad672383ce.diff",
            "diff_additions": 37,
            "diff_deletions": 3,
            "diff_file_size": 52656,
            "diff_url": "https://github.com/ElementsProject/lightning/commit/5e23b0aabef05569320401e8521cc6ad672383ce.diff",
            "exists": true,
            "files": [
                {
                    "file_additions": 37,
                    "file_deletions": 3,
                    "file_exists": true,
                    "file_name": "lightningd/pay.c",
                    "file_size": 52656
                }
            ],
            "interesting": {
                "reopen": false,
                "status": true
            },
            "is_parent": false,
            "sha": "5e23b0aabef05569320401e8521cc6ad672383ce"
        },
        {
            "associated_pull_request": [],
            "date": "2018-02-07 12:35:52",
            "diff": "elementsproject_lightning/issue_868/commit_556bac157c304cb5b3172935eaac8f26331d174a.diff",
            "diff_additions": 37,
            "diff_deletions": 3,
            "diff_file_size": 52656,
            "diff_url": "https://github.com/ElementsProject/lightning/commit/556bac157c304cb5b3172935eaac8f26331d174a.diff",
            "exists": true,
            "files": [
                {
                    "file_additions": 37,
                    "file_deletions": 3,
                    "file_exists": true,
                    "file_name": "lightningd/pay.c",
                    "file_size": 52656
                }
            ],
            "interesting": {
                "reopen": false,
                "status": true
            },
            "is_parent": false,
            "sha": "556bac157c304cb5b3172935eaac8f26331d174a"
        },
        {
            "associated_pull_request": [
                "https://github.com/ElementsProject/lightning/pull/941"
            ],
            "date": "2018-02-07 12:35:52",
            "diff": "elementsproject_lightning/issue_868/commit_be3c5a07b73d7f18b624dae90ea23b5ff42fd90a.diff",
            "diff_additions": 37,
            "diff_deletions": 3,
            "diff_file_size": 52656,
            "diff_url": "https://github.com/ElementsProject/lightning/commit/be3c5a07b73d7f18b624dae90ea23b5ff42fd90a.diff",
            "exists": true,
            "files": [
                {
                    "file_additions": 37,
                    "file_deletions": 3,
                    "file_exists": true,
                    "file_name": "lightningd/pay.c",
                    "file_size": 52656
                }
            ],
            "interesting": {
                "reopen": false,
                "status": false
            },
            "is_parent": false,
            "sha": "be3c5a07b73d7f18b624dae90ea23b5ff42fd90a"
        },
        {
            "associated_pull_request": [
                "https://github.com/ElementsProject/lightning/pull/941"
            ],
            "date": "2018-02-07 12:35:52",
            "diff": "elementsproject_lightning/issue_868/commit_d666857aed7cfd83ef30ba17d49e824f327aaa2c.diff",
            "diff_additions": 37,
            "diff_deletions": 3,
            "diff_file_size": 52656,
            "diff_url": "https://github.com/ElementsProject/lightning/commit/d666857aed7cfd83ef30ba17d49e824f327aaa2c.diff",
            "exists": true,
            "files": [
                {
                    "file_additions": 37,
                    "file_deletions": 3,
                    "file_exists": true,
                    "file_name": "lightningd/pay.c",
                    "file_size": 52656
                }
            ],
            "interesting": {
                "reopen": false,
                "status": false
            },
            "is_parent": false,
            "sha": "d666857aed7cfd83ef30ba17d49e824f327aaa2c"
        }
    ],
    "first_commit": "2018-02-06 15:32:08",
    "last_commit": "2018-02-08 00:51:30",
    "number": 868,
    "pull_request": "None",
    "score": {
        "accidental_reopen_likely": false,
        "all_labels": [
            "enhancement",
            "gossip"
        ],
        "contains_keywords": [
            "work",
            "report",
            "test",
            "error",
            "fail"
        ],
        "fix_size": 76,
        "has_labels": [],
        "intersecting": {
            "computed_score": 1.0,
            "final_commit_size": 41,
            "intersection_size": 41,
            "previous_commits_size": 76
        },
        "is_makefile_based": true,
        "no_new_files": [],
        "no_other_files": false,
        "num_prohibited_files": 65086,
        "prohibited_files": [
            "kill.h",
            "meminfo.h",
            "kill.h",
            "meminfo.h",
            "kill.h",
            "meminfo.h",
            "testsuite_cli_test.go",
            "testsuite_cli_test.go",
            "common.mk",
            "i3bar/include/draw_util.h"
        ],
        "reopen": false,
        "reopen_events": [
            [
                "2018-02-07 12:36:42",
                "commit"
            ],
            [
                "2018-02-07 12:43:51",
                "commit"
            ],
            [
                "2018-02-07 13:01:48",
                "commit"
            ],
            [
                "2018-02-07 13:27:22",
                "commit"
            ],
            [
                "2018-02-07 15:35:29",
                "commit"
            ],
            [
                "2018-02-08 00:51:31",
                "closed"
            ],
            [
                "2018-02-08 00:51:33",
                "commit"
            ]
        ],
        "status": true,
        "strategy": true,
        "total_changes": 269
    }
}