{
    "commits": [
        {
            "associated_pull_request": [],
            "date": "2021-07-27 17:57:40+00:00",
            "diff": "",
            "diff_additions": 0,
            "diff_deletions": 0,
            "diff_file_size": 0,
            "diff_url": "https://github.com/libsdl-org/SDL/commit/b2d77e638c5b44ce92e77b7240451b74ca460e17.diff",
            "exists": true,
            "files": [],
            "interesting": {
                "reopen": false,
                "status": false
            },
            "is_parent": true,
            "sha": "b2d77e638c5b44ce92e77b7240451b74ca460e17"
        },
        {
            "associated_pull_request": [],
            "date": "2021-07-27 18:12:18+00:00",
            "diff": "libsdl-org_sdl/issue_3234/commit_0d0fee7569803ddc41985bfc249418b02dd8cd97.diff",
            "diff_additions": 15,
            "diff_deletions": 3,
            "diff_file_size": 26849,
            "diff_url": "https://github.com/libsdl-org/SDL/commit/0d0fee7569803ddc41985bfc249418b02dd8cd97.diff",
            "exists": true,
            "files": [
                {
                    "file_additions": 15,
                    "file_deletions": 3,
                    "file_exists": true,
                    "file_name": "src/audio/wasapi/SDL_wasapi.c",
                    "file_size": 26849
                }
            ],
            "interesting": {
                "reopen": true,
                "status": false
            },
            "is_parent": false,
            "sha": "0d0fee7569803ddc41985bfc249418b02dd8cd97"
        },
        {
            "associated_pull_request": [
                "https://github.com/libsdl-org/SDL/pull/4353"
            ],
            "date": "2021-05-01 21:56:23+00:00",
            "diff": "libsdl-org_sdl/issue_3234/commit_c72aef266411a5a5e899ffdea1d8545d2d347f39.diff",
            "diff_additions": 8,
            "diff_deletions": 2,
            "diff_file_size": 26849,
            "diff_url": "https://github.com/libsdl-org/SDL/commit/c72aef266411a5a5e899ffdea1d8545d2d347f39.diff",
            "exists": true,
            "files": [
                {
                    "file_additions": 8,
                    "file_deletions": 2,
                    "file_exists": true,
                    "file_name": "src/audio/wasapi/SDL_wasapi.c",
                    "file_size": 26849
                }
            ],
            "interesting": {
                "reopen": false,
                "status": false
            },
            "is_parent": false,
            "sha": "c72aef266411a5a5e899ffdea1d8545d2d347f39"
        }
    ],
    "first_commit": "2021-07-27 17:57:40+00:00",
    "last_commit": "2021-07-27 18:19:11+00:00",
    "number": 3234,
    "pull_request": "None",
    "score": {
        "accidental_reopen_likely": false,
        "all_labels": [],
        "contains_keywords": [
            "work",
            "fail",
            "chang",
            "fix",
            "issu",
            "patch",
            "test",
            "problem",
            "workaround"
        ],
        "fix_size": 27,
        "has_labels": [],
        "intersecting": {
            "computed_score": 0.1111111111111111,
            "final_commit_size": 9,
            "intersection_size": 1,
            "previous_commits_size": 19
        },
        "is_makefile_based": true,
        "no_new_files": [],
        "no_other_files": true,
        "num_prohibited_files": 40792,
        "prohibited_files": [
            "server/src/main/java/com/genymobile/scrcpy/Device.java",
            "server/src/main/java/com/genymobile/scrcpy/wrappers/SurfaceControl.java",
            "server/src/main/java/com/genymobile/scrcpy/Device.java",
            "server/src/main/java/com/genymobile/scrcpy/wrappers/SurfaceControl.java",
            "app/meson.build",
            "app/scrcpy.1",
            "app/src/common.h",
            "app/src/scrcpy.h",
            "app/src/server.h",
            "server/src/main/java/com/genymobile/scrcpy/Workarounds.java"
        ],
        "reopen": true,
        "reopen_events": [
            [
                "2021-02-11 01:29:27+00:00",
                "closed"
            ],
            [
                "2021-03-03 15:21:24+00:00",
                "reopened"
            ],
            [
                "2021-07-27 18:13:47+00:00",
                "closed"
            ],
            [
                "2021-07-27 18:13:47+00:00",
                "commit"
            ],
            [
                "2021-07-27 18:17:06+00:00",
                "reopened"
            ],
            [
                "2021-07-27 18:19:12+00:00",
                "commit"
            ],
            [
                "2021-07-27 18:20:48+00:00",
                "closed"
            ]
        ],
        "status": false,
        "strategy": true,
        "total_changes": 28
    }
}