{
    "all_issues": 1292,
    "interesting_issues": 2,
    "last_update": "2023-10-19 04:51:35.470423",
    "license": {
        "download": "https://raw.githubusercontent.com/jonas/tig/master/COPYING",
        "name": "GNU General Public License v2.0"
    },
    "ratio": 0.0015479876160990713,
    "size": 7281,
    "stars": 11848,
    "url": "https://github.com/jonas/tig"
}