{
    "category": [
        "hardware/OS"
    ],
    "commits": [
        {
            "associated_pull_request": [],
            "date": "2016-02-14 02:54:45",
            "diff": "curl_curl/issue_648/commit_078753c40d05fc4a07ee20a18f60fc325592b31c.diff",
            "diff_additions": 3,
            "diff_deletions": 3,
            "diff_file_size": 51572,
            "diff_url": "https://github.com/curl/curl/commit/078753c40d05fc4a07ee20a18f60fc325592b31c.diff",
            "exists": true,
            "files": [
                {
                    "file_additions": 3,
                    "file_deletions": 3,
                    "file_exists": true,
                    "file_name": "lib/vtls/gtls.c",
                    "file_size": 51572
                }
            ],
            "interesting": {
                "reopen": false,
                "status": false
            },
            "is_parent": true,
            "sha": "078753c40d05fc4a07ee20a18f60fc325592b31c"
        },
        {
            "associated_pull_request": [],
            "date": "2016-02-14 04:54:01",
            "diff": "curl_curl/issue_648/commit_c14f9f800c5d2452926c9591b1fedb7e17c499e8.diff",
            "diff_additions": 30,
            "diff_deletions": 44,
            "diff_file_size": 130879,
            "diff_url": "https://github.com/curl/curl/commit/c14f9f800c5d2452926c9591b1fedb7e17c499e8.diff",
            "exists": true,
            "files": [
                {
                    "file_additions": 30,
                    "file_deletions": 44,
                    "file_exists": true,
                    "file_name": "lib/url.c",
                    "file_size": 130879
                }
            ],
            "interesting": {
                "reopen": false,
                "status": false
            },
            "is_parent": false,
            "sha": "c14f9f800c5d2452926c9591b1fedb7e17c499e8"
        },
        {
            "associated_pull_request": [],
            "date": "2016-05-02 21:15:05",
            "diff": "curl_curl/issue_648/commit_5823179523e9ad02a98ab6e184ed120ad2324481.diff",
            "diff_additions": 2,
            "diff_deletions": 2,
            "diff_file_size": 147333,
            "diff_url": "https://github.com/curl/curl/commit/5823179523e9ad02a98ab6e184ed120ad2324481.diff",
            "exists": true,
            "files": [
                {
                    "file_additions": 1,
                    "file_deletions": 1,
                    "file_exists": true,
                    "file_name": "lib/conncache.c",
                    "file_size": 16454
                },
                {
                    "file_additions": 1,
                    "file_deletions": 1,
                    "file_exists": true,
                    "file_name": "lib/url.c",
                    "file_size": 130879
                }
            ],
            "interesting": {
                "reopen": true,
                "status": false
            },
            "is_parent": false,
            "sha": "5823179523e9ad02a98ab6e184ed120ad2324481"
        },
        {
            "associated_pull_request": [],
            "date": "2016-05-12 22:02:21",
            "diff": "curl_curl/issue_648/commit_117a0ffe9fbe2984d2f964a844a8e662586ae9b1.diff",
            "diff_additions": 17,
            "diff_deletions": 17,
            "diff_file_size": 130879,
            "diff_url": "https://github.com/curl/curl/commit/117a0ffe9fbe2984d2f964a844a8e662586ae9b1.diff",
            "exists": true,
            "files": [
                {
                    "file_additions": 17,
                    "file_deletions": 17,
                    "file_exists": true,
                    "file_name": "lib/url.c",
                    "file_size": 130879
                }
            ],
            "interesting": {
                "reopen": false,
                "status": false
            },
            "is_parent": false,
            "sha": "117a0ffe9fbe2984d2f964a844a8e662586ae9b1"
        }
    ],
    "first_commit": "2016-02-14 03:21:32",
    "last_commit": "2016-05-12 22:02:21",
    "number": 648,
    "pull_request": "None",
    "score": {
        "accidental_reopen_likely": false,
        "all_labels": [
            "connecting & proxies"
        ],
        "contains_keywords": [
            "work",
            "attempt",
            "fix",
            "reason",
            "patch",
            "bug",
            "test",
            "issu",
            "chang",
            "fail",
            "problem"
        ],
        "fix_size": 66,
        "has_labels": [],
        "intersecting": {
            "computed_score": 0.3793103448275862,
            "final_commit_size": 29,
            "intersection_size": 11,
            "previous_commits_size": 48
        },
        "is_makefile_based": true,
        "no_new_files": [],
        "no_other_files": true,
        "num_prohibited_files": 28888,
        "prohibited_files": [
            "kill.h",
            "meminfo.h",
            "kill.h",
            "meminfo.h",
            "kill.h",
            "meminfo.h",
            "testsuite_cli_test.go",
            "testsuite_cli_test.go",
            "common.mk",
            "i3bar/include/draw_util.h"
        ],
        "reopen": true,
        "reopen_events": [
            [
                "2016-02-14 04:54:21",
                "commit"
            ],
            [
                "2016-05-03 20:29:11",
                "closed"
            ],
            [
                "2016-05-03 20:29:11",
                "commit"
            ],
            [
                "2016-05-08 11:45:24",
                "reopened"
            ],
            [
                "2016-05-12 22:06:32",
                "closed"
            ],
            [
                "2016-05-12 22:06:32",
                "commit"
            ]
        ],
        "status": false,
        "strategy": true,
        "total_changes": 118
    }
}