{
    "commits": [
        {
            "associated_pull_request": [
                "https://github.com/OpenSIPS/opensips/pull/2919"
            ],
            "date": "2022-11-03 16:35:51+00:00",
            "diff": "opensips_opensips/issue_2917/commit_3ddd19ea2a34cdc25ac43f3785bccab9ad0d42f9.diff",
            "diff_additions": 67,
            "diff_deletions": 4,
            "diff_file_size": 24849,
            "diff_url": "https://github.com/OpenSIPS/opensips/commit/3ddd19ea2a34cdc25ac43f3785bccab9ad0d42f9.diff",
            "exists": true,
            "files": [
                {
                    "file_additions": 67,
                    "file_deletions": 4,
                    "file_exists": true,
                    "file_name": "evi/event_interface.c",
                    "file_size": 24849
                }
            ],
            "interesting": {
                "reopen": false,
                "status": false
            },
            "is_parent": true,
            "sha": "3ddd19ea2a34cdc25ac43f3785bccab9ad0d42f9"
        },
        {
            "associated_pull_request": [],
            "date": "2022-11-03 17:19:36+00:00",
            "diff": "opensips_opensips/issue_2917/commit_9ac7739ef02079a22de6beb776d6a1628a4458cb.diff",
            "diff_additions": 10,
            "diff_deletions": 3,
            "diff_file_size": 16167,
            "diff_url": "https://github.com/OpenSIPS/opensips/commit/9ac7739ef02079a22de6beb776d6a1628a4458cb.diff",
            "exists": true,
            "files": [
                {
                    "file_additions": 10,
                    "file_deletions": 3,
                    "file_exists": true,
                    "file_name": "lib/reg/lookup.c",
                    "file_size": 16167
                }
            ],
            "interesting": {
                "reopen": true,
                "status": false
            },
            "is_parent": false,
            "sha": "9ac7739ef02079a22de6beb776d6a1628a4458cb"
        },
        {
            "associated_pull_request": [],
            "date": "2022-11-03 17:45:44+00:00",
            "diff": "opensips_opensips/issue_2917/commit_02ddcc6cc52e6c27d27870447c4df7a352508a75.diff",
            "diff_additions": 28,
            "diff_deletions": 0,
            "diff_file_size": 6221,
            "diff_url": "https://github.com/OpenSIPS/opensips/commit/02ddcc6cc52e6c27d27870447c4df7a352508a75.diff",
            "exists": true,
            "files": [
                {
                    "file_additions": 28,
                    "file_deletions": 0,
                    "file_exists": true,
                    "file_name": "modules/registrar/test/test.c",
                    "file_size": 6221
                }
            ],
            "interesting": {
                "reopen": false,
                "status": false
            },
            "is_parent": false,
            "sha": "02ddcc6cc52e6c27d27870447c4df7a352508a75"
        },
        {
            "associated_pull_request": [],
            "date": "2022-11-03 17:45:44+00:00",
            "diff": "opensips_opensips/issue_2917/commit_2da07e40c6847eef6bf28ec240cf3337065146ee.diff",
            "diff_additions": 28,
            "diff_deletions": 0,
            "diff_file_size": 6221,
            "diff_url": "https://github.com/OpenSIPS/opensips/commit/2da07e40c6847eef6bf28ec240cf3337065146ee.diff",
            "exists": true,
            "files": [
                {
                    "file_additions": 28,
                    "file_deletions": 0,
                    "file_exists": true,
                    "file_name": "modules/registrar/test/test.c",
                    "file_size": 6221
                }
            ],
            "interesting": {
                "reopen": false,
                "status": false
            },
            "is_parent": false,
            "sha": "2da07e40c6847eef6bf28ec240cf3337065146ee"
        },
        {
            "associated_pull_request": [
                "https://github.com/naveenecosmob/opensips/pull/1",
                "https://github.com/naveenecosmob/opensips/pull/5"
            ],
            "date": "2022-11-03 17:45:44+00:00",
            "diff": "opensips_opensips/issue_2917/commit_65d7b7ba36d9e898de3b3a527a07841594e8ed9d.diff",
            "diff_additions": 28,
            "diff_deletions": 0,
            "diff_file_size": 6221,
            "diff_url": "https://github.com/OpenSIPS/opensips/commit/65d7b7ba36d9e898de3b3a527a07841594e8ed9d.diff",
            "exists": true,
            "files": [
                {
                    "file_additions": 28,
                    "file_deletions": 0,
                    "file_exists": true,
                    "file_name": "modules/registrar/test/test.c",
                    "file_size": 6221
                }
            ],
            "interesting": {
                "reopen": false,
                "status": false
            },
            "is_parent": false,
            "sha": "65d7b7ba36d9e898de3b3a527a07841594e8ed9d"
        },
        {
            "associated_pull_request": [],
            "date": "2022-11-03 17:45:44+00:00",
            "diff": "opensips_opensips/issue_2917/commit_8e17ae3d10ac803bf3555f101db55b8aade5c79d.diff",
            "diff_additions": 28,
            "diff_deletions": 0,
            "diff_file_size": 6221,
            "diff_url": "https://github.com/OpenSIPS/opensips/commit/8e17ae3d10ac803bf3555f101db55b8aade5c79d.diff",
            "exists": true,
            "files": [
                {
                    "file_additions": 28,
                    "file_deletions": 0,
                    "file_exists": true,
                    "file_name": "modules/registrar/test/test.c",
                    "file_size": 6221
                }
            ],
            "interesting": {
                "reopen": false,
                "status": false
            },
            "is_parent": false,
            "sha": "8e17ae3d10ac803bf3555f101db55b8aade5c79d"
        }
    ],
    "first_commit": "2022-11-03 16:35:51+00:00",
    "last_commit": "2022-11-04 09:16:43+00:00",
    "number": 2917,
    "pull_request": "None",
    "score": {
        "accidental_reopen_likely": false,
        "all_labels": [
            "bug",
            "fixed"
        ],
        "contains_keywords": [
            "confirm",
            "fail",
            "fix",
            "issu",
            "test",
            "bug",
            "report"
        ],
        "fix_size": 42,
        "has_labels": [
            "bug"
        ],
        "intersecting": {
            "computed_score": 1.0,
            "final_commit_size": 29,
            "intersection_size": 29,
            "previous_commits_size": 42
        },
        "is_makefile_based": true,
        "no_new_files": [],
        "no_other_files": true,
        "num_prohibited_files": 467802,
        "prohibited_files": [
            "server/src/main/java/com/genymobile/scrcpy/Device.java",
            "server/src/main/java/com/genymobile/scrcpy/wrappers/SurfaceControl.java",
            "server/src/main/java/com/genymobile/scrcpy/Device.java",
            "server/src/main/java/com/genymobile/scrcpy/wrappers/SurfaceControl.java",
            "app/meson.build",
            "app/scrcpy.1",
            "app/src/common.h",
            "app/src/scrcpy.h",
            "app/src/server.h",
            "server/src/main/java/com/genymobile/scrcpy/Workarounds.java"
        ],
        "reopen": true,
        "reopen_events": [
            [
                "2022-11-03 17:24:33+00:00",
                "closed"
            ],
            [
                "2022-11-03 17:24:33+00:00",
                "commit"
            ],
            [
                "2022-11-03 17:24:52+00:00",
                "reopened"
            ],
            [
                "2022-11-03 17:47:07+00:00",
                "commit"
            ],
            [
                "2022-11-04 09:17:19+00:00",
                "commit"
            ],
            [
                "2022-11-04 09:17:19+00:00",
                "commit"
            ],
            [
                "2022-11-04 09:17:19+00:00",
                "commit"
            ],
            [
                "2022-11-04 09:17:19+00:00",
                "commit"
            ],
            [
                "2022-11-04 09:17:19+00:00",
                "commit"
            ],
            [
                "2022-11-04 09:17:19+00:00",
                "commit"
            ],
            [
                "2022-11-04 09:17:36+00:00",
                "closed"
            ]
        ],
        "status": false,
        "strategy": true,
        "total_changes": 196
    }
}