{
    "covered_issues": [
        229,
        227,
        226,
        223,
        222,
        221,
        220,
        219,
        218,
        217,
        216,
        210,
        209,
        208,
        207,
        206,
        205,
        204,
        203,
        202,
        200,
        199,
        198,
        195,
        194,
        192,
        189,
        188,
        187,
        185,
        184,
        183,
        182,
        181,
        180,
        179,
        178,
        177,
        176,
        175,
        174,
        173,
        171,
        170,
        169,
        167,
        166,
        165,
        164,
        163,
        162,
        160,
        159,
        157,
        156,
        154,
        153,
        148,
        147,
        146,
        145,
        143,
        141,
        140,
        139,
        138,
        132,
        130,
        129,
        127,
        126,
        121,
        98,
        95,
        89,
        88,
        87,
        86,
        85,
        84,
        82,
        80,
        79,
        78,
        77,
        76,
        74,
        73,
        71,
        70,
        69,
        68,
        67,
        66,
        65,
        64,
        63,
        61,
        60,
        59,
        58,
        57,
        56,
        55,
        54,
        53,
        52,
        49,
        48,
        47,
        46,
        38,
        37,
        36,
        35,
        34,
        33,
        32,
        31,
        29,
        28,
        27,
        26,
        24,
        23,
        22,
        21,
        20,
        19,
        18,
        17,
        16,
        15,
        14,
        13,
        12,
        11,
        9,
        7,
        6,
        5,
        4,
        2,
        1,
        198,
        192,
        170,
        198,
        192,
        170
    ],
    "finished": true
}