{
    "covered_issues": [
        149,
        143,
        142,
        138,
        137,
        134,
        133,
        130,
        128,
        127,
        123,
        119,
        112,
        107,
        106,
        105,
        98,
        97,
        84,
        83,
        82,
        74,
        73,
        66,
        65,
        63,
        61,
        60,
        59,
        58,
        55,
        54,
        50,
        43,
        41,
        40,
        39,
        37,
        27,
        24,
        23,
        21,
        18,
        5,
        3,
        2
    ],
    "finished": true
}