{
    "category": [
        "memory",
        "build/refactor/preprocessing",
        "feature request"
    ],
    "commits": [
        {
            "associated_pull_request": [],
            "date": "2013-05-11 22:31:20",
            "diff": "kevinlawler_kona/issue_198/commit_a80826ff631149942fd0f0a2bdbaa6f30628c996.diff",
            "diff_additions": 2,
            "diff_deletions": 1,
            "diff_file_size": 0,
            "diff_url": "https://github.com/kevinlawler/kona/commit/a80826ff631149942fd0f0a2bdbaa6f30628c996.diff",
            "exists": true,
            "files": [
                {
                    "file_additions": 2,
                    "file_deletions": 1,
                    "file_exists": false,
                    "file_name": "0.c",
                    "file_size": 0
                }
            ],
            "interesting": {
                "reopen": false,
                "status": false
            },
            "is_parent": true,
            "sha": "a80826ff631149942fd0f0a2bdbaa6f30628c996"
        },
        {
            "associated_pull_request": [],
            "date": "2013-05-13 15:16:00",
            "diff": "kevinlawler_kona/issue_198/commit_f924299f0b710171853a93cede1ad344c1c95595.diff",
            "diff_additions": 3,
            "diff_deletions": 3,
            "diff_file_size": 0,
            "diff_url": "https://github.com/kevinlawler/kona/commit/f924299f0b710171853a93cede1ad344c1c95595.diff",
            "exists": true,
            "files": [
                {
                    "file_additions": 3,
                    "file_deletions": 3,
                    "file_exists": false,
                    "file_name": "vd.c",
                    "file_size": 0
                }
            ],
            "interesting": {
                "reopen": false,
                "status": false
            },
            "is_parent": false,
            "sha": "f924299f0b710171853a93cede1ad344c1c95595"
        },
        {
            "associated_pull_request": [],
            "date": "2013-05-13 17:26:04",
            "diff": "kevinlawler_kona/issue_198/commit_4edc677837c377893a4f07fbd15feefacf542394.diff",
            "diff_additions": 2,
            "diff_deletions": 2,
            "diff_file_size": 0,
            "diff_url": "https://github.com/kevinlawler/kona/commit/4edc677837c377893a4f07fbd15feefacf542394.diff",
            "exists": true,
            "files": [
                {
                    "file_additions": 2,
                    "file_deletions": 2,
                    "file_exists": false,
                    "file_name": "vd.c",
                    "file_size": 0
                }
            ],
            "interesting": {
                "reopen": true,
                "status": false
            },
            "is_parent": false,
            "sha": "4edc677837c377893a4f07fbd15feefacf542394"
        },
        {
            "associated_pull_request": [],
            "date": "2013-05-16 21:41:33",
            "diff": "kevinlawler_kona/issue_198/commit_1ad8421ddb19b45076f0d920ed0849e2ffd352ef.diff",
            "diff_additions": 1,
            "diff_deletions": 1,
            "diff_file_size": 0,
            "diff_url": "https://github.com/kevinlawler/kona/commit/1ad8421ddb19b45076f0d920ed0849e2ffd352ef.diff",
            "exists": true,
            "files": [
                {
                    "file_additions": 1,
                    "file_deletions": 1,
                    "file_exists": false,
                    "file_name": "vd.c",
                    "file_size": 0
                }
            ],
            "interesting": {
                "reopen": true,
                "status": false
            },
            "is_parent": false,
            "sha": "1ad8421ddb19b45076f0d920ed0849e2ffd352ef"
        },
        {
            "associated_pull_request": [],
            "date": "2013-05-22 16:13:37",
            "diff": "kevinlawler_kona/issue_198/commit_368eaa067a5e3d041be7f624e379d159016b1da8.diff",
            "diff_additions": 1,
            "diff_deletions": 0,
            "diff_file_size": 0,
            "diff_url": "https://github.com/kevinlawler/kona/commit/368eaa067a5e3d041be7f624e379d159016b1da8.diff",
            "exists": true,
            "files": [
                {
                    "file_additions": 1,
                    "file_deletions": 0,
                    "file_exists": false,
                    "file_name": "vd.c",
                    "file_size": 0
                }
            ],
            "interesting": {
                "reopen": false,
                "status": false
            },
            "is_parent": false,
            "sha": "368eaa067a5e3d041be7f624e379d159016b1da8"
        },
        {
            "associated_pull_request": [],
            "date": "2013-05-24 20:08:28",
            "diff": "kevinlawler_kona/issue_198/commit_f99ab0c394ed0cfee352d28b07a39873daeffcc3.diff",
            "diff_additions": 3,
            "diff_deletions": 1,
            "diff_file_size": 0,
            "diff_url": "https://github.com/kevinlawler/kona/commit/f99ab0c394ed0cfee352d28b07a39873daeffcc3.diff",
            "exists": true,
            "files": [
                {
                    "file_additions": 1,
                    "file_deletions": 1,
                    "file_exists": false,
                    "file_name": "kx.c",
                    "file_size": 0
                },
                {
                    "file_additions": 2,
                    "file_deletions": 0,
                    "file_exists": false,
                    "file_name": "tests.c",
                    "file_size": 0
                }
            ],
            "interesting": {
                "reopen": false,
                "status": false
            },
            "is_parent": false,
            "sha": "f99ab0c394ed0cfee352d28b07a39873daeffcc3"
        },
        {
            "associated_pull_request": [],
            "date": "2013-05-27 23:11:45",
            "diff": "kevinlawler_kona/issue_198/commit_5323497db918eb478bc45e4f8ff2528ba5758951.diff",
            "diff_additions": 3,
            "diff_deletions": 3,
            "diff_file_size": 0,
            "diff_url": "https://github.com/kevinlawler/kona/commit/5323497db918eb478bc45e4f8ff2528ba5758951.diff",
            "exists": true,
            "files": [
                {
                    "file_additions": 1,
                    "file_deletions": 1,
                    "file_exists": false,
                    "file_name": "kx.c",
                    "file_size": 0
                },
                {
                    "file_additions": 2,
                    "file_deletions": 2,
                    "file_exists": false,
                    "file_name": "tests.c",
                    "file_size": 0
                }
            ],
            "interesting": {
                "reopen": true,
                "status": false
            },
            "is_parent": false,
            "sha": "5323497db918eb478bc45e4f8ff2528ba5758951"
        },
        {
            "associated_pull_request": [],
            "date": "2013-05-28 18:55:29",
            "diff": "kevinlawler_kona/issue_198/commit_5964d295f51c9f5da2208adc5bcb2448f6903e77.diff",
            "diff_additions": 3,
            "diff_deletions": 3,
            "diff_file_size": 0,
            "diff_url": "https://github.com/kevinlawler/kona/commit/5964d295f51c9f5da2208adc5bcb2448f6903e77.diff",
            "exists": true,
            "files": [
                {
                    "file_additions": 1,
                    "file_deletions": 1,
                    "file_exists": false,
                    "file_name": "kx.c",
                    "file_size": 0
                },
                {
                    "file_additions": 2,
                    "file_deletions": 2,
                    "file_exists": false,
                    "file_name": "tests.c",
                    "file_size": 0
                }
            ],
            "interesting": {
                "reopen": false,
                "status": false
            },
            "is_parent": false,
            "sha": "5964d295f51c9f5da2208adc5bcb2448f6903e77"
        }
    ],
    "first_commit": "2013-05-11 22:31:20",
    "last_commit": "2013-05-28 18:55:29",
    "number": 198,
    "pull_request": "None",
    "score": {
        "accidental_reopen_likely": false,
        "all_labels": [
            "feature"
        ],
        "contains_keywords": [
            "fail",
            "report",
            "warn",
            "chang",
            "error",
            "bug",
            "problem",
            "crash",
            "test",
            "fix",
            "patch",
            "issu",
            "work",
            "fault"
        ],
        "fix_size": 13,
        "has_labels": [],
        "intersecting": {
            "computed_score": 1.0,
            "final_commit_size": 5,
            "intersection_size": 5,
            "previous_commits_size": 13
        },
        "is_makefile_based": true,
        "no_new_files": [],
        "no_other_files": true,
        "num_prohibited_files": 130040,
        "prohibited_files": [
            "hal/inc/pinmap_hal.h",
            "Debug/marvin.bin",
            "Debug/marvin.elf",
            "Debug/marvin.hex",
            "Debug/marvin.bin",
            "Debug/marvin.elf",
            "Debug/marvin.hex",
            "inc/spark_utilities.h",
            "Debug/marvin.bin",
            "Debug/marvin.elf"
        ],
        "reopen": true,
        "reopen_events": [
            [
                "2013-05-13 15:03:05",
                "commit"
            ],
            [
                "2013-05-13 15:17:29",
                "closed"
            ],
            [
                "2013-05-13 17:13:01",
                "commit"
            ],
            [
                "2013-05-13 21:11:33",
                "reopened"
            ],
            [
                "2013-05-16 21:41:59",
                "commit"
            ],
            [
                "2013-05-16 21:42:43",
                "closed"
            ],
            [
                "2013-05-22 14:30:30",
                "reopened"
            ],
            [
                "2013-05-22 16:00:27",
                "commit"
            ],
            [
                "2013-05-24 19:55:14",
                "commit"
            ],
            [
                "2013-05-24 19:56:28",
                "closed"
            ],
            [
                "2013-05-27 22:58:21",
                "commit"
            ],
            [
                "2013-05-27 22:58:31",
                "reopened"
            ],
            [
                "2013-05-28 18:42:09",
                "commit"
            ],
            [
                "2013-05-28 18:49:12",
                "closed"
            ]
        ],
        "status": false,
        "strategy": true,
        "total_changes": 32
    }
}