{
    "category": [
        "memory",
        "build/refactor/preprocessing"
    ],
    "commits": [
        {
            "associated_pull_request": [],
            "date": "2020-05-04 09:00:57",
            "diff": "",
            "diff_additions": 0,
            "diff_deletions": 0,
            "diff_file_size": 0,
            "diff_url": "https://github.com/gluster/glusterfs/commit/5391f16fc4aa00f75af2a4c2707768370ace5f6c.diff",
            "exists": true,
            "files": [],
            "interesting": {
                "reopen": false,
                "status": false
            },
            "is_parent": true,
            "sha": "5391f16fc4aa00f75af2a4c2707768370ace5f6c"
        },
        {
            "associated_pull_request": [],
            "date": "2020-05-27 15:20:46",
            "diff": "gluster_glusterfs/issue_1303/commit_c4a6748f25d2c1ab3ebcf89952278ebf94c8d371.diff",
            "diff_additions": 21,
            "diff_deletions": 11,
            "diff_file_size": 259611,
            "diff_url": "https://github.com/gluster/glusterfs/commit/c4a6748f25d2c1ab3ebcf89952278ebf94c8d371.diff",
            "exists": true,
            "files": [
                {
                    "file_additions": 13,
                    "file_deletions": 11,
                    "file_exists": true,
                    "file_name": "xlators/cluster/afr/src/afr-common.c",
                    "file_size": 224067
                },
                {
                    "file_additions": 8,
                    "file_deletions": 0,
                    "file_exists": true,
                    "file_name": "xlators/cluster/afr/src/afr-dir-write.c",
                    "file_size": 35544
                }
            ],
            "interesting": {
                "reopen": true,
                "status": false
            },
            "is_parent": false,
            "sha": "c4a6748f25d2c1ab3ebcf89952278ebf94c8d371"
        },
        {
            "associated_pull_request": [],
            "date": "2020-06-16 05:17:47",
            "diff": "gluster_glusterfs/issue_1303/commit_2b9db55d2bf152bdb114f79dd6b7f2a12c379c26.diff",
            "diff_additions": 21,
            "diff_deletions": 11,
            "diff_file_size": 259611,
            "diff_url": "https://github.com/gluster/glusterfs/commit/2b9db55d2bf152bdb114f79dd6b7f2a12c379c26.diff",
            "exists": true,
            "files": [
                {
                    "file_additions": 13,
                    "file_deletions": 11,
                    "file_exists": true,
                    "file_name": "xlators/cluster/afr/src/afr-common.c",
                    "file_size": 224067
                },
                {
                    "file_additions": 8,
                    "file_deletions": 0,
                    "file_exists": true,
                    "file_name": "xlators/cluster/afr/src/afr-dir-write.c",
                    "file_size": 35544
                }
            ],
            "interesting": {
                "reopen": false,
                "status": false
            },
            "is_parent": false,
            "sha": "2b9db55d2bf152bdb114f79dd6b7f2a12c379c26"
        },
        {
            "associated_pull_request": [],
            "date": "2020-06-16 05:17:47",
            "diff": "gluster_glusterfs/issue_1303/commit_4cc44e3f128bf0eb90e5634c634ff5eabeaeda60.diff",
            "diff_additions": 21,
            "diff_deletions": 11,
            "diff_file_size": 259611,
            "diff_url": "https://github.com/gluster/glusterfs/commit/4cc44e3f128bf0eb90e5634c634ff5eabeaeda60.diff",
            "exists": true,
            "files": [
                {
                    "file_additions": 13,
                    "file_deletions": 11,
                    "file_exists": true,
                    "file_name": "xlators/cluster/afr/src/afr-common.c",
                    "file_size": 224067
                },
                {
                    "file_additions": 8,
                    "file_deletions": 0,
                    "file_exists": true,
                    "file_name": "xlators/cluster/afr/src/afr-dir-write.c",
                    "file_size": 35544
                }
            ],
            "interesting": {
                "reopen": false,
                "status": false
            },
            "is_parent": false,
            "sha": "4cc44e3f128bf0eb90e5634c634ff5eabeaeda60"
        }
    ],
    "first_commit": "2020-06-15 12:55:56",
    "last_commit": "2020-07-08 01:26:32",
    "number": 1303,
    "pull_request": "None",
    "score": {
        "accidental_reopen_likely": false,
        "all_labels": [
            "Type:Bug",
            "release 7",
            "release-6"
        ],
        "contains_keywords": [
            "fail",
            "error",
            "bug",
            "patch",
            "issu",
            "work",
            "perform",
            "debug"
        ],
        "fix_size": 66,
        "has_labels": [],
        "intersecting": {
            "computed_score": 0.2857142857142857,
            "final_commit_size": 28,
            "intersection_size": 8,
            "previous_commits_size": 46
        },
        "is_makefile_based": true,
        "no_new_files": [],
        "no_other_files": false,
        "num_prohibited_files": 72784,
        "prohibited_files": [
            "hal/inc/pinmap_hal.h",
            "Debug/marvin.bin",
            "Debug/marvin.elf",
            "Debug/marvin.hex",
            "Debug/marvin.bin",
            "Debug/marvin.elf",
            "Debug/marvin.hex",
            "inc/spark_utilities.h",
            "Debug/marvin.bin",
            "Debug/marvin.elf"
        ],
        "reopen": true,
        "reopen_events": [
            [
                "2020-06-16 04:53:24",
                "closed"
            ],
            [
                "2020-06-16 04:53:24",
                "commit"
            ],
            [
                "2020-06-16 04:59:25",
                "reopened"
            ],
            [
                "2020-06-18 05:57:45",
                "commit"
            ],
            [
                "2020-06-29 12:51:51",
                "commit"
            ],
            [
                "2020-07-08 01:26:52",
                "commit"
            ],
            [
                "2021-01-12 04:29:54",
                "closed"
            ]
        ],
        "status": false,
        "strategy": true,
        "total_changes": 96
    }
}