{
    "category": [
        "build/refactor/preprocessing",
        "network/protocol"
    ],
    "commits": [
        {
            "associated_pull_request": [],
            "date": "2018-01-29 11:23:56",
            "diff": "vifm_vifm/issue_304/commit_abe623bb1bd618eaf66ea7181476281a7942064b.diff",
            "diff_additions": 47,
            "diff_deletions": 7,
            "diff_file_size": 229090,
            "diff_url": "https://github.com/vifm/vifm/commit/abe623bb1bd618eaf66ea7181476281a7942064b.diff",
            "exists": true,
            "files": [
                {
                    "file_additions": 6,
                    "file_deletions": 0,
                    "file_exists": true,
                    "file_name": "src/cmd_handlers.c",
                    "file_size": 139023
                },
                {
                    "file_additions": 7,
                    "file_deletions": 5,
                    "file_exists": true,
                    "file_name": "src/fops_common.c",
                    "file_size": 27670
                },
                {
                    "file_additions": 1,
                    "file_deletions": 1,
                    "file_exists": true,
                    "file_name": "src/fops_cpmv.c",
                    "file_size": 15856
                },
                {
                    "file_additions": 1,
                    "file_deletions": 1,
                    "file_exists": true,
                    "file_name": "src/fops_misc.c",
                    "file_size": 31466
                },
                {
                    "file_additions": 16,
                    "file_deletions": 0,
                    "file_exists": true,
                    "file_name": "tests/fileops/clone_files.c",
                    "file_size": 4064
                },
                {
                    "file_additions": 16,
                    "file_deletions": 0,
                    "file_exists": true,
                    "file_name": "tests/fileops/cpmv_files.c",
                    "file_size": 11011
                }
            ],
            "interesting": {
                "reopen": false,
                "status": false
            },
            "is_parent": true,
            "sha": "abe623bb1bd618eaf66ea7181476281a7942064b"
        },
        {
            "associated_pull_request": [],
            "date": "2018-02-04 11:00:31",
            "diff": "vifm_vifm/issue_304/commit_e01e821c0ebc34919c0ccb66effc86d18e163f8d.diff",
            "diff_additions": 62,
            "diff_deletions": 3,
            "diff_file_size": 31859,
            "diff_url": "https://github.com/vifm/vifm/commit/e01e821c0ebc34919c0ccb66effc86d18e163f8d.diff",
            "exists": true,
            "files": [
                {
                    "file_additions": 44,
                    "file_deletions": 1,
                    "file_exists": true,
                    "file_name": "src/ui/statusline.c",
                    "file_size": 24549
                },
                {
                    "file_additions": 18,
                    "file_deletions": 2,
                    "file_exists": true,
                    "file_name": "tests/misc/expand_status_line_macros.c",
                    "file_size": 7310
                }
            ],
            "interesting": {
                "reopen": false,
                "status": true
            },
            "is_parent": false,
            "sha": "e01e821c0ebc34919c0ccb66effc86d18e163f8d"
        },
        {
            "associated_pull_request": [],
            "date": "2018-02-04 11:00:31",
            "diff": "vifm_vifm/issue_304/commit_2b734c634115f0dee24375ff2abe5ea8ac0c5f43.diff",
            "diff_additions": 63,
            "diff_deletions": 3,
            "diff_file_size": 31859,
            "diff_url": "https://github.com/vifm/vifm/commit/2b734c634115f0dee24375ff2abe5ea8ac0c5f43.diff",
            "exists": true,
            "files": [
                {
                    "file_additions": 45,
                    "file_deletions": 1,
                    "file_exists": true,
                    "file_name": "src/ui/statusline.c",
                    "file_size": 24549
                },
                {
                    "file_additions": 18,
                    "file_deletions": 2,
                    "file_exists": true,
                    "file_name": "tests/misc/expand_status_line_macros.c",
                    "file_size": 7310
                }
            ],
            "interesting": {
                "reopen": false,
                "status": true
            },
            "is_parent": false,
            "sha": "2b734c634115f0dee24375ff2abe5ea8ac0c5f43"
        },
        {
            "associated_pull_request": [],
            "date": "2018-02-04 11:00:31",
            "diff": "vifm_vifm/issue_304/commit_5fee14f4da337e3d7915cedc52517c25cfc58d76.diff",
            "diff_additions": 67,
            "diff_deletions": 3,
            "diff_file_size": 31859,
            "diff_url": "https://github.com/vifm/vifm/commit/5fee14f4da337e3d7915cedc52517c25cfc58d76.diff",
            "exists": true,
            "files": [
                {
                    "file_additions": 45,
                    "file_deletions": 1,
                    "file_exists": true,
                    "file_name": "src/ui/statusline.c",
                    "file_size": 24549
                },
                {
                    "file_additions": 22,
                    "file_deletions": 2,
                    "file_exists": true,
                    "file_name": "tests/misc/expand_status_line_macros.c",
                    "file_size": 7310
                }
            ],
            "interesting": {
                "reopen": false,
                "status": false
            },
            "is_parent": false,
            "sha": "5fee14f4da337e3d7915cedc52517c25cfc58d76"
        },
        {
            "associated_pull_request": [
                "https://github.com/vifm/vifm/pull/307"
            ],
            "date": "2018-02-04 11:00:31",
            "diff": "vifm_vifm/issue_304/commit_0221c1057359abc5af931158c712a51f0a6070b1.diff",
            "diff_additions": 72,
            "diff_deletions": 3,
            "diff_file_size": 31859,
            "diff_url": "https://github.com/vifm/vifm/commit/0221c1057359abc5af931158c712a51f0a6070b1.diff",
            "exists": true,
            "files": [
                {
                    "file_additions": 49,
                    "file_deletions": 1,
                    "file_exists": true,
                    "file_name": "src/ui/statusline.c",
                    "file_size": 24549
                },
                {
                    "file_additions": 23,
                    "file_deletions": 2,
                    "file_exists": true,
                    "file_name": "tests/misc/expand_status_line_macros.c",
                    "file_size": 7310
                }
            ],
            "interesting": {
                "reopen": false,
                "status": false
            },
            "is_parent": false,
            "sha": "0221c1057359abc5af931158c712a51f0a6070b1"
        }
    ],
    "first_commit": "2018-01-29 11:23:56",
    "last_commit": "2018-02-04 12:04:50",
    "number": 304,
    "pull_request": "None",
    "score": {
        "accidental_reopen_likely": false,
        "all_labels": [
            "improvement/addition"
        ],
        "contains_keywords": [
            "reason",
            "crash",
            "fix",
            "issu"
        ],
        "fix_size": 75,
        "has_labels": [],
        "intersecting": {
            "computed_score": 0.9333333333333333,
            "final_commit_size": 75,
            "intersection_size": 70,
            "previous_commits_size": 70
        },
        "is_makefile_based": true,
        "no_new_files": [],
        "no_other_files": false,
        "num_prohibited_files": 79071,
        "prohibited_files": [
            "hal/inc/pinmap_hal.h",
            "Debug/marvin.bin",
            "Debug/marvin.elf",
            "Debug/marvin.hex",
            "Debug/marvin.bin",
            "Debug/marvin.elf",
            "Debug/marvin.hex",
            "inc/spark_utilities.h",
            "Debug/marvin.bin",
            "Debug/marvin.elf"
        ],
        "reopen": false,
        "reopen_events": [
            [
                "2018-02-04 11:03:47",
                "commit"
            ],
            [
                "2018-02-04 11:13:33",
                "commit"
            ],
            [
                "2018-02-04 11:20:49",
                "commit"
            ],
            [
                "2018-02-04 12:04:55",
                "commit"
            ],
            [
                "2018-02-05 16:47:11",
                "closed"
            ]
        ],
        "status": true,
        "strategy": true,
        "total_changes": 330
    }
}