{
    "covered_issues": [
        71,
        70,
        67,
        66,
        57,
        56,
        52,
        51,
        48,
        46,
        45,
        43,
        39,
        38,
        37,
        36,
        32,
        31,
        30,
        28,
        25,
        22,
        20,
        19,
        18,
        17,
        16,
        15,
        14,
        12,
        11,
        10,
        9,
        8,
        7,
        6,
        5,
        4,
        3,
        2
    ],
    "finished": true
}