{
    "commits": [
        {
            "diff": "elastic_elasticsearch/issue_36470/commit_2afa7faefd0cec893ad83298e43f6342d02c2d85.diff",
            "diff_additions": 25,
            "diff_deletions": 2,
            "diff_file_size": 7630,
            "files": [
                {
                    "file_additions": 25,
                    "file_deletions": 2,
                    "file_exists": true,
                    "file_name": "server/src/main/java/org/elasticsearch/bootstrap/Elasticsearch.java",
                    "file_size": 7630
                }
            ],
            "interesting": {
                "reopened": false,
                "status": false
            },
            "sha": "2afa7faefd0cec893ad83298e43f6342d02c2d85"
        },
        {
            "diff": "elastic_elasticsearch/issue_36470/commit_1ae53e6b20771fb29dec0095dc3a996e28540c08.diff",
            "diff_additions": 3,
            "diff_deletions": 27,
            "diff_file_size": 325463,
            "files": [
                {
                    "file_additions": 3,
                    "file_deletions": 27,
                    "file_exists": true,
                    "file_name": "server/src/test/java/org/elasticsearch/index/engine/InternalEngineTests.java",
                    "file_size": 325463
                }
            ],
            "interesting": {
                "reopened": true,
                "status": false
            },
            "sha": "1ae53e6b20771fb29dec0095dc3a996e28540c08"
        },
        {
            "diff": "elastic_elasticsearch/issue_36470/commit_1e9d0bb01e17d4ad6f5394007e9214595f4dcd4e.diff",
            "diff_additions": 1,
            "diff_deletions": 0,
            "diff_file_size": 325463,
            "files": [
                {
                    "file_additions": 1,
                    "file_deletions": 0,
                    "file_exists": true,
                    "file_name": "server/src/test/java/org/elasticsearch/index/engine/InternalEngineTests.java",
                    "file_size": 325463
                }
            ],
            "interesting": {
                "reopened": false,
                "status": false
            },
            "sha": "1e9d0bb01e17d4ad6f5394007e9214595f4dcd4e"
        },
        {
            "diff": "elastic_elasticsearch/issue_36470/commit_b54783dad7cbaf299ec273e07c6184a6498c58f6.diff",
            "diff_additions": 1,
            "diff_deletions": 0,
            "diff_file_size": 325463,
            "files": [
                {
                    "file_additions": 1,
                    "file_deletions": 0,
                    "file_exists": true,
                    "file_name": "server/src/test/java/org/elasticsearch/index/engine/InternalEngineTests.java",
                    "file_size": 325463
                }
            ],
            "interesting": {
                "reopened": false,
                "status": false
            },
            "sha": "b54783dad7cbaf299ec273e07c6184a6498c58f6"
        },
        {
            "diff": "elastic_elasticsearch/issue_36470/commit_528c4e874350fe1fcd06bba7d5afbfc33073c384.diff",
            "diff_additions": 1,
            "diff_deletions": 0,
            "diff_file_size": 325463,
            "files": [
                {
                    "file_additions": 1,
                    "file_deletions": 0,
                    "file_exists": true,
                    "file_name": "server/src/test/java/org/elasticsearch/index/engine/InternalEngineTests.java",
                    "file_size": 325463
                }
            ],
            "interesting": {
                "reopened": false,
                "status": false
            },
            "sha": "528c4e874350fe1fcd06bba7d5afbfc33073c384"
        },
        {
            "diff": "elastic_elasticsearch/issue_36470/commit_d238b2934cc1581d0309f5e9d88429b78fcfdab9.diff",
            "diff_additions": 6,
            "diff_deletions": 6,
            "diff_file_size": 325463,
            "files": [
                {
                    "file_additions": 6,
                    "file_deletions": 6,
                    "file_exists": true,
                    "file_name": "server/src/test/java/org/elasticsearch/index/engine/InternalEngineTests.java",
                    "file_size": 325463
                }
            ],
            "interesting": {
                "reopened": false,
                "status": false
            },
            "sha": "d238b2934cc1581d0309f5e9d88429b78fcfdab9"
        },
        {
            "diff": "elastic_elasticsearch/issue_36470/commit_c51ec7220ee397592353b44fc322f335ad086457.diff",
            "diff_additions": 6,
            "diff_deletions": 6,
            "diff_file_size": 325463,
            "files": [
                {
                    "file_additions": 6,
                    "file_deletions": 6,
                    "file_exists": true,
                    "file_name": "server/src/test/java/org/elasticsearch/index/engine/InternalEngineTests.java",
                    "file_size": 325463
                }
            ],
            "interesting": {
                "reopened": false,
                "status": false
            },
            "sha": "c51ec7220ee397592353b44fc322f335ad086457"
        },
        {
            "diff": "elastic_elasticsearch/issue_36470/commit_1d3b04961271cc80aefd3183c1818816306fe920.diff",
            "diff_additions": 3,
            "diff_deletions": 27,
            "diff_file_size": 325463,
            "files": [
                {
                    "file_additions": 3,
                    "file_deletions": 27,
                    "file_exists": true,
                    "file_name": "server/src/test/java/org/elasticsearch/index/engine/InternalEngineTests.java",
                    "file_size": 325463
                }
            ],
            "interesting": {
                "reopened": false,
                "status": false
            },
            "sha": "1d3b04961271cc80aefd3183c1818816306fe920"
        },
        {
            "diff": "elastic_elasticsearch/issue_36470/commit_b65addb2ea6b1f2293c2b4220417694271ae8ed6.diff",
            "diff_additions": 6,
            "diff_deletions": 6,
            "diff_file_size": 325463,
            "files": [
                {
                    "file_additions": 6,
                    "file_deletions": 6,
                    "file_exists": true,
                    "file_name": "server/src/test/java/org/elasticsearch/index/engine/InternalEngineTests.java",
                    "file_size": 325463
                }
            ],
            "interesting": {
                "reopened": false,
                "status": false
            },
            "sha": "b65addb2ea6b1f2293c2b4220417694271ae8ed6"
        },
        {
            "diff": "elastic_elasticsearch/issue_36470/commit_f57dd3ac44ab50f9e5c6b09143df84db251dd4be.diff",
            "diff_additions": 1,
            "diff_deletions": 1,
            "diff_file_size": 325463,
            "files": [
                {
                    "file_additions": 1,
                    "file_deletions": 1,
                    "file_exists": true,
                    "file_name": "server/src/test/java/org/elasticsearch/index/engine/InternalEngineTests.java",
                    "file_size": 325463
                }
            ],
            "interesting": {
                "reopened": false,
                "status": false
            },
            "sha": "f57dd3ac44ab50f9e5c6b09143df84db251dd4be"
        }
    ],
    "first_commit": "2018-12-13 15:23:45",
    "last_commit": "2018-12-23 08:37:26",
    "number": 36470,
    "score": 144.03125
}