{
    "category": [
        "GUI",
        "wrong API usage",
        "feature request"
    ],
    "commits": [
        {
            "associated_pull_request": [
                "https://github.com/SanderMertens/flecs/pull/196"
            ],
            "date": "2020-06-05 22:21:28",
            "diff": "sandermertens_flecs/issue_72/commit_a8f0e40afaeb5ae2d5dfadb93325ef62cfa8048f.diff",
            "diff_additions": 122,
            "diff_deletions": 117,
            "diff_file_size": 121627,
            "diff_url": "https://github.com/SanderMertens/flecs/commit/a8f0e40afaeb5ae2d5dfadb93325ef62cfa8048f.diff",
            "exists": true,
            "files": [
                {
                    "file_additions": 20,
                    "file_deletions": 15,
                    "file_exists": true,
                    "file_name": "src/filter.c",
                    "file_size": 15792
                },
                {
                    "file_additions": 23,
                    "file_deletions": 30,
                    "file_exists": false,
                    "file_name": "src/pipeline.c",
                    "file_size": 0
                },
                {
                    "file_additions": 21,
                    "file_deletions": 14,
                    "file_exists": true,
                    "file_name": "src/query.c",
                    "file_size": 92821
                },
                {
                    "file_additions": 15,
                    "file_deletions": 15,
                    "file_exists": false,
                    "file_name": "src/system.c",
                    "file_size": 0
                },
                {
                    "file_additions": 43,
                    "file_deletions": 43,
                    "file_exists": true,
                    "file_name": "test/api/src/FilterIter.c",
                    "file_size": 13014
                }
            ],
            "interesting": {
                "reopen": false,
                "status": false
            },
            "is_parent": true,
            "sha": "a8f0e40afaeb5ae2d5dfadb93325ef62cfa8048f"
        },
        {
            "associated_pull_request": [
                "https://github.com/SanderMertens/flecs/pull/196"
            ],
            "date": "2020-06-06 04:24:41",
            "diff": "sandermertens_flecs/issue_72/commit_4df679719f1fdffe29df767519b8c3fee344131a.diff",
            "diff_additions": 140,
            "diff_deletions": 12,
            "diff_file_size": 469517,
            "diff_url": "https://github.com/SanderMertens/flecs/commit/4df679719f1fdffe29df767519b8c3fee344131a.diff",
            "exists": true,
            "files": [
                {
                    "file_additions": 10,
                    "file_deletions": 8,
                    "file_exists": true,
                    "file_name": "src/entity.c",
                    "file_size": 107949
                },
                {
                    "file_additions": 3,
                    "file_deletions": 3,
                    "file_exists": true,
                    "file_name": "src/query.c",
                    "file_size": 92821
                },
                {
                    "file_additions": 50,
                    "file_deletions": 0,
                    "file_exists": false,
                    "file_name": "src/tree.c",
                    "file_size": 0
                },
                {
                    "file_additions": 61,
                    "file_deletions": 0,
                    "file_exists": true,
                    "file_name": "test/api/src/Hierarchies.c",
                    "file_size": 41321
                },
                {
                    "file_additions": 16,
                    "file_deletions": 1,
                    "file_exists": true,
                    "file_name": "test/api/src/main.c",
                    "file_size": 227426
                }
            ],
            "interesting": {
                "reopen": false,
                "status": true
            },
            "is_parent": false,
            "sha": "4df679719f1fdffe29df767519b8c3fee344131a"
        },
        {
            "associated_pull_request": [
                "https://github.com/SanderMertens/flecs/pull/196"
            ],
            "date": "2020-06-06 05:04:39",
            "diff": "sandermertens_flecs/issue_72/commit_b11a6beb6a8a0aa447b968f8a22ff3c8d3bf7411.diff",
            "diff_additions": 76,
            "diff_deletions": 153,
            "diff_file_size": 14173,
            "diff_url": "https://github.com/SanderMertens/flecs/commit/b11a6beb6a8a0aa447b968f8a22ff3c8d3bf7411.diff",
            "exists": true,
            "files": [
                {
                    "file_additions": 2,
                    "file_deletions": 2,
                    "file_exists": true,
                    "file_name": "examples/c/01_helloworld/src/main.c",
                    "file_size": 819
                },
                {
                    "file_additions": 3,
                    "file_deletions": 3,
                    "file_exists": true,
                    "file_name": "examples/c/12_override/src/main.c",
                    "file_size": 1928
                },
                {
                    "file_additions": 3,
                    "file_deletions": 1,
                    "file_exists": true,
                    "file_name": "examples/c/13_override_init/src/main.c",
                    "file_size": 1553
                },
                {
                    "file_additions": 24,
                    "file_deletions": 72,
                    "file_exists": true,
                    "file_name": "examples/c/23_get_children/src/main.c",
                    "file_size": 1058
                },
                {
                    "file_additions": 7,
                    "file_deletions": 9,
                    "file_exists": true,
                    "file_name": "examples/c/27_filter_iter/src/main.c",
                    "file_size": 2666
                },
                {
                    "file_additions": 7,
                    "file_deletions": 9,
                    "file_exists": true,
                    "file_name": "examples/c/28_snapshot_filter_iter/src/main.c",
                    "file_size": 3268
                },
                {
                    "file_additions": 6,
                    "file_deletions": 8,
                    "file_exists": true,
                    "file_name": "examples/c/34_persistent_query/src/main.c",
                    "file_size": 2007
                },
                {
                    "file_additions": 24,
                    "file_deletions": 49,
                    "file_exists": true,
                    "file_name": "examples/cpp/23_get_children/src/main.cpp",
                    "file_size": 874
                }
            ],
            "interesting": {
                "reopen": false,
                "status": false
            },
            "is_parent": false,
            "sha": "b11a6beb6a8a0aa447b968f8a22ff3c8d3bf7411"
        }
    ],
    "first_commit": "2020-06-05 22:21:28",
    "last_commit": "2020-06-06 05:04:39",
    "number": 72,
    "pull_request": "None",
    "score": {
        "accidental_reopen_likely": false,
        "all_labels": [
            "enhancement"
        ],
        "contains_keywords": [
            "chang",
            "problem"
        ],
        "fix_size": 280,
        "has_labels": [],
        "intersecting": {
            "computed_score": 0.0,
            "final_commit_size": 182,
            "intersection_size": 0,
            "previous_commits_size": 98
        },
        "is_makefile_based": true,
        "no_new_files": [
            "examples/c/01_helloworld/src/main.c",
            "examples/c/12_override/src/main.c",
            "examples/c/13_override_init/src/main.c",
            "examples/c/23_get_children/src/main.c",
            "examples/c/27_filter_iter/src/main.c",
            "examples/c/28_snapshot_filter_iter/src/main.c",
            "examples/c/34_persistent_query/src/main.c",
            "examples/cpp/23_get_children/src/main.cpp"
        ],
        "no_other_files": false,
        "num_prohibited_files": 19764,
        "prohibited_files": [
            "kill.h",
            "meminfo.h",
            "kill.h",
            "meminfo.h",
            "kill.h",
            "meminfo.h",
            "testsuite_cli_test.go",
            "testsuite_cli_test.go",
            "common.mk",
            "i3bar/include/draw_util.h"
        ],
        "reopen": false,
        "reopen_events": [
            [
                "2020-06-06 04:24:52",
                "commit"
            ],
            [
                "2020-06-06 05:04:54",
                "commit"
            ],
            [
                "2020-06-06 05:06:35",
                "closed"
            ]
        ],
        "status": true,
        "strategy": true,
        "total_changes": 620
    }
}