{
    "category": [
        "network/protocols",
        "multithreading"
    ],
    "commits": [
        {
            "associated_pull_request": [],
            "date": "2019-01-01 03:51:50",
            "diff": "seasx_seaslog/issue_175/commit_d8370ec42ca7e66c9eff5a04dbc2127d52546ce0.diff",
            "diff_additions": 68,
            "diff_deletions": 0,
            "diff_file_size": 22909,
            "diff_url": "https://github.com/SeasX/SeasLog/commit/d8370ec42ca7e66c9eff5a04dbc2127d52546ce0.diff",
            "exists": true,
            "files": [
                {
                    "file_additions": 68,
                    "file_deletions": 0,
                    "file_exists": true,
                    "file_name": "src/Performance.c",
                    "file_size": 22909
                }
            ],
            "interesting": {
                "reopen": false,
                "status": true
            },
            "is_parent": true,
            "sha": "d8370ec42ca7e66c9eff5a04dbc2127d52546ce0"
        },
        {
            "associated_pull_request": [],
            "date": "2019-01-30 16:25:12",
            "diff": "seasx_seaslog/issue_175/commit_01fe7763c768dcf7f8a9becbd6f91e5950fe9571.diff",
            "diff_additions": 351,
            "diff_deletions": 47,
            "diff_file_size": 108305,
            "diff_url": "https://github.com/SeasX/SeasLog/commit/01fe7763c768dcf7f8a9becbd6f91e5950fe9571.diff",
            "exists": true,
            "files": [
                {
                    "file_additions": 13,
                    "file_deletions": 5,
                    "file_exists": true,
                    "file_name": "seaslog.c",
                    "file_size": 43079
                },
                {
                    "file_additions": 3,
                    "file_deletions": 18,
                    "file_exists": true,
                    "file_name": "src/Buffer.c",
                    "file_size": 6588
                },
                {
                    "file_additions": 9,
                    "file_deletions": 0,
                    "file_exists": true,
                    "file_name": "src/Common.c",
                    "file_size": 6960
                },
                {
                    "file_additions": 1,
                    "file_deletions": 11,
                    "file_exists": true,
                    "file_name": "src/Logger.c",
                    "file_size": 9238
                },
                {
                    "file_additions": 313,
                    "file_deletions": 11,
                    "file_exists": true,
                    "file_name": "src/Performance.c",
                    "file_size": 22909
                },
                {
                    "file_additions": 10,
                    "file_deletions": 0,
                    "file_exists": true,
                    "file_name": "src/Request.c",
                    "file_size": 10560
                },
                {
                    "file_additions": 2,
                    "file_deletions": 2,
                    "file_exists": true,
                    "file_name": "src/StreamWrapper.c",
                    "file_size": 8971
                }
            ],
            "interesting": {
                "reopen": false,
                "status": true
            },
            "is_parent": false,
            "sha": "01fe7763c768dcf7f8a9becbd6f91e5950fe9571"
        },
        {
            "associated_pull_request": [],
            "date": "2019-02-12 07:31:44",
            "diff": "seasx_seaslog/issue_175/commit_7dc76096de650eab528b46c2c725566fbaacd476.diff",
            "diff_additions": 41,
            "diff_deletions": 0,
            "diff_file_size": 65988,
            "diff_url": "https://github.com/SeasX/SeasLog/commit/7dc76096de650eab528b46c2c725566fbaacd476.diff",
            "exists": true,
            "files": [
                {
                    "file_additions": 1,
                    "file_deletions": 0,
                    "file_exists": true,
                    "file_name": "seaslog.c",
                    "file_size": 43079
                },
                {
                    "file_additions": 40,
                    "file_deletions": 0,
                    "file_exists": true,
                    "file_name": "src/Performance.c",
                    "file_size": 22909
                }
            ],
            "interesting": {
                "reopen": false,
                "status": false
            },
            "is_parent": false,
            "sha": "7dc76096de650eab528b46c2c725566fbaacd476"
        }
    ],
    "first_commit": "2019-01-01 03:51:50",
    "last_commit": "2019-02-12 07:31:44",
    "number": 175,
    "pull_request": "None",
    "score": {
        "accidental_reopen_likely": false,
        "all_labels": [
            "new feature"
        ],
        "contains_keywords": [
            "fix",
            "fault",
            "perform"
        ],
        "fix_size": 421,
        "has_labels": [],
        "intersecting": {
            "computed_score": 0.3488372093023256,
            "final_commit_size": 43,
            "intersection_size": 15,
            "previous_commits_size": 393
        },
        "is_makefile_based": false,
        "no_new_files": [],
        "no_other_files": false,
        "num_prohibited_files": 37623,
        "prohibited_files": [
            "kill.h",
            "meminfo.h",
            "kill.h",
            "meminfo.h",
            "kill.h",
            "meminfo.h",
            "testsuite_cli_test.go",
            "testsuite_cli_test.go",
            "common.mk",
            "i3bar/include/draw_util.h"
        ],
        "reopen": false,
        "reopen_events": [
            [
                "2019-01-30 16:25:26",
                "commit"
            ],
            [
                "2019-01-30 16:29:57",
                "commit"
            ],
            [
                "2019-01-30 18:36:24",
                "closed"
            ],
            [
                "2019-01-30 18:36:24",
                "commit"
            ],
            [
                "2019-02-12 07:31:55",
                "commit"
            ]
        ],
        "status": true,
        "strategy": true,
        "total_changes": 507
    }
}