{
    "commits": [
        {
            "associated_pull_request": [
                "https://github.com/darktable-org/darktable/pull/3291"
            ],
            "date": "2019-11-05 07:52:21+00:00",
            "diff": "darktable-org_darktable/issue_3090/commit_37307a4d4f50b70c7470c12062489b9925e857a0.diff",
            "diff_additions": 1,
            "diff_deletions": 0,
            "diff_file_size": 155176,
            "diff_url": "https://github.com/darktable-org/darktable/commit/37307a4d4f50b70c7470c12062489b9925e857a0.diff",
            "exists": true,
            "files": [
                {
                    "file_additions": 1,
                    "file_deletions": 0,
                    "file_exists": true,
                    "file_name": "src/iop/denoiseprofile.c",
                    "file_size": 155176
                }
            ],
            "interesting": {
                "reopen": false,
                "status": false
            },
            "is_parent": true,
            "sha": "37307a4d4f50b70c7470c12062489b9925e857a0"
        },
        {
            "associated_pull_request": [
                "https://github.com/darktable-org/darktable/pull/3293"
            ],
            "date": "2019-11-05 11:09:19+00:00",
            "diff": "darktable-org_darktable/issue_3090/commit_724b2a00004bce88ea2ccdf06048e02d2337dc6b.diff",
            "diff_additions": 1,
            "diff_deletions": 1,
            "diff_file_size": 49867,
            "diff_url": "https://github.com/darktable-org/darktable/commit/724b2a00004bce88ea2ccdf06048e02d2337dc6b.diff",
            "exists": true,
            "files": [
                {
                    "file_additions": 1,
                    "file_deletions": 1,
                    "file_exists": true,
                    "file_name": "src/views/lighttable.c",
                    "file_size": 49867
                }
            ],
            "interesting": {
                "reopen": true,
                "status": false
            },
            "is_parent": false,
            "sha": "724b2a00004bce88ea2ccdf06048e02d2337dc6b"
        },
        {
            "associated_pull_request": [
                "https://github.com/darktable-org/darktable/pull/3334"
            ],
            "date": "2019-11-08 19:20:39+00:00",
            "diff": "darktable-org_darktable/issue_3090/commit_180adb87bcce3769e520061f2ba0ae3a9c682ef3.diff",
            "diff_additions": 14,
            "diff_deletions": 6,
            "diff_file_size": 49867,
            "diff_url": "https://github.com/darktable-org/darktable/commit/180adb87bcce3769e520061f2ba0ae3a9c682ef3.diff",
            "exists": true,
            "files": [
                {
                    "file_additions": 14,
                    "file_deletions": 6,
                    "file_exists": true,
                    "file_name": "src/views/lighttable.c",
                    "file_size": 49867
                }
            ],
            "interesting": {
                "reopen": false,
                "status": false
            },
            "is_parent": false,
            "sha": "180adb87bcce3769e520061f2ba0ae3a9c682ef3"
        },
        {
            "associated_pull_request": [
                "https://github.com/darktable-org/darktable/pull/3334"
            ],
            "date": "2019-11-08 19:20:39+00:00",
            "diff": "darktable-org_darktable/issue_3090/commit_27345e302c78fec009f5ef0c40b800f07b98b00f.diff",
            "diff_additions": 14,
            "diff_deletions": 6,
            "diff_file_size": 49867,
            "diff_url": "https://github.com/darktable-org/darktable/commit/27345e302c78fec009f5ef0c40b800f07b98b00f.diff",
            "exists": true,
            "files": [
                {
                    "file_additions": 14,
                    "file_deletions": 6,
                    "file_exists": true,
                    "file_name": "src/views/lighttable.c",
                    "file_size": 49867
                }
            ],
            "interesting": {
                "reopen": false,
                "status": false
            },
            "is_parent": false,
            "sha": "27345e302c78fec009f5ef0c40b800f07b98b00f"
        }
    ],
    "first_commit": "2019-11-05 08:59:53+00:00",
    "last_commit": "2019-11-09 13:48:17+00:00",
    "number": 3090,
    "pull_request": "None",
    "score": {
        "accidental_reopen_likely": false,
        "all_labels": [],
        "contains_keywords": [
            "work",
            "chang",
            "fix",
            "issu",
            "fault",
            "bug",
            "problem"
        ],
        "fix_size": 16,
        "has_labels": [],
        "intersecting": {
            "computed_score": 1.0,
            "final_commit_size": 15,
            "intersection_size": 15,
            "previous_commits_size": 16
        },
        "is_makefile_based": true,
        "no_new_files": [],
        "no_other_files": true,
        "num_prohibited_files": 67260,
        "prohibited_files": [
            "server/src/main/java/com/genymobile/scrcpy/Device.java",
            "server/src/main/java/com/genymobile/scrcpy/wrappers/SurfaceControl.java",
            "server/src/main/java/com/genymobile/scrcpy/Device.java",
            "server/src/main/java/com/genymobile/scrcpy/wrappers/SurfaceControl.java",
            "app/meson.build",
            "app/scrcpy.1",
            "app/src/common.h",
            "app/src/scrcpy.h",
            "app/src/server.h",
            "server/src/main/java/com/genymobile/scrcpy/Workarounds.java"
        ],
        "reopen": true,
        "reopen_events": [
            [
                "2019-11-05 11:16:46+00:00",
                "commit"
            ],
            [
                "2019-11-07 10:17:30+00:00",
                "closed"
            ],
            [
                "2019-11-08 16:53:28+00:00",
                "reopened"
            ],
            [
                "2019-11-08 19:25:07+00:00",
                "commit"
            ],
            [
                "2019-11-09 13:48:18+00:00",
                "closed"
            ],
            [
                "2019-11-09 13:48:20+00:00",
                "commit"
            ]
        ],
        "status": false,
        "strategy": true,
        "total_changes": 43
    }
}