{
    "covered_issues": [
        115,
        86,
        85,
        79,
        71,
        70,
        69,
        67,
        64,
        56,
        55,
        54,
        50,
        44,
        39,
        38,
        37,
        32,
        29,
        28,
        25,
        24,
        20,
        18,
        16,
        14,
        13,
        9,
        7,
        6,
        5,
        4,
        2,
        1
    ],
    "finished": true
}