{
    "category": [
        "memory",
        "network/protocols",
        "feature request"
    ],
    "commits": [
        {
            "associated_pull_request": [],
            "date": "2018-12-17 13:50:18",
            "diff": "",
            "diff_additions": 0,
            "diff_deletions": 0,
            "diff_file_size": 0,
            "diff_url": "https://github.com/varnish/hitch/commit/d42b3e4676b2cb14bcc11191005491cfb8a314ef.diff",
            "exists": true,
            "files": [],
            "interesting": {
                "reopen": false,
                "status": false
            },
            "is_parent": true,
            "sha": "d42b3e4676b2cb14bcc11191005491cfb8a314ef"
        },
        {
            "associated_pull_request": [],
            "date": "2019-01-07 12:02:45",
            "diff": "varnish_hitch/issue_185/commit_b3ca174c2208d138dd06cc820be919bb56c46b2a.diff",
            "diff_additions": 11,
            "diff_deletions": 0,
            "diff_file_size": 104106,
            "diff_url": "https://github.com/varnish/hitch/commit/b3ca174c2208d138dd06cc820be919bb56c46b2a.diff",
            "exists": true,
            "files": [
                {
                    "file_additions": 11,
                    "file_deletions": 0,
                    "file_exists": true,
                    "file_name": "src/hitch.c",
                    "file_size": 104106
                }
            ],
            "interesting": {
                "reopen": false,
                "status": false
            },
            "is_parent": false,
            "sha": "b3ca174c2208d138dd06cc820be919bb56c46b2a"
        },
        {
            "associated_pull_request": [],
            "date": "2019-01-07 12:02:45",
            "diff": "varnish_hitch/issue_185/commit_981e185b8a025c655df8eefe5a3518157f012277.diff",
            "diff_additions": 11,
            "diff_deletions": 0,
            "diff_file_size": 104106,
            "diff_url": "https://github.com/varnish/hitch/commit/981e185b8a025c655df8eefe5a3518157f012277.diff",
            "exists": true,
            "files": [
                {
                    "file_additions": 11,
                    "file_deletions": 0,
                    "file_exists": true,
                    "file_name": "src/hitch.c",
                    "file_size": 104106
                }
            ],
            "interesting": {
                "reopen": false,
                "status": false
            },
            "is_parent": false,
            "sha": "981e185b8a025c655df8eefe5a3518157f012277"
        },
        {
            "associated_pull_request": [
                "https://github.com/varnish/hitch/pull/290"
            ],
            "date": "2019-01-07 12:02:45",
            "diff": "varnish_hitch/issue_185/commit_c168aa7d57eb206bcb436cf0a69e2f0850774243.diff",
            "diff_additions": 11,
            "diff_deletions": 0,
            "diff_file_size": 104106,
            "diff_url": "https://github.com/varnish/hitch/commit/c168aa7d57eb206bcb436cf0a69e2f0850774243.diff",
            "exists": true,
            "files": [
                {
                    "file_additions": 11,
                    "file_deletions": 0,
                    "file_exists": true,
                    "file_name": "src/hitch.c",
                    "file_size": 104106
                }
            ],
            "interesting": {
                "reopen": false,
                "status": false
            },
            "is_parent": false,
            "sha": "c168aa7d57eb206bcb436cf0a69e2f0850774243"
        },
        {
            "associated_pull_request": [
                "https://github.com/varnish/hitch/pull/290"
            ],
            "date": "2019-01-07 12:02:45",
            "diff": "varnish_hitch/issue_185/commit_885b17950cd127064a9d95e2fcf308be03001cbb.diff",
            "diff_additions": 11,
            "diff_deletions": 0,
            "diff_file_size": 104106,
            "diff_url": "https://github.com/varnish/hitch/commit/885b17950cd127064a9d95e2fcf308be03001cbb.diff",
            "exists": true,
            "files": [
                {
                    "file_additions": 11,
                    "file_deletions": 0,
                    "file_exists": true,
                    "file_name": "src/hitch.c",
                    "file_size": 104106
                }
            ],
            "interesting": {
                "reopen": true,
                "status": false
            },
            "is_parent": false,
            "sha": "885b17950cd127064a9d95e2fcf308be03001cbb"
        }
    ],
    "first_commit": "2018-12-17 13:50:18",
    "last_commit": "2020-06-23 11:52:28",
    "number": 185,
    "pull_request": "None",
    "score": {
        "accidental_reopen_likely": false,
        "all_labels": [
            "enhancement"
        ],
        "contains_keywords": [
            "work",
            "reason",
            "fault",
            "test",
            "remov",
            "issu",
            "error",
            "chang"
        ],
        "fix_size": 12,
        "has_labels": [],
        "intersecting": {
            "computed_score": 1.0,
            "final_commit_size": 12,
            "intersection_size": 12,
            "previous_commits_size": 12
        },
        "is_makefile_based": true,
        "no_new_files": [],
        "no_other_files": false,
        "num_prohibited_files": 94752,
        "prohibited_files": [
            "kill.h",
            "meminfo.h",
            "kill.h",
            "meminfo.h",
            "kill.h",
            "meminfo.h",
            "testsuite_cli_test.go",
            "testsuite_cli_test.go",
            "common.mk",
            "i3bar/include/draw_util.h"
        ],
        "reopen": true,
        "reopen_events": [
            [
                "2019-01-07 12:03:28",
                "commit"
            ],
            [
                "2019-01-16 12:03:29",
                "commit"
            ],
            [
                "2019-01-16 12:15:46",
                "commit"
            ],
            [
                "2019-02-06 13:33:01",
                "closed"
            ],
            [
                "2019-02-06 13:33:03",
                "commit"
            ],
            [
                "2019-02-18 12:21:20",
                "reopened"
            ],
            [
                "2019-02-19 15:03:37",
                "closed"
            ],
            [
                "2019-02-19 15:03:37",
                "commit"
            ],
            [
                "2020-05-12 11:48:54",
                "commit"
            ],
            [
                "2020-05-17 16:13:26",
                "commit"
            ],
            [
                "2020-06-23 11:52:31",
                "commit"
            ]
        ],
        "status": false,
        "strategy": true,
        "total_changes": 44
    }
}