{
    "commits": [
        {
            "associated_pull_request": [
                "https://github.com/openzfs/zfs/pull/6926"
            ],
            "date": "2017-12-21 17:13:06+00:00",
            "diff": "openzfs_zfs/issue_6171/commit_a8b2e30685c9214ccfd0181977540e080340df4e.diff",
            "diff_additions": 112,
            "diff_deletions": 35,
            "diff_file_size": 700860,
            "diff_url": "https://github.com/openzfs/zfs/commit/a8b2e30685c9214ccfd0181977540e080340df4e.diff",
            "exists": true,
            "files": [
                {
                    "file_additions": 28,
                    "file_deletions": 26,
                    "file_exists": true,
                    "file_name": "module/zfs/arc.c",
                    "file_size": 347906
                },
                {
                    "file_additions": 4,
                    "file_deletions": 4,
                    "file_exists": true,
                    "file_name": "module/zfs/dsl_scan.c",
                    "file_size": 161715
                },
                {
                    "file_additions": 42,
                    "file_deletions": 0,
                    "file_exists": true,
                    "file_name": "module/zfs/vdev_queue.c",
                    "file_size": 38256
                },
                {
                    "file_additions": 38,
                    "file_deletions": 5,
                    "file_exists": true,
                    "file_name": "module/zfs/zio.c",
                    "file_size": 152983
                }
            ],
            "interesting": {
                "reopen": false,
                "status": false
            },
            "is_parent": true,
            "sha": "a8b2e30685c9214ccfd0181977540e080340df4e"
        },
        {
            "associated_pull_request": [],
            "date": "2017-12-20 22:45:23+00:00",
            "diff": "openzfs_zfs/issue_6171/commit_48c5f29ae7ff0db71b89643191458e548eaf0b46.diff",
            "diff_additions": 50,
            "diff_deletions": 1,
            "diff_file_size": 500994,
            "diff_url": "https://github.com/openzfs/zfs/commit/48c5f29ae7ff0db71b89643191458e548eaf0b46.diff",
            "exists": true,
            "files": [
                {
                    "file_additions": 47,
                    "file_deletions": 0,
                    "file_exists": true,
                    "file_name": "module/zfs/arc.c",
                    "file_size": 347906
                },
                {
                    "file_additions": 3,
                    "file_deletions": 1,
                    "file_exists": true,
                    "file_name": "module/zfs/dbuf.c",
                    "file_size": 153088
                }
            ],
            "interesting": {
                "reopen": false,
                "status": false
            },
            "is_parent": false,
            "sha": "48c5f29ae7ff0db71b89643191458e548eaf0b46"
        },
        {
            "associated_pull_request": [
                "https://github.com/openzfs/zfs/pull/6989"
            ],
            "date": "2017-12-20 22:45:23+00:00",
            "diff": "openzfs_zfs/issue_6171/commit_e0014d56c3c21d53a71c436d54e10a456acb190d.diff",
            "diff_additions": 54,
            "diff_deletions": 2,
            "diff_file_size": 500994,
            "diff_url": "https://github.com/openzfs/zfs/commit/e0014d56c3c21d53a71c436d54e10a456acb190d.diff",
            "exists": true,
            "files": [
                {
                    "file_additions": 51,
                    "file_deletions": 1,
                    "file_exists": true,
                    "file_name": "module/zfs/arc.c",
                    "file_size": 347906
                },
                {
                    "file_additions": 3,
                    "file_deletions": 1,
                    "file_exists": true,
                    "file_name": "module/zfs/dbuf.c",
                    "file_size": 153088
                }
            ],
            "interesting": {
                "reopen": false,
                "status": false
            },
            "is_parent": false,
            "sha": "e0014d56c3c21d53a71c436d54e10a456acb190d"
        },
        {
            "associated_pull_request": [],
            "date": "2017-12-20 22:45:23+00:00",
            "diff": "openzfs_zfs/issue_6171/commit_fcdfb44cdaa52f0dd338a625cdbacbca81a486da.diff",
            "diff_additions": 54,
            "diff_deletions": 2,
            "diff_file_size": 500994,
            "diff_url": "https://github.com/openzfs/zfs/commit/fcdfb44cdaa52f0dd338a625cdbacbca81a486da.diff",
            "exists": true,
            "files": [
                {
                    "file_additions": 51,
                    "file_deletions": 1,
                    "file_exists": true,
                    "file_name": "module/zfs/arc.c",
                    "file_size": 347906
                },
                {
                    "file_additions": 3,
                    "file_deletions": 1,
                    "file_exists": true,
                    "file_name": "module/zfs/dbuf.c",
                    "file_size": 153088
                }
            ],
            "interesting": {
                "reopen": false,
                "status": false
            },
            "is_parent": false,
            "sha": "fcdfb44cdaa52f0dd338a625cdbacbca81a486da"
        },
        {
            "associated_pull_request": [],
            "date": "2017-12-20 22:45:23+00:00",
            "diff": "openzfs_zfs/issue_6171/commit_7e3ab6b5c1105010e3ab147ba33969e4cf41ac5c.diff",
            "diff_additions": 54,
            "diff_deletions": 2,
            "diff_file_size": 500994,
            "diff_url": "https://github.com/openzfs/zfs/commit/7e3ab6b5c1105010e3ab147ba33969e4cf41ac5c.diff",
            "exists": true,
            "files": [
                {
                    "file_additions": 51,
                    "file_deletions": 1,
                    "file_exists": true,
                    "file_name": "module/zfs/arc.c",
                    "file_size": 347906
                },
                {
                    "file_additions": 3,
                    "file_deletions": 1,
                    "file_exists": true,
                    "file_name": "module/zfs/dbuf.c",
                    "file_size": 153088
                }
            ],
            "interesting": {
                "reopen": false,
                "status": false
            },
            "is_parent": false,
            "sha": "7e3ab6b5c1105010e3ab147ba33969e4cf41ac5c"
        },
        {
            "associated_pull_request": [
                "https://github.com/openzfs/zfs/pull/6989"
            ],
            "date": "2018-01-08 17:52:36+00:00",
            "diff": "openzfs_zfs/issue_6171/commit_0873bb6337452e3e028e40f5dad945b30deab185.diff",
            "diff_additions": 54,
            "diff_deletions": 2,
            "diff_file_size": 500994,
            "diff_url": "https://github.com/openzfs/zfs/commit/0873bb6337452e3e028e40f5dad945b30deab185.diff",
            "exists": true,
            "files": [
                {
                    "file_additions": 51,
                    "file_deletions": 1,
                    "file_exists": true,
                    "file_name": "module/zfs/arc.c",
                    "file_size": 347906
                },
                {
                    "file_additions": 3,
                    "file_deletions": 1,
                    "file_exists": true,
                    "file_name": "module/zfs/dbuf.c",
                    "file_size": 153088
                }
            ],
            "interesting": {
                "reopen": false,
                "status": false
            },
            "is_parent": false,
            "sha": "0873bb6337452e3e028e40f5dad945b30deab185"
        },
        {
            "associated_pull_request": [],
            "date": "2017-12-20 22:45:23+00:00",
            "diff": "openzfs_zfs/issue_6171/commit_d0694dcf3e62173c081aa1ae7636d3ee0ce5b50b.diff",
            "diff_additions": 54,
            "diff_deletions": 2,
            "diff_file_size": 500994,
            "diff_url": "https://github.com/openzfs/zfs/commit/d0694dcf3e62173c081aa1ae7636d3ee0ce5b50b.diff",
            "exists": true,
            "files": [
                {
                    "file_additions": 51,
                    "file_deletions": 1,
                    "file_exists": true,
                    "file_name": "module/zfs/arc.c",
                    "file_size": 347906
                },
                {
                    "file_additions": 3,
                    "file_deletions": 1,
                    "file_exists": true,
                    "file_name": "module/zfs/dbuf.c",
                    "file_size": 153088
                }
            ],
            "interesting": {
                "reopen": false,
                "status": false
            },
            "is_parent": false,
            "sha": "d0694dcf3e62173c081aa1ae7636d3ee0ce5b50b"
        },
        {
            "associated_pull_request": [],
            "date": "2018-01-08 17:52:36+00:00",
            "diff": "openzfs_zfs/issue_6171/commit_2ee7255062b42ffa3a540ebd5a38e67927d97358.diff",
            "diff_additions": 54,
            "diff_deletions": 2,
            "diff_file_size": 500994,
            "diff_url": "https://github.com/openzfs/zfs/commit/2ee7255062b42ffa3a540ebd5a38e67927d97358.diff",
            "exists": true,
            "files": [
                {
                    "file_additions": 51,
                    "file_deletions": 1,
                    "file_exists": true,
                    "file_name": "module/zfs/arc.c",
                    "file_size": 347906
                },
                {
                    "file_additions": 3,
                    "file_deletions": 1,
                    "file_exists": true,
                    "file_name": "module/zfs/dbuf.c",
                    "file_size": 153088
                }
            ],
            "interesting": {
                "reopen": false,
                "status": false
            },
            "is_parent": false,
            "sha": "2ee7255062b42ffa3a540ebd5a38e67927d97358"
        },
        {
            "associated_pull_request": [],
            "date": "2018-01-08 17:52:36+00:00",
            "diff": "openzfs_zfs/issue_6171/commit_eff8739de40d2d0e6126ca43933f12a03b793eca.diff",
            "diff_additions": 54,
            "diff_deletions": 2,
            "diff_file_size": 500994,
            "diff_url": "https://github.com/openzfs/zfs/commit/eff8739de40d2d0e6126ca43933f12a03b793eca.diff",
            "exists": true,
            "files": [
                {
                    "file_additions": 51,
                    "file_deletions": 1,
                    "file_exists": true,
                    "file_name": "module/zfs/arc.c",
                    "file_size": 347906
                },
                {
                    "file_additions": 3,
                    "file_deletions": 1,
                    "file_exists": true,
                    "file_name": "module/zfs/dbuf.c",
                    "file_size": 153088
                }
            ],
            "interesting": {
                "reopen": false,
                "status": false
            },
            "is_parent": false,
            "sha": "eff8739de40d2d0e6126ca43933f12a03b793eca"
        },
        {
            "associated_pull_request": [],
            "date": "2018-01-08 17:52:36+00:00",
            "diff": "openzfs_zfs/issue_6171/commit_3cf3beab79777c691df03e73662bc4df9ce4328a.diff",
            "diff_additions": 55,
            "diff_deletions": 3,
            "diff_file_size": 500994,
            "diff_url": "https://github.com/openzfs/zfs/commit/3cf3beab79777c691df03e73662bc4df9ce4328a.diff",
            "exists": true,
            "files": [
                {
                    "file_additions": 52,
                    "file_deletions": 2,
                    "file_exists": true,
                    "file_name": "module/zfs/arc.c",
                    "file_size": 347906
                },
                {
                    "file_additions": 3,
                    "file_deletions": 1,
                    "file_exists": true,
                    "file_name": "module/zfs/dbuf.c",
                    "file_size": 153088
                }
            ],
            "interesting": {
                "reopen": false,
                "status": false
            },
            "is_parent": false,
            "sha": "3cf3beab79777c691df03e73662bc4df9ce4328a"
        },
        {
            "associated_pull_request": [],
            "date": "2018-01-08 17:52:36+00:00",
            "diff": "openzfs_zfs/issue_6171/commit_b114548e1ab93be2b276ad21d5b006ee47ca96ae.diff",
            "diff_additions": 54,
            "diff_deletions": 2,
            "diff_file_size": 500994,
            "diff_url": "https://github.com/openzfs/zfs/commit/b114548e1ab93be2b276ad21d5b006ee47ca96ae.diff",
            "exists": true,
            "files": [
                {
                    "file_additions": 51,
                    "file_deletions": 1,
                    "file_exists": true,
                    "file_name": "module/zfs/arc.c",
                    "file_size": 347906
                },
                {
                    "file_additions": 3,
                    "file_deletions": 1,
                    "file_exists": true,
                    "file_name": "module/zfs/dbuf.c",
                    "file_size": 153088
                }
            ],
            "interesting": {
                "reopen": false,
                "status": false
            },
            "is_parent": false,
            "sha": "b114548e1ab93be2b276ad21d5b006ee47ca96ae"
        },
        {
            "associated_pull_request": [],
            "date": "2018-01-08 17:52:36+00:00",
            "diff": "openzfs_zfs/issue_6171/commit_551d376fb997c31f66ec61b0c10a99853919e887.diff",
            "diff_additions": 55,
            "diff_deletions": 3,
            "diff_file_size": 500994,
            "diff_url": "https://github.com/openzfs/zfs/commit/551d376fb997c31f66ec61b0c10a99853919e887.diff",
            "exists": true,
            "files": [
                {
                    "file_additions": 52,
                    "file_deletions": 2,
                    "file_exists": true,
                    "file_name": "module/zfs/arc.c",
                    "file_size": 347906
                },
                {
                    "file_additions": 3,
                    "file_deletions": 1,
                    "file_exists": true,
                    "file_name": "module/zfs/dbuf.c",
                    "file_size": 153088
                }
            ],
            "interesting": {
                "reopen": false,
                "status": false
            },
            "is_parent": false,
            "sha": "551d376fb997c31f66ec61b0c10a99853919e887"
        },
        {
            "associated_pull_request": [],
            "date": "2018-01-08 17:52:36+00:00",
            "diff": "openzfs_zfs/issue_6171/commit_00f8c7941d43ab8d83a7d58c807710eac8203a31.diff",
            "diff_additions": 55,
            "diff_deletions": 3,
            "diff_file_size": 500994,
            "diff_url": "https://github.com/openzfs/zfs/commit/00f8c7941d43ab8d83a7d58c807710eac8203a31.diff",
            "exists": true,
            "files": [
                {
                    "file_additions": 52,
                    "file_deletions": 2,
                    "file_exists": true,
                    "file_name": "module/zfs/arc.c",
                    "file_size": 347906
                },
                {
                    "file_additions": 3,
                    "file_deletions": 1,
                    "file_exists": true,
                    "file_name": "module/zfs/dbuf.c",
                    "file_size": 153088
                }
            ],
            "interesting": {
                "reopen": false,
                "status": false
            },
            "is_parent": false,
            "sha": "00f8c7941d43ab8d83a7d58c807710eac8203a31"
        },
        {
            "associated_pull_request": [],
            "date": "2018-01-08 17:52:36+00:00",
            "diff": "openzfs_zfs/issue_6171/commit_1e8cb824588766b76884f33e47561b6e91485fa2.diff",
            "diff_additions": 56,
            "diff_deletions": 3,
            "diff_file_size": 500994,
            "diff_url": "https://github.com/openzfs/zfs/commit/1e8cb824588766b76884f33e47561b6e91485fa2.diff",
            "exists": true,
            "files": [
                {
                    "file_additions": 53,
                    "file_deletions": 2,
                    "file_exists": true,
                    "file_name": "module/zfs/arc.c",
                    "file_size": 347906
                },
                {
                    "file_additions": 3,
                    "file_deletions": 1,
                    "file_exists": true,
                    "file_name": "module/zfs/dbuf.c",
                    "file_size": 153088
                }
            ],
            "interesting": {
                "reopen": false,
                "status": false
            },
            "is_parent": false,
            "sha": "1e8cb824588766b76884f33e47561b6e91485fa2"
        },
        {
            "associated_pull_request": [],
            "date": "2018-01-08 17:52:36+00:00",
            "diff": "openzfs_zfs/issue_6171/commit_b172ea232d71d518c9876c71d45c0b6ac333e5d0.diff",
            "diff_additions": 55,
            "diff_deletions": 3,
            "diff_file_size": 500994,
            "diff_url": "https://github.com/openzfs/zfs/commit/b172ea232d71d518c9876c71d45c0b6ac333e5d0.diff",
            "exists": true,
            "files": [
                {
                    "file_additions": 52,
                    "file_deletions": 2,
                    "file_exists": true,
                    "file_name": "module/zfs/arc.c",
                    "file_size": 347906
                },
                {
                    "file_additions": 3,
                    "file_deletions": 1,
                    "file_exists": true,
                    "file_name": "module/zfs/dbuf.c",
                    "file_size": 153088
                }
            ],
            "interesting": {
                "reopen": false,
                "status": false
            },
            "is_parent": false,
            "sha": "b172ea232d71d518c9876c71d45c0b6ac333e5d0"
        },
        {
            "associated_pull_request": [],
            "date": "2018-01-08 17:52:36+00:00",
            "diff": "openzfs_zfs/issue_6171/commit_8125032bd95059466f7d83ec5590658f59dce327.diff",
            "diff_additions": 55,
            "diff_deletions": 3,
            "diff_file_size": 500994,
            "diff_url": "https://github.com/openzfs/zfs/commit/8125032bd95059466f7d83ec5590658f59dce327.diff",
            "exists": true,
            "files": [
                {
                    "file_additions": 52,
                    "file_deletions": 2,
                    "file_exists": true,
                    "file_name": "module/zfs/arc.c",
                    "file_size": 347906
                },
                {
                    "file_additions": 3,
                    "file_deletions": 1,
                    "file_exists": true,
                    "file_name": "module/zfs/dbuf.c",
                    "file_size": 153088
                }
            ],
            "interesting": {
                "reopen": false,
                "status": false
            },
            "is_parent": false,
            "sha": "8125032bd95059466f7d83ec5590658f59dce327"
        },
        {
            "associated_pull_request": [],
            "date": "2018-01-08 17:52:36+00:00",
            "diff": "openzfs_zfs/issue_6171/commit_a12cad1ae6ad139a7dbf20fe0cb857ee5b507469.diff",
            "diff_additions": 54,
            "diff_deletions": 2,
            "diff_file_size": 500994,
            "diff_url": "https://github.com/openzfs/zfs/commit/a12cad1ae6ad139a7dbf20fe0cb857ee5b507469.diff",
            "exists": true,
            "files": [
                {
                    "file_additions": 51,
                    "file_deletions": 1,
                    "file_exists": true,
                    "file_name": "module/zfs/arc.c",
                    "file_size": 347906
                },
                {
                    "file_additions": 3,
                    "file_deletions": 1,
                    "file_exists": true,
                    "file_name": "module/zfs/dbuf.c",
                    "file_size": 153088
                }
            ],
            "interesting": {
                "reopen": false,
                "status": false
            },
            "is_parent": false,
            "sha": "a12cad1ae6ad139a7dbf20fe0cb857ee5b507469"
        },
        {
            "associated_pull_request": [
                "https://github.com/tyler274/zfs/pull/1"
            ],
            "date": "2018-01-08 17:52:36+00:00",
            "diff": "openzfs_zfs/issue_6171/commit_9c1a8eaa51fa8db151570cb1da3199a46e9236d3.diff",
            "diff_additions": 55,
            "diff_deletions": 3,
            "diff_file_size": 500994,
            "diff_url": "https://github.com/openzfs/zfs/commit/9c1a8eaa51fa8db151570cb1da3199a46e9236d3.diff",
            "exists": true,
            "files": [
                {
                    "file_additions": 52,
                    "file_deletions": 2,
                    "file_exists": true,
                    "file_name": "module/zfs/arc.c",
                    "file_size": 347906
                },
                {
                    "file_additions": 3,
                    "file_deletions": 1,
                    "file_exists": true,
                    "file_name": "module/zfs/dbuf.c",
                    "file_size": 153088
                }
            ],
            "interesting": {
                "reopen": true,
                "status": false
            },
            "is_parent": false,
            "sha": "9c1a8eaa51fa8db151570cb1da3199a46e9236d3"
        },
        {
            "associated_pull_request": [],
            "date": "2018-01-08 17:52:36+00:00",
            "diff": "openzfs_zfs/issue_6171/commit_c4282ae3c755d782538c8d74c2ce5d1e566abfae.diff",
            "diff_additions": 54,
            "diff_deletions": 2,
            "diff_file_size": 500994,
            "diff_url": "https://github.com/openzfs/zfs/commit/c4282ae3c755d782538c8d74c2ce5d1e566abfae.diff",
            "exists": true,
            "files": [
                {
                    "file_additions": 51,
                    "file_deletions": 1,
                    "file_exists": true,
                    "file_name": "module/zfs/arc.c",
                    "file_size": 347906
                },
                {
                    "file_additions": 3,
                    "file_deletions": 1,
                    "file_exists": true,
                    "file_name": "module/zfs/dbuf.c",
                    "file_size": 153088
                }
            ],
            "interesting": {
                "reopen": false,
                "status": false
            },
            "is_parent": false,
            "sha": "c4282ae3c755d782538c8d74c2ce5d1e566abfae"
        }
    ],
    "first_commit": "2017-12-21 17:13:06+00:00",
    "last_commit": "2018-02-13 06:26:21+00:00",
    "number": 6171,
    "pull_request": "None",
    "score": {
        "accidental_reopen_likely": false,
        "all_labels": [
            "Type: Performance"
        ],
        "contains_keywords": [
            "work",
            "fail",
            "chang",
            "fix",
            "issu",
            "CI",
            "patch",
            "perform",
            "debug",
            "reason",
            "test",
            "fault",
            "leak",
            "remov",
            "bug",
            "error",
            "problem",
            "report",
            "workaround"
        ],
        "fix_size": 127,
        "has_labels": [],
        "intersecting": {
            "computed_score": 1.0,
            "final_commit_size": 56,
            "intersection_size": 56,
            "previous_commits_size": 127
        },
        "is_makefile_based": true,
        "no_new_files": [],
        "no_other_files": false,
        "num_prohibited_files": 179550,
        "prohibited_files": [
            "server/src/main/java/com/genymobile/scrcpy/Device.java",
            "server/src/main/java/com/genymobile/scrcpy/wrappers/SurfaceControl.java",
            "server/src/main/java/com/genymobile/scrcpy/Device.java",
            "server/src/main/java/com/genymobile/scrcpy/wrappers/SurfaceControl.java",
            "app/meson.build",
            "app/scrcpy.1",
            "app/src/common.h",
            "app/src/scrcpy.h",
            "app/src/server.h",
            "server/src/main/java/com/genymobile/scrcpy/Workarounds.java"
        ],
        "reopen": true,
        "reopen_events": [
            [
                "2017-12-21 18:30:47+00:00",
                "commit"
            ],
            [
                "2017-12-21 21:54:49+00:00",
                "commit"
            ],
            [
                "2017-12-27 18:46:45+00:00",
                "commit"
            ],
            [
                "2017-12-31 21:41:41+00:00",
                "commit"
            ],
            [
                "2018-01-05 03:26:30+00:00",
                "commit"
            ],
            [
                "2018-01-08 17:52:43+00:00",
                "closed"
            ],
            [
                "2018-01-08 17:52:43+00:00",
                "commit"
            ],
            [
                "2018-01-08 21:03:38+00:00",
                "commit"
            ],
            [
                "2018-01-11 04:51:00+00:00",
                "commit"
            ],
            [
                "2018-01-11 06:29:30+00:00",
                "commit"
            ],
            [
                "2018-01-16 22:45:31+00:00",
                "commit"
            ],
            [
                "2018-01-17 20:43:28+00:00",
                "commit"
            ],
            [
                "2018-01-18 01:47:56+00:00",
                "commit"
            ],
            [
                "2018-01-18 21:54:33+00:00",
                "commit"
            ],
            [
                "2018-01-19 02:51:29+00:00",
                "commit"
            ],
            [
                "2018-01-22 18:38:31+00:00",
                "commit"
            ],
            [
                "2018-01-23 01:19:09+00:00",
                "commit"
            ],
            [
                "2018-01-29 14:29:01+00:00",
                "commit"
            ],
            [
                "2018-02-06 00:44:55+00:00",
                "commit"
            ],
            [
                "2018-02-08 18:03:31+00:00",
                "reopened"
            ],
            [
                "2018-02-13 06:40:24+00:00",
                "commit"
            ],
            [
                "2018-05-23 18:09:10+00:00",
                "closed"
            ]
        ],
        "status": false,
        "strategy": true,
        "total_changes": 1165
    }
}