{
    "all_issues": 1050,
    "interesting_issues": 6,
    "last_update": "2021-05-16 11:01:11.263974",
    "license": {
        "download": "https://raw.githubusercontent.com/planck-repl/planck/master/LICENSE",
        "name": "Eclipse Public License 1.0"
    },
    "ratio": 0.005714285714285714,
    "size": 3827,
    "stars": 996,
    "url": "https://github.com/planck-repl/planck"
}