{
    "commits": [
        {
            "diff": "elastic_elasticsearch/issue_36151/commit_97107e99e8e30c0ba14e6903b5da5c3630a44e32.diff",
            "diff_additions": 44,
            "diff_deletions": 39,
            "diff_file_size": 0,
            "files": [
                {
                    "file_additions": 3,
                    "file_deletions": 37,
                    "file_exists": false,
                    "file_name": "x-pack/plugin/ccr/src/test/java/org/elasticsearch/xpack/ccr/LocalIndexFollowingIT.java",
                    "file_size": 0
                },
                {
                    "file_additions": 41,
                    "file_deletions": 2,
                    "file_exists": false,
                    "file_name": "x-pack/plugin/ccr/src/test/java/org/elasticsearch/xpack/ccr/action/FollowStatsIT.java",
                    "file_size": 0
                }
            ],
            "interesting": {
                "reopened": false,
                "status": false
            },
            "sha": "97107e99e8e30c0ba14e6903b5da5c3630a44e32"
        },
        {
            "diff": "elastic_elasticsearch/issue_36151/commit_7bf822bbbb7a624d80825b50e0506036bcd68691.diff",
            "diff_additions": 40,
            "diff_deletions": 4,
            "diff_file_size": 30739,
            "files": [
                {
                    "file_additions": 11,
                    "file_deletions": 4,
                    "file_exists": true,
                    "file_name": "server/src/main/java/org/elasticsearch/ingest/CompoundProcessor.java",
                    "file_size": 9814
                },
                {
                    "file_additions": 29,
                    "file_deletions": 0,
                    "file_exists": true,
                    "file_name": "server/src/test/java/org/elasticsearch/ingest/CompoundProcessorTests.java",
                    "file_size": 20925
                }
            ],
            "interesting": {
                "reopened": false,
                "status": false
            },
            "sha": "7bf822bbbb7a624d80825b50e0506036bcd68691"
        },
        {
            "diff": "elastic_elasticsearch/issue_36151/commit_6f9588c6adab93bf02b507315d6df4f00c394e84.diff",
            "diff_additions": 40,
            "diff_deletions": 4,
            "diff_file_size": 30739,
            "files": [
                {
                    "file_additions": 11,
                    "file_deletions": 4,
                    "file_exists": true,
                    "file_name": "server/src/main/java/org/elasticsearch/ingest/CompoundProcessor.java",
                    "file_size": 9814
                },
                {
                    "file_additions": 29,
                    "file_deletions": 0,
                    "file_exists": true,
                    "file_name": "server/src/test/java/org/elasticsearch/ingest/CompoundProcessorTests.java",
                    "file_size": 20925
                }
            ],
            "interesting": {
                "reopened": false,
                "status": false
            },
            "sha": "6f9588c6adab93bf02b507315d6df4f00c394e84"
        },
        {
            "diff": "elastic_elasticsearch/issue_36151/commit_6b4c8c85b2df4c9a519dfaba6146c31c0dcc37ad.diff",
            "diff_additions": 40,
            "diff_deletions": 4,
            "diff_file_size": 30739,
            "files": [
                {
                    "file_additions": 11,
                    "file_deletions": 4,
                    "file_exists": true,
                    "file_name": "server/src/main/java/org/elasticsearch/ingest/CompoundProcessor.java",
                    "file_size": 9814
                },
                {
                    "file_additions": 29,
                    "file_deletions": 0,
                    "file_exists": true,
                    "file_name": "server/src/test/java/org/elasticsearch/ingest/CompoundProcessorTests.java",
                    "file_size": 20925
                }
            ],
            "interesting": {
                "reopened": false,
                "status": false
            },
            "sha": "6b4c8c85b2df4c9a519dfaba6146c31c0dcc37ad"
        },
        {
            "diff": "elastic_elasticsearch/issue_36151/commit_e294056bbf3ce579c41847d0bbe4a407f9f3f1cd.diff",
            "diff_additions": 9269,
            "diff_deletions": 3066,
            "diff_file_size": 1778031,
            "files": [
                {
                    "file_additions": 3,
                    "file_deletions": 28,
                    "file_exists": true,
                    "file_name": "client/rest-high-level/src/main/java/org/elasticsearch/client/ml/job/config/Job.java",
                    "file_size": 23115
                },
                {
                    "file_additions": 0,
                    "file_deletions": 3,
                    "file_exists": true,
                    "file_name": "client/rest-high-level/src/test/java/org/elasticsearch/client/ml/job/config/JobTests.java",
                    "file_size": 7070
                },
                {
                    "file_additions": 5,
                    "file_deletions": 4,
                    "file_exists": true,
                    "file_name": "x-pack/plugin/core/src/main/java/org/elasticsearch/xpack/core/XPackClientPlugin.java",
                    "file_size": 36002
                },
                {
                    "file_additions": 0,
                    "file_deletions": 2,
                    "file_exists": true,
                    "file_name": "x-pack/plugin/core/src/main/java/org/elasticsearch/xpack/core/ml/MlMetaIndex.java",
                    "file_size": 1434
                },
                {
                    "file_additions": 11,
                    "file_deletions": 10,
                    "file_exists": true,
                    "file_name": "x-pack/plugin/core/src/main/java/org/elasticsearch/xpack/core/ml/MlMetadata.java",
                    "file_size": 13657
                },
                {
                    "file_additions": 73,
                    "file_deletions": 2,
                    "file_exists": true,
                    "file_name": "x-pack/plugin/core/src/main/java/org/elasticsearch/xpack/core/ml/MlTasks.java",
                    "file_size": 12999
                },
                {
                    "file_additions": 30,
                    "file_deletions": 6,
                    "file_exists": true,
                    "file_name": "x-pack/plugin/core/src/main/java/org/elasticsearch/xpack/core/ml/action/OpenJobAction.java",
                    "file_size": 8340
                },
                {
                    "file_additions": 1,
                    "file_deletions": 3,
                    "file_exists": true,
                    "file_name": "x-pack/plugin/core/src/main/java/org/elasticsearch/xpack/core/ml/action/PutDatafeedAction.java",
                    "file_size": 4305
                },
                {
                    "file_additions": 46,
                    "file_deletions": 5,
                    "file_exists": true,
                    "file_name": "x-pack/plugin/core/src/main/java/org/elasticsearch/xpack/core/ml/action/StartDatafeedAction.java",
                    "file_size": 12448
                },
                {
                    "file_additions": 4,
                    "file_deletions": 15,
                    "file_exists": true,
                    "file_name": "x-pack/plugin/core/src/main/java/org/elasticsearch/xpack/core/ml/action/UpdateJobAction.java",
                    "file_size": 4223
                },
                {
                    "file_additions": 2,
                    "file_deletions": 2,
                    "file_exists": true,
                    "file_name": "x-pack/plugin/core/src/main/java/org/elasticsearch/xpack/core/ml/calendars/Calendar.java",
                    "file_size": 5672
                },
                {
                    "file_additions": 2,
                    "file_deletions": 2,
                    "file_exists": true,
                    "file_name": "x-pack/plugin/core/src/main/java/org/elasticsearch/xpack/core/ml/calendars/ScheduledEvent.java",
                    "file_size": 9989
                },
                {
                    "file_additions": 26,
                    "file_deletions": 7,
                    "file_exists": true,
                    "file_name": "x-pack/plugin/core/src/main/java/org/elasticsearch/xpack/core/ml/datafeed/DatafeedConfig.java",
                    "file_size": 41041
                },
                {
                    "file_additions": 2,
                    "file_deletions": 2,
                    "file_exists": true,
                    "file_name": "x-pack/plugin/core/src/main/java/org/elasticsearch/xpack/core/ml/datafeed/DatafeedState.java",
                    "file_size": 2403
                },
                {
                    "file_additions": 1,
                    "file_deletions": 1,
                    "file_exists": true,
                    "file_name": "x-pack/plugin/core/src/main/java/org/elasticsearch/xpack/core/ml/datafeed/DatafeedUpdate.java",
                    "file_size": 22159
                },
                {
                    "file_additions": 9,
                    "file_deletions": 9,
                    "file_exists": true,
                    "file_name": "x-pack/plugin/core/src/main/java/org/elasticsearch/xpack/core/ml/job/config/AnalysisConfig.java",
                    "file_size": 31257
                },
                {
                    "file_additions": 3,
                    "file_deletions": 3,
                    "file_exists": true,
                    "file_name": "x-pack/plugin/core/src/main/java/org/elasticsearch/xpack/core/ml/job/config/CategorizationAnalyzerConfig.java",
                    "file_size": 16726
                },
                {
                    "file_additions": 6,
                    "file_deletions": 6,
                    "file_exists": true,
                    "file_name": "x-pack/plugin/core/src/main/java/org/elasticsearch/xpack/core/ml/job/config/DataDescription.java",
                    "file_size": 13680
                },
                {
                    "file_additions": 1,
                    "file_deletions": 1,
                    "file_exists": true,
                    "file_name": "x-pack/plugin/core/src/main/java/org/elasticsearch/xpack/core/ml/job/config/Detector.java",
                    "file_size": 28541
                },
                {
                    "file_additions": 45,
                    "file_deletions": 64,
                    "file_exists": true,
                    "file_name": "x-pack/plugin/core/src/main/java/org/elasticsearch/xpack/core/ml/job/config/Job.java",
                    "file_size": 54442
                },
                {
                    "file_additions": 2,
                    "file_deletions": 2,
                    "file_exists": true,
                    "file_name": "x-pack/plugin/core/src/main/java/org/elasticsearch/xpack/core/ml/job/config/JobTaskState.java",
                    "file_size": 4858
                },
                {
                    "file_additions": 42,
                    "file_deletions": 41,
                    "file_exists": true,
                    "file_name": "x-pack/plugin/core/src/main/java/org/elasticsearch/xpack/core/ml/job/config/JobUpdate.java",
                    "file_size": 35899
                },
                {
                    "file_additions": 2,
                    "file_deletions": 2,
                    "file_exists": true,
                    "file_name": "x-pack/plugin/core/src/main/java/org/elasticsearch/xpack/core/ml/job/config/MlFilter.java",
                    "file_size": 6617
                },
                {
                    "file_additions": 2,
                    "file_deletions": 2,
                    "file_exists": true,
                    "file_name": "x-pack/plugin/core/src/main/java/org/elasticsearch/xpack/core/ml/job/config/ModelPlotConfig.java",
                    "file_size": 4227
                },
                {
                    "file_additions": 3,
                    "file_deletions": 1,
                    "file_exists": true,
                    "file_name": "x-pack/plugin/core/src/main/java/org/elasticsearch/xpack/core/ml/job/messages/Messages.java",
                    "file_size": 23350
                },
                {
                    "file_additions": 8,
                    "file_deletions": 10,
                    "file_exists": true,
                    "file_name": "x-pack/plugin/core/src/main/java/org/elasticsearch/xpack/core/ml/job/persistence/AnomalyDetectorsIndex.java",
                    "file_size": 3351
                },
                {
                    "file_additions": 1,
                    "file_deletions": 0,
                    "file_exists": true,
                    "file_name": "x-pack/plugin/core/src/main/java/org/elasticsearch/xpack/core/ml/job/persistence/AnomalyDetectorsIndexFields.java",
                    "file_size": 612
                },
                {
                    "file_additions": 275,
                    "file_deletions": 5,
                    "file_exists": true,
                    "file_name": "x-pack/plugin/core/src/main/java/org/elasticsearch/xpack/core/ml/job/persistence/ElasticsearchMappings.java",
                    "file_size": 8328
                },
                {
                    "file_additions": 109,
                    "file_deletions": 8,
                    "file_exists": true,
                    "file_name": "x-pack/plugin/core/src/main/java/org/elasticsearch/xpack/core/ml/job/results/ReservedFieldNames.java",
                    "file_size": 11833
                },
                {
                    "file_additions": 9,
                    "file_deletions": 0,
                    "file_exists": true,
                    "file_name": "x-pack/plugin/core/src/main/java/org/elasticsearch/xpack/core/ml/utils/ExceptionsHelper.java",
                    "file_size": 6490
                },
                {
                    "file_additions": 10,
                    "file_deletions": 2,
                    "file_exists": true,
                    "file_name": "x-pack/plugin/core/src/main/java/org/elasticsearch/xpack/core/ml/utils/ToXContentParams.java",
                    "file_size": 1340
                },
                {
                    "file_additions": 126,
                    "file_deletions": 0,
                    "file_exists": true,
                    "file_name": "x-pack/plugin/core/src/test/java/org/elasticsearch/xpack/core/ml/MlTasksTests.java",
                    "file_size": 13810
                },
                {
                    "file_additions": 8,
                    "file_deletions": 0,
                    "file_exists": true,
                    "file_name": "x-pack/plugin/core/src/test/java/org/elasticsearch/xpack/core/ml/action/DatafeedParamsTests.java",
                    "file_size": 2004
                },
                {
                    "file_additions": 13,
                    "file_deletions": 0,
                    "file_exists": true,
                    "file_name": "x-pack/plugin/core/src/test/java/org/elasticsearch/xpack/core/ml/action/JobParamsTests.java",
                    "file_size": 2064
                },
                {
                    "file_additions": 8,
                    "file_deletions": 2,
                    "file_exists": true,
                    "file_name": "x-pack/plugin/core/src/test/java/org/elasticsearch/xpack/core/ml/action/UpdateJobActionRequestTests.java",
                    "file_size": 1479
                },
                {
                    "file_additions": 39,
                    "file_deletions": 1,
                    "file_exists": true,
                    "file_name": "x-pack/plugin/core/src/test/java/org/elasticsearch/xpack/core/ml/datafeed/DatafeedConfigTests.java",
                    "file_size": 56570
                },
                {
                    "file_additions": 7,
                    "file_deletions": 36,
                    "file_exists": true,
                    "file_name": "x-pack/plugin/core/src/test/java/org/elasticsearch/xpack/core/ml/job/config/JobTests.java",
                    "file_size": 32209
                },
                {
                    "file_additions": 3,
                    "file_deletions": 3,
                    "file_exists": true,
                    "file_name": "x-pack/plugin/core/src/test/java/org/elasticsearch/xpack/core/ml/job/config/JobUpdateTests.java",
                    "file_size": 20921
                },
                {
                    "file_additions": 53,
                    "file_deletions": 21,
                    "file_exists": true,
                    "file_name": "x-pack/plugin/core/src/test/java/org/elasticsearch/xpack/core/ml/job/persistence/ElasticsearchMappingsTests.java",
                    "file_size": 13819
                },
                {
                    "file_additions": 21,
                    "file_deletions": 6,
                    "file_exists": false,
                    "file_name": "x-pack/plugin/core/src/test/java/org/elasticsearch/xpack/test/rest/XPackRestTestHelper.java",
                    "file_size": 0
                },
                {
                    "file_additions": 2,
                    "file_deletions": 13,
                    "file_exists": false,
                    "file_name": "x-pack/plugin/ml/qa/native-multi-node-tests/src/test/java/org/elasticsearch/xpack/ml/integration/BasicRenormalizationIT.java",
                    "file_size": 0
                },
                {
                    "file_additions": 0,
                    "file_deletions": 11,
                    "file_exists": false,
                    "file_name": "x-pack/plugin/ml/qa/native-multi-node-tests/src/test/java/org/elasticsearch/xpack/ml/integration/DatafeedJobsIT.java",
                    "file_size": 0
                },
                {
                    "file_additions": 1,
                    "file_deletions": 1,
                    "file_exists": false,
                    "file_name": "x-pack/plugin/ml/qa/native-multi-node-tests/src/test/java/org/elasticsearch/xpack/ml/integration/DatafeedJobsRestIT.java",
                    "file_size": 0
                },
                {
                    "file_additions": 2,
                    "file_deletions": 2,
                    "file_exists": false,
                    "file_name": "x-pack/plugin/ml/qa/native-multi-node-tests/src/test/java/org/elasticsearch/xpack/ml/integration/DeleteExpiredDataIT.java",
                    "file_size": 0
                },
                {
                    "file_additions": 1,
                    "file_deletions": 1,
                    "file_exists": false,
                    "file_name": "x-pack/plugin/ml/qa/native-multi-node-tests/src/test/java/org/elasticsearch/xpack/ml/integration/InterimResultsDeletedAfterReopeningJobIT.java",
                    "file_size": 0
                },
                {
                    "file_additions": 3,
                    "file_deletions": 2,
                    "file_exists": false,
                    "file_name": "x-pack/plugin/ml/qa/native-multi-node-tests/src/test/java/org/elasticsearch/xpack/ml/integration/MlNativeAutodetectIntegTestCase.java",
                    "file_size": 0
                },
                {
                    "file_additions": 1,
                    "file_deletions": 12,
                    "file_exists": false,
                    "file_name": "x-pack/plugin/ml/qa/native-multi-node-tests/src/test/java/org/elasticsearch/xpack/ml/integration/OverallBucketsIT.java",
                    "file_size": 0
                },
                {
                    "file_additions": 0,
                    "file_deletions": 11,
                    "file_exists": false,
                    "file_name": "x-pack/plugin/ml/qa/native-multi-node-tests/src/test/java/org/elasticsearch/xpack/ml/integration/RestoreModelSnapshotIT.java",
                    "file_size": 0
                },
                {
                    "file_additions": 39,
                    "file_deletions": 8,
                    "file_exists": true,
                    "file_name": "x-pack/plugin/ml/src/main/java/org/elasticsearch/xpack/ml/MachineLearning.java",
                    "file_size": 74878
                },
                {
                    "file_additions": 48,
                    "file_deletions": 37,
                    "file_exists": true,
                    "file_name": "x-pack/plugin/ml/src/main/java/org/elasticsearch/xpack/ml/MlAssignmentNotifier.java",
                    "file_size": 7196
                },
                {
                    "file_additions": 112,
                    "file_deletions": 0,
                    "file_exists": true,
                    "file_name": "x-pack/plugin/ml/src/main/java/org/elasticsearch/xpack/ml/MlConfigMigrationEligibilityCheck.java",
                    "file_size": 5407
                },
                {
                    "file_additions": 538,
                    "file_deletions": 0,
                    "file_exists": true,
                    "file_name": "x-pack/plugin/ml/src/main/java/org/elasticsearch/xpack/ml/MlConfigMigrator.java",
                    "file_size": 32150
                },
                {
                    "file_additions": 17,
                    "file_deletions": 4,
                    "file_exists": true,
                    "file_name": "x-pack/plugin/ml/src/main/java/org/elasticsearch/xpack/ml/MlInitializationService.java",
                    "file_size": 4208
                },
                {
                    "file_additions": 152,
                    "file_deletions": 143,
                    "file_exists": true,
                    "file_name": "x-pack/plugin/ml/src/main/java/org/elasticsearch/xpack/ml/action/TransportCloseJobAction.java",
                    "file_size": 25722
                },
                {
                    "file_additions": 5,
                    "file_deletions": 2,
                    "file_exists": true,
                    "file_name": "x-pack/plugin/ml/src/main/java/org/elasticsearch/xpack/ml/action/TransportDeleteCalendarAction.java",
                    "file_size": 4123
                },
                {
                    "file_additions": 4,
                    "file_deletions": 2,
                    "file_exists": true,
                    "file_name": "x-pack/plugin/ml/src/main/java/org/elasticsearch/xpack/ml/action/TransportDeleteCalendarEventAction.java",
                    "file_size": 6170
                },
                {
                    "file_additions": 40,
                    "file_deletions": 33,
                    "file_exists": true,
                    "file_name": "x-pack/plugin/ml/src/main/java/org/elasticsearch/xpack/ml/action/TransportDeleteDatafeedAction.java",
                    "file_size": 8295
                },
                {
                    "file_additions": 2,
                    "file_deletions": 2,
                    "file_exists": true,
                    "file_name": "x-pack/plugin/ml/src/main/java/org/elasticsearch/xpack/ml/action/TransportDeleteExpiredDataAction.java",
                    "file_size": 12848
                },
                {
                    "file_additions": 43,
                    "file_deletions": 31,
                    "file_exists": true,
                    "file_name": "x-pack/plugin/ml/src/main/java/org/elasticsearch/xpack/ml/action/TransportDeleteFilterAction.java",
                    "file_size": 5105
                },
                {
                    "file_additions": 99,
                    "file_deletions": 81,
                    "file_exists": true,
                    "file_name": "x-pack/plugin/ml/src/main/java/org/elasticsearch/xpack/ml/action/TransportDeleteJobAction.java",
                    "file_size": 35333
                },
                {
                    "file_additions": 34,
                    "file_deletions": 28,
                    "file_exists": true,
                    "file_name": "x-pack/plugin/ml/src/main/java/org/elasticsearch/xpack/ml/action/TransportDeleteModelSnapshotAction.java",
                    "file_size": 6105
                },
                {
                    "file_additions": 44,
                    "file_deletions": 35,
                    "file_exists": true,
                    "file_name": "x-pack/plugin/ml/src/main/java/org/elasticsearch/xpack/ml/action/TransportFinalizeJobExecutionAction.java",
                    "file_size": 4536
                },
                {
                    "file_additions": 53,
                    "file_deletions": 44,
                    "file_exists": true,
                    "file_name": "x-pack/plugin/ml/src/main/java/org/elasticsearch/xpack/ml/action/TransportForecastJobAction.java",
                    "file_size": 9668
                },
                {
                    "file_additions": 28,
                    "file_deletions": 23,
                    "file_exists": true,
                    "file_name": "x-pack/plugin/ml/src/main/java/org/elasticsearch/xpack/ml/action/TransportGetBucketsAction.java",
                    "file_size": 3199
                },
                {
                    "file_additions": 26,
                    "file_deletions": 26,
                    "file_exists": true,
                    "file_name": "x-pack/plugin/ml/src/main/java/org/elasticsearch/xpack/ml/action/TransportGetCalendarEventsAction.java",
                    "file_size": 5483
                },
                {
                    "file_additions": 9,
                    "file_deletions": 6,
                    "file_exists": true,
                    "file_name": "x-pack/plugin/ml/src/main/java/org/elasticsearch/xpack/ml/action/TransportGetCategoriesAction.java",
                    "file_size": 2387
                },
                {
                    "file_additions": 62,
                    "file_deletions": 13,
                    "file_exists": true,
                    "file_name": "x-pack/plugin/ml/src/main/java/org/elasticsearch/xpack/ml/action/TransportGetDatafeedsAction.java",
                    "file_size": 5491
                },
                {
                    "file_additions": 18,
                    "file_deletions": 13,
                    "file_exists": true,
                    "file_name": "x-pack/plugin/ml/src/main/java/org/elasticsearch/xpack/ml/action/TransportGetDatafeedsStatsAction.java",
                    "file_size": 8088
                },
                {
                    "file_additions": 16,
                    "file_deletions": 13,
                    "file_exists": true,
                    "file_name": "x-pack/plugin/ml/src/main/java/org/elasticsearch/xpack/ml/action/TransportGetInfluencersAction.java",
                    "file_size": 2826
                },
                {
                    "file_additions": 8,
                    "file_deletions": 6,
                    "file_exists": true,
                    "file_name": "x-pack/plugin/ml/src/main/java/org/elasticsearch/xpack/ml/action/TransportGetJobsAction.java",
                    "file_size": 2758
                },
                {
                    "file_additions": 30,
                    "file_deletions": 24,
                    "file_exists": true,
                    "file_name": "x-pack/plugin/ml/src/main/java/org/elasticsearch/xpack/ml/action/TransportGetJobsStatsAction.java",
                    "file_size": 11952
                },
                {
                    "file_additions": 11,
                    "file_deletions": 7,
                    "file_exists": true,
                    "file_name": "x-pack/plugin/ml/src/main/java/org/elasticsearch/xpack/ml/action/TransportGetModelSnapshotsAction.java",
                    "file_size": 3997
                },
                {
                    "file_additions": 18,
                    "file_deletions": 14,
                    "file_exists": true,
                    "file_name": "x-pack/plugin/ml/src/main/java/org/elasticsearch/xpack/ml/action/TransportGetOverallBucketsAction.java",
                    "file_size": 15998
                },
                {
                    "file_additions": 16,
                    "file_deletions": 13,
                    "file_exists": true,
                    "file_name": "x-pack/plugin/ml/src/main/java/org/elasticsearch/xpack/ml/action/TransportGetRecordsAction.java",
                    "file_size": 2741
                },
                {
                    "file_additions": 0,
                    "file_deletions": 4,
                    "file_exists": true,
                    "file_name": "x-pack/plugin/ml/src/main/java/org/elasticsearch/xpack/ml/action/TransportJobTaskAction.java",
                    "file_size": 4909
                },
                {
                    "file_additions": 189,
                    "file_deletions": 123,
                    "file_exists": true,
                    "file_name": "x-pack/plugin/ml/src/main/java/org/elasticsearch/xpack/ml/action/TransportOpenJobAction.java",
                    "file_size": 17424
                },
                {
                    "file_additions": 6,
                    "file_deletions": 3,
                    "file_exists": true,
                    "file_name": "x-pack/plugin/ml/src/main/java/org/elasticsearch/xpack/ml/action/TransportPostCalendarEventsAction.java",
                    "file_size": 4980
                },
                {
                    "file_additions": 40,
                    "file_deletions": 37,
                    "file_exists": true,
                    "file_name": "x-pack/plugin/ml/src/main/java/org/elasticsearch/xpack/ml/action/TransportPreviewDatafeedAction.java",
                    "file_size": 8295
                },
                {
                    "file_additions": 2,
                    "file_deletions": 1,
                    "file_exists": true,
                    "file_name": "x-pack/plugin/ml/src/main/java/org/elasticsearch/xpack/ml/action/TransportPutCalendarAction.java",
                    "file_size": 4037
                },
                {
                    "file_additions": 66,
                    "file_deletions": 30,
                    "file_exists": true,
                    "file_name": "x-pack/plugin/ml/src/main/java/org/elasticsearch/xpack/ml/action/TransportPutDatafeedAction.java",
                    "file_size": 13778
                },
                {
                    "file_additions": 2,
                    "file_deletions": 1,
                    "file_exists": true,
                    "file_name": "x-pack/plugin/ml/src/main/java/org/elasticsearch/xpack/ml/action/TransportPutFilterAction.java",
                    "file_size": 4078
                },
                {
                    "file_additions": 28,
                    "file_deletions": 16,
                    "file_exists": true,
                    "file_name": "x-pack/plugin/ml/src/main/java/org/elasticsearch/xpack/ml/action/TransportRevertModelSnapshotAction.java",
                    "file_size": 12389
                },
                {
                    "file_additions": 114,
                    "file_deletions": 75,
                    "file_exists": true,
                    "file_name": "x-pack/plugin/ml/src/main/java/org/elasticsearch/xpack/ml/action/TransportStartDatafeedAction.java",
                    "file_size": 27574
                },
                {
                    "file_additions": 32,
                    "file_deletions": 43,
                    "file_exists": true,
                    "file_name": "x-pack/plugin/ml/src/main/java/org/elasticsearch/xpack/ml/action/TransportStopDatafeedAction.java",
                    "file_size": 21209
                },
                {
                    "file_additions": 4,
                    "file_deletions": 2,
                    "file_exists": true,
                    "file_name": "x-pack/plugin/ml/src/main/java/org/elasticsearch/xpack/ml/action/TransportUpdateCalendarJobAction.java",
                    "file_size": 2389
                },
                {
                    "file_additions": 78,
                    "file_deletions": 30,
                    "file_exists": true,
                    "file_name": "x-pack/plugin/ml/src/main/java/org/elasticsearch/xpack/ml/action/TransportUpdateDatafeedAction.java",
                    "file_size": 5970
                },
                {
                    "file_additions": 6,
                    "file_deletions": 3,
                    "file_exists": true,
                    "file_name": "x-pack/plugin/ml/src/main/java/org/elasticsearch/xpack/ml/action/TransportUpdateFilterAction.java",
                    "file_size": 8867
                },
                {
                    "file_additions": 4,
                    "file_deletions": 0,
                    "file_exists": true,
                    "file_name": "x-pack/plugin/ml/src/main/java/org/elasticsearch/xpack/ml/datafeed/DatafeedJob.java",
                    "file_size": 23633
                },
                {
                    "file_additions": 93,
                    "file_deletions": 31,
                    "file_exists": true,
                    "file_name": "x-pack/plugin/ml/src/main/java/org/elasticsearch/xpack/ml/datafeed/DatafeedJobBuilder.java",
                    "file_size": 7727
                },
                {
                    "file_additions": 31,
                    "file_deletions": 37,
                    "file_exists": true,
                    "file_name": "x-pack/plugin/ml/src/main/java/org/elasticsearch/xpack/ml/datafeed/DatafeedManager.java",
                    "file_size": 29291
                },
                {
                    "file_additions": 20,
                    "file_deletions": 18,
                    "file_exists": true,
                    "file_name": "x-pack/plugin/ml/src/main/java/org/elasticsearch/xpack/ml/datafeed/DatafeedNodeSelector.java",
                    "file_size": 8551
                },
                {
                    "file_additions": 511,
                    "file_deletions": 0,
                    "file_exists": true,
                    "file_name": "x-pack/plugin/ml/src/main/java/org/elasticsearch/xpack/ml/datafeed/persistence/DatafeedConfigProvider.java",
                    "file_size": 25641
                },
                {
                    "file_additions": 274,
                    "file_deletions": 218,
                    "file_exists": true,
                    "file_name": "x-pack/plugin/ml/src/main/java/org/elasticsearch/xpack/ml/job/JobManager.java",
                    "file_size": 32229
                },
                {
                    "file_additions": 44,
                    "file_deletions": 0,
                    "file_exists": false,
                    "file_name": "x-pack/plugin/ml/src/main/java/org/elasticsearch/xpack/ml/job/persistence/BatchedJobsIterator.java",
                    "file_size": 0
                },
                {
                    "file_additions": 158,
                    "file_deletions": 0,
                    "file_exists": false,
                    "file_name": "x-pack/plugin/ml/src/main/java/org/elasticsearch/xpack/ml/job/persistence/ExpandedIdsMatcher.java",
                    "file_size": 0
                },
                {
                    "file_additions": 849,
                    "file_deletions": 0,
                    "file_exists": true,
                    "file_name": "x-pack/plugin/ml/src/main/java/org/elasticsearch/xpack/ml/job/persistence/JobConfigProvider.java",
                    "file_size": 39169
                },
                {
                    "file_additions": 2,
                    "file_deletions": 2,
                    "file_exists": true,
                    "file_name": "x-pack/plugin/ml/src/main/java/org/elasticsearch/xpack/ml/job/persistence/JobResultsPersister.java",
                    "file_size": 24546
                },
                {
                    "file_additions": 1,
                    "file_deletions": 1,
                    "file_exists": true,
                    "file_name": "x-pack/plugin/ml/src/main/java/org/elasticsearch/xpack/ml/job/persistence/JobResultsProvider.java",
                    "file_size": 95037
                },
                {
                    "file_additions": 75,
                    "file_deletions": 59,
                    "file_exists": true,
                    "file_name": "x-pack/plugin/ml/src/main/java/org/elasticsearch/xpack/ml/job/process/autodetect/AutodetectProcessManager.java",
                    "file_size": 44911
                },
                {
                    "file_additions": 13,
                    "file_deletions": 144,
                    "file_exists": false,
                    "file_name": "x-pack/plugin/ml/src/main/java/org/elasticsearch/xpack/ml/job/process/autodetect/output/AutoDetectResultProcessor.java",
                    "file_size": 0
                },
                {
                    "file_additions": 63,
                    "file_deletions": 17,
                    "file_exists": true,
                    "file_name": "x-pack/plugin/ml/src/main/java/org/elasticsearch/xpack/ml/job/retention/AbstractExpiredJobDataRemover.java",
                    "file_size": 5420
                },
                {
                    "file_additions": 4,
                    "file_deletions": 4,
                    "file_exists": true,
                    "file_name": "x-pack/plugin/ml/src/main/java/org/elasticsearch/xpack/ml/job/retention/ExpiredModelSnapshotsRemover.java",
                    "file_size": 12083
                },
                {
                    "file_additions": 2,
                    "file_deletions": 3,
                    "file_exists": true,
                    "file_name": "x-pack/plugin/ml/src/main/java/org/elasticsearch/xpack/ml/job/retention/ExpiredResultsRemover.java",
                    "file_size": 9945
                },
                {
                    "file_additions": 292,
                    "file_deletions": 0,
                    "file_exists": true,
                    "file_name": "x-pack/plugin/ml/src/main/java/org/elasticsearch/xpack/ml/process/MlMemoryTracker.java",
                    "file_size": 22522
                },
                {
                    "file_additions": 4,
                    "file_deletions": 1,
                    "file_exists": false,
                    "file_name": "x-pack/plugin/ml/src/test/java/org/elasticsearch/license/MachineLearningLicensingTests.java",
                    "file_size": 0
                },
                {
                    "file_additions": 104,
                    "file_deletions": 23,
                    "file_exists": true,
                    "file_name": "x-pack/plugin/ml/src/test/java/org/elasticsearch/xpack/ml/MlAssignmentNotifierTests.java",
                    "file_size": 8983
                },
                {
                    "file_additions": 319,
                    "file_deletions": 0,
                    "file_exists": true,
                    "file_name": "x-pack/plugin/ml/src/test/java/org/elasticsearch/xpack/ml/MlConfigMigrationEligibilityCheckTests.java",
                    "file_size": 18453
                },
                {
                    "file_additions": 301,
                    "file_deletions": 0,
                    "file_exists": true,
                    "file_name": "x-pack/plugin/ml/src/test/java/org/elasticsearch/xpack/ml/MlConfigMigratorTests.java",
                    "file_size": 24610
                },
                {
                    "file_additions": 5,
                    "file_deletions": 52,
                    "file_exists": true,
                    "file_name": "x-pack/plugin/ml/src/test/java/org/elasticsearch/xpack/ml/MlInitializationServiceTests.java",
                    "file_size": 3383
                },
                {
                    "file_additions": 2,
                    "file_deletions": 2,
                    "file_exists": true,
                    "file_name": "x-pack/plugin/ml/src/test/java/org/elasticsearch/xpack/ml/MlMetadataTests.java",
                    "file_size": 8606
                },
                {
                    "file_additions": 59,
                    "file_deletions": 0,
                    "file_exists": true,
                    "file_name": "x-pack/plugin/ml/src/test/java/org/elasticsearch/xpack/ml/MlSingleNodeTestCase.java",
                    "file_size": 9293
                },
                {
                    "file_additions": 0,
                    "file_deletions": 68,
                    "file_exists": false,
                    "file_name": "x-pack/plugin/ml/src/test/java/org/elasticsearch/xpack/ml/MlTasksTests.java",
                    "file_size": 0
                },
                {
                    "file_additions": 167,
                    "file_deletions": 184,
                    "file_exists": true,
                    "file_name": "x-pack/plugin/ml/src/test/java/org/elasticsearch/xpack/ml/action/TransportCloseJobActionTests.java",
                    "file_size": 15505
                },
                {
                    "file_additions": 0,
                    "file_deletions": 37,
                    "file_exists": false,
                    "file_name": "x-pack/plugin/ml/src/test/java/org/elasticsearch/xpack/ml/action/TransportDeleteJobActionTests.java",
                    "file_size": 0
                },
                {
                    "file_additions": 89,
                    "file_deletions": 0,
                    "file_exists": true,
                    "file_name": "x-pack/plugin/ml/src/test/java/org/elasticsearch/xpack/ml/action/TransportFinalizeJobExecutionActionTests.java",
                    "file_size": 3944
                },
                {
                    "file_additions": 7,
                    "file_deletions": 27,
                    "file_exists": true,
                    "file_name": "x-pack/plugin/ml/src/test/java/org/elasticsearch/xpack/ml/action/TransportGetJobsStatsActionTests.java",
                    "file_size": 3901
                },
                {
                    "file_additions": 80,
                    "file_deletions": 175,
                    "file_exists": false,
                    "file_name": "x-pack/plugin/ml/src/test/java/org/elasticsearch/xpack/ml/action/TransportOpenJobActionTests.java",
                    "file_size": 0
                },
                {
                    "file_additions": 3,
                    "file_deletions": 33,
                    "file_exists": true,
                    "file_name": "x-pack/plugin/ml/src/test/java/org/elasticsearch/xpack/ml/action/TransportStartDatafeedActionTests.java",
                    "file_size": 6235
                },
                {
                    "file_additions": 13,
                    "file_deletions": 66,
                    "file_exists": true,
                    "file_name": "x-pack/plugin/ml/src/test/java/org/elasticsearch/xpack/ml/action/TransportStopDatafeedActionTests.java",
                    "file_size": 4290
                },
                {
                    "file_additions": 55,
                    "file_deletions": 11,
                    "file_exists": true,
                    "file_name": "x-pack/plugin/ml/src/test/java/org/elasticsearch/xpack/ml/datafeed/DatafeedJobBuilderTests.java",
                    "file_size": 10344
                },
                {
                    "file_additions": 16,
                    "file_deletions": 27,
                    "file_exists": true,
                    "file_name": "x-pack/plugin/ml/src/test/java/org/elasticsearch/xpack/ml/datafeed/DatafeedManagerTests.java",
                    "file_size": 25811
                },
                {
                    "file_additions": 53,
                    "file_deletions": 74,
                    "file_exists": true,
                    "file_name": "x-pack/plugin/ml/src/test/java/org/elasticsearch/xpack/ml/datafeed/DatafeedNodeSelectorTests.java",
                    "file_size": 27732
                },
                {
                    "file_additions": 2,
                    "file_deletions": 10,
                    "file_exists": false,
                    "file_name": "x-pack/plugin/ml/src/test/java/org/elasticsearch/xpack/ml/integration/AnnotationIndexIT.java",
                    "file_size": 0
                },
                {
                    "file_additions": 3,
                    "file_deletions": 26,
                    "file_exists": false,
                    "file_name": "x-pack/plugin/ml/src/test/java/org/elasticsearch/xpack/ml/integration/AutodetectResultProcessorIT.java",
                    "file_size": 0
                },
                {
                    "file_additions": 34,
                    "file_deletions": 6,
                    "file_exists": false,
                    "file_name": "x-pack/plugin/ml/src/test/java/org/elasticsearch/xpack/ml/integration/BasicDistributedJobsIT.java",
                    "file_size": 0
                },
                {
                    "file_additions": 354,
                    "file_deletions": 0,
                    "file_exists": false,
                    "file_name": "x-pack/plugin/ml/src/test/java/org/elasticsearch/xpack/ml/integration/DatafeedConfigProviderIT.java",
                    "file_size": 0
                },
                {
                    "file_additions": 576,
                    "file_deletions": 0,
                    "file_exists": false,
                    "file_name": "x-pack/plugin/ml/src/test/java/org/elasticsearch/xpack/ml/integration/JobConfigProviderIT.java",
                    "file_size": 0
                },
                {
                    "file_additions": 4,
                    "file_deletions": 33,
                    "file_exists": false,
                    "file_name": "x-pack/plugin/ml/src/test/java/org/elasticsearch/xpack/ml/integration/JobResultsProviderIT.java",
                    "file_size": 0
                },
                {
                    "file_additions": 309,
                    "file_deletions": 0,
                    "file_exists": false,
                    "file_name": "x-pack/plugin/ml/src/test/java/org/elasticsearch/xpack/ml/integration/MlConfigMigratorIT.java",
                    "file_size": 0
                },
                {
                    "file_additions": 89,
                    "file_deletions": 5,
                    "file_exists": false,
                    "file_name": "x-pack/plugin/ml/src/test/java/org/elasticsearch/xpack/ml/integration/MlDistributedFailureIT.java",
                    "file_size": 0
                },
                {
                    "file_additions": 262,
                    "file_deletions": 97,
                    "file_exists": true,
                    "file_name": "x-pack/plugin/ml/src/test/java/org/elasticsearch/xpack/ml/job/JobManagerTests.java",
                    "file_size": 31640
                },
                {
                    "file_additions": 101,
                    "file_deletions": 0,
                    "file_exists": false,
                    "file_name": "x-pack/plugin/ml/src/test/java/org/elasticsearch/xpack/ml/job/persistence/ExpandedIdsMatcherTests.java",
                    "file_size": 0
                },
                {
                    "file_additions": 100,
                    "file_deletions": 0,
                    "file_exists": true,
                    "file_name": "x-pack/plugin/ml/src/test/java/org/elasticsearch/xpack/ml/job/persistence/MockClientBuilder.java",
                    "file_size": 10758
                },
                {
                    "file_additions": 63,
                    "file_deletions": 32,
                    "file_exists": true,
                    "file_name": "x-pack/plugin/ml/src/test/java/org/elasticsearch/xpack/ml/job/process/autodetect/AutodetectProcessManagerTests.java",
                    "file_size": 38534
                },
                {
                    "file_additions": 10,
                    "file_deletions": 90,
                    "file_exists": false,
                    "file_name": "x-pack/plugin/ml/src/test/java/org/elasticsearch/xpack/ml/job/process/autodetect/output/AutoDetectResultProcessorTests.java",
                    "file_size": 0
                },
                {
                    "file_additions": 168,
                    "file_deletions": 0,
                    "file_exists": true,
                    "file_name": "x-pack/plugin/ml/src/test/java/org/elasticsearch/xpack/ml/job/retention/AbstractExpiredJobDataRemoverTests.java",
                    "file_size": 6665
                },
                {
                    "file_additions": 33,
                    "file_deletions": 75,
                    "file_exists": true,
                    "file_name": "x-pack/plugin/ml/src/test/java/org/elasticsearch/xpack/ml/job/retention/ExpiredModelSnapshotsRemoverTests.java",
                    "file_size": 20288
                },
                {
                    "file_additions": 13,
                    "file_deletions": 22,
                    "file_exists": true,
                    "file_name": "x-pack/plugin/ml/src/test/java/org/elasticsearch/xpack/ml/job/retention/ExpiredResultsRemoverTests.java",
                    "file_size": 8920
                },
                {
                    "file_additions": 161,
                    "file_deletions": 0,
                    "file_exists": true,
                    "file_name": "x-pack/plugin/ml/src/test/java/org/elasticsearch/xpack/ml/process/MlMemoryTrackerTests.java",
                    "file_size": 13005
                },
                {
                    "file_additions": 2,
                    "file_deletions": 1,
                    "file_exists": false,
                    "file_name": "x-pack/plugin/src/test/java/org/elasticsearch/xpack/test/rest/XPackRestIT.java",
                    "file_size": 0
                },
                {
                    "file_additions": 0,
                    "file_deletions": 7,
                    "file_exists": true,
                    "file_name": "x-pack/qa/full-cluster-restart/src/test/java/org/elasticsearch/xpack/restart/FullClusterRestartIT.java",
                    "file_size": 39242
                },
                {
                    "file_additions": 211,
                    "file_deletions": 0,
                    "file_exists": true,
                    "file_name": "x-pack/qa/full-cluster-restart/src/test/java/org/elasticsearch/xpack/restart/MlMigrationFullClusterRestartIT.java",
                    "file_size": 11055
                },
                {
                    "file_additions": 1,
                    "file_deletions": 2,
                    "file_exists": true,
                    "file_name": "x-pack/qa/rolling-upgrade/src/test/java/org/elasticsearch/upgrades/UpgradeClusterClientYamlTestSuiteIT.java",
                    "file_size": 4282
                }
            ],
            "interesting": {
                "reopened": false,
                "status": false
            },
            "sha": "e294056bbf3ce579c41847d0bbe4a407f9f3f1cd"
        },
        {
            "diff": "elastic_elasticsearch/issue_36151/commit_358fd4eec96e4febbd32d2652fa601f0f176501a.diff",
            "diff_additions": 40,
            "diff_deletions": 4,
            "diff_file_size": 30739,
            "files": [
                {
                    "file_additions": 11,
                    "file_deletions": 4,
                    "file_exists": true,
                    "file_name": "server/src/main/java/org/elasticsearch/ingest/CompoundProcessor.java",
                    "file_size": 9814
                },
                {
                    "file_additions": 29,
                    "file_deletions": 0,
                    "file_exists": true,
                    "file_name": "server/src/test/java/org/elasticsearch/ingest/CompoundProcessorTests.java",
                    "file_size": 20925
                }
            ],
            "interesting": {
                "reopened": false,
                "status": false
            },
            "sha": "358fd4eec96e4febbd32d2652fa601f0f176501a"
        }
    ],
    "first_commit": "2018-12-16 12:57:51",
    "last_commit": "2018-12-18 21:30:55",
    "number": 36151,
    "score": 320.00031761156106
}