typos and better parameter name
we need TLE8888 driver #714
we need TLE8888 driver #714
we need TLE8888 driver #714
we need TLE8888 driver #714
we need TLE8888 driver #714
we need TLE8888 driver #714
we need TLE8888 driver #714
we need TLE8888 driver #714
we need TLE8888 driver #714
we need TLE8888 driver #714
we need TLE8888 driver #714
we need TLE8888 driver #714
we need TLE8888 driver #714
we need TLE8888 driver #714
we need TLE8888 driver #714
it works now! all SPI/CS pins in 'default' mode
we need TLE8888 driver #714
we need TLE8888 driver #714
we need TLE8888 driver #714
F7 support
we need TLE8888 driver #714
we need TLE8888 driver #714
we need TLE8888 driver #714
reviving build
we need TLE8888 driver #714
we need TLE8888 driver #714
we need TLE8888 driver #714
we need TLE8888 driver #714
we need TLE8888 driver #714
we need TLE8888 driver #714
saving exact TLE8888 reponses
we need TLE8888 driver #714
trying a sleep before first command
we need TLE8888 driver #714
