{
    "commits": [
        {
            "associated_pull_request": [
                "https://github.com/darktable-org/darktable/pull/6910"
            ],
            "date": "2020-11-14 15:28:26+00:00",
            "diff": "darktable-org_darktable/issue_6900/commit_a95f76624dae5d6384a8ce729dd84f20c1ef7636.diff",
            "diff_additions": 31,
            "diff_deletions": 36,
            "diff_file_size": 201841,
            "diff_url": "https://github.com/darktable-org/darktable/commit/a95f76624dae5d6384a8ce729dd84f20c1ef7636.diff",
            "exists": true,
            "files": [
                {
                    "file_additions": 9,
                    "file_deletions": 6,
                    "file_exists": true,
                    "file_name": "src/develop/blend.c",
                    "file_size": 82945
                },
                {
                    "file_additions": 22,
                    "file_deletions": 30,
                    "file_exists": true,
                    "file_name": "src/develop/pixelpipe_hb.c",
                    "file_size": 118896
                }
            ],
            "interesting": {
                "reopen": false,
                "status": false
            },
            "is_parent": true,
            "sha": "a95f76624dae5d6384a8ce729dd84f20c1ef7636"
        },
        {
            "associated_pull_request": [],
            "date": "2020-11-14 17:09:25+00:00",
            "diff": "darktable-org_darktable/issue_6900/commit_27752c6b9f63ecc86453b62fd7c091d4710f886c.diff",
            "diff_additions": 28,
            "diff_deletions": 10,
            "diff_file_size": 75571,
            "diff_url": "https://github.com/darktable-org/darktable/commit/27752c6b9f63ecc86453b62fd7c091d4710f886c.diff",
            "exists": true,
            "files": [
                {
                    "file_additions": 28,
                    "file_deletions": 10,
                    "file_exists": true,
                    "file_name": "src/iop/temperature.c",
                    "file_size": 75571
                }
            ],
            "interesting": {
                "reopen": false,
                "status": false
            },
            "is_parent": false,
            "sha": "27752c6b9f63ecc86453b62fd7c091d4710f886c"
        },
        {
            "associated_pull_request": [],
            "date": "2020-11-22 20:03:50+00:00",
            "diff": "darktable-org_darktable/issue_6900/commit_b05f8555aee8d1e49c381736c3486ffe68a5b008.diff",
            "diff_additions": 3,
            "diff_deletions": 24,
            "diff_file_size": 75571,
            "diff_url": "https://github.com/darktable-org/darktable/commit/b05f8555aee8d1e49c381736c3486ffe68a5b008.diff",
            "exists": true,
            "files": [
                {
                    "file_additions": 3,
                    "file_deletions": 24,
                    "file_exists": true,
                    "file_name": "src/iop/temperature.c",
                    "file_size": 75571
                }
            ],
            "interesting": {
                "reopen": true,
                "status": false
            },
            "is_parent": false,
            "sha": "b05f8555aee8d1e49c381736c3486ffe68a5b008"
        },
        {
            "associated_pull_request": [],
            "date": "2020-11-22 23:38:02+00:00",
            "diff": "darktable-org_darktable/issue_6900/commit_f1ca6c55c7479f2a649e6c21072398da217742f0.diff",
            "diff_additions": 1,
            "diff_deletions": 0,
            "diff_file_size": 0,
            "diff_url": "https://github.com/darktable-org/darktable/commit/f1ca6c55c7479f2a649e6c21072398da217742f0.diff",
            "exists": true,
            "files": [
                {
                    "file_additions": 1,
                    "file_deletions": 0,
                    "file_exists": false,
                    "file_name": "src/common/imageio.c",
                    "file_size": 0
                }
            ],
            "interesting": {
                "reopen": false,
                "status": false
            },
            "is_parent": false,
            "sha": "f1ca6c55c7479f2a649e6c21072398da217742f0"
        }
    ],
    "first_commit": "2020-11-14 17:10:26+00:00",
    "last_commit": "2020-11-22 23:38:02+00:00",
    "number": 6900,
    "pull_request": "None",
    "score": {
        "accidental_reopen_likely": false,
        "all_labels": [],
        "contains_keywords": [
            "fail",
            "chang",
            "fix",
            "issu",
            "leak",
            "remov",
            "warn"
        ],
        "fix_size": 53,
        "has_labels": [],
        "intersecting": {
            "computed_score": 0.0,
            "final_commit_size": 2,
            "intersection_size": 0,
            "previous_commits_size": 51
        },
        "is_makefile_based": true,
        "no_new_files": [
            "src/common/imageio.c"
        ],
        "no_other_files": false,
        "num_prohibited_files": 67084,
        "prohibited_files": [
            "server/src/main/java/com/genymobile/scrcpy/Device.java",
            "server/src/main/java/com/genymobile/scrcpy/wrappers/SurfaceControl.java",
            "server/src/main/java/com/genymobile/scrcpy/Device.java",
            "server/src/main/java/com/genymobile/scrcpy/wrappers/SurfaceControl.java",
            "app/meson.build",
            "app/scrcpy.1",
            "app/src/common.h",
            "app/src/scrcpy.h",
            "app/src/server.h",
            "server/src/main/java/com/genymobile/scrcpy/Workarounds.java"
        ],
        "reopen": true,
        "reopen_events": [
            [
                "2020-11-14 17:14:03+00:00",
                "closed"
            ],
            [
                "2020-11-14 17:14:03+00:00",
                "commit"
            ],
            [
                "2020-11-22 20:09:40+00:00",
                "commit"
            ],
            [
                "2020-11-22 20:09:51+00:00",
                "reopened"
            ],
            [
                "2020-11-22 23:38:22+00:00",
                "closed"
            ],
            [
                "2020-11-22 23:38:22+00:00",
                "commit"
            ]
        ],
        "status": false,
        "strategy": true,
        "total_changes": 133
    }
}