{
    "covered_issues": [
        481,
        479,
        473,
        469,
        465,
        461,
        460,
        455,
        453,
        442,
        439,
        436,
        424,
        423,
        422,
        415,
        411,
        408,
        407,
        406,
        403,
        398,
        392,
        389,
        383,
        377,
        371,
        368,
        367,
        365,
        363,
        343,
        339,
        329,
        327,
        326,
        322,
        320,
        319,
        317,
        314,
        308,
        307,
        305,
        298,
        295,
        293,
        291,
        285,
        284,
        279,
        276,
        274,
        273,
        271,
        269,
        268,
        267,
        266,
        260,
        259,
        252,
        247,
        246,
        242,
        239,
        236,
        234,
        222,
        221,
        220,
        211,
        210,
        209,
        203,
        198,
        197,
        195,
        194,
        192,
        191,
        190,
        182,
        179,
        176,
        175,
        171,
        169,
        168,
        166,
        165,
        162,
        158,
        157,
        155,
        148,
        141,
        137,
        135,
        133,
        132,
        130,
        129,
        128,
        127,
        125,
        112,
        105,
        104,
        102,
        99,
        98,
        96,
        94,
        93,
        92,
        91,
        90,
        88,
        85,
        81,
        74,
        73,
        72,
        70,
        68,
        61,
        57,
        55,
        54,
        51,
        43,
        40,
        38,
        36,
        34,
        33,
        32,
        30,
        29,
        27,
        26,
        23,
        21,
        20,
        18,
        15,
        14,
        8,
        6,
        5,
        2,
        1
    ],
    "finished": true
}