{
    "all_issues": 1058,
    "interesting_issues": 1,
    "last_update": "2021-05-16 11:01:11.298332",
    "license": {
        "download": "https://raw.githubusercontent.com/eclipse/mraa/master/COPYING",
        "name": "MIT License"
    },
    "ratio": 0.000945179584120983,
    "size": 3420,
    "stars": 1224,
    "url": "https://github.com/eclipse/mraa"
}