{
    "commits": [
        {
            "associated_pull_request": [],
            "date": "2017-01-27 20:57:18+00:00",
            "diff": "baskerville_bspwm/issue_608/commit_d5d05067e2fd2f9a011a16a59cc3c205c82630ff.diff",
            "diff_additions": 4,
            "diff_deletions": 0,
            "diff_file_size": 8794,
            "diff_url": "https://github.com/baskerville/bspwm/commit/d5d05067e2fd2f9a011a16a59cc3c205c82630ff.diff",
            "exists": true,
            "files": [
                {
                    "file_additions": 4,
                    "file_deletions": 0,
                    "file_exists": true,
                    "file_name": "src/ewmh.c",
                    "file_size": 8794
                }
            ],
            "interesting": {
                "reopen": false,
                "status": false
            },
            "is_parent": true,
            "sha": "d5d05067e2fd2f9a011a16a59cc3c205c82630ff"
        },
        {
            "associated_pull_request": [],
            "date": "2017-01-28 21:29:18+00:00",
            "diff": "baskerville_bspwm/issue_608/commit_9f30cbfc97a8107481c871dc3970e6fce7e61aa9.diff",
            "diff_additions": 0,
            "diff_deletions": 4,
            "diff_file_size": 54669,
            "diff_url": "https://github.com/baskerville/bspwm/commit/9f30cbfc97a8107481c871dc3970e6fce7e61aa9.diff",
            "exists": true,
            "files": [
                {
                    "file_additions": 0,
                    "file_deletions": 4,
                    "file_exists": true,
                    "file_name": "src/tree.c",
                    "file_size": 54669
                }
            ],
            "interesting": {
                "reopen": true,
                "status": false
            },
            "is_parent": false,
            "sha": "9f30cbfc97a8107481c871dc3970e6fce7e61aa9"
        },
        {
            "associated_pull_request": [],
            "date": "2017-01-31 16:28:47+00:00",
            "diff": "baskerville_bspwm/issue_608/commit_1a4f9dadcd96616df0172d6613369a654e73101c.diff",
            "diff_additions": 35,
            "diff_deletions": 38,
            "diff_file_size": 105339,
            "diff_url": "https://github.com/baskerville/bspwm/commit/1a4f9dadcd96616df0172d6613369a654e73101c.diff",
            "exists": true,
            "files": [
                {
                    "file_additions": 9,
                    "file_deletions": 9,
                    "file_exists": true,
                    "file_name": "src/desktop.c",
                    "file_size": 12827
                },
                {
                    "file_additions": 2,
                    "file_deletions": 2,
                    "file_exists": true,
                    "file_name": "src/pointer.c",
                    "file_size": 10662
                },
                {
                    "file_additions": 22,
                    "file_deletions": 25,
                    "file_exists": true,
                    "file_name": "src/tree.c",
                    "file_size": 54669
                },
                {
                    "file_additions": 2,
                    "file_deletions": 2,
                    "file_exists": true,
                    "file_name": "src/window.c",
                    "file_size": 27181
                }
            ],
            "interesting": {
                "reopen": false,
                "status": false
            },
            "is_parent": false,
            "sha": "1a4f9dadcd96616df0172d6613369a654e73101c"
        },
        {
            "associated_pull_request": [],
            "date": "2017-01-31 16:28:47+00:00",
            "diff": "baskerville_bspwm/issue_608/commit_9d15c1fb6c15fba8786d033bebfc386b9fbc586b.diff",
            "diff_additions": 35,
            "diff_deletions": 38,
            "diff_file_size": 105339,
            "diff_url": "https://github.com/baskerville/bspwm/commit/9d15c1fb6c15fba8786d033bebfc386b9fbc586b.diff",
            "exists": true,
            "files": [
                {
                    "file_additions": 9,
                    "file_deletions": 9,
                    "file_exists": true,
                    "file_name": "src/desktop.c",
                    "file_size": 12827
                },
                {
                    "file_additions": 2,
                    "file_deletions": 2,
                    "file_exists": true,
                    "file_name": "src/pointer.c",
                    "file_size": 10662
                },
                {
                    "file_additions": 22,
                    "file_deletions": 25,
                    "file_exists": true,
                    "file_name": "src/tree.c",
                    "file_size": 54669
                },
                {
                    "file_additions": 2,
                    "file_deletions": 2,
                    "file_exists": true,
                    "file_name": "src/window.c",
                    "file_size": 27181
                }
            ],
            "interesting": {
                "reopen": false,
                "status": false
            },
            "is_parent": false,
            "sha": "9d15c1fb6c15fba8786d033bebfc386b9fbc586b"
        }
    ],
    "first_commit": "2017-01-27 20:57:18+00:00",
    "last_commit": "2017-02-25 19:16:31+00:00",
    "number": 608,
    "pull_request": "None",
    "score": {
        "accidental_reopen_likely": false,
        "all_labels": [],
        "contains_keywords": [
            "work",
            "chang",
            "fix",
            "issu",
            "perform",
            "warn",
            "problem"
        ],
        "fix_size": 55,
        "has_labels": [],
        "intersecting": {
            "computed_score": 1.0,
            "final_commit_size": 55,
            "intersection_size": 55,
            "previous_commits_size": 55
        },
        "is_makefile_based": true,
        "no_new_files": [],
        "no_other_files": false,
        "num_prohibited_files": 94644,
        "prohibited_files": [
            "server/src/main/java/com/genymobile/scrcpy/Device.java",
            "server/src/main/java/com/genymobile/scrcpy/wrappers/SurfaceControl.java",
            "server/src/main/java/com/genymobile/scrcpy/Device.java",
            "server/src/main/java/com/genymobile/scrcpy/wrappers/SurfaceControl.java",
            "app/meson.build",
            "app/scrcpy.1",
            "app/src/common.h",
            "app/src/scrcpy.h",
            "app/src/server.h",
            "server/src/main/java/com/genymobile/scrcpy/Workarounds.java"
        ],
        "reopen": true,
        "reopen_events": [
            [
                "2017-01-28 21:31:33+00:00",
                "closed"
            ],
            [
                "2017-01-28 21:31:33+00:00",
                "commit"
            ],
            [
                "2017-01-28 21:37:55+00:00",
                "reopened"
            ],
            [
                "2017-01-31 16:31:59+00:00",
                "closed"
            ],
            [
                "2017-01-31 16:31:59+00:00",
                "commit"
            ],
            [
                "2017-02-25 19:16:34+00:00",
                "commit"
            ],
            [
                "2017-02-25 19:16:34+00:00",
                "commit"
            ]
        ],
        "status": false,
        "strategy": true,
        "total_changes": 154
    }
}