{
    "commits": [
        {
            "associated_pull_request": [],
            "date": "2022-08-29 13:37:16+00:00",
            "diff": "haproxy_haproxy/issue_1842/commit_4a20972a954b2af0ec75b21e32d2d56ae97a8493.diff",
            "diff_additions": 2,
            "diff_deletions": 2,
            "diff_file_size": 391032,
            "diff_url": "https://github.com/haproxy/haproxy/commit/4a20972a954b2af0ec75b21e32d2d56ae97a8493.diff",
            "exists": true,
            "files": [
                {
                    "file_additions": 2,
                    "file_deletions": 2,
                    "file_exists": true,
                    "file_name": "src/hlua.c",
                    "file_size": 391032
                }
            ],
            "interesting": {
                "reopen": false,
                "status": false
            },
            "is_parent": true,
            "sha": "4a20972a954b2af0ec75b21e32d2d56ae97a8493"
        },
        {
            "associated_pull_request": [],
            "date": "2022-08-29 08:22:56+00:00",
            "diff": "haproxy_haproxy/issue_1842/commit_cad42a78b846fab542d6172814526abe369a3ab6.diff",
            "diff_additions": 4,
            "diff_deletions": 2,
            "diff_file_size": 170390,
            "diff_url": "https://github.com/haproxy/haproxy/commit/cad42a78b846fab542d6172814526abe369a3ab6.diff",
            "exists": true,
            "files": [
                {
                    "file_additions": 4,
                    "file_deletions": 2,
                    "file_exists": true,
                    "file_name": "src/mux_h1.c",
                    "file_size": 170390
                }
            ],
            "interesting": {
                "reopen": true,
                "status": false
            },
            "is_parent": false,
            "sha": "cad42a78b846fab542d6172814526abe369a3ab6"
        },
        {
            "associated_pull_request": [],
            "date": "2022-08-29 08:22:56+00:00",
            "diff": "haproxy_haproxy/issue_1842/commit_e26025d0a7cca2b9cec8c85ee8ed795a9ddb859f.diff",
            "diff_additions": 4,
            "diff_deletions": 2,
            "diff_file_size": 170390,
            "diff_url": "https://github.com/haproxy/haproxy/commit/e26025d0a7cca2b9cec8c85ee8ed795a9ddb859f.diff",
            "exists": true,
            "files": [
                {
                    "file_additions": 4,
                    "file_deletions": 2,
                    "file_exists": true,
                    "file_name": "src/mux_h1.c",
                    "file_size": 170390
                }
            ],
            "interesting": {
                "reopen": false,
                "status": false
            },
            "is_parent": false,
            "sha": "e26025d0a7cca2b9cec8c85ee8ed795a9ddb859f"
        },
        {
            "associated_pull_request": [],
            "date": "2022-08-29 08:22:56+00:00",
            "diff": "haproxy_haproxy/issue_1842/commit_a3d9a375495aa7493ec3ef173967498e4f93e1ee.diff",
            "diff_additions": 4,
            "diff_deletions": 2,
            "diff_file_size": 170390,
            "diff_url": "https://github.com/haproxy/haproxy/commit/a3d9a375495aa7493ec3ef173967498e4f93e1ee.diff",
            "exists": true,
            "files": [
                {
                    "file_additions": 4,
                    "file_deletions": 2,
                    "file_exists": true,
                    "file_name": "src/mux_h1.c",
                    "file_size": 170390
                }
            ],
            "interesting": {
                "reopen": false,
                "status": false
            },
            "is_parent": false,
            "sha": "a3d9a375495aa7493ec3ef173967498e4f93e1ee"
        },
        {
            "associated_pull_request": [],
            "date": "2022-08-29 08:22:56+00:00",
            "diff": "haproxy_haproxy/issue_1842/commit_0b20d41e4c86be9c715e4eb55e33ec289ee4a0ac.diff",
            "diff_additions": 4,
            "diff_deletions": 2,
            "diff_file_size": 170390,
            "diff_url": "https://github.com/haproxy/haproxy/commit/0b20d41e4c86be9c715e4eb55e33ec289ee4a0ac.diff",
            "exists": true,
            "files": [
                {
                    "file_additions": 4,
                    "file_deletions": 2,
                    "file_exists": true,
                    "file_name": "src/mux_h1.c",
                    "file_size": 170390
                }
            ],
            "interesting": {
                "reopen": false,
                "status": false
            },
            "is_parent": false,
            "sha": "0b20d41e4c86be9c715e4eb55e33ec289ee4a0ac"
        },
        {
            "associated_pull_request": [],
            "date": "2022-08-29 08:22:56+00:00",
            "diff": "haproxy_haproxy/issue_1842/commit_da8c66fcbf2bc822d5dfbadccc4b6fe36d339015.diff",
            "diff_additions": 4,
            "diff_deletions": 2,
            "diff_file_size": 170390,
            "diff_url": "https://github.com/haproxy/haproxy/commit/da8c66fcbf2bc822d5dfbadccc4b6fe36d339015.diff",
            "exists": true,
            "files": [
                {
                    "file_additions": 4,
                    "file_deletions": 2,
                    "file_exists": true,
                    "file_name": "src/mux_h1.c",
                    "file_size": 170390
                }
            ],
            "interesting": {
                "reopen": false,
                "status": false
            },
            "is_parent": false,
            "sha": "da8c66fcbf2bc822d5dfbadccc4b6fe36d339015"
        }
    ],
    "first_commit": "2022-08-29 13:37:17+00:00",
    "last_commit": "2023-05-26 13:24:03+00:00",
    "number": 1842,
    "pull_request": "None",
    "score": {
        "accidental_reopen_likely": false,
        "all_labels": [
            "type: bug",
            "severity: medium",
            "status: fixed",
            "subsystem: h1"
        ],
        "contains_keywords": [
            "confirm",
            "work",
            "fail",
            "chang",
            "fix",
            "issu",
            "patch",
            "reason",
            "test",
            "attempt",
            "fault",
            "remov",
            "bug",
            "error",
            "problem",
            "report"
        ],
        "fix_size": 26,
        "has_labels": [],
        "intersecting": {
            "computed_score": 0.16666666666666666,
            "final_commit_size": 6,
            "intersection_size": 1,
            "previous_commits_size": 21
        },
        "is_makefile_based": true,
        "no_new_files": [],
        "no_other_files": true,
        "num_prohibited_files": 224385,
        "prohibited_files": [
            "server/src/main/java/com/genymobile/scrcpy/Device.java",
            "server/src/main/java/com/genymobile/scrcpy/wrappers/SurfaceControl.java",
            "server/src/main/java/com/genymobile/scrcpy/Device.java",
            "server/src/main/java/com/genymobile/scrcpy/wrappers/SurfaceControl.java",
            "app/meson.build",
            "app/scrcpy.1",
            "app/src/common.h",
            "app/src/scrcpy.h",
            "app/src/server.h",
            "server/src/main/java/com/genymobile/scrcpy/Workarounds.java"
        ],
        "reopen": true,
        "reopen_events": [
            [
                "2022-08-29 16:47:10+00:00",
                "commit"
            ],
            [
                "2022-08-29 18:56:11+00:00",
                "closed"
            ],
            [
                "2022-08-29 19:34:37+00:00",
                "reopened"
            ],
            [
                "2022-09-01 05:25:29+00:00",
                "commit"
            ],
            [
                "2022-09-16 05:25:24+00:00",
                "commit"
            ],
            [
                "2022-09-16 05:25:25+00:00",
                "commit"
            ],
            [
                "2022-09-19 16:16:07+00:00",
                "closed"
            ],
            [
                "2023-05-27 05:25:33+00:00",
                "commit"
            ],
            [
                "2023-05-27 05:25:34+00:00",
                "commit"
            ]
        ],
        "status": false,
        "strategy": true,
        "total_changes": 34
    }
}