{
    "covered_issues": [
        1547,
        1541,
        1539,
        1536,
        1531,
        1528,
        1500,
        1495,
        1490,
        1478,
        1474,
        1472,
        1470,
        1465,
        1459,
        1457,
        1454,
        1443,
        1441,
        1437,
        1431,
        1430,
        1424,
        1423,
        1421,
        1420,
        1419,
        1418,
        1417,
        1416,
        1415,
        1414,
        1412,
        1411,
        1410,
        1409,
        1402,
        1400,
        1399,
        1398,
        1390,
        1389,
        1385,
        1384,
        1379,
        1378,
        1376,
        1373,
        1372,
        1371,
        1365,
        1364,
        1363,
        1362,
        1361,
        1360,
        1353,
        1351,
        1342,
        1341,
        1340,
        1337,
        1335,
        1333,
        1329,
        1324,
        1323,
        1315,
        1309,
        1308,
        1305,
        1303,
        1298,
        1297,
        1295,
        1290,
        1289,
        1286,
        1285,
        1283,
        1282,
        1280,
        1275,
        1274,
        1266,
        1263,
        1258,
        1256,
        1255,
        1254,
        1253,
        1252,
        1251,
        1250,
        1249,
        1247,
        1246,
        1245,
        1244,
        1242,
        1238,
        1237,
        1236,
        1235,
        1234,
        1226,
        1223,
        1221,
        1220,
        1217,
        1216,
        1214,
        1211,
        1210,
        1205,
        1204,
        1202,
        1199,
        1198,
        1197,
        1196,
        1194,
        1189,
        1188,
        1185,
        1184,
        1183,
        1178,
        1172,
        1169,
        1168,
        1167,
        1160,
        1156,
        1149,
        1146,
        1145,
        1142,
        1137,
        1136,
        1129,
        1125,
        1124,
        1121,
        1119,
        1114,
        1108,
        1107,
        1100,
        1088,
        1085,
        1081,
        1078,
        1077,
        1072,
        1064,
        1059,
        1058,
        1057,
        1055,
        1049,
        1040,
        1038,
        1037,
        1033,
        1032,
        1030,
        1029,
        1026,
        1023,
        1019,
        1017,
        1016,
        1014,
        1013,
        1004,
        1002,
        1001,
        1000,
        998,
        997,
        996,
        992,
        989,
        986,
        985,
        982,
        978,
        972,
        967,
        964,
        957,
        951,
        946,
        941,
        940,
        939,
        935,
        927,
        925,
        915,
        913,
        905,
        901,
        898,
        897,
        893,
        881,
        879,
        875,
        874,
        873,
        869,
        862,
        855,
        851,
        850,
        844,
        841,
        830,
        829,
        825,
        824,
        823,
        822,
        821,
        818,
        816,
        815,
        812,
        811,
        810,
        809,
        804,
        798,
        795,
        794,
        793,
        790,
        789,
        788,
        787,
        784,
        783,
        782,
        781,
        780,
        779,
        778,
        775,
        771,
        770,
        769,
        765,
        755,
        752,
        748,
        742,
        741,
        732,
        730,
        729,
        728,
        726,
        722,
        721,
        720,
        719,
        718,
        717,
        713,
        712,
        711,
        708,
        699,
        697,
        689,
        687,
        684,
        683,
        682,
        680,
        676,
        675,
        673,
        668,
        667,
        665,
        663,
        661,
        655,
        653,
        641,
        639,
        638,
        630,
        628,
        625,
        621,
        620,
        616,
        615,
        614,
        611,
        609,
        602,
        601,
        600,
        588,
        587,
        586,
        585,
        584,
        583,
        582,
        581,
        580,
        576,
        572,
        571,
        570,
        567,
        563,
        556,
        555,
        545,
        544,
        528,
        525,
        520,
        509,
        502,
        498,
        495,
        474,
        471,
        460,
        459,
        458,
        453,
        449,
        448,
        445,
        441,
        440,
        439,
        438,
        436,
        427,
        424,
        422,
        421,
        418,
        417,
        416,
        413,
        412,
        407,
        406,
        405,
        402,
        401,
        399,
        398,
        396,
        395,
        389,
        388,
        387,
        386,
        385,
        384,
        380,
        377,
        375,
        373,
        371,
        368,
        363,
        361,
        358,
        357,
        355,
        353,
        352,
        351,
        350,
        348,
        346,
        344,
        343,
        342,
        341,
        338,
        337,
        334,
        330,
        327,
        326,
        324,
        322,
        320,
        319,
        318,
        316,
        315,
        314,
        313,
        312,
        311,
        310,
        309,
        307,
        305,
        303,
        302,
        300,
        298,
        297,
        293,
        292,
        291,
        289,
        287,
        286,
        282,
        281,
        280,
        278,
        277,
        275,
        273,
        272,
        265,
        262,
        261,
        259,
        258,
        256,
        255,
        253,
        252,
        251,
        246,
        245,
        244,
        243,
        242,
        237,
        235,
        234,
        233,
        232,
        230,
        229,
        226,
        224,
        223,
        222,
        221,
        218,
        217,
        215,
        211,
        210,
        209,
        208,
        207,
        205,
        202,
        201,
        200,
        199,
        198,
        197,
        195,
        192,
        189,
        188,
        187,
        186,
        185,
        184,
        179,
        176,
        175,
        174,
        173,
        172,
        171,
        169,
        168,
        167,
        164,
        161,
        159,
        158,
        157,
        151,
        149,
        147,
        145,
        143,
        142,
        138,
        131,
        130,
        128,
        127,
        126,
        125,
        124,
        115,
        114,
        113,
        110,
        109,
        105,
        102,
        99,
        98,
        97,
        96,
        95,
        93,
        92,
        91,
        90,
        87,
        86,
        83,
        80,
        74,
        73,
        72,
        68,
        67,
        65,
        64,
        58,
        57,
        56,
        55,
        54,
        51,
        45,
        40,
        39,
        38,
        37,
        35,
        34,
        30,
        28,
        27,
        26,
        23,
        20,
        18,
        17,
        16,
        5,
        3,
        1
    ],
    "finished": true
}