{
    "commits": [
        {
            "associated_pull_request": [],
            "date": "2022-02-07 16:04:16+00:00",
            "diff": "earlephilhower_arduino-pico/issue_464/commit_b415496e8becaceb5d7d0f4028bc9979de87bc27.diff",
            "diff_additions": 2,
            "diff_deletions": 2,
            "diff_file_size": 13448,
            "diff_url": "https://github.com/earlephilhower/arduino-pico/commit/b415496e8becaceb5d7d0f4028bc9979de87bc27.diff",
            "exists": true,
            "files": [
                {
                    "file_additions": 2,
                    "file_deletions": 2,
                    "file_exists": true,
                    "file_name": "cores/rp2040/SerialUART.cpp",
                    "file_size": 13448
                }
            ],
            "interesting": {
                "reopen": false,
                "status": false
            },
            "is_parent": false,
            "sha": "b415496e8becaceb5d7d0f4028bc9979de87bc27"
        },
        {
            "associated_pull_request": [],
            "date": "2022-02-07 16:04:16+00:00",
            "diff": "earlephilhower_arduino-pico/issue_464/commit_1a3f5531f3ddca805eb7aeca773ee69bc3532bc9.diff",
            "diff_additions": 12,
            "diff_deletions": 0,
            "diff_file_size": 13448,
            "diff_url": "https://github.com/earlephilhower/arduino-pico/commit/1a3f5531f3ddca805eb7aeca773ee69bc3532bc9.diff",
            "exists": true,
            "files": [
                {
                    "file_additions": 12,
                    "file_deletions": 0,
                    "file_exists": true,
                    "file_name": "cores/rp2040/SerialUART.cpp",
                    "file_size": 13448
                }
            ],
            "interesting": {
                "reopen": false,
                "status": false
            },
            "is_parent": false,
            "sha": "1a3f5531f3ddca805eb7aeca773ee69bc3532bc9"
        },
        {
            "associated_pull_request": [],
            "date": "2022-02-07 16:04:16+00:00",
            "diff": "earlephilhower_arduino-pico/issue_464/commit_25b251fb7bcfee75fc7c8554a1f9089d12d163d4.diff",
            "diff_additions": 13,
            "diff_deletions": 1,
            "diff_file_size": 13448,
            "diff_url": "https://github.com/earlephilhower/arduino-pico/commit/25b251fb7bcfee75fc7c8554a1f9089d12d163d4.diff",
            "exists": true,
            "files": [
                {
                    "file_additions": 13,
                    "file_deletions": 1,
                    "file_exists": true,
                    "file_name": "cores/rp2040/SerialUART.cpp",
                    "file_size": 13448
                }
            ],
            "interesting": {
                "reopen": false,
                "status": false
            },
            "is_parent": false,
            "sha": "25b251fb7bcfee75fc7c8554a1f9089d12d163d4"
        },
        {
            "associated_pull_request": [],
            "date": "2022-02-07 16:04:16+00:00",
            "diff": "earlephilhower_arduino-pico/issue_464/commit_0f12a04eec420d5fa4fb93cc6c4d8eaaa3c7b5b8.diff",
            "diff_additions": 12,
            "diff_deletions": 0,
            "diff_file_size": 13448,
            "diff_url": "https://github.com/earlephilhower/arduino-pico/commit/0f12a04eec420d5fa4fb93cc6c4d8eaaa3c7b5b8.diff",
            "exists": true,
            "files": [
                {
                    "file_additions": 12,
                    "file_deletions": 0,
                    "file_exists": true,
                    "file_name": "cores/rp2040/SerialUART.cpp",
                    "file_size": 13448
                }
            ],
            "interesting": {
                "reopen": false,
                "status": false
            },
            "is_parent": false,
            "sha": "0f12a04eec420d5fa4fb93cc6c4d8eaaa3c7b5b8"
        },
        {
            "associated_pull_request": [
                "https://github.com/earlephilhower/arduino-pico/pull/466"
            ],
            "date": "2022-02-07 16:37:12+00:00",
            "diff": "earlephilhower_arduino-pico/issue_464/commit_46b0550782e84e8e94f25cac1f63f4c4ff29e036.diff",
            "diff_additions": 16,
            "diff_deletions": 40,
            "diff_file_size": 25174,
            "diff_url": "https://github.com/earlephilhower/arduino-pico/commit/46b0550782e84e8e94f25cac1f63f4c4ff29e036.diff",
            "exists": true,
            "files": [
                {
                    "file_additions": 8,
                    "file_deletions": 20,
                    "file_exists": true,
                    "file_name": "cores/rp2040/SerialPIO.cpp",
                    "file_size": 11726
                },
                {
                    "file_additions": 8,
                    "file_deletions": 20,
                    "file_exists": true,
                    "file_name": "cores/rp2040/SerialUART.cpp",
                    "file_size": 13448
                }
            ],
            "interesting": {
                "reopen": false,
                "status": false
            },
            "is_parent": false,
            "sha": "46b0550782e84e8e94f25cac1f63f4c4ff29e036"
        },
        {
            "associated_pull_request": [
                "https://github.com/earlephilhower/arduino-pico/pull/466"
            ],
            "date": "2022-02-07 20:33:49+00:00",
            "diff": "earlephilhower_arduino-pico/issue_464/commit_4cd65d1512a0aa62d447c80b249722e6830e6e02.diff",
            "diff_additions": 16,
            "diff_deletions": 40,
            "diff_file_size": 25174,
            "diff_url": "https://github.com/earlephilhower/arduino-pico/commit/4cd65d1512a0aa62d447c80b249722e6830e6e02.diff",
            "exists": true,
            "files": [
                {
                    "file_additions": 8,
                    "file_deletions": 20,
                    "file_exists": true,
                    "file_name": "cores/rp2040/SerialPIO.cpp",
                    "file_size": 11726
                },
                {
                    "file_additions": 8,
                    "file_deletions": 20,
                    "file_exists": true,
                    "file_name": "cores/rp2040/SerialUART.cpp",
                    "file_size": 13448
                }
            ],
            "interesting": {
                "reopen": false,
                "status": false
            },
            "is_parent": false,
            "sha": "4cd65d1512a0aa62d447c80b249722e6830e6e02"
        },
        {
            "associated_pull_request": [
                "https://github.com/earlephilhower/arduino-pico/pull/511"
            ],
            "date": "2022-03-12 19:21:35+00:00",
            "diff": "earlephilhower_arduino-pico/issue_464/commit_139ace9909ef09d40e8ef208b156213188a6c5f6.diff",
            "diff_additions": 37,
            "diff_deletions": 1,
            "diff_file_size": 13448,
            "diff_url": "https://github.com/earlephilhower/arduino-pico/commit/139ace9909ef09d40e8ef208b156213188a6c5f6.diff",
            "exists": true,
            "files": [
                {
                    "file_additions": 37,
                    "file_deletions": 1,
                    "file_exists": true,
                    "file_name": "cores/rp2040/SerialUART.cpp",
                    "file_size": 13448
                }
            ],
            "interesting": {
                "reopen": true,
                "status": false
            },
            "is_parent": false,
            "sha": "139ace9909ef09d40e8ef208b156213188a6c5f6"
        },
        {
            "associated_pull_request": [
                "https://github.com/earlephilhower/arduino-pico/pull/511"
            ],
            "date": "2022-03-16 15:46:20+00:00",
            "diff": "earlephilhower_arduino-pico/issue_464/commit_53043830e7747fabf4f7cc2876e3bfad4d9f2fe2.diff",
            "diff_additions": 50,
            "diff_deletions": 9,
            "diff_file_size": 13448,
            "diff_url": "https://github.com/earlephilhower/arduino-pico/commit/53043830e7747fabf4f7cc2876e3bfad4d9f2fe2.diff",
            "exists": true,
            "files": [
                {
                    "file_additions": 50,
                    "file_deletions": 9,
                    "file_exists": true,
                    "file_name": "cores/rp2040/SerialUART.cpp",
                    "file_size": 13448
                }
            ],
            "interesting": {
                "reopen": false,
                "status": false
            },
            "is_parent": false,
            "sha": "53043830e7747fabf4f7cc2876e3bfad4d9f2fe2"
        }
    ],
    "first_commit": "2022-02-07 16:04:16+00:00",
    "last_commit": "2022-03-16 15:46:20+00:00",
    "number": 464,
    "pull_request": "None",
    "score": {
        "accidental_reopen_likely": false,
        "all_labels": [],
        "contains_keywords": [
            "work",
            "chang",
            "fix",
            "issu",
            "patch",
            "perform",
            "debug",
            "test",
            "fault",
            "leak",
            "remov",
            "bug",
            "report",
            "workaround"
        ],
        "fix_size": 127,
        "has_labels": [],
        "intersecting": {
            "computed_score": 0.3793103448275862,
            "final_commit_size": 58,
            "intersection_size": 22,
            "previous_commits_size": 91
        },
        "is_makefile_based": false,
        "no_new_files": [],
        "no_other_files": false,
        "num_prohibited_files": 397747,
        "prohibited_files": [
            "server/src/main/java/com/genymobile/scrcpy/Device.java",
            "server/src/main/java/com/genymobile/scrcpy/wrappers/SurfaceControl.java",
            "server/src/main/java/com/genymobile/scrcpy/Device.java",
            "server/src/main/java/com/genymobile/scrcpy/wrappers/SurfaceControl.java",
            "app/meson.build",
            "app/scrcpy.1",
            "app/src/common.h",
            "app/src/scrcpy.h",
            "app/src/server.h",
            "server/src/main/java/com/genymobile/scrcpy/Workarounds.java"
        ],
        "reopen": true,
        "reopen_events": [
            [
                "2022-02-07 15:53:41+00:00",
                "commit"
            ],
            [
                "2022-02-07 16:05:22+00:00",
                "commit"
            ],
            [
                "2022-02-07 16:12:55+00:00",
                "commit"
            ],
            [
                "2022-02-07 16:15:28+00:00",
                "commit"
            ],
            [
                "2022-02-07 16:17:13+00:00",
                "commit"
            ],
            [
                "2022-02-07 16:39:54+00:00",
                "commit"
            ],
            [
                "2022-02-07 20:33:50+00:00",
                "closed"
            ],
            [
                "2022-02-07 20:33:51+00:00",
                "commit"
            ],
            [
                "2022-03-12 19:26:55+00:00",
                "commit"
            ],
            [
                "2022-03-12 19:34:18+00:00",
                "reopened"
            ],
            [
                "2022-03-16 11:02:30+00:00",
                "closed"
            ],
            [
                "2022-03-16 15:46:56+00:00",
                "commit"
            ]
        ],
        "status": false,
        "strategy": true,
        "total_changes": 251
    }
}