{
    "covered_issues": [
        143,
        136,
        134,
        129,
        124,
        122,
        117,
        115,
        96,
        95,
        85,
        77,
        67,
        65,
        46,
        42,
        41,
        40,
        39,
        38,
        37,
        36,
        35,
        34,
        33,
        32,
        31,
        29,
        28,
        27,
        26,
        25,
        22,
        21,
        20,
        19,
        18,
        17,
        15,
        12,
        11,
        10,
        9,
        8,
        7,
        6,
        5,
        3,
        2,
        1
    ],
    "finished": true
}