{
    "commits": [
        {
            "diff": "spring-projects_spring-boot/issue_212/commit_d125357bf6aab5db24463dce458d8cda552d2035.diff",
            "diff_additions": 21,
            "diff_deletions": 9,
            "diff_file_size": 0,
            "files": [
                {
                    "file_additions": 13,
                    "file_deletions": 8,
                    "file_exists": false,
                    "file_name": "spring-boot-tools/spring-boot-loader/src/main/java/org/springframework/boot/loader/jar/JarEntryData.java",
                    "file_size": 0
                },
                {
                    "file_additions": 8,
                    "file_deletions": 1,
                    "file_exists": false,
                    "file_name": "spring-boot-tools/spring-boot-loader/src/main/java/org/springframework/boot/loader/jar/ZipInflaterInputStream.java",
                    "file_size": 0
                }
            ],
            "interesting": {
                "reopened": false,
                "status": false
            },
            "sha": "d125357bf6aab5db24463dce458d8cda552d2035"
        },
        {
            "diff": "spring-projects_spring-boot/issue_212/commit_420fc699832567f1d3ba9a19900b11b16d8248aa.diff",
            "diff_additions": 1,
            "diff_deletions": 1,
            "diff_file_size": 0,
            "files": [
                {
                    "file_additions": 1,
                    "file_deletions": 1,
                    "file_exists": false,
                    "file_name": "spring-boot-cli/src/main/java/org/springframework/boot/cli/command/InitCommand.java",
                    "file_size": 0
                }
            ],
            "interesting": {
                "reopened": true,
                "status": false
            },
            "sha": "420fc699832567f1d3ba9a19900b11b16d8248aa"
        },
        {
            "diff": "spring-projects_spring-boot/issue_212/commit_165ba2eb4548a7949e6bb425897ada67a103c214.diff",
            "diff_additions": 228,
            "diff_deletions": 79,
            "diff_file_size": 0,
            "files": [
                {
                    "file_additions": 17,
                    "file_deletions": 3,
                    "file_exists": false,
                    "file_name": "spring-boot-cli/src/main/java/org/springframework/boot/cli/SpringCli.java",
                    "file_size": 0
                },
                {
                    "file_additions": 15,
                    "file_deletions": 2,
                    "file_exists": false,
                    "file_name": "spring-boot-cli/src/main/java/org/springframework/boot/cli/command/InitCommand.java",
                    "file_size": 0
                },
                {
                    "file_additions": 59,
                    "file_deletions": 73,
                    "file_exists": false,
                    "file_name": "spring-boot-cli/src/main/java/org/springframework/boot/cli/util/ResourceUtils.java",
                    "file_size": 0
                },
                {
                    "file_additions": 116,
                    "file_deletions": 0,
                    "file_exists": false,
                    "file_name": "spring-boot-cli/src/test/java/org/springframework/boot/cli/command/InitCommandPerformanceTests.java",
                    "file_size": 0
                },
                {
                    "file_additions": 21,
                    "file_deletions": 1,
                    "file_exists": false,
                    "file_name": "spring-boot-cli/src/test/java/org/springframework/boot/cli/command/InitCommandTests.java",
                    "file_size": 0
                }
            ],
            "interesting": {
                "reopened": true,
                "status": false
            },
            "sha": "165ba2eb4548a7949e6bb425897ada67a103c214"
        },
        {
            "diff": "spring-projects_spring-boot/issue_212/commit_3e6eb6fec89ecf5bd8f2cbc5309e53d5e4674228.diff",
            "diff_additions": 9,
            "diff_deletions": 17,
            "diff_file_size": 0,
            "files": [
                {
                    "file_additions": 5,
                    "file_deletions": 13,
                    "file_exists": false,
                    "file_name": "spring-boot-cli/src/main/java/org/springframework/boot/cli/SpringCli.java",
                    "file_size": 0
                },
                {
                    "file_additions": 1,
                    "file_deletions": 1,
                    "file_exists": false,
                    "file_name": "spring-boot-cli/src/main/java/org/springframework/boot/cli/command/InitCommand.java",
                    "file_size": 0
                },
                {
                    "file_additions": 1,
                    "file_deletions": 1,
                    "file_exists": false,
                    "file_name": "spring-boot-cli/src/main/java/org/springframework/boot/cli/command/ShellCommand.java",
                    "file_size": 0
                },
                {
                    "file_additions": 1,
                    "file_deletions": 1,
                    "file_exists": false,
                    "file_name": "spring-boot-cli/src/test/java/org/springframework/boot/cli/command/InitCommandTests.java",
                    "file_size": 0
                },
                {
                    "file_additions": 1,
                    "file_deletions": 1,
                    "file_exists": false,
                    "file_name": "spring-boot-cli/src/test/java/org/springframework/boot/cli/command/ScriptCommandTests.java",
                    "file_size": 0
                }
            ],
            "interesting": {
                "reopened": false,
                "status": false
            },
            "sha": "3e6eb6fec89ecf5bd8f2cbc5309e53d5e4674228"
        },
        {
            "diff": "spring-projects_spring-boot/issue_212/commit_a5f16d46fee73b365357a068d42f201a0c0a7106.diff",
            "diff_additions": 3,
            "diff_deletions": 741,
            "diff_file_size": 0,
            "files": [
                {
                    "file_additions": 3,
                    "file_deletions": 41,
                    "file_exists": false,
                    "file_name": "spring-boot-cli/src/main/java/org/springframework/boot/cli/command/InitCommand.java",
                    "file_size": 0
                },
                {
                    "file_additions": 0,
                    "file_deletions": 136,
                    "file_exists": false,
                    "file_name": "spring-boot-cli/src/main/java/org/springframework/boot/cli/command/ScriptCommand.java",
                    "file_size": 0
                },
                {
                    "file_additions": 0,
                    "file_deletions": 298,
                    "file_exists": false,
                    "file_name": "spring-boot-cli/src/main/java/org/springframework/boot/cli/command/ScriptCompilationCustomizer.java",
                    "file_size": 0
                },
                {
                    "file_additions": 0,
                    "file_deletions": 33,
                    "file_exists": false,
                    "file_name": "spring-boot-cli/src/test/java/org/springframework/boot/cli/command/InitCommandTests.java",
                    "file_size": 0
                },
                {
                    "file_additions": 0,
                    "file_deletions": 77,
                    "file_exists": false,
                    "file_name": "spring-boot-cli/src/test/java/org/springframework/boot/cli/command/ScriptCommandTests.java",
                    "file_size": 0
                },
                {
                    "file_additions": 0,
                    "file_deletions": 156,
                    "file_exists": false,
                    "file_name": "spring-boot-cli/src/test/java/org/springframework/boot/cli/command/ScriptCompilationCustomizerTests.java",
                    "file_size": 0
                }
            ],
            "interesting": {
                "reopened": false,
                "status": false
            },
            "sha": "a5f16d46fee73b365357a068d42f201a0c0a7106"
        },
        {
            "diff": "spring-projects_spring-boot/issue_212/commit_b07a1998df8fe5881cd1bea1741fe87b24d2b5c3.diff",
            "diff_additions": 0,
            "diff_deletions": 390,
            "diff_file_size": 0,
            "files": [
                {
                    "file_additions": 0,
                    "file_deletions": 164,
                    "file_exists": false,
                    "file_name": "spring-boot-cli/src/main/java/org/springframework/boot/cli/command/InitCommand.java",
                    "file_size": 0
                },
                {
                    "file_additions": 0,
                    "file_deletions": 1,
                    "file_exists": false,
                    "file_name": "spring-boot-cli/src/main/java/org/springframework/boot/cli/command/ShellCommand.java",
                    "file_size": 0
                },
                {
                    "file_additions": 0,
                    "file_deletions": 121,
                    "file_exists": false,
                    "file_name": "spring-boot-cli/src/test/java/org/springframework/boot/cli/command/InitCommandPerformanceTests.java",
                    "file_size": 0
                },
                {
                    "file_additions": 0,
                    "file_deletions": 104,
                    "file_exists": false,
                    "file_name": "spring-boot-cli/src/test/java/org/springframework/boot/cli/command/InitCommandTests.java",
                    "file_size": 0
                }
            ],
            "interesting": {
                "reopened": false,
                "status": false
            },
            "sha": "b07a1998df8fe5881cd1bea1741fe87b24d2b5c3"
        },
        {
            "diff": "spring-projects_spring-boot/issue_212/commit_045c71eee9cdbccebe6046b7f49ed77a19d7160e.diff",
            "diff_additions": 1,
            "diff_deletions": 1,
            "diff_file_size": 0,
            "files": [
                {
                    "file_additions": 1,
                    "file_deletions": 1,
                    "file_exists": false,
                    "file_name": "spring-boot-cli/src/main/java/org/springframework/boot/cli/command/InitCommand.java",
                    "file_size": 0
                }
            ],
            "interesting": {
                "reopened": false,
                "status": false
            },
            "sha": "045c71eee9cdbccebe6046b7f49ed77a19d7160e"
        },
        {
            "diff": "spring-projects_spring-boot/issue_212/commit_abbbf47bf84f173f6175f32e2edda0df206bd138.diff",
            "diff_additions": 228,
            "diff_deletions": 79,
            "diff_file_size": 0,
            "files": [
                {
                    "file_additions": 17,
                    "file_deletions": 3,
                    "file_exists": false,
                    "file_name": "spring-boot-cli/src/main/java/org/springframework/boot/cli/SpringCli.java",
                    "file_size": 0
                },
                {
                    "file_additions": 15,
                    "file_deletions": 2,
                    "file_exists": false,
                    "file_name": "spring-boot-cli/src/main/java/org/springframework/boot/cli/command/InitCommand.java",
                    "file_size": 0
                },
                {
                    "file_additions": 59,
                    "file_deletions": 73,
                    "file_exists": false,
                    "file_name": "spring-boot-cli/src/main/java/org/springframework/boot/cli/util/ResourceUtils.java",
                    "file_size": 0
                },
                {
                    "file_additions": 116,
                    "file_deletions": 0,
                    "file_exists": false,
                    "file_name": "spring-boot-cli/src/test/java/org/springframework/boot/cli/command/InitCommandPerformanceTests.java",
                    "file_size": 0
                },
                {
                    "file_additions": 21,
                    "file_deletions": 1,
                    "file_exists": false,
                    "file_name": "spring-boot-cli/src/test/java/org/springframework/boot/cli/command/InitCommandTests.java",
                    "file_size": 0
                }
            ],
            "interesting": {
                "reopened": false,
                "status": false
            },
            "sha": "abbbf47bf84f173f6175f32e2edda0df206bd138"
        },
        {
            "diff": "spring-projects_spring-boot/issue_212/commit_e11ca309ebe13223cafeee91c675c0102c4f0363.diff",
            "diff_additions": 9,
            "diff_deletions": 17,
            "diff_file_size": 0,
            "files": [
                {
                    "file_additions": 5,
                    "file_deletions": 13,
                    "file_exists": false,
                    "file_name": "spring-boot-cli/src/main/java/org/springframework/boot/cli/SpringCli.java",
                    "file_size": 0
                },
                {
                    "file_additions": 1,
                    "file_deletions": 1,
                    "file_exists": false,
                    "file_name": "spring-boot-cli/src/main/java/org/springframework/boot/cli/command/InitCommand.java",
                    "file_size": 0
                },
                {
                    "file_additions": 1,
                    "file_deletions": 1,
                    "file_exists": false,
                    "file_name": "spring-boot-cli/src/main/java/org/springframework/boot/cli/command/ShellCommand.java",
                    "file_size": 0
                },
                {
                    "file_additions": 1,
                    "file_deletions": 1,
                    "file_exists": false,
                    "file_name": "spring-boot-cli/src/test/java/org/springframework/boot/cli/command/InitCommandTests.java",
                    "file_size": 0
                },
                {
                    "file_additions": 1,
                    "file_deletions": 1,
                    "file_exists": false,
                    "file_name": "spring-boot-cli/src/test/java/org/springframework/boot/cli/command/ScriptCommandTests.java",
                    "file_size": 0
                }
            ],
            "interesting": {
                "reopened": false,
                "status": false
            },
            "sha": "e11ca309ebe13223cafeee91c675c0102c4f0363"
        },
        {
            "diff": "spring-projects_spring-boot/issue_212/commit_50af97b4a2efa32e268fdc1407e7f8a6b2b8c9f2.diff",
            "diff_additions": 3,
            "diff_deletions": 741,
            "diff_file_size": 0,
            "files": [
                {
                    "file_additions": 3,
                    "file_deletions": 41,
                    "file_exists": false,
                    "file_name": "spring-boot-cli/src/main/java/org/springframework/boot/cli/command/InitCommand.java",
                    "file_size": 0
                },
                {
                    "file_additions": 0,
                    "file_deletions": 136,
                    "file_exists": false,
                    "file_name": "spring-boot-cli/src/main/java/org/springframework/boot/cli/command/ScriptCommand.java",
                    "file_size": 0
                },
                {
                    "file_additions": 0,
                    "file_deletions": 298,
                    "file_exists": false,
                    "file_name": "spring-boot-cli/src/main/java/org/springframework/boot/cli/command/ScriptCompilationCustomizer.java",
                    "file_size": 0
                },
                {
                    "file_additions": 0,
                    "file_deletions": 33,
                    "file_exists": false,
                    "file_name": "spring-boot-cli/src/test/java/org/springframework/boot/cli/command/InitCommandTests.java",
                    "file_size": 0
                },
                {
                    "file_additions": 0,
                    "file_deletions": 77,
                    "file_exists": false,
                    "file_name": "spring-boot-cli/src/test/java/org/springframework/boot/cli/command/ScriptCommandTests.java",
                    "file_size": 0
                },
                {
                    "file_additions": 0,
                    "file_deletions": 156,
                    "file_exists": false,
                    "file_name": "spring-boot-cli/src/test/java/org/springframework/boot/cli/command/ScriptCompilationCustomizerTests.java",
                    "file_size": 0
                }
            ],
            "interesting": {
                "reopened": false,
                "status": false
            },
            "sha": "50af97b4a2efa32e268fdc1407e7f8a6b2b8c9f2"
        },
        {
            "diff": "spring-projects_spring-boot/issue_212/commit_2ba941326f2e230738d04c7c475525b1cc6c99ea.diff",
            "diff_additions": 0,
            "diff_deletions": 390,
            "diff_file_size": 0,
            "files": [
                {
                    "file_additions": 0,
                    "file_deletions": 164,
                    "file_exists": false,
                    "file_name": "spring-boot-cli/src/main/java/org/springframework/boot/cli/command/InitCommand.java",
                    "file_size": 0
                },
                {
                    "file_additions": 0,
                    "file_deletions": 1,
                    "file_exists": false,
                    "file_name": "spring-boot-cli/src/main/java/org/springframework/boot/cli/command/ShellCommand.java",
                    "file_size": 0
                },
                {
                    "file_additions": 0,
                    "file_deletions": 121,
                    "file_exists": false,
                    "file_name": "spring-boot-cli/src/test/java/org/springframework/boot/cli/command/InitCommandPerformanceTests.java",
                    "file_size": 0
                },
                {
                    "file_additions": 0,
                    "file_deletions": 104,
                    "file_exists": false,
                    "file_name": "spring-boot-cli/src/test/java/org/springframework/boot/cli/command/InitCommandTests.java",
                    "file_size": 0
                }
            ],
            "interesting": {
                "reopened": false,
                "status": false
            },
            "sha": "2ba941326f2e230738d04c7c475525b1cc6c99ea"
        }
    ],
    "first_commit": "2014-01-11 00:57:51",
    "last_commit": "2014-01-14 14:49:00",
    "number": 212,
    "score": 176.00134770889488
}