{
    "commits": [
        {
            "diff": "spring-projects_spring-boot/issue_9248/commit_cbdab9edb365c02a8c16001e1525d716503a6f1e.diff",
            "diff_additions": 69,
            "diff_deletions": 3,
            "diff_file_size": 0,
            "files": [
                {
                    "file_additions": 32,
                    "file_deletions": 3,
                    "file_exists": false,
                    "file_name": "spring-boot-devtools/src/main/java/org/springframework/boot/devtools/restart/ClassLoaderFilesResourcePatternResolver.java",
                    "file_size": 0
                },
                {
                    "file_additions": 37,
                    "file_deletions": 0,
                    "file_exists": false,
                    "file_name": "spring-boot-devtools/src/test/java/org/springframework/boot/devtools/restart/ClassLoaderFilesResourcePatternResolverTests.java",
                    "file_size": 0
                }
            ],
            "interesting": {
                "reopened": false,
                "status": false
            },
            "sha": "cbdab9edb365c02a8c16001e1525d716503a6f1e"
        },
        {
            "diff": "spring-projects_spring-boot/issue_9248/commit_21a5ab7875e8b250d1839c5e9e45366359b93ca5.diff",
            "diff_additions": 139,
            "diff_deletions": 0,
            "diff_file_size": 0,
            "files": [
                {
                    "file_additions": 90,
                    "file_deletions": 0,
                    "file_exists": false,
                    "file_name": "spring-boot-test/src/main/java/org/springframework/boot/test/json/DuplicateJsonObjectContextCustomizerFactory.java",
                    "file_size": 0
                },
                {
                    "file_additions": 49,
                    "file_deletions": 0,
                    "file_exists": false,
                    "file_name": "spring-boot-test/src/test/java/org/springframework/boot/test/json/DuplicateJsonObjectContextCustomizerFactoryTests.java",
                    "file_size": 0
                }
            ],
            "interesting": {
                "reopened": false,
                "status": true
            },
            "sha": "21a5ab7875e8b250d1839c5e9e45366359b93ca5"
        },
        {
            "diff": "spring-projects_spring-boot/issue_9248/commit_84721666c5fe77f9fe635b7fc055e78953717ccd.diff",
            "diff_additions": 13,
            "diff_deletions": 0,
            "diff_file_size": 0,
            "files": [
                {
                    "file_additions": 13,
                    "file_deletions": 0,
                    "file_exists": false,
                    "file_name": "spring-boot-test/src/main/java/org/springframework/boot/test/json/DuplicateJsonObjectContextCustomizerFactory.java",
                    "file_size": 0
                }
            ],
            "interesting": {
                "reopened": false,
                "status": false
            },
            "sha": "84721666c5fe77f9fe635b7fc055e78953717ccd"
        }
    ],
    "first_commit": "2017-06-06 14:04:12",
    "last_commit": "2017-06-06 21:23:43",
    "number": 9248,
    "score": 272.01785714285717
}