{
    "covered_issues": [
        252,
        251,
        246,
        243,
        237,
        236,
        231,
        230,
        225,
        221,
        218,
        217,
        212,
        211,
        207,
        206,
        203,
        200,
        199,
        198,
        195,
        194,
        192,
        191,
        185,
        184,
        182,
        181,
        176,
        175,
        171,
        170,
        169,
        168,
        167,
        166,
        165,
        162,
        157,
        153,
        144,
        143,
        139,
        137,
        130,
        128,
        127,
        126,
        124,
        119,
        116,
        115,
        114,
        112,
        110,
        109,
        105,
        104,
        97,
        96,
        95,
        93,
        91,
        90,
        86,
        82,
        74,
        72,
        71,
        67,
        64,
        63,
        60,
        52,
        50,
        46,
        44,
        42,
        41,
        34,
        30,
        26,
        25,
        24,
        23,
        21,
        19,
        18,
        15,
        14,
        13,
        11,
        10,
        5,
        2,
        1
    ],
    "finished": true
}