{
    "covered_issues": [
        455,
        446,
        442,
        418,
        408,
        406,
        395,
        393,
        391,
        386,
        383,
        382,
        379,
        377,
        373,
        367,
        363,
        362,
        357,
        353,
        351,
        349,
        348,
        346,
        342,
        341,
        339,
        336,
        335,
        332,
        331,
        330,
        328,
        327,
        323,
        321,
        320,
        319,
        317,
        316,
        315,
        314,
        312,
        311,
        310,
        308,
        304,
        303,
        302,
        301,
        300,
        299,
        294,
        292,
        291,
        288,
        285,
        282,
        276,
        274,
        272,
        267,
        266,
        265,
        263,
        262,
        261,
        260,
        258,
        257,
        253,
        252,
        251,
        249,
        247,
        246,
        240,
        239,
        223,
        196,
        193,
        176,
        170,
        169,
        139,
        138,
        125,
        117,
        105,
        104,
        103,
        102,
        99,
        98,
        97,
        96,
        95,
        94,
        93,
        92,
        86,
        85,
        80,
        76,
        74,
        73,
        71,
        70,
        69,
        68,
        67,
        66,
        63,
        57,
        52,
        51,
        50,
        49,
        48,
        47,
        46,
        36,
        35,
        34,
        32,
        31,
        28,
        25,
        24,
        22,
        21,
        20,
        17,
        13,
        12,
        9,
        5,
        4,
        3,
        2
    ],
    "finished": true
}