{
    "covered_issues": [
        2227,
        2222,
        2221,
        2217,
        2210,
        2197,
        2192,
        2191,
        2186,
        2184,
        2179,
        2165,
        2162,
        2157,
        2154,
        2151,
        2144,
        2142,
        2139,
        2136,
        2135,
        2122,
        2121,
        2117,
        2111,
        2109,
        2106,
        2102,
        2095,
        2079,
        2065,
        2064,
        2061,
        2060,
        2047,
        2043,
        2039,
        2033,
        2030,
        2029,
        2022,
        2021,
        2020,
        2019,
        2017,
        2016,
        2015,
        2008,
        2005,
        1990,
        1989,
        1984,
        1978,
        1976,
        1974,
        1973,
        1966,
        1964,
        1963,
        1959,
        1957,
        1947,
        1941,
        1936,
        1934,
        1933,
        1914,
        1912,
        1895,
        1894,
        1893,
        1891,
        1890,
        1889,
        1888,
        1887,
        1882,
        1875,
        1872,
        1869,
        1858,
        1853,
        1852,
        1847,
        1846,
        1841,
        1839,
        1838,
        1827,
        1823,
        1822,
        1819,
        1812,
        1811,
        1804,
        1796,
        1795,
        1791,
        1790,
        1788,
        1787,
        1786,
        1780,
        1779,
        1776,
        1775,
        1773,
        1772,
        1769,
        1768,
        1765,
        1763,
        1762,
        1759,
        1758,
        1754,
        1751,
        1749,
        1747,
        1746,
        1743,
        1726,
        1723,
        1721,
        1714,
        1712,
        1711,
        1710,
        1706,
        1705,
        1704,
        1702,
        1701,
        1696,
        1693,
        1690,
        1682,
        1681,
        1680,
        1678,
        1670,
        1667,
        1666,
        1660,
        1659,
        1655,
        1652,
        1651,
        1647,
        1643,
        1642,
        1636,
        1634,
        1632,
        1628,
        1625,
        1615,
        1614,
        1612,
        1602,
        1601,
        1600,
        1597,
        1587,
        1584,
        1583,
        1581,
        1580,
        1579,
        1573,
        1572,
        1569,
        1568,
        1563,
        1562,
        1561,
        1559,
        1556,
        1555,
        1552,
        1551,
        1550,
        1547,
        1545,
        1538,
        1536,
        1533,
        1531,
        1523,
        1522,
        1518,
        1516,
        1508,
        1507,
        1506,
        1504,
        1502,
        1496,
        1495,
        1494,
        1489,
        1483,
        1482,
        1478,
        1473,
        1470,
        1466,
        1465,
        1462,
        1456,
        1451,
        1450,
        1445,
        1443,
        1440,
        1438,
        1437,
        1431,
        1421,
        1415,
        1414,
        1408,
        1398,
        1397,
        1390,
        1389,
        1387,
        1385,
        1384,
        1383,
        1375,
        1374,
        1373,
        1372,
        1369,
        1367,
        1366,
        1362,
        1360,
        1359,
        1357,
        1350,
        1348,
        1347,
        1345,
        1343,
        1341,
        1339,
        1338,
        1335,
        1333,
        1332,
        1327,
        1323,
        1320,
        1318,
        1317,
        1314,
        1313,
        1310,
        1303,
        1301,
        1299,
        1298,
        1297,
        1296,
        1294,
        1292,
        1291,
        1290,
        1289,
        1288,
        1287,
        1284,
        1283,
        1280,
        1279,
        1277,
        1276,
        1275,
        1274,
        1268,
        1267,
        1266,
        1265,
        1263,
        1262,
        1259,
        1255,
        1252,
        1250,
        1245,
        1244,
        1241,
        1237,
        1234,
        1229,
        1224,
        1222,
        1221,
        1216,
        1201,
        1188,
        1186,
        1184,
        1181,
        1179,
        1178,
        1177,
        1173,
        1168,
        1167,
        1164,
        1163,
        1159,
        1150,
        1149,
        1148,
        1145,
        1144,
        1143,
        1139,
        1137,
        1131,
        1125,
        1123,
        1122,
        1118,
        1117,
        1116,
        1115,
        1114,
        1113,
        1112,
        1111,
        1108,
        1100,
        1098,
        1097,
        1096,
        1095,
        1094,
        1093,
        1089,
        1088,
        1086,
        1080,
        1077,
        1075,
        1074,
        1071,
        1062,
        1061,
        1060,
        1054,
        1050,
        1048,
        1047,
        1045,
        1044,
        1043,
        1040,
        1039,
        1038,
        1036,
        1033,
        1032,
        1030,
        1028,
        1024,
        1020,
        1019,
        1016,
        1014,
        1008,
        1005,
        1004,
        1002,
        1001,
        999,
        998,
        995,
        993,
        992,
        991,
        990,
        988,
        985,
        984,
        983,
        979,
        978,
        975,
        974,
        972,
        971,
        969,
        964,
        963,
        962,
        959,
        957,
        956,
        955,
        954,
        949,
        948,
        946,
        943,
        941,
        940,
        939,
        937,
        936,
        935,
        934,
        932,
        928,
        926,
        925,
        919,
        918,
        917,
        916,
        915,
        910,
        904,
        901,
        900,
        897,
        895,
        894,
        893,
        892,
        891,
        888,
        887,
        884,
        883,
        882,
        879,
        878,
        876,
        872,
        871,
        868,
        866,
        864,
        860,
        859,
        858,
        856,
        850,
        844,
        842,
        841,
        840,
        835,
        830,
        827,
        825,
        820,
        818,
        817,
        814,
        813,
        807,
        806,
        805,
        804,
        802,
        801,
        799,
        798,
        793,
        789,
        788,
        787,
        786,
        785,
        784,
        781,
        780,
        778,
        775,
        772,
        770,
        769,
        767,
        761,
        760,
        756,
        755,
        753,
        752,
        750,
        747,
        737,
        736,
        735,
        734,
        733,
        732,
        731,
        730,
        729,
        728,
        724,
        722,
        720,
        718,
        717,
        716,
        715,
        713,
        711,
        710,
        709,
        708,
        705,
        704,
        703,
        702,
        701,
        700,
        699,
        698,
        697,
        696,
        694,
        691,
        690,
        689,
        686,
        685,
        684,
        683,
        679,
        678,
        674,
        672,
        671,
        669,
        667,
        664,
        661,
        655,
        651,
        650,
        649,
        641,
        639,
        638,
        635,
        632,
        630,
        622,
        618,
        616,
        610,
        596,
        591,
        590,
        589,
        586,
        584,
        582,
        581,
        580,
        579,
        578,
        572,
        569,
        565,
        563,
        560,
        559,
        558,
        556,
        551,
        550,
        549,
        548,
        546,
        544,
        542,
        540,
        539,
        538,
        537,
        536,
        535,
        527,
        526,
        525,
        523,
        522,
        520,
        515,
        512,
        511,
        509,
        508,
        506,
        502,
        500,
        499,
        497,
        496,
        495,
        493,
        492,
        491,
        490,
        489,
        488,
        486,
        485,
        484,
        483,
        481,
        476,
        474,
        470,
        469,
        465,
        461,
        445,
        434,
        432,
        428,
        427,
        423,
        422,
        421,
        420,
        419,
        416,
        415,
        413,
        409,
        408,
        406,
        403,
        396,
        377,
        372,
        367,
        366,
        364,
        362,
        357,
        352,
        351,
        340,
        339,
        337,
        331,
        330,
        327,
        325,
        324,
        321,
        316,
        299,
        296,
        293,
        286,
        278,
        277,
        276,
        275,
        270,
        268,
        267,
        265,
        264,
        263,
        261,
        260,
        258,
        252,
        251,
        250,
        245,
        244,
        235,
        234,
        231,
        230,
        228,
        218,
        216,
        212,
        206,
        204,
        201,
        200,
        198,
        194,
        193,
        192,
        191,
        189,
        187,
        186,
        182,
        178,
        175,
        172,
        170,
        169,
        167,
        166
    ],
    "finished": true
}