{
    "commits": [
        {
            "associated_pull_request": [],
            "date": "2023-07-23 16:35:38+00:00",
            "diff": "",
            "diff_additions": 0,
            "diff_deletions": 0,
            "diff_file_size": 0,
            "diff_url": "https://github.com/the-tcpdump-group/tcpdump/commit/2312bd8e49cb46f507aee277902cdb21fdf1d4b9.diff",
            "exists": true,
            "files": [],
            "interesting": {
                "reopen": false,
                "status": true
            },
            "is_parent": true,
            "sha": "2312bd8e49cb46f507aee277902cdb21fdf1d4b9"
        },
        {
            "associated_pull_request": [
                "https://github.com/the-tcpdump-group/tcpdump/pull/1065"
            ],
            "date": "2023-07-23 17:41:59+00:00",
            "diff": "the-tcpdump-group_tcpdump/issue_1064/commit_4faedc028e3b2d843a26892b42ef463c05da876b.diff",
            "diff_additions": 34,
            "diff_deletions": 26,
            "diff_file_size": 39327,
            "diff_url": "https://github.com/the-tcpdump-group/tcpdump/commit/4faedc028e3b2d843a26892b42ef463c05da876b.diff",
            "exists": true,
            "files": [
                {
                    "file_additions": 34,
                    "file_deletions": 26,
                    "file_exists": true,
                    "file_name": "print-tcp.c",
                    "file_size": 39327
                }
            ],
            "interesting": {
                "reopen": false,
                "status": true
            },
            "is_parent": false,
            "sha": "4faedc028e3b2d843a26892b42ef463c05da876b"
        },
        {
            "associated_pull_request": [],
            "date": "2023-07-23 17:41:59+00:00",
            "diff": "the-tcpdump-group_tcpdump/issue_1064/commit_fdc52a7240f909c65608207d9d5b33d3bffabf02.diff",
            "diff_additions": 34,
            "diff_deletions": 26,
            "diff_file_size": 39327,
            "diff_url": "https://github.com/the-tcpdump-group/tcpdump/commit/fdc52a7240f909c65608207d9d5b33d3bffabf02.diff",
            "exists": true,
            "files": [
                {
                    "file_additions": 34,
                    "file_deletions": 26,
                    "file_exists": true,
                    "file_name": "print-tcp.c",
                    "file_size": 39327
                }
            ],
            "interesting": {
                "reopen": false,
                "status": false
            },
            "is_parent": false,
            "sha": "fdc52a7240f909c65608207d9d5b33d3bffabf02"
        }
    ],
    "first_commit": "2023-07-23 16:37:20+00:00",
    "last_commit": "2023-07-24 10:34:23+00:00",
    "number": 1064,
    "pull_request": "None",
    "score": {
        "accidental_reopen_likely": false,
        "all_labels": [],
        "contains_keywords": [
            "fix",
            "issu",
            "test",
            "problem"
        ],
        "fix_size": 54,
        "has_labels": [],
        "intersecting": {
            "computed_score": 0.7727272727272727,
            "final_commit_size": 44,
            "intersection_size": 34,
            "previous_commits_size": 44
        },
        "is_makefile_based": true,
        "no_new_files": [],
        "no_other_files": true,
        "num_prohibited_files": 125124,
        "prohibited_files": [
            "server/src/main/java/com/genymobile/scrcpy/Device.java",
            "server/src/main/java/com/genymobile/scrcpy/wrappers/SurfaceControl.java",
            "server/src/main/java/com/genymobile/scrcpy/Device.java",
            "server/src/main/java/com/genymobile/scrcpy/wrappers/SurfaceControl.java",
            "app/meson.build",
            "app/scrcpy.1",
            "app/src/common.h",
            "app/src/scrcpy.h",
            "app/src/server.h",
            "server/src/main/java/com/genymobile/scrcpy/Workarounds.java"
        ],
        "reopen": false,
        "reopen_events": [
            [
                "2023-07-23 17:52:08+00:00",
                "commit"
            ],
            [
                "2023-07-24 05:05:41+00:00",
                "commit"
            ],
            [
                "2023-07-24 10:50:41+00:00",
                "commit"
            ],
            [
                "2023-07-25 01:34:53+00:00",
                "closed"
            ]
        ],
        "status": true,
        "strategy": true,
        "total_changes": 120
    }
}