{
    "commits": [
        {
            "associated_pull_request": [],
            "date": "2014-03-19 13:19:11+00:00",
            "diff": "tass-belgium_picotcp/issue_136/commit_72d8a00ff2e42d312489ff1f7c6b61dde0deb12c.diff",
            "diff_additions": 17,
            "diff_deletions": 0,
            "diff_file_size": 13028,
            "diff_url": "https://github.com/tass-belgium/picotcp/commit/72d8a00ff2e42d312489ff1f7c6b61dde0deb12c.diff",
            "exists": true,
            "files": [
                {
                    "file_additions": 17,
                    "file_deletions": 0,
                    "file_exists": true,
                    "file_name": "modules/pico_dhcp_server.c",
                    "file_size": 13028
                }
            ],
            "interesting": {
                "reopen": false,
                "status": false
            },
            "is_parent": true,
            "sha": "72d8a00ff2e42d312489ff1f7c6b61dde0deb12c"
        },
        {
            "associated_pull_request": [],
            "date": "2014-03-19 16:02:42+00:00",
            "diff": "tass-belgium_picotcp/issue_136/commit_cf1a516d1aa09aabdd96ff36b57c1570a1d4145c.diff",
            "diff_additions": 2,
            "diff_deletions": 4,
            "diff_file_size": 106038,
            "diff_url": "https://github.com/tass-belgium/picotcp/commit/cf1a516d1aa09aabdd96ff36b57c1570a1d4145c.diff",
            "exists": true,
            "files": [
                {
                    "file_additions": 2,
                    "file_deletions": 4,
                    "file_exists": true,
                    "file_name": "modules/pico_tcp.c",
                    "file_size": 106038
                }
            ],
            "interesting": {
                "reopen": true,
                "status": false
            },
            "is_parent": false,
            "sha": "cf1a516d1aa09aabdd96ff36b57c1570a1d4145c"
        },
        {
            "associated_pull_request": [],
            "date": "2014-03-20 10:23:16+00:00",
            "diff": "tass-belgium_picotcp/issue_136/commit_24d2c4bf7fd3938763ec639a8de12e4431f73ff8.diff",
            "diff_additions": 17,
            "diff_deletions": 6,
            "diff_file_size": 106038,
            "diff_url": "https://github.com/tass-belgium/picotcp/commit/24d2c4bf7fd3938763ec639a8de12e4431f73ff8.diff",
            "exists": true,
            "files": [
                {
                    "file_additions": 17,
                    "file_deletions": 6,
                    "file_exists": true,
                    "file_name": "modules/pico_tcp.c",
                    "file_size": 106038
                }
            ],
            "interesting": {
                "reopen": false,
                "status": false
            },
            "is_parent": false,
            "sha": "24d2c4bf7fd3938763ec639a8de12e4431f73ff8"
        }
    ],
    "first_commit": "2014-03-19 13:19:46+00:00",
    "last_commit": "2014-03-20 10:23:16+00:00",
    "number": 136,
    "pull_request": "None",
    "score": {
        "accidental_reopen_likely": false,
        "all_labels": [
            "bug"
        ],
        "contains_keywords": [
            "fail",
            "fix"
        ],
        "fix_size": 25,
        "has_labels": [
            "bug"
        ],
        "intersecting": {
            "computed_score": 0.13636363636363635,
            "final_commit_size": 22,
            "intersection_size": 3,
            "previous_commits_size": 6
        },
        "is_makefile_based": true,
        "no_new_files": [],
        "no_other_files": false,
        "num_prohibited_files": 159927,
        "prohibited_files": [
            "server/src/main/java/com/genymobile/scrcpy/Device.java",
            "server/src/main/java/com/genymobile/scrcpy/wrappers/SurfaceControl.java",
            "server/src/main/java/com/genymobile/scrcpy/Device.java",
            "server/src/main/java/com/genymobile/scrcpy/wrappers/SurfaceControl.java",
            "app/meson.build",
            "app/scrcpy.1",
            "app/src/common.h",
            "app/src/scrcpy.h",
            "app/src/server.h",
            "server/src/main/java/com/genymobile/scrcpy/Workarounds.java"
        ],
        "reopen": true,
        "reopen_events": [
            [
                "2014-03-19 16:03:04+00:00",
                "closed"
            ],
            [
                "2014-03-19 16:03:04+00:00",
                "commit"
            ],
            [
                "2014-03-19 16:03:16+00:00",
                "reopened"
            ],
            [
                "2014-03-20 10:25:43+00:00",
                "closed"
            ],
            [
                "2014-03-20 10:25:43+00:00",
                "commit"
            ]
        ],
        "status": false,
        "strategy": true,
        "total_changes": 46
    }
}