{
    "covered_issues": [
        1021,
        1018,
        1005,
        998,
        995,
        972,
        967,
        962,
        957,
        955,
        954,
        947,
        939,
        938,
        907,
        901,
        870,
        863,
        861,
        853,
        840,
        831,
        822,
        821,
        814,
        806,
        804,
        800,
        798,
        795,
        791,
        787,
        786,
        785,
        779,
        778,
        774,
        769,
        766,
        764,
        762,
        761,
        759,
        756,
        755,
        754,
        748,
        747,
        744,
        743,
        742,
        739,
        738,
        737,
        734,
        733,
        732,
        727,
        726,
        725,
        723,
        720,
        718,
        717,
        715,
        714,
        711,
        710,
        709,
        706,
        705,
        704,
        703,
        699,
        697,
        696,
        695,
        693,
        691,
        688,
        687,
        685,
        684,
        683,
        682,
        681,
        675,
        673,
        672,
        670,
        669,
        666,
        665,
        663,
        662,
        661,
        655,
        653,
        650,
        648,
        646,
        644,
        643,
        641,
        639,
        635,
        633,
        630,
        629,
        619,
        616,
        611,
        607,
        603,
        600,
        598,
        597,
        591,
        589,
        587,
        585,
        583,
        578,
        575,
        572,
        571,
        570,
        568,
        567,
        566,
        565,
        561,
        559,
        557,
        556,
        554,
        548,
        545,
        544,
        543,
        542,
        541,
        540,
        539,
        536,
        533,
        532,
        531,
        530,
        525,
        523,
        522,
        521,
        520,
        518,
        514,
        513,
        508,
        503,
        502,
        499,
        498,
        493,
        489,
        484,
        483,
        482,
        481,
        480,
        477,
        471,
        470,
        469,
        467,
        465,
        462,
        461,
        460,
        459,
        456,
        455,
        454,
        453,
        451,
        440,
        439,
        438,
        434,
        432,
        431,
        429,
        426,
        425,
        424,
        422,
        419,
        417,
        416,
        415,
        412,
        409,
        406,
        405,
        403,
        402,
        401,
        400,
        393,
        392,
        389,
        386,
        385,
        383,
        381,
        379,
        378,
        377,
        375,
        374,
        373,
        372,
        371,
        370,
        369,
        367,
        364,
        362,
        361,
        358,
        357,
        354,
        353,
        352,
        345,
        344,
        340,
        336,
        330,
        329,
        326,
        324,
        322,
        321,
        317,
        316,
        312,
        311,
        310,
        307,
        306,
        305,
        301,
        300,
        297,
        295,
        294,
        292,
        290,
        289,
        284,
        282,
        278,
        277,
        276,
        271,
        270,
        265,
        261,
        260,
        259,
        258,
        257,
        256,
        244,
        243,
        242,
        241,
        240,
        239,
        238,
        237,
        236,
        233,
        231,
        229,
        228,
        227,
        225,
        224,
        212,
        210,
        206,
        204,
        202,
        201,
        200,
        199,
        198,
        197,
        192,
        191,
        190,
        189,
        188,
        186,
        185,
        182,
        181,
        180,
        179,
        178,
        177,
        175,
        174,
        173,
        172,
        170,
        169,
        168,
        167,
        166,
        165,
        164,
        163,
        161,
        160,
        159,
        158,
        157,
        156,
        155,
        152,
        150,
        149,
        147,
        145,
        142,
        141,
        139,
        138,
        136,
        135,
        131,
        129,
        128,
        127,
        126,
        125,
        124,
        123,
        120,
        119,
        118,
        117,
        115,
        112,
        110,
        109,
        108,
        107,
        106,
        105,
        104,
        103,
        102,
        101,
        100,
        98,
        97,
        94,
        90,
        89,
        88,
        85,
        84,
        81,
        80,
        79,
        78,
        76,
        75,
        74,
        73,
        72,
        71,
        70,
        69,
        68,
        67,
        66,
        65,
        64,
        63,
        62,
        61,
        60,
        58,
        57,
        56,
        55,
        54,
        53,
        52,
        51,
        50,
        49,
        48,
        47,
        46,
        45,
        44,
        42,
        41,
        40,
        39,
        38,
        37,
        36,
        35,
        34,
        33,
        32,
        31,
        30,
        29,
        28,
        27,
        25,
        24,
        23,
        22,
        21,
        20,
        19,
        18,
        17,
        16,
        15,
        14,
        13,
        11,
        9,
        8,
        7,
        3,
        1,
        434,
        434
    ],
    "finished": true
}