{
    "covered_issues": [
        968,
        958,
        953,
        951,
        942,
        937,
        936,
        919,
        914,
        907,
        906,
        904,
        901,
        898,
        883,
        875,
        874,
        868,
        863,
        862,
        861,
        860,
        854,
        851,
        850,
        847,
        844,
        843,
        835,
        827,
        826,
        825,
        822,
        819,
        816,
        812,
        810,
        809,
        808,
        805,
        803,
        801,
        800,
        798,
        795,
        794,
        790,
        778,
        773,
        769,
        768,
        763,
        760,
        755,
        746,
        745,
        741,
        740,
        739,
        738,
        737,
        729,
        724,
        723,
        721,
        720,
        716,
        710,
        703,
        701,
        699,
        695,
        694,
        691,
        689,
        686,
        684,
        682,
        681,
        680,
        677,
        674,
        673,
        671,
        669,
        667,
        664,
        663,
        662,
        661,
        658,
        657,
        656,
        654,
        647,
        646,
        644,
        641,
        640,
        638,
        637,
        636,
        635,
        633,
        627,
        625,
        623,
        618,
        617,
        612,
        610,
        609,
        607,
        604,
        595,
        590,
        589,
        588,
        587,
        586,
        584,
        582,
        581,
        580,
        578,
        570,
        563,
        562,
        560,
        557,
        554,
        553,
        547,
        546,
        545,
        541,
        537,
        536,
        535,
        534,
        533,
        532,
        531,
        530,
        528,
        524,
        523,
        522,
        521,
        520,
        519,
        518,
        517,
        516,
        515,
        514,
        513,
        512,
        511,
        509,
        508,
        507,
        506,
        505,
        503,
        501,
        500,
        496,
        495,
        493,
        492,
        491,
        486,
        477,
        475,
        474,
        473,
        471,
        470,
        467,
        465,
        464,
        463,
        461,
        460,
        456,
        454,
        453,
        447,
        446,
        444,
        442,
        435,
        434,
        433,
        432,
        431,
        427,
        426,
        425,
        419,
        418,
        417,
        412,
        411,
        409,
        407,
        406,
        405,
        402,
        400,
        398,
        397,
        396,
        394,
        391,
        387,
        386,
        385,
        384,
        383,
        381,
        380,
        379,
        377,
        376,
        375,
        374,
        373,
        372,
        371,
        369,
        368,
        365,
        358,
        357,
        353,
        351,
        350,
        347,
        344,
        341,
        338,
        336,
        335,
        334,
        332,
        331,
        328,
        325,
        323,
        320,
        312,
        311,
        310,
        308,
        307,
        306,
        305,
        303,
        302,
        300,
        296,
        295,
        294,
        293,
        291,
        290,
        289,
        288,
        285,
        283,
        282,
        281,
        277,
        275,
        274,
        273,
        272,
        271,
        268,
        263,
        262,
        261,
        258,
        252,
        248,
        247,
        246,
        245,
        244,
        239,
        237,
        236,
        234,
        230,
        228,
        225,
        224,
        223,
        222,
        220,
        216,
        215,
        211,
        210,
        209,
        208,
        207,
        206,
        203,
        201,
        199,
        194,
        193,
        192,
        191,
        190,
        189,
        187,
        186,
        185,
        181,
        180,
        179,
        177,
        176,
        175,
        174,
        173,
        172,
        170,
        169,
        167,
        165,
        164,
        161,
        160,
        159,
        158,
        156,
        152,
        150,
        149,
        145,
        144,
        143,
        142,
        141,
        140,
        139,
        138,
        136,
        135,
        134,
        133,
        131,
        128,
        126,
        125,
        122,
        118,
        117,
        116,
        115,
        114,
        113,
        111,
        110,
        109,
        107,
        106,
        105,
        104,
        102,
        101,
        100,
        98,
        97,
        96,
        95,
        94,
        93,
        92,
        91,
        89,
        88,
        87,
        86,
        83,
        82,
        77,
        75,
        70,
        69,
        68,
        67,
        64,
        60,
        58,
        56,
        55,
        54,
        53,
        52,
        51,
        50,
        46,
        43,
        42,
        41,
        40,
        39,
        38,
        37,
        36,
        32,
        30,
        28,
        27,
        25,
        22,
        11,
        10,
        9,
        8,
        7,
        2
    ],
    "finished": true
}