{
    "commits": [
        {
            "associated_pull_request": [
                "https://github.com/blackmagic-debug/blackmagic/pull/830"
            ],
            "date": "2021-02-11 23:01:05+00:00",
            "diff": "blackmagic-debug_blackmagic/issue_832/commit_d70fa8c7f6b11ee22f6511d062c96a6a00a2c3bc.diff",
            "diff_additions": 4,
            "diff_deletions": 17,
            "diff_file_size": 23376,
            "diff_url": "https://github.com/blackmagic-debug/blackmagic/commit/d70fa8c7f6b11ee22f6511d062c96a6a00a2c3bc.diff",
            "exists": true,
            "files": [
                {
                    "file_additions": 4,
                    "file_deletions": 17,
                    "file_exists": true,
                    "file_name": "src/platforms/hosted/bmp_libusb.c",
                    "file_size": 23376
                }
            ],
            "interesting": {
                "reopen": false,
                "status": false
            },
            "is_parent": true,
            "sha": "d70fa8c7f6b11ee22f6511d062c96a6a00a2c3bc"
        },
        {
            "associated_pull_request": [
                "https://github.com/blackmagic-debug/blackmagic/pull/834"
            ],
            "date": "2021-02-16 19:17:07+00:00",
            "diff": "blackmagic-debug_blackmagic/issue_832/commit_4e9e17a8a8685e4a344a86b501018ff193acb68f.diff",
            "diff_additions": 2,
            "diff_deletions": 0,
            "diff_file_size": 46945,
            "diff_url": "https://github.com/blackmagic-debug/blackmagic/commit/4e9e17a8a8685e4a344a86b501018ff193acb68f.diff",
            "exists": true,
            "files": [
                {
                    "file_additions": 2,
                    "file_deletions": 0,
                    "file_exists": true,
                    "file_name": "src/target/adiv5.c",
                    "file_size": 46945
                }
            ],
            "interesting": {
                "reopen": false,
                "status": false
            },
            "is_parent": false,
            "sha": "4e9e17a8a8685e4a344a86b501018ff193acb68f"
        },
        {
            "associated_pull_request": [],
            "date": "2021-06-18 16:57:30+00:00",
            "diff": "blackmagic-debug_blackmagic/issue_832/commit_1b59251b1b05df666970d6030d1ce70e394b9cb0.diff",
            "diff_additions": 11,
            "diff_deletions": 17,
            "diff_file_size": 46945,
            "diff_url": "https://github.com/blackmagic-debug/blackmagic/commit/1b59251b1b05df666970d6030d1ce70e394b9cb0.diff",
            "exists": true,
            "files": [
                {
                    "file_additions": 11,
                    "file_deletions": 17,
                    "file_exists": true,
                    "file_name": "src/target/adiv5.c",
                    "file_size": 46945
                }
            ],
            "interesting": {
                "reopen": true,
                "status": false
            },
            "is_parent": false,
            "sha": "1b59251b1b05df666970d6030d1ce70e394b9cb0"
        },
        {
            "associated_pull_request": [],
            "date": "2022-06-25 13:06:35+00:00",
            "diff": "blackmagic-debug_blackmagic/issue_832/commit_45afc9da4d562aecb42e0d04d2c960335a4e0c79.diff",
            "diff_additions": 25,
            "diff_deletions": 2,
            "diff_file_size": 98286,
            "diff_url": "https://github.com/blackmagic-debug/blackmagic/commit/45afc9da4d562aecb42e0d04d2c960335a4e0c79.diff",
            "exists": true,
            "files": [
                {
                    "file_additions": 3,
                    "file_deletions": 0,
                    "file_exists": true,
                    "file_name": "src/target/cortexm.c",
                    "file_size": 63909
                },
                {
                    "file_additions": 22,
                    "file_deletions": 2,
                    "file_exists": true,
                    "file_name": "src/target/stm32l4.c",
                    "file_size": 34377
                }
            ],
            "interesting": {
                "reopen": false,
                "status": false
            },
            "is_parent": false,
            "sha": "45afc9da4d562aecb42e0d04d2c960335a4e0c79"
        },
        {
            "associated_pull_request": [],
            "date": "2022-06-25 13:06:35+00:00",
            "diff": "blackmagic-debug_blackmagic/issue_832/commit_89ad995dcd9b5d042dcf02f2f291a3d68441d02a.diff",
            "diff_additions": 25,
            "diff_deletions": 2,
            "diff_file_size": 98286,
            "diff_url": "https://github.com/blackmagic-debug/blackmagic/commit/89ad995dcd9b5d042dcf02f2f291a3d68441d02a.diff",
            "exists": true,
            "files": [
                {
                    "file_additions": 3,
                    "file_deletions": 0,
                    "file_exists": true,
                    "file_name": "src/target/cortexm.c",
                    "file_size": 63909
                },
                {
                    "file_additions": 22,
                    "file_deletions": 2,
                    "file_exists": true,
                    "file_name": "src/target/stm32l4.c",
                    "file_size": 34377
                }
            ],
            "interesting": {
                "reopen": false,
                "status": false
            },
            "is_parent": false,
            "sha": "89ad995dcd9b5d042dcf02f2f291a3d68441d02a"
        },
        {
            "associated_pull_request": [],
            "date": "2022-06-25 13:06:35+00:00",
            "diff": "blackmagic-debug_blackmagic/issue_832/commit_4df7ba7e816b933d71dec762ad81bb1f6526a43f.diff",
            "diff_additions": 28,
            "diff_deletions": 2,
            "diff_file_size": 98286,
            "diff_url": "https://github.com/blackmagic-debug/blackmagic/commit/4df7ba7e816b933d71dec762ad81bb1f6526a43f.diff",
            "exists": true,
            "files": [
                {
                    "file_additions": 3,
                    "file_deletions": 0,
                    "file_exists": true,
                    "file_name": "src/target/cortexm.c",
                    "file_size": 63909
                },
                {
                    "file_additions": 25,
                    "file_deletions": 2,
                    "file_exists": true,
                    "file_name": "src/target/stm32l4.c",
                    "file_size": 34377
                }
            ],
            "interesting": {
                "reopen": false,
                "status": false
            },
            "is_parent": false,
            "sha": "4df7ba7e816b933d71dec762ad81bb1f6526a43f"
        },
        {
            "associated_pull_request": [],
            "date": "2022-06-25 13:06:35+00:00",
            "diff": "blackmagic-debug_blackmagic/issue_832/commit_949fb63a1ae05da56a073da8d94320a9afb241dd.diff",
            "diff_additions": 30,
            "diff_deletions": 2,
            "diff_file_size": 145231,
            "diff_url": "https://github.com/blackmagic-debug/blackmagic/commit/949fb63a1ae05da56a073da8d94320a9afb241dd.diff",
            "exists": true,
            "files": [
                {
                    "file_additions": 1,
                    "file_deletions": 0,
                    "file_exists": true,
                    "file_name": "src/target/adiv5.c",
                    "file_size": 46945
                },
                {
                    "file_additions": 3,
                    "file_deletions": 0,
                    "file_exists": true,
                    "file_name": "src/target/cortexm.c",
                    "file_size": 63909
                },
                {
                    "file_additions": 26,
                    "file_deletions": 2,
                    "file_exists": true,
                    "file_name": "src/target/stm32l4.c",
                    "file_size": 34377
                }
            ],
            "interesting": {
                "reopen": false,
                "status": false
            },
            "is_parent": false,
            "sha": "949fb63a1ae05da56a073da8d94320a9afb241dd"
        },
        {
            "associated_pull_request": [
                "https://github.com/blackmagic-debug/blackmagic/pull/1067"
            ],
            "date": "2022-06-25 13:06:35+00:00",
            "diff": "blackmagic-debug_blackmagic/issue_832/commit_98f057d424b2f76776ce3c3d059af82e27b639e1.diff",
            "diff_additions": 34,
            "diff_deletions": 3,
            "diff_file_size": 145231,
            "diff_url": "https://github.com/blackmagic-debug/blackmagic/commit/98f057d424b2f76776ce3c3d059af82e27b639e1.diff",
            "exists": true,
            "files": [
                {
                    "file_additions": 1,
                    "file_deletions": 0,
                    "file_exists": true,
                    "file_name": "src/target/adiv5.c",
                    "file_size": 46945
                },
                {
                    "file_additions": 3,
                    "file_deletions": 0,
                    "file_exists": true,
                    "file_name": "src/target/cortexm.c",
                    "file_size": 63909
                },
                {
                    "file_additions": 30,
                    "file_deletions": 3,
                    "file_exists": true,
                    "file_name": "src/target/stm32l4.c",
                    "file_size": 34377
                }
            ],
            "interesting": {
                "reopen": false,
                "status": false
            },
            "is_parent": false,
            "sha": "98f057d424b2f76776ce3c3d059af82e27b639e1"
        },
        {
            "associated_pull_request": [
                "https://github.com/blackmagic-debug/blackmagic/pull/1067"
            ],
            "date": "2022-06-25 13:06:35+00:00",
            "diff": "blackmagic-debug_blackmagic/issue_832/commit_80c98df2f959bf86959cd07280d64842110b10ef.diff",
            "diff_additions": 34,
            "diff_deletions": 3,
            "diff_file_size": 145231,
            "diff_url": "https://github.com/blackmagic-debug/blackmagic/commit/80c98df2f959bf86959cd07280d64842110b10ef.diff",
            "exists": true,
            "files": [
                {
                    "file_additions": 1,
                    "file_deletions": 0,
                    "file_exists": true,
                    "file_name": "src/target/adiv5.c",
                    "file_size": 46945
                },
                {
                    "file_additions": 3,
                    "file_deletions": 0,
                    "file_exists": true,
                    "file_name": "src/target/cortexm.c",
                    "file_size": 63909
                },
                {
                    "file_additions": 30,
                    "file_deletions": 3,
                    "file_exists": true,
                    "file_name": "src/target/stm32l4.c",
                    "file_size": 34377
                }
            ],
            "interesting": {
                "reopen": false,
                "status": false
            },
            "is_parent": false,
            "sha": "80c98df2f959bf86959cd07280d64842110b10ef"
        }
    ],
    "first_commit": "2021-02-15 16:47:29+00:00",
    "last_commit": "2022-06-25 20:52:36+00:00",
    "number": 832,
    "pull_request": "None",
    "score": {
        "accidental_reopen_likely": false,
        "all_labels": [],
        "contains_keywords": [
            "work",
            "fail",
            "fix",
            "issu",
            "CI",
            "patch",
            "debug",
            "reason",
            "test",
            "warn",
            "bug",
            "error",
            "problem",
            "report",
            "workaround"
        ],
        "fix_size": 76,
        "has_labels": [],
        "intersecting": {
            "computed_score": 1.0,
            "final_commit_size": 39,
            "intersection_size": 39,
            "previous_commits_size": 76
        },
        "is_makefile_based": true,
        "no_new_files": [],
        "no_other_files": false,
        "num_prohibited_files": 356841,
        "prohibited_files": [
            "server/src/main/java/com/genymobile/scrcpy/Device.java",
            "server/src/main/java/com/genymobile/scrcpy/wrappers/SurfaceControl.java",
            "server/src/main/java/com/genymobile/scrcpy/Device.java",
            "server/src/main/java/com/genymobile/scrcpy/wrappers/SurfaceControl.java",
            "app/meson.build",
            "app/scrcpy.1",
            "app/src/common.h",
            "app/src/scrcpy.h",
            "app/src/server.h",
            "server/src/main/java/com/genymobile/scrcpy/Workarounds.java"
        ],
        "reopen": true,
        "reopen_events": [
            [
                "2021-02-19 10:06:12+00:00",
                "commit"
            ],
            [
                "2021-02-19 17:48:03+00:00",
                "commit"
            ],
            [
                "2021-06-18 17:02:53+00:00",
                "commit"
            ],
            [
                "2021-07-15 13:06:55+00:00",
                "closed"
            ],
            [
                "2022-06-22 15:26:22+00:00",
                "reopened"
            ],
            [
                "2022-06-25 14:02:35+00:00",
                "commit"
            ],
            [
                "2022-06-25 14:09:59+00:00",
                "commit"
            ],
            [
                "2022-06-25 15:26:58+00:00",
                "commit"
            ],
            [
                "2022-06-25 16:14:03+00:00",
                "commit"
            ],
            [
                "2022-06-25 19:47:58+00:00",
                "commit"
            ],
            [
                "2022-06-25 20:52:36+00:00",
                "closed"
            ],
            [
                "2022-06-25 20:52:38+00:00",
                "commit"
            ]
        ],
        "status": false,
        "strategy": true,
        "total_changes": 241
    }
}