{
    "covered_issues": [
        265,
        264,
        260,
        256,
        249,
        248,
        246,
        242,
        241,
        233,
        231,
        228,
        219,
        201,
        200,
        198,
        186,
        182,
        179,
        170,
        169,
        166,
        163,
        162,
        158,
        156,
        155,
        153,
        152,
        151,
        150,
        147,
        146,
        139,
        134,
        133,
        131,
        125,
        121,
        117,
        116,
        115,
        112,
        111,
        110,
        109,
        102,
        101,
        99,
        98,
        97,
        93,
        89,
        88,
        86,
        85,
        83,
        81,
        80,
        79,
        76,
        70,
        62,
        59,
        57,
        55,
        54,
        51,
        48,
        47,
        46,
        45,
        43,
        34,
        33,
        32,
        31,
        29,
        27,
        25,
        21,
        20,
        19,
        17,
        16,
        15,
        13,
        12,
        8,
        7,
        5,
        4,
        2,
        1
    ],
    "finished": true
}