{
    "covered_issues": [
        2046,
        2044,
        2041,
        2040,
        2039,
        2018,
        2013,
        2001,
        1986,
        1976,
        1973,
        1969,
        1965,
        1959,
        1951,
        1950,
        1949,
        1948,
        1947,
        1945,
        1944,
        1941,
        1939,
        1936,
        1935,
        1934,
        1933,
        1932,
        1931,
        1929,
        1928,
        1925,
        1924,
        1923,
        1921,
        1920,
        1919,
        1918,
        1917,
        1916,
        1915,
        1914,
        1912,
        1910,
        1908,
        1906,
        1905,
        1903,
        1902,
        1899,
        1898,
        1897,
        1896,
        1895,
        1893,
        1892,
        1891,
        1890,
        1886,
        1885,
        1884,
        1883,
        1882,
        1879,
        1878,
        1875,
        1874,
        1873,
        1872,
        1870,
        1869,
        1868,
        1866,
        1865,
        1864,
        1862,
        1861,
        1860,
        1859,
        1858,
        1857,
        1856,
        1855,
        1854,
        1853,
        1852,
        1851,
        1850,
        1849,
        1848,
        1847,
        1846,
        1845,
        1844,
        1841,
        1840,
        1838,
        1836,
        1835,
        1834,
        1833,
        1832,
        1831,
        1828,
        1827,
        1825,
        1824,
        1823,
        1822,
        1821,
        1819,
        1818,
        1817,
        1816,
        1814,
        1813,
        1812,
        1808,
        1807,
        1805,
        1804,
        1803,
        1798,
        1797,
        1794,
        1793,
        1792,
        1791,
        1790,
        1789,
        1785,
        1783,
        1782,
        1780,
        1777,
        1776,
        1772,
        1771,
        1768,
        1766,
        1764,
        1762,
        1761,
        1759,
        1758,
        1757,
        1755,
        1754,
        1752,
        1751,
        1750,
        1748,
        1747,
        1746,
        1745,
        1744,
        1743,
        1737,
        1736,
        1734,
        1733,
        1732,
        1731,
        1730,
        1729,
        1728,
        1727,
        1726,
        1725,
        1724,
        1723,
        1722,
        1721,
        1720,
        1719,
        1718,
        1717,
        1715,
        1714,
        1713,
        1712,
        1711,
        1709,
        1708,
        1707,
        1706,
        1705,
        1704,
        1703,
        1701,
        1698,
        1697,
        1696,
        1694,
        1693,
        1692,
        1691,
        1690,
        1689,
        1688,
        1687,
        1686,
        1685,
        1684,
        1683,
        1682,
        1681,
        1680,
        1679,
        1677,
        1676,
        1674,
        1673,
        1672,
        1671,
        1670,
        1668,
        1667,
        1666,
        1665,
        1664,
        1663,
        1662,
        1661,
        1659,
        1657,
        1655,
        1654,
        1653,
        1652,
        1651,
        1650,
        1649,
        1648,
        1647,
        1646,
        1643,
        1642,
        1641,
        1640,
        1639,
        1638,
        1637,
        1636,
        1635,
        1634,
        1633,
        1632,
        1630,
        1629,
        1628,
        1627,
        1626,
        1625,
        1624,
        1623,
        1622,
        1621,
        1620,
        1619,
        1618,
        1617,
        1616,
        1615,
        1613,
        1612,
        1611,
        1610,
        1609,
        1608,
        1607,
        1606,
        1605,
        1604,
        1603,
        1602,
        1601,
        1600,
        1599,
        1598,
        1597,
        1596,
        1594,
        1593,
        1592,
        1591,
        1590,
        1589,
        1586,
        1585,
        1584,
        1583,
        1581,
        1580,
        1579,
        1578,
        1577,
        1576,
        1575,
        1572,
        1571,
        1570,
        1569,
        1568,
        1567,
        1566,
        1565,
        1564,
        1563,
        1561,
        1560,
        1559,
        1558,
        1557,
        1556,
        1554,
        1553,
        1552,
        1551,
        1550,
        1549,
        1548,
        1547,
        1546,
        1544,
        1542,
        1541,
        1539,
        1535,
        1534,
        1533,
        1532,
        1531,
        1530,
        1529,
        1528,
        1527,
        1526,
        1525,
        1523,
        1521,
        1520,
        1519,
        1518,
        1517,
        1516,
        1513,
        1512,
        1511,
        1510,
        1509,
        1507,
        1505,
        1504,
        1503,
        1500,
        1498,
        1497,
        1496,
        1495,
        1493,
        1492,
        1490,
        1488,
        1487,
        1486,
        1485,
        1484,
        1483,
        1481,
        1480,
        1479,
        1478,
        1476,
        1474,
        1473,
        1470,
        1469,
        1466,
        1465,
        1464,
        1463,
        1462,
        1461,
        1460,
        1458,
        1457,
        1456,
        1455,
        1454,
        1453,
        1452,
        1451,
        1450,
        1449,
        1448,
        1446,
        1445,
        1444,
        1443,
        1442,
        1441,
        1440,
        1439,
        1438,
        1437,
        1436,
        1435,
        1434,
        1433,
        1432,
        1431,
        1430,
        1429,
        1427,
        1426,
        1423,
        1421,
        1420,
        1418,
        1417,
        1415,
        1414,
        1413,
        1411,
        1410,
        1409,
        1408,
        1406,
        1405,
        1402,
        1401,
        1398,
        1397,
        1396,
        1395,
        1394,
        1392,
        1391,
        1390,
        1389,
        1384,
        1383,
        1382,
        1381,
        1380,
        1379,
        1378,
        1377,
        1376,
        1375,
        1374,
        1371,
        1370,
        1369,
        1368,
        1366,
        1364,
        1362,
        1361,
        1360,
        1359,
        1358,
        1357,
        1356,
        1355,
        1354,
        1353,
        1352,
        1350,
        1348,
        1346,
        1345,
        1343,
        1341,
        1339,
        1337,
        1336,
        1335,
        1334,
        1333,
        1331,
        1330,
        1328,
        1327,
        1326,
        1324,
        1321,
        1320,
        1319,
        1318,
        1317,
        1316,
        1315,
        1314,
        1313,
        1312,
        1311,
        1310,
        1309,
        1308,
        1307,
        1306,
        1302,
        1300,
        1299,
        1297,
        1296,
        1294,
        1293,
        1292,
        1291,
        1290,
        1288,
        1285,
        1284,
        1283,
        1282,
        1281,
        1279,
        1278,
        1276,
        1273,
        1272,
        1270,
        1268,
        1267,
        1266,
        1265,
        1263,
        1260,
        1259,
        1258,
        1257,
        1256,
        1255,
        1254,
        1252,
        1251,
        1250,
        1249,
        1248,
        1246,
        1245,
        1244,
        1243,
        1242,
        1241,
        1240,
        1238,
        1236,
        1235,
        1234,
        1230,
        1227,
        1226,
        1225,
        1224,
        1223,
        1222,
        1221,
        1220,
        1218,
        1217,
        1215,
        1214,
        1213,
        1211,
        1208,
        1207,
        1200,
        1198,
        1197,
        1196,
        1195,
        1191,
        1187,
        1181,
        1179,
        1175,
        1172,
        1170,
        1169,
        1167,
        1166,
        1165,
        1164,
        1156,
        1155,
        1154,
        1153,
        1152,
        1150,
        1149,
        1148,
        1147,
        1146,
        1145,
        1144,
        1143,
        1142,
        1141,
        1140,
        1139,
        1138,
        1136,
        1134,
        1133,
        1132,
        1131,
        1129,
        1128,
        1127,
        1125,
        1124,
        1123,
        1120,
        1119,
        1118,
        1114,
        1113,
        1111,
        1110,
        1109,
        1108,
        1107,
        1104,
        1103,
        1102,
        1101,
        1100,
        1097,
        1096,
        1095,
        1094,
        1093,
        1092,
        1091,
        1090,
        1088,
        1087,
        1086,
        1085,
        1084,
        1083,
        1082,
        1081,
        1080,
        1079,
        1078,
        1077,
        1076,
        1075,
        1074,
        1073,
        1072,
        1071,
        1070,
        1069,
        1068,
        1067,
        1066,
        1065,
        1064,
        1063,
        1062,
        1061,
        1060,
        1059,
        1058,
        1057,
        1056,
        1055,
        1053,
        1050,
        1049,
        1048,
        1046,
        1045,
        1044,
        1043,
        1042,
        1041,
        1040,
        1039,
        1036,
        1034,
        1033,
        1032,
        1031,
        1030,
        1029,
        1028,
        1026,
        1025,
        1024,
        1023,
        1022,
        1021,
        1020,
        1019,
        1017,
        1016,
        1015,
        1014,
        1013,
        1012,
        1011,
        1010,
        1009,
        1008,
        1006,
        1004,
        1002,
        1001,
        1000,
        999,
        998,
        996,
        995,
        994,
        993,
        991,
        990,
        987,
        986,
        985,
        984,
        983,
        982,
        981,
        978,
        976,
        975,
        972,
        971,
        970,
        969,
        968,
        967,
        965,
        964,
        963,
        962,
        961,
        960,
        959,
        957,
        955,
        954,
        953,
        952,
        951,
        949,
        948,
        947,
        945,
        943,
        942,
        941,
        940,
        939,
        938,
        937,
        935,
        934,
        933,
        932,
        931,
        930,
        929,
        927,
        926,
        925,
        921,
        919,
        918,
        916,
        915,
        914,
        913,
        912,
        910,
        909,
        907,
        906,
        904,
        899,
        898,
        896,
        894,
        893,
        892,
        891,
        890,
        887,
        886,
        885,
        883,
        882,
        881,
        880,
        879,
        878,
        877,
        875,
        874,
        873,
        872,
        871,
        868,
        867,
        865,
        863,
        862,
        859,
        858,
        856,
        855,
        854,
        853,
        852,
        850,
        849,
        848,
        847,
        846,
        844,
        843,
        841,
        840,
        839,
        838,
        837,
        836,
        835,
        834,
        833,
        832,
        831,
        829,
        828,
        827,
        826,
        825,
        823,
        822,
        821,
        818,
        816,
        815,
        814,
        810,
        808,
        807,
        806,
        805,
        802,
        799,
        798,
        797,
        795,
        793,
        792,
        791,
        790,
        789,
        788,
        786,
        784,
        782,
        780,
        778,
        777,
        775,
        774,
        773,
        772,
        771,
        769,
        768,
        767,
        766,
        764,
        762,
        760,
        759,
        758,
        757,
        756,
        755,
        754,
        753,
        750,
        749,
        748,
        746,
        745,
        744,
        740,
        739,
        738,
        736,
        734,
        733,
        728,
        727,
        726,
        724,
        723,
        722,
        721,
        720,
        719,
        718,
        717,
        716,
        715,
        714,
        713,
        711,
        709,
        708,
        707,
        706,
        705,
        703,
        701,
        699,
        698,
        697,
        696,
        695,
        692,
        691,
        689,
        688,
        685,
        682,
        679,
        676,
        675,
        674,
        672,
        671,
        669,
        668,
        667,
        664,
        663,
        662,
        661,
        660,
        658,
        657,
        656,
        655,
        653,
        650,
        649,
        647,
        646,
        645,
        644,
        643,
        642,
        641,
        640,
        636,
        635,
        633,
        632,
        631,
        629,
        628,
        626,
        625,
        621,
        619,
        618,
        617,
        616,
        614,
        613,
        612,
        611,
        610,
        608,
        607,
        606,
        605,
        604,
        600,
        598,
        597,
        596,
        595,
        594,
        593,
        592,
        591,
        590,
        588,
        586,
        584,
        583,
        582,
        581,
        580,
        579,
        578,
        577,
        576,
        575,
        574,
        573,
        572,
        571,
        570,
        569,
        568,
        566,
        565,
        563,
        559,
        558,
        556,
        555,
        553,
        550,
        546,
        544,
        542,
        541,
        540,
        539,
        538,
        536,
        534,
        531,
        530,
        529,
        528,
        527,
        524,
        523,
        521,
        520,
        519,
        518,
        517,
        516,
        515,
        514,
        513,
        512,
        511,
        510,
        509,
        505,
        503,
        502,
        501,
        498,
        495,
        494,
        493,
        490,
        487,
        486,
        484,
        483,
        482,
        481,
        479,
        477,
        476,
        475,
        474,
        473,
        472,
        468,
        467,
        466,
        465,
        463,
        462,
        458,
        457,
        453,
        452,
        449,
        445,
        444,
        442,
        440,
        439,
        438,
        437,
        436,
        435,
        434,
        433,
        432,
        430,
        427,
        426,
        425,
        423,
        422,
        420,
        419,
        417,
        414,
        412,
        408,
        403,
        402,
        396,
        395,
        394,
        393,
        391,
        390,
        389,
        388,
        383,
        381,
        378,
        376,
        375,
        374,
        372,
        371,
        366,
        362,
        361,
        360,
        359,
        358,
        356,
        354,
        353,
        352,
        351,
        349,
        345,
        344,
        339,
        338,
        337,
        336,
        335,
        333,
        329,
        328,
        324,
        323,
        320,
        319,
        318,
        317,
        313,
        312,
        310,
        309,
        305,
        304,
        303,
        302,
        301,
        299,
        297,
        296,
        293,
        291,
        290,
        287,
        286,
        284,
        278,
        277,
        276,
        273,
        272,
        271,
        269,
        267,
        266,
        263,
        260,
        259,
        258,
        256,
        254,
        249,
        248,
        247,
        245,
        241,
        239,
        238,
        237,
        234,
        233,
        232,
        230,
        226,
        224,
        217,
        214,
        210,
        208,
        207,
        206,
        204,
        201,
        200,
        199,
        195,
        194,
        193,
        190,
        185,
        183,
        182,
        180,
        177,
        174,
        171,
        167,
        163,
        161,
        160,
        157,
        155,
        153,
        152,
        149,
        148,
        145,
        144,
        142,
        138,
        137,
        132,
        128,
        126,
        124,
        123,
        121,
        119,
        114,
        112,
        111,
        110,
        107,
        103,
        98,
        97,
        91,
        87,
        86,
        84,
        83,
        80,
        79,
        69,
        67,
        65,
        60,
        59,
        58,
        57,
        54,
        53,
        52,
        50,
        48,
        47,
        46,
        45,
        44,
        40,
        39,
        32,
        31,
        27
    ],
    "finished": true
}