{
    "covered_issues": [
        61,
        60,
        50,
        49,
        47,
        46,
        45,
        43,
        39,
        38,
        36,
        31,
        29,
        27,
        25,
        22,
        18,
        17,
        11,
        8,
        7,
        6,
        5,
        2,
        1
    ],
    "finished": true
}