{
    "commits": [
        {
            "associated_pull_request": [],
            "date": "2015-11-18 18:44:19+00:00",
            "diff": "simh_simh/issue_246/commit_53796ba961f1c414a3a2187ab791f9e8b94e796b.diff",
            "diff_additions": 138,
            "diff_deletions": 7,
            "diff_file_size": 410086,
            "diff_url": "https://github.com/simh/simh/commit/53796ba961f1c414a3a2187ab791f9e8b94e796b.diff",
            "exists": true,
            "files": [
                {
                    "file_additions": 23,
                    "file_deletions": 1,
                    "file_exists": true,
                    "file_name": "sim_console.c",
                    "file_size": 161361
                },
                {
                    "file_additions": 115,
                    "file_deletions": 6,
                    "file_exists": true,
                    "file_name": "sim_tmxr.c",
                    "file_size": 248725
                }
            ],
            "interesting": {
                "reopen": false,
                "status": false
            },
            "is_parent": true,
            "sha": "53796ba961f1c414a3a2187ab791f9e8b94e796b"
        },
        {
            "associated_pull_request": [],
            "date": "2015-11-18 18:51:37+00:00",
            "diff": "simh_simh/issue_246/commit_9b458336874e4f648c43df1fb2573d8e0b80638b.diff",
            "diff_additions": 14,
            "diff_deletions": 14,
            "diff_file_size": 211169,
            "diff_url": "https://github.com/simh/simh/commit/9b458336874e4f648c43df1fb2573d8e0b80638b.diff",
            "exists": true,
            "files": [
                {
                    "file_additions": 2,
                    "file_deletions": 2,
                    "file_exists": true,
                    "file_name": "PDP11/pdp11_stddev.c",
                    "file_size": 22313
                },
                {
                    "file_additions": 2,
                    "file_deletions": 2,
                    "file_exists": true,
                    "file_name": "VAX/vax610_stddev.c",
                    "file_size": 16798
                },
                {
                    "file_additions": 2,
                    "file_deletions": 2,
                    "file_exists": true,
                    "file_name": "VAX/vax630_stddev.c",
                    "file_size": 14319
                },
                {
                    "file_additions": 2,
                    "file_deletions": 2,
                    "file_exists": true,
                    "file_name": "VAX/vax730_stddev.c",
                    "file_size": 39770
                },
                {
                    "file_additions": 2,
                    "file_deletions": 2,
                    "file_exists": true,
                    "file_name": "VAX/vax750_stddev.c",
                    "file_size": 37942
                },
                {
                    "file_additions": 2,
                    "file_deletions": 2,
                    "file_exists": true,
                    "file_name": "VAX/vax780_stddev.c",
                    "file_size": 52399
                },
                {
                    "file_additions": 2,
                    "file_deletions": 2,
                    "file_exists": true,
                    "file_name": "VAX/vax_stddev.c",
                    "file_size": 27628
                }
            ],
            "interesting": {
                "reopen": false,
                "status": false
            },
            "is_parent": false,
            "sha": "9b458336874e4f648c43df1fb2573d8e0b80638b"
        },
        {
            "associated_pull_request": [],
            "date": "2015-11-19 16:56:06+00:00",
            "diff": "simh_simh/issue_246/commit_833ba71c3ba500836e5260d22330244e268165a9.diff",
            "diff_additions": 89,
            "diff_deletions": 32,
            "diff_file_size": 441343,
            "diff_url": "https://github.com/simh/simh/commit/833ba71c3ba500836e5260d22330244e268165a9.diff",
            "exists": true,
            "files": [
                {
                    "file_additions": 2,
                    "file_deletions": 2,
                    "file_exists": true,
                    "file_name": "PDP11/pdp11_dc.c",
                    "file_size": 30233
                },
                {
                    "file_additions": 2,
                    "file_deletions": 2,
                    "file_exists": true,
                    "file_name": "PDP11/pdp11_dl.c",
                    "file_size": 39669
                },
                {
                    "file_additions": 17,
                    "file_deletions": 14,
                    "file_exists": true,
                    "file_name": "PDP11/pdp11_dz.c",
                    "file_size": 46012
                },
                {
                    "file_additions": 43,
                    "file_deletions": 14,
                    "file_exists": true,
                    "file_name": "PDP11/pdp11_vh.c",
                    "file_size": 76704
                },
                {
                    "file_additions": 25,
                    "file_deletions": 0,
                    "file_exists": true,
                    "file_name": "sim_tmxr.c",
                    "file_size": 248725
                }
            ],
            "interesting": {
                "reopen": true,
                "status": false
            },
            "is_parent": false,
            "sha": "833ba71c3ba500836e5260d22330244e268165a9"
        },
        {
            "associated_pull_request": [],
            "date": "2015-11-19 16:56:06+00:00",
            "diff": "simh_simh/issue_246/commit_6d6b0aeaac4b16a61c7c6ed8de0f3125c756140b.diff",
            "diff_additions": 89,
            "diff_deletions": 32,
            "diff_file_size": 441343,
            "diff_url": "https://github.com/simh/simh/commit/6d6b0aeaac4b16a61c7c6ed8de0f3125c756140b.diff",
            "exists": true,
            "files": [
                {
                    "file_additions": 2,
                    "file_deletions": 2,
                    "file_exists": true,
                    "file_name": "PDP11/pdp11_dc.c",
                    "file_size": 30233
                },
                {
                    "file_additions": 2,
                    "file_deletions": 2,
                    "file_exists": true,
                    "file_name": "PDP11/pdp11_dl.c",
                    "file_size": 39669
                },
                {
                    "file_additions": 17,
                    "file_deletions": 14,
                    "file_exists": true,
                    "file_name": "PDP11/pdp11_dz.c",
                    "file_size": 46012
                },
                {
                    "file_additions": 43,
                    "file_deletions": 14,
                    "file_exists": true,
                    "file_name": "PDP11/pdp11_vh.c",
                    "file_size": 76704
                },
                {
                    "file_additions": 25,
                    "file_deletions": 0,
                    "file_exists": true,
                    "file_name": "sim_tmxr.c",
                    "file_size": 248725
                }
            ],
            "interesting": {
                "reopen": false,
                "status": false
            },
            "is_parent": false,
            "sha": "6d6b0aeaac4b16a61c7c6ed8de0f3125c756140b"
        }
    ],
    "first_commit": "2015-11-18 18:44:19+00:00",
    "last_commit": "2017-11-27 01:10:52+00:00",
    "number": 246,
    "pull_request": "None",
    "score": {
        "accidental_reopen_likely": false,
        "all_labels": [],
        "contains_keywords": [
            "confirm",
            "work",
            "fail",
            "chang",
            "fix",
            "issu",
            "CI",
            "patch",
            "perform",
            "debug",
            "reason",
            "test",
            "attempt",
            "fault",
            "defect",
            "remov",
            "warn",
            "bug",
            "error",
            "problem",
            "report",
            "workaround"
        ],
        "fix_size": 132,
        "has_labels": [],
        "intersecting": {
            "computed_score": 1.0,
            "final_commit_size": 111,
            "intersection_size": 111,
            "previous_commits_size": 132
        },
        "is_makefile_based": true,
        "no_new_files": [],
        "no_other_files": false,
        "num_prohibited_files": 240740,
        "prohibited_files": [
            "server/src/main/java/com/genymobile/scrcpy/Device.java",
            "server/src/main/java/com/genymobile/scrcpy/wrappers/SurfaceControl.java",
            "server/src/main/java/com/genymobile/scrcpy/Device.java",
            "server/src/main/java/com/genymobile/scrcpy/wrappers/SurfaceControl.java",
            "app/meson.build",
            "app/scrcpy.1",
            "app/src/common.h",
            "app/src/scrcpy.h",
            "app/src/server.h",
            "server/src/main/java/com/genymobile/scrcpy/Workarounds.java"
        ],
        "reopen": true,
        "reopen_events": [
            [
                "2015-11-19 16:56:20+00:00",
                "commit"
            ],
            [
                "2015-11-19 16:56:20+00:00",
                "closed"
            ],
            [
                "2015-11-19 16:56:20+00:00",
                "commit"
            ],
            [
                "2015-11-19 16:57:35+00:00",
                "reopened"
            ],
            [
                "2015-11-24 03:10:42+00:00",
                "closed"
            ],
            [
                "2015-11-24 03:11:01+00:00",
                "reopened"
            ],
            [
                "2015-11-29 20:49:58+00:00",
                "closed"
            ],
            [
                "2017-11-27 01:10:55+00:00",
                "commit"
            ],
            [
                "2017-11-27 01:10:55+00:00",
                "commit"
            ]
        ],
        "status": false,
        "strategy": true,
        "total_changes": 415
    }
}