{
    "commits": [
        {
            "associated_pull_request": [],
            "date": "2019-04-16 21:24:01+00:00",
            "diff": "",
            "diff_additions": 0,
            "diff_deletions": 0,
            "diff_file_size": 0,
            "diff_url": "https://github.com/varnishcache/varnish-cache/commit/355e7adfca0b84a82a3e6ea13da4469580803d5f.diff",
            "exists": true,
            "files": [],
            "interesting": {
                "reopen": false,
                "status": false
            },
            "is_parent": true,
            "sha": "355e7adfca0b84a82a3e6ea13da4469580803d5f"
        },
        {
            "associated_pull_request": [],
            "date": "2019-04-17 08:36:45+00:00",
            "diff": "varnishcache_varnish-cache/issue_2976/commit_96c9ea2163ccf420070af34ae21295f6fd1c7d80.diff",
            "diff_additions": 1,
            "diff_deletions": 0,
            "diff_file_size": 17279,
            "diff_url": "https://github.com/varnishcache/varnish-cache/commit/96c9ea2163ccf420070af34ae21295f6fd1c7d80.diff",
            "exists": true,
            "files": [
                {
                    "file_additions": 1,
                    "file_deletions": 0,
                    "file_exists": true,
                    "file_name": "bin/varnishd/cache/cache_backend_probe.c",
                    "file_size": 17279
                }
            ],
            "interesting": {
                "reopen": false,
                "status": false
            },
            "is_parent": false,
            "sha": "96c9ea2163ccf420070af34ae21295f6fd1c7d80"
        },
        {
            "associated_pull_request": [],
            "date": "2019-04-17 11:31:25+00:00",
            "diff": "varnishcache_varnish-cache/issue_2976/commit_fff848208dc2efd495f4e6aead6a898c2fca3f18.diff",
            "diff_additions": 13,
            "diff_deletions": 4,
            "diff_file_size": 17279,
            "diff_url": "https://github.com/varnishcache/varnish-cache/commit/fff848208dc2efd495f4e6aead6a898c2fca3f18.diff",
            "exists": true,
            "files": [
                {
                    "file_additions": 13,
                    "file_deletions": 4,
                    "file_exists": true,
                    "file_name": "bin/varnishd/cache/cache_backend_probe.c",
                    "file_size": 17279
                }
            ],
            "interesting": {
                "reopen": true,
                "status": false
            },
            "is_parent": false,
            "sha": "fff848208dc2efd495f4e6aead6a898c2fca3f18"
        },
        {
            "associated_pull_request": [],
            "date": "2019-04-17 11:31:25+00:00",
            "diff": "varnishcache_varnish-cache/issue_2976/commit_0678d2c1b2beaec3e07b0f5143ef533cd08de684.diff",
            "diff_additions": 13,
            "diff_deletions": 4,
            "diff_file_size": 17279,
            "diff_url": "https://github.com/varnishcache/varnish-cache/commit/0678d2c1b2beaec3e07b0f5143ef533cd08de684.diff",
            "exists": true,
            "files": [
                {
                    "file_additions": 13,
                    "file_deletions": 4,
                    "file_exists": true,
                    "file_name": "bin/varnishd/cache/cache_backend_probe.c",
                    "file_size": 17279
                }
            ],
            "interesting": {
                "reopen": false,
                "status": false
            },
            "is_parent": false,
            "sha": "0678d2c1b2beaec3e07b0f5143ef533cd08de684"
        }
    ],
    "first_commit": "2019-04-16 21:24:01+00:00",
    "last_commit": "2020-11-03 22:14:44+00:00",
    "number": 2976,
    "pull_request": "None",
    "score": {
        "accidental_reopen_likely": false,
        "all_labels": [],
        "contains_keywords": [
            "fail",
            "fix",
            "test",
            "remov",
            "bug",
            "problem"
        ],
        "fix_size": 18,
        "has_labels": [],
        "intersecting": {
            "computed_score": 1.0,
            "final_commit_size": 18,
            "intersection_size": 18,
            "previous_commits_size": 18
        },
        "is_makefile_based": true,
        "no_new_files": [],
        "no_other_files": true,
        "num_prohibited_files": 201800,
        "prohibited_files": [
            "server/src/main/java/com/genymobile/scrcpy/Device.java",
            "server/src/main/java/com/genymobile/scrcpy/wrappers/SurfaceControl.java",
            "server/src/main/java/com/genymobile/scrcpy/Device.java",
            "server/src/main/java/com/genymobile/scrcpy/wrappers/SurfaceControl.java",
            "app/meson.build",
            "app/scrcpy.1",
            "app/src/common.h",
            "app/src/scrcpy.h",
            "app/src/server.h",
            "server/src/main/java/com/genymobile/scrcpy/Workarounds.java"
        ],
        "reopen": true,
        "reopen_events": [
            [
                "2019-04-17 08:40:41+00:00",
                "closed"
            ],
            [
                "2019-04-17 08:40:41+00:00",
                "commit"
            ],
            [
                "2019-04-17 11:40:24+00:00",
                "commit"
            ],
            [
                "2019-04-17 14:15:07+00:00",
                "reopened"
            ],
            [
                "2019-04-23 13:32:26+00:00",
                "commit"
            ],
            [
                "2019-04-23 16:01:21+00:00",
                "closed"
            ],
            [
                "2019-07-11 09:35:00+00:00",
                "commit"
            ],
            [
                "2019-07-11 09:35:00+00:00",
                "commit"
            ],
            [
                "2019-07-11 23:40:05+00:00",
                "commit"
            ],
            [
                "2019-07-11 23:40:05+00:00",
                "commit"
            ],
            [
                "2019-07-11 23:40:06+00:00",
                "commit"
            ],
            [
                "2020-11-03 22:15:21+00:00",
                "commit"
            ],
            [
                "2020-11-03 22:15:21+00:00",
                "commit"
            ]
        ],
        "status": false,
        "strategy": true,
        "total_changes": 35
    }
}