{
    "covered_issues": [
        5299,
        5295,
        5289,
        5256,
        5253,
        5252,
        5247,
        5244,
        5235,
        5234,
        5233,
        5225,
        5219,
        5213,
        5212,
        5205,
        5189,
        5187,
        5176,
        5174,
        5162,
        5161,
        5159,
        5158,
        5155,
        5154,
        5153,
        5145,
        5143,
        5142,
        5141,
        5139,
        5134,
        5132,
        5126,
        5125,
        5123,
        5122,
        5121,
        5119,
        5118,
        5116,
        5115,
        5114,
        5111,
        5103,
        5102,
        5101,
        5100,
        5098,
        5097,
        5096,
        5091,
        5090,
        5088,
        5085,
        5084,
        5077,
        5073,
        5072,
        5071,
        5070,
        5068,
        5064,
        5061,
        5059,
        5057,
        5056,
        5054,
        5052,
        5050,
        5049,
        5048,
        5045,
        5042,
        5039,
        5038,
        5037,
        5036,
        5028,
        5027,
        5026,
        5023,
        5021,
        5020,
        5015,
        5012,
        5011,
        5009,
        5006,
        5003,
        5002,
        5000,
        4992,
        4991,
        4990,
        4989,
        4987,
        4986,
        4978,
        4977,
        4976,
        4974,
        4973,
        4972,
        4970,
        4964,
        4959,
        4957,
        4955,
        4954,
        4953,
        4951,
        4947,
        4946,
        4942,
        4938,
        4937,
        4936,
        4930,
        4926,
        4924,
        4923,
        4920,
        4918,
        4915,
        4914,
        4910,
        4905,
        4901,
        4897,
        4895,
        4891,
        4886,
        4885,
        4884,
        4875,
        4874,
        4872,
        4871,
        4870,
        4869,
        4868,
        4857,
        4853,
        4840,
        4838,
        4837,
        4831,
        4830,
        4829,
        4825,
        4824,
        4822,
        4821,
        4819,
        4818,
        4815,
        4812,
        4808,
        4807,
        4806,
        4805,
        4804,
        4803,
        4801,
        4798,
        4795,
        4794,
        4793,
        4792,
        4790,
        4788,
        4787,
        4786,
        4785,
        4782,
        4779,
        4776,
        4772,
        4770,
        4768,
        4767,
        4766,
        4763,
        4761,
        4758,
        4755,
        4752,
        4751,
        4747,
        4740,
        4735,
        4731,
        4726,
        4725,
        4724,
        4719,
        4718,
        4717,
        4716,
        4715,
        4713,
        4712,
        4700,
        4691,
        4683,
        4677,
        4676,
        4667,
        4665,
        4661,
        4659,
        4658,
        4656,
        4653,
        4652,
        4651,
        4644,
        4641,
        4640,
        4638,
        4636,
        4635,
        4632,
        4629,
        4627,
        4625,
        4621,
        4620,
        4618,
        4616,
        4613,
        4609,
        4608,
        4607,
        4604,
        4602,
        4600,
        4599,
        4595,
        4593,
        4592,
        4591,
        4588,
        4587,
        4584,
        4583,
        4582,
        4581,
        4580,
        4579,
        4577,
        4576,
        4574,
        4572,
        4571,
        4564,
        4563,
        4562,
        4560,
        4554,
        4552,
        4547,
        4546,
        4545,
        4544,
        4543,
        4542,
        4540,
        4539,
        4534,
        4532,
        4528,
        4526,
        4523,
        4520,
        4519,
        4518,
        4517,
        4516,
        4513,
        4500,
        4496,
        4494,
        4492,
        4487,
        4485,
        4480,
        4479,
        4477,
        4476,
        4475,
        4474,
        4471,
        4470,
        4469,
        4468,
        4466,
        4464,
        4462,
        4461,
        4455,
        4454,
        4452,
        4451,
        4449,
        4444,
        4443,
        4439,
        4435,
        4434,
        4433,
        4430,
        4429,
        4427,
        4426,
        4425,
        4422,
        4421,
        4419,
        4418,
        4417,
        4416,
        4415,
        4411,
        4410,
        4406,
        4402,
        4401,
        4399,
        4398,
        4396,
        4394,
        4393,
        4392,
        4391,
        4390,
        4389,
        4388,
        4384,
        4382,
        4380,
        4375,
        4373,
        4368,
        4367,
        4366,
        4365,
        4356,
        4354,
        4352,
        4351,
        4350,
        4349,
        4347,
        4340,
        4337,
        4335,
        4334,
        4331,
        4330,
        4328,
        4327,
        4325,
        4323,
        4315,
        4312,
        4304,
        4303,
        4302,
        4299,
        4295,
        4294,
        4291,
        4290,
        4286,
        4283,
        4282,
        4279,
        4276,
        4274,
        4265,
        4264,
        4262,
        4261,
        4259,
        4256,
        4254,
        4249,
        4248,
        4247,
        4243,
        4240,
        4239,
        4238,
        4236,
        4235,
        4234,
        4233,
        4230,
        4229,
        4228,
        4227,
        4223,
        4222,
        4217,
        4216,
        4215,
        4213,
        4212,
        4211,
        4210,
        4209,
        4206,
        4203,
        4201,
        4198,
        4193,
        4192,
        4188,
        4178,
        4176,
        4171,
        4165,
        4164,
        4161,
        4159,
        4157,
        4155,
        4153,
        4151,
        4149,
        4148,
        4147,
        4145,
        4131,
        4125,
        4122,
        4114,
        4113,
        4112,
        4110,
        4109,
        4107,
        4106,
        4104,
        4102,
        4099,
        4096,
        4095,
        4094,
        4093,
        4092,
        4090,
        4089,
        4088,
        4086,
        4085,
        4084,
        4083,
        4082,
        4081,
        4073,
        4067,
        4061,
        4059,
        4056,
        4054,
        4053,
        4052,
        4051,
        4050,
        4049,
        4047,
        4045,
        4044,
        4043,
        4041,
        4040,
        4037,
        4035,
        4034,
        4019,
        4014,
        4008,
        4007,
        4000,
        3994,
        3983,
        3982,
        3980,
        3978,
        3976,
        3974,
        3973,
        3970,
        3969,
        3968,
        3964,
        3960,
        3959,
        3957,
        3948,
        3947,
        3944,
        3940,
        3935,
        3933,
        3930,
        3925,
        3920,
        3919,
        3918,
        3910,
        3909,
        3904,
        3902,
        3897,
        3892,
        3890,
        3889,
        3888,
        3887,
        3885,
        3884,
        3883,
        3882,
        3880,
        3877,
        3870,
        3868,
        3864,
        3860,
        3857,
        3856,
        3851,
        3850,
        3848,
        3846,
        3845,
        3844,
        3838,
        3835,
        3833,
        3830,
        3827,
        3823,
        3820,
        3818,
        3815,
        3814,
        3807,
        3803,
        3793,
        3790,
        3787,
        3784,
        3783,
        3780,
        3777,
        3776,
        3775,
        3771,
        3768,
        3765,
        3764,
        3762,
        3761,
        3756,
        3752,
        3751,
        3750,
        3749,
        3748,
        3740,
        3734,
        3726,
        3724,
        3720,
        3718,
        3714,
        3708,
        3705,
        3704,
        3702,
        3701,
        3699,
        3697,
        3696,
        3695,
        3694,
        3692,
        3686,
        3684,
        3681,
        3676,
        3675,
        3670,
        3667,
        3664,
        3656,
        3654,
        3653,
        3649,
        3647,
        3646,
        3644,
        3642,
        3641,
        3640,
        3639,
        3627,
        3625,
        3621,
        3620,
        3615,
        3614,
        3613,
        3612,
        3611,
        3609,
        3607,
        3604,
        3603,
        3602,
        3601,
        3598,
        3597,
        3592,
        3588,
        3584,
        3582,
        3571,
        3570,
        3569,
        3566,
        3564,
        3559,
        3558,
        3555,
        3553,
        3552,
        3551,
        3550,
        3541,
        3539,
        3536,
        3526,
        3525,
        3512,
        3510,
        3508,
        3507,
        3504,
        3501,
        3500,
        3499,
        3498,
        3491,
        3487,
        3482,
        3480,
        3474,
        3470,
        3457,
        3454,
        3450,
        3440,
        3439,
        3437,
        3435,
        3432,
        3431,
        3430,
        3427,
        3425,
        3422,
        3421,
        3415,
        3414,
        3412,
        3407,
        3406,
        3400,
        3399,
        3397,
        3396,
        3392,
        3390,
        3386,
        3385,
        3384,
        3383,
        3382,
        3381,
        3379,
        3378,
        3373,
        3372,
        3369,
        3367,
        3366,
        3363,
        3361,
        3360,
        3359,
        3357,
        3351,
        3347,
        3345,
        3343,
        3341,
        3340,
        3335,
        3332,
        3329,
        3326,
        3325,
        3324,
        3321,
        3320,
        3317,
        3308,
        3306,
        3305,
        3304,
        3302,
        3300,
        3297,
        3296,
        3289,
        3287,
        3283,
        3281,
        3279,
        3278,
        3275,
        3271,
        3264,
        3262,
        3261,
        3260,
        3258,
        3255,
        3252,
        3246,
        3244,
        3242,
        3241,
        3240,
        3239,
        3238,
        3237,
        3232,
        3230,
        3229,
        3228,
        3226,
        3223,
        3222,
        3221,
        3220,
        3219,
        3214,
        3209,
        3208,
        3207,
        3206,
        3203,
        3202,
        3200,
        3198,
        3197,
        3194,
        3191,
        3189,
        3188,
        3182,
        3180,
        3175,
        3174,
        3173,
        3172,
        3169,
        3164,
        3163,
        3161,
        3155,
        3154,
        3151,
        3149,
        3148,
        3145,
        3142,
        3141,
        3140,
        3136,
        3135,
        3133,
        3132,
        3128,
        3126,
        3123,
        3122,
        3119,
        3118,
        3117,
        3116,
        3115,
        3113,
        3110,
        3108,
        3106,
        3100,
        3099,
        3098,
        3097,
        3096,
        3095,
        3094,
        3093,
        3092,
        3091,
        3090,
        3089,
        3088,
        3087,
        3086,
        3084,
        3082,
        3081,
        3077,
        3075,
        3074,
        3071,
        3070,
        3069,
        3068,
        3063,
        3062,
        3061,
        3060,
        3059,
        3057,
        3056,
        3055,
        3054,
        3053,
        3051,
        3048,
        3042,
        3041,
        3040,
        3039,
        3038,
        3034,
        3032,
        3029,
        3027,
        3024,
        3022,
        3018,
        3015,
        3014,
        3008,
        3006,
        3004,
        3002,
        3001,
        2999,
        2992,
        2991,
        2988,
        2987,
        2986,
        2984,
        2981,
        2979,
        2978,
        2976,
        2971,
        2968,
        2967,
        2966,
        2965,
        2960,
        2959,
        2957,
        2954,
        2953,
        2951,
        2950,
        2948,
        2941,
        2930,
        2926,
        2925,
        2923,
        2913,
        2912,
        2911,
        2908,
        2907,
        2906,
        2903,
        2901,
        2900,
        2898,
        2895,
        2892,
        2886,
        2883,
        2868,
        2867,
        2863,
        2860,
        2859,
        2856,
        2852,
        2850,
        2849,
        2847,
        2843,
        2841,
        2834,
        2832,
        2828,
        2820,
        2818,
        2812,
        2810,
        2803,
        2801,
        2799,
        2797,
        2796,
        2790,
        2779,
        2776,
        2775,
        2770,
        2769,
        2768,
        2766,
        2765,
        2764,
        2752,
        2751,
        2748,
        2746,
        2743,
        2741,
        2737,
        2736,
        2734,
        2733,
        2732,
        2730,
        2729,
        2728,
        2726,
        2722,
        2719,
        2718,
        2717,
        2712,
        2710,
        2707,
        2705,
        2701,
        2692,
        2691,
        2687,
        2686,
        2684,
        2681,
        2678,
        2677,
        2675,
        2674,
        2672,
        2670,
        2669,
        2668,
        2665,
        2663,
        2661,
        2660,
        2659,
        2658,
        2657,
        2652,
        2651,
        2644,
        2641,
        2640,
        2639,
        2638,
        2637,
        2633,
        2631,
        2630,
        2628,
        2627,
        2626,
        2625,
        2623,
        2621,
        2620,
        2618,
        2617,
        2616,
        2614,
        2610,
        2608,
        2607,
        2606,
        2605,
        2604,
        2603,
        2601,
        2597,
        2593,
        2592,
        2590,
        2582,
        2581,
        2580,
        2578,
        2575,
        2569,
        2568,
        2567,
        2566,
        2565,
        2563,
        2562,
        2558,
        2556,
        2555,
        2554,
        2552,
        2550,
        2548,
        2547,
        2543,
        2542,
        2538,
        2537,
        2536,
        2535,
        2534,
        2533,
        2531,
        2530,
        2529,
        2527,
        2526,
        2525,
        2523,
        2522,
        2519,
        2518,
        2517,
        2514,
        2513,
        2510,
        2507,
        2506,
        2504,
        2503,
        2499,
        2498,
        2497,
        2490,
        2489,
        2482,
        2481,
        2480,
        2479,
        2478,
        2477,
        2475,
        2474,
        2473,
        2470,
        2465,
        2462,
        2461,
        2460,
        2455,
        2454,
        2452,
        2450,
        2448,
        2447,
        2444,
        2443,
        2442,
        2440,
        2439,
        2438,
        2436,
        2435,
        2434,
        2433,
        2432,
        2430,
        2429,
        2425,
        2424,
        2422,
        2421,
        2419,
        2418,
        2417,
        2413,
        2412,
        2411,
        2410,
        2408,
        2406,
        2403,
        2401,
        2400,
        2399,
        2398,
        2397,
        2394,
        2391,
        2389,
        2388,
        2384,
        2382,
        2381,
        2379,
        2378,
        2370,
        2368,
        2366,
        2365,
        2364,
        2362,
        2361,
        2360,
        2357,
        2356,
        2355,
        2354,
        2353,
        2352,
        2348,
        2347,
        2346,
        2343,
        2338,
        2337,
        2336,
        2335,
        2334,
        2332,
        2331,
        2329,
        2327,
        2323,
        2322,
        2318,
        2316,
        2315,
        2312,
        2311,
        2307,
        2306,
        2305,
        2301,
        2300,
        2298,
        2297,
        2296,
        2290,
        2287,
        2286,
        2283,
        2282,
        2278,
        2277,
        2275,
        2272,
        2271,
        2270,
        2267,
        2265,
        2261,
        2260,
        2259,
        2258,
        2257,
        2256,
        2237,
        2236,
        2235,
        2233,
        2232,
        2231,
        2230,
        2228,
        2226,
        2223,
        2222,
        2221,
        2220,
        2219,
        2218,
        2215,
        2213,
        2212,
        2210,
        2209,
        2207,
        2205,
        2200,
        2194,
        2191,
        2190,
        2188,
        2187,
        2183,
        2178,
        2177,
        2176,
        2170,
        2169,
        2166,
        2163,
        2155,
        2154,
        2152,
        2151,
        2149,
        2148,
        2143,
        2141,
        2131,
        2122,
        2120,
        2119,
        2117,
        2114,
        2112,
        2109,
        2107,
        2106,
        2103,
        2100,
        2097,
        2096,
        2095,
        2094,
        2089,
        2088,
        2087,
        2086,
        2085,
        2083,
        2081,
        2078,
        2077,
        2073,
        2072,
        2071,
        2069,
        2068,
        2067,
        2066,
        2065,
        2059,
        2058,
        2055,
        2053,
        2052,
        2050,
        2049,
        2048,
        2046,
        2045,
        2044,
        2043,
        2042,
        2040,
        2038,
        2037,
        2034,
        2032,
        2030,
        2029,
        2027,
        2025,
        2024,
        2023,
        2022,
        2020,
        2019,
        2012,
        2009,
        2007,
        2005,
        2003,
        2000,
        1995,
        1991,
        1990,
        1987,
        1985,
        1981,
        1977,
        1976,
        1972,
        1971,
        1969,
        1960,
        1958,
        1957,
        1956,
        1955,
        1949,
        1944,
        1943,
        1942,
        1936,
        1934,
        1931,
        1930,
        1928,
        1927,
        1924,
        1922,
        1920,
        1918,
        1916,
        1910,
        1908,
        1907,
        1904,
        1899,
        1892,
        1889,
        1888,
        1885,
        1884,
        1883,
        1882,
        1881,
        1880,
        1879,
        1872,
        1863,
        1853,
        1851,
        1849,
        1844,
        1837,
        1836,
        1829,
        1828,
        1827,
        1826,
        1825,
        1820,
        1816,
        1815,
        1813,
        1811,
        1810,
        1809,
        1807,
        1806,
        1805,
        1804,
        1803,
        1800,
        1797,
        1788,
        1786,
        1785,
        1779,
        1776,
        1770,
        1769,
        1764,
        1758,
        1756,
        1750,
        1749,
        1748,
        1747,
        1742,
        1741,
        1734,
        1731,
        1729,
        1725,
        1721,
        1715,
        1713,
        1712,
        1705,
        1702,
        1693,
        1691,
        1690,
        1687,
        1683,
        1680,
        1677,
        1647,
        1645,
        1640,
        1637,
        1635,
        1634,
        1632,
        1631,
        1629,
        1628,
        1624,
        1623,
        1622,
        1619,
        1614,
        1596,
        1595,
        1594,
        1587,
        1586,
        1585,
        1584,
        1581,
        1580,
        1578,
        1575,
        1574,
        1564,
        1559,
        1556,
        1553,
        1552,
        1551,
        1550,
        1547,
        1545,
        1540,
        1539,
        1537,
        1528,
        1523,
        1522,
        1517,
        1516,
        1515,
        1514,
        1507,
        1506,
        1505,
        1504,
        1503,
        1502,
        1500,
        1497,
        1496,
        1490,
        1489,
        1488,
        1481,
        1479,
        1474,
        1469,
        1468,
        1467,
        1466,
        1465,
        1463,
        1459,
        1458,
        1455,
        1452,
        1450,
        1446,
        1445,
        1444,
        1440,
        1433,
        1427,
        1425,
        1424,
        1423,
        1422,
        1420,
        1414,
        1413,
        1412,
        1411,
        1403,
        1402,
        1399,
        1398,
        1396,
        1394,
        1391,
        1390,
        1389,
        1383,
        1381,
        1380,
        1373,
        1369,
        1367,
        1366,
        1351,
        1345,
        1344,
        1343,
        1342,
        1341,
        1339,
        1336,
        1327,
        1326,
        1322,
        1320,
        1311,
        1310,
        1309,
        1308,
        1307,
        1306,
        1305,
        1297,
        1296,
        1295,
        1293,
        1291,
        1290,
        1288,
        1283,
        1282,
        1280,
        1274,
        1273,
        1271,
        1267,
        1266,
        1265,
        1264,
        1263,
        1262,
        1260,
        1258,
        1257,
        1256,
        1253,
        1250,
        1248,
        1247,
        1245,
        1244,
        1243,
        1241,
        1239,
        1238,
        1236,
        1235,
        1233,
        1232,
        1231,
        1230,
        1229,
        1228,
        1227,
        1226,
        1224,
        1223,
        1220,
        1219,
        1218,
        1217,
        1216,
        1213,
        1212,
        1208,
        1207,
        1206,
        1201,
        1199,
        1195,
        1194,
        1188,
        1178,
        1173,
        1157,
        1156,
        1152,
        1151,
        1150,
        1148,
        1147,
        1145,
        1144,
        1138,
        1136,
        1135,
        1130,
        1128,
        1124,
        1122,
        1119,
        1117,
        1109,
        1105,
        1104,
        1095,
        1090,
        1082,
        1080,
        1075,
        1065,
        1063,
        1062,
        1046,
        1038,
        1037,
        1033,
        1032,
        1031,
        1026,
        1025,
        1023,
        1022,
        1019,
        1018,
        1016,
        1015,
        1012,
        1011,
        1006,
        1005,
        1004,
        1003,
        999,
        998,
        997,
        995,
        989,
        987,
        981,
        972,
        971,
        968,
        967,
        964,
        962,
        961,
        960,
        959,
        958,
        957,
        955,
        952,
        947,
        946,
        945,
        943,
        942,
        941,
        932,
        930,
        929,
        928,
        927,
        926,
        925,
        924,
        917,
        912,
        911,
        910,
        909,
        905,
        904,
        903,
        902,
        895,
        894,
        893,
        892,
        891,
        888,
        887,
        879,
        878,
        877,
        875,
        873,
        872,
        863,
        859,
        857,
        856,
        855,
        853,
        852,
        848,
        844,
        843,
        840,
        836,
        831,
        830,
        828,
        804,
        803,
        801,
        799,
        798,
        797,
        795,
        794,
        790,
        785,
        783,
        782,
        781,
        779,
        777,
        776,
        775,
        774,
        773,
        771,
        767,
        766,
        759,
        757,
        755,
        753,
        743,
        742,
        740,
        739,
        738,
        737,
        735,
        734,
        731,
        730,
        729,
        727,
        724,
        720,
        719,
        718,
        716,
        709,
        708,
        707,
        706,
        704,
        701,
        700,
        699,
        697,
        694,
        691,
        690,
        688,
        686,
        685,
        678,
        664,
        658,
        650,
        644,
        642,
        641,
        640,
        637,
        630,
        626,
        619,
        618,
        612,
        606,
        605,
        604,
        582,
        581,
        570,
        569,
        567,
        566,
        564,
        559,
        557,
        556,
        555,
        554,
        552,
        551,
        550,
        547,
        542,
        539,
        537,
        535,
        533,
        529,
        527,
        523,
        521,
        517,
        515,
        511,
        506,
        504,
        496,
        495,
        494,
        492,
        491,
        488,
        487,
        486,
        485,
        484,
        479,
        477,
        476,
        473,
        472,
        471,
        470,
        469,
        466,
        465,
        464,
        456,
        455,
        448,
        447,
        446,
        438,
        436,
        431,
        419,
        418,
        417,
        415,
        414,
        412,
        411,
        409,
        408,
        404,
        402,
        401,
        393,
        384,
        383,
        382,
        381,
        380,
        376,
        368,
        361,
        360,
        359,
        358,
        357,
        354,
        352,
        346,
        342,
        340,
        333,
        332,
        321,
        318,
        317,
        316,
        315,
        314,
        313,
        311,
        309,
        308,
        305,
        298,
        297,
        295,
        292,
        291,
        290,
        289,
        288,
        281,
        277,
        272,
        271,
        267,
        266,
        265,
        264,
        262,
        261,
        260,
        257,
        256,
        255,
        253,
        252,
        251,
        250,
        249,
        248,
        247,
        245,
        244,
        242,
        241,
        239,
        233,
        232,
        231,
        230,
        229,
        228,
        226,
        222,
        213,
        212,
        209,
        208,
        205,
        203,
        200,
        199,
        196,
        190,
        186,
        185,
        184,
        180,
        178,
        177,
        176,
        175,
        174,
        173,
        172,
        171,
        170,
        167,
        166,
        153,
        151,
        149,
        143,
        142,
        132,
        130,
        123,
        118,
        117,
        113,
        112,
        110,
        106,
        105,
        104,
        103,
        102,
        101,
        100,
        99,
        94,
        92,
        91,
        85,
        84,
        82,
        74,
        73,
        69,
        65,
        50,
        44,
        42,
        40,
        38,
        20,
        18,
        17,
        16,
        12,
        10,
        9,
        7
    ],
    "finished": true
}