{
    "covered_issues": [
        1144,
        1142,
        1137,
        1135,
        1133,
        1131,
        1130,
        1127,
        1125,
        1123,
        1122,
        1121,
        1116,
        1115,
        1113,
        1111,
        1107,
        1104,
        1102,
        1101,
        1096,
        1093,
        1091,
        1090,
        1083,
        1081,
        1076,
        1075,
        1074,
        1069,
        1065,
        1060,
        1056,
        1053,
        1051,
        1049,
        1046,
        1041,
        1039,
        1035,
        1033,
        1032,
        1030,
        1028,
        1027,
        1025,
        1024,
        1023,
        1021,
        1020,
        1019,
        1018,
        1017,
        1014,
        1013,
        1012,
        1010,
        1008,
        1007,
        1004,
        1003,
        1002,
        999,
        997,
        992,
        990,
        989,
        986,
        984,
        970,
        969,
        968,
        966,
        965,
        950,
        944,
        943,
        941,
        940,
        937,
        936,
        927,
        925,
        918,
        917,
        915,
        891,
        889,
        879,
        875,
        874,
        872,
        866,
        864,
        863,
        862,
        859,
        855,
        851,
        850,
        846,
        842,
        841,
        840,
        838,
        837,
        832,
        829,
        827,
        825,
        824,
        819,
        815,
        813,
        812,
        809,
        808,
        805,
        803,
        798,
        797,
        796,
        794,
        793,
        788,
        787,
        786,
        785,
        784,
        783,
        780,
        779,
        776,
        774,
        770,
        768,
        766,
        764,
        761,
        760,
        759,
        756,
        755,
        752,
        751,
        750,
        748,
        747,
        745,
        744,
        743,
        742,
        741,
        740,
        737,
        736,
        735,
        734,
        733,
        730,
        729,
        728,
        725,
        722,
        720,
        719,
        718,
        714,
        712,
        711,
        710,
        709,
        708,
        707,
        706,
        705,
        704,
        703,
        702,
        701,
        699,
        694,
        693,
        691,
        689,
        688,
        687,
        680,
        679,
        678,
        676,
        675,
        674,
        673,
        670,
        668,
        667,
        666,
        664,
        662,
        661,
        659,
        658,
        655,
        634,
        631,
        629,
        628,
        627,
        625,
        624,
        623,
        622,
        620,
        619,
        618,
        616,
        613,
        612,
        610,
        608,
        605,
        603,
        601,
        600,
        599,
        597,
        594,
        592,
        590,
        589,
        586,
        584,
        583,
        582,
        581,
        580,
        579,
        578,
        576,
        575,
        574,
        573,
        572,
        571,
        570,
        568,
        567,
        566,
        565,
        564,
        563,
        561,
        559,
        557,
        556,
        555,
        553,
        552,
        548,
        543,
        542,
        541,
        538,
        536,
        535,
        534,
        532,
        531,
        530,
        529,
        527,
        526,
        523,
        522,
        520,
        519,
        518,
        517,
        516,
        511,
        510,
        508,
        507,
        506,
        505,
        504,
        503,
        502,
        500,
        498,
        497,
        496,
        494,
        493,
        492,
        486,
        485,
        483,
        482,
        481,
        478,
        477,
        476,
        475,
        474,
        473,
        472,
        470,
        469,
        463,
        462,
        461,
        460,
        459,
        457,
        455,
        454,
        453,
        452,
        451,
        450,
        449,
        448,
        447,
        446,
        445,
        444,
        443,
        442,
        441,
        440,
        439,
        438,
        437,
        436,
        435,
        434,
        433,
        432,
        431,
        430,
        429,
        428,
        427,
        426,
        425,
        424,
        423,
        422,
        421,
        420,
        419,
        418,
        417,
        416,
        415,
        413,
        411,
        410,
        409,
        408,
        407,
        406,
        405,
        404,
        403,
        402,
        401,
        400,
        397,
        395,
        393,
        392,
        390,
        387,
        386,
        385,
        383,
        379,
        378,
        377,
        376,
        375,
        373,
        371,
        369,
        367,
        366,
        365,
        361,
        359,
        358,
        356,
        354,
        353,
        352,
        351,
        344,
        340,
        339,
        338,
        337,
        336,
        335,
        334,
        332,
        327,
        320,
        317,
        315,
        314,
        311,
        309,
        308,
        305,
        304,
        302,
        301,
        300,
        299,
        297,
        296,
        295,
        293,
        292,
        290,
        289,
        288,
        287,
        286,
        284,
        282,
        280,
        279,
        277,
        276,
        275,
        274,
        273,
        272,
        270,
        269,
        268,
        267,
        266,
        263,
        262,
        261,
        259,
        258,
        251,
        250,
        249,
        248,
        247,
        243,
        242,
        240,
        239,
        238,
        237,
        236,
        235,
        234,
        233,
        232,
        231,
        230,
        228,
        227,
        226,
        225,
        224,
        223,
        222,
        221,
        220,
        219,
        218,
        217,
        214,
        213,
        212,
        211,
        210,
        209,
        206,
        204,
        199,
        198,
        197,
        196,
        195,
        192,
        191,
        190,
        187,
        185,
        184,
        182,
        176,
        175,
        174,
        173,
        172,
        171,
        170,
        169,
        163,
        162,
        161,
        160,
        158,
        157,
        156,
        155,
        152,
        151,
        150,
        148,
        146,
        144,
        142,
        141,
        139,
        137,
        130,
        124,
        123,
        121,
        120,
        119,
        118,
        117,
        116,
        110,
        104,
        103,
        102,
        97,
        93,
        92,
        91,
        89,
        80,
        79,
        78,
        77,
        76,
        75,
        74,
        72,
        71,
        68,
        67,
        63,
        59,
        58,
        52,
        51,
        49,
        48,
        47,
        46,
        45,
        44,
        40,
        39,
        35,
        34,
        32,
        31,
        30,
        29,
        28,
        27,
        26,
        25,
        24,
        23,
        21,
        20,
        17,
        16,
        14,
        13,
        12,
        11,
        10,
        9,
        8,
        7,
        6,
        4,
        3,
        2,
        1
    ],
    "finished": true
}