{
    "commits": [
        {
            "associated_pull_request": [],
            "date": "2016-09-19 11:59:35+00:00",
            "diff": "",
            "diff_additions": 0,
            "diff_deletions": 0,
            "diff_file_size": 0,
            "diff_url": "https://github.com/EnterpriseDB/repmgr/commit/2c55accbdd223836e7adc5bb6612bda28753979f.diff",
            "exists": true,
            "files": [],
            "interesting": {
                "reopen": false,
                "status": false
            },
            "is_parent": true,
            "sha": "2c55accbdd223836e7adc5bb6612bda28753979f"
        },
        {
            "associated_pull_request": [],
            "date": "2016-09-19 12:24:49+00:00",
            "diff": "enterprisedb_repmgr/issue_229/commit_036c59526aed568118acef566914df73b78517fa.diff",
            "diff_additions": 7,
            "diff_deletions": 0,
            "diff_file_size": 15989,
            "diff_url": "https://github.com/EnterpriseDB/repmgr/commit/036c59526aed568118acef566914df73b78517fa.diff",
            "exists": true,
            "files": [
                {
                    "file_additions": 7,
                    "file_deletions": 0,
                    "file_exists": true,
                    "file_name": "repmgr.c",
                    "file_size": 15989
                }
            ],
            "interesting": {
                "reopen": true,
                "status": false
            },
            "is_parent": false,
            "sha": "036c59526aed568118acef566914df73b78517fa"
        },
        {
            "associated_pull_request": [],
            "date": "2016-09-20 08:05:20+00:00",
            "diff": "enterprisedb_repmgr/issue_229/commit_03911488aa84311ffd94c4543c2ebd9ec2ddf227.diff",
            "diff_additions": 172,
            "diff_deletions": 83,
            "diff_file_size": 26222,
            "diff_url": "https://github.com/EnterpriseDB/repmgr/commit/03911488aa84311ffd94c4543c2ebd9ec2ddf227.diff",
            "exists": true,
            "files": [
                {
                    "file_additions": 141,
                    "file_deletions": 83,
                    "file_exists": true,
                    "file_name": "repmgr.c",
                    "file_size": 15989
                },
                {
                    "file_additions": 31,
                    "file_deletions": 0,
                    "file_exists": true,
                    "file_name": "strutil.c",
                    "file_size": 10233
                }
            ],
            "interesting": {
                "reopen": false,
                "status": false
            },
            "is_parent": false,
            "sha": "03911488aa84311ffd94c4543c2ebd9ec2ddf227"
        }
    ],
    "first_commit": "2016-09-19 11:59:35+00:00",
    "last_commit": "2016-09-20 23:09:44+00:00",
    "number": 229,
    "pull_request": "None",
    "score": {
        "accidental_reopen_likely": false,
        "all_labels": [],
        "contains_keywords": [
            "fail",
            "fix",
            "test",
            "attempt",
            "remov",
            "bug",
            "error",
            "report"
        ],
        "fix_size": 249,
        "has_labels": [],
        "intersecting": {
            "computed_score": 0.00823045267489712,
            "final_commit_size": 243,
            "intersection_size": 2,
            "previous_commits_size": 8
        },
        "is_makefile_based": true,
        "no_new_files": [
            "strutil.c"
        ],
        "no_other_files": false,
        "num_prohibited_files": 100042,
        "prohibited_files": [
            "server/src/main/java/com/genymobile/scrcpy/Device.java",
            "server/src/main/java/com/genymobile/scrcpy/wrappers/SurfaceControl.java",
            "server/src/main/java/com/genymobile/scrcpy/Device.java",
            "server/src/main/java/com/genymobile/scrcpy/wrappers/SurfaceControl.java",
            "app/meson.build",
            "app/scrcpy.1",
            "app/src/common.h",
            "app/src/scrcpy.h",
            "app/src/server.h",
            "server/src/main/java/com/genymobile/scrcpy/Workarounds.java"
        ],
        "reopen": true,
        "reopen_events": [
            [
                "2016-09-19 12:31:29+00:00",
                "commit"
            ],
            [
                "2016-09-19 12:35:45+00:00",
                "closed"
            ],
            [
                "2016-09-19 12:35:49+00:00",
                "reopened"
            ],
            [
                "2016-09-20 23:08:24+00:00",
                "closed"
            ],
            [
                "2016-09-20 23:14:36+00:00",
                "commit"
            ]
        ],
        "status": false,
        "strategy": true,
        "total_changes": 262
    }
}