{
    "covered_issues": [
        86,
        85,
        84,
        81,
        80,
        78,
        77,
        75,
        73,
        70,
        69,
        67,
        66,
        65,
        64,
        63,
        60,
        56,
        54,
        53,
        51,
        43,
        42,
        41,
        40,
        39,
        37,
        34,
        31,
        30,
        29,
        28,
        27,
        26,
        25,
        24,
        23,
        16,
        13,
        10,
        9,
        6,
        4,
        3
    ],
    "finished": true
}