{
    "all_issues": 7980,
    "interesting_issues": 19,
    "last_update": "2023-11-06 23:22:21.487184",
    "license": {
        "download": "https://raw.githubusercontent.com/GenericMappingTools/gmt/master/LICENSE.TXT",
        "name": "Other"
    },
    "ratio": 0.002380952380952381,
    "size": 925602,
    "stars": 756,
    "url": "https://github.com/GenericMappingTools/gmt"
}