{
    "covered_issues": [
        57,
        43,
        35,
        31,
        29,
        22,
        19,
        18,
        17,
        16,
        15,
        14,
        13,
        12,
        10,
        9,
        5,
        4,
        3,
        2,
        1
    ],
    "finished": true
}