{
    "commits": [
        {
            "associated_pull_request": [
                "https://github.com/DynamoRIO/dynamorio/pull/4864"
            ],
            "date": "2021-04-20 16:53:56+00:00",
            "diff": "dynamorio_dynamorio/issue_4857/commit_4c4380e252bb16f7e15d18d68ef482cf7281754a.diff",
            "diff_additions": 107,
            "diff_deletions": 34,
            "diff_file_size": 202375,
            "diff_url": "https://github.com/DynamoRIO/dynamorio/commit/4c4380e252bb16f7e15d18d68ef482cf7281754a.diff",
            "exists": true,
            "files": [
                {
                    "file_additions": 3,
                    "file_deletions": 3,
                    "file_exists": true,
                    "file_name": "clients/drcachesim/analyzer_multi.cpp",
                    "file_size": 24368
                },
                {
                    "file_additions": 9,
                    "file_deletions": 6,
                    "file_exists": true,
                    "file_name": "clients/drcachesim/common/options.cpp",
                    "file_size": 49998
                },
                {
                    "file_additions": 21,
                    "file_deletions": 3,
                    "file_exists": false,
                    "file_name": "clients/drcachesim/tests/trace_invariants.cpp",
                    "file_size": 0
                },
                {
                    "file_additions": 10,
                    "file_deletions": 2,
                    "file_exists": true,
                    "file_name": "clients/drcachesim/tracer/instru_online.cpp",
                    "file_size": 21066
                },
                {
                    "file_additions": 64,
                    "file_deletions": 20,
                    "file_exists": true,
                    "file_name": "clients/drcachesim/tracer/tracer.cpp",
                    "file_size": 106943
                }
            ],
            "interesting": {
                "reopen": false,
                "status": false
            },
            "is_parent": true,
            "sha": "4c4380e252bb16f7e15d18d68ef482cf7281754a"
        },
        {
            "associated_pull_request": [
                "https://github.com/DynamoRIO/dynamorio/pull/4864"
            ],
            "date": "2021-04-21 01:31:27+00:00",
            "diff": "dynamorio_dynamorio/issue_4857/commit_836c6368faebde95bdf7aaf634616b26d005e235.diff",
            "diff_additions": 2,
            "diff_deletions": 0,
            "diff_file_size": 0,
            "diff_url": "https://github.com/DynamoRIO/dynamorio/commit/836c6368faebde95bdf7aaf634616b26d005e235.diff",
            "exists": true,
            "files": [
                {
                    "file_additions": 2,
                    "file_deletions": 0,
                    "file_exists": false,
                    "file_name": "clients/drcachesim/tests/trace_invariants.cpp",
                    "file_size": 0
                }
            ],
            "interesting": {
                "reopen": false,
                "status": false
            },
            "is_parent": false,
            "sha": "836c6368faebde95bdf7aaf634616b26d005e235"
        },
        {
            "associated_pull_request": [
                "https://github.com/DynamoRIO/dynamorio/pull/4864"
            ],
            "date": "2021-04-21 17:20:07+00:00",
            "diff": "dynamorio_dynamorio/issue_4857/commit_c530f52e3797ece0ac023876b65e42a66657a8ad.diff",
            "diff_additions": 109,
            "diff_deletions": 34,
            "diff_file_size": 202375,
            "diff_url": "https://github.com/DynamoRIO/dynamorio/commit/c530f52e3797ece0ac023876b65e42a66657a8ad.diff",
            "exists": true,
            "files": [
                {
                    "file_additions": 3,
                    "file_deletions": 3,
                    "file_exists": true,
                    "file_name": "clients/drcachesim/analyzer_multi.cpp",
                    "file_size": 24368
                },
                {
                    "file_additions": 9,
                    "file_deletions": 6,
                    "file_exists": true,
                    "file_name": "clients/drcachesim/common/options.cpp",
                    "file_size": 49998
                },
                {
                    "file_additions": 23,
                    "file_deletions": 3,
                    "file_exists": false,
                    "file_name": "clients/drcachesim/tests/trace_invariants.cpp",
                    "file_size": 0
                },
                {
                    "file_additions": 10,
                    "file_deletions": 2,
                    "file_exists": true,
                    "file_name": "clients/drcachesim/tracer/instru_online.cpp",
                    "file_size": 21066
                },
                {
                    "file_additions": 64,
                    "file_deletions": 20,
                    "file_exists": true,
                    "file_name": "clients/drcachesim/tracer/tracer.cpp",
                    "file_size": 106943
                }
            ],
            "interesting": {
                "reopen": true,
                "status": false
            },
            "is_parent": false,
            "sha": "c530f52e3797ece0ac023876b65e42a66657a8ad"
        },
        {
            "associated_pull_request": [
                "https://github.com/DynamoRIO/dynamorio/pull/4961"
            ],
            "date": "2021-06-19 02:54:13+00:00",
            "diff": "dynamorio_dynamorio/issue_4857/commit_262f540c344f3485e22426a9408450ffa22ec38d.diff",
            "diff_additions": 55,
            "diff_deletions": 13,
            "diff_file_size": 182971,
            "diff_url": "https://github.com/DynamoRIO/dynamorio/commit/262f540c344f3485e22426a9408450ffa22ec38d.diff",
            "exists": true,
            "files": [
                {
                    "file_additions": 2,
                    "file_deletions": 1,
                    "file_exists": true,
                    "file_name": "clients/drcachesim/common/options.cpp",
                    "file_size": 49998
                },
                {
                    "file_additions": 8,
                    "file_deletions": 6,
                    "file_exists": false,
                    "file_name": "clients/drcachesim/tests/trace_invariants.cpp",
                    "file_size": 0
                },
                {
                    "file_additions": 14,
                    "file_deletions": 2,
                    "file_exists": true,
                    "file_name": "clients/drcachesim/tools/view.cpp",
                    "file_size": 26030
                },
                {
                    "file_additions": 31,
                    "file_deletions": 4,
                    "file_exists": true,
                    "file_name": "clients/drcachesim/tracer/tracer.cpp",
                    "file_size": 106943
                }
            ],
            "interesting": {
                "reopen": false,
                "status": false
            },
            "is_parent": false,
            "sha": "262f540c344f3485e22426a9408450ffa22ec38d"
        },
        {
            "associated_pull_request": [
                "https://github.com/DynamoRIO/dynamorio/pull/4961"
            ],
            "date": "2021-06-22 19:16:16+00:00",
            "diff": "dynamorio_dynamorio/issue_4857/commit_ce0aee0f8a74dd839867a99069cf6970cce87f33.diff",
            "diff_additions": 55,
            "diff_deletions": 13,
            "diff_file_size": 182971,
            "diff_url": "https://github.com/DynamoRIO/dynamorio/commit/ce0aee0f8a74dd839867a99069cf6970cce87f33.diff",
            "exists": true,
            "files": [
                {
                    "file_additions": 2,
                    "file_deletions": 1,
                    "file_exists": true,
                    "file_name": "clients/drcachesim/common/options.cpp",
                    "file_size": 49998
                },
                {
                    "file_additions": 8,
                    "file_deletions": 6,
                    "file_exists": false,
                    "file_name": "clients/drcachesim/tests/trace_invariants.cpp",
                    "file_size": 0
                },
                {
                    "file_additions": 14,
                    "file_deletions": 2,
                    "file_exists": true,
                    "file_name": "clients/drcachesim/tools/view.cpp",
                    "file_size": 26030
                },
                {
                    "file_additions": 31,
                    "file_deletions": 4,
                    "file_exists": true,
                    "file_name": "clients/drcachesim/tracer/tracer.cpp",
                    "file_size": 106943
                }
            ],
            "interesting": {
                "reopen": false,
                "status": false
            },
            "is_parent": false,
            "sha": "ce0aee0f8a74dd839867a99069cf6970cce87f33"
        }
    ],
    "first_commit": "2021-04-21 01:02:40+00:00",
    "last_commit": "2021-06-22 19:16:16+00:00",
    "number": 4857,
    "pull_request": "None",
    "score": {
        "accidental_reopen_likely": false,
        "all_labels": [
            "Type-Feature",
            "Component-DrCacheSim"
        ],
        "contains_keywords": [
            "confirm",
            "fix",
            "test",
            "fault",
            "warn"
        ],
        "fix_size": 173,
        "has_labels": [],
        "intersecting": {
            "computed_score": 1.0,
            "final_commit_size": 66,
            "intersection_size": 66,
            "previous_commits_size": 173
        },
        "is_makefile_based": true,
        "no_new_files": [],
        "no_other_files": false,
        "num_prohibited_files": 206277,
        "prohibited_files": [
            "server/src/main/java/com/genymobile/scrcpy/Device.java",
            "server/src/main/java/com/genymobile/scrcpy/wrappers/SurfaceControl.java",
            "server/src/main/java/com/genymobile/scrcpy/Device.java",
            "server/src/main/java/com/genymobile/scrcpy/wrappers/SurfaceControl.java",
            "app/meson.build",
            "app/scrcpy.1",
            "app/src/common.h",
            "app/src/scrcpy.h",
            "app/src/server.h",
            "server/src/main/java/com/genymobile/scrcpy/Workarounds.java"
        ],
        "reopen": true,
        "reopen_events": [
            [
                "2021-04-21 01:31:35+00:00",
                "commit"
            ],
            [
                "2021-04-21 17:20:08+00:00",
                "closed"
            ],
            [
                "2021-04-21 17:20:09+00:00",
                "commit"
            ],
            [
                "2021-06-18 19:18:38+00:00",
                "reopened"
            ],
            [
                "2021-06-22 16:53:43+00:00",
                "commit"
            ],
            [
                "2021-06-22 19:16:17+00:00",
                "closed"
            ],
            [
                "2021-06-22 19:16:18+00:00",
                "commit"
            ]
        ],
        "status": false,
        "strategy": true,
        "total_changes": 422
    }
}