{
    "commits": [
        {
            "associated_pull_request": [],
            "date": "2020-01-04 05:32:19+00:00",
            "diff": "",
            "diff_additions": 0,
            "diff_deletions": 0,
            "diff_file_size": 0,
            "diff_url": "https://github.com/SpenceKonde/ATTinyCore/commit/5f1409c69825b8e7f8930557c8a999a1a8b5d426.diff",
            "exists": true,
            "files": [],
            "interesting": {
                "reopen": false,
                "status": false
            },
            "is_parent": true,
            "sha": "5f1409c69825b8e7f8930557c8a999a1a8b5d426"
        },
        {
            "associated_pull_request": [],
            "date": "2020-02-05 17:36:15+00:00",
            "diff": "spencekonde_attinycore/issue_384/commit_f290c1f0533bf3d2e8b8f6bbe1a63dc5f8fb0446.diff",
            "diff_additions": 57,
            "diff_deletions": 33,
            "diff_file_size": 3615,
            "diff_url": "https://github.com/SpenceKonde/ATTinyCore/commit/f290c1f0533bf3d2e8b8f6bbe1a63dc5f8fb0446.diff",
            "exists": true,
            "files": [
                {
                    "file_additions": 57,
                    "file_deletions": 33,
                    "file_exists": true,
                    "file_name": "avr/cores/tiny/wiring_pulse.c",
                    "file_size": 3615
                }
            ],
            "interesting": {
                "reopen": true,
                "status": false
            },
            "is_parent": false,
            "sha": "f290c1f0533bf3d2e8b8f6bbe1a63dc5f8fb0446"
        },
        {
            "associated_pull_request": [],
            "date": "2020-02-07 16:14:41+00:00",
            "diff": "spencekonde_attinycore/issue_384/commit_83f2ef123f0827478391b44eb9dc722096117a7e.diff",
            "diff_additions": 57,
            "diff_deletions": 33,
            "diff_file_size": 0,
            "diff_url": "https://github.com/SpenceKonde/ATTinyCore/commit/83f2ef123f0827478391b44eb9dc722096117a7e.diff",
            "exists": true,
            "files": [
                {
                    "file_additions": 57,
                    "file_deletions": 33,
                    "file_exists": false,
                    "file_name": "avr/cores/tinymodern/wiring_pulse.c",
                    "file_size": 0
                }
            ],
            "interesting": {
                "reopen": true,
                "status": false
            },
            "is_parent": false,
            "sha": "83f2ef123f0827478391b44eb9dc722096117a7e"
        }
    ],
    "first_commit": "2020-01-04 05:32:19+00:00",
    "last_commit": "2020-02-12 05:36:32+00:00",
    "number": 384,
    "pull_request": "None",
    "score": {
        "accidental_reopen_likely": false,
        "all_labels": [
            "Pre-2.0.0 bug",
            "Critical"
        ],
        "contains_keywords": [
            "work",
            "chang",
            "fix",
            "issu",
            "patch",
            "debug",
            "reason",
            "test",
            "fault",
            "bug",
            "problem",
            "report"
        ],
        "fix_size": 124,
        "has_labels": [],
        "intersecting": {
            "computed_score": 0.0,
            "final_commit_size": 62,
            "intersection_size": 0,
            "previous_commits_size": 62
        },
        "is_makefile_based": false,
        "no_new_files": [
            "avr/cores/tinymodern/wiring_pulse.c"
        ],
        "no_other_files": true,
        "num_prohibited_files": 100150,
        "prohibited_files": [
            "server/src/main/java/com/genymobile/scrcpy/Device.java",
            "server/src/main/java/com/genymobile/scrcpy/wrappers/SurfaceControl.java",
            "server/src/main/java/com/genymobile/scrcpy/Device.java",
            "server/src/main/java/com/genymobile/scrcpy/wrappers/SurfaceControl.java",
            "app/meson.build",
            "app/scrcpy.1",
            "app/src/common.h",
            "app/src/scrcpy.h",
            "app/src/server.h",
            "server/src/main/java/com/genymobile/scrcpy/Workarounds.java"
        ],
        "reopen": true,
        "reopen_events": [
            [
                "2020-02-05 17:33:12+00:00",
                "commit"
            ],
            [
                "2020-02-05 17:36:17+00:00",
                "closed"
            ],
            [
                "2020-02-05 17:36:17+00:00",
                "commit"
            ],
            [
                "2020-02-05 17:36:32+00:00",
                "reopened"
            ],
            [
                "2020-02-07 16:14:42+00:00",
                "closed"
            ],
            [
                "2020-02-07 16:14:42+00:00",
                "commit"
            ],
            [
                "2020-02-08 21:03:46+00:00",
                "reopened"
            ],
            [
                "2020-02-09 12:02:29+00:00",
                "closed"
            ],
            [
                "2020-02-09 12:02:29+00:00",
                "commit"
            ],
            [
                "2020-02-09 12:04:38+00:00",
                "reopened"
            ],
            [
                "2020-02-12 05:36:46+00:00",
                "commit"
            ],
            [
                "2020-02-12 05:37:26+00:00",
                "closed"
            ]
        ],
        "status": false,
        "strategy": true,
        "total_changes": 180
    }
}