{
    "category": [
        "memory",
        "multithreading"
    ],
    "commits": [
        {
            "associated_pull_request": [
                "https://github.com/ElementsProject/lightning/pull/1322"
            ],
            "date": "2018-04-26 04:51:02",
            "diff": "elementsproject_lightning/issue_1420/commit_83e847575c04514f09e02042d123c0f9002362e0.diff",
            "diff_additions": 39,
            "diff_deletions": 30,
            "diff_file_size": 11589,
            "diff_url": "https://github.com/ElementsProject/lightning/commit/83e847575c04514f09e02042d123c0f9002362e0.diff",
            "exists": true,
            "files": [
                {
                    "file_additions": 22,
                    "file_deletions": 15,
                    "file_exists": false,
                    "file_name": "gossipd/gossip.c",
                    "file_size": 0
                },
                {
                    "file_additions": 17,
                    "file_deletions": 15,
                    "file_exists": true,
                    "file_name": "lightningd/connect_control.c",
                    "file_size": 11589
                }
            ],
            "interesting": {
                "reopen": false,
                "status": false
            },
            "is_parent": true,
            "sha": "83e847575c04514f09e02042d123c0f9002362e0"
        },
        {
            "associated_pull_request": [
                "https://github.com/ElementsProject/lightning/pull/1425"
            ],
            "date": "2018-04-26 07:37:34",
            "diff": "elementsproject_lightning/issue_1420/commit_1bcfb3e09c6195d72f18e88a9e9ca10f3ae3db3c.diff",
            "diff_additions": 1,
            "diff_deletions": 0,
            "diff_file_size": 125178,
            "diff_url": "https://github.com/ElementsProject/lightning/commit/1bcfb3e09c6195d72f18e88a9e9ca10f3ae3db3c.diff",
            "exists": true,
            "files": [
                {
                    "file_additions": 1,
                    "file_deletions": 0,
                    "file_exists": true,
                    "file_name": "wallet/wallet.c",
                    "file_size": 125178
                }
            ],
            "interesting": {
                "reopen": false,
                "status": false
            },
            "is_parent": false,
            "sha": "1bcfb3e09c6195d72f18e88a9e9ca10f3ae3db3c"
        },
        {
            "associated_pull_request": [],
            "date": "2019-07-25 03:21:28",
            "diff": "elementsproject_lightning/issue_1420/commit_56db245cbf9becc79a0e864edb503b5594b7cb19.diff",
            "diff_additions": 13,
            "diff_deletions": 1,
            "diff_file_size": 2400,
            "diff_url": "https://github.com/ElementsProject/lightning/commit/56db245cbf9becc79a0e864edb503b5594b7cb19.diff",
            "exists": true,
            "files": [
                {
                    "file_additions": 13,
                    "file_deletions": 1,
                    "file_exists": true,
                    "file_name": "common/peer_failed.c",
                    "file_size": 2400
                }
            ],
            "interesting": {
                "reopen": false,
                "status": true
            },
            "is_parent": false,
            "sha": "56db245cbf9becc79a0e864edb503b5594b7cb19"
        },
        {
            "associated_pull_request": [],
            "date": "2019-07-25 06:40:44",
            "diff": "elementsproject_lightning/issue_1420/commit_f357f9a49badc89acfc199c2988a21fa169ecc74.diff",
            "diff_additions": 13,
            "diff_deletions": 1,
            "diff_file_size": 2400,
            "diff_url": "https://github.com/ElementsProject/lightning/commit/f357f9a49badc89acfc199c2988a21fa169ecc74.diff",
            "exists": true,
            "files": [
                {
                    "file_additions": 13,
                    "file_deletions": 1,
                    "file_exists": true,
                    "file_name": "common/peer_failed.c",
                    "file_size": 2400
                }
            ],
            "interesting": {
                "reopen": false,
                "status": false
            },
            "is_parent": false,
            "sha": "f357f9a49badc89acfc199c2988a21fa169ecc74"
        },
        {
            "associated_pull_request": [
                "https://github.com/ElementsProject/lightning/pull/2842"
            ],
            "date": "2019-07-26 02:11:29",
            "diff": "elementsproject_lightning/issue_1420/commit_4736cb3eace53eaf1a1c9c63834c765f7a4199f1.diff",
            "diff_additions": 13,
            "diff_deletions": 1,
            "diff_file_size": 2400,
            "diff_url": "https://github.com/ElementsProject/lightning/commit/4736cb3eace53eaf1a1c9c63834c765f7a4199f1.diff",
            "exists": true,
            "files": [
                {
                    "file_additions": 13,
                    "file_deletions": 1,
                    "file_exists": true,
                    "file_name": "common/peer_failed.c",
                    "file_size": 2400
                }
            ],
            "interesting": {
                "reopen": false,
                "status": false
            },
            "is_parent": false,
            "sha": "4736cb3eace53eaf1a1c9c63834c765f7a4199f1"
        },
        {
            "associated_pull_request": [
                "https://github.com/ElementsProject/lightning/pull/2842"
            ],
            "date": "2019-07-26 02:11:29",
            "diff": "elementsproject_lightning/issue_1420/commit_6c7a45623e6c2367315f8db58f8faf0c47592943.diff",
            "diff_additions": 13,
            "diff_deletions": 1,
            "diff_file_size": 2400,
            "diff_url": "https://github.com/ElementsProject/lightning/commit/6c7a45623e6c2367315f8db58f8faf0c47592943.diff",
            "exists": true,
            "files": [
                {
                    "file_additions": 13,
                    "file_deletions": 1,
                    "file_exists": true,
                    "file_name": "common/peer_failed.c",
                    "file_size": 2400
                }
            ],
            "interesting": {
                "reopen": false,
                "status": false
            },
            "is_parent": false,
            "sha": "6c7a45623e6c2367315f8db58f8faf0c47592943"
        }
    ],
    "first_commit": "2018-04-26 05:47:57",
    "last_commit": "2019-07-26 03:53:03",
    "number": 1420,
    "pull_request": "None",
    "score": {
        "accidental_reopen_likely": false,
        "all_labels": [
            "db",
            "lightningd"
        ],
        "contains_keywords": [
            "work",
            "fix",
            "bug",
            "test",
            "error",
            "debug",
            "crash",
            "fail",
            "problem"
        ],
        "fix_size": 16,
        "has_labels": [],
        "intersecting": {
            "computed_score": 1.0,
            "final_commit_size": 14,
            "intersection_size": 14,
            "previous_commits_size": 16
        },
        "is_makefile_based": true,
        "no_new_files": [],
        "no_other_files": true,
        "num_prohibited_files": 64953,
        "prohibited_files": [
            "kill.h",
            "meminfo.h",
            "kill.h",
            "meminfo.h",
            "kill.h",
            "meminfo.h",
            "testsuite_cli_test.go",
            "testsuite_cli_test.go",
            "common.mk",
            "i3bar/include/draw_util.h"
        ],
        "reopen": false,
        "reopen_events": [
            [
                "2018-04-26 07:38:06",
                "commit"
            ],
            [
                "2018-04-26 07:59:17",
                "closed"
            ],
            [
                "2018-04-26 07:59:17",
                "commit"
            ],
            [
                "2019-07-25 03:29:29",
                "commit"
            ],
            [
                "2019-07-25 06:40:53",
                "commit"
            ],
            [
                "2019-07-26 02:12:12",
                "commit"
            ],
            [
                "2019-07-26 03:53:08",
                "commit"
            ]
        ],
        "status": true,
        "strategy": true,
        "total_changes": 126
    }
}