{
    "covered_issues": [
        674,
        671,
        664,
        661,
        660,
        659,
        657,
        656,
        655,
        654,
        653,
        652,
        651,
        650,
        649,
        648,
        647,
        646,
        645,
        644,
        643,
        642,
        641,
        640,
        639,
        638,
        637,
        636,
        635,
        634,
        633,
        632,
        631,
        630,
        628,
        627,
        626,
        625,
        624,
        623,
        622,
        621,
        619,
        618,
        617,
        616,
        615,
        614,
        612,
        611,
        610,
        609,
        608,
        605,
        604,
        603,
        601,
        599,
        593,
        591,
        590,
        588,
        586,
        585,
        584,
        578,
        577,
        576,
        575,
        574,
        573,
        572,
        571,
        569,
        567,
        564,
        562,
        557,
        554,
        553,
        551,
        550,
        548,
        547,
        545,
        544,
        543,
        541,
        539,
        538,
        535,
        534,
        531,
        530,
        529,
        525,
        524,
        523,
        521,
        519,
        518,
        517,
        514,
        512,
        510,
        508,
        506,
        504,
        500,
        498,
        496,
        493,
        492,
        491,
        490,
        489,
        487,
        485,
        484,
        483,
        481,
        479,
        478,
        477,
        476,
        475,
        474,
        473,
        472,
        471,
        470,
        469,
        468,
        467,
        466,
        465,
        464,
        463,
        462,
        460,
        459,
        458,
        457,
        456,
        455,
        454,
        453,
        452,
        451,
        450,
        449,
        448,
        447,
        445,
        442,
        441,
        440,
        435,
        433,
        432,
        431,
        430,
        429,
        428,
        427,
        426,
        425,
        424,
        423,
        422,
        421,
        420,
        419,
        418,
        417,
        416,
        415,
        412,
        411,
        410,
        407,
        406,
        404,
        403,
        402,
        401,
        400,
        399,
        398,
        397,
        396,
        393,
        391,
        390,
        388,
        385,
        384,
        383,
        381,
        379,
        378,
        377,
        375,
        374,
        372,
        368,
        367,
        366,
        365,
        364,
        363,
        362,
        361,
        358,
        357,
        356,
        354,
        353,
        352,
        350,
        349,
        348,
        347,
        346,
        344,
        343,
        342,
        341,
        340,
        338,
        337,
        336,
        332,
        331,
        327,
        324,
        323,
        322,
        320,
        319,
        309,
        308,
        307,
        306,
        304,
        302,
        297,
        296,
        295,
        294,
        291,
        290,
        289,
        288,
        287,
        286,
        284,
        281,
        280,
        279,
        278,
        277,
        276,
        275,
        274,
        273,
        271,
        268,
        264,
        263,
        262,
        261,
        258,
        249,
        248,
        247,
        244,
        243,
        242,
        241,
        238,
        235,
        234,
        233,
        232,
        228,
        226,
        225,
        220,
        218,
        217,
        216,
        215,
        213,
        212,
        203,
        202,
        196,
        195,
        194,
        193,
        191,
        185,
        181,
        178,
        177,
        176,
        167,
        161,
        155,
        144,
        143,
        133,
        131,
        126,
        122,
        121,
        120,
        119,
        118,
        116,
        115,
        112,
        111,
        109,
        107,
        104,
        99,
        97,
        96,
        95,
        94,
        93,
        91,
        90,
        89,
        88,
        87,
        86,
        85,
        84,
        83,
        81,
        80,
        79,
        78,
        77,
        74,
        73,
        71,
        70,
        69,
        68,
        67,
        66,
        65,
        62,
        60,
        59,
        58,
        57,
        56,
        55,
        54,
        53,
        51,
        49,
        48,
        47,
        46,
        44,
        42,
        41,
        39,
        38,
        37,
        36,
        35,
        34,
        33,
        32,
        31,
        30,
        29,
        28,
        27,
        24,
        23,
        22,
        21,
        20,
        19,
        17,
        16,
        13,
        12,
        11,
        10,
        9,
        6,
        5,
        4,
        3,
        2,
        1
    ],
    "finished": true
}