{
    "commits": [
        {
            "diff": "elastic_elasticsearch/issue_56891/commit_c6c8cdc68feb429b6a4009d6695ff920a27dc4f3.diff",
            "diff_additions": 3,
            "diff_deletions": 3,
            "diff_file_size": 8738,
            "files": [
                {
                    "file_additions": 2,
                    "file_deletions": 2,
                    "file_exists": true,
                    "file_name": "x-pack/plugin/core/src/main/java/org/elasticsearch/xpack/core/ml/action/DeleteExpiredDataAction.java",
                    "file_size": 6997
                },
                {
                    "file_additions": 1,
                    "file_deletions": 1,
                    "file_exists": true,
                    "file_name": "x-pack/plugin/core/src/test/java/org/elasticsearch/xpack/core/ml/action/DeleteExpiredDataActionRequestTests.java",
                    "file_size": 1741
                }
            ],
            "interesting": {
                "reopened": false,
                "status": false
            },
            "sha": "c6c8cdc68feb429b6a4009d6695ff920a27dc4f3"
        },
        {
            "diff": "elastic_elasticsearch/issue_56891/commit_1495d2a0aa8faab742b6e807aad6293fb9ae9a53.diff",
            "diff_additions": 1,
            "diff_deletions": 1,
            "diff_file_size": 31105,
            "files": [
                {
                    "file_additions": 1,
                    "file_deletions": 1,
                    "file_exists": true,
                    "file_name": "x-pack/plugin/ccr/src/internalClusterTest/java/org/elasticsearch/xpack/ccr/AutoFollowIT.java",
                    "file_size": 31105
                }
            ],
            "interesting": {
                "reopened": false,
                "status": false
            },
            "sha": "1495d2a0aa8faab742b6e807aad6293fb9ae9a53"
        },
        {
            "diff": "elastic_elasticsearch/issue_56891/commit_82e751da306374b7deeeeb6875114edc33511230.diff",
            "diff_additions": 1,
            "diff_deletions": 1,
            "diff_file_size": 31105,
            "files": [
                {
                    "file_additions": 1,
                    "file_deletions": 1,
                    "file_exists": true,
                    "file_name": "x-pack/plugin/ccr/src/internalClusterTest/java/org/elasticsearch/xpack/ccr/AutoFollowIT.java",
                    "file_size": 31105
                }
            ],
            "interesting": {
                "reopened": false,
                "status": false
            },
            "sha": "82e751da306374b7deeeeb6875114edc33511230"
        },
        {
            "diff": "elastic_elasticsearch/issue_56891/commit_073e3a5179e8b4d75bf3a3b555453770db3d5cbd.diff",
            "diff_additions": 1,
            "diff_deletions": 1,
            "diff_file_size": 31105,
            "files": [
                {
                    "file_additions": 1,
                    "file_deletions": 1,
                    "file_exists": true,
                    "file_name": "x-pack/plugin/ccr/src/internalClusterTest/java/org/elasticsearch/xpack/ccr/AutoFollowIT.java",
                    "file_size": 31105
                }
            ],
            "interesting": {
                "reopened": true,
                "status": false
            },
            "sha": "073e3a5179e8b4d75bf3a3b555453770db3d5cbd"
        },
        {
            "diff": "elastic_elasticsearch/issue_56891/commit_f238d0a3678452b3fc944739effc034e46528eb9.diff",
            "diff_additions": 108,
            "diff_deletions": 48,
            "diff_file_size": 366514,
            "files": [
                {
                    "file_additions": 1,
                    "file_deletions": 0,
                    "file_exists": true,
                    "file_name": "libs/core/src/main/java/org/elasticsearch/common/unit/TimeValue.java",
                    "file_size": 14403
                },
                {
                    "file_additions": 15,
                    "file_deletions": 11,
                    "file_exists": true,
                    "file_name": "x-pack/plugin/ccr/src/internalClusterTest/java/org/elasticsearch/xpack/ccr/CcrRepositoryIT.java",
                    "file_size": 40016
                },
                {
                    "file_additions": 6,
                    "file_deletions": 5,
                    "file_exists": true,
                    "file_name": "x-pack/plugin/ccr/src/internalClusterTest/java/org/elasticsearch/xpack/ccr/CcrRetentionLeaseIT.java",
                    "file_size": 66296
                },
                {
                    "file_additions": 2,
                    "file_deletions": 2,
                    "file_exists": true,
                    "file_name": "x-pack/plugin/ccr/src/internalClusterTest/java/org/elasticsearch/xpack/ccr/CloseFollowerIndexIT.java",
                    "file_size": 6615
                },
                {
                    "file_additions": 1,
                    "file_deletions": 1,
                    "file_exists": true,
                    "file_name": "x-pack/plugin/ccr/src/internalClusterTest/java/org/elasticsearch/xpack/ccr/FollowerFailOverIT.java",
                    "file_size": 16998
                },
                {
                    "file_additions": 25,
                    "file_deletions": 20,
                    "file_exists": true,
                    "file_name": "x-pack/plugin/ccr/src/internalClusterTest/java/org/elasticsearch/xpack/ccr/IndexFollowingIT.java",
                    "file_size": 90114
                },
                {
                    "file_additions": 1,
                    "file_deletions": 0,
                    "file_exists": true,
                    "file_name": "x-pack/plugin/ccr/src/internalClusterTest/java/org/elasticsearch/xpack/ccr/PrimaryFollowerAllocationIT.java",
                    "file_size": 8552
                },
                {
                    "file_additions": 1,
                    "file_deletions": 0,
                    "file_exists": true,
                    "file_name": "x-pack/plugin/ccr/src/main/java/org/elasticsearch/xpack/ccr/action/CcrRequests.java",
                    "file_size": 7152
                },
                {
                    "file_additions": 8,
                    "file_deletions": 6,
                    "file_exists": true,
                    "file_name": "x-pack/plugin/ccr/src/main/java/org/elasticsearch/xpack/ccr/action/ShardFollowTasksExecutor.java",
                    "file_size": 37662
                },
                {
                    "file_additions": 1,
                    "file_deletions": 2,
                    "file_exists": true,
                    "file_name": "x-pack/plugin/ccr/src/main/java/org/elasticsearch/xpack/ccr/repository/CcrRepository.java",
                    "file_size": 35442
                },
                {
                    "file_additions": 47,
                    "file_deletions": 1,
                    "file_exists": true,
                    "file_name": "x-pack/plugin/ccr/src/test/java/org/elasticsearch/xpack/CcrIntegTestCase.java",
                    "file_size": 43264
                }
            ],
            "interesting": {
                "reopened": false,
                "status": false
            },
            "sha": "f238d0a3678452b3fc944739effc034e46528eb9"
        },
        {
            "diff": "elastic_elasticsearch/issue_56891/commit_0a9fc39af0cadd1d53fef4e877dd59b867f9c3d7.diff",
            "diff_additions": 115,
            "diff_deletions": 50,
            "diff_file_size": 371998,
            "files": [
                {
                    "file_additions": 1,
                    "file_deletions": 0,
                    "file_exists": true,
                    "file_name": "libs/core/src/main/java/org/elasticsearch/common/unit/TimeValue.java",
                    "file_size": 14403
                },
                {
                    "file_additions": 15,
                    "file_deletions": 11,
                    "file_exists": true,
                    "file_name": "x-pack/plugin/ccr/src/internalClusterTest/java/org/elasticsearch/xpack/ccr/CcrRepositoryIT.java",
                    "file_size": 40016
                },
                {
                    "file_additions": 6,
                    "file_deletions": 5,
                    "file_exists": true,
                    "file_name": "x-pack/plugin/ccr/src/internalClusterTest/java/org/elasticsearch/xpack/ccr/CcrRetentionLeaseIT.java",
                    "file_size": 66296
                },
                {
                    "file_additions": 2,
                    "file_deletions": 2,
                    "file_exists": true,
                    "file_name": "x-pack/plugin/ccr/src/internalClusterTest/java/org/elasticsearch/xpack/ccr/CloseFollowerIndexIT.java",
                    "file_size": 6615
                },
                {
                    "file_additions": 5,
                    "file_deletions": 1,
                    "file_exists": true,
                    "file_name": "x-pack/plugin/ccr/src/internalClusterTest/java/org/elasticsearch/xpack/ccr/FollowerFailOverIT.java",
                    "file_size": 16998
                },
                {
                    "file_additions": 25,
                    "file_deletions": 20,
                    "file_exists": true,
                    "file_name": "x-pack/plugin/ccr/src/internalClusterTest/java/org/elasticsearch/xpack/ccr/IndexFollowingIT.java",
                    "file_size": 90114
                },
                {
                    "file_additions": 1,
                    "file_deletions": 0,
                    "file_exists": true,
                    "file_name": "x-pack/plugin/ccr/src/internalClusterTest/java/org/elasticsearch/xpack/ccr/PrimaryFollowerAllocationIT.java",
                    "file_size": 8552
                },
                {
                    "file_additions": 3,
                    "file_deletions": 2,
                    "file_exists": true,
                    "file_name": "x-pack/plugin/ccr/src/internalClusterTest/java/org/elasticsearch/xpack/ccr/RestartIndexFollowingIT.java",
                    "file_size": 5484
                },
                {
                    "file_additions": 1,
                    "file_deletions": 0,
                    "file_exists": true,
                    "file_name": "x-pack/plugin/ccr/src/main/java/org/elasticsearch/xpack/ccr/action/CcrRequests.java",
                    "file_size": 7152
                },
                {
                    "file_additions": 8,
                    "file_deletions": 6,
                    "file_exists": true,
                    "file_name": "x-pack/plugin/ccr/src/main/java/org/elasticsearch/xpack/ccr/action/ShardFollowTasksExecutor.java",
                    "file_size": 37662
                },
                {
                    "file_additions": 1,
                    "file_deletions": 2,
                    "file_exists": true,
                    "file_name": "x-pack/plugin/ccr/src/main/java/org/elasticsearch/xpack/ccr/repository/CcrRepository.java",
                    "file_size": 35442
                },
                {
                    "file_additions": 47,
                    "file_deletions": 1,
                    "file_exists": true,
                    "file_name": "x-pack/plugin/ccr/src/test/java/org/elasticsearch/xpack/CcrIntegTestCase.java",
                    "file_size": 43264
                }
            ],
            "interesting": {
                "reopened": false,
                "status": false
            },
            "sha": "0a9fc39af0cadd1d53fef4e877dd59b867f9c3d7"
        },
        {
            "diff": "elastic_elasticsearch/issue_56891/commit_370d261e0f0e8061b4a144c89eb23b5895c37cdf.diff",
            "diff_additions": 7,
            "diff_deletions": 6,
            "diff_file_size": 94659,
            "files": [
                {
                    "file_additions": 1,
                    "file_deletions": 0,
                    "file_exists": true,
                    "file_name": "libs/core/src/main/java/org/elasticsearch/common/unit/TimeValue.java",
                    "file_size": 14403
                },
                {
                    "file_additions": 1,
                    "file_deletions": 0,
                    "file_exists": true,
                    "file_name": "x-pack/plugin/ccr/src/main/java/org/elasticsearch/xpack/ccr/action/CcrRequests.java",
                    "file_size": 7152
                },
                {
                    "file_additions": 4,
                    "file_deletions": 4,
                    "file_exists": true,
                    "file_name": "x-pack/plugin/ccr/src/main/java/org/elasticsearch/xpack/ccr/action/ShardFollowTasksExecutor.java",
                    "file_size": 37662
                },
                {
                    "file_additions": 1,
                    "file_deletions": 2,
                    "file_exists": true,
                    "file_name": "x-pack/plugin/ccr/src/main/java/org/elasticsearch/xpack/ccr/repository/CcrRepository.java",
                    "file_size": 35442
                }
            ],
            "interesting": {
                "reopened": false,
                "status": false
            },
            "sha": "370d261e0f0e8061b4a144c89eb23b5895c37cdf"
        },
        {
            "diff": "elastic_elasticsearch/issue_56891/commit_93aec268959b3099fa1743f5943fc33b10d49489.diff",
            "diff_additions": 108,
            "diff_deletions": 48,
            "diff_file_size": 366514,
            "files": [
                {
                    "file_additions": 1,
                    "file_deletions": 0,
                    "file_exists": true,
                    "file_name": "libs/core/src/main/java/org/elasticsearch/common/unit/TimeValue.java",
                    "file_size": 14403
                },
                {
                    "file_additions": 15,
                    "file_deletions": 11,
                    "file_exists": true,
                    "file_name": "x-pack/plugin/ccr/src/internalClusterTest/java/org/elasticsearch/xpack/ccr/CcrRepositoryIT.java",
                    "file_size": 40016
                },
                {
                    "file_additions": 6,
                    "file_deletions": 5,
                    "file_exists": true,
                    "file_name": "x-pack/plugin/ccr/src/internalClusterTest/java/org/elasticsearch/xpack/ccr/CcrRetentionLeaseIT.java",
                    "file_size": 66296
                },
                {
                    "file_additions": 2,
                    "file_deletions": 2,
                    "file_exists": true,
                    "file_name": "x-pack/plugin/ccr/src/internalClusterTest/java/org/elasticsearch/xpack/ccr/CloseFollowerIndexIT.java",
                    "file_size": 6615
                },
                {
                    "file_additions": 1,
                    "file_deletions": 1,
                    "file_exists": true,
                    "file_name": "x-pack/plugin/ccr/src/internalClusterTest/java/org/elasticsearch/xpack/ccr/FollowerFailOverIT.java",
                    "file_size": 16998
                },
                {
                    "file_additions": 25,
                    "file_deletions": 20,
                    "file_exists": true,
                    "file_name": "x-pack/plugin/ccr/src/internalClusterTest/java/org/elasticsearch/xpack/ccr/IndexFollowingIT.java",
                    "file_size": 90114
                },
                {
                    "file_additions": 1,
                    "file_deletions": 0,
                    "file_exists": true,
                    "file_name": "x-pack/plugin/ccr/src/internalClusterTest/java/org/elasticsearch/xpack/ccr/PrimaryFollowerAllocationIT.java",
                    "file_size": 8552
                },
                {
                    "file_additions": 1,
                    "file_deletions": 0,
                    "file_exists": true,
                    "file_name": "x-pack/plugin/ccr/src/main/java/org/elasticsearch/xpack/ccr/action/CcrRequests.java",
                    "file_size": 7152
                },
                {
                    "file_additions": 8,
                    "file_deletions": 6,
                    "file_exists": true,
                    "file_name": "x-pack/plugin/ccr/src/main/java/org/elasticsearch/xpack/ccr/action/ShardFollowTasksExecutor.java",
                    "file_size": 37662
                },
                {
                    "file_additions": 1,
                    "file_deletions": 2,
                    "file_exists": true,
                    "file_name": "x-pack/plugin/ccr/src/main/java/org/elasticsearch/xpack/ccr/repository/CcrRepository.java",
                    "file_size": 35442
                },
                {
                    "file_additions": 47,
                    "file_deletions": 1,
                    "file_exists": true,
                    "file_name": "x-pack/plugin/ccr/src/test/java/org/elasticsearch/xpack/CcrIntegTestCase.java",
                    "file_size": 43264
                }
            ],
            "interesting": {
                "reopened": false,
                "status": false
            },
            "sha": "93aec268959b3099fa1743f5943fc33b10d49489"
        },
        {
            "diff": "elastic_elasticsearch/issue_56891/commit_6ece629ec36a9a253d4d70d8d4e7576911c3a160.diff",
            "diff_additions": 115,
            "diff_deletions": 50,
            "diff_file_size": 371998,
            "files": [
                {
                    "file_additions": 1,
                    "file_deletions": 0,
                    "file_exists": true,
                    "file_name": "libs/core/src/main/java/org/elasticsearch/common/unit/TimeValue.java",
                    "file_size": 14403
                },
                {
                    "file_additions": 15,
                    "file_deletions": 11,
                    "file_exists": true,
                    "file_name": "x-pack/plugin/ccr/src/internalClusterTest/java/org/elasticsearch/xpack/ccr/CcrRepositoryIT.java",
                    "file_size": 40016
                },
                {
                    "file_additions": 6,
                    "file_deletions": 5,
                    "file_exists": true,
                    "file_name": "x-pack/plugin/ccr/src/internalClusterTest/java/org/elasticsearch/xpack/ccr/CcrRetentionLeaseIT.java",
                    "file_size": 66296
                },
                {
                    "file_additions": 2,
                    "file_deletions": 2,
                    "file_exists": true,
                    "file_name": "x-pack/plugin/ccr/src/internalClusterTest/java/org/elasticsearch/xpack/ccr/CloseFollowerIndexIT.java",
                    "file_size": 6615
                },
                {
                    "file_additions": 5,
                    "file_deletions": 1,
                    "file_exists": true,
                    "file_name": "x-pack/plugin/ccr/src/internalClusterTest/java/org/elasticsearch/xpack/ccr/FollowerFailOverIT.java",
                    "file_size": 16998
                },
                {
                    "file_additions": 25,
                    "file_deletions": 20,
                    "file_exists": true,
                    "file_name": "x-pack/plugin/ccr/src/internalClusterTest/java/org/elasticsearch/xpack/ccr/IndexFollowingIT.java",
                    "file_size": 90114
                },
                {
                    "file_additions": 1,
                    "file_deletions": 0,
                    "file_exists": true,
                    "file_name": "x-pack/plugin/ccr/src/internalClusterTest/java/org/elasticsearch/xpack/ccr/PrimaryFollowerAllocationIT.java",
                    "file_size": 8552
                },
                {
                    "file_additions": 3,
                    "file_deletions": 2,
                    "file_exists": true,
                    "file_name": "x-pack/plugin/ccr/src/internalClusterTest/java/org/elasticsearch/xpack/ccr/RestartIndexFollowingIT.java",
                    "file_size": 5484
                },
                {
                    "file_additions": 1,
                    "file_deletions": 0,
                    "file_exists": true,
                    "file_name": "x-pack/plugin/ccr/src/main/java/org/elasticsearch/xpack/ccr/action/CcrRequests.java",
                    "file_size": 7152
                },
                {
                    "file_additions": 8,
                    "file_deletions": 6,
                    "file_exists": true,
                    "file_name": "x-pack/plugin/ccr/src/main/java/org/elasticsearch/xpack/ccr/action/ShardFollowTasksExecutor.java",
                    "file_size": 37662
                },
                {
                    "file_additions": 1,
                    "file_deletions": 2,
                    "file_exists": true,
                    "file_name": "x-pack/plugin/ccr/src/main/java/org/elasticsearch/xpack/ccr/repository/CcrRepository.java",
                    "file_size": 35442
                },
                {
                    "file_additions": 47,
                    "file_deletions": 1,
                    "file_exists": true,
                    "file_name": "x-pack/plugin/ccr/src/test/java/org/elasticsearch/xpack/CcrIntegTestCase.java",
                    "file_size": 43264
                }
            ],
            "interesting": {
                "reopened": false,
                "status": false
            },
            "sha": "6ece629ec36a9a253d4d70d8d4e7576911c3a160"
        },
        {
            "diff": "elastic_elasticsearch/issue_56891/commit_c4ff6081ff9d1410d8f55b24604d9e836b4e4a93.diff",
            "diff_additions": 117,
            "diff_deletions": 50,
            "diff_file_size": 371998,
            "files": [
                {
                    "file_additions": 1,
                    "file_deletions": 0,
                    "file_exists": true,
                    "file_name": "libs/core/src/main/java/org/elasticsearch/common/unit/TimeValue.java",
                    "file_size": 14403
                },
                {
                    "file_additions": 15,
                    "file_deletions": 11,
                    "file_exists": true,
                    "file_name": "x-pack/plugin/ccr/src/internalClusterTest/java/org/elasticsearch/xpack/ccr/CcrRepositoryIT.java",
                    "file_size": 40016
                },
                {
                    "file_additions": 6,
                    "file_deletions": 5,
                    "file_exists": true,
                    "file_name": "x-pack/plugin/ccr/src/internalClusterTest/java/org/elasticsearch/xpack/ccr/CcrRetentionLeaseIT.java",
                    "file_size": 66296
                },
                {
                    "file_additions": 2,
                    "file_deletions": 2,
                    "file_exists": true,
                    "file_name": "x-pack/plugin/ccr/src/internalClusterTest/java/org/elasticsearch/xpack/ccr/CloseFollowerIndexIT.java",
                    "file_size": 6615
                },
                {
                    "file_additions": 5,
                    "file_deletions": 1,
                    "file_exists": true,
                    "file_name": "x-pack/plugin/ccr/src/internalClusterTest/java/org/elasticsearch/xpack/ccr/FollowerFailOverIT.java",
                    "file_size": 16998
                },
                {
                    "file_additions": 25,
                    "file_deletions": 20,
                    "file_exists": true,
                    "file_name": "x-pack/plugin/ccr/src/internalClusterTest/java/org/elasticsearch/xpack/ccr/IndexFollowingIT.java",
                    "file_size": 90114
                },
                {
                    "file_additions": 3,
                    "file_deletions": 0,
                    "file_exists": true,
                    "file_name": "x-pack/plugin/ccr/src/internalClusterTest/java/org/elasticsearch/xpack/ccr/PrimaryFollowerAllocationIT.java",
                    "file_size": 8552
                },
                {
                    "file_additions": 3,
                    "file_deletions": 2,
                    "file_exists": true,
                    "file_name": "x-pack/plugin/ccr/src/internalClusterTest/java/org/elasticsearch/xpack/ccr/RestartIndexFollowingIT.java",
                    "file_size": 5484
                },
                {
                    "file_additions": 1,
                    "file_deletions": 0,
                    "file_exists": true,
                    "file_name": "x-pack/plugin/ccr/src/main/java/org/elasticsearch/xpack/ccr/action/CcrRequests.java",
                    "file_size": 7152
                },
                {
                    "file_additions": 8,
                    "file_deletions": 6,
                    "file_exists": true,
                    "file_name": "x-pack/plugin/ccr/src/main/java/org/elasticsearch/xpack/ccr/action/ShardFollowTasksExecutor.java",
                    "file_size": 37662
                },
                {
                    "file_additions": 1,
                    "file_deletions": 2,
                    "file_exists": true,
                    "file_name": "x-pack/plugin/ccr/src/main/java/org/elasticsearch/xpack/ccr/repository/CcrRepository.java",
                    "file_size": 35442
                },
                {
                    "file_additions": 47,
                    "file_deletions": 1,
                    "file_exists": true,
                    "file_name": "x-pack/plugin/ccr/src/test/java/org/elasticsearch/xpack/CcrIntegTestCase.java",
                    "file_size": 43264
                }
            ],
            "interesting": {
                "reopened": true,
                "status": false
            },
            "sha": "c4ff6081ff9d1410d8f55b24604d9e836b4e4a93"
        },
        {
            "diff": "elastic_elasticsearch/issue_56891/commit_64734ee225ce026ecb7d4d36c4f85165c481438f.diff",
            "diff_additions": 5,
            "diff_deletions": 0,
            "diff_file_size": 143358,
            "files": [
                {
                    "file_additions": 1,
                    "file_deletions": 0,
                    "file_exists": true,
                    "file_name": "x-pack/plugin/ccr/src/main/java/org/elasticsearch/xpack/ccr/action/AutoFollowCoordinator.java",
                    "file_size": 42681
                },
                {
                    "file_additions": 4,
                    "file_deletions": 0,
                    "file_exists": true,
                    "file_name": "x-pack/plugin/ccr/src/test/java/org/elasticsearch/xpack/ccr/action/AutoFollowCoordinatorTests.java",
                    "file_size": 100677
                }
            ],
            "interesting": {
                "reopened": false,
                "status": false
            },
            "sha": "64734ee225ce026ecb7d4d36c4f85165c481438f"
        },
        {
            "diff": "elastic_elasticsearch/issue_56891/commit_e37ce561c7ea098a6f0711f4d2c093f05431043b.diff",
            "diff_additions": 5,
            "diff_deletions": 0,
            "diff_file_size": 143358,
            "files": [
                {
                    "file_additions": 1,
                    "file_deletions": 0,
                    "file_exists": true,
                    "file_name": "x-pack/plugin/ccr/src/main/java/org/elasticsearch/xpack/ccr/action/AutoFollowCoordinator.java",
                    "file_size": 42681
                },
                {
                    "file_additions": 4,
                    "file_deletions": 0,
                    "file_exists": true,
                    "file_name": "x-pack/plugin/ccr/src/test/java/org/elasticsearch/xpack/ccr/action/AutoFollowCoordinatorTests.java",
                    "file_size": 100677
                }
            ],
            "interesting": {
                "reopened": false,
                "status": false
            },
            "sha": "e37ce561c7ea098a6f0711f4d2c093f05431043b"
        },
        {
            "diff": "elastic_elasticsearch/issue_56891/commit_c38f2699f00107e816a7feb55aa567ad20567031.diff",
            "diff_additions": 4,
            "diff_deletions": 0,
            "diff_file_size": 143358,
            "files": [
                {
                    "file_additions": 1,
                    "file_deletions": 0,
                    "file_exists": true,
                    "file_name": "x-pack/plugin/ccr/src/main/java/org/elasticsearch/xpack/ccr/action/AutoFollowCoordinator.java",
                    "file_size": 42681
                },
                {
                    "file_additions": 3,
                    "file_deletions": 0,
                    "file_exists": true,
                    "file_name": "x-pack/plugin/ccr/src/test/java/org/elasticsearch/xpack/ccr/action/AutoFollowCoordinatorTests.java",
                    "file_size": 100677
                }
            ],
            "interesting": {
                "reopened": false,
                "status": false
            },
            "sha": "c38f2699f00107e816a7feb55aa567ad20567031"
        }
    ],
    "first_commit": "2020-05-18 14:03:41",
    "last_commit": "2020-09-01 13:59:51",
    "number": 56891,
    "score": 208.00471698113208
}