{
    "commits": [
        {
            "associated_pull_request": [
                "https://github.com/espruino/Espruino/pull/1087"
            ],
            "date": "2017-02-03 18:49:22+00:00",
            "diff": "espruino_espruino/issue_1051/commit_cbd26fea2d649cfa73b25d50a882225ab90c5eab.diff",
            "diff_additions": 379,
            "diff_deletions": 95,
            "diff_file_size": 84319,
            "diff_url": "https://github.com/espruino/Espruino/commit/cbd26fea2d649cfa73b25d50a882225ab90c5eab.diff",
            "exists": true,
            "files": [
                {
                    "file_additions": 378,
                    "file_deletions": 94,
                    "file_exists": true,
                    "file_name": "targets/stm32_ll/jshardware.c",
                    "file_size": 73304
                },
                {
                    "file_additions": 1,
                    "file_deletions": 1,
                    "file_exists": true,
                    "file_name": "targets/stm32_ll/stm32_it.c",
                    "file_size": 11015
                }
            ],
            "interesting": {
                "reopen": false,
                "status": false
            },
            "is_parent": true,
            "sha": "cbd26fea2d649cfa73b25d50a882225ab90c5eab"
        },
        {
            "associated_pull_request": [
                "https://github.com/espruino/Espruino/pull/1087"
            ],
            "date": "2017-02-06 10:26:57+00:00",
            "diff": "espruino_espruino/issue_1051/commit_6a2eb0d90f1695a254037ec8126caa4c13235738.diff",
            "diff_additions": 2,
            "diff_deletions": 1,
            "diff_file_size": 151495,
            "diff_url": "https://github.com/espruino/Espruino/commit/6a2eb0d90f1695a254037ec8126caa4c13235738.diff",
            "exists": true,
            "files": [
                {
                    "file_additions": 2,
                    "file_deletions": 1,
                    "file_exists": true,
                    "file_name": "libs/bluetooth/jswrap_bluetooth.c",
                    "file_size": 151495
                }
            ],
            "interesting": {
                "reopen": true,
                "status": false
            },
            "is_parent": false,
            "sha": "6a2eb0d90f1695a254037ec8126caa4c13235738"
        },
        {
            "associated_pull_request": [
                "https://github.com/espruino/Espruino/pull/1052"
            ],
            "date": "2017-02-06 14:49:46+00:00",
            "diff": "espruino_espruino/issue_1051/commit_ce1f11934b4afc39f2a428bdbe0ac865e6a40f2f.diff",
            "diff_additions": 1,
            "diff_deletions": 2,
            "diff_file_size": 151495,
            "diff_url": "https://github.com/espruino/Espruino/commit/ce1f11934b4afc39f2a428bdbe0ac865e6a40f2f.diff",
            "exists": true,
            "files": [
                {
                    "file_additions": 1,
                    "file_deletions": 2,
                    "file_exists": true,
                    "file_name": "libs/bluetooth/jswrap_bluetooth.c",
                    "file_size": 151495
                }
            ],
            "interesting": {
                "reopen": false,
                "status": false
            },
            "is_parent": false,
            "sha": "ce1f11934b4afc39f2a428bdbe0ac865e6a40f2f"
        },
        {
            "associated_pull_request": [],
            "date": "2017-02-06 14:49:46+00:00",
            "diff": "espruino_espruino/issue_1051/commit_24a2e1745e07af412e2ed02e3fe9203332d3a214.diff",
            "diff_additions": 1,
            "diff_deletions": 2,
            "diff_file_size": 151495,
            "diff_url": "https://github.com/espruino/Espruino/commit/24a2e1745e07af412e2ed02e3fe9203332d3a214.diff",
            "exists": true,
            "files": [
                {
                    "file_additions": 1,
                    "file_deletions": 2,
                    "file_exists": true,
                    "file_name": "libs/bluetooth/jswrap_bluetooth.c",
                    "file_size": 151495
                }
            ],
            "interesting": {
                "reopen": false,
                "status": false
            },
            "is_parent": false,
            "sha": "24a2e1745e07af412e2ed02e3fe9203332d3a214"
        },
        {
            "associated_pull_request": [
                "https://github.com/espruino/Espruino/pull/1071"
            ],
            "date": "2017-02-06 10:26:57+00:00",
            "diff": "espruino_espruino/issue_1051/commit_4cdce1ff709eb3fb6118be3dd2350a3f4281e9e0.diff",
            "diff_additions": 2,
            "diff_deletions": 1,
            "diff_file_size": 151495,
            "diff_url": "https://github.com/espruino/Espruino/commit/4cdce1ff709eb3fb6118be3dd2350a3f4281e9e0.diff",
            "exists": true,
            "files": [
                {
                    "file_additions": 2,
                    "file_deletions": 1,
                    "file_exists": true,
                    "file_name": "libs/bluetooth/jswrap_bluetooth.c",
                    "file_size": 151495
                }
            ],
            "interesting": {
                "reopen": false,
                "status": false
            },
            "is_parent": false,
            "sha": "4cdce1ff709eb3fb6118be3dd2350a3f4281e9e0"
        },
        {
            "associated_pull_request": [
                "https://github.com/espruino/Espruino/pull/1071"
            ],
            "date": "2017-02-06 14:49:46+00:00",
            "diff": "espruino_espruino/issue_1051/commit_24bfefe4f7dfa2cb56c06d514df073db21f9102a.diff",
            "diff_additions": 1,
            "diff_deletions": 2,
            "diff_file_size": 151495,
            "diff_url": "https://github.com/espruino/Espruino/commit/24bfefe4f7dfa2cb56c06d514df073db21f9102a.diff",
            "exists": true,
            "files": [
                {
                    "file_additions": 1,
                    "file_deletions": 2,
                    "file_exists": true,
                    "file_name": "libs/bluetooth/jswrap_bluetooth.c",
                    "file_size": 151495
                }
            ],
            "interesting": {
                "reopen": false,
                "status": false
            },
            "is_parent": false,
            "sha": "24bfefe4f7dfa2cb56c06d514df073db21f9102a"
        }
    ],
    "first_commit": "2017-02-03 18:49:22+00:00",
    "last_commit": "2017-02-16 04:33:04+00:00",
    "number": 1051,
    "pull_request": "None",
    "score": {
        "accidental_reopen_likely": false,
        "all_labels": [],
        "contains_keywords": [
            "work",
            "chang",
            "fix",
            "issu",
            "test",
            "attempt",
            "crash"
        ],
        "fix_size": 7,
        "has_labels": [],
        "intersecting": {
            "computed_score": 1.0,
            "final_commit_size": 3,
            "intersection_size": 3,
            "previous_commits_size": 7
        },
        "is_makefile_based": true,
        "no_new_files": [],
        "no_other_files": false,
        "num_prohibited_files": 240554,
        "prohibited_files": [
            "server/src/main/java/com/genymobile/scrcpy/Device.java",
            "server/src/main/java/com/genymobile/scrcpy/wrappers/SurfaceControl.java",
            "server/src/main/java/com/genymobile/scrcpy/Device.java",
            "server/src/main/java/com/genymobile/scrcpy/wrappers/SurfaceControl.java",
            "app/meson.build",
            "app/scrcpy.1",
            "app/src/common.h",
            "app/src/scrcpy.h",
            "app/src/server.h",
            "server/src/main/java/com/genymobile/scrcpy/Workarounds.java"
        ],
        "reopen": true,
        "reopen_events": [
            [
                "2017-02-06 10:29:45+00:00",
                "closed"
            ],
            [
                "2017-02-06 10:29:45+00:00",
                "commit"
            ],
            [
                "2017-02-06 10:29:49+00:00",
                "reopened"
            ],
            [
                "2017-02-06 14:54:58+00:00",
                "commit"
            ],
            [
                "2017-02-06 15:04:36+00:00",
                "closed"
            ],
            [
                "2017-02-06 15:07:19+00:00",
                "commit"
            ],
            [
                "2017-02-16 06:49:22+00:00",
                "commit"
            ],
            [
                "2017-02-16 06:49:22+00:00",
                "commit"
            ]
        ],
        "status": false,
        "strategy": true,
        "total_changes": 489
    }
}