{
    "covered_issues": [
        6399,
        6394,
        6375,
        6373,
        6367,
        6364,
        6344,
        6342,
        6337,
        6336,
        6334,
        6327,
        6314,
        6299,
        6294,
        6291,
        6289,
        6288,
        6286,
        6280,
        6262,
        6259,
        6258,
        6249,
        6245,
        6240,
        6213,
        6196,
        6190,
        6187,
        6164,
        6143,
        6136,
        6131,
        6120,
        6112,
        6109,
        6104,
        6083,
        6060,
        6047,
        6046,
        6026,
        6024,
        6007,
        6006,
        6003,
        5998,
        5986,
        5984,
        5982,
        5981,
        5980,
        5979,
        5975,
        5972,
        5957,
        5955,
        5954,
        5951,
        5950,
        5946,
        5927,
        5912,
        5909,
        5906,
        5897,
        5890,
        5878,
        5874,
        5873,
        5869,
        5858,
        5852,
        5848,
        5845,
        5844,
        5843,
        5841,
        5833,
        5824,
        5806,
        5800,
        5798,
        5786,
        5784,
        5781,
        5774,
        5762,
        5752,
        5744,
        5733,
        5724,
        5722,
        5716,
        5709,
        5705,
        5703,
        5701,
        5688,
        5683,
        5661,
        5659,
        5656,
        5651,
        5645,
        5644,
        5636,
        5629,
        5621,
        5620,
        5618,
        5615,
        5570,
        5566,
        5554,
        5537,
        5534,
        5529,
        5527,
        5524,
        5520,
        5517,
        5498,
        5495,
        5494,
        5490,
        5486,
        5483,
        5475,
        5474,
        5469,
        5463,
        5459,
        5458,
        5456,
        5455,
        5452,
        5448,
        5447,
        5442,
        5440,
        5434,
        5432,
        5431,
        5421,
        5411,
        5398,
        5395,
        5391,
        5390,
        5389,
        5388,
        5384,
        5382,
        5376,
        5369,
        5366,
        5356,
        5352,
        5348,
        5345,
        5340,
        5336,
        5329,
        5328,
        5320,
        5314,
        5304,
        5302,
        5299,
        5297,
        5284,
        5269,
        5266,
        5256,
        5250,
        5247,
        5246,
        5245,
        5241,
        5233,
        5207,
        5199,
        5198,
        5195,
        5192,
        5190,
        5177,
        5145,
        5144,
        5141,
        5133,
        5131,
        5130,
        5129,
        5127,
        5118,
        5101,
        5089,
        5085,
        5080,
        5076,
        5070,
        5067,
        5064,
        5054,
        5052,
        5039,
        5033,
        5026,
        5025,
        5023,
        5021,
        5018,
        5017,
        4998,
        4996,
        4984,
        4982,
        4965,
        4964,
        4963,
        4958,
        4954,
        4953,
        4943,
        4940,
        4939,
        4933,
        4928,
        4926,
        4924,
        4923,
        4922,
        4911,
        4905,
        4899,
        4897,
        4896,
        4893,
        4892,
        4890,
        4884,
        4881,
        4878,
        4872,
        4866,
        4865,
        4861,
        4857,
        4845,
        4807,
        4791,
        4790,
        4786,
        4780,
        4777,
        4774,
        4769,
        4755,
        4749,
        4741,
        4740,
        4736,
        4734,
        4731,
        4718,
        4717,
        4716,
        4712,
        4711,
        4704,
        4700,
        4687,
        4681,
        4680,
        4679,
        4671,
        4670,
        4668,
        4666,
        4665,
        4658,
        4654,
        4652,
        4650,
        4640,
        4627,
        4610,
        4609,
        4607,
        4601,
        4597,
        4594,
        4588,
        4587,
        4585,
        4581,
        4575,
        4572,
        4571,
        4567,
        4565,
        4564,
        4560,
        4556,
        4555,
        4550,
        4549,
        4542,
        4541,
        4540,
        4539,
        4537,
        4536,
        4535,
        4534,
        4532,
        4527,
        4522,
        4520,
        4518,
        4516,
        4511,
        4508,
        4504,
        4497,
        4496,
        4495,
        4493,
        4487,
        4475,
        4472,
        4468,
        4465,
        4462,
        4461,
        4460,
        4459,
        4458,
        4457,
        4451,
        4450,
        4446,
        4438,
        4434,
        4433,
        4426,
        4425,
        4424,
        4423,
        4418,
        4408,
        4407,
        4403,
        4387,
        4385,
        4384,
        4381,
        4379,
        4378,
        4377,
        4370,
        4366,
        4363,
        4352,
        4347,
        4344,
        4343,
        4336,
        4335,
        4334,
        4329,
        4328,
        4326,
        4316,
        4312,
        4304,
        4301,
        4299,
        4291,
        4290,
        4289,
        4287,
        4283,
        4280,
        4278,
        4275,
        4274,
        4273,
        4272,
        4271,
        4266,
        4256,
        4251,
        4250,
        4237,
        4226,
        4223,
        4218,
        4203,
        4201,
        4200,
        4197,
        4194,
        4189,
        4187,
        4180,
        4179,
        4177,
        4170,
        4169,
        4168,
        4160,
        4156,
        4155,
        4153,
        4152,
        4151,
        4147,
        4146,
        4144,
        4139,
        4137,
        4136,
        4134,
        4131,
        4130,
        4128,
        4126,
        4124,
        4123,
        4120,
        4117,
        4115,
        4114,
        4113,
        4108,
        4097,
        4091,
        4087,
        4086,
        4083,
        4075,
        4074,
        4071,
        4070,
        4068,
        4066,
        4062,
        4060,
        4059,
        4057,
        4056,
        4053,
        4052,
        4050,
        4049,
        4038,
        4036,
        4031,
        4030,
        4029,
        4024,
        4019,
        4017,
        4011,
        4003,
        4002,
        4000,
        3992,
        3989,
        3982,
        3978,
        3974,
        3973,
        3972,
        3971,
        3968,
        3967,
        3966,
        3962,
        3959,
        3956,
        3951,
        3950,
        3949,
        3940,
        3939,
        3930,
        3929,
        3926,
        3923,
        3918,
        3917,
        3913,
        3911,
        3910,
        3906,
        3904,
        3900,
        3898,
        3896,
        3895,
        3886,
        3878,
        3876,
        3874,
        3872,
        3867,
        3856,
        3855,
        3848,
        3847,
        3846,
        3839,
        3837,
        3835,
        3828,
        3825,
        3824,
        3823,
        3821,
        3812,
        3810,
        3807,
        3806,
        3805,
        3803,
        3799,
        3794,
        3792,
        3790,
        3789,
        3788,
        3784,
        3780,
        3779,
        3776,
        3770,
        3768,
        3764,
        3761,
        3759,
        3758,
        3756,
        3753,
        3749,
        3739,
        3722,
        3719,
        3717,
        3715,
        3712,
        3711,
        3705,
        3693,
        3692,
        3681,
        3679,
        3674,
        3662,
        3661,
        3653,
        3645,
        3642,
        3635,
        3633,
        3624,
        3618,
        3615,
        3613,
        3610,
        3605,
        3598,
        3597,
        3592,
        3589,
        3582,
        3581,
        3579,
        3569,
        3567,
        3566,
        3563,
        3562,
        3561,
        3559,
        3555,
        3551,
        3549,
        3535,
        3526,
        3525,
        3517,
        3515,
        3511,
        3507,
        3498,
        3496,
        3486,
        3485,
        3483,
        3479,
        3478,
        3474,
        3468,
        3466,
        3456,
        3450,
        3446,
        3444,
        3442,
        3437,
        3433,
        3425,
        3418,
        3407,
        3401,
        3399,
        3397,
        3381,
        3380,
        3372,
        3369,
        3367,
        3356,
        3351,
        3344,
        3340,
        3336,
        3335,
        3333,
        3327,
        3324,
        3317,
        3316,
        3315,
        3314,
        3310,
        3305,
        3303,
        3302,
        3296,
        3283,
        3281,
        3274,
        3272,
        3271,
        3268,
        3252,
        3248,
        3245,
        3235,
        3230,
        3227,
        3218,
        3212,
        3203,
        3201,
        3198,
        3197,
        3195,
        3194,
        3192,
        3182,
        3178,
        3177,
        3171,
        3170,
        3169,
        3167,
        3165,
        3160,
        3159,
        3158,
        3152,
        3137,
        3136,
        3133,
        3131,
        3129,
        3123,
        3122,
        3119,
        3116,
        3113,
        3112,
        3110,
        3106,
        3100,
        3098,
        3095,
        3092,
        3090,
        3080,
        3074,
        3069,
        3066,
        3059,
        3054,
        3049,
        3048,
        3046,
        3039,
        3037,
        3031,
        3026,
        3023,
        3015,
        3005,
        3002,
        2995,
        2993,
        2991,
        2990,
        2989,
        2987,
        2985,
        2984,
        2976,
        2971,
        2968,
        2964,
        2960,
        2956,
        2953,
        2950,
        2947,
        2946,
        2945,
        2941,
        2939,
        2936,
        2934,
        2925,
        2924,
        2921,
        2918,
        2913,
        2912,
        2910,
        2909,
        2907,
        2905,
        2903,
        2902,
        2901,
        2899,
        2892,
        2891,
        2876,
        2871,
        2869,
        2868,
        2861,
        2860,
        2857,
        2852,
        2847,
        2845,
        2843,
        2841,
        2829,
        2820,
        2814,
        2812,
        2806,
        2805,
        2800,
        2799,
        2793,
        2779,
        2776,
        2768,
        2764,
        2761,
        2759,
        2756,
        2755,
        2753,
        2751,
        2737,
        2733,
        2728,
        2725,
        2720,
        2708,
        2698,
        2692,
        2688,
        2683,
        2682,
        2681,
        2679,
        2676,
        2674,
        2673,
        2667,
        2666,
        2663,
        2661,
        2659,
        2658,
        2649,
        2645,
        2641,
        2638,
        2634,
        2632,
        2629,
        2625,
        2624,
        2621,
        2617,
        2616,
        2615,
        2614,
        2613,
        2612,
        2607,
        2606,
        2603,
        2601,
        2600,
        2597,
        2592,
        2584,
        2580,
        2575,
        2574,
        2573,
        2571,
        2566,
        2561,
        2558,
        2557,
        2553,
        2548,
        2544,
        2540,
        2538,
        2534,
        2533,
        2532,
        2524,
        2520,
        2511,
        2509,
        2508,
        2494,
        2488,
        2487,
        2486,
        2483,
        2479,
        2478,
        2475,
        2473,
        2469,
        2468,
        2465,
        2463,
        2453,
        2449,
        2448,
        2439,
        2438,
        2437,
        2433,
        2431,
        2405,
        2400,
        2399,
        2398,
        2397,
        2393,
        2392,
        2387,
        2381,
        2372,
        2371,
        2369,
        2364,
        2360,
        2356,
        2351,
        2350,
        2337,
        2335,
        2328,
        2324,
        2322,
        2318,
        2312,
        2300,
        2299,
        2291,
        2290,
        2285,
        2281,
        2277,
        2275,
        2274,
        2272,
        2270,
        2263,
        2262,
        2255,
        2243,
        2237,
        2232,
        2225,
        2224,
        2213,
        2207,
        2192,
        2188,
        2175,
        2173,
        2172,
        2166,
        2163,
        2162,
        2161,
        2158,
        2155,
        2153,
        2147,
        2146,
        2145,
        2144,
        2142,
        2141,
        2140,
        2139,
        2138,
        2136,
        2135,
        2131,
        2129,
        2127,
        2126,
        2124,
        2122,
        2121,
        2120,
        2119,
        2118,
        2117,
        2116,
        2113,
        2107,
        2106,
        2105,
        2101,
        2098,
        2097,
        2096,
        2092,
        2089,
        2087,
        2085,
        2084,
        2083,
        2082,
        2079,
        2077,
        2075,
        2074,
        2070,
        2069,
        2068,
        2066,
        2064,
        2063,
        2061,
        2060,
        2059,
        2058,
        2056,
        2054,
        2051,
        2050,
        2049,
        2048,
        2047,
        2045,
        2043,
        2042,
        2041,
        2039,
        2037,
        2036,
        2035,
        2034,
        2032,
        2031,
        2029,
        2028,
        2026,
        2025,
        2023,
        2021,
        2020,
        2019,
        2018,
        2017,
        2016,
        2013,
        2011,
        2007,
        2006,
        2002,
        1999,
        1998,
        1993,
        1992,
        1991,
        1990,
        1989,
        1988,
        1987,
        1986,
        1985,
        1984,
        1982,
        1981,
        1980,
        1978,
        1977,
        1976,
        1975,
        1971,
        1967,
        1966,
        1962,
        1961,
        1960,
        1959,
        1957,
        1955,
        1954,
        1952,
        1951,
        1950,
        1949,
        1945,
        1944,
        1943,
        1942,
        1941,
        1939,
        1937,
        1933,
        1932,
        1931,
        1929,
        1925,
        1924,
        1923,
        1921,
        1920,
        1919,
        1918,
        1915,
        1914,
        1912,
        1909,
        1908,
        1907,
        1906,
        1905,
        1904,
        1903,
        1902,
        1901,
        1900,
        1899,
        1897,
        1895,
        1888,
        1887,
        1885,
        1882,
        1880,
        1879,
        1878,
        1877,
        1876,
        1875,
        1873,
        1872,
        1870,
        1869,
        1868,
        1867,
        1865,
        1863,
        1862,
        1861,
        1860,
        1858,
        1856,
        1853,
        1851,
        1850,
        1849,
        1848,
        1847,
        1846,
        1845,
        1844,
        1843,
        1841,
        1839,
        1838,
        1837,
        1836,
        1835,
        1832,
        1831,
        1830,
        1829,
        1828,
        1825,
        1823,
        1822,
        1821,
        1820,
        1818,
        1816,
        1812,
        1811,
        1810,
        1809,
        1808,
        1805,
        1804,
        1800,
        1797,
        1796,
        1795,
        1794,
        1792,
        1789,
        1788,
        1787,
        1786,
        1785,
        1784,
        1782,
        1781,
        1780,
        1777,
        1775,
        1774,
        1772,
        1769,
        1768,
        1767,
        1765,
        1764,
        1760,
        1755,
        1754,
        1753,
        1752,
        1751,
        1750,
        1748,
        1747,
        1744,
        1742,
        1741,
        1740,
        1739,
        1736,
        1735,
        1733,
        1729,
        1726,
        1723,
        1722,
        1721,
        1720,
        1719,
        1718,
        1715,
        1714,
        1713,
        1711,
        1709,
        1708,
        1706,
        1705,
        1703,
        1702,
        1701,
        1697,
        1696,
        1693,
        1692,
        1690,
        1686,
        1685,
        1681,
        1678,
        1676,
        1675,
        1671,
        1667,
        1665,
        1664,
        1663,
        1661,
        1660,
        1659,
        1657,
        1656,
        1655,
        1653,
        1652,
        1650,
        1649,
        1648,
        1645,
        1643,
        1642,
        1641,
        1639,
        1638,
        1634,
        1621,
        1618,
        1617,
        1616,
        1614,
        1613,
        1610,
        1609,
        1608,
        1607,
        1606,
        1605,
        1604,
        1602,
        1600,
        1599,
        1598,
        1597,
        1596,
        1592,
        1591,
        1590,
        1589,
        1588,
        1587,
        1586,
        1584,
        1583,
        1580,
        1577,
        1576,
        1574,
        1567,
        1566,
        1564,
        1562,
        1561,
        1559,
        1557,
        1551,
        1550,
        1547,
        1542,
        1541,
        1540,
        1539,
        1537,
        1536,
        1534,
        1533,
        1531,
        1530,
        1529,
        1528,
        1527,
        1526,
        1525,
        1523,
        1521,
        1519,
        1518,
        1516,
        1515,
        1513,
        1512,
        1510,
        1509,
        1506,
        1505,
        1504,
        1502,
        1501,
        1500,
        1499,
        1498,
        1497,
        1496,
        1493,
        1491,
        1489,
        1487,
        1485,
        1484,
        1482,
        1480,
        1479,
        1478,
        1477,
        1474,
        1473,
        1470,
        1467,
        1466,
        1465,
        1464,
        1462,
        1459,
        1457,
        1454,
        1451,
        1448,
        1447,
        1446,
        1444,
        1441,
        1439,
        1438,
        1437,
        1436,
        1433,
        1432,
        1431,
        1428,
        1427,
        1425,
        1424,
        1421,
        1420,
        1419,
        1418,
        1417,
        1416,
        1415,
        1414,
        1413,
        1412,
        1411,
        1407,
        1406,
        1402,
        1401,
        1398,
        1396,
        1395,
        1394,
        1392,
        1391,
        1385,
        1382,
        1381,
        1379,
        1378,
        1376,
        1375,
        1374,
        1373,
        1372,
        1371,
        1368,
        1367,
        1366,
        1365,
        1364,
        1363,
        1361,
        1359,
        1358,
        1356,
        1354,
        1351,
        1350,
        1349,
        1346,
        1343,
        1342,
        1341,
        1340,
        1339,
        1338,
        1337,
        1336,
        1335,
        1333,
        1332,
        1331,
        1328,
        1325,
        1321,
        1319,
        1318,
        1317,
        1309,
        1306,
        1304,
        1303,
        1297,
        1296,
        1295,
        1294,
        1293,
        1292,
        1284,
        1282,
        1280,
        1278,
        1276,
        1274,
        1273,
        1272,
        1271,
        1269,
        1265,
        1263,
        1262,
        1261,
        1259,
        1258,
        1257,
        1256,
        1253,
        1252,
        1249,
        1247,
        1245,
        1243,
        1241,
        1240,
        1238,
        1236,
        1235,
        1233,
        1232,
        1231,
        1230,
        1228,
        1227,
        1226,
        1223,
        1220,
        1219,
        1217,
        1216,
        1215,
        1214,
        1213,
        1212,
        1211,
        1210,
        1208,
        1207,
        1206,
        1205,
        1203,
        1202,
        1200,
        1199,
        1198,
        1197,
        1195,
        1194,
        1192,
        1191,
        1190,
        1187,
        1184,
        1182,
        1181,
        1180,
        1179,
        1178,
        1177,
        1175,
        1174,
        1172,
        1171,
        1170,
        1169,
        1167,
        1165,
        1164,
        1163,
        1161,
        1160,
        1159,
        1158,
        1157,
        1156,
        1155,
        1154,
        1151,
        1150,
        1146,
        1145,
        1143,
        1142,
        1141,
        1140,
        1138,
        1137,
        1136,
        1134,
        1132,
        1129,
        1128,
        1126,
        1125,
        1124,
        1123,
        1122,
        1121,
        1120,
        1119,
        1118,
        1116,
        1115,
        1113,
        1112,
        1111,
        1110,
        1109,
        1108,
        1107,
        1103,
        1102,
        1101,
        1100,
        1099,
        1098,
        1097,
        1096,
        1095,
        1094,
        1093,
        1092,
        1091,
        1090,
        1088,
        1086,
        1085,
        1084,
        1081,
        1080,
        1079,
        1075,
        1074,
        1073,
        1071,
        1070,
        1069,
        1067,
        1066,
        1062,
        1061,
        1060,
        1059,
        1056,
        1055,
        1054,
        1052,
        1049,
        1047,
        1044,
        1043,
        1041,
        1040,
        1039,
        1038,
        1037,
        1036,
        1035,
        1034,
        1033,
        1032,
        1031,
        1030,
        1028,
        1027,
        1026,
        1025,
        1024,
        1023,
        1022,
        1020,
        1019,
        1014,
        1013,
        1012,
        1011,
        1010,
        1008,
        1007,
        1006,
        1004,
        1001,
        999,
        997,
        996,
        995,
        994,
        993,
        992,
        991,
        990,
        989,
        988,
        987,
        985,
        984,
        983,
        982,
        981,
        977,
        974,
        970,
        969,
        968,
        967,
        961,
        960,
        959,
        958,
        957,
        955,
        954,
        953,
        950,
        949,
        948,
        947,
        946,
        945,
        942,
        941,
        939,
        938,
        936,
        935,
        934,
        933,
        932,
        930,
        928,
        926,
        924,
        923,
        922,
        921,
        920,
        919,
        917,
        911,
        909,
        908,
        907,
        906,
        904,
        902,
        901,
        898,
        897,
        896,
        895,
        894,
        893,
        892,
        891,
        889,
        888,
        887,
        884,
        882,
        881,
        880,
        879,
        878,
        877,
        876,
        875,
        872,
        871,
        870,
        869,
        867,
        866,
        864,
        863,
        861,
        859,
        858,
        857,
        856,
        855,
        851,
        850,
        849,
        848,
        847,
        846,
        845,
        844,
        843,
        842,
        841,
        839,
        838,
        837,
        836,
        835,
        834,
        833,
        831,
        830,
        827,
        820,
        819,
        818,
        817,
        816,
        813,
        811,
        810,
        806,
        805,
        803,
        801,
        800,
        799,
        798,
        797,
        796,
        795,
        794,
        793,
        792,
        791,
        789,
        788,
        786,
        785,
        784,
        782,
        780,
        779,
        778,
        777,
        776,
        774,
        773,
        771,
        766,
        765,
        763,
        762,
        761,
        760,
        759,
        757,
        756,
        754,
        753,
        750,
        749,
        748,
        747,
        746,
        745,
        743,
        742,
        741,
        740,
        739,
        738,
        737,
        736,
        735,
        734,
        732,
        731,
        728,
        727,
        726,
        725,
        723,
        722,
        720,
        719,
        718,
        716,
        715,
        714,
        712,
        711,
        710,
        709,
        708,
        707,
        706,
        705,
        703,
        702,
        700,
        699,
        696,
        695,
        694,
        692,
        691,
        690,
        689,
        688,
        687,
        686,
        684,
        683,
        682,
        680,
        679,
        678,
        677,
        676,
        675,
        674,
        673,
        671,
        670,
        669,
        668,
        667,
        666,
        665,
        664,
        662,
        658,
        657,
        656,
        655,
        651,
        650,
        648,
        647,
        646,
        645,
        644,
        643,
        642,
        637,
        634,
        633,
        632,
        630,
        629,
        628,
        626,
        624,
        623,
        622,
        621,
        620,
        619,
        618,
        617,
        613,
        612,
        610,
        609,
        608,
        605,
        603,
        602,
        599,
        598,
        595,
        592,
        591,
        590,
        589,
        588,
        587,
        585,
        584,
        581,
        579,
        577,
        576,
        575,
        573,
        572,
        570,
        567,
        566,
        565,
        563,
        562,
        561,
        560,
        558,
        557,
        555,
        554,
        553,
        552,
        551,
        550,
        549,
        548,
        547,
        545,
        543,
        542,
        541,
        540,
        537,
        536,
        535,
        534,
        533,
        528,
        527,
        526,
        525,
        524,
        523,
        522,
        521,
        520,
        519,
        518,
        517,
        516,
        515,
        514,
        509,
        508,
        507,
        505,
        503,
        502,
        501,
        500,
        499,
        496,
        495,
        494,
        493,
        491,
        489,
        488,
        487,
        486,
        485,
        484,
        482,
        479,
        478,
        477,
        476,
        473,
        472,
        471,
        470,
        469,
        467,
        466,
        465,
        464,
        463,
        462,
        460,
        458,
        457,
        456,
        455,
        454,
        453,
        448,
        445,
        442,
        440,
        439,
        437,
        436,
        435,
        434,
        433,
        430,
        428,
        426,
        425,
        424,
        423,
        421,
        420,
        419,
        418,
        416,
        411,
        410,
        408,
        407,
        406,
        405,
        403,
        402,
        401,
        398,
        396,
        395,
        394,
        393,
        392,
        391,
        390,
        389,
        388,
        386,
        383,
        382,
        380,
        379,
        378,
        376,
        375,
        374,
        372,
        371,
        369,
        368,
        366,
        364,
        363,
        361,
        360,
        359,
        358,
        357,
        353,
        352,
        350,
        349,
        347,
        346,
        345,
        343,
        342,
        340,
        338,
        337,
        336,
        335,
        334,
        333,
        332,
        330,
        326,
        325,
        324,
        322,
        321,
        320,
        319,
        318,
        317,
        316,
        314,
        313,
        312,
        311,
        310,
        309,
        308,
        306,
        305,
        304,
        303,
        302,
        300,
        299,
        298,
        296,
        295,
        294,
        292,
        291,
        290,
        289,
        288,
        286,
        285,
        284,
        283,
        281,
        280,
        279,
        278,
        277,
        276,
        275,
        274,
        273,
        271,
        269,
        268,
        265,
        264,
        263,
        262,
        259,
        258,
        257,
        256,
        254,
        252,
        251,
        250,
        248,
        246,
        245,
        244,
        243,
        241,
        238,
        237,
        236,
        232,
        231,
        230,
        229,
        228,
        227,
        226,
        225,
        224,
        223,
        222,
        221,
        220,
        219,
        218,
        217,
        216,
        215,
        214,
        213,
        212,
        211,
        210,
        207,
        206,
        205,
        204,
        203,
        202,
        201,
        200,
        197,
        196,
        195,
        193,
        190,
        189,
        186,
        185,
        184,
        182,
        181,
        180,
        179,
        178,
        177,
        176,
        175,
        173,
        172,
        171,
        169,
        168,
        167,
        166,
        165,
        164,
        163,
        162,
        160,
        159,
        158,
        157,
        155,
        154,
        153,
        152,
        151,
        149,
        147,
        146,
        145,
        144,
        142,
        139,
        138,
        137,
        134,
        133,
        132,
        130,
        128,
        127,
        126,
        123,
        122,
        119,
        117,
        116,
        115,
        114,
        113,
        112,
        110,
        109,
        108,
        106,
        105,
        104,
        103,
        102,
        101,
        100,
        99,
        97,
        96,
        94,
        93,
        91,
        90,
        89,
        88,
        87,
        86,
        85,
        83,
        82,
        81,
        80,
        79,
        78,
        75,
        73,
        71,
        69,
        67,
        66,
        64,
        63,
        62,
        61,
        52,
        51,
        47,
        46,
        44,
        42,
        41,
        39,
        35,
        34,
        30,
        28,
        27,
        25,
        23,
        20,
        19,
        18,
        17,
        15,
        14,
        13,
        12,
        11,
        8,
        7,
        6,
        5,
        4,
        2,
        1
    ],
    "finished": true
}