{
    "commits": [
        {
            "diff": "elastic_elasticsearch/issue_42053/commit_e9cd61f97c5b22c12266c6c1ea362781bd69e918.diff",
            "diff_additions": 38,
            "diff_deletions": 11,
            "diff_file_size": 19031,
            "files": [
                {
                    "file_additions": 2,
                    "file_deletions": 2,
                    "file_exists": true,
                    "file_name": "x-pack/plugin/core/src/main/java/org/elasticsearch/xpack/core/security/action/CreateApiKeyRequest.java",
                    "file_size": 5585
                },
                {
                    "file_additions": 1,
                    "file_deletions": 1,
                    "file_exists": true,
                    "file_name": "x-pack/plugin/core/src/main/java/org/elasticsearch/xpack/core/security/action/CreateApiKeyRequestBuilder.java",
                    "file_size": 3831
                },
                {
                    "file_additions": 18,
                    "file_deletions": 0,
                    "file_exists": true,
                    "file_name": "x-pack/plugin/core/src/test/java/org/elasticsearch/xpack/core/security/action/CreateApiKeyRequestBuilderTests.java",
                    "file_size": 4201
                },
                {
                    "file_additions": 17,
                    "file_deletions": 8,
                    "file_exists": true,
                    "file_name": "x-pack/plugin/core/src/test/java/org/elasticsearch/xpack/core/security/action/CreateApiKeyRequestTests.java",
                    "file_size": 5414
                }
            ],
            "interesting": {
                "reopened": false,
                "status": false
            },
            "sha": "e9cd61f97c5b22c12266c6c1ea362781bd69e918"
        },
        {
            "diff": "elastic_elasticsearch/issue_42053/commit_7009db4c81f6ef5eead99a6766de5cd577eddb4e.diff",
            "diff_additions": 38,
            "diff_deletions": 11,
            "diff_file_size": 19031,
            "files": [
                {
                    "file_additions": 2,
                    "file_deletions": 2,
                    "file_exists": true,
                    "file_name": "x-pack/plugin/core/src/main/java/org/elasticsearch/xpack/core/security/action/CreateApiKeyRequest.java",
                    "file_size": 5585
                },
                {
                    "file_additions": 1,
                    "file_deletions": 1,
                    "file_exists": true,
                    "file_name": "x-pack/plugin/core/src/main/java/org/elasticsearch/xpack/core/security/action/CreateApiKeyRequestBuilder.java",
                    "file_size": 3831
                },
                {
                    "file_additions": 18,
                    "file_deletions": 0,
                    "file_exists": true,
                    "file_name": "x-pack/plugin/core/src/test/java/org/elasticsearch/xpack/core/security/action/CreateApiKeyRequestBuilderTests.java",
                    "file_size": 4201
                },
                {
                    "file_additions": 17,
                    "file_deletions": 8,
                    "file_exists": true,
                    "file_name": "x-pack/plugin/core/src/test/java/org/elasticsearch/xpack/core/security/action/CreateApiKeyRequestTests.java",
                    "file_size": 5414
                }
            ],
            "interesting": {
                "reopened": false,
                "status": true
            },
            "sha": "7009db4c81f6ef5eead99a6766de5cd577eddb4e"
        },
        {
            "diff": "elastic_elasticsearch/issue_42053/commit_d96b5ec8ca5997fe37c5f16326ecc0ff8cf2a248.diff",
            "diff_additions": 41,
            "diff_deletions": 15,
            "diff_file_size": 19031,
            "files": [
                {
                    "file_additions": 6,
                    "file_deletions": 6,
                    "file_exists": true,
                    "file_name": "x-pack/plugin/core/src/main/java/org/elasticsearch/xpack/core/security/action/CreateApiKeyRequest.java",
                    "file_size": 5585
                },
                {
                    "file_additions": 1,
                    "file_deletions": 1,
                    "file_exists": true,
                    "file_name": "x-pack/plugin/core/src/main/java/org/elasticsearch/xpack/core/security/action/CreateApiKeyRequestBuilder.java",
                    "file_size": 3831
                },
                {
                    "file_additions": 18,
                    "file_deletions": 0,
                    "file_exists": true,
                    "file_name": "x-pack/plugin/core/src/test/java/org/elasticsearch/xpack/core/security/action/CreateApiKeyRequestBuilderTests.java",
                    "file_size": 4201
                },
                {
                    "file_additions": 16,
                    "file_deletions": 8,
                    "file_exists": true,
                    "file_name": "x-pack/plugin/core/src/test/java/org/elasticsearch/xpack/core/security/action/CreateApiKeyRequestTests.java",
                    "file_size": 5414
                }
            ],
            "interesting": {
                "reopened": false,
                "status": true
            },
            "sha": "d96b5ec8ca5997fe37c5f16326ecc0ff8cf2a248"
        },
        {
            "diff": "elastic_elasticsearch/issue_42053/commit_7f3fd5a95b7fa072478c0eba1da41fe3e9548a23.diff",
            "diff_additions": 41,
            "diff_deletions": 15,
            "diff_file_size": 19031,
            "files": [
                {
                    "file_additions": 6,
                    "file_deletions": 6,
                    "file_exists": true,
                    "file_name": "x-pack/plugin/core/src/main/java/org/elasticsearch/xpack/core/security/action/CreateApiKeyRequest.java",
                    "file_size": 5585
                },
                {
                    "file_additions": 1,
                    "file_deletions": 1,
                    "file_exists": true,
                    "file_name": "x-pack/plugin/core/src/main/java/org/elasticsearch/xpack/core/security/action/CreateApiKeyRequestBuilder.java",
                    "file_size": 3831
                },
                {
                    "file_additions": 18,
                    "file_deletions": 0,
                    "file_exists": true,
                    "file_name": "x-pack/plugin/core/src/test/java/org/elasticsearch/xpack/core/security/action/CreateApiKeyRequestBuilderTests.java",
                    "file_size": 4201
                },
                {
                    "file_additions": 16,
                    "file_deletions": 8,
                    "file_exists": true,
                    "file_name": "x-pack/plugin/core/src/test/java/org/elasticsearch/xpack/core/security/action/CreateApiKeyRequestTests.java",
                    "file_size": 5414
                }
            ],
            "interesting": {
                "reopened": false,
                "status": true
            },
            "sha": "7f3fd5a95b7fa072478c0eba1da41fe3e9548a23"
        },
        {
            "diff": "elastic_elasticsearch/issue_42053/commit_93e1370aac9daaee767d85892e89472b83bebb3f.diff",
            "diff_additions": 40,
            "diff_deletions": 14,
            "diff_file_size": 19031,
            "files": [
                {
                    "file_additions": 5,
                    "file_deletions": 5,
                    "file_exists": true,
                    "file_name": "x-pack/plugin/core/src/main/java/org/elasticsearch/xpack/core/security/action/CreateApiKeyRequest.java",
                    "file_size": 5585
                },
                {
                    "file_additions": 1,
                    "file_deletions": 1,
                    "file_exists": true,
                    "file_name": "x-pack/plugin/core/src/main/java/org/elasticsearch/xpack/core/security/action/CreateApiKeyRequestBuilder.java",
                    "file_size": 3831
                },
                {
                    "file_additions": 18,
                    "file_deletions": 0,
                    "file_exists": true,
                    "file_name": "x-pack/plugin/core/src/test/java/org/elasticsearch/xpack/core/security/action/CreateApiKeyRequestBuilderTests.java",
                    "file_size": 4201
                },
                {
                    "file_additions": 16,
                    "file_deletions": 8,
                    "file_exists": true,
                    "file_name": "x-pack/plugin/core/src/test/java/org/elasticsearch/xpack/core/security/action/CreateApiKeyRequestTests.java",
                    "file_size": 5414
                }
            ],
            "interesting": {
                "reopened": false,
                "status": true
            },
            "sha": "93e1370aac9daaee767d85892e89472b83bebb3f"
        },
        {
            "diff": "elastic_elasticsearch/issue_42053/commit_1394b1508ca5189f3c55decd751bcc1bb47b5ef4.diff",
            "diff_additions": 40,
            "diff_deletions": 14,
            "diff_file_size": 19031,
            "files": [
                {
                    "file_additions": 5,
                    "file_deletions": 5,
                    "file_exists": true,
                    "file_name": "x-pack/plugin/core/src/main/java/org/elasticsearch/xpack/core/security/action/CreateApiKeyRequest.java",
                    "file_size": 5585
                },
                {
                    "file_additions": 1,
                    "file_deletions": 1,
                    "file_exists": true,
                    "file_name": "x-pack/plugin/core/src/main/java/org/elasticsearch/xpack/core/security/action/CreateApiKeyRequestBuilder.java",
                    "file_size": 3831
                },
                {
                    "file_additions": 18,
                    "file_deletions": 0,
                    "file_exists": true,
                    "file_name": "x-pack/plugin/core/src/test/java/org/elasticsearch/xpack/core/security/action/CreateApiKeyRequestBuilderTests.java",
                    "file_size": 4201
                },
                {
                    "file_additions": 16,
                    "file_deletions": 8,
                    "file_exists": true,
                    "file_name": "x-pack/plugin/core/src/test/java/org/elasticsearch/xpack/core/security/action/CreateApiKeyRequestTests.java",
                    "file_size": 5414
                }
            ],
            "interesting": {
                "reopened": false,
                "status": true
            },
            "sha": "1394b1508ca5189f3c55decd751bcc1bb47b5ef4"
        },
        {
            "diff": "elastic_elasticsearch/issue_42053/commit_c6a1e8f0d5350f3707d82b134517315541b2cbf4.diff",
            "diff_additions": 41,
            "diff_deletions": 14,
            "diff_file_size": 19031,
            "files": [
                {
                    "file_additions": 5,
                    "file_deletions": 5,
                    "file_exists": true,
                    "file_name": "x-pack/plugin/core/src/main/java/org/elasticsearch/xpack/core/security/action/CreateApiKeyRequest.java",
                    "file_size": 5585
                },
                {
                    "file_additions": 1,
                    "file_deletions": 1,
                    "file_exists": true,
                    "file_name": "x-pack/plugin/core/src/main/java/org/elasticsearch/xpack/core/security/action/CreateApiKeyRequestBuilder.java",
                    "file_size": 3831
                },
                {
                    "file_additions": 18,
                    "file_deletions": 0,
                    "file_exists": true,
                    "file_name": "x-pack/plugin/core/src/test/java/org/elasticsearch/xpack/core/security/action/CreateApiKeyRequestBuilderTests.java",
                    "file_size": 4201
                },
                {
                    "file_additions": 17,
                    "file_deletions": 8,
                    "file_exists": true,
                    "file_name": "x-pack/plugin/core/src/test/java/org/elasticsearch/xpack/core/security/action/CreateApiKeyRequestTests.java",
                    "file_size": 5414
                }
            ],
            "interesting": {
                "reopened": false,
                "status": false
            },
            "sha": "c6a1e8f0d5350f3707d82b134517315541b2cbf4"
        },
        {
            "diff": "elastic_elasticsearch/issue_42053/commit_480453aa246fdb6676da0bda80562077d453dccc.diff",
            "diff_additions": 41,
            "diff_deletions": 14,
            "diff_file_size": 19031,
            "files": [
                {
                    "file_additions": 5,
                    "file_deletions": 5,
                    "file_exists": true,
                    "file_name": "x-pack/plugin/core/src/main/java/org/elasticsearch/xpack/core/security/action/CreateApiKeyRequest.java",
                    "file_size": 5585
                },
                {
                    "file_additions": 1,
                    "file_deletions": 1,
                    "file_exists": true,
                    "file_name": "x-pack/plugin/core/src/main/java/org/elasticsearch/xpack/core/security/action/CreateApiKeyRequestBuilder.java",
                    "file_size": 3831
                },
                {
                    "file_additions": 18,
                    "file_deletions": 0,
                    "file_exists": true,
                    "file_name": "x-pack/plugin/core/src/test/java/org/elasticsearch/xpack/core/security/action/CreateApiKeyRequestBuilderTests.java",
                    "file_size": 4201
                },
                {
                    "file_additions": 17,
                    "file_deletions": 8,
                    "file_exists": true,
                    "file_name": "x-pack/plugin/core/src/test/java/org/elasticsearch/xpack/core/security/action/CreateApiKeyRequestTests.java",
                    "file_size": 5414
                }
            ],
            "interesting": {
                "reopened": false,
                "status": false
            },
            "sha": "480453aa246fdb6676da0bda80562077d453dccc"
        },
        {
            "diff": "elastic_elasticsearch/issue_42053/commit_fa23b683a84216afd6c579a4aa37c82afe5252a3.diff",
            "diff_additions": 41,
            "diff_deletions": 14,
            "diff_file_size": 19031,
            "files": [
                {
                    "file_additions": 5,
                    "file_deletions": 5,
                    "file_exists": true,
                    "file_name": "x-pack/plugin/core/src/main/java/org/elasticsearch/xpack/core/security/action/CreateApiKeyRequest.java",
                    "file_size": 5585
                },
                {
                    "file_additions": 1,
                    "file_deletions": 1,
                    "file_exists": true,
                    "file_name": "x-pack/plugin/core/src/main/java/org/elasticsearch/xpack/core/security/action/CreateApiKeyRequestBuilder.java",
                    "file_size": 3831
                },
                {
                    "file_additions": 18,
                    "file_deletions": 0,
                    "file_exists": true,
                    "file_name": "x-pack/plugin/core/src/test/java/org/elasticsearch/xpack/core/security/action/CreateApiKeyRequestBuilderTests.java",
                    "file_size": 4201
                },
                {
                    "file_additions": 17,
                    "file_deletions": 8,
                    "file_exists": true,
                    "file_name": "x-pack/plugin/core/src/test/java/org/elasticsearch/xpack/core/security/action/CreateApiKeyRequestTests.java",
                    "file_size": 5414
                }
            ],
            "interesting": {
                "reopened": false,
                "status": false
            },
            "sha": "fa23b683a84216afd6c579a4aa37c82afe5252a3"
        },
        {
            "diff": "elastic_elasticsearch/issue_42053/commit_50724365fcb1365ad454c67881a73c1a91ebc4ee.diff",
            "diff_additions": 41,
            "diff_deletions": 15,
            "diff_file_size": 19031,
            "files": [
                {
                    "file_additions": 6,
                    "file_deletions": 6,
                    "file_exists": true,
                    "file_name": "x-pack/plugin/core/src/main/java/org/elasticsearch/xpack/core/security/action/CreateApiKeyRequest.java",
                    "file_size": 5585
                },
                {
                    "file_additions": 1,
                    "file_deletions": 1,
                    "file_exists": true,
                    "file_name": "x-pack/plugin/core/src/main/java/org/elasticsearch/xpack/core/security/action/CreateApiKeyRequestBuilder.java",
                    "file_size": 3831
                },
                {
                    "file_additions": 18,
                    "file_deletions": 0,
                    "file_exists": true,
                    "file_name": "x-pack/plugin/core/src/test/java/org/elasticsearch/xpack/core/security/action/CreateApiKeyRequestBuilderTests.java",
                    "file_size": 4201
                },
                {
                    "file_additions": 16,
                    "file_deletions": 8,
                    "file_exists": true,
                    "file_name": "x-pack/plugin/core/src/test/java/org/elasticsearch/xpack/core/security/action/CreateApiKeyRequestTests.java",
                    "file_size": 5414
                }
            ],
            "interesting": {
                "reopened": false,
                "status": false
            },
            "sha": "50724365fcb1365ad454c67881a73c1a91ebc4ee"
        }
    ],
    "first_commit": "2019-06-20 21:27:07",
    "last_commit": "2019-06-27 08:09:01",
    "number": 42053,
    "score": 320.0074211502783
}