{
    "commits": [
        {
            "associated_pull_request": [],
            "date": "2018-12-09 15:28:25+00:00",
            "diff": "samtools_bcftools/issue_929/commit_d50f412e0aeebe01b62cd3e4f87577ed77a26c08.diff",
            "diff_additions": 1,
            "diff_deletions": 1,
            "diff_file_size": 145035,
            "diff_url": "https://github.com/samtools/bcftools/commit/d50f412e0aeebe01b62cd3e4f87577ed77a26c08.diff",
            "exists": true,
            "files": [
                {
                    "file_additions": 1,
                    "file_deletions": 1,
                    "file_exists": true,
                    "file_name": "csq.c",
                    "file_size": 145035
                }
            ],
            "interesting": {
                "reopen": false,
                "status": false
            },
            "is_parent": true,
            "sha": "d50f412e0aeebe01b62cd3e4f87577ed77a26c08"
        },
        {
            "associated_pull_request": [],
            "date": "2018-12-10 12:59:50+00:00",
            "diff": "samtools_bcftools/issue_929/commit_417d427690af916ed8546ed8a754b08479226da2.diff",
            "diff_additions": 5,
            "diff_deletions": 3,
            "diff_file_size": 147561,
            "diff_url": "https://github.com/samtools/bcftools/commit/417d427690af916ed8546ed8a754b08479226da2.diff",
            "exists": true,
            "files": [
                {
                    "file_additions": 5,
                    "file_deletions": 3,
                    "file_exists": true,
                    "file_name": "vcfmerge.c",
                    "file_size": 147561
                }
            ],
            "interesting": {
                "reopen": true,
                "status": false
            },
            "is_parent": false,
            "sha": "417d427690af916ed8546ed8a754b08479226da2"
        },
        {
            "associated_pull_request": [],
            "date": "2018-12-20 08:46:16+00:00",
            "diff": "samtools_bcftools/issue_929/commit_d6b7b5b8d829e29008f365f1fee8ee09554dcb83.diff",
            "diff_additions": 23,
            "diff_deletions": 0,
            "diff_file_size": 147561,
            "diff_url": "https://github.com/samtools/bcftools/commit/d6b7b5b8d829e29008f365f1fee8ee09554dcb83.diff",
            "exists": true,
            "files": [
                {
                    "file_additions": 23,
                    "file_deletions": 0,
                    "file_exists": true,
                    "file_name": "vcfmerge.c",
                    "file_size": 147561
                }
            ],
            "interesting": {
                "reopen": false,
                "status": false
            },
            "is_parent": false,
            "sha": "d6b7b5b8d829e29008f365f1fee8ee09554dcb83"
        }
    ],
    "first_commit": "2018-12-09 15:29:06+00:00",
    "last_commit": "2018-12-20 08:46:16+00:00",
    "number": 929,
    "pull_request": "None",
    "score": {
        "accidental_reopen_likely": false,
        "all_labels": [
            "htslib-dependent"
        ],
        "contains_keywords": [
            "work",
            "chang",
            "fix",
            "test",
            "fault",
            "warn",
            "bug",
            "error",
            "problem",
            "report"
        ],
        "fix_size": 30,
        "has_labels": [],
        "intersecting": {
            "computed_score": 0.041666666666666664,
            "final_commit_size": 24,
            "intersection_size": 1,
            "previous_commits_size": 7
        },
        "is_makefile_based": true,
        "no_new_files": [],
        "no_other_files": false,
        "num_prohibited_files": 197358,
        "prohibited_files": [
            "server/src/main/java/com/genymobile/scrcpy/Device.java",
            "server/src/main/java/com/genymobile/scrcpy/wrappers/SurfaceControl.java",
            "server/src/main/java/com/genymobile/scrcpy/Device.java",
            "server/src/main/java/com/genymobile/scrcpy/wrappers/SurfaceControl.java",
            "app/meson.build",
            "app/scrcpy.1",
            "app/src/common.h",
            "app/src/scrcpy.h",
            "app/src/server.h",
            "server/src/main/java/com/genymobile/scrcpy/Workarounds.java"
        ],
        "reopen": true,
        "reopen_events": [
            [
                "2018-12-10 13:00:15+00:00",
                "closed"
            ],
            [
                "2018-12-10 13:00:15+00:00",
                "commit"
            ],
            [
                "2018-12-14 18:02:21+00:00",
                "reopened"
            ],
            [
                "2018-12-20 08:55:05+00:00",
                "closed"
            ],
            [
                "2018-12-20 08:55:05+00:00",
                "commit"
            ]
        ],
        "status": false,
        "strategy": true,
        "total_changes": 33
    }
}