{
    "covered_issues": [
        814,
        801,
        800,
        799,
        794,
        784,
        781,
        777,
        767,
        764,
        763,
        762,
        761,
        760,
        758,
        739,
        729,
        713,
        686,
        633,
        609,
        582,
        578,
        576,
        572,
        566,
        561,
        560,
        550,
        549,
        540,
        535,
        522,
        519,
        509,
        502,
        456,
        392,
        284,
        259,
        245,
        242,
        239,
        229,
        223,
        214,
        208,
        140,
        126,
        110,
        100,
        78,
        77,
        60,
        49,
        43,
        42,
        39,
        37,
        36,
        34,
        3
    ],
    "finished": true
}