{
    "category": [
        "network/protocols",
        "multithreading"
    ],
    "commits": [
        {
            "associated_pull_request": [],
            "date": "2014-04-16 18:26:27",
            "diff": "",
            "diff_additions": 0,
            "diff_deletions": 0,
            "diff_file_size": 0,
            "diff_url": "https://github.com/FreeRADIUS/freeradius-server/commit/cfeb34877a4e2c7fd4b7104b765b0c93be4dae16.diff",
            "exists": true,
            "files": [],
            "interesting": {
                "reopen": false,
                "status": false
            },
            "is_parent": true,
            "sha": "cfeb34877a4e2c7fd4b7104b765b0c93be4dae16"
        },
        {
            "associated_pull_request": [],
            "date": "2014-04-17 13:58:41",
            "diff": "freeradius_freeradius-server/issue_591/commit_b401c44253f67cb1f55a026ceccca0bc284c95a6.diff",
            "diff_additions": 1,
            "diff_deletions": 0,
            "diff_file_size": 0,
            "diff_url": "https://github.com/FreeRADIUS/freeradius-server/commit/b401c44253f67cb1f55a026ceccca0bc284c95a6.diff",
            "exists": true,
            "files": [
                {
                    "file_additions": 1,
                    "file_deletions": 0,
                    "file_exists": false,
                    "file_name": "src/main/dhcpd.c",
                    "file_size": 0
                }
            ],
            "interesting": {
                "reopen": false,
                "status": true
            },
            "is_parent": false,
            "sha": "b401c44253f67cb1f55a026ceccca0bc284c95a6"
        },
        {
            "associated_pull_request": [],
            "date": "2014-04-17 13:59:16",
            "diff": "freeradius_freeradius-server/issue_591/commit_c3a203fac8f36cc776173c9caf10634b690b94cb.diff",
            "diff_additions": 1,
            "diff_deletions": 0,
            "diff_file_size": 0,
            "diff_url": "https://github.com/FreeRADIUS/freeradius-server/commit/c3a203fac8f36cc776173c9caf10634b690b94cb.diff",
            "exists": true,
            "files": [
                {
                    "file_additions": 1,
                    "file_deletions": 0,
                    "file_exists": false,
                    "file_name": "src/modules/proto_dhcp/dhcpd.c",
                    "file_size": 0
                }
            ],
            "interesting": {
                "reopen": false,
                "status": false
            },
            "is_parent": false,
            "sha": "c3a203fac8f36cc776173c9caf10634b690b94cb"
        },
        {
            "associated_pull_request": [],
            "date": "2014-04-17 13:59:16",
            "diff": "freeradius_freeradius-server/issue_591/commit_84947b538fb6fab81a85246a56be4757e2d81239.diff",
            "diff_additions": 1,
            "diff_deletions": 0,
            "diff_file_size": 0,
            "diff_url": "https://github.com/FreeRADIUS/freeradius-server/commit/84947b538fb6fab81a85246a56be4757e2d81239.diff",
            "exists": true,
            "files": [
                {
                    "file_additions": 1,
                    "file_deletions": 0,
                    "file_exists": false,
                    "file_name": "src/modules/proto_dhcp/dhcpd.c",
                    "file_size": 0
                }
            ],
            "interesting": {
                "reopen": false,
                "status": false
            },
            "is_parent": false,
            "sha": "84947b538fb6fab81a85246a56be4757e2d81239"
        },
        {
            "associated_pull_request": [],
            "date": "2014-04-17 14:35:46",
            "diff": "freeradius_freeradius-server/issue_591/commit_d451a5d81f6240b1d32028252be31116b51e766d.diff",
            "diff_additions": 1,
            "diff_deletions": 1,
            "diff_file_size": 0,
            "diff_url": "https://github.com/FreeRADIUS/freeradius-server/commit/d451a5d81f6240b1d32028252be31116b51e766d.diff",
            "exists": true,
            "files": [
                {
                    "file_additions": 1,
                    "file_deletions": 1,
                    "file_exists": false,
                    "file_name": "src/main/dhcpd.c",
                    "file_size": 0
                }
            ],
            "interesting": {
                "reopen": false,
                "status": false
            },
            "is_parent": false,
            "sha": "d451a5d81f6240b1d32028252be31116b51e766d"
        }
    ],
    "first_commit": "2014-04-16 18:27:32",
    "last_commit": "2014-04-17 14:35:46",
    "number": 591,
    "pull_request": "None",
    "score": {
        "accidental_reopen_likely": false,
        "all_labels": [],
        "contains_keywords": [
            "work",
            "fix",
            "issu"
        ],
        "fix_size": 4,
        "has_labels": [],
        "intersecting": {
            "computed_score": 1.0,
            "final_commit_size": 2,
            "intersection_size": 2,
            "previous_commits_size": 4
        },
        "is_makefile_based": true,
        "no_new_files": [],
        "no_other_files": true,
        "num_prohibited_files": 10648,
        "prohibited_files": [
            "kill.h",
            "meminfo.h",
            "kill.h",
            "meminfo.h",
            "kill.h",
            "meminfo.h",
            "testsuite_cli_test.go",
            "testsuite_cli_test.go",
            "common.mk",
            "i3bar/include/draw_util.h"
        ],
        "reopen": false,
        "reopen_events": [
            [
                "2014-04-17 13:35:24",
                "closed"
            ],
            [
                "2014-04-17 13:59:07",
                "commit"
            ],
            [
                "2014-04-17 13:59:23",
                "commit"
            ],
            [
                "2014-04-17 14:00:05",
                "commit"
            ],
            [
                "2014-04-17 14:35:55",
                "commit"
            ]
        ],
        "status": true,
        "strategy": true,
        "total_changes": 5
    }
}