{
    "commits": [
        {
            "diff": "spring-projects_spring-boot/issue_8609/commit_4100360cebf3115698de1f1699bde973cdceaced.diff",
            "diff_additions": 3,
            "diff_deletions": 55,
            "diff_file_size": 0,
            "files": [
                {
                    "file_additions": 0,
                    "file_deletions": 6,
                    "file_exists": false,
                    "file_name": "spring-boot-autoconfigure/src/test/java/org/springframework/boot/autoconfigure/webflux/MockReactiveWebServerFactory.java",
                    "file_size": 0
                },
                {
                    "file_additions": 2,
                    "file_deletions": 10,
                    "file_exists": false,
                    "file_name": "spring-boot/src/main/java/org/springframework/boot/web/embedded/jetty/JettyReactiveWebServerFactory.java",
                    "file_size": 0
                },
                {
                    "file_additions": 0,
                    "file_deletions": 10,
                    "file_exists": false,
                    "file_name": "spring-boot/src/main/java/org/springframework/boot/web/embedded/netty/NettyReactiveWebServerFactory.java",
                    "file_size": 0
                },
                {
                    "file_additions": 0,
                    "file_deletions": 9,
                    "file_exists": false,
                    "file_name": "spring-boot/src/main/java/org/springframework/boot/web/embedded/tomcat/TomcatReactiveWebServerFactory.java",
                    "file_size": 0
                },
                {
                    "file_additions": 0,
                    "file_deletions": 10,
                    "file_exists": false,
                    "file_name": "spring-boot/src/main/java/org/springframework/boot/web/embedded/undertow/UndertowReactiveWebServerFactory.java",
                    "file_size": 0
                },
                {
                    "file_additions": 1,
                    "file_deletions": 10,
                    "file_exists": false,
                    "file_name": "spring-boot/src/main/java/org/springframework/boot/web/reactive/server/ReactiveWebServerFactory.java",
                    "file_size": 0
                }
            ],
            "interesting": {
                "reopened": false,
                "status": false
            },
            "sha": "4100360cebf3115698de1f1699bde973cdceaced"
        },
        {
            "diff": "spring-projects_spring-boot/issue_8609/commit_4bd67980e7171e201f1a461bf9826d99d414259f.diff",
            "diff_additions": 448,
            "diff_deletions": 0,
            "diff_file_size": 0,
            "files": [
                {
                    "file_additions": 43,
                    "file_deletions": 0,
                    "file_exists": false,
                    "file_name": "spring-boot-test-autoconfigure/src/main/java/org/springframework/boot/test/autoconfigure/data/neo4j/AutoConfigureDataNeo4j.java",
                    "file_size": 0
                },
                {
                    "file_additions": 70,
                    "file_deletions": 0,
                    "file_exists": false,
                    "file_name": "spring-boot-test-autoconfigure/src/main/java/org/springframework/boot/test/autoconfigure/data/neo4j/DataNeo4jTest.java",
                    "file_size": 0
                },
                {
                    "file_additions": 73,
                    "file_deletions": 0,
                    "file_exists": false,
                    "file_name": "spring-boot-test-autoconfigure/src/main/java/org/springframework/boot/test/autoconfigure/data/neo4j/DataNeo4jTypeExcludeFilter.java",
                    "file_size": 0
                },
                {
                    "file_additions": 68,
                    "file_deletions": 0,
                    "file_exists": false,
                    "file_name": "spring-boot-test-autoconfigure/src/test/java/org/springframework/boot/test/autoconfigure/data/neo4j/DataNeo4jTestIntegrationTests.java",
                    "file_size": 0
                },
                {
                    "file_additions": 46,
                    "file_deletions": 0,
                    "file_exists": false,
                    "file_name": "spring-boot-test-autoconfigure/src/test/java/org/springframework/boot/test/autoconfigure/data/neo4j/DataNeo4jTestWithIncludeFilterIntegrationTests.java",
                    "file_size": 0
                },
                {
                    "file_additions": 52,
                    "file_deletions": 0,
                    "file_exists": false,
                    "file_name": "spring-boot-test-autoconfigure/src/test/java/org/springframework/boot/test/autoconfigure/data/neo4j/ExampleGraph.java",
                    "file_size": 0
                },
                {
                    "file_additions": 29,
                    "file_deletions": 0,
                    "file_exists": false,
                    "file_name": "spring-boot-test-autoconfigure/src/test/java/org/springframework/boot/test/autoconfigure/data/neo4j/ExampleNeo4jApplication.java",
                    "file_size": 0
                },
                {
                    "file_additions": 27,
                    "file_deletions": 0,
                    "file_exists": false,
                    "file_name": "spring-boot-test-autoconfigure/src/test/java/org/springframework/boot/test/autoconfigure/data/neo4j/ExampleRepository.java",
                    "file_size": 0
                },
                {
                    "file_additions": 40,
                    "file_deletions": 0,
                    "file_exists": false,
                    "file_name": "spring-boot-test-autoconfigure/src/test/java/org/springframework/boot/test/autoconfigure/data/neo4j/ExampleService.java",
                    "file_size": 0
                }
            ],
            "interesting": {
                "reopened": false,
                "status": true
            },
            "sha": "4bd67980e7171e201f1a461bf9826d99d414259f"
        },
        {
            "diff": "spring-projects_spring-boot/issue_8609/commit_13e5d985603e455669c0dfa04ea143ecd684344a.diff",
            "diff_additions": 600,
            "diff_deletions": 0,
            "diff_file_size": 0,
            "files": [
                {
                    "file_additions": 43,
                    "file_deletions": 0,
                    "file_exists": false,
                    "file_name": "spring-boot-test-autoconfigure/src/main/java/org/springframework/boot/test/autoconfigure/data/neo4j/AutoConfigureDataNeo4j.java",
                    "file_size": 0
                },
                {
                    "file_additions": 97,
                    "file_deletions": 0,
                    "file_exists": false,
                    "file_name": "spring-boot-test-autoconfigure/src/main/java/org/springframework/boot/test/autoconfigure/data/neo4j/DataNeo4jTest.java",
                    "file_size": 0
                },
                {
                    "file_additions": 72,
                    "file_deletions": 0,
                    "file_exists": false,
                    "file_name": "spring-boot-test-autoconfigure/src/main/java/org/springframework/boot/test/autoconfigure/data/neo4j/DataNeo4jTypeExcludeFilter.java",
                    "file_size": 0
                },
                {
                    "file_additions": 74,
                    "file_deletions": 0,
                    "file_exists": false,
                    "file_name": "spring-boot-test-autoconfigure/src/test/java/org/springframework/boot/test/autoconfigure/data/neo4j/DataNeo4jTestIntegrationTests.java",
                    "file_size": 0
                },
                {
                    "file_additions": 51,
                    "file_deletions": 0,
                    "file_exists": false,
                    "file_name": "spring-boot-test-autoconfigure/src/test/java/org/springframework/boot/test/autoconfigure/data/neo4j/DataNeo4jTestWithIncludeFilterIntegrationTests.java",
                    "file_size": 0
                },
                {
                    "file_additions": 53,
                    "file_deletions": 0,
                    "file_exists": false,
                    "file_name": "spring-boot-test-autoconfigure/src/test/java/org/springframework/boot/test/autoconfigure/data/neo4j/ExampleGraph.java",
                    "file_size": 0
                },
                {
                    "file_additions": 29,
                    "file_deletions": 0,
                    "file_exists": false,
                    "file_name": "spring-boot-test-autoconfigure/src/test/java/org/springframework/boot/test/autoconfigure/data/neo4j/ExampleNeo4jApplication.java",
                    "file_size": 0
                },
                {
                    "file_additions": 27,
                    "file_deletions": 0,
                    "file_exists": false,
                    "file_name": "spring-boot-test-autoconfigure/src/test/java/org/springframework/boot/test/autoconfigure/data/neo4j/ExampleRepository.java",
                    "file_size": 0
                },
                {
                    "file_additions": 41,
                    "file_deletions": 0,
                    "file_exists": false,
                    "file_name": "spring-boot-test-autoconfigure/src/test/java/org/springframework/boot/test/autoconfigure/data/neo4j/ExampleService.java",
                    "file_size": 0
                },
                {
                    "file_additions": 113,
                    "file_deletions": 0,
                    "file_exists": false,
                    "file_name": "spring-boot-test-autoconfigure/src/test/java/org/springframework/boot/test/autoconfigure/data/neo4j/Neo4jTestServer.java",
                    "file_size": 0
                }
            ],
            "interesting": {
                "reopened": false,
                "status": false
            },
            "sha": "13e5d985603e455669c0dfa04ea143ecd684344a"
        }
    ],
    "first_commit": "2017-03-14 20:45:53",
    "last_commit": "2017-04-02 14:34:28",
    "number": 8609,
    "score": 256.003616636528
}