{
    "covered_issues": [
        299,
        298,
        295,
        293,
        292,
        291,
        289,
        288,
        287,
        286,
        285,
        284,
        283,
        281,
        273,
        271,
        269,
        268,
        267,
        266,
        264,
        262,
        261,
        259,
        257,
        255,
        254,
        251,
        244,
        243,
        239,
        236,
        235,
        233,
        232,
        231,
        230,
        228,
        227,
        226,
        225,
        224,
        223,
        219,
        216,
        215,
        214,
        211,
        209,
        208,
        206,
        204,
        203,
        202,
        201,
        200,
        198,
        197,
        196,
        194,
        193,
        191,
        190,
        189,
        188,
        183,
        182,
        181,
        179,
        177,
        175,
        171,
        170,
        169,
        168,
        163,
        162,
        161,
        160,
        159,
        158,
        157,
        156,
        154,
        152,
        150,
        147,
        144,
        143,
        142,
        141,
        140,
        138,
        136,
        135,
        134,
        128,
        127,
        126,
        125,
        122,
        121,
        117,
        116,
        112,
        111,
        110,
        109,
        108,
        106,
        103,
        102,
        96,
        95,
        86,
        84,
        81,
        80,
        79,
        78,
        77,
        75,
        74,
        73,
        72,
        71,
        70,
        69,
        68,
        67,
        65,
        64,
        61,
        59,
        58,
        56,
        55,
        49,
        47,
        46,
        44,
        42,
        41,
        40,
        39,
        36,
        35,
        33,
        32,
        31,
        29,
        28,
        25,
        24,
        22,
        21,
        20,
        19,
        18,
        16,
        13,
        8,
        2,
        160,
        160
    ],
    "finished": true
}