{
    "all_issues": 3121,
    "interesting_issues": 1,
    "last_update": "2023-10-29 11:02:22.460297",
    "license": {
        "download": "https://raw.githubusercontent.com/cleanflight/cleanflight/master/LICENSE",
        "name": "GNU General Public License v3.0"
    },
    "ratio": 0.0003204101249599487,
    "size": 362275,
    "stars": 2521,
    "url": "https://github.com/cleanflight/cleanflight"
}