{
    "covered_issues": [
        46,
        41,
        35,
        34,
        32,
        21,
        13,
        12,
        11,
        10,
        9,
        8,
        7,
        5,
        4,
        3,
        2
    ],
    "finished": true
}