{
    "covered_issues": [
        377,
        376,
        375,
        373,
        371,
        370,
        368,
        366,
        363,
        359,
        358,
        356,
        355,
        353,
        346,
        343,
        342,
        340,
        339,
        338,
        337,
        336,
        332,
        331,
        328,
        326,
        325,
        324,
        321,
        320,
        319,
        317,
        316,
        314,
        313,
        312,
        311,
        310,
        309,
        308,
        305,
        302,
        301,
        299,
        298,
        297,
        296,
        294,
        293,
        292,
        291,
        289,
        287,
        285,
        284,
        283,
        282,
        281,
        280,
        276,
        274,
        273,
        271,
        269,
        268,
        266,
        265,
        264,
        261,
        259,
        258,
        257,
        255,
        254,
        252,
        251,
        250,
        249,
        248,
        247,
        246,
        245,
        244,
        243,
        240,
        239,
        238,
        237,
        236,
        234,
        233,
        231,
        229,
        227,
        226,
        224,
        223,
        222,
        221,
        220,
        219,
        218,
        217,
        216,
        215,
        214,
        212,
        209,
        208,
        207,
        206,
        205,
        204,
        203,
        201,
        200,
        199,
        198,
        197,
        195,
        194,
        193,
        191,
        190,
        189,
        188,
        187,
        185,
        184,
        181,
        180,
        179,
        178,
        177,
        176,
        172,
        171,
        170,
        169,
        168,
        167,
        166,
        165,
        164,
        163,
        161,
        160,
        156,
        154,
        153,
        152,
        151,
        150,
        149,
        148,
        147,
        146,
        144,
        143,
        142,
        141,
        140,
        139,
        138,
        136,
        135,
        133,
        131,
        130,
        129,
        126,
        125,
        124,
        123,
        122,
        121,
        120,
        119,
        118,
        117,
        115,
        113,
        111,
        110,
        108,
        107,
        106,
        105,
        104,
        103,
        102,
        101,
        100,
        94,
        91,
        90,
        89,
        88,
        85,
        84,
        83,
        82,
        81,
        80,
        78,
        77,
        76,
        75,
        74,
        73,
        71,
        70,
        69,
        68,
        67,
        66,
        64,
        63,
        62,
        61,
        60,
        55,
        54,
        53,
        52,
        51,
        50,
        49,
        48,
        47,
        46,
        45,
        44,
        43,
        42,
        41,
        40,
        37,
        35,
        34,
        32,
        31,
        27,
        25,
        24,
        23,
        22,
        21,
        20,
        19,
        18,
        17,
        16,
        15,
        14,
        13,
        12,
        10,
        9,
        8,
        6,
        5,
        3
    ],
    "finished": true
}