{
    "category": [
        "hardware/OS",
        "build/refactor/preprocessing"
    ],
    "commits": [
        {
            "diff": "shadow_shadow/issue_128/commit_78af9f7728f943e57be7ee692a1da91efaf3eef3.diff",
            "diff_additions": 71,
            "diff_deletions": 163,
            "diff_file_size": 0,
            "exists": true,
            "files": [
                {
                    "file_additions": 3,
                    "file_deletions": 25,
                    "file_exists": false,
                    "file_name": "src/plugins/scallion/shd-scallion-preload.c",
                    "file_size": 0
                },
                {
                    "file_additions": 68,
                    "file_deletions": 138,
                    "file_exists": false,
                    "file_name": "src/plugins/scallion/shd-scallion.c",
                    "file_size": 0
                }
            ],
            "interesting": {
                "reopen": false,
                "status": false
            },
            "is_parent": false,
            "sha": "78af9f7728f943e57be7ee692a1da91efaf3eef3"
        },
        {
            "diff": "shadow_shadow/issue_128/commit_34e41c59d85b844891afcf3952590dd6a5d887a5.diff",
            "diff_additions": 1,
            "diff_deletions": 1,
            "diff_file_size": 0,
            "exists": true,
            "files": [
                {
                    "file_additions": 1,
                    "file_deletions": 1,
                    "file_exists": false,
                    "file_name": "src/plugins/scallion/shd-scallion.c",
                    "file_size": 0
                }
            ],
            "interesting": {
                "reopen": true,
                "status": false
            },
            "is_parent": false,
            "sha": "34e41c59d85b844891afcf3952590dd6a5d887a5"
        },
        {
            "diff": "shadow_shadow/issue_128/commit_63f6ef9c6b3ee85e700022891f08b7b038a555a4.diff",
            "diff_additions": 3,
            "diff_deletions": 1,
            "diff_file_size": 0,
            "exists": true,
            "files": [
                {
                    "file_additions": 3,
                    "file_deletions": 1,
                    "file_exists": false,
                    "file_name": "src/plugins/scallion/shd-scallion.c",
                    "file_size": 0
                }
            ],
            "interesting": {
                "reopen": false,
                "status": false
            },
            "is_parent": false,
            "sha": "63f6ef9c6b3ee85e700022891f08b7b038a555a4"
        }
    ],
    "first_commit": "2013-05-15 18:50:34",
    "last_commit": "2013-06-07 19:23:30",
    "number": 128,
    "score": {
        "all_labels": [
            "X-Archive: Plugin"
        ],
        "contains_keywords": [
            "fix",
            "test"
        ],
        "fix_size": 4,
        "has_labels": [],
        "intersecting": {
            "computed_score": 0.5,
            "final_commit_size": 4,
            "intersection_size": 2,
            "previous_commits_size": 2
        },
        "is_makefile_based": true,
        "no_new_files": [],
        "no_other_files": false,
        "num_prohibited_files": 47175,
        "prohibited_files": [
            "ompi/mca/osc/rdma/osc_rdma.h",
            "opal/mca/btl/usnic/Makefile.am",
            "opal/mca/btl/usnic/Makefile.am",
            "opal/mca/btl/usnic/Makefile.am",
            "opal/mca/btl/usnic/Makefile.am",
            "opal/mca/btl/usnic/Makefile.am",
            "oshmem/include/pshmem.h",
            "oshmem/include/pshmemx.h",
            "oshmem/include/shmem.h.in",
            "oshmem/include/shmemx.h"
        ],
        "reopen": true,
        "status": false,
        "strategy": true,
        "total_changes": 240
    }
}