{
    "all_issues": 4006,
    "interesting_issues": 1,
    "last_update": "2021-05-16 18:55:13.613511",
    "license": {
        "download": "https://raw.githubusercontent.com/pawelsalawa/sqlitestudio/master/LICENSE",
        "name": "Other"
    },
    "ratio": 0.00024962556165751375,
    "size": 35288,
    "stars": 1941,
    "url": "https://github.com/pawelsalawa/sqlitestudio"
}