{
    "covered_issues": [
        186,
        180,
        179,
        176,
        174,
        173,
        171,
        167,
        151,
        148,
        147,
        145,
        143,
        142,
        140,
        137,
        135,
        132,
        130,
        121,
        120,
        119,
        118,
        116,
        115,
        109,
        108,
        106,
        100,
        99,
        98,
        97,
        95,
        90,
        87,
        85,
        84,
        83,
        82,
        81,
        80,
        79,
        78,
        77,
        76,
        71,
        70,
        67,
        63,
        62,
        60,
        56,
        55,
        54,
        53,
        52,
        50,
        49,
        48,
        46,
        45,
        43,
        42,
        40,
        39,
        38,
        37,
        28,
        26,
        25,
        21,
        20,
        19,
        18,
        17,
        16,
        14,
        13,
        12,
        11,
        10,
        9,
        8,
        6,
        5,
        4,
        1
    ],
    "finished": true
}