{
    "covered_issues": [
        523,
        519,
        515,
        512,
        507,
        502,
        494,
        485,
        483,
        481,
        479,
        478,
        476,
        475,
        467,
        466,
        459,
        454,
        453,
        451,
        450,
        448,
        447,
        445,
        444,
        443,
        440,
        438,
        435,
        431,
        429,
        422,
        418,
        408,
        406,
        396,
        395,
        393,
        387,
        386,
        385,
        383,
        377,
        375,
        373,
        371,
        369,
        368,
        367,
        365,
        362,
        360,
        359,
        357,
        354,
        353,
        352,
        350,
        349,
        347,
        346,
        344,
        342,
        340,
        339,
        338,
        337,
        336,
        335,
        332,
        329,
        327,
        326,
        325,
        324,
        323,
        322,
        320,
        319,
        317,
        315,
        314,
        313,
        312,
        311,
        310,
        309,
        308,
        306,
        304,
        303,
        302,
        301,
        300,
        299,
        297,
        296,
        294,
        292,
        291,
        290,
        287,
        286,
        284,
        283,
        282,
        281,
        280,
        279,
        277,
        276,
        275,
        274,
        273,
        272,
        270,
        268,
        267,
        266,
        264,
        263,
        262,
        260,
        259,
        256,
        255,
        252,
        251,
        249,
        246,
        243,
        242,
        241,
        240,
        238,
        237,
        227,
        225,
        224,
        223,
        222,
        221,
        220,
        217,
        216,
        215,
        213,
        212,
        210,
        209,
        207,
        206,
        205,
        204,
        203,
        202,
        201,
        200,
        199,
        198,
        196,
        194,
        192,
        191,
        188,
        187,
        186,
        185,
        184,
        183,
        182,
        179,
        178,
        177,
        176,
        174,
        173,
        172,
        171,
        169,
        168,
        163,
        160,
        159,
        157,
        156,
        155,
        154,
        153,
        152,
        151,
        150,
        149,
        145,
        144,
        141,
        139,
        138,
        137,
        136,
        135,
        134,
        133,
        130,
        129,
        126,
        125,
        122,
        121,
        120,
        119,
        117,
        115,
        114,
        112,
        111,
        110,
        109,
        108,
        107,
        106,
        105,
        104,
        102,
        101,
        97,
        96,
        95,
        93,
        92,
        91,
        90,
        88,
        87,
        86,
        85,
        84,
        83,
        82,
        81,
        80,
        79,
        78,
        76,
        74,
        73,
        71,
        69,
        68,
        66,
        65,
        64,
        63,
        61,
        60,
        59,
        58,
        57,
        56,
        55,
        54,
        53,
        52,
        50,
        49,
        48,
        47,
        46,
        45,
        43,
        42,
        41,
        40,
        39,
        38,
        36,
        34,
        33,
        32,
        31,
        30,
        29,
        28,
        27,
        26,
        25,
        24,
        23,
        22,
        21,
        20,
        19,
        18,
        14,
        13,
        12,
        11,
        10,
        9,
        8,
        7,
        6,
        5,
        4,
        3
    ],
    "finished": true
}