{
    "all_issues": 11093,
    "interesting_issues": 1,
    "last_update": "2023-10-31 19:21:33.193040",
    "license": {
        "download": "https://raw.githubusercontent.com/apache/nuttx/master/LICENSE",
        "name": "Apache License 2.0"
    },
    "ratio": 9.014693951140358e-05,
    "size": 244634,
    "stars": 1772,
    "url": "https://github.com/apache/nuttx"
}