{
    "covered_issues": [
        215,
        211,
        210,
        208,
        207,
        206,
        205,
        203,
        202,
        201,
        198,
        197,
        193,
        190,
        189,
        188,
        187,
        186,
        184,
        183,
        181,
        177,
        176,
        174,
        173,
        172,
        171,
        169,
        166,
        165,
        164,
        163,
        161,
        159,
        158,
        157,
        156,
        154,
        153,
        152,
        151,
        150,
        149,
        148,
        147,
        146,
        143,
        141,
        140,
        138,
        137,
        135,
        134,
        131,
        128,
        127,
        125,
        122,
        121,
        119,
        117,
        116,
        115,
        114,
        112,
        111,
        109,
        107,
        104,
        103,
        102,
        100,
        98,
        97,
        96,
        94,
        92,
        91,
        90,
        89,
        87,
        85,
        79,
        75,
        72,
        69,
        68,
        67,
        66,
        65,
        64,
        63,
        61,
        60,
        58,
        57,
        55,
        54,
        52,
        51,
        47,
        45,
        44,
        43,
        41,
        40,
        39,
        38,
        37,
        35,
        34,
        33,
        32,
        31,
        29,
        28,
        26,
        25,
        24,
        22,
        21,
        19,
        17,
        16,
        15,
        10,
        8,
        7,
        5,
        4,
        3,
        2
    ],
    "finished": true
}