{
    "category": [
        "memory"
    ],
    "commits": [
        {
            "associated_pull_request": [
                "https://github.com/radareorg/radare2/pull/10504"
            ],
            "date": "2018-06-26 22:57:56",
            "diff": "radareorg_radare2/issue_10498/commit_e25b62fb03c501502dab5d8b0f91f2b1977e459e.diff",
            "diff_additions": 3,
            "diff_deletions": 0,
            "diff_file_size": 0,
            "diff_url": "https://github.com/radareorg/radare2/commit/e25b62fb03c501502dab5d8b0f91f2b1977e459e.diff",
            "exists": true,
            "files": [
                {
                    "file_additions": 3,
                    "file_deletions": 0,
                    "file_exists": false,
                    "file_name": "shlr/windbg/windbg.c",
                    "file_size": 0
                }
            ],
            "interesting": {
                "reopen": false,
                "status": false
            },
            "is_parent": true,
            "sha": "e25b62fb03c501502dab5d8b0f91f2b1977e459e"
        },
        {
            "associated_pull_request": [
                "https://github.com/radareorg/radare2/pull/10511"
            ],
            "date": "2018-06-26 23:17:05",
            "diff": "radareorg_radare2/issue_10498/commit_eb0fb72b3c5307ec8e33effb6bf947e38cfdffe8.diff",
            "diff_additions": 3,
            "diff_deletions": 0,
            "diff_file_size": 340339,
            "diff_url": "https://github.com/radareorg/radare2/commit/eb0fb72b3c5307ec8e33effb6bf947e38cfdffe8.diff",
            "exists": true,
            "files": [
                {
                    "file_additions": 3,
                    "file_deletions": 0,
                    "file_exists": true,
                    "file_name": "shlr/java/class.c",
                    "file_size": 340339
                }
            ],
            "interesting": {
                "reopen": false,
                "status": true
            },
            "is_parent": false,
            "sha": "eb0fb72b3c5307ec8e33effb6bf947e38cfdffe8"
        },
        {
            "associated_pull_request": [
                "https://github.com/radareorg/radare2/pull/10511"
            ],
            "date": "2018-06-27 11:56:59",
            "diff": "radareorg_radare2/issue_10498/commit_e9ce0d64faf19fa4e9c260250fbdf25e3c11e152.diff",
            "diff_additions": 12,
            "diff_deletions": 9,
            "diff_file_size": 340339,
            "diff_url": "https://github.com/radareorg/radare2/commit/e9ce0d64faf19fa4e9c260250fbdf25e3c11e152.diff",
            "exists": true,
            "files": [
                {
                    "file_additions": 12,
                    "file_deletions": 9,
                    "file_exists": true,
                    "file_name": "shlr/java/class.c",
                    "file_size": 340339
                }
            ],
            "interesting": {
                "reopen": false,
                "status": false
            },
            "is_parent": false,
            "sha": "e9ce0d64faf19fa4e9c260250fbdf25e3c11e152"
        }
    ],
    "first_commit": "2018-06-26 22:57:56",
    "last_commit": "2018-06-27 11:56:59",
    "number": 10498,
    "pull_request": "None",
    "score": {
        "accidental_reopen_likely": false,
        "all_labels": [],
        "contains_keywords": [
            "crash",
            "leak"
        ],
        "fix_size": 25,
        "has_labels": [],
        "intersecting": {
            "computed_score": 0.045454545454545456,
            "final_commit_size": 22,
            "intersection_size": 1,
            "previous_commits_size": 4
        },
        "is_makefile_based": true,
        "no_new_files": [],
        "no_other_files": true,
        "num_prohibited_files": 45780,
        "prohibited_files": [
            "hal/inc/pinmap_hal.h",
            "Debug/marvin.bin",
            "Debug/marvin.elf",
            "Debug/marvin.hex",
            "Debug/marvin.bin",
            "Debug/marvin.elf",
            "Debug/marvin.hex",
            "inc/spark_utilities.h",
            "Debug/marvin.bin",
            "Debug/marvin.elf"
        ],
        "reopen": false,
        "reopen_events": [
            [
                "2018-06-26 23:17:27",
                "commit"
            ],
            [
                "2018-06-27 11:57:02",
                "closed"
            ],
            [
                "2018-06-27 11:57:02",
                "commit"
            ]
        ],
        "status": true,
        "strategy": true,
        "total_changes": 27
    }
}