{
    "category": [
        "GUI",
        "feature request"
    ],
    "commits": [
        {
            "associated_pull_request": [
                "https://github.com/swaywm/wlroots/pull/2668"
            ],
            "date": "2021-01-20 20:20:55",
            "diff": "swaywm_wlroots/issue_2624/commit_7c995b78b2f74a0a2e4c96c6be1736702d3733c7.diff",
            "diff_additions": 44,
            "diff_deletions": 134,
            "diff_file_size": 30411,
            "diff_url": "https://github.com/swaywm/wlroots/commit/7c995b78b2f74a0a2e4c96c6be1736702d3733c7.diff",
            "exists": true,
            "files": [
                {
                    "file_additions": 33,
                    "file_deletions": 133,
                    "file_exists": true,
                    "file_name": "render/egl.c",
                    "file_size": 22883
                },
                {
                    "file_additions": 11,
                    "file_deletions": 1,
                    "file_exists": true,
                    "file_name": "render/wlr_renderer.c",
                    "file_size": 7528
                }
            ],
            "interesting": {
                "reopen": false,
                "status": false
            },
            "is_parent": true,
            "sha": "7c995b78b2f74a0a2e4c96c6be1736702d3733c7"
        },
        {
            "associated_pull_request": [],
            "date": "2021-01-21 01:08:05",
            "diff": "swaywm_wlroots/issue_2624/commit_03f23480cb258d0ceaa3c7a42e1942df4071d2a3.diff",
            "diff_additions": 16,
            "diff_deletions": 42,
            "diff_file_size": 131937,
            "diff_url": "https://github.com/swaywm/wlroots/commit/03f23480cb258d0ceaa3c7a42e1942df4071d2a3.diff",
            "exists": true,
            "files": [
                {
                    "file_additions": 1,
                    "file_deletions": 2,
                    "file_exists": true,
                    "file_name": "examples/idle-inhibit.c",
                    "file_size": 6861
                },
                {
                    "file_additions": 1,
                    "file_deletions": 2,
                    "file_exists": true,
                    "file_name": "examples/input-inhibitor.c",
                    "file_size": 5787
                },
                {
                    "file_additions": 1,
                    "file_deletions": 2,
                    "file_exists": true,
                    "file_name": "examples/keyboard-shortcuts-inhibit.c",
                    "file_size": 8345
                },
                {
                    "file_additions": 1,
                    "file_deletions": 2,
                    "file_exists": true,
                    "file_name": "examples/layer-shell.c",
                    "file_size": 19099
                },
                {
                    "file_additions": 1,
                    "file_deletions": 2,
                    "file_exists": true,
                    "file_name": "examples/pointer-constraints.c",
                    "file_size": 8000
                },
                {
                    "file_additions": 1,
                    "file_deletions": 2,
                    "file_exists": true,
                    "file_name": "examples/relative-pointer-unstable-v1.c",
                    "file_size": 14797
                },
                {
                    "file_additions": 1,
                    "file_deletions": 2,
                    "file_exists": true,
                    "file_name": "examples/text-input.c",
                    "file_size": 11309
                },
                {
                    "file_additions": 1,
                    "file_deletions": 2,
                    "file_exists": true,
                    "file_name": "examples/toplevel-decoration.c",
                    "file_size": 7642
                },
                {
                    "file_additions": 8,
                    "file_deletions": 23,
                    "file_exists": true,
                    "file_name": "render/egl.c",
                    "file_size": 22883
                },
                {
                    "file_additions": 0,
                    "file_deletions": 3,
                    "file_exists": true,
                    "file_name": "render/gles2/renderer.c",
                    "file_size": 27214
                }
            ],
            "interesting": {
                "reopen": false,
                "status": true
            },
            "is_parent": false,
            "sha": "03f23480cb258d0ceaa3c7a42e1942df4071d2a3"
        },
        {
            "associated_pull_request": [],
            "date": "2021-01-21 02:33:04",
            "diff": "swaywm_wlroots/issue_2624/commit_0b92783dc0ff67cf9e6608d6a6851949f9dbb16c.diff",
            "diff_additions": 17,
            "diff_deletions": 44,
            "diff_file_size": 139465,
            "diff_url": "https://github.com/swaywm/wlroots/commit/0b92783dc0ff67cf9e6608d6a6851949f9dbb16c.diff",
            "exists": true,
            "files": [
                {
                    "file_additions": 1,
                    "file_deletions": 2,
                    "file_exists": true,
                    "file_name": "examples/idle-inhibit.c",
                    "file_size": 6861
                },
                {
                    "file_additions": 1,
                    "file_deletions": 2,
                    "file_exists": true,
                    "file_name": "examples/input-inhibitor.c",
                    "file_size": 5787
                },
                {
                    "file_additions": 1,
                    "file_deletions": 2,
                    "file_exists": true,
                    "file_name": "examples/keyboard-shortcuts-inhibit.c",
                    "file_size": 8345
                },
                {
                    "file_additions": 1,
                    "file_deletions": 2,
                    "file_exists": true,
                    "file_name": "examples/layer-shell.c",
                    "file_size": 19099
                },
                {
                    "file_additions": 1,
                    "file_deletions": 2,
                    "file_exists": true,
                    "file_name": "examples/pointer-constraints.c",
                    "file_size": 8000
                },
                {
                    "file_additions": 1,
                    "file_deletions": 2,
                    "file_exists": true,
                    "file_name": "examples/relative-pointer-unstable-v1.c",
                    "file_size": 14797
                },
                {
                    "file_additions": 1,
                    "file_deletions": 2,
                    "file_exists": true,
                    "file_name": "examples/text-input.c",
                    "file_size": 11309
                },
                {
                    "file_additions": 1,
                    "file_deletions": 2,
                    "file_exists": true,
                    "file_name": "examples/toplevel-decoration.c",
                    "file_size": 7642
                },
                {
                    "file_additions": 8,
                    "file_deletions": 23,
                    "file_exists": true,
                    "file_name": "render/egl.c",
                    "file_size": 22883
                },
                {
                    "file_additions": 0,
                    "file_deletions": 3,
                    "file_exists": true,
                    "file_name": "render/gles2/renderer.c",
                    "file_size": 27214
                },
                {
                    "file_additions": 1,
                    "file_deletions": 2,
                    "file_exists": true,
                    "file_name": "render/wlr_renderer.c",
                    "file_size": 7528
                }
            ],
            "interesting": {
                "reopen": false,
                "status": false
            },
            "is_parent": false,
            "sha": "0b92783dc0ff67cf9e6608d6a6851949f9dbb16c"
        },
        {
            "associated_pull_request": [],
            "date": "2021-01-21 02:33:04",
            "diff": "swaywm_wlroots/issue_2624/commit_1e92c27bdeaaa8f145697dd11727cedc5badb4ab.diff",
            "diff_additions": 17,
            "diff_deletions": 44,
            "diff_file_size": 139465,
            "diff_url": "https://github.com/swaywm/wlroots/commit/1e92c27bdeaaa8f145697dd11727cedc5badb4ab.diff",
            "exists": true,
            "files": [
                {
                    "file_additions": 1,
                    "file_deletions": 2,
                    "file_exists": true,
                    "file_name": "examples/idle-inhibit.c",
                    "file_size": 6861
                },
                {
                    "file_additions": 1,
                    "file_deletions": 2,
                    "file_exists": true,
                    "file_name": "examples/input-inhibitor.c",
                    "file_size": 5787
                },
                {
                    "file_additions": 1,
                    "file_deletions": 2,
                    "file_exists": true,
                    "file_name": "examples/keyboard-shortcuts-inhibit.c",
                    "file_size": 8345
                },
                {
                    "file_additions": 1,
                    "file_deletions": 2,
                    "file_exists": true,
                    "file_name": "examples/layer-shell.c",
                    "file_size": 19099
                },
                {
                    "file_additions": 1,
                    "file_deletions": 2,
                    "file_exists": true,
                    "file_name": "examples/pointer-constraints.c",
                    "file_size": 8000
                },
                {
                    "file_additions": 1,
                    "file_deletions": 2,
                    "file_exists": true,
                    "file_name": "examples/relative-pointer-unstable-v1.c",
                    "file_size": 14797
                },
                {
                    "file_additions": 1,
                    "file_deletions": 2,
                    "file_exists": true,
                    "file_name": "examples/text-input.c",
                    "file_size": 11309
                },
                {
                    "file_additions": 1,
                    "file_deletions": 2,
                    "file_exists": true,
                    "file_name": "examples/toplevel-decoration.c",
                    "file_size": 7642
                },
                {
                    "file_additions": 8,
                    "file_deletions": 23,
                    "file_exists": true,
                    "file_name": "render/egl.c",
                    "file_size": 22883
                },
                {
                    "file_additions": 0,
                    "file_deletions": 3,
                    "file_exists": true,
                    "file_name": "render/gles2/renderer.c",
                    "file_size": 27214
                },
                {
                    "file_additions": 1,
                    "file_deletions": 2,
                    "file_exists": true,
                    "file_name": "render/wlr_renderer.c",
                    "file_size": 7528
                }
            ],
            "interesting": {
                "reopen": false,
                "status": false
            },
            "is_parent": false,
            "sha": "1e92c27bdeaaa8f145697dd11727cedc5badb4ab"
        },
        {
            "associated_pull_request": [],
            "date": "2021-01-22 05:05:37",
            "diff": "swaywm_wlroots/issue_2624/commit_f7825ad126e3551a2415f0fa6fb4a8b1089b880f.diff",
            "diff_additions": 2,
            "diff_deletions": 4,
            "diff_file_size": 22883,
            "diff_url": "https://github.com/swaywm/wlroots/commit/f7825ad126e3551a2415f0fa6fb4a8b1089b880f.diff",
            "exists": true,
            "files": [
                {
                    "file_additions": 2,
                    "file_deletions": 4,
                    "file_exists": true,
                    "file_name": "render/egl.c",
                    "file_size": 22883
                }
            ],
            "interesting": {
                "reopen": false,
                "status": false
            },
            "is_parent": false,
            "sha": "f7825ad126e3551a2415f0fa6fb4a8b1089b880f"
        },
        {
            "associated_pull_request": [],
            "date": "2021-01-21 02:33:04",
            "diff": "swaywm_wlroots/issue_2624/commit_86e33f30bc88c984b58f0f8f9cf5385de1a83348.diff",
            "diff_additions": 17,
            "diff_deletions": 44,
            "diff_file_size": 139465,
            "diff_url": "https://github.com/swaywm/wlroots/commit/86e33f30bc88c984b58f0f8f9cf5385de1a83348.diff",
            "exists": true,
            "files": [
                {
                    "file_additions": 1,
                    "file_deletions": 2,
                    "file_exists": true,
                    "file_name": "examples/idle-inhibit.c",
                    "file_size": 6861
                },
                {
                    "file_additions": 1,
                    "file_deletions": 2,
                    "file_exists": true,
                    "file_name": "examples/input-inhibitor.c",
                    "file_size": 5787
                },
                {
                    "file_additions": 1,
                    "file_deletions": 2,
                    "file_exists": true,
                    "file_name": "examples/keyboard-shortcuts-inhibit.c",
                    "file_size": 8345
                },
                {
                    "file_additions": 1,
                    "file_deletions": 2,
                    "file_exists": true,
                    "file_name": "examples/layer-shell.c",
                    "file_size": 19099
                },
                {
                    "file_additions": 1,
                    "file_deletions": 2,
                    "file_exists": true,
                    "file_name": "examples/pointer-constraints.c",
                    "file_size": 8000
                },
                {
                    "file_additions": 1,
                    "file_deletions": 2,
                    "file_exists": true,
                    "file_name": "examples/relative-pointer-unstable-v1.c",
                    "file_size": 14797
                },
                {
                    "file_additions": 1,
                    "file_deletions": 2,
                    "file_exists": true,
                    "file_name": "examples/text-input.c",
                    "file_size": 11309
                },
                {
                    "file_additions": 1,
                    "file_deletions": 2,
                    "file_exists": true,
                    "file_name": "examples/toplevel-decoration.c",
                    "file_size": 7642
                },
                {
                    "file_additions": 8,
                    "file_deletions": 23,
                    "file_exists": true,
                    "file_name": "render/egl.c",
                    "file_size": 22883
                },
                {
                    "file_additions": 0,
                    "file_deletions": 3,
                    "file_exists": true,
                    "file_name": "render/gles2/renderer.c",
                    "file_size": 27214
                },
                {
                    "file_additions": 1,
                    "file_deletions": 2,
                    "file_exists": true,
                    "file_name": "render/wlr_renderer.c",
                    "file_size": 7528
                }
            ],
            "interesting": {
                "reopen": false,
                "status": false
            },
            "is_parent": false,
            "sha": "86e33f30bc88c984b58f0f8f9cf5385de1a83348"
        },
        {
            "associated_pull_request": [],
            "date": "2021-01-22 05:05:37",
            "diff": "swaywm_wlroots/issue_2624/commit_c21c38a93f0f9e4281998c71867c03454c272227.diff",
            "diff_additions": 2,
            "diff_deletions": 4,
            "diff_file_size": 22883,
            "diff_url": "https://github.com/swaywm/wlroots/commit/c21c38a93f0f9e4281998c71867c03454c272227.diff",
            "exists": true,
            "files": [
                {
                    "file_additions": 2,
                    "file_deletions": 4,
                    "file_exists": true,
                    "file_name": "render/egl.c",
                    "file_size": 22883
                }
            ],
            "interesting": {
                "reopen": false,
                "status": false
            },
            "is_parent": false,
            "sha": "c21c38a93f0f9e4281998c71867c03454c272227"
        },
        {
            "associated_pull_request": [],
            "date": "2021-01-22 05:05:37",
            "diff": "swaywm_wlroots/issue_2624/commit_c24fc5f05d9463521f75871a472f3635433006eb.diff",
            "diff_additions": 2,
            "diff_deletions": 4,
            "diff_file_size": 22883,
            "diff_url": "https://github.com/swaywm/wlroots/commit/c24fc5f05d9463521f75871a472f3635433006eb.diff",
            "exists": true,
            "files": [
                {
                    "file_additions": 2,
                    "file_deletions": 4,
                    "file_exists": true,
                    "file_name": "render/egl.c",
                    "file_size": 22883
                }
            ],
            "interesting": {
                "reopen": false,
                "status": false
            },
            "is_parent": false,
            "sha": "c24fc5f05d9463521f75871a472f3635433006eb"
        },
        {
            "associated_pull_request": [],
            "date": "2021-01-22 05:05:37",
            "diff": "swaywm_wlroots/issue_2624/commit_a6fd14dc5fba6daf7df959bd67e25e86de1faff2.diff",
            "diff_additions": 2,
            "diff_deletions": 4,
            "diff_file_size": 22883,
            "diff_url": "https://github.com/swaywm/wlroots/commit/a6fd14dc5fba6daf7df959bd67e25e86de1faff2.diff",
            "exists": true,
            "files": [
                {
                    "file_additions": 2,
                    "file_deletions": 4,
                    "file_exists": true,
                    "file_name": "render/egl.c",
                    "file_size": 22883
                }
            ],
            "interesting": {
                "reopen": false,
                "status": false
            },
            "is_parent": false,
            "sha": "a6fd14dc5fba6daf7df959bd67e25e86de1faff2"
        },
        {
            "associated_pull_request": [],
            "date": "2021-01-22 05:05:37",
            "diff": "swaywm_wlroots/issue_2624/commit_7af22a0774debf32095cac2472be73eaef3459ac.diff",
            "diff_additions": 2,
            "diff_deletions": 4,
            "diff_file_size": 22883,
            "diff_url": "https://github.com/swaywm/wlroots/commit/7af22a0774debf32095cac2472be73eaef3459ac.diff",
            "exists": true,
            "files": [
                {
                    "file_additions": 2,
                    "file_deletions": 4,
                    "file_exists": true,
                    "file_name": "render/egl.c",
                    "file_size": 22883
                }
            ],
            "interesting": {
                "reopen": false,
                "status": false
            },
            "is_parent": false,
            "sha": "7af22a0774debf32095cac2472be73eaef3459ac"
        }
    ],
    "first_commit": "2021-01-20 20:32:50",
    "last_commit": "2021-01-29 23:49:33",
    "number": 2624,
    "pull_request": "None",
    "score": {
        "accidental_reopen_likely": false,
        "all_labels": [
            "renderer"
        ],
        "contains_keywords": [
            "chang",
            "remov"
        ],
        "fix_size": 74,
        "has_labels": [],
        "intersecting": {
            "computed_score": 1.0,
            "final_commit_size": 7,
            "intersection_size": 7,
            "previous_commits_size": 74
        },
        "is_makefile_based": false,
        "no_new_files": [],
        "no_other_files": false,
        "num_prohibited_files": 216455,
        "prohibited_files": [
            "hal/inc/pinmap_hal.h",
            "Debug/marvin.bin",
            "Debug/marvin.elf",
            "Debug/marvin.hex",
            "Debug/marvin.bin",
            "Debug/marvin.elf",
            "Debug/marvin.hex",
            "inc/spark_utilities.h",
            "Debug/marvin.bin",
            "Debug/marvin.elf"
        ],
        "reopen": false,
        "reopen_events": [
            [
                "2021-01-21 01:05:21",
                "commit"
            ],
            [
                "2021-01-21 02:30:12",
                "commit"
            ],
            [
                "2021-01-22 03:47:30",
                "commit"
            ],
            [
                "2021-01-22 05:02:43",
                "commit"
            ],
            [
                "2021-01-26 23:43:38",
                "commit"
            ],
            [
                "2021-01-26 23:59:27",
                "commit"
            ],
            [
                "2021-01-28 23:58:27",
                "commit"
            ],
            [
                "2021-01-29 09:03:47",
                "closed"
            ],
            [
                "2021-01-29 23:12:51",
                "commit"
            ],
            [
                "2021-01-29 23:46:43",
                "commit"
            ]
        ],
        "status": true,
        "strategy": true,
        "total_changes": 449
    }
}