{
    "commits": [
        {
            "diff": "elastic_elasticsearch/issue_34837/commit_bd143334d3ec773d5e47090233dd6218e4e4bf98.diff",
            "diff_additions": 41,
            "diff_deletions": 6,
            "diff_file_size": 228381,
            "files": [
                {
                    "file_additions": 9,
                    "file_deletions": 1,
                    "file_exists": false,
                    "file_name": "x-pack/plugin/sql/src/main/java/org/elasticsearch/xpack/sql/expression/predicate/In.java",
                    "file_size": 0
                },
                {
                    "file_additions": 8,
                    "file_deletions": 3,
                    "file_exists": false,
                    "file_name": "x-pack/plugin/sql/src/main/java/org/elasticsearch/xpack/sql/querydsl/query/TermsQuery.java",
                    "file_size": 0
                },
                {
                    "file_additions": 13,
                    "file_deletions": 1,
                    "file_exists": true,
                    "file_name": "x-pack/plugin/sql/src/test/java/org/elasticsearch/xpack/sql/optimizer/OptimizerTests.java",
                    "file_size": 51785
                },
                {
                    "file_additions": 10,
                    "file_deletions": 0,
                    "file_exists": true,
                    "file_name": "x-pack/plugin/sql/src/test/java/org/elasticsearch/xpack/sql/planner/QueryFolderTests.java",
                    "file_size": 29070
                },
                {
                    "file_additions": 1,
                    "file_deletions": 1,
                    "file_exists": true,
                    "file_name": "x-pack/plugin/sql/src/test/java/org/elasticsearch/xpack/sql/planner/QueryTranslatorTests.java",
                    "file_size": 147526
                }
            ],
            "interesting": {
                "reopened": false,
                "status": false
            },
            "sha": "bd143334d3ec773d5e47090233dd6218e4e4bf98"
        },
        {
            "diff": "elastic_elasticsearch/issue_34837/commit_cf138f0ea21f7ecd3059932d11fbb42e4b6abdc9.diff",
            "diff_additions": 2,
            "diff_deletions": 2,
            "diff_file_size": 9490,
            "files": [
                {
                    "file_additions": 2,
                    "file_deletions": 2,
                    "file_exists": true,
                    "file_name": "client/rest-high-level/src/test/java/org/elasticsearch/client/core/TermVectorsResponseTests.java",
                    "file_size": 9490
                }
            ],
            "interesting": {
                "reopened": false,
                "status": true
            },
            "sha": "cf138f0ea21f7ecd3059932d11fbb42e4b6abdc9"
        },
        {
            "diff": "elastic_elasticsearch/issue_34837/commit_5a829506dcebbd9e071818350e0834b041247fe5.diff",
            "diff_additions": 15,
            "diff_deletions": 8,
            "diff_file_size": 9490,
            "files": [
                {
                    "file_additions": 15,
                    "file_deletions": 8,
                    "file_exists": true,
                    "file_name": "client/rest-high-level/src/test/java/org/elasticsearch/client/core/TermVectorsResponseTests.java",
                    "file_size": 9490
                }
            ],
            "interesting": {
                "reopened": false,
                "status": false
            },
            "sha": "5a829506dcebbd9e071818350e0834b041247fe5"
        }
    ],
    "first_commit": "2018-10-25 12:24:11",
    "last_commit": "2018-10-30 04:29:17",
    "number": 34837,
    "score": 288.05405405405406
}