{
    "category": [
        "multithreading",
        "wrong API usage"
    ],
    "commits": [
        {
            "associated_pull_request": [
                "https://github.com/radareorg/radare2/pull/12095"
            ],
            "date": "2018-11-19 01:17:57",
            "diff": "radareorg_radare2/issue_12188/commit_cc7023dae801fc80fad3d72020f7fa071709a92b.diff",
            "diff_additions": 1,
            "diff_deletions": 1,
            "diff_file_size": 11025,
            "diff_url": "https://github.com/radareorg/radare2/commit/cc7023dae801fc80fad3d72020f7fa071709a92b.diff",
            "exists": true,
            "files": [
                {
                    "file_additions": 1,
                    "file_deletions": 1,
                    "file_exists": true,
                    "file_name": "libr/anal/p/anal_java.c",
                    "file_size": 11025
                }
            ],
            "interesting": {
                "reopen": false,
                "status": true
            },
            "is_parent": true,
            "sha": "cc7023dae801fc80fad3d72020f7fa071709a92b"
        },
        {
            "associated_pull_request": [],
            "date": "2018-11-19 01:28:23",
            "diff": "radareorg_radare2/issue_12188/commit_445efe306b13a202b4b91e32b68e8cec493f1325.diff",
            "diff_additions": 5,
            "diff_deletions": 6,
            "diff_file_size": 192557,
            "diff_url": "https://github.com/radareorg/radare2/commit/445efe306b13a202b4b91e32b68e8cec493f1325.diff",
            "exists": true,
            "files": [
                {
                    "file_additions": 5,
                    "file_deletions": 6,
                    "file_exists": true,
                    "file_name": "libr/core/disasm.c",
                    "file_size": 192557
                }
            ],
            "interesting": {
                "reopen": false,
                "status": true
            },
            "is_parent": false,
            "sha": "445efe306b13a202b4b91e32b68e8cec493f1325"
        },
        {
            "associated_pull_request": [
                "https://github.com/radareorg/radare2/pull/12211"
            ],
            "date": "2018-11-19 10:13:09",
            "diff": "radareorg_radare2/issue_12188/commit_f2ce982aeb064d36cc9c68764e113b1cc00546d8.diff",
            "diff_additions": 8,
            "diff_deletions": 9,
            "diff_file_size": 242940,
            "diff_url": "https://github.com/radareorg/radare2/commit/f2ce982aeb064d36cc9c68764e113b1cc00546d8.diff",
            "exists": true,
            "files": [
                {
                    "file_additions": 1,
                    "file_deletions": 1,
                    "file_exists": true,
                    "file_name": "libr/core/cmd_type.c",
                    "file_size": 50383
                },
                {
                    "file_additions": 7,
                    "file_deletions": 8,
                    "file_exists": true,
                    "file_name": "libr/core/disasm.c",
                    "file_size": 192557
                }
            ],
            "interesting": {
                "reopen": false,
                "status": false
            },
            "is_parent": false,
            "sha": "f2ce982aeb064d36cc9c68764e113b1cc00546d8"
        }
    ],
    "first_commit": "2018-11-19 01:17:57",
    "last_commit": "2018-11-19 10:13:09",
    "number": 12188,
    "pull_request": "None",
    "score": {
        "accidental_reopen_likely": false,
        "all_labels": [],
        "contains_keywords": [
            "fix"
        ],
        "fix_size": 15,
        "has_labels": [],
        "intersecting": {
            "computed_score": 0.6666666666666666,
            "final_commit_size": 15,
            "intersection_size": 10,
            "previous_commits_size": 10
        },
        "is_makefile_based": true,
        "no_new_files": [
            "libr/core/cmd_type.c"
        ],
        "no_other_files": true,
        "num_prohibited_files": 61972,
        "prohibited_files": [
            "hal/inc/pinmap_hal.h",
            "Debug/marvin.bin",
            "Debug/marvin.elf",
            "Debug/marvin.hex",
            "Debug/marvin.bin",
            "Debug/marvin.elf",
            "Debug/marvin.hex",
            "inc/spark_utilities.h",
            "Debug/marvin.bin",
            "Debug/marvin.elf"
        ],
        "reopen": false,
        "reopen_events": [
            [
                "2018-11-19 01:28:52",
                "commit"
            ],
            [
                "2018-11-19 01:51:46",
                "commit"
            ],
            [
                "2018-11-19 10:13:15",
                "closed"
            ],
            [
                "2018-11-19 10:13:15",
                "commit"
            ]
        ],
        "status": true,
        "strategy": true,
        "total_changes": 30
    }
}