{
    "commits": [
        {
            "associated_pull_request": [],
            "date": "2019-03-02 14:46:53+00:00",
            "diff": "srombauts_sqlitecpp/issue_189/commit_2cb3cb2fefedeccc66b0b508737e43fc6fbf5ccb.diff",
            "diff_additions": 13,
            "diff_deletions": 13,
            "diff_file_size": 150601,
            "diff_url": "https://github.com/SRombauts/SQLiteCpp/commit/2cb3cb2fefedeccc66b0b508737e43fc6fbf5ccb.diff",
            "exists": true,
            "files": [
                {
                    "file_additions": 1,
                    "file_deletions": 1,
                    "file_exists": true,
                    "file_name": "examples/example1/main.cpp",
                    "file_size": 22626
                },
                {
                    "file_additions": 1,
                    "file_deletions": 1,
                    "file_exists": true,
                    "file_name": "src/Backup.cpp",
                    "file_size": 2624
                },
                {
                    "file_additions": 1,
                    "file_deletions": 1,
                    "file_exists": true,
                    "file_name": "src/Column.cpp",
                    "file_size": 4066
                },
                {
                    "file_additions": 1,
                    "file_deletions": 1,
                    "file_exists": true,
                    "file_name": "src/Database.cpp",
                    "file_size": 14397
                },
                {
                    "file_additions": 1,
                    "file_deletions": 1,
                    "file_exists": true,
                    "file_name": "src/Exception.cpp",
                    "file_size": 1120
                },
                {
                    "file_additions": 1,
                    "file_deletions": 1,
                    "file_exists": true,
                    "file_name": "src/Statement.cpp",
                    "file_size": 12302
                },
                {
                    "file_additions": 1,
                    "file_deletions": 1,
                    "file_exists": true,
                    "file_name": "tests/Backup_test.cpp",
                    "file_size": 5207
                },
                {
                    "file_additions": 1,
                    "file_deletions": 1,
                    "file_exists": true,
                    "file_name": "tests/Column_test.cpp",
                    "file_size": 13227
                },
                {
                    "file_additions": 1,
                    "file_deletions": 1,
                    "file_exists": true,
                    "file_name": "tests/Database_test.cpp",
                    "file_size": 25956
                },
                {
                    "file_additions": 1,
                    "file_deletions": 1,
                    "file_exists": true,
                    "file_name": "tests/Exception_test.cpp",
                    "file_size": 2537
                },
                {
                    "file_additions": 1,
                    "file_deletions": 1,
                    "file_exists": true,
                    "file_name": "tests/Statement_test.cpp",
                    "file_size": 38606
                },
                {
                    "file_additions": 1,
                    "file_deletions": 1,
                    "file_exists": true,
                    "file_name": "tests/Transaction_test.cpp",
                    "file_size": 3857
                },
                {
                    "file_additions": 1,
                    "file_deletions": 1,
                    "file_exists": true,
                    "file_name": "tests/VariadicBind_test.cpp",
                    "file_size": 4076
                }
            ],
            "interesting": {
                "reopen": false,
                "status": false
            },
            "is_parent": true,
            "sha": "2cb3cb2fefedeccc66b0b508737e43fc6fbf5ccb"
        },
        {
            "associated_pull_request": [],
            "date": "2019-03-02 17:28:42+00:00",
            "diff": "srombauts_sqlitecpp/issue_189/commit_ec2c8bf9508a1f12101bf6fbd515a6314d84ef16.diff",
            "diff_additions": 2,
            "diff_deletions": 1,
            "diff_file_size": 13227,
            "diff_url": "https://github.com/SRombauts/SQLiteCpp/commit/ec2c8bf9508a1f12101bf6fbd515a6314d84ef16.diff",
            "exists": true,
            "files": [
                {
                    "file_additions": 2,
                    "file_deletions": 1,
                    "file_exists": true,
                    "file_name": "tests/Column_test.cpp",
                    "file_size": 13227
                }
            ],
            "interesting": {
                "reopen": false,
                "status": false
            },
            "is_parent": false,
            "sha": "ec2c8bf9508a1f12101bf6fbd515a6314d84ef16"
        },
        {
            "associated_pull_request": [],
            "date": "2019-03-02 17:28:42+00:00",
            "diff": "srombauts_sqlitecpp/issue_189/commit_7eb60cc7cadac534fdf8bde5b87f78957125b010.diff",
            "diff_additions": 6,
            "diff_deletions": 1,
            "diff_file_size": 25529,
            "diff_url": "https://github.com/SRombauts/SQLiteCpp/commit/7eb60cc7cadac534fdf8bde5b87f78957125b010.diff",
            "exists": true,
            "files": [
                {
                    "file_additions": 2,
                    "file_deletions": 0,
                    "file_exists": true,
                    "file_name": "src/Statement.cpp",
                    "file_size": 12302
                },
                {
                    "file_additions": 4,
                    "file_deletions": 1,
                    "file_exists": true,
                    "file_name": "tests/Column_test.cpp",
                    "file_size": 13227
                }
            ],
            "interesting": {
                "reopen": false,
                "status": false
            },
            "is_parent": false,
            "sha": "7eb60cc7cadac534fdf8bde5b87f78957125b010"
        },
        {
            "associated_pull_request": [],
            "date": "2019-03-02 17:28:42+00:00",
            "diff": "srombauts_sqlitecpp/issue_189/commit_ea42333662bbc1ced7417c86de23c0da6447001e.diff",
            "diff_additions": 5,
            "diff_deletions": 1,
            "diff_file_size": 25529,
            "diff_url": "https://github.com/SRombauts/SQLiteCpp/commit/ea42333662bbc1ced7417c86de23c0da6447001e.diff",
            "exists": true,
            "files": [
                {
                    "file_additions": 1,
                    "file_deletions": 0,
                    "file_exists": true,
                    "file_name": "src/Statement.cpp",
                    "file_size": 12302
                },
                {
                    "file_additions": 4,
                    "file_deletions": 1,
                    "file_exists": true,
                    "file_name": "tests/Column_test.cpp",
                    "file_size": 13227
                }
            ],
            "interesting": {
                "reopen": false,
                "status": false
            },
            "is_parent": false,
            "sha": "ea42333662bbc1ced7417c86de23c0da6447001e"
        },
        {
            "associated_pull_request": [],
            "date": "2019-03-02 17:28:42+00:00",
            "diff": "srombauts_sqlitecpp/issue_189/commit_a0465046fce1a6d6582d61711812d96be7cc38ed.diff",
            "diff_additions": 12,
            "diff_deletions": 1,
            "diff_file_size": 25529,
            "diff_url": "https://github.com/SRombauts/SQLiteCpp/commit/a0465046fce1a6d6582d61711812d96be7cc38ed.diff",
            "exists": true,
            "files": [
                {
                    "file_additions": 1,
                    "file_deletions": 0,
                    "file_exists": true,
                    "file_name": "src/Statement.cpp",
                    "file_size": 12302
                },
                {
                    "file_additions": 11,
                    "file_deletions": 1,
                    "file_exists": true,
                    "file_name": "tests/Column_test.cpp",
                    "file_size": 13227
                }
            ],
            "interesting": {
                "reopen": false,
                "status": false
            },
            "is_parent": false,
            "sha": "a0465046fce1a6d6582d61711812d96be7cc38ed"
        },
        {
            "associated_pull_request": [],
            "date": "2019-03-02 17:28:42+00:00",
            "diff": "srombauts_sqlitecpp/issue_189/commit_c4992980274da962b904e27bbe3395ab7bf369a0.diff",
            "diff_additions": 15,
            "diff_deletions": 8,
            "diff_file_size": 51485,
            "diff_url": "https://github.com/SRombauts/SQLiteCpp/commit/c4992980274da962b904e27bbe3395ab7bf369a0.diff",
            "exists": true,
            "files": [
                {
                    "file_additions": 1,
                    "file_deletions": 0,
                    "file_exists": true,
                    "file_name": "src/Statement.cpp",
                    "file_size": 12302
                },
                {
                    "file_additions": 13,
                    "file_deletions": 7,
                    "file_exists": true,
                    "file_name": "tests/Column_test.cpp",
                    "file_size": 13227
                },
                {
                    "file_additions": 1,
                    "file_deletions": 1,
                    "file_exists": true,
                    "file_name": "tests/Database_test.cpp",
                    "file_size": 25956
                }
            ],
            "interesting": {
                "reopen": false,
                "status": false
            },
            "is_parent": false,
            "sha": "c4992980274da962b904e27bbe3395ab7bf369a0"
        },
        {
            "associated_pull_request": [],
            "date": "2019-03-02 17:28:42+00:00",
            "diff": "srombauts_sqlitecpp/issue_189/commit_46838b6b798462742d5f03c15e6cd9acfa58a088.diff",
            "diff_additions": 13,
            "diff_deletions": 6,
            "diff_file_size": 13227,
            "diff_url": "https://github.com/SRombauts/SQLiteCpp/commit/46838b6b798462742d5f03c15e6cd9acfa58a088.diff",
            "exists": true,
            "files": [
                {
                    "file_additions": 13,
                    "file_deletions": 6,
                    "file_exists": true,
                    "file_name": "tests/Column_test.cpp",
                    "file_size": 13227
                }
            ],
            "interesting": {
                "reopen": true,
                "status": false
            },
            "is_parent": false,
            "sha": "46838b6b798462742d5f03c15e6cd9acfa58a088"
        },
        {
            "associated_pull_request": [],
            "date": "2019-03-02 23:37:44+00:00",
            "diff": "srombauts_sqlitecpp/issue_189/commit_777949289ddeaa3a44bb7cdc8ea74d78b559686c.diff",
            "diff_additions": 13,
            "diff_deletions": 5,
            "diff_file_size": 13227,
            "diff_url": "https://github.com/SRombauts/SQLiteCpp/commit/777949289ddeaa3a44bb7cdc8ea74d78b559686c.diff",
            "exists": true,
            "files": [
                {
                    "file_additions": 13,
                    "file_deletions": 5,
                    "file_exists": true,
                    "file_name": "tests/Column_test.cpp",
                    "file_size": 13227
                }
            ],
            "interesting": {
                "reopen": false,
                "status": false
            },
            "is_parent": false,
            "sha": "777949289ddeaa3a44bb7cdc8ea74d78b559686c"
        },
        {
            "associated_pull_request": [],
            "date": "2019-03-02 23:37:44+00:00",
            "diff": "srombauts_sqlitecpp/issue_189/commit_8bf01eda20f391e2ef55cf2cbc30fb4ac87b51a3.diff",
            "diff_additions": 7,
            "diff_deletions": 1,
            "diff_file_size": 13227,
            "diff_url": "https://github.com/SRombauts/SQLiteCpp/commit/8bf01eda20f391e2ef55cf2cbc30fb4ac87b51a3.diff",
            "exists": true,
            "files": [
                {
                    "file_additions": 7,
                    "file_deletions": 1,
                    "file_exists": true,
                    "file_name": "tests/Column_test.cpp",
                    "file_size": 13227
                }
            ],
            "interesting": {
                "reopen": false,
                "status": false
            },
            "is_parent": false,
            "sha": "8bf01eda20f391e2ef55cf2cbc30fb4ac87b51a3"
        },
        {
            "associated_pull_request": [],
            "date": "2019-03-02 23:37:44+00:00",
            "diff": "srombauts_sqlitecpp/issue_189/commit_2e69a81ccfbba7332ab0455468fa808cf76d9f4d.diff",
            "diff_additions": 7,
            "diff_deletions": 1,
            "diff_file_size": 13227,
            "diff_url": "https://github.com/SRombauts/SQLiteCpp/commit/2e69a81ccfbba7332ab0455468fa808cf76d9f4d.diff",
            "exists": true,
            "files": [
                {
                    "file_additions": 7,
                    "file_deletions": 1,
                    "file_exists": true,
                    "file_name": "tests/Column_test.cpp",
                    "file_size": 13227
                }
            ],
            "interesting": {
                "reopen": false,
                "status": false
            },
            "is_parent": false,
            "sha": "2e69a81ccfbba7332ab0455468fa808cf76d9f4d"
        },
        {
            "associated_pull_request": [],
            "date": "2019-03-02 23:37:44+00:00",
            "diff": "srombauts_sqlitecpp/issue_189/commit_2e69a81ccfbba7332ab0455468fa808cf76d9f4d.diff",
            "diff_additions": 7,
            "diff_deletions": 1,
            "diff_file_size": 13227,
            "diff_url": "https://github.com/SRombauts/SQLiteCpp/commit/2e69a81ccfbba7332ab0455468fa808cf76d9f4d.diff",
            "exists": true,
            "files": [
                {
                    "file_additions": 7,
                    "file_deletions": 1,
                    "file_exists": true,
                    "file_name": "tests/Column_test.cpp",
                    "file_size": 13227
                }
            ],
            "interesting": {
                "reopen": false,
                "status": false
            },
            "is_parent": false,
            "sha": "2e69a81ccfbba7332ab0455468fa808cf76d9f4d"
        }
    ],
    "first_commit": "2019-03-02 14:46:53+00:00",
    "last_commit": "2019-03-03 07:55:18+00:00",
    "number": 189,
    "pull_request": "None",
    "score": {
        "accidental_reopen_likely": false,
        "all_labels": [
            "bug"
        ],
        "contains_keywords": [
            "work",
            "fail",
            "chang",
            "fix",
            "test",
            "bug"
        ],
        "fix_size": 49,
        "has_labels": [
            "bug"
        ],
        "intersecting": {
            "computed_score": 1.0,
            "final_commit_size": 8,
            "intersection_size": 8,
            "previous_commits_size": 49
        },
        "is_makefile_based": true,
        "no_new_files": [],
        "no_other_files": false,
        "num_prohibited_files": 480134,
        "prohibited_files": [
            "server/src/main/java/com/genymobile/scrcpy/Device.java",
            "server/src/main/java/com/genymobile/scrcpy/wrappers/SurfaceControl.java",
            "server/src/main/java/com/genymobile/scrcpy/Device.java",
            "server/src/main/java/com/genymobile/scrcpy/wrappers/SurfaceControl.java",
            "app/meson.build",
            "app/scrcpy.1",
            "app/src/common.h",
            "app/src/scrcpy.h",
            "app/src/server.h",
            "server/src/main/java/com/genymobile/scrcpy/Workarounds.java"
        ],
        "reopen": true,
        "reopen_events": [
            [
                "2019-03-02 18:25:35+00:00",
                "closed"
            ],
            [
                "2019-03-02 18:25:35+00:00",
                "commit"
            ],
            [
                "2019-03-02 21:57:32+00:00",
                "commit"
            ],
            [
                "2019-03-02 22:06:43+00:00",
                "commit"
            ],
            [
                "2019-03-02 22:28:43+00:00",
                "commit"
            ],
            [
                "2019-03-02 22:34:58+00:00",
                "commit"
            ],
            [
                "2019-03-02 22:52:31+00:00",
                "commit"
            ],
            [
                "2019-03-02 22:52:40+00:00",
                "reopened"
            ],
            [
                "2019-03-02 23:37:52+00:00",
                "commit"
            ],
            [
                "2019-03-03 07:31:27+00:00",
                "commit"
            ],
            [
                "2019-03-03 07:55:25+00:00",
                "commit"
            ],
            [
                "2019-03-03 08:24:25+00:00",
                "closed"
            ],
            [
                "2019-03-03 08:24:25+00:00",
                "commit"
            ]
        ],
        "status": false,
        "strategy": true,
        "total_changes": 139
    }
}