{
    "covered_issues": [
        456,
        455,
        447,
        446,
        445,
        444,
        443,
        442,
        440,
        434,
        432,
        430,
        429,
        428,
        427,
        425,
        424,
        420,
        419,
        416,
        415,
        410,
        407,
        406,
        403,
        401,
        398,
        393,
        392,
        389,
        387,
        385,
        384,
        382,
        373,
        366,
        365,
        361,
        360,
        359,
        355,
        354,
        353,
        351,
        339,
        336,
        321,
        319,
        316,
        315,
        309,
        308,
        305,
        300,
        299,
        298,
        291,
        290,
        283,
        282,
        278,
        277,
        274,
        273,
        272,
        268,
        267,
        262,
        255,
        253,
        252,
        251,
        245,
        233,
        232,
        230,
        229,
        227,
        223,
        220,
        217,
        216,
        215,
        210,
        208,
        207,
        202,
        198,
        197,
        193,
        187,
        186,
        180,
        176,
        172,
        169,
        168,
        166,
        164,
        162,
        158,
        149,
        148,
        147,
        140,
        139,
        136,
        135,
        133,
        132,
        131,
        124,
        123,
        119,
        98,
        86,
        80,
        30,
        18,
        17,
        14,
        13,
        12,
        11,
        10,
        9,
        4,
        3
    ],
    "finished": true
}