{
    "commits": [
        {
            "associated_pull_request": [
                "https://github.com/gluster/glusterfs/pull/2020"
            ],
            "date": "2021-01-19 17:03:33+00:00",
            "diff": "gluster_glusterfs/issue_1991/commit_e950c6e9dd7f990fca80c0e7d5a4f624e69852ec.diff",
            "diff_additions": 2,
            "diff_deletions": 2,
            "diff_file_size": 360431,
            "diff_url": "https://github.com/gluster/glusterfs/commit/e950c6e9dd7f990fca80c0e7d5a4f624e69852ec.diff",
            "exists": true,
            "files": [
                {
                    "file_additions": 2,
                    "file_deletions": 2,
                    "file_exists": true,
                    "file_name": "xlators/cluster/dht/src/dht-common.c",
                    "file_size": 360431
                }
            ],
            "interesting": {
                "reopen": true,
                "status": false
            },
            "is_parent": false,
            "sha": "e950c6e9dd7f990fca80c0e7d5a4f624e69852ec"
        },
        {
            "associated_pull_request": [],
            "date": "2021-01-19 17:03:33+00:00",
            "diff": "gluster_glusterfs/issue_1991/commit_3a9040b39be7f81001927899b007b1322fb6810f.diff",
            "diff_additions": 2,
            "diff_deletions": 2,
            "diff_file_size": 360431,
            "diff_url": "https://github.com/gluster/glusterfs/commit/3a9040b39be7f81001927899b007b1322fb6810f.diff",
            "exists": true,
            "files": [
                {
                    "file_additions": 2,
                    "file_deletions": 2,
                    "file_exists": true,
                    "file_name": "xlators/cluster/dht/src/dht-common.c",
                    "file_size": 360431
                }
            ],
            "interesting": {
                "reopen": false,
                "status": false
            },
            "is_parent": false,
            "sha": "3a9040b39be7f81001927899b007b1322fb6810f"
        },
        {
            "associated_pull_request": [
                "https://github.com/gluster/glusterfs/pull/2032"
            ],
            "date": "2021-01-19 17:03:33+00:00",
            "diff": "gluster_glusterfs/issue_1991/commit_6175fa5304ccc8f8d9381d211f31dedc3b3a5a06.diff",
            "diff_additions": 2,
            "diff_deletions": 2,
            "diff_file_size": 360431,
            "diff_url": "https://github.com/gluster/glusterfs/commit/6175fa5304ccc8f8d9381d211f31dedc3b3a5a06.diff",
            "exists": true,
            "files": [
                {
                    "file_additions": 2,
                    "file_deletions": 2,
                    "file_exists": true,
                    "file_name": "xlators/cluster/dht/src/dht-common.c",
                    "file_size": 360431
                }
            ],
            "interesting": {
                "reopen": false,
                "status": false
            },
            "is_parent": false,
            "sha": "6175fa5304ccc8f8d9381d211f31dedc3b3a5a06"
        },
        {
            "associated_pull_request": [
                "https://github.com/gluster/glusterfs/pull/2032"
            ],
            "date": "2021-02-06 00:47:08+00:00",
            "diff": "gluster_glusterfs/issue_1991/commit_2f27e2ca1041cd8a51b62487d6f731d6ccb09d98.diff",
            "diff_additions": 2,
            "diff_deletions": 2,
            "diff_file_size": 360431,
            "diff_url": "https://github.com/gluster/glusterfs/commit/2f27e2ca1041cd8a51b62487d6f731d6ccb09d98.diff",
            "exists": true,
            "files": [
                {
                    "file_additions": 2,
                    "file_deletions": 2,
                    "file_exists": true,
                    "file_name": "xlators/cluster/dht/src/dht-common.c",
                    "file_size": 360431
                }
            ],
            "interesting": {
                "reopen": false,
                "status": false
            },
            "is_parent": false,
            "sha": "2f27e2ca1041cd8a51b62487d6f731d6ccb09d98"
        },
        {
            "associated_pull_request": [],
            "date": "2021-02-06 00:47:08+00:00",
            "diff": "gluster_glusterfs/issue_1991/commit_ed36cb8fe493d1c07ed7523c09b8a318e9a4329c.diff",
            "diff_additions": 2,
            "diff_deletions": 2,
            "diff_file_size": 360431,
            "diff_url": "https://github.com/gluster/glusterfs/commit/ed36cb8fe493d1c07ed7523c09b8a318e9a4329c.diff",
            "exists": true,
            "files": [
                {
                    "file_additions": 2,
                    "file_deletions": 2,
                    "file_exists": true,
                    "file_name": "xlators/cluster/dht/src/dht-common.c",
                    "file_size": 360431
                }
            ],
            "interesting": {
                "reopen": false,
                "status": false
            },
            "is_parent": false,
            "sha": "ed36cb8fe493d1c07ed7523c09b8a318e9a4329c"
        },
        {
            "associated_pull_request": [],
            "date": "2021-01-19 17:03:33+00:00",
            "diff": "gluster_glusterfs/issue_1991/commit_a7f6ad0c617a36414c8232cb692471703923b16d.diff",
            "diff_additions": 2,
            "diff_deletions": 2,
            "diff_file_size": 360431,
            "diff_url": "https://github.com/gluster/glusterfs/commit/a7f6ad0c617a36414c8232cb692471703923b16d.diff",
            "exists": true,
            "files": [
                {
                    "file_additions": 2,
                    "file_deletions": 2,
                    "file_exists": true,
                    "file_name": "xlators/cluster/dht/src/dht-common.c",
                    "file_size": 360431
                }
            ],
            "interesting": {
                "reopen": false,
                "status": false
            },
            "is_parent": false,
            "sha": "a7f6ad0c617a36414c8232cb692471703923b16d"
        }
    ],
    "first_commit": "2021-01-18 14:39:57+00:00",
    "last_commit": "2021-06-03 09:22:32+00:00",
    "number": 1991,
    "pull_request": "None",
    "score": {
        "accidental_reopen_likely": false,
        "all_labels": [
            "release 8",
            "release 9"
        ],
        "contains_keywords": [
            "work",
            "chang",
            "fix",
            "issu",
            "patch",
            "reason",
            "test",
            "bug",
            "problem",
            "report"
        ],
        "fix_size": 7,
        "has_labels": [],
        "intersecting": {
            "computed_score": 0.3333333333333333,
            "final_commit_size": 3,
            "intersection_size": 1,
            "previous_commits_size": 5
        },
        "is_makefile_based": true,
        "no_new_files": [],
        "no_other_files": true,
        "num_prohibited_files": 289950,
        "prohibited_files": [
            "server/src/main/java/com/genymobile/scrcpy/Device.java",
            "server/src/main/java/com/genymobile/scrcpy/wrappers/SurfaceControl.java",
            "server/src/main/java/com/genymobile/scrcpy/Device.java",
            "server/src/main/java/com/genymobile/scrcpy/wrappers/SurfaceControl.java",
            "app/meson.build",
            "app/scrcpy.1",
            "app/src/common.h",
            "app/src/scrcpy.h",
            "app/src/server.h",
            "server/src/main/java/com/genymobile/scrcpy/Workarounds.java"
        ],
        "reopen": true,
        "reopen_events": [
            [
                "2021-01-11 18:58:33+00:00",
                "commit"
            ],
            [
                "2021-01-18 14:42:39+00:00",
                "commit"
            ],
            [
                "2021-01-19 17:03:34+00:00",
                "closed"
            ],
            [
                "2021-01-19 17:03:40+00:00",
                "commit"
            ],
            [
                "2021-01-20 10:12:53+00:00",
                "reopened"
            ],
            [
                "2021-01-20 10:19:56+00:00",
                "commit"
            ],
            [
                "2021-01-20 10:21:32+00:00",
                "commit"
            ],
            [
                "2021-01-20 10:25:10+00:00",
                "commit"
            ],
            [
                "2021-01-20 10:25:47+00:00",
                "commit"
            ],
            [
                "2021-02-06 00:46:45+00:00",
                "commit"
            ],
            [
                "2021-02-06 00:47:10+00:00",
                "commit"
            ],
            [
                "2021-02-18 08:35:07+00:00",
                "closed"
            ],
            [
                "2021-05-25 11:13:23+00:00",
                "commit"
            ],
            [
                "2023-03-07 18:07:00+00:00",
                "commit"
            ]
        ],
        "status": false,
        "strategy": true,
        "total_changes": 24
    }
}