{
    "category": [
        "hardware/OS",
        "network/protocol"
    ],
    "commits": [
        {
            "associated_pull_request": [
                "https://github.com/fwupd/fwupd/pull/813"
            ],
            "date": "2018-10-19 10:09:36",
            "diff": "fwupd_fwupd/issue_815/commit_e4ad25044a07fbcea4d719a1a9776abc58a2d1f7.diff",
            "diff_additions": 30,
            "diff_deletions": 0,
            "diff_file_size": 0,
            "diff_url": "https://github.com/fwupd/fwupd/commit/e4ad25044a07fbcea4d719a1a9776abc58a2d1f7.diff",
            "exists": true,
            "files": [
                {
                    "file_additions": 30,
                    "file_deletions": 0,
                    "file_exists": false,
                    "file_name": "src/fu-common-cab.c",
                    "file_size": 0
                }
            ],
            "interesting": {
                "reopen": false,
                "status": false
            },
            "is_parent": true,
            "sha": "e4ad25044a07fbcea4d719a1a9776abc58a2d1f7"
        },
        {
            "associated_pull_request": [
                "https://github.com/fwupd/fwupd/pull/817"
            ],
            "date": "2018-10-24 11:21:48",
            "diff": "fwupd_fwupd/issue_815/commit_6a1e55394a350a2f5ac9d6d15ac7a495b9792561.diff",
            "diff_additions": 4,
            "diff_deletions": 0,
            "diff_file_size": 102763,
            "diff_url": "https://github.com/fwupd/fwupd/commit/6a1e55394a350a2f5ac9d6d15ac7a495b9792561.diff",
            "exists": true,
            "files": [
                {
                    "file_additions": 4,
                    "file_deletions": 0,
                    "file_exists": true,
                    "file_name": "src/fu-util.c",
                    "file_size": 102763
                }
            ],
            "interesting": {
                "reopen": false,
                "status": true
            },
            "is_parent": false,
            "sha": "6a1e55394a350a2f5ac9d6d15ac7a495b9792561"
        },
        {
            "associated_pull_request": [],
            "date": "2018-10-24 11:21:48",
            "diff": "fwupd_fwupd/issue_815/commit_862e26310ced8200134f0936ece3c22cf33c5ab8.diff",
            "diff_additions": 4,
            "diff_deletions": 0,
            "diff_file_size": 102763,
            "diff_url": "https://github.com/fwupd/fwupd/commit/862e26310ced8200134f0936ece3c22cf33c5ab8.diff",
            "exists": true,
            "files": [
                {
                    "file_additions": 4,
                    "file_deletions": 0,
                    "file_exists": true,
                    "file_name": "src/fu-util.c",
                    "file_size": 102763
                }
            ],
            "interesting": {
                "reopen": false,
                "status": false
            },
            "is_parent": false,
            "sha": "862e26310ced8200134f0936ece3c22cf33c5ab8"
        }
    ],
    "first_commit": "2018-10-23 08:20:02",
    "last_commit": "2018-10-24 14:51:12",
    "number": 815,
    "pull_request": "None",
    "score": {
        "accidental_reopen_likely": false,
        "all_labels": [],
        "contains_keywords": [
            "fail",
            "chang",
            "confirm",
            "error",
            "bug",
            "problem",
            "test",
            "issu",
            "work",
            "fault"
        ],
        "fix_size": 9,
        "has_labels": [],
        "intersecting": {
            "computed_score": 0.2,
            "final_commit_size": 5,
            "intersection_size": 1,
            "previous_commits_size": 5
        },
        "is_makefile_based": false,
        "no_new_files": [],
        "no_other_files": false,
        "num_prohibited_files": 49740,
        "prohibited_files": [
            "hal/inc/pinmap_hal.h",
            "Debug/marvin.bin",
            "Debug/marvin.elf",
            "Debug/marvin.hex",
            "Debug/marvin.bin",
            "Debug/marvin.elf",
            "Debug/marvin.hex",
            "inc/spark_utilities.h",
            "Debug/marvin.bin",
            "Debug/marvin.elf"
        ],
        "reopen": false,
        "reopen_events": [
            [
                "2018-10-24 11:23:09",
                "commit"
            ],
            [
                "2018-10-24 12:16:28",
                "closed"
            ],
            [
                "2018-10-24 12:16:29",
                "commit"
            ],
            [
                "2018-10-24 14:52:23",
                "commit"
            ],
            [
                "2018-10-24 14:52:44",
                "commit"
            ]
        ],
        "status": true,
        "strategy": true,
        "total_changes": 38
    }
}