{
    "category": [
        "build/refactor/preprocessing",
        "feature request"
    ],
    "commits": [
        {
            "associated_pull_request": [],
            "date": "2018-05-31 10:42:31",
            "diff": "open-mpi_ompi/issue_4451/commit_0cb8fc46c375f10328c6b1e403f8df9a5a591684.diff",
            "diff_additions": 4,
            "diff_deletions": 4,
            "diff_file_size": 0,
            "diff_url": "https://github.com/open-mpi/ompi/commit/0cb8fc46c375f10328c6b1e403f8df9a5a591684.diff",
            "exists": true,
            "files": [
                {
                    "file_additions": 1,
                    "file_deletions": 1,
                    "file_exists": false,
                    "file_name": "orte/orted/orted_submit.c",
                    "file_size": 0
                },
                {
                    "file_additions": 1,
                    "file_deletions": 1,
                    "file_exists": false,
                    "file_name": "orte/tools/orte-dvm/orte-dvm.c",
                    "file_size": 0
                },
                {
                    "file_additions": 1,
                    "file_deletions": 1,
                    "file_exists": false,
                    "file_name": "orte/tools/orterun/orterun.c",
                    "file_size": 0
                },
                {
                    "file_additions": 1,
                    "file_deletions": 1,
                    "file_exists": false,
                    "file_name": "orte/tools/prun/prun.c",
                    "file_size": 0
                }
            ],
            "interesting": {
                "reopen": true,
                "status": false
            },
            "is_parent": false,
            "sha": "0cb8fc46c375f10328c6b1e403f8df9a5a591684"
        },
        {
            "associated_pull_request": [],
            "date": "2018-08-24 23:41:05",
            "diff": "open-mpi_ompi/issue_4451/commit_0857299e711220314cd8c8af59071171811ed907.diff",
            "diff_additions": 14,
            "diff_deletions": 3,
            "diff_file_size": 0,
            "diff_url": "https://github.com/open-mpi/ompi/commit/0857299e711220314cd8c8af59071171811ed907.diff",
            "exists": true,
            "files": [
                {
                    "file_additions": 14,
                    "file_deletions": 3,
                    "file_exists": false,
                    "file_name": "orte/orted/orted_submit.c",
                    "file_size": 0
                }
            ],
            "interesting": {
                "reopen": false,
                "status": false
            },
            "is_parent": false,
            "sha": "0857299e711220314cd8c8af59071171811ed907"
        },
        {
            "associated_pull_request": [],
            "date": "2018-08-24 23:41:05",
            "diff": "open-mpi_ompi/issue_4451/commit_320c17e1e96fc1c2fc83f6cbea0a61dd5b0d9ee9.diff",
            "diff_additions": 14,
            "diff_deletions": 3,
            "diff_file_size": 0,
            "diff_url": "https://github.com/open-mpi/ompi/commit/320c17e1e96fc1c2fc83f6cbea0a61dd5b0d9ee9.diff",
            "exists": true,
            "files": [
                {
                    "file_additions": 14,
                    "file_deletions": 3,
                    "file_exists": false,
                    "file_name": "orte/orted/orted_submit.c",
                    "file_size": 0
                }
            ],
            "interesting": {
                "reopen": false,
                "status": true
            },
            "is_parent": false,
            "sha": "320c17e1e96fc1c2fc83f6cbea0a61dd5b0d9ee9"
        },
        {
            "associated_pull_request": [],
            "date": "2018-08-24 23:41:05",
            "diff": "open-mpi_ompi/issue_4451/commit_c19f983592a141bf809118df1a57109cc075c899.diff",
            "diff_additions": 15,
            "diff_deletions": 3,
            "diff_file_size": 0,
            "diff_url": "https://github.com/open-mpi/ompi/commit/c19f983592a141bf809118df1a57109cc075c899.diff",
            "exists": true,
            "files": [
                {
                    "file_additions": 15,
                    "file_deletions": 3,
                    "file_exists": false,
                    "file_name": "orte/orted/orted_submit.c",
                    "file_size": 0
                }
            ],
            "interesting": {
                "reopen": false,
                "status": true
            },
            "is_parent": false,
            "sha": "c19f983592a141bf809118df1a57109cc075c899"
        },
        {
            "associated_pull_request": [],
            "date": "2018-08-24 23:41:05",
            "diff": "open-mpi_ompi/issue_4451/commit_d022211c608105995a7daf54c83486f545bb603c.diff",
            "diff_additions": 15,
            "diff_deletions": 3,
            "diff_file_size": 0,
            "diff_url": "https://github.com/open-mpi/ompi/commit/d022211c608105995a7daf54c83486f545bb603c.diff",
            "exists": true,
            "files": [
                {
                    "file_additions": 15,
                    "file_deletions": 3,
                    "file_exists": false,
                    "file_name": "orte/orted/orted_submit.c",
                    "file_size": 0
                }
            ],
            "interesting": {
                "reopen": false,
                "status": true
            },
            "is_parent": false,
            "sha": "d022211c608105995a7daf54c83486f545bb603c"
        },
        {
            "associated_pull_request": [
                "https://github.com/open-mpi/ompi/pull/5597"
            ],
            "date": "2018-08-24 23:41:05",
            "diff": "open-mpi_ompi/issue_4451/commit_7f1444d5f9e504ff50392a0f73e81787c01b7a0e.diff",
            "diff_additions": 15,
            "diff_deletions": 3,
            "diff_file_size": 0,
            "diff_url": "https://github.com/open-mpi/ompi/commit/7f1444d5f9e504ff50392a0f73e81787c01b7a0e.diff",
            "exists": true,
            "files": [
                {
                    "file_additions": 15,
                    "file_deletions": 3,
                    "file_exists": false,
                    "file_name": "orte/orted/orted_submit.c",
                    "file_size": 0
                }
            ],
            "interesting": {
                "reopen": false,
                "status": false
            },
            "is_parent": false,
            "sha": "7f1444d5f9e504ff50392a0f73e81787c01b7a0e"
        },
        {
            "associated_pull_request": [
                "https://github.com/open-mpi/ompi/pull/5598"
            ],
            "date": "2018-08-24 23:41:05",
            "diff": "open-mpi_ompi/issue_4451/commit_b4ae5d005f102db3ae2642a3595397ecce3ecf3b.diff",
            "diff_additions": 15,
            "diff_deletions": 3,
            "diff_file_size": 0,
            "diff_url": "https://github.com/open-mpi/ompi/commit/b4ae5d005f102db3ae2642a3595397ecce3ecf3b.diff",
            "exists": true,
            "files": [
                {
                    "file_additions": 15,
                    "file_deletions": 3,
                    "file_exists": false,
                    "file_name": "orte/orted/orted_submit.c",
                    "file_size": 0
                }
            ],
            "interesting": {
                "reopen": false,
                "status": false
            },
            "is_parent": false,
            "sha": "b4ae5d005f102db3ae2642a3595397ecce3ecf3b"
        }
    ],
    "first_commit": "2018-05-31 10:47:59",
    "last_commit": "2018-08-25 03:24:22",
    "number": 4451,
    "pull_request": "None",
    "score": {
        "accidental_reopen_likely": false,
        "all_labels": [
            "enhancement"
        ],
        "contains_keywords": [
            "work",
            "report",
            "fix",
            "CI",
            "reason",
            "patch",
            "fault",
            "bug",
            "test",
            "remov",
            "issu",
            "perform",
            "warn",
            "error",
            "chang",
            "confirm",
            "fail",
            "problem"
        ],
        "fix_size": 27,
        "has_labels": [],
        "intersecting": {
            "computed_score": 1.0,
            "final_commit_size": 19,
            "intersection_size": 19,
            "previous_commits_size": 27
        },
        "is_makefile_based": true,
        "no_new_files": [],
        "no_other_files": false,
        "num_prohibited_files": 73570,
        "prohibited_files": [
            "kill.h",
            "meminfo.h",
            "kill.h",
            "meminfo.h",
            "kill.h",
            "meminfo.h",
            "testsuite_cli_test.go",
            "testsuite_cli_test.go",
            "common.mk",
            "i3bar/include/draw_util.h"
        ],
        "reopen": true,
        "reopen_events": [
            [
                "2018-05-11 14:11:02",
                "commit"
            ],
            [
                "2018-05-30 20:50:50",
                "closed"
            ],
            [
                "2018-05-31 10:56:18",
                "commit"
            ],
            [
                "2018-05-31 19:16:21",
                "reopened"
            ],
            [
                "2018-08-24 23:42:13",
                "commit"
            ],
            [
                "2018-08-24 23:43:50",
                "commit"
            ],
            [
                "2018-08-24 23:49:54",
                "commit"
            ],
            [
                "2018-08-25 01:10:12",
                "commit"
            ],
            [
                "2018-08-25 01:13:08",
                "commit"
            ],
            [
                "2018-08-25 03:20:59",
                "closed"
            ],
            [
                "2018-08-25 03:24:32",
                "commit"
            ],
            [
                "2020-04-09 18:54:12",
                "commit"
            ],
            [
                "2020-04-09 19:24:07",
                "commit"
            ],
            [
                "2020-04-09 20:11:21",
                "commit"
            ],
            [
                "2020-04-09 22:40:17",
                "commit"
            ],
            [
                "2020-04-09 23:12:52",
                "commit"
            ]
        ],
        "status": false,
        "strategy": true,
        "total_changes": 114
    }
}