{
    "commits": [
        {
            "associated_pull_request": [],
            "date": "2023-05-29 18:46:58+00:00",
            "diff": "libsdl-org_sdl/issue_7070/commit_d275851dfbd586910ddf1fbed8ef54714afbe6c4.diff",
            "diff_additions": 10,
            "diff_deletions": 5,
            "diff_file_size": 54535,
            "diff_url": "https://github.com/libsdl-org/SDL/commit/d275851dfbd586910ddf1fbed8ef54714afbe6c4.diff",
            "exists": true,
            "files": [
                {
                    "file_additions": 10,
                    "file_deletions": 5,
                    "file_exists": true,
                    "file_name": "src/video/windows/SDL_windowswindow.c",
                    "file_size": 54535
                }
            ],
            "interesting": {
                "reopen": false,
                "status": false
            },
            "is_parent": true,
            "sha": "d275851dfbd586910ddf1fbed8ef54714afbe6c4"
        },
        {
            "associated_pull_request": [],
            "date": "2023-05-30 21:04:31+00:00",
            "diff": "libsdl-org_sdl/issue_7070/commit_379a6f4dabc448d37a5823724d507967e2e069eb.diff",
            "diff_additions": 51,
            "diff_deletions": 0,
            "diff_file_size": 71091,
            "diff_url": "https://github.com/libsdl-org/SDL/commit/379a6f4dabc448d37a5823724d507967e2e069eb.diff",
            "exists": true,
            "files": [
                {
                    "file_additions": 51,
                    "file_deletions": 0,
                    "file_exists": true,
                    "file_name": "src/video/x11/SDL_x11window.c",
                    "file_size": 71091
                }
            ],
            "interesting": {
                "reopen": false,
                "status": false
            },
            "is_parent": false,
            "sha": "379a6f4dabc448d37a5823724d507967e2e069eb"
        },
        {
            "associated_pull_request": [],
            "date": "2023-05-30 21:04:31+00:00",
            "diff": "libsdl-org_sdl/issue_7070/commit_19c10b41fd0435e259c1da675733cc446541f9fa.diff",
            "diff_additions": 51,
            "diff_deletions": 0,
            "diff_file_size": 71091,
            "diff_url": "https://github.com/libsdl-org/SDL/commit/19c10b41fd0435e259c1da675733cc446541f9fa.diff",
            "exists": true,
            "files": [
                {
                    "file_additions": 51,
                    "file_deletions": 0,
                    "file_exists": true,
                    "file_name": "src/video/x11/SDL_x11window.c",
                    "file_size": 71091
                }
            ],
            "interesting": {
                "reopen": false,
                "status": false
            },
            "is_parent": false,
            "sha": "19c10b41fd0435e259c1da675733cc446541f9fa"
        },
        {
            "associated_pull_request": [],
            "date": "2023-06-22 13:19:30+00:00",
            "diff": "libsdl-org_sdl/issue_7070/commit_1e8eef0ec49d65c0edf89e444fc16d9a0f6dbbf3.diff",
            "diff_additions": 3618,
            "diff_deletions": 1262,
            "diff_file_size": 2565055,
            "diff_url": "https://github.com/libsdl-org/SDL/commit/1e8eef0ec49d65c0edf89e444fc16d9a0f6dbbf3.diff",
            "exists": true,
            "files": [
                {
                    "file_additions": 17,
                    "file_deletions": 0,
                    "file_exists": true,
                    "file_name": "src/SDL_hints.c",
                    "file_size": 8982
                },
                {
                    "file_additions": 7,
                    "file_deletions": 1,
                    "file_exists": true,
                    "file_name": "src/audio/pipewire/SDL_pipewire.c",
                    "file_size": 44228
                },
                {
                    "file_additions": 73,
                    "file_deletions": 11,
                    "file_exists": true,
                    "file_name": "src/core/android/SDL_android.c",
                    "file_size": 98469
                },
                {
                    "file_additions": 76,
                    "file_deletions": 17,
                    "file_exists": true,
                    "file_name": "src/core/linux/SDL_dbus.c",
                    "file_size": 23919
                },
                {
                    "file_additions": 1,
                    "file_deletions": 1,
                    "file_exists": true,
                    "file_name": "src/core/linux/SDL_evdev.c",
                    "file_size": 35981
                },
                {
                    "file_additions": 25,
                    "file_deletions": 6,
                    "file_exists": true,
                    "file_name": "src/core/linux/SDL_evdev_capabilities.c",
                    "file_size": 6240
                },
                {
                    "file_additions": 6,
                    "file_deletions": 1,
                    "file_exists": true,
                    "file_name": "src/core/linux/SDL_ibus.c",
                    "file_size": 23687
                },
                {
                    "file_additions": 10,
                    "file_deletions": 2,
                    "file_exists": true,
                    "file_name": "src/core/linux/SDL_udev.c",
                    "file_size": 17860
                },
                {
                    "file_additions": 76,
                    "file_deletions": 0,
                    "file_exists": true,
                    "file_name": "src/core/unix/SDL_appid.c",
                    "file_size": 2355
                },
                {
                    "file_additions": 9,
                    "file_deletions": 9,
                    "file_exists": true,
                    "file_name": "src/dynapi/SDL_dynapi.c",
                    "file_size": 29343
                },
                {
                    "file_additions": 10,
                    "file_deletions": 2,
                    "file_exists": true,
                    "file_name": "src/events/SDL_displayevents.c",
                    "file_size": 2032
                },
                {
                    "file_additions": 32,
                    "file_deletions": 7,
                    "file_exists": true,
                    "file_name": "src/events/SDL_events.c",
                    "file_size": 51007
                },
                {
                    "file_additions": 17,
                    "file_deletions": 9,
                    "file_exists": true,
                    "file_name": "src/hidapi/SDL_hidapi.c",
                    "file_size": 62634
                },
                {
                    "file_additions": 1,
                    "file_deletions": 1,
                    "file_exists": true,
                    "file_name": "src/hidapi/android/hid.cpp",
                    "file_size": 41117
                },
                {
                    "file_additions": 64,
                    "file_deletions": 205,
                    "file_exists": true,
                    "file_name": "src/hidapi/libusb/hid.c",
                    "file_size": 61093
                },
                {
                    "file_additions": 16,
                    "file_deletions": 2,
                    "file_exists": true,
                    "file_name": "src/hidapi/linux/hid.c",
                    "file_size": 39471
                },
                {
                    "file_additions": 24,
                    "file_deletions": 4,
                    "file_exists": true,
                    "file_name": "src/hidapi/mac/hid.c",
                    "file_size": 45108
                },
                {
                    "file_additions": 87,
                    "file_deletions": 6,
                    "file_exists": true,
                    "file_name": "src/hidapi/windows/hid.c",
                    "file_size": 48705
                },
                {
                    "file_additions": 118,
                    "file_deletions": 86,
                    "file_exists": true,
                    "file_name": "src/joystick/SDL_gamepad.c",
                    "file_size": 116661
                },
                {
                    "file_additions": 314,
                    "file_deletions": 10,
                    "file_exists": true,
                    "file_name": "src/joystick/SDL_joystick.c",
                    "file_size": 105592
                },
                {
                    "file_additions": 2,
                    "file_deletions": 2,
                    "file_exists": true,
                    "file_name": "src/joystick/hidapi/SDL_hidapi_ps3.c",
                    "file_size": 38708
                },
                {
                    "file_additions": 163,
                    "file_deletions": 132,
                    "file_exists": true,
                    "file_name": "src/joystick/hidapi/SDL_hidapi_switch.c",
                    "file_size": 105567
                },
                {
                    "file_additions": 2,
                    "file_deletions": 4,
                    "file_exists": true,
                    "file_name": "src/joystick/hidapi/SDL_hidapi_xbox360.c",
                    "file_size": 14981
                },
                {
                    "file_additions": 22,
                    "file_deletions": 3,
                    "file_exists": true,
                    "file_name": "src/joystick/hidapi/SDL_hidapijoystick.c",
                    "file_size": 53357
                },
                {
                    "file_additions": 167,
                    "file_deletions": 18,
                    "file_exists": true,
                    "file_name": "src/joystick/linux/SDL_sysjoystick.c",
                    "file_size": 88871
                },
                {
                    "file_additions": 2,
                    "file_deletions": 2,
                    "file_exists": true,
                    "file_name": "src/joystick/windows/SDL_dinputjoystick.c",
                    "file_size": 48638
                },
                {
                    "file_additions": 58,
                    "file_deletions": 23,
                    "file_exists": true,
                    "file_name": "src/joystick/windows/SDL_rawinputjoystick.c",
                    "file_size": 84458
                },
                {
                    "file_additions": 11,
                    "file_deletions": 8,
                    "file_exists": true,
                    "file_name": "src/joystick/windows/SDL_windows_gaming_input.c",
                    "file_size": 41949
                },
                {
                    "file_additions": 9,
                    "file_deletions": 4,
                    "file_exists": true,
                    "file_name": "src/joystick/windows/SDL_windowsjoystick.c",
                    "file_size": 24991
                },
                {
                    "file_additions": 7,
                    "file_deletions": 7,
                    "file_exists": true,
                    "file_name": "src/joystick/windows/SDL_xinputjoystick.c",
                    "file_size": 22404
                },
                {
                    "file_additions": 15,
                    "file_deletions": 15,
                    "file_exists": true,
                    "file_name": "src/power/linux/SDL_syspower.c",
                    "file_size": 20624
                },
                {
                    "file_additions": 5,
                    "file_deletions": 0,
                    "file_exists": true,
                    "file_name": "src/render/SDL_render.c",
                    "file_size": 140809
                },
                {
                    "file_additions": 9,
                    "file_deletions": 0,
                    "file_exists": true,
                    "file_name": "src/sensor/SDL_sensor.c",
                    "file_size": 16366
                },
                {
                    "file_additions": 143,
                    "file_deletions": 50,
                    "file_exists": true,
                    "file_name": "src/sensor/android/SDL_androidsensor.c",
                    "file_size": 8514
                },
                {
                    "file_additions": 2,
                    "file_deletions": 1,
                    "file_exists": true,
                    "file_name": "src/stdlib/SDL_iconv.c",
                    "file_size": 25229
                },
                {
                    "file_additions": 21,
                    "file_deletions": 42,
                    "file_exists": true,
                    "file_name": "src/stdlib/SDL_stdlib.c",
                    "file_size": 14589
                },
                {
                    "file_additions": 1,
                    "file_deletions": 1,
                    "file_exists": true,
                    "file_name": "src/stdlib/SDL_string.c",
                    "file_size": 59003
                },
                {
                    "file_additions": 15,
                    "file_deletions": 18,
                    "file_exists": true,
                    "file_name": "src/test/SDL_test_common.c",
                    "file_size": 96334
                },
                {
                    "file_additions": 398,
                    "file_deletions": 157,
                    "file_exists": true,
                    "file_name": "src/video/SDL_blit_0.c",
                    "file_size": 22471
                },
                {
                    "file_additions": 74,
                    "file_deletions": 25,
                    "file_exists": true,
                    "file_name": "src/video/SDL_video.c",
                    "file_size": 151829
                },
                {
                    "file_additions": 6,
                    "file_deletions": 4,
                    "file_exists": true,
                    "file_name": "src/video/android/SDL_androidevents.c",
                    "file_size": 8810
                },
                {
                    "file_additions": 2,
                    "file_deletions": 1,
                    "file_exists": true,
                    "file_name": "src/video/android/SDL_androidvideo.c",
                    "file_size": 10089
                },
                {
                    "file_additions": 304,
                    "file_deletions": 0,
                    "file_exists": true,
                    "file_name": "src/video/gdk/SDL_gdktextinput.cpp",
                    "file_size": 9671
                },
                {
                    "file_additions": 20,
                    "file_deletions": 11,
                    "file_exists": true,
                    "file_name": "src/video/wayland/SDL_waylandclipboard.c",
                    "file_size": 6668
                },
                {
                    "file_additions": 7,
                    "file_deletions": 62,
                    "file_exists": true,
                    "file_name": "src/video/wayland/SDL_waylandvideo.c",
                    "file_size": 40229
                },
                {
                    "file_additions": 84,
                    "file_deletions": 4,
                    "file_exists": true,
                    "file_name": "src/video/wayland/SDL_waylandwindow.c",
                    "file_size": 97578
                },
                {
                    "file_additions": 42,
                    "file_deletions": 23,
                    "file_exists": true,
                    "file_name": "src/video/windows/SDL_windowsmodes.c",
                    "file_size": 24011
                },
                {
                    "file_additions": 19,
                    "file_deletions": 0,
                    "file_exists": true,
                    "file_name": "src/video/windows/SDL_windowsvideo.c",
                    "file_size": 26935
                },
                {
                    "file_additions": 10,
                    "file_deletions": 5,
                    "file_exists": true,
                    "file_name": "src/video/windows/SDL_windowswindow.c",
                    "file_size": 54535
                },
                {
                    "file_additions": 13,
                    "file_deletions": 5,
                    "file_exists": true,
                    "file_name": "src/video/x11/SDL_x11clipboard.c",
                    "file_size": 9673
                },
                {
                    "file_additions": 14,
                    "file_deletions": 1,
                    "file_exists": true,
                    "file_name": "src/video/x11/SDL_x11events.c",
                    "file_size": 66765
                },
                {
                    "file_additions": 1,
                    "file_deletions": 1,
                    "file_exists": true,
                    "file_name": "src/video/x11/SDL_x11keyboard.c",
                    "file_size": 16229
                },
                {
                    "file_additions": 29,
                    "file_deletions": 16,
                    "file_exists": true,
                    "file_name": "src/video/x11/SDL_x11modes.c",
                    "file_size": 36100
                },
                {
                    "file_additions": 0,
                    "file_deletions": 45,
                    "file_exists": true,
                    "file_name": "src/video/x11/SDL_x11video.c",
                    "file_size": 15618
                },
                {
                    "file_additions": 152,
                    "file_deletions": 140,
                    "file_exists": true,
                    "file_name": "src/video/x11/SDL_x11window.c",
                    "file_size": 71091
                },
                {
                    "file_additions": 1,
                    "file_deletions": 1,
                    "file_exists": true,
                    "file_name": "test/testautomation_clipboard.c",
                    "file_size": 21124
                },
                {
                    "file_additions": 3,
                    "file_deletions": 0,
                    "file_exists": true,
                    "file_name": "test/testautomation_events.c",
                    "file_size": 6418
                },
                {
                    "file_additions": 19,
                    "file_deletions": 5,
                    "file_exists": true,
                    "file_name": "test/testautomation_guid.c",
                    "file_size": 4733
                },
                {
                    "file_additions": 1,
                    "file_deletions": 0,
                    "file_exists": true,
                    "file_name": "test/testautomation_hints.c",
                    "file_size": 9158
                },
                {
                    "file_additions": 778,
                    "file_deletions": 45,
                    "file_exists": true,
                    "file_name": "test/testevdev.c",
                    "file_size": 71054
                },
                {
                    "file_additions": 4,
                    "file_deletions": 1,
                    "file_exists": true,
                    "file_name": "test/testhaptic.c",
                    "file_size": 14390
                }
            ],
            "interesting": {
                "reopen": false,
                "status": false
            },
            "is_parent": false,
            "sha": "1e8eef0ec49d65c0edf89e444fc16d9a0f6dbbf3"
        },
        {
            "associated_pull_request": [],
            "date": "2023-06-22 16:25:42+00:00",
            "diff": "libsdl-org_sdl/issue_7070/commit_1d4928c59a191b815438efe0f58e1baaa6892efc.diff",
            "diff_additions": 3319,
            "diff_deletions": 0,
            "diff_file_size": 151829,
            "diff_url": "https://github.com/libsdl-org/SDL/commit/1d4928c59a191b815438efe0f58e1baaa6892efc.diff",
            "exists": true,
            "files": [
                {
                    "file_additions": 10,
                    "file_deletions": 0,
                    "file_exists": true,
                    "file_name": "src/video/SDL_video.c",
                    "file_size": 151829
                },
                {
                    "file_additions": 919,
                    "file_deletions": 0,
                    "file_exists": false,
                    "file_name": "src/video/SDL_video_capture.c",
                    "file_size": 0
                },
                {
                    "file_additions": 962,
                    "file_deletions": 0,
                    "file_exists": false,
                    "file_name": "src/video/SDL_video_capture_v4l2.c",
                    "file_size": 0
                },
                {
                    "file_additions": 678,
                    "file_deletions": 0,
                    "file_exists": false,
                    "file_name": "src/video/android/SDL_android_video_capture.c",
                    "file_size": 0
                },
                {
                    "file_additions": 750,
                    "file_deletions": 0,
                    "file_exists": false,
                    "file_name": "test/testvideocapture.c",
                    "file_size": 0
                }
            ],
            "interesting": {
                "reopen": true,
                "status": false
            },
            "is_parent": false,
            "sha": "1d4928c59a191b815438efe0f58e1baaa6892efc"
        },
        {
            "associated_pull_request": [],
            "date": "2023-08-01 17:55:04+00:00",
            "diff": "libsdl-org_sdl/issue_7070/commit_3030fd815c4d05b5286f7cb9c8a8a2b42cff7bb1.diff",
            "diff_additions": 1,
            "diff_deletions": 1,
            "diff_file_size": 71091,
            "diff_url": "https://github.com/libsdl-org/SDL/commit/3030fd815c4d05b5286f7cb9c8a8a2b42cff7bb1.diff",
            "exists": true,
            "files": [
                {
                    "file_additions": 1,
                    "file_deletions": 1,
                    "file_exists": true,
                    "file_name": "src/video/x11/SDL_x11window.c",
                    "file_size": 71091
                }
            ],
            "interesting": {
                "reopen": false,
                "status": false
            },
            "is_parent": false,
            "sha": "3030fd815c4d05b5286f7cb9c8a8a2b42cff7bb1"
        },
        {
            "associated_pull_request": [],
            "date": "2023-08-01 17:55:04+00:00",
            "diff": "libsdl-org_sdl/issue_7070/commit_e73a81b28adbc293cfb3c2bb2013052712f2d59b.diff",
            "diff_additions": 1,
            "diff_deletions": 1,
            "diff_file_size": 71091,
            "diff_url": "https://github.com/libsdl-org/SDL/commit/e73a81b28adbc293cfb3c2bb2013052712f2d59b.diff",
            "exists": true,
            "files": [
                {
                    "file_additions": 1,
                    "file_deletions": 1,
                    "file_exists": true,
                    "file_name": "src/video/x11/SDL_x11window.c",
                    "file_size": 71091
                }
            ],
            "interesting": {
                "reopen": false,
                "status": false
            },
            "is_parent": false,
            "sha": "e73a81b28adbc293cfb3c2bb2013052712f2d59b"
        }
    ],
    "first_commit": "2023-05-29 18:47:53+00:00",
    "last_commit": "2023-08-01 17:55:58+00:00",
    "number": 7070,
    "pull_request": "None",
    "score": {
        "accidental_reopen_likely": false,
        "all_labels": [],
        "contains_keywords": [
            "work",
            "fail",
            "chang",
            "fix",
            "issu",
            "CI",
            "patch",
            "debug",
            "reason",
            "test",
            "attempt",
            "fault",
            "remov",
            "warn",
            "bug",
            "error",
            "crash",
            "report"
        ],
        "fix_size": 4283,
        "has_labels": [],
        "intersecting": {
            "computed_score": 1.0,
            "final_commit_size": 2,
            "intersection_size": 2,
            "previous_commits_size": 4283
        },
        "is_makefile_based": true,
        "no_new_files": [],
        "no_other_files": false,
        "num_prohibited_files": 136141,
        "prohibited_files": [
            "server/src/main/java/com/genymobile/scrcpy/Device.java",
            "server/src/main/java/com/genymobile/scrcpy/wrappers/SurfaceControl.java",
            "server/src/main/java/com/genymobile/scrcpy/Device.java",
            "server/src/main/java/com/genymobile/scrcpy/wrappers/SurfaceControl.java",
            "app/meson.build",
            "app/scrcpy.1",
            "app/src/common.h",
            "app/src/scrcpy.h",
            "app/src/server.h",
            "server/src/main/java/com/genymobile/scrcpy/Workarounds.java"
        ],
        "reopen": true,
        "reopen_events": [
            [
                "2023-05-30 21:05:47+00:00",
                "commit"
            ],
            [
                "2023-05-30 21:10:09+00:00",
                "closed"
            ],
            [
                "2023-05-30 21:10:09+00:00",
                "commit"
            ],
            [
                "2023-06-22 13:21:03+00:00",
                "commit"
            ],
            [
                "2023-06-22 16:27:24+00:00",
                "commit"
            ],
            [
                "2023-07-02 03:00:55+00:00",
                "reopened"
            ],
            [
                "2023-07-26 16:25:27+00:00",
                "closed"
            ],
            [
                "2023-08-01 17:55:40+00:00",
                "commit"
            ],
            [
                "2023-08-01 17:56:17+00:00",
                "commit"
            ]
        ],
        "status": false,
        "strategy": true,
        "total_changes": 8320
    }
}