{
    "category": [
        "hardware/OS",
        "feature request"
    ],
    "commits": [
        {
            "associated_pull_request": [],
            "date": "2019-07-04 11:25:46",
            "diff": "",
            "diff_additions": 0,
            "diff_deletions": 0,
            "diff_file_size": 0,
            "diff_url": "https://github.com/containers/crun/commit/7f363a642f38bcd0aad8c6bccfb6c2d6cd2998fa.diff",
            "exists": true,
            "files": [],
            "interesting": {
                "reopen": false,
                "status": false
            },
            "is_parent": true,
            "sha": "7f363a642f38bcd0aad8c6bccfb6c2d6cd2998fa"
        },
        {
            "associated_pull_request": [],
            "date": "2019-07-07 21:02:49",
            "diff": "containers_crun/issue_12/commit_8d418806bb117ba50e56be6eb1936232dc5e1fd9.diff",
            "diff_additions": 113,
            "diff_deletions": 38,
            "diff_file_size": 230739,
            "diff_url": "https://github.com/containers/crun/commit/8d418806bb117ba50e56be6eb1936232dc5e1fd9.diff",
            "exists": true,
            "files": [
                {
                    "file_additions": 60,
                    "file_deletions": 14,
                    "file_exists": true,
                    "file_name": "src/libcrun/container.c",
                    "file_size": 108243
                },
                {
                    "file_additions": 53,
                    "file_deletions": 24,
                    "file_exists": true,
                    "file_name": "src/libcrun/linux.c",
                    "file_size": 122496
                }
            ],
            "interesting": {
                "reopen": false,
                "status": true
            },
            "is_parent": false,
            "sha": "8d418806bb117ba50e56be6eb1936232dc5e1fd9"
        },
        {
            "associated_pull_request": [],
            "date": "2019-07-07 21:02:49",
            "diff": "containers_crun/issue_12/commit_8fb02d5168173441359f95fbefd3aa12da5437f6.diff",
            "diff_additions": 117,
            "diff_deletions": 40,
            "diff_file_size": 230739,
            "diff_url": "https://github.com/containers/crun/commit/8fb02d5168173441359f95fbefd3aa12da5437f6.diff",
            "exists": true,
            "files": [
                {
                    "file_additions": 64,
                    "file_deletions": 16,
                    "file_exists": true,
                    "file_name": "src/libcrun/container.c",
                    "file_size": 108243
                },
                {
                    "file_additions": 53,
                    "file_deletions": 24,
                    "file_exists": true,
                    "file_name": "src/libcrun/linux.c",
                    "file_size": 122496
                }
            ],
            "interesting": {
                "reopen": false,
                "status": true
            },
            "is_parent": false,
            "sha": "8fb02d5168173441359f95fbefd3aa12da5437f6"
        },
        {
            "associated_pull_request": [
                "https://github.com/containers/crun/pull/52"
            ],
            "date": "2019-07-07 21:02:49",
            "diff": "containers_crun/issue_12/commit_c8ec5bfa0c733eccc4a0a9a5c71f60c0dd2721a8.diff",
            "diff_additions": 121,
            "diff_deletions": 40,
            "diff_file_size": 230739,
            "diff_url": "https://github.com/containers/crun/commit/c8ec5bfa0c733eccc4a0a9a5c71f60c0dd2721a8.diff",
            "exists": true,
            "files": [
                {
                    "file_additions": 64,
                    "file_deletions": 16,
                    "file_exists": true,
                    "file_name": "src/libcrun/container.c",
                    "file_size": 108243
                },
                {
                    "file_additions": 57,
                    "file_deletions": 24,
                    "file_exists": true,
                    "file_name": "src/libcrun/linux.c",
                    "file_size": 122496
                }
            ],
            "interesting": {
                "reopen": false,
                "status": false
            },
            "is_parent": false,
            "sha": "c8ec5bfa0c733eccc4a0a9a5c71f60c0dd2721a8"
        }
    ],
    "first_commit": "2019-07-04 11:25:46",
    "last_commit": "2019-07-08 07:34:05",
    "number": 12,
    "pull_request": "None",
    "score": {
        "accidental_reopen_likely": false,
        "all_labels": [],
        "contains_keywords": [
            "issu"
        ],
        "fix_size": 171,
        "has_labels": [],
        "intersecting": {
            "computed_score": 0.88,
            "final_commit_size": 150,
            "intersection_size": 132,
            "previous_commits_size": 153
        },
        "is_makefile_based": true,
        "no_new_files": [],
        "no_other_files": false,
        "num_prohibited_files": 68064,
        "prohibited_files": [
            "kill.h",
            "meminfo.h",
            "kill.h",
            "meminfo.h",
            "kill.h",
            "meminfo.h",
            "testsuite_cli_test.go",
            "testsuite_cli_test.go",
            "common.mk",
            "i3bar/include/draw_util.h"
        ],
        "reopen": false,
        "reopen_events": [
            [
                "2019-07-07 21:07:09",
                "commit"
            ],
            [
                "2019-07-07 21:46:59",
                "commit"
            ],
            [
                "2019-07-08 07:34:17",
                "commit"
            ],
            [
                "2019-07-08 08:06:29",
                "closed"
            ]
        ],
        "status": true,
        "strategy": true,
        "total_changes": 469
    }
}