{
    "commits": [
        {
            "associated_pull_request": [
                "https://github.com/ARMmbed/mbed-os/pull/4282"
            ],
            "date": "2017-05-26 15:31:05+00:00",
            "diff": "armmbed_mbed-os/issue_3863/commit_58e88813a940316972da493b094242f7c93bdf40.diff",
            "diff_additions": 117,
            "diff_deletions": 1,
            "diff_file_size": 0,
            "diff_url": "https://github.com/ARMmbed/mbed-os/commit/58e88813a940316972da493b094242f7c93bdf40.diff",
            "exists": true,
            "files": [
                {
                    "file_additions": 0,
                    "file_deletions": 1,
                    "file_exists": false,
                    "file_name": "TESTS/mbed_hal/flash/functional_tests/main.cpp",
                    "file_size": 0
                },
                {
                    "file_additions": 117,
                    "file_deletions": 0,
                    "file_exists": false,
                    "file_name": "targets/TARGET_NORDIC/TARGET_NRF5/flash_api.c",
                    "file_size": 0
                }
            ],
            "interesting": {
                "reopen": false,
                "status": false
            },
            "is_parent": true,
            "sha": "58e88813a940316972da493b094242f7c93bdf40"
        },
        {
            "associated_pull_request": [
                "https://github.com/ARMmbed/mbed-os/pull/4165"
            ],
            "date": "2017-05-16 08:37:50+00:00",
            "diff": "armmbed_mbed-os/issue_3863/commit_b6581d317c1bf3a076e2588b45d346ef9ce3d441.diff",
            "diff_additions": 2,
            "diff_deletions": 2,
            "diff_file_size": 0,
            "diff_url": "https://github.com/ARMmbed/mbed-os/commit/b6581d317c1bf3a076e2588b45d346ef9ce3d441.diff",
            "exists": true,
            "files": [
                {
                    "file_additions": 2,
                    "file_deletions": 2,
                    "file_exists": false,
                    "file_name": "drivers/CAN.cpp",
                    "file_size": 0
                }
            ],
            "interesting": {
                "reopen": false,
                "status": false
            },
            "is_parent": true,
            "sha": "b6581d317c1bf3a076e2588b45d346ef9ce3d441"
        },
        {
            "associated_pull_request": [
                "https://github.com/ARMmbed/mbed-os/pull/4165"
            ],
            "date": "2017-05-26 15:45:19+00:00",
            "diff": "armmbed_mbed-os/issue_3863/commit_d11289b576140b0064a542a3cc242c380ea99686.diff",
            "diff_additions": 200,
            "diff_deletions": 39,
            "diff_file_size": 112573,
            "diff_url": "https://github.com/ARMmbed/mbed-os/commit/d11289b576140b0064a542a3cc242c380ea99686.diff",
            "exists": true,
            "files": [
                {
                    "file_additions": 11,
                    "file_deletions": 0,
                    "file_exists": false,
                    "file_name": "drivers/CAN.cpp",
                    "file_size": 0
                },
                {
                    "file_additions": 100,
                    "file_deletions": 0,
                    "file_exists": false,
                    "file_name": "features/unsupported/tests/mbed/can_api/main.cpp",
                    "file_size": 0
                },
                {
                    "file_additions": 11,
                    "file_deletions": 5,
                    "file_exists": true,
                    "file_name": "targets/TARGET_NUVOTON/TARGET_M451/can_api.c",
                    "file_size": 8701
                },
                {
                    "file_additions": 11,
                    "file_deletions": 5,
                    "file_exists": true,
                    "file_name": "targets/TARGET_NUVOTON/TARGET_NUC472/can_api.c",
                    "file_size": 9616
                },
                {
                    "file_additions": 10,
                    "file_deletions": 6,
                    "file_exists": false,
                    "file_name": "targets/TARGET_NXP/TARGET_LPC11XX_11CXX/TARGET_LPC11CXX/can_api.c",
                    "file_size": 0
                },
                {
                    "file_additions": 6,
                    "file_deletions": 3,
                    "file_exists": false,
                    "file_name": "targets/TARGET_NXP/TARGET_LPC15XX/can_api.c",
                    "file_size": 0
                },
                {
                    "file_additions": 6,
                    "file_deletions": 2,
                    "file_exists": true,
                    "file_name": "targets/TARGET_NXP/TARGET_LPC176X/can_api.c",
                    "file_size": 12770
                },
                {
                    "file_additions": 8,
                    "file_deletions": 4,
                    "file_exists": false,
                    "file_name": "targets/TARGET_NXP/TARGET_LPC408X/TARGET_LPC4088/can_api.c",
                    "file_size": 0
                },
                {
                    "file_additions": 6,
                    "file_deletions": 2,
                    "file_exists": false,
                    "file_name": "targets/TARGET_NXP/TARGET_LPC408X/TARGET_LPC4088_DM/can_api.c",
                    "file_size": 0
                },
                {
                    "file_additions": 8,
                    "file_deletions": 1,
                    "file_exists": false,
                    "file_name": "targets/TARGET_RENESAS/TARGET_RZ_A1H/can_api.c",
                    "file_size": 0
                },
                {
                    "file_additions": 8,
                    "file_deletions": 1,
                    "file_exists": false,
                    "file_name": "targets/TARGET_RENESAS/TARGET_VK_RZ_A1H/can_api.c",
                    "file_size": 0
                },
                {
                    "file_additions": 2,
                    "file_deletions": 2,
                    "file_exists": true,
                    "file_name": "targets/TARGET_STM/TARGET_STM32L4/TARGET_STM32L476xG/TARGET_DISCO_L476VG/PeripheralPins.c",
                    "file_size": 35589
                },
                {
                    "file_additions": 13,
                    "file_deletions": 8,
                    "file_exists": true,
                    "file_name": "targets/TARGET_STM/can_api.c",
                    "file_size": 45897
                }
            ],
            "interesting": {
                "reopen": false,
                "status": false
            },
            "is_parent": false,
            "sha": "d11289b576140b0064a542a3cc242c380ea99686"
        },
        {
            "associated_pull_request": [
                "https://github.com/ARMmbed/mbed-os/pull/4329"
            ],
            "date": "2017-05-30 15:52:09+00:00",
            "diff": "armmbed_mbed-os/issue_3863/commit_45b4d41bbd837b2a3cac850f6b31cc4310530777.diff",
            "diff_additions": 32,
            "diff_deletions": 9,
            "diff_file_size": 45897,
            "diff_url": "https://github.com/ARMmbed/mbed-os/commit/45b4d41bbd837b2a3cac850f6b31cc4310530777.diff",
            "exists": true,
            "files": [
                {
                    "file_additions": 32,
                    "file_deletions": 9,
                    "file_exists": true,
                    "file_name": "targets/TARGET_STM/can_api.c",
                    "file_size": 45897
                }
            ],
            "interesting": {
                "reopen": true,
                "status": false
            },
            "is_parent": false,
            "sha": "45b4d41bbd837b2a3cac850f6b31cc4310530777"
        },
        {
            "associated_pull_request": [
                "https://github.com/ARMmbed/mbed-os/pull/4664"
            ],
            "date": "2017-06-28 19:07:14+00:00",
            "diff": "armmbed_mbed-os/issue_3863/commit_f7d76b5d296b214274af6b0d9cb7f7df6c6fb01c.diff",
            "diff_additions": 2,
            "diff_deletions": 2,
            "diff_file_size": 45897,
            "diff_url": "https://github.com/ARMmbed/mbed-os/commit/f7d76b5d296b214274af6b0d9cb7f7df6c6fb01c.diff",
            "exists": true,
            "files": [
                {
                    "file_additions": 2,
                    "file_deletions": 2,
                    "file_exists": true,
                    "file_name": "targets/TARGET_STM/can_api.c",
                    "file_size": 45897
                }
            ],
            "interesting": {
                "reopen": false,
                "status": false
            },
            "is_parent": false,
            "sha": "f7d76b5d296b214274af6b0d9cb7f7df6c6fb01c"
        },
        {
            "associated_pull_request": [
                "https://github.com/ARMmbed/mbed-os/pull/4824"
            ],
            "date": "2017-06-28 19:07:14+00:00",
            "diff": "armmbed_mbed-os/issue_3863/commit_5c74203b1048644dbfbd3b6ce033e08fc312e758.diff",
            "diff_additions": 2,
            "diff_deletions": 2,
            "diff_file_size": 45897,
            "diff_url": "https://github.com/ARMmbed/mbed-os/commit/5c74203b1048644dbfbd3b6ce033e08fc312e758.diff",
            "exists": true,
            "files": [
                {
                    "file_additions": 2,
                    "file_deletions": 2,
                    "file_exists": true,
                    "file_name": "targets/TARGET_STM/can_api.c",
                    "file_size": 45897
                }
            ],
            "interesting": {
                "reopen": false,
                "status": false
            },
            "is_parent": false,
            "sha": "5c74203b1048644dbfbd3b6ce033e08fc312e758"
        }
    ],
    "first_commit": "2017-05-26 15:31:05+00:00",
    "last_commit": "2017-07-28 13:46:14+00:00",
    "number": 3863,
    "pull_request": "None",
    "score": {
        "accidental_reopen_likely": false,
        "all_labels": [
            "type: bug",
            "devices: st"
        ],
        "contains_keywords": [
            "confirm",
            "work",
            "fail",
            "chang",
            "fix",
            "issu",
            "debug",
            "test",
            "bug",
            "error",
            "problem",
            "crash"
        ],
        "fix_size": 156,
        "has_labels": [],
        "intersecting": {
            "computed_score": 1.0,
            "final_commit_size": 3,
            "intersection_size": 3,
            "previous_commits_size": 156
        },
        "is_makefile_based": true,
        "no_new_files": [],
        "no_other_files": false,
        "num_prohibited_files": 168650,
        "prohibited_files": [
            "server/src/main/java/com/genymobile/scrcpy/Device.java",
            "server/src/main/java/com/genymobile/scrcpy/wrappers/SurfaceControl.java",
            "server/src/main/java/com/genymobile/scrcpy/Device.java",
            "server/src/main/java/com/genymobile/scrcpy/wrappers/SurfaceControl.java",
            "app/meson.build",
            "app/scrcpy.1",
            "app/src/common.h",
            "app/src/scrcpy.h",
            "app/src/server.h",
            "server/src/main/java/com/genymobile/scrcpy/Workarounds.java"
        ],
        "reopen": true,
        "reopen_events": [
            [
                "2017-05-26 15:45:29+00:00",
                "closed"
            ],
            [
                "2017-05-26 15:45:29+00:00",
                "commit"
            ],
            [
                "2017-05-30 15:52:19+00:00",
                "commit"
            ],
            [
                "2017-06-27 19:49:02+00:00",
                "reopened"
            ],
            [
                "2017-06-28 19:08:18+00:00",
                "commit"
            ],
            [
                "2017-07-28 13:46:37+00:00",
                "commit"
            ],
            [
                "2017-08-17 13:02:17+00:00",
                "closed"
            ]
        ],
        "status": false,
        "strategy": true,
        "total_changes": 410
    }
}