{
    "commits": [
        {
            "associated_pull_request": [
                "https://github.com/flang-compiler/flang/pull/697"
            ],
            "date": "2019-03-29 20:07:45+00:00",
            "diff": "",
            "diff_additions": 0,
            "diff_deletions": 0,
            "diff_file_size": 0,
            "diff_url": "https://github.com/flang-compiler/flang/commit/280044157b39a24febbd655f56cf398cf314fcab.diff",
            "exists": true,
            "files": [],
            "interesting": {
                "reopen": false,
                "status": false
            },
            "is_parent": true,
            "sha": "280044157b39a24febbd655f56cf398cf314fcab"
        },
        {
            "associated_pull_request": [],
            "date": "2019-03-31 23:33:42+00:00",
            "diff": "flang-compiler_flang/issue_688/commit_fd8ad8bcbf3e4dddc04ac2b7177c279df918487a.diff",
            "diff_additions": 1,
            "diff_deletions": 0,
            "diff_file_size": 54882,
            "diff_url": "https://github.com/flang-compiler/flang/commit/fd8ad8bcbf3e4dddc04ac2b7177c279df918487a.diff",
            "exists": true,
            "files": [
                {
                    "file_additions": 1,
                    "file_deletions": 0,
                    "file_exists": true,
                    "file_name": "tools/flang1/flang1exe/vsub.c",
                    "file_size": 54882
                }
            ],
            "interesting": {
                "reopen": false,
                "status": false
            },
            "is_parent": false,
            "sha": "fd8ad8bcbf3e4dddc04ac2b7177c279df918487a"
        },
        {
            "associated_pull_request": [],
            "date": "2019-03-31 23:33:42+00:00",
            "diff": "flang-compiler_flang/issue_688/commit_df88200a485885e8ad4f982457955b967e77b27b.diff",
            "diff_additions": 1,
            "diff_deletions": 0,
            "diff_file_size": 54882,
            "diff_url": "https://github.com/flang-compiler/flang/commit/df88200a485885e8ad4f982457955b967e77b27b.diff",
            "exists": true,
            "files": [
                {
                    "file_additions": 1,
                    "file_deletions": 0,
                    "file_exists": true,
                    "file_name": "tools/flang1/flang1exe/vsub.c",
                    "file_size": 54882
                }
            ],
            "interesting": {
                "reopen": true,
                "status": false
            },
            "is_parent": false,
            "sha": "df88200a485885e8ad4f982457955b967e77b27b"
        },
        {
            "associated_pull_request": [
                "https://github.com/flang-compiler/flang/pull/701"
            ],
            "date": "2019-03-31 23:33:42+00:00",
            "diff": "flang-compiler_flang/issue_688/commit_2ae1bbd43e95cf8bd749ef44696d3663373cad3d.diff",
            "diff_additions": 1,
            "diff_deletions": 0,
            "diff_file_size": 54882,
            "diff_url": "https://github.com/flang-compiler/flang/commit/2ae1bbd43e95cf8bd749ef44696d3663373cad3d.diff",
            "exists": true,
            "files": [
                {
                    "file_additions": 1,
                    "file_deletions": 0,
                    "file_exists": true,
                    "file_name": "tools/flang1/flang1exe/vsub.c",
                    "file_size": 54882
                }
            ],
            "interesting": {
                "reopen": false,
                "status": false
            },
            "is_parent": false,
            "sha": "2ae1bbd43e95cf8bd749ef44696d3663373cad3d"
        },
        {
            "associated_pull_request": [
                "https://github.com/flang-compiler/flang/pull/701"
            ],
            "date": "2019-03-31 23:33:42+00:00",
            "diff": "flang-compiler_flang/issue_688/commit_48a10172c6963503095fcfd2e3b6bd9aa0e9d30b.diff",
            "diff_additions": 1,
            "diff_deletions": 0,
            "diff_file_size": 54882,
            "diff_url": "https://github.com/flang-compiler/flang/commit/48a10172c6963503095fcfd2e3b6bd9aa0e9d30b.diff",
            "exists": true,
            "files": [
                {
                    "file_additions": 1,
                    "file_deletions": 0,
                    "file_exists": true,
                    "file_name": "tools/flang1/flang1exe/vsub.c",
                    "file_size": 54882
                }
            ],
            "interesting": {
                "reopen": false,
                "status": false
            },
            "is_parent": false,
            "sha": "48a10172c6963503095fcfd2e3b6bd9aa0e9d30b"
        }
    ],
    "first_commit": "2019-03-29 20:07:45+00:00",
    "last_commit": "2021-04-05 09:00:24+00:00",
    "number": 688,
    "pull_request": "None",
    "score": {
        "accidental_reopen_likely": false,
        "all_labels": [
            "bug",
            "nvidia"
        ],
        "contains_keywords": [
            "work",
            "fix",
            "issu",
            "CI",
            "patch",
            "test"
        ],
        "fix_size": 3,
        "has_labels": [
            "bug"
        ],
        "intersecting": {
            "computed_score": 1.0,
            "final_commit_size": 2,
            "intersection_size": 2,
            "previous_commits_size": 3
        },
        "is_makefile_based": true,
        "no_new_files": [],
        "no_other_files": false,
        "num_prohibited_files": 248594,
        "prohibited_files": [
            "server/src/main/java/com/genymobile/scrcpy/Device.java",
            "server/src/main/java/com/genymobile/scrcpy/wrappers/SurfaceControl.java",
            "server/src/main/java/com/genymobile/scrcpy/Device.java",
            "server/src/main/java/com/genymobile/scrcpy/wrappers/SurfaceControl.java",
            "app/meson.build",
            "app/scrcpy.1",
            "app/src/common.h",
            "app/src/scrcpy.h",
            "app/src/server.h",
            "server/src/main/java/com/genymobile/scrcpy/Workarounds.java"
        ],
        "reopen": true,
        "reopen_events": [
            [
                "2019-04-03 17:09:50+00:00",
                "commit"
            ],
            [
                "2020-09-20 14:06:25+00:00",
                "closed"
            ],
            [
                "2020-09-20 14:06:26+00:00",
                "commit"
            ],
            [
                "2020-09-21 09:57:08+00:00",
                "reopened"
            ],
            [
                "2021-03-28 22:38:54+00:00",
                "commit"
            ],
            [
                "2021-04-05 09:00:25+00:00",
                "closed"
            ],
            [
                "2021-04-05 09:00:26+00:00",
                "commit"
            ]
        ],
        "status": false,
        "strategy": true,
        "total_changes": 4
    }
}