{
    "all_issues": 6232,
    "interesting_issues": 40,
    "last_update": "2021-05-16 18:47:06.961817",
    "license": {
        "download": "https://raw.githubusercontent.com/swaywm/sway/master/LICENSE",
        "name": "MIT License"
    },
    "ratio": 0.006418485237483954,
    "size": 28953,
    "stars": 8885,
    "url": "https://github.com/swaywm/sway"
}