{
    "covered_issues": [
        200,
        198,
        197,
        195,
        194,
        192,
        191,
        190,
        189,
        186,
        185,
        184,
        182,
        174,
        172,
        171,
        169,
        167,
        166,
        165,
        163,
        161,
        159,
        156,
        155,
        154,
        153,
        152,
        151,
        149,
        146,
        142,
        141,
        139,
        137,
        136,
        130,
        129,
        123,
        122,
        120,
        119,
        117,
        114,
        113,
        112,
        111,
        110,
        109,
        108,
        107,
        106,
        105,
        103,
        102,
        101,
        100,
        99,
        98,
        97,
        96,
        94,
        93,
        92,
        91,
        90,
        89,
        88,
        87,
        86,
        85,
        84,
        83,
        82,
        80,
        79,
        78,
        76,
        75,
        74,
        72,
        71,
        69,
        68,
        66,
        65,
        64,
        63,
        61,
        60,
        59,
        58,
        57,
        56,
        55,
        52,
        51,
        50,
        49,
        46,
        45,
        44,
        43,
        42,
        41,
        40,
        39,
        38,
        36,
        35,
        33,
        32,
        31,
        30,
        29,
        28,
        27,
        26,
        25,
        23,
        22,
        21,
        20,
        15,
        13,
        12,
        10,
        9,
        5,
        4,
        3,
        2,
        1
    ],
    "finished": true
}