{
    "category": [
        "build/refactor/preprocessing"
    ],
    "commits": [
        {
            "associated_pull_request": [],
            "date": "2015-02-18 23:55:04",
            "diff": "commonmark_cmark/issue_9/commit_17e4a8203dc24ecee990ba3e8880092a1864e12e.diff",
            "diff_additions": 1,
            "diff_deletions": 1,
            "diff_file_size": 42610,
            "diff_url": "https://github.com/commonmark/cmark/commit/17e4a8203dc24ecee990ba3e8880092a1864e12e.diff",
            "exists": true,
            "files": [
                {
                    "file_additions": 1,
                    "file_deletions": 1,
                    "file_exists": true,
                    "file_name": "src/inlines.c",
                    "file_size": 42610
                }
            ],
            "interesting": {
                "reopen": false,
                "status": false
            },
            "is_parent": true,
            "sha": "17e4a8203dc24ecee990ba3e8880092a1864e12e"
        },
        {
            "associated_pull_request": [],
            "date": "2015-02-19 17:16:49",
            "diff": "commonmark_cmark/issue_9/commit_aad831e87c92530fe54b7dcdda593c53ccc3f0b6.diff",
            "diff_additions": 8,
            "diff_deletions": 9,
            "diff_file_size": 40674,
            "diff_url": "https://github.com/commonmark/cmark/commit/aad831e87c92530fe54b7dcdda593c53ccc3f0b6.diff",
            "exists": true,
            "files": [
                {
                    "file_additions": 8,
                    "file_deletions": 9,
                    "file_exists": true,
                    "file_name": "src/blocks.c",
                    "file_size": 40674
                }
            ],
            "interesting": {
                "reopen": true,
                "status": false
            },
            "is_parent": false,
            "sha": "aad831e87c92530fe54b7dcdda593c53ccc3f0b6"
        },
        {
            "associated_pull_request": [],
            "date": "2015-02-20 06:55:02",
            "diff": "commonmark_cmark/issue_9/commit_5af9f2717274efe5e2aebfe6a8154d700ec7e471.diff",
            "diff_additions": 5,
            "diff_deletions": 2,
            "diff_file_size": 40674,
            "diff_url": "https://github.com/commonmark/cmark/commit/5af9f2717274efe5e2aebfe6a8154d700ec7e471.diff",
            "exists": true,
            "files": [
                {
                    "file_additions": 5,
                    "file_deletions": 2,
                    "file_exists": true,
                    "file_name": "src/blocks.c",
                    "file_size": 40674
                }
            ],
            "interesting": {
                "reopen": false,
                "status": false
            },
            "is_parent": false,
            "sha": "5af9f2717274efe5e2aebfe6a8154d700ec7e471"
        }
    ],
    "first_commit": "2015-02-18 23:55:04",
    "last_commit": "2015-02-20 06:55:02",
    "number": 9,
    "pull_request": "None",
    "score": {
        "accidental_reopen_likely": false,
        "all_labels": [],
        "contains_keywords": [
            "fix",
            "fault",
            "bug",
            "test",
            "remov",
            "issu",
            "error",
            "confirm",
            "crash",
            "problem"
        ],
        "fix_size": 21,
        "has_labels": [],
        "intersecting": {
            "computed_score": 0.25,
            "final_commit_size": 8,
            "intersection_size": 2,
            "previous_commits_size": 15
        },
        "is_makefile_based": true,
        "no_new_files": [],
        "no_other_files": true,
        "num_prohibited_files": 52554,
        "prohibited_files": [
            "kill.h",
            "meminfo.h",
            "kill.h",
            "meminfo.h",
            "kill.h",
            "meminfo.h",
            "testsuite_cli_test.go",
            "testsuite_cli_test.go",
            "common.mk",
            "i3bar/include/draw_util.h"
        ],
        "reopen": true,
        "reopen_events": [
            [
                "2015-02-19 17:21:38",
                "closed"
            ],
            [
                "2015-02-19 17:21:38",
                "commit"
            ],
            [
                "2015-02-19 18:16:23",
                "reopened"
            ],
            [
                "2015-02-20 06:59:35",
                "closed"
            ],
            [
                "2015-02-20 06:59:35",
                "commit"
            ]
        ],
        "status": false,
        "strategy": true,
        "total_changes": 26
    }
}