{
    "all_issues": 14834,
    "interesting_issues": 26,
    "last_update": "2023-10-20 08:57:36.022445",
    "license": {
        "download": "https://raw.githubusercontent.com/openzfs/zfs/master/LICENSE",
        "name": "Other"
    },
    "ratio": 0.0017527302143723878,
    "size": 123949,
    "stars": 9622,
    "url": "https://github.com/openzfs/zfs"
}