{
    "category": [
        "build/refactor/preprocessing",
        "GUI"
    ],
    "commits": [
        {
            "associated_pull_request": [
                "https://github.com/nodemcu/nodemcu-firmware/pull/2501"
            ],
            "date": "2018-10-02 17:00:04",
            "diff": "nodemcu_nodemcu-firmware/issue_2507/commit_bf5808495ce5265916883b2e15f095241ea052bc.diff",
            "diff_additions": 710,
            "diff_deletions": 0,
            "diff_file_size": 0,
            "diff_url": "https://github.com/nodemcu/nodemcu-firmware/commit/bf5808495ce5265916883b2e15f095241ea052bc.diff",
            "exists": true,
            "files": [
                {
                    "file_additions": 710,
                    "file_deletions": 0,
                    "file_exists": false,
                    "file_name": "components/modules/mqtt.c",
                    "file_size": 0
                }
            ],
            "interesting": {
                "reopen": false,
                "status": false
            },
            "is_parent": true,
            "sha": "bf5808495ce5265916883b2e15f095241ea052bc"
        },
        {
            "associated_pull_request": [
                "https://github.com/nodemcu/nodemcu-firmware/pull/2508"
            ],
            "date": "2018-10-07 10:51:06",
            "diff": "nodemcu_nodemcu-firmware/issue_2507/commit_3b121334895e7373a9a74c694ca52c851ddd0fd7.diff",
            "diff_additions": 3,
            "diff_deletions": 0,
            "diff_file_size": 0,
            "diff_url": "https://github.com/nodemcu/nodemcu-firmware/commit/3b121334895e7373a9a74c694ca52c851ddd0fd7.diff",
            "exists": true,
            "files": [
                {
                    "file_additions": 3,
                    "file_deletions": 0,
                    "file_exists": false,
                    "file_name": "components/lua/lua.c",
                    "file_size": 0
                }
            ],
            "interesting": {
                "reopen": false,
                "status": true
            },
            "is_parent": false,
            "sha": "3b121334895e7373a9a74c694ca52c851ddd0fd7"
        },
        {
            "associated_pull_request": [
                "https://github.com/nodemcu/nodemcu-firmware/pull/2508"
            ],
            "date": "2018-10-07 19:40:49",
            "diff": "nodemcu_nodemcu-firmware/issue_2507/commit_35c0f15805aff777ed88ee0f674e3e917529d509.diff",
            "diff_additions": 1,
            "diff_deletions": 0,
            "diff_file_size": 0,
            "diff_url": "https://github.com/nodemcu/nodemcu-firmware/commit/35c0f15805aff777ed88ee0f674e3e917529d509.diff",
            "exists": true,
            "files": [
                {
                    "file_additions": 1,
                    "file_deletions": 0,
                    "file_exists": false,
                    "file_name": "components/base_nodemcu/user_main.c",
                    "file_size": 0
                }
            ],
            "interesting": {
                "reopen": false,
                "status": false
            },
            "is_parent": false,
            "sha": "35c0f15805aff777ed88ee0f674e3e917529d509"
        }
    ],
    "first_commit": "2018-10-02 17:00:04",
    "last_commit": "2018-10-07 19:40:49",
    "number": 2507,
    "pull_request": "None",
    "score": {
        "accidental_reopen_likely": false,
        "all_labels": [
            "ESP32"
        ],
        "contains_keywords": [
            "fix",
            "issu"
        ],
        "fix_size": 6,
        "has_labels": [],
        "intersecting": {
            "computed_score": 0.0,
            "final_commit_size": 2,
            "intersection_size": 0,
            "previous_commits_size": 4
        },
        "is_makefile_based": true,
        "no_new_files": [
            "components/base_nodemcu/user_main.c"
        ],
        "no_other_files": false,
        "num_prohibited_files": 65742,
        "prohibited_files": [
            "hal/inc/pinmap_hal.h",
            "Debug/marvin.bin",
            "Debug/marvin.elf",
            "Debug/marvin.hex",
            "Debug/marvin.bin",
            "Debug/marvin.elf",
            "Debug/marvin.hex",
            "inc/spark_utilities.h",
            "Debug/marvin.bin",
            "Debug/marvin.elf"
        ],
        "reopen": false,
        "reopen_events": [
            [
                "2018-10-07 10:52:21",
                "commit"
            ],
            [
                "2018-10-07 19:40:52",
                "commit"
            ],
            [
                "2018-11-03 20:38:26",
                "closed"
            ]
        ],
        "status": true,
        "strategy": true,
        "total_changes": 714
    }
}