{
    "category": [
        "memory",
        "network/protocol"
    ],
    "commits": [
        {
            "associated_pull_request": [],
            "date": "2018-12-07 13:09:22",
            "diff": "libvips_libvips/issue_1180/commit_0d5eced96434e9ed179dd486f744f2b80a2fd29f.diff",
            "diff_additions": 3,
            "diff_deletions": 3,
            "diff_file_size": 17363,
            "diff_url": "https://github.com/libvips/libvips/commit/0d5eced96434e9ed179dd486f744f2b80a2fd29f.diff",
            "exists": true,
            "files": [
                {
                    "file_additions": 3,
                    "file_deletions": 3,
                    "file_exists": true,
                    "file_name": "libvips/create/text.c",
                    "file_size": 17363
                }
            ],
            "interesting": {
                "reopen": false,
                "status": false
            },
            "is_parent": true,
            "sha": "0d5eced96434e9ed179dd486f744f2b80a2fd29f"
        },
        {
            "associated_pull_request": [],
            "date": "2018-12-17 12:42:34",
            "diff": "libvips_libvips/issue_1180/commit_db4fe60405a8937e5c55cdd9a03608458fc4b17d.diff",
            "diff_additions": 14,
            "diff_deletions": 9,
            "diff_file_size": 30819,
            "diff_url": "https://github.com/libvips/libvips/commit/db4fe60405a8937e5c55cdd9a03608458fc4b17d.diff",
            "exists": true,
            "files": [
                {
                    "file_additions": 5,
                    "file_deletions": 5,
                    "file_exists": true,
                    "file_name": "libvips/resample/bicubic.cpp",
                    "file_size": 17237
                },
                {
                    "file_additions": 9,
                    "file_deletions": 4,
                    "file_exists": true,
                    "file_name": "libvips/resample/mapim.c",
                    "file_size": 13582
                }
            ],
            "interesting": {
                "reopen": true,
                "status": false
            },
            "is_parent": false,
            "sha": "db4fe60405a8937e5c55cdd9a03608458fc4b17d"
        },
        {
            "associated_pull_request": [],
            "date": "2018-12-17 20:29:31",
            "diff": "libvips_libvips/issue_1180/commit_6ba4b3bfdb1799d2426225192d11040032dc8619.diff",
            "diff_additions": 8,
            "diff_deletions": 6,
            "diff_file_size": 13582,
            "diff_url": "https://github.com/libvips/libvips/commit/6ba4b3bfdb1799d2426225192d11040032dc8619.diff",
            "exists": true,
            "files": [
                {
                    "file_additions": 8,
                    "file_deletions": 6,
                    "file_exists": true,
                    "file_name": "libvips/resample/mapim.c",
                    "file_size": 13582
                }
            ],
            "interesting": {
                "reopen": false,
                "status": false
            },
            "is_parent": false,
            "sha": "6ba4b3bfdb1799d2426225192d11040032dc8619"
        }
    ],
    "first_commit": "2018-12-07 13:09:22",
    "last_commit": "2018-12-17 20:29:31",
    "number": 1180,
    "pull_request": "None",
    "score": {
        "accidental_reopen_likely": false,
        "all_labels": [
            "bug",
            "in development"
        ],
        "contains_keywords": [
            "fail",
            "report",
            "problem",
            "test",
            "fix",
            "remov",
            "issu",
            "work",
            "fault"
        ],
        "fix_size": 31,
        "has_labels": [
            "bug"
        ],
        "intersecting": {
            "computed_score": 0.45454545454545453,
            "final_commit_size": 11,
            "intersection_size": 5,
            "previous_commits_size": 25
        },
        "is_makefile_based": true,
        "no_new_files": [],
        "no_other_files": false,
        "num_prohibited_files": 52201,
        "prohibited_files": [
            "hal/inc/pinmap_hal.h",
            "Debug/marvin.bin",
            "Debug/marvin.elf",
            "Debug/marvin.hex",
            "Debug/marvin.bin",
            "Debug/marvin.elf",
            "Debug/marvin.hex",
            "inc/spark_utilities.h",
            "Debug/marvin.bin",
            "Debug/marvin.elf"
        ],
        "reopen": true,
        "reopen_events": [
            [
                "2018-12-17 12:44:07",
                "commit"
            ],
            [
                "2018-12-17 18:38:56",
                "closed"
            ],
            [
                "2018-12-17 18:39:06",
                "reopened"
            ],
            [
                "2018-12-17 20:30:20",
                "commit"
            ],
            [
                "2018-12-17 21:20:57",
                "closed"
            ]
        ],
        "status": false,
        "strategy": true,
        "total_changes": 43
    }
}