{
    "commits": [
        {
            "associated_pull_request": [],
            "date": "2019-08-23 17:31:04+00:00",
            "diff": "",
            "diff_additions": 0,
            "diff_deletions": 0,
            "diff_file_size": 0,
            "diff_url": "https://github.com/qmk/qmk_firmware/commit/8615a3e090b0bdeb271adcb972ddb665f5511254.diff",
            "exists": true,
            "files": [],
            "interesting": {
                "reopen": false,
                "status": false
            },
            "is_parent": true,
            "sha": "8615a3e090b0bdeb271adcb972ddb665f5511254"
        },
        {
            "associated_pull_request": [],
            "date": "2019-08-23 18:24:46+00:00",
            "diff": "qmk_qmk_firmware/issue_6589/commit_1227fe5c2669df02e59c80697d97fca92b589bbf.diff",
            "diff_additions": 17,
            "diff_deletions": 6,
            "diff_file_size": 0,
            "diff_url": "https://github.com/qmk/qmk_firmware/commit/1227fe5c2669df02e59c80697d97fca92b589bbf.diff",
            "exists": true,
            "files": [
                {
                    "file_additions": 17,
                    "file_deletions": 6,
                    "file_exists": false,
                    "file_name": "keyboards/handwired/dactyl_manuform/4x5/keymaps/sunat/keymap.c",
                    "file_size": 0
                }
            ],
            "interesting": {
                "reopen": false,
                "status": false
            },
            "is_parent": false,
            "sha": "1227fe5c2669df02e59c80697d97fca92b589bbf"
        },
        {
            "associated_pull_request": [],
            "date": "2019-08-26 07:30:42+00:00",
            "diff": "qmk_qmk_firmware/issue_6589/commit_2243ff0c23326b429e87f3f9c297dc5988323957.diff",
            "diff_additions": 4,
            "diff_deletions": 4,
            "diff_file_size": 0,
            "diff_url": "https://github.com/qmk/qmk_firmware/commit/2243ff0c23326b429e87f3f9c297dc5988323957.diff",
            "exists": true,
            "files": [
                {
                    "file_additions": 4,
                    "file_deletions": 4,
                    "file_exists": false,
                    "file_name": "keyboards/planck/keymaps/waldfee/keymap.c",
                    "file_size": 0
                }
            ],
            "interesting": {
                "reopen": true,
                "status": false
            },
            "is_parent": false,
            "sha": "2243ff0c23326b429e87f3f9c297dc5988323957"
        },
        {
            "associated_pull_request": [
                "https://github.com/qmk/qmk_firmware/pull/6691"
            ],
            "date": "2019-09-07 15:58:17+00:00",
            "diff": "qmk_qmk_firmware/issue_6589/commit_d90038eb9cc62ffd4f0e4a6a3c6de54a8670f51b.diff",
            "diff_additions": 28,
            "diff_deletions": 2,
            "diff_file_size": 3035,
            "diff_url": "https://github.com/qmk/qmk_firmware/commit/d90038eb9cc62ffd4f0e4a6a3c6de54a8670f51b.diff",
            "exists": true,
            "files": [
                {
                    "file_additions": 26,
                    "file_deletions": 0,
                    "file_exists": true,
                    "file_name": "keyboards/9key/keymaps/bcat/keymap.c",
                    "file_size": 1385
                },
                {
                    "file_additions": 2,
                    "file_deletions": 2,
                    "file_exists": true,
                    "file_name": "keyboards/keebio/bdn9/keymaps/bcat/keymap.c",
                    "file_size": 1650
                }
            ],
            "interesting": {
                "reopen": false,
                "status": false
            },
            "is_parent": false,
            "sha": "d90038eb9cc62ffd4f0e4a6a3c6de54a8670f51b"
        },
        {
            "associated_pull_request": [],
            "date": "2019-09-07 15:58:17+00:00",
            "diff": "qmk_qmk_firmware/issue_6589/commit_64833e9494c31f1783bb0d0a1b855ee43ed3b8bf.diff",
            "diff_additions": 28,
            "diff_deletions": 2,
            "diff_file_size": 3035,
            "diff_url": "https://github.com/qmk/qmk_firmware/commit/64833e9494c31f1783bb0d0a1b855ee43ed3b8bf.diff",
            "exists": true,
            "files": [
                {
                    "file_additions": 26,
                    "file_deletions": 0,
                    "file_exists": true,
                    "file_name": "keyboards/9key/keymaps/bcat/keymap.c",
                    "file_size": 1385
                },
                {
                    "file_additions": 2,
                    "file_deletions": 2,
                    "file_exists": true,
                    "file_name": "keyboards/keebio/bdn9/keymaps/bcat/keymap.c",
                    "file_size": 1650
                }
            ],
            "interesting": {
                "reopen": false,
                "status": false
            },
            "is_parent": false,
            "sha": "64833e9494c31f1783bb0d0a1b855ee43ed3b8bf"
        },
        {
            "associated_pull_request": [],
            "date": "2019-09-07 15:58:17+00:00",
            "diff": "qmk_qmk_firmware/issue_6589/commit_ab8efb1e93f71d1621462752bb66b49fbf82d2db.diff",
            "diff_additions": 28,
            "diff_deletions": 2,
            "diff_file_size": 3035,
            "diff_url": "https://github.com/qmk/qmk_firmware/commit/ab8efb1e93f71d1621462752bb66b49fbf82d2db.diff",
            "exists": true,
            "files": [
                {
                    "file_additions": 26,
                    "file_deletions": 0,
                    "file_exists": true,
                    "file_name": "keyboards/9key/keymaps/bcat/keymap.c",
                    "file_size": 1385
                },
                {
                    "file_additions": 2,
                    "file_deletions": 2,
                    "file_exists": true,
                    "file_name": "keyboards/keebio/bdn9/keymaps/bcat/keymap.c",
                    "file_size": 1650
                }
            ],
            "interesting": {
                "reopen": false,
                "status": false
            },
            "is_parent": false,
            "sha": "ab8efb1e93f71d1621462752bb66b49fbf82d2db"
        },
        {
            "associated_pull_request": [],
            "date": "2019-09-07 15:58:17+00:00",
            "diff": "qmk_qmk_firmware/issue_6589/commit_4d7dbcafb639870fff23d1e18ec00f3f9f40e4d6.diff",
            "diff_additions": 28,
            "diff_deletions": 2,
            "diff_file_size": 3035,
            "diff_url": "https://github.com/qmk/qmk_firmware/commit/4d7dbcafb639870fff23d1e18ec00f3f9f40e4d6.diff",
            "exists": true,
            "files": [
                {
                    "file_additions": 26,
                    "file_deletions": 0,
                    "file_exists": true,
                    "file_name": "keyboards/9key/keymaps/bcat/keymap.c",
                    "file_size": 1385
                },
                {
                    "file_additions": 2,
                    "file_deletions": 2,
                    "file_exists": true,
                    "file_name": "keyboards/keebio/bdn9/keymaps/bcat/keymap.c",
                    "file_size": 1650
                }
            ],
            "interesting": {
                "reopen": false,
                "status": false
            },
            "is_parent": false,
            "sha": "4d7dbcafb639870fff23d1e18ec00f3f9f40e4d6"
        },
        {
            "associated_pull_request": [],
            "date": "2019-09-29 00:06:19+00:00",
            "diff": "qmk_qmk_firmware/issue_6589/commit_bf0417415a841ea2b1f73d43488b04a4e46f42a6.diff",
            "diff_additions": 4303,
            "diff_deletions": 4545,
            "diff_file_size": 144456,
            "diff_url": "https://github.com/qmk/qmk_firmware/commit/bf0417415a841ea2b1f73d43488b04a4e46f42a6.diff",
            "exists": true,
            "files": [
                {
                    "file_additions": 64,
                    "file_deletions": 70,
                    "file_exists": false,
                    "file_name": "drivers/arm/i2c_master.c",
                    "file_size": 0
                },
                {
                    "file_additions": 21,
                    "file_deletions": 32,
                    "file_exists": false,
                    "file_name": "drivers/avr/analog.c",
                    "file_size": 0
                },
                {
                    "file_additions": 71,
                    "file_deletions": 76,
                    "file_exists": false,
                    "file_name": "drivers/avr/apa102.c",
                    "file_size": 0
                },
                {
                    "file_additions": 19,
                    "file_deletions": 261,
                    "file_exists": false,
                    "file_name": "drivers/avr/glcdfont.c",
                    "file_size": 0
                },
                {
                    "file_additions": 227,
                    "file_deletions": 283,
                    "file_exists": false,
                    "file_name": "drivers/avr/hd44780.c",
                    "file_size": 0
                },
                {
                    "file_additions": 132,
                    "file_deletions": 132,
                    "file_exists": false,
                    "file_name": "drivers/avr/i2c_master.c",
                    "file_size": 0
                },
                {
                    "file_additions": 9,
                    "file_deletions": 9,
                    "file_exists": false,
                    "file_name": "drivers/avr/i2c_slave.c",
                    "file_size": 0
                },
                {
                    "file_additions": 211,
                    "file_deletions": 216,
                    "file_exists": false,
                    "file_name": "drivers/avr/ssd1306.c",
                    "file_size": 0
                },
                {
                    "file_additions": 179,
                    "file_deletions": 205,
                    "file_exists": false,
                    "file_name": "drivers/avr/ws2812.c",
                    "file_size": 0
                },
                {
                    "file_additions": 42,
                    "file_deletions": 56,
                    "file_exists": false,
                    "file_name": "drivers/boards/GENERIC_STM32_F303XC/board.c",
                    "file_size": 0
                },
                {
                    "file_additions": 96,
                    "file_deletions": 141,
                    "file_exists": false,
                    "file_name": "drivers/boards/IC_TEENSY_3_1/board.c",
                    "file_size": 0
                },
                {
                    "file_additions": 36,
                    "file_deletions": 36,
                    "file_exists": true,
                    "file_name": "drivers/gpio/pca9555.c",
                    "file_size": 2669
                },
                {
                    "file_additions": 80,
                    "file_deletions": 77,
                    "file_exists": false,
                    "file_name": "drivers/haptic/DRV2605L.c",
                    "file_size": 0
                },
                {
                    "file_additions": 229,
                    "file_deletions": 144,
                    "file_exists": false,
                    "file_name": "drivers/haptic/haptic.c",
                    "file_size": 0
                },
                {
                    "file_additions": 43,
                    "file_deletions": 57,
                    "file_exists": true,
                    "file_name": "drivers/haptic/solenoid.c",
                    "file_size": 4993
                },
                {
                    "file_additions": 47,
                    "file_deletions": 53,
                    "file_exists": false,
                    "file_name": "drivers/issi/is31fl3218.c",
                    "file_size": 0
                },
                {
                    "file_additions": 34,
                    "file_deletions": 37,
                    "file_exists": false,
                    "file_name": "drivers/issi/is31fl3731-simple.c",
                    "file_size": 0
                },
                {
                    "file_additions": 70,
                    "file_deletions": 90,
                    "file_exists": false,
                    "file_name": "drivers/issi/is31fl3731.c",
                    "file_size": 0
                },
                {
                    "file_additions": 80,
                    "file_deletions": 97,
                    "file_exists": false,
                    "file_name": "drivers/issi/is31fl3733.c",
                    "file_size": 0
                },
                {
                    "file_additions": 97,
                    "file_deletions": 122,
                    "file_exists": false,
                    "file_name": "drivers/issi/is31fl3736.c",
                    "file_size": 0
                },
                {
                    "file_additions": 80,
                    "file_deletions": 97,
                    "file_exists": false,
                    "file_name": "drivers/issi/is31fl3737.c",
                    "file_size": 0
                },
                {
                    "file_additions": 13,
                    "file_deletions": 228,
                    "file_exists": true,
                    "file_name": "drivers/oled/glcdfont.c",
                    "file_size": 8256
                },
                {
                    "file_additions": 389,
                    "file_deletions": 413,
                    "file_exists": true,
                    "file_name": "drivers/oled/oled_driver.c",
                    "file_size": 31646
                },
                {
                    "file_additions": 262,
                    "file_deletions": 486,
                    "file_exists": false,
                    "file_name": "drivers/qwiic/micro_oled.c",
                    "file_size": 0
                },
                {
                    "file_additions": 6,
                    "file_deletions": 6,
                    "file_exists": false,
                    "file_name": "drivers/qwiic/qwiic.c",
                    "file_size": 0
                },
                {
                    "file_additions": 131,
                    "file_deletions": 137,
                    "file_exists": false,
                    "file_name": "drivers/ugfx/gdisp/is31fl3731c/gdisp_is31fl3731c.c",
                    "file_size": 0
                },
                {
                    "file_additions": 170,
                    "file_deletions": 167,
                    "file_exists": false,
                    "file_name": "drivers/ugfx/gdisp/st7565/gdisp_lld_ST7565.c",
                    "file_size": 0
                },
                {
                    "file_additions": 16,
                    "file_deletions": 0,
                    "file_exists": false,
                    "file_name": "keyboards/1upkeyboards/1up60hte/1up60hte.c",
                    "file_size": 0
                },
                {
                    "file_additions": 0,
                    "file_deletions": 19,
                    "file_exists": true,
                    "file_name": "keyboards/1upkeyboards/1up60hte/keymaps/default/keymap.c",
                    "file_size": 2166
                },
                {
                    "file_additions": 0,
                    "file_deletions": 19,
                    "file_exists": true,
                    "file_name": "keyboards/1upkeyboards/1up60hte/keymaps/hhkb/keymap.c",
                    "file_size": 2130
                },
                {
                    "file_additions": 8,
                    "file_deletions": 0,
                    "file_exists": false,
                    "file_name": "keyboards/2_milk/keymaps/mikethetiger/keymap.c",
                    "file_size": 0
                },
                {
                    "file_additions": 1,
                    "file_deletions": 0,
                    "file_exists": false,
                    "file_name": "keyboards/2key2crawl/2key2crawl.c",
                    "file_size": 0
                },
                {
                    "file_additions": 28,
                    "file_deletions": 0,
                    "file_exists": true,
                    "file_name": "keyboards/2key2crawl/keymaps/default/keymap.c",
                    "file_size": 488
                },
                {
                    "file_additions": 26,
                    "file_deletions": 0,
                    "file_exists": true,
                    "file_name": "keyboards/2key2crawl/keymaps/tabs/keymap.c",
                    "file_size": 490
                },
                {
                    "file_additions": 25,
                    "file_deletions": 0,
                    "file_exists": true,
                    "file_name": "keyboards/2key2crawl/keymaps/vol/keymap.c",
                    "file_size": 485
                },
                {
                    "file_additions": 55,
                    "file_deletions": 0,
                    "file_exists": true,
                    "file_name": "keyboards/40percentclub/mf68/keymaps/emdarcher/keymap.c",
                    "file_size": 2710
                },
                {
                    "file_additions": 26,
                    "file_deletions": 0,
                    "file_exists": true,
                    "file_name": "keyboards/9key/keymaps/bcat/keymap.c",
                    "file_size": 1385
                },
                {
                    "file_additions": 3,
                    "file_deletions": 3,
                    "file_exists": true,
                    "file_name": "keyboards/adkb96/keymaps/default/keymap.c",
                    "file_size": 807
                },
                {
                    "file_additions": 7,
                    "file_deletions": 8,
                    "file_exists": false,
                    "file_name": "keyboards/aeboards/ext65/keymaps/default/keymap.c",
                    "file_size": 0
                },
                {
                    "file_additions": 7,
                    "file_deletions": 7,
                    "file_exists": false,
                    "file_name": "keyboards/aeboards/ext65/keymaps/via/keymap.c",
                    "file_size": 0
                },
                {
                    "file_additions": 18,
                    "file_deletions": 11,
                    "file_exists": false,
                    "file_name": "keyboards/alps64/alps64.c",
                    "file_size": 0
                },
                {
                    "file_additions": 0,
                    "file_deletions": 34,
                    "file_exists": false,
                    "file_name": "keyboards/alps64/led.c",
                    "file_size": 0
                },
                {
                    "file_additions": 0,
                    "file_deletions": 199,
                    "file_exists": false,
                    "file_name": "keyboards/alps64/matrix.c",
                    "file_size": 0
                },
                {
                    "file_additions": 51,
                    "file_deletions": 0,
                    "file_exists": false,
                    "file_name": "keyboards/angel17/alpha/alpha.c",
                    "file_size": 0
                },
                {
                    "file_additions": 0,
                    "file_deletions": 51,
                    "file_exists": false,
                    "file_name": "keyboards/angel17/angel17.c",
                    "file_size": 0
                },
                {
                    "file_additions": 18,
                    "file_deletions": 6,
                    "file_exists": false,
                    "file_name": "keyboards/angel17/keymaps/default/keymap.c",
                    "file_size": 0
                },
                {
                    "file_additions": 51,
                    "file_deletions": 0,
                    "file_exists": false,
                    "file_name": "keyboards/angel17/rev1/rev1.c",
                    "file_size": 0
                },
                {
                    "file_additions": 1,
                    "file_deletions": 0,
                    "file_exists": true,
                    "file_name": "keyboards/at_at/660m/660m.c",
                    "file_size": 143
                },
                {
                    "file_additions": 109,
                    "file_deletions": 0,
                    "file_exists": false,
                    "file_name": "keyboards/at_at/660m/boards/ST_STM32F072B_DISCOVERY/board.c",
                    "file_size": 0
                },
                {
                    "file_additions": 43,
                    "file_deletions": 0,
                    "file_exists": true,
                    "file_name": "keyboards/at_at/660m/keymaps/default/keymap.c",
                    "file_size": 2582
                },
                {
                    "file_additions": 1,
                    "file_deletions": 4,
                    "file_exists": true,
                    "file_name": "keyboards/atomic/atomic.c",
                    "file_size": 922
                },
                {
                    "file_additions": 2,
                    "file_deletions": 7,
                    "file_exists": false,
                    "file_name": "keyboards/atomic/keymaps/abienz.c",
                    "file_size": 0
                },
                {
                    "file_additions": 0,
                    "file_deletions": 5,
                    "file_exists": false,
                    "file_name": "keyboards/atomic/keymaps/twolayer.c",
                    "file_size": 0
                },
                {
                    "file_additions": 16,
                    "file_deletions": 0,
                    "file_exists": false,
                    "file_name": "keyboards/atreus/astar/astar.c",
                    "file_size": 0
                },
                {
                    "file_additions": 17,
                    "file_deletions": 1,
                    "file_exists": false,
                    "file_name": "keyboards/atreus/atreus.c",
                    "file_size": 0
                },
                {
                    "file_additions": 1,
                    "file_deletions": 1,
                    "file_exists": true,
                    "file_name": "keyboards/atreus/keymaps/classic/keymap.c",
                    "file_size": 1895
                },
                {
                    "file_additions": 1,
                    "file_deletions": 1,
                    "file_exists": true,
                    "file_name": "keyboards/atreus/keymaps/default/keymap.c",
                    "file_size": 2665
                },
                {
                    "file_additions": 1,
                    "file_deletions": 2,
                    "file_exists": true,
                    "file_name": "keyboards/atreus/keymaps/erlandsona/keymap.c",
                    "file_size": 1968
                },
                {
                    "file_additions": 1,
                    "file_deletions": 1,
                    "file_exists": true,
                    "file_name": "keyboards/atreus/keymaps/jeremy/keymap.c",
                    "file_size": 3607
                },
                {
                    "file_additions": 1,
                    "file_deletions": 1,
                    "file_exists": true,
                    "file_name": "keyboards/atreus/keymaps/nojjan/keymap.c",
                    "file_size": 2607
                },
                {
                    "file_additions": 1,
                    "file_deletions": 1,
                    "file_exists": true,
                    "file_name": "keyboards/atreus/keymaps/ptillemans/keymap.c",
                    "file_size": 2744
                },
                {
                    "file_additions": 76,
                    "file_deletions": 0,
                    "file_exists": true,
                    "file_name": "keyboards/atreus/keymaps/workman/keymap.c",
                    "file_size": 3622
                },
                {
                    "file_additions": 16,
                    "file_deletions": 0,
                    "file_exists": false,
                    "file_name": "keyboards/atreus/teensy2/teensy2.c",
                    "file_size": 0
                },
                {
                    "file_additions": 5,
                    "file_deletions": 4,
                    "file_exists": false,
                    "file_name": "keyboards/atreus62/keymaps/atreus52/keymap.c",
                    "file_size": 0
                },
                {
                    "file_additions": 1,
                    "file_deletions": 1,
                    "file_exists": true,
                    "file_name": "keyboards/atreus62/keymaps/default/keymap.c",
                    "file_size": 3447
                },
                {
                    "file_additions": 1,
                    "file_deletions": 1,
                    "file_exists": false,
                    "file_name": "keyboards/atreus62/keymaps/mneme/keymap.c",
                    "file_size": 0
                },
                {
                    "file_additions": 2,
                    "file_deletions": 2,
                    "file_exists": true,
                    "file_name": "keyboards/bantam44/keymaps/default/keymap.c",
                    "file_size": 1608
                },
                {
                    "file_additions": 1,
                    "file_deletions": 3,
                    "file_exists": false,
                    "file_name": "keyboards/bpiphany/frosty_flake/keymaps/QFR_JM/keymap.c",
                    "file_size": 0
                },
                {
                    "file_additions": 2,
                    "file_deletions": 3,
                    "file_exists": true,
                    "file_name": "keyboards/bpiphany/pegasushoof/keymaps/blowrak/keymap.c",
                    "file_size": 5604
                },
                {
                    "file_additions": 109,
                    "file_deletions": 0,
                    "file_exists": false,
                    "file_name": "keyboards/cannonkeys/chimera65/boards/ST_STM32F072B_DISCOVERY/board.c",
                    "file_size": 0
                },
                {
                    "file_additions": 1,
                    "file_deletions": 0,
                    "file_exists": false,
                    "file_name": "keyboards/cannonkeys/chimera65/chimera65.c",
                    "file_size": 0
                },
                {
                    "file_additions": 44,
                    "file_deletions": 0,
                    "file_exists": true,
                    "file_name": "keyboards/cannonkeys/chimera65/keymaps/default/keymap.c",
                    "file_size": 2331
                },
                {
                    "file_additions": 44,
                    "file_deletions": 0,
                    "file_exists": true,
                    "file_name": "keyboards/cannonkeys/chimera65/keymaps/via/keymap.c",
                    "file_size": 2331
                },
                {
                    "file_additions": 55,
                    "file_deletions": 57,
                    "file_exists": true,
                    "file_name": "keyboards/cannonkeys/satisfaction75/satisfaction75.c",
                    "file_size": 12955
                },
                {
                    "file_additions": 57,
                    "file_deletions": 1,
                    "file_exists": true,
                    "file_name": "keyboards/cannonkeys/satisfaction75/satisfaction_encoder.c",
                    "file_size": 6693
                },
                {
                    "file_additions": 1,
                    "file_deletions": 2,
                    "file_exists": false,
                    "file_name": "keyboards/cannonkeys/stm32f072/keyboard.c",
                    "file_size": 0
                },
                {
                    "file_additions": 0,
                    "file_deletions": 132,
                    "file_exists": false,
                    "file_name": "keyboards/clueboard/60/keymaps/yanfali/keymap.c",
                    "file_size": 0
                },
                {
                    "file_additions": 16,
                    "file_deletions": 0,
                    "file_exists": false,
                    "file_name": "keyboards/copenhagen_click/click_pad_v1/click_pad_v1.c",
                    "file_size": 0
                },
                {
                    "file_additions": 53,
                    "file_deletions": 0,
                    "file_exists": true,
                    "file_name": "keyboards/copenhagen_click/click_pad_v1/keymaps/default/keymap.c",
                    "file_size": 1339
                },
                {
                    "file_additions": 24,
                    "file_deletions": 0,
                    "file_exists": false,
                    "file_name": "keyboards/coseyfannitutti/discipad/discipad.c",
                    "file_size": 0
                },
                {
                    "file_additions": 27,
                    "file_deletions": 0,
                    "file_exists": true,
                    "file_name": "keyboards/coseyfannitutti/discipad/keymaps/default/keymap.c",
                    "file_size": 1038
                },
                {
                    "file_additions": 2,
                    "file_deletions": 2,
                    "file_exists": false,
                    "file_name": "keyboards/crkbd/keymaps/drashna/glcdfont.c",
                    "file_size": 0
                },
                {
                    "file_additions": 141,
                    "file_deletions": 164,
                    "file_exists": false,
                    "file_name": "keyboards/crkbd/keymaps/drashna/keymap.c",
                    "file_size": 0
                },
                {
                    "file_additions": 89,
                    "file_deletions": 0,
                    "file_exists": true,
                    "file_name": "keyboards/crkbd/keymaps/ninjonas/keymap.c",
                    "file_size": 8495
                },
                {
                    "file_additions": 27,
                    "file_deletions": 0,
                    "file_exists": false,
                    "file_name": "keyboards/crkbd/keymaps/ninjonas/rgb.c",
                    "file_size": 0
                },
                {
                    "file_additions": 16,
                    "file_deletions": 16,
                    "file_exists": false,
                    "file_name": "keyboards/crkbd/rev1/rev1.c",
                    "file_size": 0
                },
                {
                    "file_additions": 40,
                    "file_deletions": 16,
                    "file_exists": true,
                    "file_name": "keyboards/doro67/multi/keymaps/default/keymap.c",
                    "file_size": 5889
                },
                {
                    "file_additions": 40,
                    "file_deletions": 16,
                    "file_exists": true,
                    "file_name": "keyboards/doro67/multi/keymaps/default_iso/keymap.c",
                    "file_size": 5857
                },
                {
                    "file_additions": 40,
                    "file_deletions": 16,
                    "file_exists": true,
                    "file_name": "keyboards/doro67/multi/keymaps/default_multi/keymap.c",
                    "file_size": 5889
                }
            ],
            "interesting": {
                "reopen": false,
                "status": false
            },
            "is_parent": false,
            "sha": "bf0417415a841ea2b1f73d43488b04a4e46f42a6"
        },
        {
            "associated_pull_request": [],
            "date": "2019-09-07 15:58:17+00:00",
            "diff": "qmk_qmk_firmware/issue_6589/commit_1b8e8a6a83c11e5c400ac64dffeab72d04aed71c.diff",
            "diff_additions": 28,
            "diff_deletions": 2,
            "diff_file_size": 3035,
            "diff_url": "https://github.com/qmk/qmk_firmware/commit/1b8e8a6a83c11e5c400ac64dffeab72d04aed71c.diff",
            "exists": true,
            "files": [
                {
                    "file_additions": 26,
                    "file_deletions": 0,
                    "file_exists": true,
                    "file_name": "keyboards/9key/keymaps/bcat/keymap.c",
                    "file_size": 1385
                },
                {
                    "file_additions": 2,
                    "file_deletions": 2,
                    "file_exists": true,
                    "file_name": "keyboards/keebio/bdn9/keymaps/bcat/keymap.c",
                    "file_size": 1650
                }
            ],
            "interesting": {
                "reopen": false,
                "status": false
            },
            "is_parent": false,
            "sha": "1b8e8a6a83c11e5c400ac64dffeab72d04aed71c"
        },
        {
            "associated_pull_request": [],
            "date": "2019-08-23 18:24:46+00:00",
            "diff": "qmk_qmk_firmware/issue_6589/commit_aef356eef5bc309b0e68ab1f162c330e816ae174.diff",
            "diff_additions": 29,
            "diff_deletions": 1,
            "diff_file_size": 0,
            "diff_url": "https://github.com/qmk/qmk_firmware/commit/aef356eef5bc309b0e68ab1f162c330e816ae174.diff",
            "exists": true,
            "files": [
                {
                    "file_additions": 29,
                    "file_deletions": 1,
                    "file_exists": false,
                    "file_name": "keyboards/handwired/dactyl_manuform/4x5/keymaps/sunat/keymap.c",
                    "file_size": 0
                }
            ],
            "interesting": {
                "reopen": false,
                "status": false
            },
            "is_parent": false,
            "sha": "aef356eef5bc309b0e68ab1f162c330e816ae174"
        },
        {
            "associated_pull_request": [],
            "date": "2019-09-07 15:58:17+00:00",
            "diff": "qmk_qmk_firmware/issue_6589/commit_b821448f402d3609fb97d63b2b847769d6e721cb.diff",
            "diff_additions": 28,
            "diff_deletions": 2,
            "diff_file_size": 3035,
            "diff_url": "https://github.com/qmk/qmk_firmware/commit/b821448f402d3609fb97d63b2b847769d6e721cb.diff",
            "exists": true,
            "files": [
                {
                    "file_additions": 26,
                    "file_deletions": 0,
                    "file_exists": true,
                    "file_name": "keyboards/9key/keymaps/bcat/keymap.c",
                    "file_size": 1385
                },
                {
                    "file_additions": 2,
                    "file_deletions": 2,
                    "file_exists": true,
                    "file_name": "keyboards/keebio/bdn9/keymaps/bcat/keymap.c",
                    "file_size": 1650
                }
            ],
            "interesting": {
                "reopen": false,
                "status": false
            },
            "is_parent": false,
            "sha": "b821448f402d3609fb97d63b2b847769d6e721cb"
        },
        {
            "associated_pull_request": [],
            "date": "2019-09-07 15:58:17+00:00",
            "diff": "qmk_qmk_firmware/issue_6589/commit_5121e744cca688ef96b44cfefdc77bea5cf97804.diff",
            "diff_additions": 28,
            "diff_deletions": 2,
            "diff_file_size": 3035,
            "diff_url": "https://github.com/qmk/qmk_firmware/commit/5121e744cca688ef96b44cfefdc77bea5cf97804.diff",
            "exists": true,
            "files": [
                {
                    "file_additions": 26,
                    "file_deletions": 0,
                    "file_exists": true,
                    "file_name": "keyboards/9key/keymaps/bcat/keymap.c",
                    "file_size": 1385
                },
                {
                    "file_additions": 2,
                    "file_deletions": 2,
                    "file_exists": true,
                    "file_name": "keyboards/keebio/bdn9/keymaps/bcat/keymap.c",
                    "file_size": 1650
                }
            ],
            "interesting": {
                "reopen": false,
                "status": false
            },
            "is_parent": false,
            "sha": "5121e744cca688ef96b44cfefdc77bea5cf97804"
        },
        {
            "associated_pull_request": [],
            "date": "2019-09-07 15:58:17+00:00",
            "diff": "qmk_qmk_firmware/issue_6589/commit_9e5899d0dd78a6ea66ab5ffcf96d37d277ce98c7.diff",
            "diff_additions": 28,
            "diff_deletions": 2,
            "diff_file_size": 3035,
            "diff_url": "https://github.com/qmk/qmk_firmware/commit/9e5899d0dd78a6ea66ab5ffcf96d37d277ce98c7.diff",
            "exists": true,
            "files": [
                {
                    "file_additions": 26,
                    "file_deletions": 0,
                    "file_exists": true,
                    "file_name": "keyboards/9key/keymaps/bcat/keymap.c",
                    "file_size": 1385
                },
                {
                    "file_additions": 2,
                    "file_deletions": 2,
                    "file_exists": true,
                    "file_name": "keyboards/keebio/bdn9/keymaps/bcat/keymap.c",
                    "file_size": 1650
                }
            ],
            "interesting": {
                "reopen": false,
                "status": false
            },
            "is_parent": false,
            "sha": "9e5899d0dd78a6ea66ab5ffcf96d37d277ce98c7"
        }
    ],
    "first_commit": "2019-08-23 17:31:04+00:00",
    "last_commit": "2019-09-07 15:58:17+00:00",
    "number": 6589,
    "pull_request": "None",
    "score": {
        "accidental_reopen_likely": false,
        "all_labels": [
            "bug",
            "question",
            "discussion"
        ],
        "contains_keywords": [
            "confirm",
            "work",
            "fail",
            "chang",
            "fix",
            "issu",
            "CI",
            "perform",
            "debug",
            "reason",
            "test",
            "fault",
            "remov",
            "warn",
            "bug",
            "error",
            "problem",
            "report",
            "workaround"
        ],
        "fix_size": 58,
        "has_labels": [
            "bug"
        ],
        "intersecting": {
            "computed_score": 1.0,
            "final_commit_size": 3,
            "intersection_size": 3,
            "previous_commits_size": 58
        },
        "is_makefile_based": true,
        "no_new_files": [],
        "no_other_files": false,
        "num_prohibited_files": 87520,
        "prohibited_files": [
            "server/src/main/java/com/genymobile/scrcpy/Device.java",
            "server/src/main/java/com/genymobile/scrcpy/wrappers/SurfaceControl.java",
            "server/src/main/java/com/genymobile/scrcpy/Device.java",
            "server/src/main/java/com/genymobile/scrcpy/wrappers/SurfaceControl.java",
            "app/meson.build",
            "app/scrcpy.1",
            "app/src/common.h",
            "app/src/scrcpy.h",
            "app/src/server.h",
            "server/src/main/java/com/genymobile/scrcpy/Workarounds.java"
        ],
        "reopen": true,
        "reopen_events": [
            [
                "2019-08-23 18:25:21+00:00",
                "commit"
            ],
            [
                "2019-08-26 07:31:50+00:00",
                "commit"
            ],
            [
                "2019-08-28 03:32:37+00:00",
                "closed"
            ],
            [
                "2019-08-28 04:43:31+00:00",
                "reopened"
            ],
            [
                "2019-09-06 20:55:58+00:00",
                "commit"
            ],
            [
                "2019-09-07 15:58:19+00:00",
                "commit"
            ],
            [
                "2019-09-09 00:18:49+00:00",
                "commit"
            ],
            [
                "2019-09-18 21:57:32+00:00",
                "closed"
            ],
            [
                "2019-09-25 09:32:28+00:00",
                "commit"
            ],
            [
                "2019-09-28 05:25:39+00:00",
                "commit"
            ],
            [
                "2019-09-29 00:06:23+00:00",
                "commit"
            ],
            [
                "2019-10-03 10:53:51+00:00",
                "commit"
            ],
            [
                "2019-10-05 02:49:22+00:00",
                "commit"
            ],
            [
                "2019-10-07 09:51:28+00:00",
                "commit"
            ],
            [
                "2019-10-12 13:25:47+00:00",
                "commit"
            ],
            [
                "2019-10-12 13:25:48+00:00",
                "commit"
            ],
            [
                "2019-11-13 15:29:16+00:00",
                "commit"
            ],
            [
                "2019-12-03 16:08:46+00:00",
                "commit"
            ],
            [
                "2020-01-10 16:12:13+00:00",
                "commit"
            ]
        ],
        "status": false,
        "strategy": true,
        "total_changes": 9149
    }
}