{
    "covered_issues": [
        637,
        632,
        630,
        629,
        626,
        625,
        594,
        570,
        567,
        562,
        561,
        554,
        526,
        516,
        453,
        424,
        379,
        368,
        364,
        352,
        313,
        308,
        307,
        305,
        301,
        299,
        282,
        275,
        260,
        249,
        247,
        243,
        236,
        230,
        222,
        185,
        184,
        182,
        145,
        134,
        133,
        108,
        105,
        101,
        100,
        99,
        95,
        92,
        91,
        85,
        73,
        71,
        68,
        52,
        51,
        39,
        35,
        34,
        19,
        15,
        13,
        11,
        10,
        9,
        4,
        1
    ],
    "finished": true
}