{
    "commits": [
        {
            "associated_pull_request": [],
            "date": "2022-04-23 17:32:40+00:00",
            "diff": "libsdl-org_sdl/issue_5572/commit_981e1e3c4489add5bf6d4df5415af3cf1ef2773d.diff",
            "diff_additions": 7,
            "diff_deletions": 0,
            "diff_file_size": 72466,
            "diff_url": "https://github.com/libsdl-org/SDL/commit/981e1e3c4489add5bf6d4df5415af3cf1ef2773d.diff",
            "exists": true,
            "files": [
                {
                    "file_additions": 7,
                    "file_deletions": 0,
                    "file_exists": true,
                    "file_name": "src/render/opengl/SDL_render_gl.c",
                    "file_size": 72466
                }
            ],
            "interesting": {
                "reopen": false,
                "status": false
            },
            "is_parent": true,
            "sha": "981e1e3c4489add5bf6d4df5415af3cf1ef2773d"
        },
        {
            "associated_pull_request": [],
            "date": "2022-04-25 17:51:15+00:00",
            "diff": "libsdl-org_sdl/issue_5572/commit_53dea9830964eee8b5c2a7ee0a65d6e268dc78a1.diff",
            "diff_additions": 1,
            "diff_deletions": 12,
            "diff_file_size": 137856,
            "diff_url": "https://github.com/libsdl-org/SDL/commit/53dea9830964eee8b5c2a7ee0a65d6e268dc78a1.diff",
            "exists": true,
            "files": [
                {
                    "file_additions": 0,
                    "file_deletions": 11,
                    "file_exists": true,
                    "file_name": "src/video/x11/SDL_x11events.c",
                    "file_size": 66765
                },
                {
                    "file_additions": 1,
                    "file_deletions": 1,
                    "file_exists": true,
                    "file_name": "src/video/x11/SDL_x11window.c",
                    "file_size": 71091
                }
            ],
            "interesting": {
                "reopen": true,
                "status": false
            },
            "is_parent": false,
            "sha": "53dea9830964eee8b5c2a7ee0a65d6e268dc78a1"
        },
        {
            "associated_pull_request": [],
            "date": "2022-05-19 21:15:10+00:00",
            "diff": "libsdl-org_sdl/issue_5572/commit_9edd411a8315540b86fceec590dd5aa6be41f5f0.diff",
            "diff_additions": 14,
            "diff_deletions": 6,
            "diff_file_size": 71091,
            "diff_url": "https://github.com/libsdl-org/SDL/commit/9edd411a8315540b86fceec590dd5aa6be41f5f0.diff",
            "exists": true,
            "files": [
                {
                    "file_additions": 14,
                    "file_deletions": 6,
                    "file_exists": true,
                    "file_name": "src/video/x11/SDL_x11window.c",
                    "file_size": 71091
                }
            ],
            "interesting": {
                "reopen": false,
                "status": false
            },
            "is_parent": false,
            "sha": "9edd411a8315540b86fceec590dd5aa6be41f5f0"
        },
        {
            "associated_pull_request": [],
            "date": "2022-05-19 21:15:10+00:00",
            "diff": "libsdl-org_sdl/issue_5572/commit_f7f0bf2eb1fe20285b4044b757148aeb1e283f0b.diff",
            "diff_additions": 14,
            "diff_deletions": 6,
            "diff_file_size": 71091,
            "diff_url": "https://github.com/libsdl-org/SDL/commit/f7f0bf2eb1fe20285b4044b757148aeb1e283f0b.diff",
            "exists": true,
            "files": [
                {
                    "file_additions": 14,
                    "file_deletions": 6,
                    "file_exists": true,
                    "file_name": "src/video/x11/SDL_x11window.c",
                    "file_size": 71091
                }
            ],
            "interesting": {
                "reopen": false,
                "status": false
            },
            "is_parent": false,
            "sha": "f7f0bf2eb1fe20285b4044b757148aeb1e283f0b"
        },
        {
            "associated_pull_request": [],
            "date": "2022-05-19 21:15:10+00:00",
            "diff": "libsdl-org_sdl/issue_5572/commit_031c9b03f1e5054e8d78e1974b92a6ef77b71774.diff",
            "diff_additions": 14,
            "diff_deletions": 6,
            "diff_file_size": 71091,
            "diff_url": "https://github.com/libsdl-org/SDL/commit/031c9b03f1e5054e8d78e1974b92a6ef77b71774.diff",
            "exists": true,
            "files": [
                {
                    "file_additions": 14,
                    "file_deletions": 6,
                    "file_exists": true,
                    "file_name": "src/video/x11/SDL_x11window.c",
                    "file_size": 71091
                }
            ],
            "interesting": {
                "reopen": false,
                "status": false
            },
            "is_parent": false,
            "sha": "031c9b03f1e5054e8d78e1974b92a6ef77b71774"
        },
        {
            "associated_pull_request": [],
            "date": "2022-05-19 21:15:10+00:00",
            "diff": "libsdl-org_sdl/issue_5572/commit_128efc455505e3d8544631ece092d90008d909c3.diff",
            "diff_additions": 14,
            "diff_deletions": 6,
            "diff_file_size": 71091,
            "diff_url": "https://github.com/libsdl-org/SDL/commit/128efc455505e3d8544631ece092d90008d909c3.diff",
            "exists": true,
            "files": [
                {
                    "file_additions": 14,
                    "file_deletions": 6,
                    "file_exists": true,
                    "file_name": "src/video/x11/SDL_x11window.c",
                    "file_size": 71091
                }
            ],
            "interesting": {
                "reopen": false,
                "status": false
            },
            "is_parent": false,
            "sha": "128efc455505e3d8544631ece092d90008d909c3"
        },
        {
            "associated_pull_request": [],
            "date": "2022-04-28 19:02:38+00:00",
            "diff": "libsdl-org_sdl/issue_5572/commit_e8156c6b688b7aab8ef27eb6a57a6f106f02af5b.diff",
            "diff_additions": 6006,
            "diff_deletions": 2985,
            "diff_file_size": 4557060,
            "diff_url": "https://github.com/libsdl-org/SDL/commit/e8156c6b688b7aab8ef27eb6a57a6f106f02af5b.diff",
            "exists": true,
            "files": [
                {
                    "file_additions": 5,
                    "file_deletions": 4,
                    "file_exists": true,
                    "file_name": "src/SDL.c",
                    "file_size": 19114
                },
                {
                    "file_additions": 5,
                    "file_deletions": 0,
                    "file_exists": true,
                    "file_name": "src/SDL_hints.c",
                    "file_size": 8982
                },
                {
                    "file_additions": 93,
                    "file_deletions": 0,
                    "file_exists": true,
                    "file_name": "src/SDL_list.c",
                    "file_size": 2132
                },
                {
                    "file_additions": 41,
                    "file_deletions": 89,
                    "file_exists": true,
                    "file_name": "src/audio/SDL_audio.c",
                    "file_size": 85289
                },
                {
                    "file_additions": 47,
                    "file_deletions": 32,
                    "file_exists": true,
                    "file_name": "src/audio/SDL_audiocvt.c",
                    "file_size": 43024
                },
                {
                    "file_additions": 53,
                    "file_deletions": 54,
                    "file_exists": true,
                    "file_name": "src/audio/SDL_mixer.c",
                    "file_size": 11106
                },
                {
                    "file_additions": 1,
                    "file_deletions": 1,
                    "file_exists": true,
                    "file_name": "src/audio/SDL_wave.c",
                    "file_size": 75958
                },
                {
                    "file_additions": 9,
                    "file_deletions": 8,
                    "file_exists": true,
                    "file_name": "src/audio/aaudio/SDL_aaudio.c",
                    "file_size": 20156
                },
                {
                    "file_additions": 13,
                    "file_deletions": 20,
                    "file_exists": true,
                    "file_name": "src/audio/alsa/SDL_alsa_audio.c",
                    "file_size": 38087
                },
                {
                    "file_additions": 10,
                    "file_deletions": 11,
                    "file_exists": true,
                    "file_name": "src/audio/android/SDL_androidaudio.c",
                    "file_size": 6205
                },
                {
                    "file_additions": 15,
                    "file_deletions": 23,
                    "file_exists": false,
                    "file_name": "src/audio/arts/SDL_artsaudio.c",
                    "file_size": 0
                },
                {
                    "file_additions": 20,
                    "file_deletions": 24,
                    "file_exists": true,
                    "file_name": "src/audio/directsound/SDL_directsound.c",
                    "file_size": 24199
                },
                {
                    "file_additions": 8,
                    "file_deletions": 6,
                    "file_exists": true,
                    "file_name": "src/audio/disk/SDL_diskaudio.c",
                    "file_size": 5694
                },
                {
                    "file_additions": 8,
                    "file_deletions": 6,
                    "file_exists": true,
                    "file_name": "src/audio/dsp/SDL_dspaudio.c",
                    "file_size": 9938
                },
                {
                    "file_additions": 6,
                    "file_deletions": 6,
                    "file_exists": true,
                    "file_name": "src/audio/dummy/SDL_dummyaudio.c",
                    "file_size": 3138
                },
                {
                    "file_additions": 34,
                    "file_deletions": 31,
                    "file_exists": true,
                    "file_name": "src/audio/emscripten/SDL_emscriptenaudio.c",
                    "file_size": 14927
                },
                {
                    "file_additions": 7,
                    "file_deletions": 7,
                    "file_exists": false,
                    "file_name": "src/audio/esd/SDL_esdaudio.c",
                    "file_size": 0
                },
                {
                    "file_additions": 14,
                    "file_deletions": 25,
                    "file_exists": false,
                    "file_name": "src/audio/fusionsound/SDL_fsaudio.c",
                    "file_size": 0
                },
                {
                    "file_additions": 14,
                    "file_deletions": 17,
                    "file_exists": true,
                    "file_name": "src/audio/haiku/SDL_haikuaudio.cc",
                    "file_size": 6735
                },
                {
                    "file_additions": 7,
                    "file_deletions": 6,
                    "file_exists": true,
                    "file_name": "src/audio/jack/SDL_jackaudio.c",
                    "file_size": 15313
                },
                {
                    "file_additions": 7,
                    "file_deletions": 7,
                    "file_exists": false,
                    "file_name": "src/audio/nacl/SDL_naclaudio.c",
                    "file_size": 0
                },
                {
                    "file_additions": 35,
                    "file_deletions": 37,
                    "file_exists": false,
                    "file_name": "src/audio/nas/SDL_nasaudio.c",
                    "file_size": 0
                },
                {
                    "file_additions": 26,
                    "file_deletions": 32,
                    "file_exists": true,
                    "file_name": "src/audio/netbsd/SDL_netbsdaudio.c",
                    "file_size": 10571
                },
                {
                    "file_additions": 40,
                    "file_deletions": 28,
                    "file_exists": true,
                    "file_name": "src/audio/openslES/SDL_openslES.c",
                    "file_size": 26349
                },
                {
                    "file_additions": 15,
                    "file_deletions": 16,
                    "file_exists": false,
                    "file_name": "src/audio/os2/SDL_os2audio.c",
                    "file_size": 0
                },
                {
                    "file_additions": 28,
                    "file_deletions": 50,
                    "file_exists": false,
                    "file_name": "src/audio/paudio/SDL_paudio.c",
                    "file_size": 0
                },
                {
                    "file_additions": 143,
                    "file_deletions": 102,
                    "file_exists": true,
                    "file_name": "src/audio/pipewire/SDL_pipewire.c",
                    "file_size": 44228
                },
                {
                    "file_additions": 7,
                    "file_deletions": 7,
                    "file_exists": true,
                    "file_name": "src/audio/psp/SDL_pspaudio.c",
                    "file_size": 6593
                },
                {
                    "file_additions": 24,
                    "file_deletions": 28,
                    "file_exists": true,
                    "file_name": "src/audio/pulseaudio/SDL_pulseaudio.c",
                    "file_size": 42264
                },
                {
                    "file_additions": 31,
                    "file_deletions": 80,
                    "file_exists": false,
                    "file_name": "src/audio/qsa/SDL_qsa_audio.c",
                    "file_size": 0
                },
                {
                    "file_additions": 11,
                    "file_deletions": 14,
                    "file_exists": true,
                    "file_name": "src/audio/sndio/SDL_sndioaudio.c",
                    "file_size": 11055
                },
                {
                    "file_additions": 6,
                    "file_deletions": 5,
                    "file_exists": false,
                    "file_name": "src/audio/sun/SDL_sunaudio.c",
                    "file_size": 0
                },
                {
                    "file_additions": 68,
                    "file_deletions": 27,
                    "file_exists": true,
                    "file_name": "src/audio/vita/SDL_vitaaudio.c",
                    "file_size": 8038
                },
                {
                    "file_additions": 18,
                    "file_deletions": 26,
                    "file_exists": true,
                    "file_name": "src/audio/wasapi/SDL_wasapi.c",
                    "file_size": 26849
                },
                {
                    "file_additions": 14,
                    "file_deletions": 16,
                    "file_exists": false,
                    "file_name": "src/audio/winmm/SDL_winmm.c",
                    "file_size": 0
                },
                {
                    "file_additions": 13,
                    "file_deletions": 0,
                    "file_exists": true,
                    "file_name": "src/core/android/SDL_android.c",
                    "file_size": 98469
                },
                {
                    "file_additions": 4,
                    "file_deletions": 4,
                    "file_exists": true,
                    "file_name": "src/core/linux/SDL_fcitx.c",
                    "file_size": 15512
                },
                {
                    "file_additions": 8,
                    "file_deletions": 3,
                    "file_exists": true,
                    "file_name": "src/core/linux/SDL_ibus.c",
                    "file_size": 23687
                },
                {
                    "file_additions": 3,
                    "file_deletions": 3,
                    "file_exists": true,
                    "file_name": "src/core/linux/SDL_ime.c",
                    "file_size": 4540
                },
                {
                    "file_additions": 8,
                    "file_deletions": 1,
                    "file_exists": true,
                    "file_name": "src/core/openbsd/SDL_wscons_kbd.c",
                    "file_size": 34051
                },
                {
                    "file_additions": 17,
                    "file_deletions": 12,
                    "file_exists": false,
                    "file_name": "src/core/os2/geniconv/geniconv.c",
                    "file_size": 0
                },
                {
                    "file_additions": 72,
                    "file_deletions": 1,
                    "file_exists": true,
                    "file_name": "src/core/windows/SDL_windows.c",
                    "file_size": 15236
                },
                {
                    "file_additions": 1,
                    "file_deletions": 1,
                    "file_exists": true,
                    "file_name": "src/core/winrt/SDL_winrtapp_xaml.cpp",
                    "file_size": 5702
                },
                {
                    "file_additions": 72,
                    "file_deletions": 53,
                    "file_exists": true,
                    "file_name": "src/events/SDL_events.c",
                    "file_size": 51007
                },
                {
                    "file_additions": 23,
                    "file_deletions": 2,
                    "file_exists": true,
                    "file_name": "src/events/SDL_keyboard.c",
                    "file_size": 35864
                },
                {
                    "file_additions": 110,
                    "file_deletions": 40,
                    "file_exists": true,
                    "file_name": "src/events/SDL_mouse.c",
                    "file_size": 43193
                },
                {
                    "file_additions": 20,
                    "file_deletions": 2,
                    "file_exists": true,
                    "file_name": "src/events/SDL_touch.c",
                    "file_size": 14974
                },
                {
                    "file_additions": 4,
                    "file_deletions": 3,
                    "file_exists": true,
                    "file_name": "src/events/SDL_windowevents.c",
                    "file_size": 7800
                },
                {
                    "file_additions": 1,
                    "file_deletions": 1,
                    "file_exists": true,
                    "file_name": "src/file/SDL_rwops.c",
                    "file_size": 28241
                },
                {
                    "file_additions": 13,
                    "file_deletions": 11,
                    "file_exists": false,
                    "file_name": "src/filesystem/os2/SDL_sysfilesystem.c",
                    "file_size": 0
                },
                {
                    "file_additions": 1,
                    "file_deletions": 19,
                    "file_exists": true,
                    "file_name": "src/filesystem/windows/SDL_sysfilesystem.c",
                    "file_size": 9975
                },
                {
                    "file_additions": 2,
                    "file_deletions": 4,
                    "file_exists": true,
                    "file_name": "src/haptic/windows/SDL_dinputhaptic.c",
                    "file_size": 39661
                },
                {
                    "file_additions": 1,
                    "file_deletions": 2,
                    "file_exists": true,
                    "file_name": "src/haptic/windows/SDL_xinputhaptic.c",
                    "file_size": 13280
                },
                {
                    "file_additions": 6,
                    "file_deletions": 4,
                    "file_exists": true,
                    "file_name": "src/hidapi/SDL_hidapi.c",
                    "file_size": 62634
                },
                {
                    "file_additions": 99,
                    "file_deletions": 20,
                    "file_exists": true,
                    "file_name": "src/hidapi/android/hid.cpp",
                    "file_size": 41117
                },
                {
                    "file_additions": 44,
                    "file_deletions": 7,
                    "file_exists": true,
                    "file_name": "src/hidapi/libusb/hid.c",
                    "file_size": 61093
                },
                {
                    "file_additions": 17,
                    "file_deletions": 16,
                    "file_exists": true,
                    "file_name": "src/hidapi/mac/hid.c",
                    "file_size": 45108
                },
                {
                    "file_additions": 58,
                    "file_deletions": 31,
                    "file_exists": true,
                    "file_name": "src/joystick/SDL_joystick.c",
                    "file_size": 105592
                },
                {
                    "file_additions": 1,
                    "file_deletions": 0,
                    "file_exists": true,
                    "file_name": "src/joystick/android/SDL_sysjoystick.c",
                    "file_size": 20002
                },
                {
                    "file_additions": 27,
                    "file_deletions": 4,
                    "file_exists": true,
                    "file_name": "src/joystick/hidapi/SDL_hidapi_gamecube.c",
                    "file_size": 20937
                },
                {
                    "file_additions": 6,
                    "file_deletions": 0,
                    "file_exists": true,
                    "file_name": "src/joystick/hidapi/SDL_hidapi_ps4.c",
                    "file_size": 48566
                },
                {
                    "file_additions": 9,
                    "file_deletions": 2,
                    "file_exists": true,
                    "file_name": "src/joystick/hidapi/SDL_hidapi_ps5.c",
                    "file_size": 60724
                },
                {
                    "file_additions": 1,
                    "file_deletions": 2,
                    "file_exists": true,
                    "file_name": "src/joystick/hidapi/SDL_hidapi_switch.c",
                    "file_size": 105567
                },
                {
                    "file_additions": 12,
                    "file_deletions": 36,
                    "file_exists": true,
                    "file_name": "src/joystick/hidapi/SDL_hidapi_xboxone.c",
                    "file_size": 60320
                },
                {
                    "file_additions": 7,
                    "file_deletions": 13,
                    "file_exists": true,
                    "file_name": "src/joystick/hidapi/SDL_hidapijoystick.c",
                    "file_size": 53357
                },
                {
                    "file_additions": 88,
                    "file_deletions": 31,
                    "file_exists": true,
                    "file_name": "src/joystick/linux/SDL_sysjoystick.c",
                    "file_size": 88871
                },
                {
                    "file_additions": 2,
                    "file_deletions": 1,
                    "file_exists": true,
                    "file_name": "src/joystick/vita/SDL_sysjoystick.c",
                    "file_size": 11518
                },
                {
                    "file_additions": 103,
                    "file_deletions": 43,
                    "file_exists": true,
                    "file_name": "src/joystick/windows/SDL_rawinputjoystick.c",
                    "file_size": 84458
                },
                {
                    "file_additions": 39,
                    "file_deletions": 70,
                    "file_exists": true,
                    "file_name": "src/joystick/windows/SDL_windows_gaming_input.c",
                    "file_size": 41949
                },
                {
                    "file_additions": 14,
                    "file_deletions": 3,
                    "file_exists": true,
                    "file_name": "src/joystick/windows/SDL_xinputjoystick.c",
                    "file_size": 22404
                },
                {
                    "file_additions": 1,
                    "file_deletions": 1,
                    "file_exists": false,
                    "file_name": "src/loadso/os2/SDL_sysloadso.c",
                    "file_size": 0
                },
                {
                    "file_additions": 1,
                    "file_deletions": 1,
                    "file_exists": true,
                    "file_name": "src/loadso/windows/SDL_sysloadso.c",
                    "file_size": 2564
                },
                {
                    "file_additions": 71,
                    "file_deletions": 0,
                    "file_exists": true,
                    "file_name": "src/locale/vita/SDL_syslocale.c",
                    "file_size": 2036
                },
                {
                    "file_additions": 37,
                    "file_deletions": 0,
                    "file_exists": true,
                    "file_name": "src/misc/emscripten/SDL_sysurl.c",
                    "file_size": 1184
                },
                {
                    "file_additions": 1,
                    "file_deletions": 2,
                    "file_exists": true,
                    "file_name": "src/misc/winrt/SDL_sysurl.cpp",
                    "file_size": 1425
                },
                {
                    "file_additions": 21,
                    "file_deletions": 11,
                    "file_exists": true,
                    "file_name": "src/power/linux/SDL_syspower.c",
                    "file_size": 20624
                },
                {
                    "file_additions": 88,
                    "file_deletions": 132,
                    "file_exists": true,
                    "file_name": "src/render/SDL_render.c",
                    "file_size": 140809
                },
                {
                    "file_additions": 78,
                    "file_deletions": 35,
                    "file_exists": true,
                    "file_name": "src/render/direct3d/SDL_render_d3d.c",
                    "file_size": 61541
                },
                {
                    "file_additions": 53,
                    "file_deletions": 62,
                    "file_exists": true,
                    "file_name": "src/render/direct3d11/SDL_render_d3d11.c",
                    "file_size": 98799
                },
                {
                    "file_additions": 3,
                    "file_deletions": 1,
                    "file_exists": true,
                    "file_name": "src/render/direct3d11/SDL_shaders_d3d11.c",
                    "file_size": 117149
                },
                {
                    "file_additions": 188,
                    "file_deletions": 61,
                    "file_exists": true,
                    "file_name": "src/render/opengl/SDL_render_gl.c",
                    "file_size": 72466
                },
                {
                    "file_additions": 2,
                    "file_deletions": 1,
                    "file_exists": true,
                    "file_name": "src/render/opengl/SDL_shaders_gl.c",
                    "file_size": 23065
                },
                {
                    "file_additions": 75,
                    "file_deletions": 41,
                    "file_exists": true,
                    "file_name": "src/render/opengles2/SDL_render_gles2.c",
                    "file_size": 81191
                },
                {
                    "file_additions": 5,
                    "file_deletions": 0,
                    "file_exists": true,
                    "file_name": "src/render/opengles2/SDL_shaders_gles2.c",
                    "file_size": 21352
                },
                {
                    "file_additions": 41,
                    "file_deletions": 26,
                    "file_exists": true,
                    "file_name": "src/render/psp/SDL_render_psp.c",
                    "file_size": 43052
                },
                {
                    "file_additions": 2,
                    "file_deletions": 2,
                    "file_exists": true,
                    "file_name": "src/render/software/SDL_blendfillrect.c",
                    "file_size": 10307
                },
                {
                    "file_additions": 1,
                    "file_deletions": 1,
                    "file_exists": true,
                    "file_name": "src/render/software/SDL_blendline.c",
                    "file_size": 28402
                },
                {
                    "file_additions": 2,
                    "file_deletions": 2,
                    "file_exists": true,
                    "file_name": "src/render/software/SDL_blendpoint.c",
                    "file_size": 9958
                },
                {
                    "file_additions": 2,
                    "file_deletions": 2,
                    "file_exists": true,
                    "file_name": "src/render/software/SDL_drawline.c",
                    "file_size": 6616
                },
                {
                    "file_additions": 2,
                    "file_deletions": 2,
                    "file_exists": true,
                    "file_name": "src/render/software/SDL_drawpoint.c",
                    "file_size": 3134
                },
                {
                    "file_additions": 90,
                    "file_deletions": 50,
                    "file_exists": true,
                    "file_name": "src/render/software/SDL_render_sw.c",
                    "file_size": 43944
                },
                {
                    "file_additions": 137,
                    "file_deletions": 93,
                    "file_exists": true,
                    "file_name": "src/render/software/SDL_rotate.c",
                    "file_size": 22603
                },
                {
                    "file_additions": 43,
                    "file_deletions": 14,
                    "file_exists": true,
                    "file_name": "src/render/software/SDL_triangle.c",
                    "file_size": 27501
                },
                {
                    "file_additions": 263,
                    "file_deletions": 28,
                    "file_exists": true,
                    "file_name": "src/render/vitagxm/SDL_render_vita_gxm.c",
                    "file_size": 42133
                },
                {
                    "file_additions": 70,
                    "file_deletions": 6,
                    "file_exists": true,
                    "file_name": "src/render/vitagxm/SDL_render_vita_gxm_memory.c",
                    "file_size": 4948
                },
                {
                    "file_additions": 82,
                    "file_deletions": 70,
                    "file_exists": true,
                    "file_name": "src/render/vitagxm/SDL_render_vita_gxm_tools.c",
                    "file_size": 46251
                },
                {
                    "file_additions": 4,
                    "file_deletions": 1,
                    "file_exists": true,
                    "file_name": "src/sensor/windows/SDL_windowssensor.c",
                    "file_size": 15873
                },
                {
                    "file_additions": 7,
                    "file_deletions": 7,
                    "file_exists": true,
                    "file_name": "src/stdlib/SDL_getenv.c",
                    "file_size": 6513
                },
                {
                    "file_additions": 3,
                    "file_deletions": 18,
                    "file_exists": true,
                    "file_name": "src/stdlib/SDL_iconv.c",
                    "file_size": 25229
                },
                {
                    "file_additions": 36,
                    "file_deletions": 34,
                    "file_exists": true,
                    "file_name": "src/stdlib/SDL_string.c",
                    "file_size": 59003
                },
                {
                    "file_additions": 2,
                    "file_deletions": 0,
                    "file_exists": true,
                    "file_name": "src/test/SDL_test_common.c",
                    "file_size": 96334
                },
                {
                    "file_additions": 3,
                    "file_deletions": 3,
                    "file_exists": true,
                    "file_name": "src/thread/generic/SDL_syscond.c",
                    "file_size": 6924
                },
                {
                    "file_additions": 3,
                    "file_deletions": 3,
                    "file_exists": true,
                    "file_name": "src/thread/generic/SDL_sysmutex.c",
                    "file_size": 4176
                },
                {
                    "file_additions": 3,
                    "file_deletions": 3,
                    "file_exists": true,
                    "file_name": "src/thread/generic/SDL_syssem.c",
                    "file_size": 4306
                },
                {
                    "file_additions": 8,
                    "file_deletions": 8,
                    "file_exists": false,
                    "file_name": "src/thread/os2/SDL_sysmutex.c",
                    "file_size": 0
                },
                {
                    "file_additions": 3,
                    "file_deletions": 3,
                    "file_exists": false,
                    "file_name": "src/thread/os2/SDL_syssem.c",
                    "file_size": 0
                },
                {
                    "file_additions": 3,
                    "file_deletions": 3,
                    "file_exists": true,
                    "file_name": "src/thread/psp/SDL_syscond.c",
                    "file_size": 6025
                },
                {
                    "file_additions": 3,
                    "file_deletions": 3,
                    "file_exists": true,
                    "file_name": "src/thread/psp/SDL_sysmutex.c",
                    "file_size": 3461
                },
                {
                    "file_additions": 3,
                    "file_deletions": 3,
                    "file_exists": true,
                    "file_name": "src/thread/psp/SDL_syssem.c",
                    "file_size": 3687
                },
                {
                    "file_additions": 4,
                    "file_deletions": 4,
                    "file_exists": true,
                    "file_name": "src/thread/pthread/SDL_syscond.c",
                    "file_size": 3806
                },
                {
                    "file_additions": 3,
                    "file_deletions": 3,
                    "file_exists": true,
                    "file_name": "src/thread/pthread/SDL_sysmutex.c",
                    "file_size": 4970
                },
                {
                    "file_additions": 4,
                    "file_deletions": 4,
                    "file_exists": true,
                    "file_name": "src/thread/pthread/SDL_syssem.c",
                    "file_size": 4645
                },
                {
                    "file_additions": 13,
                    "file_deletions": 6,
                    "file_exists": true,
                    "file_name": "src/thread/pthread/SDL_systhread.c",
                    "file_size": 8913
                },
                {
                    "file_additions": 5,
                    "file_deletions": 10,
                    "file_exists": true,
                    "file_name": "src/thread/stdcpp/SDL_syscond.cpp",
                    "file_size": 3840
                },
                {
                    "file_additions": 4,
                    "file_deletions": 7,
                    "file_exists": true,
                    "file_name": "src/thread/stdcpp/SDL_sysmutex.cpp",
                    "file_size": 2531
                },
                {
                    "file_additions": 2,
                    "file_deletions": 4,
                    "file_exists": true,
                    "file_name": "src/thread/stdcpp/SDL_systhread.cpp",
                    "file_size": 4381
                },
                {
                    "file_additions": 3,
                    "file_deletions": 3,
                    "file_exists": true,
                    "file_name": "src/thread/vita/SDL_syscond.c",
                    "file_size": 6045
                },
                {
                    "file_additions": 3,
                    "file_deletions": 3,
                    "file_exists": true,
                    "file_name": "src/thread/vita/SDL_sysmutex.c",
                    "file_size": 3387
                },
                {
                    "file_additions": 3,
                    "file_deletions": 3,
                    "file_exists": true,
                    "file_name": "src/thread/vita/SDL_syssem.c",
                    "file_size": 3754
                },
                {
                    "file_additions": 4,
                    "file_deletions": 4,
                    "file_exists": true,
                    "file_name": "src/thread/windows/SDL_syscond_cv.c",
                    "file_size": 8571
                },
                {
                    "file_additions": 6,
                    "file_deletions": 6,
                    "file_exists": true,
                    "file_name": "src/thread/windows/SDL_sysmutex.c",
                    "file_size": 8527
                },
                {
                    "file_additions": 8,
                    "file_deletions": 8,
                    "file_exists": true,
                    "file_name": "src/thread/windows/SDL_syssem.c",
                    "file_size": 11225
                },
                {
                    "file_additions": 11,
                    "file_deletions": 2,
                    "file_exists": false,
                    "file_name": "src/timer/os2/SDL_systimer.c",
                    "file_size": 0
                },
                {
                    "file_additions": 8,
                    "file_deletions": 7,
                    "file_exists": true,
                    "file_name": "src/timer/unix/SDL_systimer.c",
                    "file_size": 5101
                },
                {
                    "file_additions": 1,
                    "file_deletions": 3,
                    "file_exists": true,
                    "file_name": "src/video/SDL_blit.c",
                    "file_size": 8367
                },
                {
                    "file_additions": 83,
                    "file_deletions": 0,
                    "file_exists": true,
                    "file_name": "src/video/SDL_blit_0.c",
                    "file_size": 22471
                },
                {
                    "file_additions": 1,
                    "file_deletions": 1,
                    "file_exists": true,
                    "file_name": "src/video/SDL_blit_N.c",
                    "file_size": 124130
                },
                {
                    "file_additions": 6,
                    "file_deletions": 18,
                    "file_exists": true,
                    "file_name": "src/video/SDL_blit_auto.c",
                    "file_size": 272923
                },
                {
                    "file_additions": 45,
                    "file_deletions": 14,
                    "file_exists": true,
                    "file_name": "src/video/SDL_blit_slow.c",
                    "file_size": 7524
                },
                {
                    "file_additions": 24,
                    "file_deletions": 13,
                    "file_exists": true,
                    "file_name": "src/video/SDL_bmp.c",
                    "file_size": 30017
                },
                {
                    "file_additions": 8,
                    "file_deletions": 18,
                    "file_exists": true,
                    "file_name": "src/video/SDL_egl.c",
                    "file_size": 49795
                },
                {
                    "file_additions": 21,
                    "file_deletions": 9,
                    "file_exists": true,
                    "file_name": "src/video/SDL_fillrect.c",
                    "file_size": 12046
                },
                {
                    "file_additions": 2,
                    "file_deletions": 41,
                    "file_exists": true,
                    "file_name": "src/video/SDL_pixels.c",
                    "file_size": 33200
                },
                {
                    "file_additions": 0,
                    "file_deletions": 0,
                    "file_exists": true,
                    "file_name": "src/video/SDL_rect.c",
                    "file_size": 3870
                },
                {
                    "file_additions": 4,
                    "file_deletions": 5,
                    "file_exists": true,
                    "file_name": "src/video/SDL_surface.c",
                    "file_size": 46720
                },
                {
                    "file_additions": 196,
                    "file_deletions": 171,
                    "file_exists": true,
                    "file_name": "src/video/SDL_video.c",
                    "file_size": 151829
                },
                {
                    "file_additions": 10,
                    "file_deletions": 1,
                    "file_exists": true,
                    "file_name": "src/video/android/SDL_androidevents.c",
                    "file_size": 8810
                },
                {
                    "file_additions": 1,
                    "file_deletions": 1,
                    "file_exists": true,
                    "file_name": "src/video/android/SDL_androidgl.c",
                    "file_size": 2628
                },
                {
                    "file_additions": 3,
                    "file_deletions": 0,
                    "file_exists": true,
                    "file_name": "src/video/android/SDL_androidvideo.c",
                    "file_size": 10089
                },
                {
                    "file_additions": 16,
                    "file_deletions": 0,
                    "file_exists": true,
                    "file_name": "src/video/android/SDL_androidwindow.c",
                    "file_size": 6324
                },
                {
                    "file_additions": 2,
                    "file_deletions": 6,
                    "file_exists": true,
                    "file_name": "src/video/dummy/SDL_nullframebuffer.c",
                    "file_size": 2812
                },
                {
                    "file_additions": 2,
                    "file_deletions": 1,
                    "file_exists": true,
                    "file_name": "src/video/dummy/SDL_nullvideo.c",
                    "file_size": 4788
                },
                {
                    "file_additions": 2,
                    "file_deletions": 4,
                    "file_exists": true,
                    "file_name": "src/video/emscripten/SDL_emscriptenevents.c",
                    "file_size": 37166
                },
                {
                    "file_additions": 27,
                    "file_deletions": 11,
                    "file_exists": true,
                    "file_name": "src/video/emscripten/SDL_emscriptenframebuffer.c",
                    "file_size": 5210
                },
                {
                    "file_additions": 40,
                    "file_deletions": 16,
                    "file_exists": true,
                    "file_name": "src/video/emscripten/SDL_emscriptenmouse.c",
                    "file_size": 7489
                },
                {
                    "file_additions": 25,
                    "file_deletions": 2,
                    "file_exists": true,
                    "file_name": "src/video/emscripten/SDL_emscriptenvideo.c",
                    "file_size": 11766
                },
                {
                    "file_additions": 9,
                    "file_deletions": 139,
                    "file_exists": true,
                    "file_name": "src/video/haiku/SDL_bframebuffer.cc",
                    "file_size": 3312
                },
                {
                    "file_additions": 29,
                    "file_deletions": 7,
                    "file_exists": true,
                    "file_name": "src/video/haiku/SDL_bopengl.cc",
                    "file_size": 6136
                },
                {
                    "file_additions": 28,
                    "file_deletions": 1,
                    "file_exists": true,
                    "file_name": "src/video/haiku/SDL_bvideo.cc",
                    "file_size": 9370
                },
                {
                    "file_additions": 7,
                    "file_deletions": 0,
                    "file_exists": true,
                    "file_name": "src/video/haiku/SDL_bwindow.cc",
                    "file_size": 6865
                },
                {
                    "file_additions": 1,
                    "file_deletions": 2,
                    "file_exists": false,
                    "file_name": "src/video/nacl/SDL_naclwindow.c",
                    "file_size": 0
                },
                {
                    "file_additions": 2,
                    "file_deletions": 6,
                    "file_exists": true,
                    "file_name": "src/video/offscreen/SDL_offscreenframebuffer.c",
                    "file_size": 2862
                },
                {
                    "file_additions": 5,
                    "file_deletions": 3,
                    "file_exists": false,
                    "file_name": "src/video/os2/SDL_os2dive.c",
                    "file_size": 0
                },
                {
                    "file_additions": 5,
                    "file_deletions": 5,
                    "file_exists": false,
                    "file_name": "src/video/os2/SDL_os2messagebox.c",
                    "file_size": 0
                },
                {
                    "file_additions": 6,
                    "file_deletions": 3,
                    "file_exists": false,
                    "file_name": "src/video/os2/SDL_os2util.c",
                    "file_size": 0
                },
                {
                    "file_additions": 8,
                    "file_deletions": 6,
                    "file_exists": false,
                    "file_name": "src/video/os2/SDL_os2video.c",
                    "file_size": 0
                },
                {
                    "file_additions": 5,
                    "file_deletions": 6,
                    "file_exists": false,
                    "file_name": "src/video/os2/SDL_os2vman.c",
                    "file_size": 0
                },
                {
                    "file_additions": 6,
                    "file_deletions": 13,
                    "file_exists": true,
                    "file_name": "src/video/riscos/SDL_riscosevents.c",
                    "file_size": 5131
                },
                {
                    "file_additions": 1,
                    "file_deletions": 1,
                    "file_exists": true,
                    "file_name": "src/video/vita/SDL_vitaframebuffer.c",
                    "file_size": 3270
                },
                {
                    "file_additions": 47,
                    "file_deletions": 18,
                    "file_exists": true,
                    "file_name": "src/video/vita/SDL_vitagl_pvr.c",
                    "file_size": 4432
                },
                {
                    "file_additions": 12,
                    "file_deletions": 12,
                    "file_exists": true,
                    "file_name": "src/video/vita/SDL_vitagles.c",
                    "file_size": 7078
                },
                {
                    "file_additions": 103,
                    "file_deletions": 0,
                    "file_exists": true,
                    "file_name": "src/video/vita/SDL_vitagles_pvr.c",
                    "file_size": 3427
                },
                {
                    "file_additions": 21,
                    "file_deletions": 8,
                    "file_exists": true,
                    "file_name": "src/video/vita/SDL_vitatouch.c",
                    "file_size": 7006
                },
                {
                    "file_additions": 47,
                    "file_deletions": 17,
                    "file_exists": true,
                    "file_name": "src/video/vita/SDL_vitavideo.c",
                    "file_size": 16724
                },
                {
                    "file_additions": 568,
                    "file_deletions": 38,
                    "file_exists": true,
                    "file_name": "src/video/wayland/SDL_waylandevents.c",
                    "file_size": 108088
                },
                {
                    "file_additions": 2,
                    "file_deletions": 2,
                    "file_exists": true,
                    "file_name": "src/video/wayland/SDL_waylandopengles.c",
                    "file_size": 8110
                },
                {
                    "file_additions": 333,
                    "file_deletions": 69,
                    "file_exists": true,
                    "file_name": "src/video/wayland/SDL_waylandvideo.c",
                    "file_size": 40229
                },
                {
                    "file_additions": 2,
                    "file_deletions": 2,
                    "file_exists": true,
                    "file_name": "src/video/wayland/SDL_waylandvulkan.c",
                    "file_size": 6487
                },
                {
                    "file_additions": 667,
                    "file_deletions": 93,
                    "file_exists": true,
                    "file_name": "src/video/wayland/SDL_waylandwindow.c",
                    "file_size": 97578
                },
                {
                    "file_additions": 60,
                    "file_deletions": 22,
                    "file_exists": true,
                    "file_name": "src/video/windows/SDL_windowsevents.c",
                    "file_size": 76136
                },
                {
                    "file_additions": 195,
                    "file_deletions": 77,
                    "file_exists": true,
                    "file_name": "src/video/windows/SDL_windowskeyboard.c",
                    "file_size": 58535
                },
                {
                    "file_additions": 6,
                    "file_deletions": 3,
                    "file_exists": true,
                    "file_name": "src/video/windows/SDL_windowsmouse.c",
                    "file_size": 13741
                },
                {
                    "file_additions": 2,
                    "file_deletions": 0,
                    "file_exists": true,
                    "file_name": "src/video/windows/SDL_windowsvideo.c",
                    "file_size": 26935
                }
            ],
            "interesting": {
                "reopen": false,
                "status": false
            },
            "is_parent": false,
            "sha": "e8156c6b688b7aab8ef27eb6a57a6f106f02af5b"
        }
    ],
    "first_commit": "2022-04-23 17:35:05+00:00",
    "last_commit": "2022-04-28 19:02:38+00:00",
    "number": 5572,
    "pull_request": "None",
    "score": {
        "accidental_reopen_likely": false,
        "all_labels": [],
        "contains_keywords": [
            "work",
            "fail",
            "chang",
            "fix",
            "issu",
            "CI",
            "patch",
            "perform",
            "debug",
            "reason",
            "test",
            "attempt",
            "fault",
            "leak",
            "remov",
            "warn",
            "bug",
            "error",
            "problem",
            "crash",
            "report"
        ],
        "fix_size": 9177,
        "has_labels": [],
        "intersecting": {
            "computed_score": 0.002509821038847665,
            "final_commit_size": 9164,
            "intersection_size": 23,
            "previous_commits_size": 36
        },
        "is_makefile_based": true,
        "no_new_files": [
            "src/SDL.c",
            "src/SDL_hints.c",
            "src/audio/SDL_audio.c",
            "src/audio/SDL_audiocvt.c",
            "src/audio/SDL_mixer.c",
            "src/audio/SDL_wave.c",
            "src/audio/aaudio/SDL_aaudio.c",
            "src/audio/alsa/SDL_alsa_audio.c",
            "src/audio/android/SDL_androidaudio.c",
            "src/audio/arts/SDL_artsaudio.c",
            "src/audio/directsound/SDL_directsound.c",
            "src/audio/disk/SDL_diskaudio.c",
            "src/audio/dsp/SDL_dspaudio.c",
            "src/audio/dummy/SDL_dummyaudio.c",
            "src/audio/emscripten/SDL_emscriptenaudio.c",
            "src/audio/esd/SDL_esdaudio.c",
            "src/audio/fusionsound/SDL_fsaudio.c",
            "src/audio/haiku/SDL_haikuaudio.cc",
            "src/audio/jack/SDL_jackaudio.c",
            "src/audio/nacl/SDL_naclaudio.c",
            "src/audio/nas/SDL_nasaudio.c",
            "src/audio/netbsd/SDL_netbsdaudio.c",
            "src/audio/openslES/SDL_openslES.c",
            "src/audio/os2/SDL_os2audio.c",
            "src/audio/paudio/SDL_paudio.c",
            "src/audio/pipewire/SDL_pipewire.c",
            "src/audio/psp/SDL_pspaudio.c",
            "src/audio/pulseaudio/SDL_pulseaudio.c",
            "src/audio/qsa/SDL_qsa_audio.c",
            "src/audio/sndio/SDL_sndioaudio.c",
            "src/audio/sun/SDL_sunaudio.c",
            "src/audio/vita/SDL_vitaaudio.c",
            "src/audio/wasapi/SDL_wasapi.c",
            "src/audio/winmm/SDL_winmm.c",
            "src/core/android/SDL_android.c",
            "src/core/linux/SDL_fcitx.c",
            "src/core/linux/SDL_ibus.c",
            "src/core/linux/SDL_ime.c",
            "src/core/openbsd/SDL_wscons_kbd.c",
            "src/core/os2/geniconv/geniconv.c",
            "src/core/windows/SDL_windows.c",
            "src/core/winrt/SDL_winrtapp_xaml.cpp",
            "src/events/SDL_events.c",
            "src/events/SDL_keyboard.c",
            "src/events/SDL_mouse.c",
            "src/events/SDL_touch.c",
            "src/events/SDL_windowevents.c",
            "src/file/SDL_rwops.c",
            "src/filesystem/os2/SDL_sysfilesystem.c",
            "src/filesystem/windows/SDL_sysfilesystem.c",
            "src/haptic/windows/SDL_dinputhaptic.c",
            "src/haptic/windows/SDL_xinputhaptic.c",
            "src/hidapi/SDL_hidapi.c",
            "src/hidapi/android/hid.cpp",
            "src/hidapi/libusb/hid.c",
            "src/hidapi/mac/hid.c",
            "src/joystick/SDL_joystick.c",
            "src/joystick/android/SDL_sysjoystick.c",
            "src/joystick/hidapi/SDL_hidapi_gamecube.c",
            "src/joystick/hidapi/SDL_hidapi_ps4.c",
            "src/joystick/hidapi/SDL_hidapi_ps5.c",
            "src/joystick/hidapi/SDL_hidapi_switch.c",
            "src/joystick/hidapi/SDL_hidapi_xboxone.c",
            "src/joystick/hidapi/SDL_hidapijoystick.c",
            "src/joystick/linux/SDL_sysjoystick.c",
            "src/joystick/vita/SDL_sysjoystick.c",
            "src/joystick/windows/SDL_rawinputjoystick.c",
            "src/joystick/windows/SDL_windows_gaming_input.c",
            "src/joystick/windows/SDL_xinputjoystick.c",
            "src/loadso/os2/SDL_sysloadso.c",
            "src/loadso/windows/SDL_sysloadso.c",
            "src/misc/winrt/SDL_sysurl.cpp",
            "src/power/linux/SDL_syspower.c",
            "src/render/SDL_render.c",
            "src/render/direct3d/SDL_render_d3d.c",
            "src/render/direct3d11/SDL_render_d3d11.c",
            "src/render/direct3d11/SDL_shaders_d3d11.c",
            "src/render/opengl/SDL_render_gl.c",
            "src/render/opengl/SDL_shaders_gl.c",
            "src/render/opengles2/SDL_render_gles2.c",
            "src/render/opengles2/SDL_shaders_gles2.c",
            "src/render/psp/SDL_render_psp.c",
            "src/render/software/SDL_blendfillrect.c",
            "src/render/software/SDL_blendline.c",
            "src/render/software/SDL_blendpoint.c",
            "src/render/software/SDL_drawline.c",
            "src/render/software/SDL_drawpoint.c",
            "src/render/software/SDL_render_sw.c",
            "src/render/software/SDL_rotate.c",
            "src/render/software/SDL_triangle.c",
            "src/render/vitagxm/SDL_render_vita_gxm.c",
            "src/render/vitagxm/SDL_render_vita_gxm_memory.c",
            "src/render/vitagxm/SDL_render_vita_gxm_tools.c",
            "src/sensor/windows/SDL_windowssensor.c",
            "src/stdlib/SDL_getenv.c",
            "src/stdlib/SDL_iconv.c",
            "src/stdlib/SDL_string.c",
            "src/test/SDL_test_common.c",
            "src/thread/generic/SDL_syscond.c",
            "src/thread/generic/SDL_sysmutex.c",
            "src/thread/generic/SDL_syssem.c",
            "src/thread/os2/SDL_sysmutex.c",
            "src/thread/os2/SDL_syssem.c",
            "src/thread/psp/SDL_syscond.c",
            "src/thread/psp/SDL_sysmutex.c",
            "src/thread/psp/SDL_syssem.c",
            "src/thread/pthread/SDL_syscond.c",
            "src/thread/pthread/SDL_sysmutex.c",
            "src/thread/pthread/SDL_syssem.c",
            "src/thread/pthread/SDL_systhread.c",
            "src/thread/stdcpp/SDL_syscond.cpp",
            "src/thread/stdcpp/SDL_sysmutex.cpp",
            "src/thread/stdcpp/SDL_systhread.cpp",
            "src/thread/vita/SDL_syscond.c",
            "src/thread/vita/SDL_sysmutex.c",
            "src/thread/vita/SDL_syssem.c",
            "src/thread/windows/SDL_syscond_cv.c",
            "src/thread/windows/SDL_sysmutex.c",
            "src/thread/windows/SDL_syssem.c",
            "src/timer/os2/SDL_systimer.c",
            "src/timer/unix/SDL_systimer.c",
            "src/video/SDL_blit.c",
            "src/video/SDL_blit_0.c",
            "src/video/SDL_blit_N.c",
            "src/video/SDL_blit_auto.c",
            "src/video/SDL_blit_slow.c",
            "src/video/SDL_bmp.c",
            "src/video/SDL_egl.c",
            "src/video/SDL_fillrect.c",
            "src/video/SDL_pixels.c",
            "src/video/SDL_rect.c",
            "src/video/SDL_surface.c",
            "src/video/SDL_video.c",
            "src/video/android/SDL_androidevents.c",
            "src/video/android/SDL_androidgl.c",
            "src/video/android/SDL_androidvideo.c",
            "src/video/android/SDL_androidwindow.c",
            "src/video/dummy/SDL_nullframebuffer.c",
            "src/video/dummy/SDL_nullvideo.c",
            "src/video/emscripten/SDL_emscriptenevents.c",
            "src/video/emscripten/SDL_emscriptenframebuffer.c",
            "src/video/emscripten/SDL_emscriptenmouse.c",
            "src/video/emscripten/SDL_emscriptenvideo.c",
            "src/video/haiku/SDL_bframebuffer.cc",
            "src/video/haiku/SDL_bopengl.cc",
            "src/video/haiku/SDL_bvideo.cc",
            "src/video/haiku/SDL_bwindow.cc",
            "src/video/nacl/SDL_naclwindow.c",
            "src/video/offscreen/SDL_offscreenframebuffer.c",
            "src/video/os2/SDL_os2dive.c",
            "src/video/os2/SDL_os2messagebox.c",
            "src/video/os2/SDL_os2util.c",
            "src/video/os2/SDL_os2video.c",
            "src/video/os2/SDL_os2vman.c",
            "src/video/riscos/SDL_riscosevents.c",
            "src/video/vita/SDL_vitaframebuffer.c",
            "src/video/vita/SDL_vitagl.c",
            "src/video/vita/SDL_vitagl_pvr.c",
            "src/video/vita/SDL_vitatouch.c",
            "src/video/vita/SDL_vitavideo.c",
            "src/video/wayland/SDL_waylandevents.c",
            "src/video/wayland/SDL_waylandopengles.c",
            "src/video/wayland/SDL_waylandvideo.c",
            "src/video/wayland/SDL_waylandvulkan.c",
            "src/video/wayland/SDL_waylandwindow.c",
            "src/video/windows/SDL_windowsevents.c",
            "src/video/windows/SDL_windowskeyboard.c",
            "src/video/windows/SDL_windowsmouse.c",
            "src/video/windows/SDL_windowsvideo.c",
            "src/video/windows/SDL_windowswindow.c",
            "src/video/winrt/SDL_winrtvideo.cpp",
            "src/video/x11/SDL_x11keyboard.c",
            "src/video/x11/SDL_x11messagebox.c",
            "src/video/x11/SDL_x11modes.c",
            "src/video/x11/SDL_x11mouse.c",
            "src/video/x11/SDL_x11opengl.c",
            "test/testautomation_rect.c",
            "test/testautomation_render.c",
            "test/testautomation_surface.c",
            "test/testevdev.c",
            "test/testgamecontroller.c",
            "test/testgesture.c",
            "test/testgles2.c",
            "test/testmouse.c",
            "test/testplatform.c",
            "test/testshader.c"
        ],
        "no_other_files": false,
        "num_prohibited_files": 176823,
        "prohibited_files": [
            "server/src/main/java/com/genymobile/scrcpy/Device.java",
            "server/src/main/java/com/genymobile/scrcpy/wrappers/SurfaceControl.java",
            "server/src/main/java/com/genymobile/scrcpy/Device.java",
            "server/src/main/java/com/genymobile/scrcpy/wrappers/SurfaceControl.java",
            "app/meson.build",
            "app/scrcpy.1",
            "app/src/common.h",
            "app/src/scrcpy.h",
            "app/src/server.h",
            "server/src/main/java/com/genymobile/scrcpy/Workarounds.java"
        ],
        "reopen": true,
        "reopen_events": [
            [
                "2022-04-25 18:01:23+00:00",
                "closed"
            ],
            [
                "2022-04-25 18:01:23+00:00",
                "commit"
            ],
            [
                "2022-04-25 18:17:45+00:00",
                "reopened"
            ],
            [
                "2022-04-27 14:08:13+00:00",
                "commit"
            ],
            [
                "2022-05-19 21:19:58+00:00",
                "commit"
            ],
            [
                "2022-05-19 23:10:10+00:00",
                "commit"
            ],
            [
                "2022-05-20 12:36:46+00:00",
                "closed"
            ],
            [
                "2022-05-20 15:30:53+00:00",
                "commit"
            ],
            [
                "2022-11-13 23:33:03+00:00",
                "commit"
            ],
            [
                "2022-11-13 23:33:04+00:00",
                "commit"
            ],
            [
                "2023-03-19 21:02:21+00:00",
                "commit"
            ]
        ],
        "status": false,
        "strategy": true,
        "total_changes": 9091
    }
}