{
    "category": [
        "hardware/OS",
        "feature request"
    ],
    "commits": [
        {
            "associated_pull_request": [],
            "date": "2015-02-10 16:11:57",
            "diff": "",
            "diff_additions": 0,
            "diff_deletions": 0,
            "diff_file_size": 0,
            "diff_url": "https://github.com/cockpit-project/cockpit/commit/e62645b86172e5d45a7a7adc6ee4b425710d1b80.diff",
            "exists": true,
            "files": [],
            "interesting": {
                "reopen": false,
                "status": false
            },
            "is_parent": true,
            "sha": "e62645b86172e5d45a7a7adc6ee4b425710d1b80"
        },
        {
            "associated_pull_request": [],
            "date": "2015-02-12 09:40:19",
            "diff": "cockpit-project_cockpit/issue_1098/commit_c9a48f11bb81691ef6cce08e371e734e0adf660d.diff",
            "diff_additions": 2,
            "diff_deletions": 6,
            "diff_file_size": 21252,
            "diff_url": "https://github.com/cockpit-project/cockpit/commit/c9a48f11bb81691ef6cce08e371e734e0adf660d.diff",
            "exists": true,
            "files": [
                {
                    "file_additions": 2,
                    "file_deletions": 6,
                    "file_exists": true,
                    "file_name": "src/ws/session.c",
                    "file_size": 21252
                }
            ],
            "interesting": {
                "reopen": false,
                "status": false
            },
            "is_parent": false,
            "sha": "c9a48f11bb81691ef6cce08e371e734e0adf660d"
        },
        {
            "associated_pull_request": [],
            "date": "2015-02-12 09:40:19",
            "diff": "cockpit-project_cockpit/issue_1098/commit_c9ff1ab886d45dadb2c365b8baacb4274551c6cf.diff",
            "diff_additions": 1,
            "diff_deletions": 6,
            "diff_file_size": 21252,
            "diff_url": "https://github.com/cockpit-project/cockpit/commit/c9ff1ab886d45dadb2c365b8baacb4274551c6cf.diff",
            "exists": true,
            "files": [
                {
                    "file_additions": 1,
                    "file_deletions": 6,
                    "file_exists": true,
                    "file_name": "src/ws/session.c",
                    "file_size": 21252
                }
            ],
            "interesting": {
                "reopen": false,
                "status": false
            },
            "is_parent": false,
            "sha": "c9ff1ab886d45dadb2c365b8baacb4274551c6cf"
        },
        {
            "associated_pull_request": [],
            "date": "2019-01-14 09:59:09",
            "diff": "cockpit-project_cockpit/issue_1098/commit_dc90b560df7c2c94f54e6779ba7986e7c768d9d6.diff",
            "diff_additions": 1,
            "diff_deletions": 0,
            "diff_file_size": 21252,
            "diff_url": "https://github.com/cockpit-project/cockpit/commit/dc90b560df7c2c94f54e6779ba7986e7c768d9d6.diff",
            "exists": true,
            "files": [
                {
                    "file_additions": 1,
                    "file_deletions": 0,
                    "file_exists": true,
                    "file_name": "src/ws/session.c",
                    "file_size": 21252
                }
            ],
            "interesting": {
                "reopen": false,
                "status": true
            },
            "is_parent": false,
            "sha": "dc90b560df7c2c94f54e6779ba7986e7c768d9d6"
        },
        {
            "associated_pull_request": [],
            "date": "2019-01-14 09:59:09",
            "diff": "cockpit-project_cockpit/issue_1098/commit_1f574bcc1583f32e24f5b316db44bcd995c4f739.diff",
            "diff_additions": 1,
            "diff_deletions": 0,
            "diff_file_size": 21252,
            "diff_url": "https://github.com/cockpit-project/cockpit/commit/1f574bcc1583f32e24f5b316db44bcd995c4f739.diff",
            "exists": true,
            "files": [
                {
                    "file_additions": 1,
                    "file_deletions": 0,
                    "file_exists": true,
                    "file_name": "src/ws/session.c",
                    "file_size": 21252
                }
            ],
            "interesting": {
                "reopen": false,
                "status": true
            },
            "is_parent": false,
            "sha": "1f574bcc1583f32e24f5b316db44bcd995c4f739"
        },
        {
            "associated_pull_request": [],
            "date": "2019-01-14 09:59:09",
            "diff": "cockpit-project_cockpit/issue_1098/commit_6866de08da4ac12b7770d5b1cc571598f6c2759c.diff",
            "diff_additions": 1,
            "diff_deletions": 0,
            "diff_file_size": 21252,
            "diff_url": "https://github.com/cockpit-project/cockpit/commit/6866de08da4ac12b7770d5b1cc571598f6c2759c.diff",
            "exists": true,
            "files": [
                {
                    "file_additions": 1,
                    "file_deletions": 0,
                    "file_exists": true,
                    "file_name": "src/ws/session.c",
                    "file_size": 21252
                }
            ],
            "interesting": {
                "reopen": false,
                "status": true
            },
            "is_parent": false,
            "sha": "6866de08da4ac12b7770d5b1cc571598f6c2759c"
        },
        {
            "associated_pull_request": [],
            "date": "2019-01-14 09:59:09",
            "diff": "cockpit-project_cockpit/issue_1098/commit_e76436e33be19d5ae6b7df7fa79e64b3c8f535e5.diff",
            "diff_additions": 1,
            "diff_deletions": 0,
            "diff_file_size": 21252,
            "diff_url": "https://github.com/cockpit-project/cockpit/commit/e76436e33be19d5ae6b7df7fa79e64b3c8f535e5.diff",
            "exists": true,
            "files": [
                {
                    "file_additions": 1,
                    "file_deletions": 0,
                    "file_exists": true,
                    "file_name": "src/ws/session.c",
                    "file_size": 21252
                }
            ],
            "interesting": {
                "reopen": false,
                "status": false
            },
            "is_parent": false,
            "sha": "e76436e33be19d5ae6b7df7fa79e64b3c8f535e5"
        },
        {
            "associated_pull_request": [
                "https://github.com/cockpit-project/cockpit/pull/10963"
            ],
            "date": "2019-01-14 09:59:09",
            "diff": "cockpit-project_cockpit/issue_1098/commit_edadc84b4127832dd6bc4d09b5d2370b98b3e128.diff",
            "diff_additions": 1,
            "diff_deletions": 0,
            "diff_file_size": 21252,
            "diff_url": "https://github.com/cockpit-project/cockpit/commit/edadc84b4127832dd6bc4d09b5d2370b98b3e128.diff",
            "exists": true,
            "files": [
                {
                    "file_additions": 1,
                    "file_deletions": 0,
                    "file_exists": true,
                    "file_name": "src/ws/session.c",
                    "file_size": 21252
                }
            ],
            "interesting": {
                "reopen": false,
                "status": false
            },
            "is_parent": false,
            "sha": "edadc84b4127832dd6bc4d09b5d2370b98b3e128"
        },
        {
            "associated_pull_request": [
                "https://github.com/cockpit-project/cockpit/pull/10963"
            ],
            "date": "2019-01-14 09:59:09",
            "diff": "cockpit-project_cockpit/issue_1098/commit_14e08cb2f02e82ae5f9773fb1d0df2efd937d0e3.diff",
            "diff_additions": 1,
            "diff_deletions": 0,
            "diff_file_size": 21252,
            "diff_url": "https://github.com/cockpit-project/cockpit/commit/14e08cb2f02e82ae5f9773fb1d0df2efd937d0e3.diff",
            "exists": true,
            "files": [
                {
                    "file_additions": 1,
                    "file_deletions": 0,
                    "file_exists": true,
                    "file_name": "src/ws/session.c",
                    "file_size": 21252
                }
            ],
            "interesting": {
                "reopen": false,
                "status": false
            },
            "is_parent": false,
            "sha": "14e08cb2f02e82ae5f9773fb1d0df2efd937d0e3"
        }
    ],
    "first_commit": "2015-02-11 09:31:32",
    "last_commit": "2019-02-01 11:34:15",
    "number": 1098,
    "pull_request": "None",
    "score": {
        "accidental_reopen_likely": false,
        "all_labels": [
            "enhancement"
        ],
        "contains_keywords": [
            "problem",
            "test",
            "bug"
        ],
        "fix_size": 8,
        "has_labels": [],
        "intersecting": {
            "computed_score": 1.0,
            "final_commit_size": 2,
            "intersection_size": 2,
            "previous_commits_size": 8
        },
        "is_makefile_based": true,
        "no_new_files": [],
        "no_other_files": false,
        "num_prohibited_files": 50607,
        "prohibited_files": [
            "tools/building.py",
            "tools/building.py",
            "tools/building.py",
            "emcc.py",
            "src/library_emmalloc.js",
            "src/shell.js",
            "tests/test_core.py",
            "src/shell.js",
            "tests/test_core.py",
            "src/library.js"
        ],
        "reopen": false,
        "reopen_events": [
            [
                "2015-02-12 10:04:40",
                "commit"
            ],
            [
                "2015-02-12 11:34:29",
                "commit"
            ],
            [
                "2019-01-14 10:01:35",
                "commit"
            ],
            [
                "2019-01-15 12:32:54",
                "commit"
            ],
            [
                "2019-01-31 08:12:06",
                "commit"
            ],
            [
                "2019-01-31 14:48:29",
                "commit"
            ],
            [
                "2019-01-31 19:44:33",
                "commit"
            ],
            [
                "2019-02-01 11:34:16",
                "closed"
            ],
            [
                "2019-02-01 11:34:24",
                "commit"
            ]
        ],
        "status": true,
        "strategy": true,
        "total_changes": 21
    }
}