{
    "covered_issues": [
        173,
        166,
        165,
        161,
        159,
        157,
        155,
        153,
        152,
        148,
        147,
        146,
        145,
        143,
        141,
        140,
        139,
        137,
        133,
        132,
        131,
        126,
        125,
        123,
        122,
        121,
        120,
        119,
        118,
        117,
        114,
        100,
        99,
        97,
        93,
        92,
        91,
        90,
        89,
        88,
        87,
        85,
        84,
        83,
        82,
        81,
        80,
        79,
        78,
        77,
        75,
        74,
        73,
        72,
        65,
        64,
        63,
        62,
        60,
        59,
        58,
        56,
        54,
        53,
        52,
        51,
        49,
        46,
        45,
        44,
        43,
        42,
        41,
        40,
        39,
        38,
        37,
        36,
        34,
        33,
        32,
        31,
        30,
        29,
        27,
        23,
        22,
        21,
        20,
        17,
        16,
        15,
        13,
        11,
        9,
        8,
        7,
        6,
        4,
        118,
        118
    ],
    "finished": true
}