{
    "commits": [
        {
            "associated_pull_request": [],
            "date": "2017-05-15 18:41:04+00:00",
            "diff": "libretro_retroarch/issue_4920/commit_eddb655eb9c5e8c17108250c65cb4a2ae4658a47.diff",
            "diff_additions": 36,
            "diff_deletions": 21,
            "diff_file_size": 1216621,
            "diff_url": "https://github.com/libretro/RetroArch/commit/eddb655eb9c5e8c17108250c65cb4a2ae4658a47.diff",
            "exists": true,
            "files": [
                {
                    "file_additions": 1,
                    "file_deletions": 1,
                    "file_exists": true,
                    "file_name": "configuration.c",
                    "file_size": 285640
                },
                {
                    "file_additions": 5,
                    "file_deletions": 3,
                    "file_exists": false,
                    "file_name": "dynamic.c",
                    "file_size": 0
                },
                {
                    "file_additions": 2,
                    "file_deletions": 4,
                    "file_exists": true,
                    "file_name": "menu/menu_setting.c",
                    "file_size": 905639
                },
                {
                    "file_additions": 28,
                    "file_deletions": 13,
                    "file_exists": true,
                    "file_name": "msg_hash.c",
                    "file_size": 25342
                }
            ],
            "interesting": {
                "reopen": false,
                "status": false
            },
            "is_parent": true,
            "sha": "eddb655eb9c5e8c17108250c65cb4a2ae4658a47"
        },
        {
            "associated_pull_request": [],
            "date": "2017-05-15 19:23:03+00:00",
            "diff": "libretro_retroarch/issue_4920/commit_8e47e7e8b3e168aa0c9e37490fc172400f4014b5.diff",
            "diff_additions": 0,
            "diff_deletions": 1,
            "diff_file_size": 363178,
            "diff_url": "https://github.com/libretro/RetroArch/commit/8e47e7e8b3e168aa0c9e37490fc172400f4014b5.diff",
            "exists": true,
            "files": [
                {
                    "file_additions": 0,
                    "file_deletions": 1,
                    "file_exists": true,
                    "file_name": "menu/cbs/menu_cbs_ok.c",
                    "file_size": 363178
                }
            ],
            "interesting": {
                "reopen": true,
                "status": false
            },
            "is_parent": false,
            "sha": "8e47e7e8b3e168aa0c9e37490fc172400f4014b5"
        },
        {
            "associated_pull_request": [],
            "date": "2017-05-18 22:38:04+00:00",
            "diff": "libretro_retroarch/issue_4920/commit_f341f70705b7332499dcfa37e18da480fcb3afca.diff",
            "diff_additions": 2,
            "diff_deletions": 2,
            "diff_file_size": 363178,
            "diff_url": "https://github.com/libretro/RetroArch/commit/f341f70705b7332499dcfa37e18da480fcb3afca.diff",
            "exists": true,
            "files": [
                {
                    "file_additions": 1,
                    "file_deletions": 0,
                    "file_exists": true,
                    "file_name": "menu/cbs/menu_cbs_ok.c",
                    "file_size": 363178
                },
                {
                    "file_additions": 1,
                    "file_deletions": 2,
                    "file_exists": false,
                    "file_name": "menu/widgets/menu_filebrowser.c",
                    "file_size": 0
                }
            ],
            "interesting": {
                "reopen": false,
                "status": false
            },
            "is_parent": false,
            "sha": "f341f70705b7332499dcfa37e18da480fcb3afca"
        },
        {
            "associated_pull_request": [],
            "date": "2017-05-18 23:37:45+00:00",
            "diff": "libretro_retroarch/issue_4920/commit_6d20fa96e0faa89eb3d92982186f06353c403942.diff",
            "diff_additions": 2,
            "diff_deletions": 2,
            "diff_file_size": 363178,
            "diff_url": "https://github.com/libretro/RetroArch/commit/6d20fa96e0faa89eb3d92982186f06353c403942.diff",
            "exists": true,
            "files": [
                {
                    "file_additions": 0,
                    "file_deletions": 1,
                    "file_exists": true,
                    "file_name": "menu/cbs/menu_cbs_ok.c",
                    "file_size": 363178
                },
                {
                    "file_additions": 2,
                    "file_deletions": 1,
                    "file_exists": false,
                    "file_name": "menu/widgets/menu_filebrowser.c",
                    "file_size": 0
                }
            ],
            "interesting": {
                "reopen": false,
                "status": false
            },
            "is_parent": false,
            "sha": "6d20fa96e0faa89eb3d92982186f06353c403942"
        }
    ],
    "first_commit": "2017-05-15 18:41:04+00:00",
    "last_commit": "2017-05-18 23:37:45+00:00",
    "number": 4920,
    "pull_request": "None",
    "score": {
        "accidental_reopen_likely": false,
        "all_labels": [
            "bug: major"
        ],
        "contains_keywords": [
            "confirm",
            "chang",
            "fix",
            "issu",
            "problem",
            "report"
        ],
        "fix_size": 6,
        "has_labels": [],
        "intersecting": {
            "computed_score": 1.0,
            "final_commit_size": 5,
            "intersection_size": 5,
            "previous_commits_size": 6
        },
        "is_makefile_based": true,
        "no_new_files": [],
        "no_other_files": false,
        "num_prohibited_files": 52968,
        "prohibited_files": [
            "server/src/main/java/com/genymobile/scrcpy/Device.java",
            "server/src/main/java/com/genymobile/scrcpy/wrappers/SurfaceControl.java",
            "server/src/main/java/com/genymobile/scrcpy/Device.java",
            "server/src/main/java/com/genymobile/scrcpy/wrappers/SurfaceControl.java",
            "app/meson.build",
            "app/scrcpy.1",
            "app/src/common.h",
            "app/src/scrcpy.h",
            "app/src/server.h",
            "server/src/main/java/com/genymobile/scrcpy/Workarounds.java"
        ],
        "reopen": true,
        "reopen_events": [
            [
                "2017-05-15 19:27:57+00:00",
                "closed"
            ],
            [
                "2017-05-15 19:27:57+00:00",
                "commit"
            ],
            [
                "2017-05-17 03:59:35+00:00",
                "reopened"
            ],
            [
                "2017-05-18 22:38:57+00:00",
                "closed"
            ],
            [
                "2017-05-18 22:38:57+00:00",
                "commit"
            ],
            [
                "2017-05-18 23:50:12+00:00",
                "commit"
            ]
        ],
        "status": false,
        "strategy": true,
        "total_changes": 66
    }
}