{
    "commits": [
        {
            "associated_pull_request": [
                "https://github.com/universal-ctags/ctags/pull/3818"
            ],
            "date": "2023-09-15 07:23:04+00:00",
            "diff": "",
            "diff_additions": 0,
            "diff_deletions": 0,
            "diff_file_size": 0,
            "diff_url": "https://github.com/universal-ctags/ctags/commit/e8780c43bc7bad1ee5fd16c8d641076b18321cff.diff",
            "exists": true,
            "files": [],
            "interesting": {
                "reopen": false,
                "status": false
            },
            "is_parent": true,
            "sha": "e8780c43bc7bad1ee5fd16c8d641076b18321cff"
        },
        {
            "associated_pull_request": [],
            "date": "2023-09-18 14:31:30+00:00",
            "diff": "universal-ctags_ctags/issue_3823/commit_90b82d1936647d267518ffe9f3e42f7dafa3712f.diff",
            "diff_additions": 1,
            "diff_deletions": 1,
            "diff_file_size": 9960,
            "diff_url": "https://github.com/universal-ctags/ctags/commit/90b82d1936647d267518ffe9f3e42f7dafa3712f.diff",
            "exists": true,
            "files": [
                {
                    "file_additions": 1,
                    "file_deletions": 1,
                    "file_exists": true,
                    "file_name": "parsers/bibtex.c",
                    "file_size": 9960
                }
            ],
            "interesting": {
                "reopen": false,
                "status": true
            },
            "is_parent": false,
            "sha": "90b82d1936647d267518ffe9f3e42f7dafa3712f"
        },
        {
            "associated_pull_request": [
                "https://github.com/universal-ctags/ctags/pull/3824"
            ],
            "date": "2023-09-18 14:31:30+00:00",
            "diff": "universal-ctags_ctags/issue_3823/commit_8a7eaae2f056161924218bca1bd58fee89748c82.diff",
            "diff_additions": 1,
            "diff_deletions": 1,
            "diff_file_size": 9960,
            "diff_url": "https://github.com/universal-ctags/ctags/commit/8a7eaae2f056161924218bca1bd58fee89748c82.diff",
            "exists": true,
            "files": [
                {
                    "file_additions": 1,
                    "file_deletions": 1,
                    "file_exists": true,
                    "file_name": "parsers/bibtex.c",
                    "file_size": 9960
                }
            ],
            "interesting": {
                "reopen": false,
                "status": false
            },
            "is_parent": false,
            "sha": "8a7eaae2f056161924218bca1bd58fee89748c82"
        }
    ],
    "first_commit": "2023-09-15 08:31:05+00:00",
    "last_commit": "2023-09-18 14:40:44+00:00",
    "number": 3823,
    "pull_request": "None",
    "score": {
        "accidental_reopen_likely": false,
        "all_labels": [],
        "contains_keywords": [],
        "fix_size": 3,
        "has_labels": [],
        "intersecting": {
            "computed_score": 0.5,
            "final_commit_size": 2,
            "intersection_size": 1,
            "previous_commits_size": 2
        },
        "is_makefile_based": true,
        "no_new_files": [],
        "no_other_files": false,
        "num_prohibited_files": 41796,
        "prohibited_files": [
            "server/src/main/java/com/genymobile/scrcpy/Device.java",
            "server/src/main/java/com/genymobile/scrcpy/wrappers/SurfaceControl.java",
            "server/src/main/java/com/genymobile/scrcpy/Device.java",
            "server/src/main/java/com/genymobile/scrcpy/wrappers/SurfaceControl.java",
            "app/meson.build",
            "app/scrcpy.1",
            "app/src/common.h",
            "app/src/scrcpy.h",
            "app/src/server.h",
            "server/src/main/java/com/genymobile/scrcpy/Workarounds.java"
        ],
        "reopen": false,
        "reopen_events": [
            [
                "2023-09-18 14:32:11+00:00",
                "commit"
            ],
            [
                "2023-09-18 14:41:04+00:00",
                "commit"
            ],
            [
                "2023-09-18 22:40:53+00:00",
                "closed"
            ]
        ],
        "status": true,
        "strategy": true,
        "total_changes": 4
    }
}