{
    "commits": [
        {
            "associated_pull_request": [],
            "date": "2021-06-22 15:31:51+00:00",
            "diff": "haproxy_haproxy/issue_1303/commit_5ffb045ed12f14a0367bcb0aa39931806c84357a.diff",
            "diff_additions": 1,
            "diff_deletions": 2,
            "diff_file_size": 104002,
            "diff_url": "https://github.com/haproxy/haproxy/commit/5ffb045ed12f14a0367bcb0aa39931806c84357a.diff",
            "exists": true,
            "files": [
                {
                    "file_additions": 1,
                    "file_deletions": 2,
                    "file_exists": true,
                    "file_name": "src/backend.c",
                    "file_size": 104002
                }
            ],
            "interesting": {
                "reopen": false,
                "status": false
            },
            "is_parent": true,
            "sha": "5ffb045ed12f14a0367bcb0aa39931806c84357a"
        },
        {
            "associated_pull_request": [],
            "date": "2021-06-23 10:07:21+00:00",
            "diff": "haproxy_haproxy/issue_1303/commit_19bbbe05629ea947dd60d5b96d96f0066b047b97.diff",
            "diff_additions": 2,
            "diff_deletions": 0,
            "diff_file_size": 21706,
            "diff_url": "https://github.com/haproxy/haproxy/commit/19bbbe05629ea947dd60d5b96d96f0066b047b97.diff",
            "exists": true,
            "files": [
                {
                    "file_additions": 2,
                    "file_deletions": 0,
                    "file_exists": true,
                    "file_name": "src/tcp_act.c",
                    "file_size": 21706
                }
            ],
            "interesting": {
                "reopen": false,
                "status": false
            },
            "is_parent": false,
            "sha": "19bbbe05629ea947dd60d5b96d96f0066b047b97"
        },
        {
            "associated_pull_request": [],
            "date": "2021-06-23 10:07:21+00:00",
            "diff": "haproxy_haproxy/issue_1303/commit_29873071a109b8b6b9b9ee2c2a8b7e14e13fd7fd.diff",
            "diff_additions": 2,
            "diff_deletions": 0,
            "diff_file_size": 26261,
            "diff_url": "https://github.com/haproxy/haproxy/commit/29873071a109b8b6b9b9ee2c2a8b7e14e13fd7fd.diff",
            "exists": true,
            "files": [
                {
                    "file_additions": 2,
                    "file_deletions": 0,
                    "file_exists": true,
                    "file_name": "src/proto_tcp.c",
                    "file_size": 26261
                }
            ],
            "interesting": {
                "reopen": false,
                "status": false
            },
            "is_parent": false,
            "sha": "29873071a109b8b6b9b9ee2c2a8b7e14e13fd7fd"
        },
        {
            "associated_pull_request": [],
            "date": "2021-06-23 10:07:21+00:00",
            "diff": "haproxy_haproxy/issue_1303/commit_78f4613532d41b133ed6d02d1b8ae3d50ed6ab72.diff",
            "diff_additions": 2,
            "diff_deletions": 0,
            "diff_file_size": 21706,
            "diff_url": "https://github.com/haproxy/haproxy/commit/78f4613532d41b133ed6d02d1b8ae3d50ed6ab72.diff",
            "exists": true,
            "files": [
                {
                    "file_additions": 2,
                    "file_deletions": 0,
                    "file_exists": true,
                    "file_name": "src/tcp_act.c",
                    "file_size": 21706
                }
            ],
            "interesting": {
                "reopen": false,
                "status": false
            },
            "is_parent": false,
            "sha": "78f4613532d41b133ed6d02d1b8ae3d50ed6ab72"
        },
        {
            "associated_pull_request": [],
            "date": "2021-06-23 10:07:21+00:00",
            "diff": "haproxy_haproxy/issue_1303/commit_afad5c385c146be1d5e1a50c6e3bd317301aa27f.diff",
            "diff_additions": 2,
            "diff_deletions": 0,
            "diff_file_size": 26261,
            "diff_url": "https://github.com/haproxy/haproxy/commit/afad5c385c146be1d5e1a50c6e3bd317301aa27f.diff",
            "exists": true,
            "files": [
                {
                    "file_additions": 2,
                    "file_deletions": 0,
                    "file_exists": true,
                    "file_name": "src/proto_tcp.c",
                    "file_size": 26261
                }
            ],
            "interesting": {
                "reopen": false,
                "status": false
            },
            "is_parent": false,
            "sha": "afad5c385c146be1d5e1a50c6e3bd317301aa27f"
        },
        {
            "associated_pull_request": [],
            "date": "2021-07-06 09:25:36+00:00",
            "diff": "haproxy_haproxy/issue_1303/commit_23048875a4eacf5d7d4450d677cb077e67778b95.diff",
            "diff_additions": 0,
            "diff_deletions": 2,
            "diff_file_size": 21706,
            "diff_url": "https://github.com/haproxy/haproxy/commit/23048875a4eacf5d7d4450d677cb077e67778b95.diff",
            "exists": true,
            "files": [
                {
                    "file_additions": 0,
                    "file_deletions": 2,
                    "file_exists": true,
                    "file_name": "src/tcp_act.c",
                    "file_size": 21706
                }
            ],
            "interesting": {
                "reopen": true,
                "status": false
            },
            "is_parent": false,
            "sha": "23048875a4eacf5d7d4450d677cb077e67778b95"
        },
        {
            "associated_pull_request": [],
            "date": "2021-07-06 09:25:36+00:00",
            "diff": "haproxy_haproxy/issue_1303/commit_390f49477159de53d0506cd52bd6ed323febde0a.diff",
            "diff_additions": 0,
            "diff_deletions": 2,
            "diff_file_size": 21706,
            "diff_url": "https://github.com/haproxy/haproxy/commit/390f49477159de53d0506cd52bd6ed323febde0a.diff",
            "exists": true,
            "files": [
                {
                    "file_additions": 0,
                    "file_deletions": 2,
                    "file_exists": true,
                    "file_name": "src/tcp_act.c",
                    "file_size": 21706
                }
            ],
            "interesting": {
                "reopen": false,
                "status": false
            },
            "is_parent": false,
            "sha": "390f49477159de53d0506cd52bd6ed323febde0a"
        },
        {
            "associated_pull_request": [],
            "date": "2021-07-06 09:25:36+00:00",
            "diff": "haproxy_haproxy/issue_1303/commit_fcc1dd5fed7e7228c6004ce3a52efc5d39e62006.diff",
            "diff_additions": 0,
            "diff_deletions": 2,
            "diff_file_size": 26261,
            "diff_url": "https://github.com/haproxy/haproxy/commit/fcc1dd5fed7e7228c6004ce3a52efc5d39e62006.diff",
            "exists": true,
            "files": [
                {
                    "file_additions": 0,
                    "file_deletions": 2,
                    "file_exists": true,
                    "file_name": "src/proto_tcp.c",
                    "file_size": 26261
                }
            ],
            "interesting": {
                "reopen": false,
                "status": false
            },
            "is_parent": false,
            "sha": "fcc1dd5fed7e7228c6004ce3a52efc5d39e62006"
        },
        {
            "associated_pull_request": [],
            "date": "2021-07-06 09:25:36+00:00",
            "diff": "haproxy_haproxy/issue_1303/commit_637b026540de4a328da6a214dc29e00906317cdc.diff",
            "diff_additions": 0,
            "diff_deletions": 2,
            "diff_file_size": 21706,
            "diff_url": "https://github.com/haproxy/haproxy/commit/637b026540de4a328da6a214dc29e00906317cdc.diff",
            "exists": true,
            "files": [
                {
                    "file_additions": 0,
                    "file_deletions": 2,
                    "file_exists": true,
                    "file_name": "src/tcp_act.c",
                    "file_size": 21706
                }
            ],
            "interesting": {
                "reopen": false,
                "status": false
            },
            "is_parent": false,
            "sha": "637b026540de4a328da6a214dc29e00906317cdc"
        },
        {
            "associated_pull_request": [],
            "date": "2021-07-06 09:25:36+00:00",
            "diff": "haproxy_haproxy/issue_1303/commit_d6f0caf792e0ef257f5d3820ace0b115092d92c4.diff",
            "diff_additions": 0,
            "diff_deletions": 2,
            "diff_file_size": 26261,
            "diff_url": "https://github.com/haproxy/haproxy/commit/d6f0caf792e0ef257f5d3820ace0b115092d92c4.diff",
            "exists": true,
            "files": [
                {
                    "file_additions": 0,
                    "file_deletions": 2,
                    "file_exists": true,
                    "file_name": "src/proto_tcp.c",
                    "file_size": 26261
                }
            ],
            "interesting": {
                "reopen": false,
                "status": false
            },
            "is_parent": false,
            "sha": "d6f0caf792e0ef257f5d3820ace0b115092d92c4"
        },
        {
            "associated_pull_request": [],
            "date": "2021-06-23 10:07:21+00:00",
            "diff": "haproxy_haproxy/issue_1303/commit_1e83b70409cbdc0423afc46d7313d2ab4be90730.diff",
            "diff_additions": 2,
            "diff_deletions": 0,
            "diff_file_size": 21706,
            "diff_url": "https://github.com/haproxy/haproxy/commit/1e83b70409cbdc0423afc46d7313d2ab4be90730.diff",
            "exists": true,
            "files": [
                {
                    "file_additions": 2,
                    "file_deletions": 0,
                    "file_exists": true,
                    "file_name": "src/tcp_act.c",
                    "file_size": 21706
                }
            ],
            "interesting": {
                "reopen": false,
                "status": false
            },
            "is_parent": false,
            "sha": "1e83b70409cbdc0423afc46d7313d2ab4be90730"
        }
    ],
    "first_commit": "2021-06-22 17:21:11+00:00",
    "last_commit": "2021-10-27 09:35:59+00:00",
    "number": 1303,
    "pull_request": "None",
    "score": {
        "accidental_reopen_likely": false,
        "all_labels": [
            "type: bug",
            "status: fixed"
        ],
        "contains_keywords": [
            "work",
            "chang",
            "fix",
            "issu",
            "patch",
            "perform",
            "reason",
            "test",
            "remov",
            "problem",
            "workaround"
        ],
        "fix_size": 14,
        "has_labels": [],
        "intersecting": {
            "computed_score": 0.3333333333333333,
            "final_commit_size": 3,
            "intersection_size": 1,
            "previous_commits_size": 12
        },
        "is_makefile_based": true,
        "no_new_files": [],
        "no_other_files": true,
        "num_prohibited_files": 384876,
        "prohibited_files": [
            "server/src/main/java/com/genymobile/scrcpy/Device.java",
            "server/src/main/java/com/genymobile/scrcpy/wrappers/SurfaceControl.java",
            "server/src/main/java/com/genymobile/scrcpy/Device.java",
            "server/src/main/java/com/genymobile/scrcpy/wrappers/SurfaceControl.java",
            "app/meson.build",
            "app/scrcpy.1",
            "app/src/common.h",
            "app/src/scrcpy.h",
            "app/src/server.h",
            "server/src/main/java/com/genymobile/scrcpy/Workarounds.java"
        ],
        "reopen": true,
        "reopen_events": [
            [
                "2021-06-23 12:18:14+00:00",
                "commit"
            ],
            [
                "2021-07-01 05:25:21+00:00",
                "commit"
            ],
            [
                "2021-07-01 08:38:05+00:00",
                "closed"
            ],
            [
                "2021-07-02 05:25:22+00:00",
                "commit"
            ],
            [
                "2021-07-02 05:25:22+00:00",
                "commit"
            ],
            [
                "2021-07-02 05:25:23+00:00",
                "commit"
            ],
            [
                "2021-07-06 09:45:11+00:00",
                "commit"
            ],
            [
                "2021-07-06 09:55:23+00:00",
                "reopened"
            ],
            [
                "2021-07-07 05:25:25+00:00",
                "commit"
            ],
            [
                "2021-07-08 05:25:23+00:00",
                "commit"
            ],
            [
                "2021-07-08 05:25:26+00:00",
                "commit"
            ],
            [
                "2021-07-09 05:25:22+00:00",
                "commit"
            ],
            [
                "2021-10-27 09:50:56+00:00",
                "commit"
            ],
            [
                "2021-10-27 10:23:53+00:00",
                "closed"
            ]
        ],
        "status": false,
        "strategy": true,
        "total_changes": 23
    }
}