{
    "commits": [
        {
            "associated_pull_request": [],
            "date": "2023-01-31 05:43:08+00:00",
            "diff": "",
            "diff_additions": 0,
            "diff_deletions": 0,
            "diff_file_size": 0,
            "diff_url": "https://github.com/yugabyte/yugabyte-db/commit/715e9992d988e415bb1218995fb5e674cb119249.diff",
            "exists": true,
            "files": [],
            "interesting": {
                "reopen": false,
                "status": false
            },
            "is_parent": true,
            "sha": "715e9992d988e415bb1218995fb5e674cb119249"
        },
        {
            "associated_pull_request": [],
            "date": "2023-01-24 21:08:45+00:00",
            "diff": "yugabyte_yugabyte-db/issue_15786/commit_8dd58368d8426d94a7b98316dfef67007ec338ee.diff",
            "diff_additions": 101,
            "diff_deletions": 27,
            "diff_file_size": 335511,
            "diff_url": "https://github.com/yugabyte/yugabyte-db/commit/8dd58368d8426d94a7b98316dfef67007ec338ee.diff",
            "exists": true,
            "files": [
                {
                    "file_additions": 50,
                    "file_deletions": 3,
                    "file_exists": true,
                    "file_name": "src/yb/docdb/doc_rowwise_iterator.cc",
                    "file_size": 14080
                },
                {
                    "file_additions": 1,
                    "file_deletions": 1,
                    "file_exists": true,
                    "file_name": "src/yb/tablet/abstract_tablet.cc",
                    "file_size": 5209
                },
                {
                    "file_additions": 21,
                    "file_deletions": 0,
                    "file_exists": true,
                    "file_name": "src/yb/tablet/tablet-schema-test.cc",
                    "file_size": 7257
                },
                {
                    "file_additions": 21,
                    "file_deletions": 16,
                    "file_exists": true,
                    "file_name": "src/yb/tablet/tablet.cc",
                    "file_size": 189486
                },
                {
                    "file_additions": 6,
                    "file_deletions": 5,
                    "file_exists": true,
                    "file_name": "src/yb/tablet/tablet_metadata.cc",
                    "file_size": 78976
                },
                {
                    "file_additions": 2,
                    "file_deletions": 2,
                    "file_exists": true,
                    "file_name": "src/yb/tablet/write_query.cc",
                    "file_size": 40503
                }
            ],
            "interesting": {
                "reopen": true,
                "status": false
            },
            "is_parent": false,
            "sha": "8dd58368d8426d94a7b98316dfef67007ec338ee"
        },
        {
            "associated_pull_request": [],
            "date": "2023-02-09 15:08:22+00:00",
            "diff": "yugabyte_yugabyte-db/issue_15786/commit_8cc2e11bc85399fcdaab5081e36d1a2f3a62c6ae.diff",
            "diff_additions": 154,
            "diff_deletions": 42,
            "diff_file_size": 420224,
            "diff_url": "https://github.com/yugabyte/yugabyte-db/commit/8cc2e11bc85399fcdaab5081e36d1a2f3a62c6ae.diff",
            "exists": true,
            "files": [
                {
                    "file_additions": 14,
                    "file_deletions": 0,
                    "file_exists": true,
                    "file_name": "src/yb/docdb/cql_operation.cc",
                    "file_size": 84713
                },
                {
                    "file_additions": 50,
                    "file_deletions": 3,
                    "file_exists": true,
                    "file_name": "src/yb/docdb/doc_rowwise_iterator.cc",
                    "file_size": 14080
                },
                {
                    "file_additions": 1,
                    "file_deletions": 1,
                    "file_exists": true,
                    "file_name": "src/yb/tablet/abstract_tablet.cc",
                    "file_size": 5209
                },
                {
                    "file_additions": 21,
                    "file_deletions": 0,
                    "file_exists": true,
                    "file_name": "src/yb/tablet/tablet-schema-test.cc",
                    "file_size": 7257
                },
                {
                    "file_additions": 28,
                    "file_deletions": 24,
                    "file_exists": true,
                    "file_name": "src/yb/tablet/tablet.cc",
                    "file_size": 189486
                },
                {
                    "file_additions": 37,
                    "file_deletions": 11,
                    "file_exists": true,
                    "file_name": "src/yb/tablet/tablet_metadata.cc",
                    "file_size": 78976
                },
                {
                    "file_additions": 3,
                    "file_deletions": 3,
                    "file_exists": true,
                    "file_name": "src/yb/tablet/write_query.cc",
                    "file_size": 40503
                }
            ],
            "interesting": {
                "reopen": false,
                "status": false
            },
            "is_parent": false,
            "sha": "8cc2e11bc85399fcdaab5081e36d1a2f3a62c6ae"
        },
        {
            "associated_pull_request": [],
            "date": "2023-02-09 15:08:22+00:00",
            "diff": "yugabyte_yugabyte-db/issue_15786/commit_273b0f979861077129631b50f193c61f26c288b6.diff",
            "diff_additions": 154,
            "diff_deletions": 42,
            "diff_file_size": 420224,
            "diff_url": "https://github.com/yugabyte/yugabyte-db/commit/273b0f979861077129631b50f193c61f26c288b6.diff",
            "exists": true,
            "files": [
                {
                    "file_additions": 14,
                    "file_deletions": 0,
                    "file_exists": true,
                    "file_name": "src/yb/docdb/cql_operation.cc",
                    "file_size": 84713
                },
                {
                    "file_additions": 50,
                    "file_deletions": 3,
                    "file_exists": true,
                    "file_name": "src/yb/docdb/doc_rowwise_iterator.cc",
                    "file_size": 14080
                },
                {
                    "file_additions": 1,
                    "file_deletions": 1,
                    "file_exists": true,
                    "file_name": "src/yb/tablet/abstract_tablet.cc",
                    "file_size": 5209
                },
                {
                    "file_additions": 21,
                    "file_deletions": 0,
                    "file_exists": true,
                    "file_name": "src/yb/tablet/tablet-schema-test.cc",
                    "file_size": 7257
                },
                {
                    "file_additions": 28,
                    "file_deletions": 24,
                    "file_exists": true,
                    "file_name": "src/yb/tablet/tablet.cc",
                    "file_size": 189486
                },
                {
                    "file_additions": 37,
                    "file_deletions": 11,
                    "file_exists": true,
                    "file_name": "src/yb/tablet/tablet_metadata.cc",
                    "file_size": 78976
                },
                {
                    "file_additions": 3,
                    "file_deletions": 3,
                    "file_exists": true,
                    "file_name": "src/yb/tablet/write_query.cc",
                    "file_size": 40503
                }
            ],
            "interesting": {
                "reopen": false,
                "status": false
            },
            "is_parent": false,
            "sha": "273b0f979861077129631b50f193c61f26c288b6"
        }
    ],
    "first_commit": "2023-01-31 16:05:20+00:00",
    "last_commit": "2023-04-04 23:12:36+00:00",
    "number": 15786,
    "pull_request": "None",
    "score": {
        "accidental_reopen_likely": false,
        "all_labels": [
            "kind/bug",
            "kind/failing-test",
            "area/docdb",
            "priority/medium",
            "2.14 Backport Required",
            "2.16 Backport Required"
        ],
        "contains_keywords": [
            "work",
            "fail",
            "chang",
            "fix",
            "issu",
            "test",
            "attempt",
            "fault",
            "remov",
            "error",
            "problem",
            "crash"
        ],
        "fix_size": 417,
        "has_labels": [],
        "intersecting": {
            "computed_score": 0.1878453038674033,
            "final_commit_size": 181,
            "intersection_size": 34,
            "previous_commits_size": 270
        },
        "is_makefile_based": true,
        "no_new_files": [],
        "no_other_files": false,
        "num_prohibited_files": 44220,
        "prohibited_files": [
            "server/src/main/java/com/genymobile/scrcpy/Device.java",
            "server/src/main/java/com/genymobile/scrcpy/wrappers/SurfaceControl.java",
            "server/src/main/java/com/genymobile/scrcpy/Device.java",
            "server/src/main/java/com/genymobile/scrcpy/wrappers/SurfaceControl.java",
            "app/meson.build",
            "app/scrcpy.1",
            "app/src/common.h",
            "app/src/scrcpy.h",
            "app/src/server.h",
            "server/src/main/java/com/genymobile/scrcpy/Workarounds.java"
        ],
        "reopen": true,
        "reopen_events": [
            [
                "2023-01-31 16:19:11+00:00",
                "commit"
            ],
            [
                "2023-02-17 21:52:31+00:00",
                "closed"
            ],
            [
                "2023-02-17 21:58:08+00:00",
                "reopened"
            ],
            [
                "2023-03-29 01:09:47+00:00",
                "commit"
            ],
            [
                "2023-04-04 23:12:40+00:00",
                "commit"
            ],
            [
                "2023-04-05 17:48:29+00:00",
                "closed"
            ]
        ],
        "status": false,
        "strategy": true,
        "total_changes": 520
    }
}