{
    "commits": [
        {
            "associated_pull_request": [],
            "date": "2023-05-26 22:11:43+00:00",
            "diff": "hamlib_hamlib/issue_1303/commit_77d9d11f9249edeaedef943766c243c595952ad8.diff",
            "diff_additions": 7,
            "diff_deletions": 3,
            "diff_file_size": 248742,
            "diff_url": "https://github.com/Hamlib/Hamlib/commit/77d9d11f9249edeaedef943766c243c595952ad8.diff",
            "exists": true,
            "files": [
                {
                    "file_additions": 2,
                    "file_deletions": 0,
                    "file_exists": true,
                    "file_name": "src/multicast.c",
                    "file_size": 17600
                },
                {
                    "file_additions": 2,
                    "file_deletions": 0,
                    "file_exists": true,
                    "file_name": "src/rig.c",
                    "file_size": 230163
                },
                {
                    "file_additions": 3,
                    "file_deletions": 3,
                    "file_exists": true,
                    "file_name": "tests/rigtestmcast.c",
                    "file_size": 979
                }
            ],
            "interesting": {
                "reopen": false,
                "status": false
            },
            "is_parent": true,
            "sha": "77d9d11f9249edeaedef943766c243c595952ad8"
        },
        {
            "associated_pull_request": [],
            "date": "2023-05-27 15:07:32+00:00",
            "diff": "hamlib_hamlib/issue_1303/commit_00b6e0ecd72104d1c074e78ba3ddb87569ac1e19.diff",
            "diff_additions": 1,
            "diff_deletions": 2,
            "diff_file_size": 41874,
            "diff_url": "https://github.com/Hamlib/Hamlib/commit/00b6e0ecd72104d1c074e78ba3ddb87569ac1e19.diff",
            "exists": true,
            "files": [
                {
                    "file_additions": 1,
                    "file_deletions": 2,
                    "file_exists": true,
                    "file_name": "src/iofunc.c",
                    "file_size": 41874
                }
            ],
            "interesting": {
                "reopen": false,
                "status": false
            },
            "is_parent": false,
            "sha": "00b6e0ecd72104d1c074e78ba3ddb87569ac1e19"
        },
        {
            "associated_pull_request": [],
            "date": "2023-05-27 16:04:56+00:00",
            "diff": "hamlib_hamlib/issue_1303/commit_3b45dfa4b845d581dd187c819876db6ccde447d7.diff",
            "diff_additions": 501,
            "diff_deletions": 2,
            "diff_file_size": 30701,
            "diff_url": "https://github.com/Hamlib/Hamlib/commit/3b45dfa4b845d581dd187c819876db6ccde447d7.diff",
            "exists": true,
            "files": [
                {
                    "file_additions": 405,
                    "file_deletions": 0,
                    "file_exists": true,
                    "file_name": "rigs/anytone/anytone.c",
                    "file_size": 13143
                },
                {
                    "file_additions": 92,
                    "file_deletions": 0,
                    "file_exists": true,
                    "file_name": "rigs/anytone/d578.c",
                    "file_size": 3418
                },
                {
                    "file_additions": 4,
                    "file_deletions": 2,
                    "file_exists": true,
                    "file_name": "src/register.c",
                    "file_size": 14140
                }
            ],
            "interesting": {
                "reopen": false,
                "status": false
            },
            "is_parent": false,
            "sha": "3b45dfa4b845d581dd187c819876db6ccde447d7"
        },
        {
            "associated_pull_request": [],
            "date": "2023-05-27 17:51:24+00:00",
            "diff": "hamlib_hamlib/issue_1303/commit_34f20cc970af8ea5cc113a9df58f4ed7f1de08bc.diff",
            "diff_additions": 61,
            "diff_deletions": 12,
            "diff_file_size": 16903,
            "diff_url": "https://github.com/Hamlib/Hamlib/commit/34f20cc970af8ea5cc113a9df58f4ed7f1de08bc.diff",
            "exists": true,
            "files": [
                {
                    "file_additions": 47,
                    "file_deletions": 4,
                    "file_exists": true,
                    "file_name": "rigs/anytone/anytone.c",
                    "file_size": 13143
                },
                {
                    "file_additions": 14,
                    "file_deletions": 8,
                    "file_exists": true,
                    "file_name": "simulators/simatd578.c",
                    "file_size": 3760
                }
            ],
            "interesting": {
                "reopen": false,
                "status": false
            },
            "is_parent": false,
            "sha": "34f20cc970af8ea5cc113a9df58f4ed7f1de08bc"
        },
        {
            "associated_pull_request": [],
            "date": "2023-05-27 21:21:14+00:00",
            "diff": "hamlib_hamlib/issue_1303/commit_e5bb7355b8ab9e3adabe5f59625c0125c70d63c0.diff",
            "diff_additions": 7,
            "diff_deletions": 7,
            "diff_file_size": 13143,
            "diff_url": "https://github.com/Hamlib/Hamlib/commit/e5bb7355b8ab9e3adabe5f59625c0125c70d63c0.diff",
            "exists": true,
            "files": [
                {
                    "file_additions": 7,
                    "file_deletions": 7,
                    "file_exists": true,
                    "file_name": "rigs/anytone/anytone.c",
                    "file_size": 13143
                }
            ],
            "interesting": {
                "reopen": true,
                "status": false
            },
            "is_parent": false,
            "sha": "e5bb7355b8ab9e3adabe5f59625c0125c70d63c0"
        },
        {
            "associated_pull_request": [],
            "date": "2023-05-28 21:38:27+00:00",
            "diff": "hamlib_hamlib/issue_1303/commit_07a9f321b4a3a337df306b4b6184435040174eae.diff",
            "diff_additions": 89,
            "diff_deletions": 41,
            "diff_file_size": 16903,
            "diff_url": "https://github.com/Hamlib/Hamlib/commit/07a9f321b4a3a337df306b4b6184435040174eae.diff",
            "exists": true,
            "files": [
                {
                    "file_additions": 37,
                    "file_deletions": 32,
                    "file_exists": true,
                    "file_name": "rigs/anytone/anytone.c",
                    "file_size": 13143
                },
                {
                    "file_additions": 52,
                    "file_deletions": 9,
                    "file_exists": true,
                    "file_name": "simulators/simatd578.c",
                    "file_size": 3760
                }
            ],
            "interesting": {
                "reopen": false,
                "status": false
            },
            "is_parent": false,
            "sha": "07a9f321b4a3a337df306b4b6184435040174eae"
        }
    ],
    "first_commit": "2023-05-26 22:11:43+00:00",
    "last_commit": "2023-05-28 21:38:27+00:00",
    "number": 1303,
    "pull_request": "None",
    "score": {
        "accidental_reopen_likely": false,
        "all_labels": [],
        "contains_keywords": [
            "work",
            "fix",
            "issu",
            "test",
            "error"
        ],
        "fix_size": 188,
        "has_labels": [],
        "intersecting": {
            "computed_score": 0.17073170731707318,
            "final_commit_size": 123,
            "intersection_size": 21,
            "previous_commits_size": 86
        },
        "is_makefile_based": true,
        "no_new_files": [],
        "no_other_files": false,
        "num_prohibited_files": 404237,
        "prohibited_files": [
            "server/src/main/java/com/genymobile/scrcpy/Device.java",
            "server/src/main/java/com/genymobile/scrcpy/wrappers/SurfaceControl.java",
            "server/src/main/java/com/genymobile/scrcpy/Device.java",
            "server/src/main/java/com/genymobile/scrcpy/wrappers/SurfaceControl.java",
            "app/meson.build",
            "app/scrcpy.1",
            "app/src/common.h",
            "app/src/scrcpy.h",
            "app/src/server.h",
            "server/src/main/java/com/genymobile/scrcpy/Workarounds.java"
        ],
        "reopen": true,
        "reopen_events": [
            [
                "2023-05-27 16:05:10+00:00",
                "commit"
            ],
            [
                "2023-05-27 16:05:10+00:00",
                "commit"
            ],
            [
                "2023-05-27 17:01:14+00:00",
                "commit"
            ],
            [
                "2023-05-27 17:51:53+00:00",
                "commit"
            ],
            [
                "2023-05-27 17:58:48+00:00",
                "commit"
            ],
            [
                "2023-05-27 21:21:43+00:00",
                "closed"
            ],
            [
                "2023-05-27 21:21:43+00:00",
                "commit"
            ],
            [
                "2023-05-28 03:31:12+00:00",
                "reopened"
            ],
            [
                "2023-05-28 21:38:53+00:00",
                "commit"
            ],
            [
                "2023-05-29 03:09:33+00:00",
                "closed"
            ]
        ],
        "status": false,
        "strategy": true,
        "total_changes": 733
    }
}