{
    "commits": [
        {
            "diff": "elastic_elasticsearch/issue_37063/commit_d4e766024846ad9578f5d0621d9dc92ec6a72085.diff",
            "diff_additions": 162,
            "diff_deletions": 1,
            "diff_file_size": 247567,
            "files": [
                {
                    "file_additions": 3,
                    "file_deletions": 0,
                    "file_exists": true,
                    "file_name": "client/rest-high-level/src/main/java/org/elasticsearch/client/RestHighLevelClient.java",
                    "file_size": 116351
                },
                {
                    "file_additions": 39,
                    "file_deletions": 0,
                    "file_exists": true,
                    "file_name": "client/rest-high-level/src/test/java/org/elasticsearch/client/SearchIT.java",
                    "file_size": 77860
                },
                {
                    "file_additions": 1,
                    "file_deletions": 1,
                    "file_exists": true,
                    "file_name": "server/src/main/java/org/elasticsearch/search/aggregations/metrics/ParsedWeightedAvg.java",
                    "file_size": 2029
                },
                {
                    "file_additions": 2,
                    "file_deletions": 0,
                    "file_exists": true,
                    "file_name": "server/src/test/java/org/elasticsearch/search/aggregations/AggregationsTests.java",
                    "file_size": 16079
                },
                {
                    "file_additions": 114,
                    "file_deletions": 0,
                    "file_exists": true,
                    "file_name": "server/src/test/java/org/elasticsearch/search/aggregations/metrics/InternalWeightedAvgTests.java",
                    "file_size": 3435
                },
                {
                    "file_additions": 3,
                    "file_deletions": 0,
                    "file_exists": true,
                    "file_name": "test/framework/src/main/java/org/elasticsearch/test/InternalAggregationTestCase.java",
                    "file_size": 31813
                }
            ],
            "interesting": {
                "reopened": false,
                "status": false
            },
            "sha": "d4e766024846ad9578f5d0621d9dc92ec6a72085"
        },
        {
            "diff": "elastic_elasticsearch/issue_37063/commit_f0cd19f39b083759a883a6c2fa6d1616abaebd84.diff",
            "diff_additions": 4,
            "diff_deletions": 4,
            "diff_file_size": 0,
            "files": [
                {
                    "file_additions": 4,
                    "file_deletions": 4,
                    "file_exists": false,
                    "file_name": "x-pack/plugin/security/src/test/java/org/elasticsearch/xpack/security/authc/TokenAuthIntegTests.java",
                    "file_size": 0
                }
            ],
            "interesting": {
                "reopened": false,
                "status": false
            },
            "sha": "f0cd19f39b083759a883a6c2fa6d1616abaebd84"
        },
        {
            "diff": "elastic_elasticsearch/issue_37063/commit_00022032f6ccdeb500ad11669c718db54726dffb.diff",
            "diff_additions": 1,
            "diff_deletions": 0,
            "diff_file_size": 0,
            "files": [
                {
                    "file_additions": 1,
                    "file_deletions": 0,
                    "file_exists": false,
                    "file_name": "x-pack/plugin/security/src/test/java/org/elasticsearch/xpack/security/authc/TokenAuthIntegTests.java",
                    "file_size": 0
                }
            ],
            "interesting": {
                "reopened": true,
                "status": false
            },
            "sha": "00022032f6ccdeb500ad11669c718db54726dffb"
        },
        {
            "diff": "elastic_elasticsearch/issue_37063/commit_7609e890ffec68176117171033d6ed46aea61044.diff",
            "diff_additions": 1,
            "diff_deletions": 1,
            "diff_file_size": 0,
            "files": [
                {
                    "file_additions": 1,
                    "file_deletions": 1,
                    "file_exists": false,
                    "file_name": "x-pack/plugin/security/src/test/java/org/elasticsearch/xpack/security/authc/TokenAuthIntegTests.java",
                    "file_size": 0
                }
            ],
            "interesting": {
                "reopened": false,
                "status": false
            },
            "sha": "7609e890ffec68176117171033d6ed46aea61044"
        }
    ],
    "first_commit": "2019-01-02 21:53:21",
    "last_commit": "2019-03-15 11:21:52",
    "number": 37063,
    "score": 176.02298850574712
}