{
    "covered_issues": [
        155,
        152,
        135,
        134,
        132,
        131,
        130,
        127,
        126,
        125,
        124,
        123,
        122,
        121,
        120,
        118,
        117,
        116,
        115,
        113,
        111,
        110,
        109,
        108,
        106,
        105,
        104,
        103,
        101,
        100,
        99,
        98,
        97,
        96,
        95,
        93,
        92,
        88,
        87,
        86,
        85,
        84,
        83,
        82,
        81,
        80,
        79,
        78,
        77,
        76,
        75,
        73,
        70,
        69,
        68,
        67,
        66,
        65,
        64,
        63,
        62,
        61,
        60,
        59,
        58,
        57,
        56,
        55,
        54,
        53,
        52,
        51,
        50,
        49,
        48,
        47,
        46,
        45,
        44,
        43,
        42,
        41,
        39,
        38,
        37,
        36,
        35,
        34,
        33,
        32,
        31,
        30,
        29,
        28,
        27,
        26,
        25,
        24,
        23,
        20,
        18,
        17,
        16,
        15,
        13,
        11,
        10,
        8,
        7,
        6,
        5,
        4,
        3,
        2,
        1
    ],
    "finished": true
}