{
    "category": [
        "memory",
        "multithreading"
    ],
    "commits": [
        {
            "associated_pull_request": [],
            "date": "2019-02-13 11:46:23",
            "diff": "krakjoe_parallel/issue_2/commit_44fbbba621af93816f851a5e42a336b47800ab72.diff",
            "diff_additions": 1,
            "diff_deletions": 1,
            "diff_file_size": 7360,
            "diff_url": "https://github.com/krakjoe/parallel/commit/44fbbba621af93816f851a5e42a336b47800ab72.diff",
            "exists": true,
            "files": [
                {
                    "file_additions": 1,
                    "file_deletions": 1,
                    "file_exists": true,
                    "file_name": "src/parallel.c",
                    "file_size": 7360
                }
            ],
            "interesting": {
                "reopen": false,
                "status": false
            },
            "is_parent": true,
            "sha": "44fbbba621af93816f851a5e42a336b47800ab72"
        },
        {
            "associated_pull_request": [],
            "date": "2019-02-14 05:38:44",
            "diff": "krakjoe_parallel/issue_2/commit_48dae227b0c36dafab2b3e40af4db1070bf86574.diff",
            "diff_additions": 99,
            "diff_deletions": 44,
            "diff_file_size": 48751,
            "diff_url": "https://github.com/krakjoe/parallel/commit/48dae227b0c36dafab2b3e40af4db1070bf86574.diff",
            "exists": true,
            "files": [
                {
                    "file_additions": 7,
                    "file_deletions": 1,
                    "file_exists": true,
                    "file_name": "src/copy.c",
                    "file_size": 27394
                },
                {
                    "file_additions": 10,
                    "file_deletions": 3,
                    "file_exists": true,
                    "file_name": "src/future.c",
                    "file_size": 10202
                },
                {
                    "file_additions": 9,
                    "file_deletions": 21,
                    "file_exists": true,
                    "file_name": "src/monitor.c",
                    "file_size": 3795
                },
                {
                    "file_additions": 73,
                    "file_deletions": 19,
                    "file_exists": true,
                    "file_name": "src/parallel.c",
                    "file_size": 7360
                }
            ],
            "interesting": {
                "reopen": false,
                "status": true
            },
            "is_parent": false,
            "sha": "48dae227b0c36dafab2b3e40af4db1070bf86574"
        },
        {
            "associated_pull_request": [],
            "date": "2019-02-14 07:26:43",
            "diff": "krakjoe_parallel/issue_2/commit_222e61343355c24366b951d2e7cd694c7e415cae.diff",
            "diff_additions": 9,
            "diff_deletions": 2,
            "diff_file_size": 34754,
            "diff_url": "https://github.com/krakjoe/parallel/commit/222e61343355c24366b951d2e7cd694c7e415cae.diff",
            "exists": true,
            "files": [
                {
                    "file_additions": 8,
                    "file_deletions": 1,
                    "file_exists": true,
                    "file_name": "src/copy.c",
                    "file_size": 27394
                },
                {
                    "file_additions": 1,
                    "file_deletions": 1,
                    "file_exists": true,
                    "file_name": "src/parallel.c",
                    "file_size": 7360
                }
            ],
            "interesting": {
                "reopen": false,
                "status": false
            },
            "is_parent": false,
            "sha": "222e61343355c24366b951d2e7cd694c7e415cae"
        }
    ],
    "first_commit": "2019-02-13 11:46:23",
    "last_commit": "2019-02-14 07:26:43",
    "number": 2,
    "pull_request": "None",
    "score": {
        "accidental_reopen_likely": false,
        "all_labels": [],
        "contains_keywords": [
            "error"
        ],
        "fix_size": 140,
        "has_labels": [],
        "intersecting": {
            "computed_score": 0.5454545454545454,
            "final_commit_size": 11,
            "intersection_size": 6,
            "previous_commits_size": 135
        },
        "is_makefile_based": true,
        "no_new_files": [],
        "no_other_files": false,
        "num_prohibited_files": 43283,
        "prohibited_files": [
            "hal/inc/pinmap_hal.h",
            "Debug/marvin.bin",
            "Debug/marvin.elf",
            "Debug/marvin.hex",
            "Debug/marvin.bin",
            "Debug/marvin.elf",
            "Debug/marvin.hex",
            "inc/spark_utilities.h",
            "Debug/marvin.bin",
            "Debug/marvin.elf"
        ],
        "reopen": false,
        "reopen_events": [
            [
                "2019-02-14 05:41:13",
                "closed"
            ],
            [
                "2019-02-14 05:41:13",
                "commit"
            ],
            [
                "2019-02-14 07:27:31",
                "commit"
            ]
        ],
        "status": true,
        "strategy": true,
        "total_changes": 156
    }
}