ts_uinput: MT type A / without pressure event from touchscreen / doesn't work
Thanks for reporting! If you can give me an evemu-recording of your __original__ device (of a few "taps"), I can test myself. That's be great. Otherwise I'll try to fix it anyways, requiring you to test...
I think that's not a complete recording :( The descriptors on top are missing..

Am 5. Dezember 2017 18:26:23 MEZ schrieb "Peter V." <notifications@github.com>:
>Directly from touchscreen: http://sprunge.us/FVEj
>```
>LibreELEC:~ # evtest
>No device specified, trying to scan all of /dev/input/event*
>Available devices:
>/dev/input/event0:      RCMCU iPazzPort
>/dev/input/event1:      RCMCU iPazzPort
>/dev/input/event2:      3M 3M USB Touchscreen - EX II   <<<< this one
>Select the device event number [0-2]:
>```

-- 
Martin Kepplinger
http://martinkepplinger.com
sent from mobile

Seems I was using some prehistoric evemu :(

I think this one should be better: http://sprunge.us/AFQS
great. thanks

Am 5. Dezember 2017 19:25:37 MEZ schrieb "Peter V." <notifications@github.com>:
>Seems I was using some prehistoric evemu :(
>
>I think this one should be better: http://sprunge.us/AFQS

-- 
Martin Kepplinger
http://martinkepplinger.com
sent from mobile

Sorry, but now your recording isn't available anymore :(

I  __think__ that I have the fix and will push it, but please, if you have the time, re-opload this recording for verification. thanks!
I think the problem still exists after quick test.

evemu record: http://vpeter.libreelec.tv/touchscreen/3M.3M.USB.Touchscreen.-.EX.II.evemu.record.txt
looks ok to me: recording ts_uinput's device now, when TSLIB_TSDEVICE is your sample, is:

```
# EVEMU 1.3
# Kernel: 4.14.0-00002-g22faf2dbad1a
# DMI: dmi:bvnFUJITSU//PhoenixTechnologiesLtd.:bvrVersion1.11:bd01/13/2015:svnFUJITSU:pnCELSIUSH730:pvr10601583184:rvnFUJITSU:rnFJNB274:rvrJ3:cvnFUJITSU:ct10:cvrCELSIUSH730:
# Input device name: "ts_uinput"
# Input device ID: bus 0x06 vendor 0000 product 0000 version 0000
# Supported events:
#   Event type 0 (EV_SYN)
#     Event code 0 (SYN_REPORT)
#     Event code 1 (SYN_CONFIG)
#     Event code 2 (SYN_MT_REPORT)
#     Event code 3 (SYN_DROPPED)
#     Event code 4 ((null))
#     Event code 5 ((null))
#     Event code 6 ((null))
#     Event code 7 ((null))
#     Event code 8 ((null))
#     Event code 9 ((null))
#     Event code 10 ((null))
#     Event code 11 ((null))
#     Event code 12 ((null))
#     Event code 13 ((null))
#     Event code 14 ((null))
#     Event code 15 (SYN_MAX)
#   Event type 1 (EV_KEY)
#     Event code 330 (BTN_TOUCH)
#   Event type 3 (EV_ABS)
#     Event code 0 (ABS_X)
#       Value    -7900
#       Min          0
#       Max       1919
#       Fuzz         0
#       Flat         0
#       Resolution   0
#     Event code 1 (ABS_Y)
#       Value    -5288
#       Min          0
#       Max       1079
#       Fuzz         0
#       Flat         0
#       Resolution   0
# Properties:
N: ts_uinput
I: 0006 0000 0000 0000
P: 00 00 00 00 00 00 00 00
B: 00 0b 00 00 00 00 00 00 00
B: 01 00 00 00 00 00 00 00 00
B: 01 00 00 00 00 00 00 00 00
B: 01 00 00 00 00 00 00 00 00
B: 01 00 00 00 00 00 00 00 00
B: 01 00 00 00 00 00 00 00 00
B: 01 00 04 00 00 00 00 00 00
B: 01 00 00 00 00 00 00 00 00
B: 01 00 00 00 00 00 00 00 00
B: 01 00 00 00 00 00 00 00 00
B: 01 00 00 00 00 00 00 00 00
B: 01 00 00 00 00 00 00 00 00
B: 01 00 00 00 00 00 00 00 00
B: 02 00 00 00 00 00 00 00 00
B: 03 03 00 00 00 00 00 00 00
B: 04 00 00 00 00 00 00 00 00
B: 05 00 00 00 00 00 00 00 00
B: 11 00 00 00 00 00 00 00 00
B: 12 00 00 00 00 00 00 00 00
B: 14 00 00 00 00 00 00 00 00
B: 15 00 00 00 00 00 00 00 00
B: 15 00 00 00 00 00 00 00 00
A: 00 0 1919 0 0 0
A: 01 0 1079 0 0 0
################################
#      Waiting for events      #
################################
E: 0.000001 0001 014a 0001	# EV_KEY / BTN_TOUCH            1
E: 0.000001 0003 0000 -5014	# EV_ABS / ABS_X                -5014
E: 0.000001 0003 0001 -1365	# EV_ABS / ABS_Y                -1365
E: 0.000001 0000 0000 0000	# ------------ SYN_REPORT (0) ---------- +0ms
E: 0.001930 0003 0000 -5023	# EV_ABS / ABS_X                -5023
E: 0.001930 0003 0001 -1366	# EV_ABS / ABS_Y                -1366
E: 0.001930 0000 0000 0000	# ------------ SYN_REPORT (0) ---------- +1ms
E: 0.005866 0003 0000 -5031	# EV_ABS / ABS_X                -5031
E: 0.005866 0003 0001 -1369	# EV_ABS / ABS_Y                -1369
E: 0.005866 0000 0000 0000	# ------------ SYN_REPORT (0) ---------- +4ms
E: 0.007789 0003 0000 -5032	# EV_ABS / ABS_X                -5032
E: 0.007789 0003 0001 -1374	# EV_ABS / ABS_Y                -1374
E: 0.007789 0000 0000 0000	# ------------ SYN_REPORT (0) ---------- +2ms
E: 0.009737 0003 0000 -5038	# EV_ABS / ABS_X                -5038
E: 0.009737 0003 0001 -1379	# EV_ABS / ABS_Y                -1379
E: 0.009737 0000 0000 0000	# ------------ SYN_REPORT (0) ---------- +2ms
E: 0.013676 0003 0000 -5039	# EV_ABS / ABS_X                -5039
E: 0.013676 0003 0001 -1385	# EV_ABS / ABS_Y                -1385
E: 0.013676 0000 0000 0000	# ------------ SYN_REPORT (0) ---------- +4ms
E: 0.015633 0003 0000 -5034	# EV_ABS / ABS_X                -5034
E: 0.015633 0003 0001 -1386	# EV_ABS / ABS_Y                -1386
E: 0.015633 0000 0000 0000	# ------------ SYN_REPORT (0) ---------- +2ms
E: 0.017569 0001 014a 0000	# EV_KEY / BTN_TOUCH            0
E: 0.017569 0003 0000 -5031	# EV_ABS / ABS_X                -5031
E: 0.017569 0003 0001 -1384	# EV_ABS / ABS_Y                -1384
E: 0.017569 0000 0000 0000	# ------------ SYN_REPORT (0) ---------- +2ms
E: 1.179585 0001 014a 0001	# EV_KEY / BTN_TOUCH            1
E: 1.179585 0003 0000 -5618	# EV_ABS / ABS_X                -5618
E: 1.179585 0003 0001 -2249	# EV_ABS / ABS_Y                -2249
E: 1.179585 0000 0000 0000	# ------------ SYN_REPORT (0) ---------- +1162ms
E: 1.183518 0003 0000 -5623	# EV_ABS / ABS_X                -5623
E: 1.183518 0000 0000 0000	# ------------ SYN_REPORT (0) ---------- +4ms
E: 1.185461 0003 0000 -5632	# EV_ABS / ABS_X                -5632
E: 1.185461 0003 0001 -2253	# EV_ABS / ABS_Y                -2253
E: 1.185461 0000 0000 0000	# ------------ SYN_REPORT (0) ---------- +2ms
E: 1.187460 0003 0000 -5633	# EV_ABS / ABS_X                -5633
E: 1.187460 0003 0001 -2255	# EV_ABS / ABS_Y                -2255
E: 1.187460 0000 0000 0000	# ------------ SYN_REPORT (0) ---------- +2ms
E: 1.191429 0003 0000 -5639	# EV_ABS / ABS_X                -5639
E: 1.191429 0003 0001 -2260	# EV_ABS / ABS_Y                -2260
E: 1.191429 0000 0000 0000	# ------------ SYN_REPORT (0) ---------- +4ms
E: 1.193344 0003 0000 -5644	# EV_ABS / ABS_X                -5644
E: 1.193344 0003 0001 -2268	# EV_ABS / ABS_Y                -2268
E: 1.193344 0000 0000 0000	# ------------ SYN_REPORT (0) ---------- +2ms
E: 1.197298 0003 0001 -2276	# EV_ABS / ABS_Y                -2276
E: 1.197298 0000 0000 0000	# ------------ SYN_REPORT (0) ---------- +4ms
E: 1.199218 0003 0000 -5653	# EV_ABS / ABS_X                -5653
E: 1.199218 0003 0001 -2291	# EV_ABS / ABS_Y                -2291
E: 1.199218 0000 0000 0000	# ------------ SYN_REPORT (0) ---------- +2ms
E: 1.201097 0003 0000 -5694	# EV_ABS / ABS_X                -5694
E: 1.201097 0003 0001 -2323	# EV_ABS / ABS_Y                -2323
E: 1.201097 0000 0000 0000	# ------------ SYN_REPORT (0) ---------- +2ms
E: 1.205072 0003 0000 -6376	# EV_ABS / ABS_X                -6376
E: 1.205072 0003 0001 -2698	# EV_ABS / ABS_Y                -2698
E: 1.205072 0000 0000 0000	# ------------ SYN_REPORT (0) ---------- +4ms
E: 1.207005 0001 014a 0000	# EV_KEY / BTN_TOUCH            0
E: 1.207005 0000 0000 0000	# ------------ SYN_REPORT (0) ---------- +2ms
E: 2.599000 0001 014a 0001	# EV_KEY / BTN_TOUCH            1
E: 2.599000 0003 0000 -6428	# EV_ABS / ABS_X                -6428
E: 2.599000 0003 0001 -3004	# EV_ABS / ABS_Y                -3004
E: 2.599000 0000 0000 0000	# ------------ SYN_REPORT (0) ---------- +1392ms
E: 2.600901 0003 0000 -6429	# EV_ABS / ABS_X                -6429
E: 2.600901 0003 0001 -3005	# EV_ABS / ABS_Y                -3005
E: 2.600901 0000 0000 0000	# ------------ SYN_REPORT (0) ---------- +1ms
E: 2.608823 0003 0000 -6425	# EV_ABS / ABS_X                -6425
E: 2.608823 0003 0001 -3007	# EV_ABS / ABS_Y                -3007
E: 2.608823 0000 0000 0000	# ------------ SYN_REPORT (0) ---------- +8ms
E: 2.610769 0003 0000 -6424	# EV_ABS / ABS_X                -6424
E: 2.610769 0003 0001 -3009	# EV_ABS / ABS_Y                -3009
E: 2.610769 0000 0000 0000	# ------------ SYN_REPORT (0) ---------- +2ms
E: 2.614730 0003 0000 -6422	# EV_ABS / ABS_X                -6422
E: 2.614730 0003 0001 -3013	# EV_ABS / ABS_Y                -3013
E: 2.614730 0000 0000 0000	# ------------ SYN_REPORT (0) ---------- +4ms
E: 2.616644 0003 0000 -6420	# EV_ABS / ABS_X                -6420
E: 2.616644 0003 0001 -3015	# EV_ABS / ABS_Y                -3015
E: 2.616644 0000 0000 0000	# ------------ SYN_REPORT (0) ---------- +2ms
E: 2.618642 0003 0000 -6422	# EV_ABS / ABS_X                -6422
E: 2.618642 0003 0001 -3021	# EV_ABS / ABS_Y                -3021
E: 2.618642 0000 0000 0000	# ------------ SYN_REPORT (0) ---------- +2ms
E: 2.622642 0003 0000 -6425	# EV_ABS / ABS_X                -6425
E: 2.622642 0003 0001 -3027	# EV_ABS / ABS_Y                -3027
E: 2.622642 0000 0000 0000	# ------------ SYN_REPORT (0) ---------- +4ms
E: 2.624645 0003 0000 -6418	# EV_ABS / ABS_X                -6418
E: 2.624645 0003 0001 -3035	# EV_ABS / ABS_Y                -3035
E: 2.624645 0000 0000 0000	# ------------ SYN_REPORT (0) ---------- +2ms
E: 2.628567 0003 0000 -6426	# EV_ABS / ABS_X                -6426
E: 2.628567 0003 0001 -3045	# EV_ABS / ABS_Y                -3045
E: 2.628567 0000 0000 0000	# ------------ SYN_REPORT (0) ---------- +4ms
E: 2.630590 0003 0000 -6441	# EV_ABS / ABS_X                -6441
E: 2.630590 0003 0001 -3061	# EV_ABS / ABS_Y                -3061
E: 2.630590 0000 0000 0000	# ------------ SYN_REPORT (0) ---------- +2ms
E: 2.632591 0003 0000 -6671	# EV_ABS / ABS_X                -6671
E: 2.632591 0003 0001 -3186	# EV_ABS / ABS_Y                -3186
E: 2.632591 0000 0000 0000	# ------------ SYN_REPORT (0) ---------- +2ms
E: 2.636621 0001 014a 0000	# EV_KEY / BTN_TOUCH            0
E: 2.636621 0000 0000 0000	# ------------ SYN_REPORT (0) ---------- +4ms
E: 3.704602 0001 014a 0001	# EV_KEY / BTN_TOUCH            1
E: 3.704602 0003 0000 -6949	# EV_ABS / ABS_X                -6949
E: 3.704602 0003 0001 -3999	# EV_ABS / ABS_Y                -3999
E: 3.704602 0000 0000 0000	# ------------ SYN_REPORT (0) ---------- +1068ms
E: 3.708540 0003 0001 -3998	# EV_ABS / ABS_Y                -3998
E: 3.708540 0000 0000 0000	# ------------ SYN_REPORT (0) ---------- +4ms
E: 3.710490 0003 0000 -6954	# EV_ABS / ABS_X                -6954
E: 3.710490 0000 0000 0000	# ------------ SYN_REPORT (0) ---------- +2ms
E: 3.712404 0003 0000 -6957	# EV_ABS / ABS_X                -6957
E: 3.712404 0003 0001 -3999	# EV_ABS / ABS_Y                -3999
E: 3.712404 0000 0000 0000	# ------------ SYN_REPORT (0) ---------- +2ms
E: 3.716345 0003 0000 -6961	# EV_ABS / ABS_X                -6961
E: 3.716345 0003 0001 -4002	# EV_ABS / ABS_Y                -4002
E: 3.716345 0000 0000 0000	# ------------ SYN_REPORT (0) ---------- +4ms
E: 3.718288 0003 0000 -6964	# EV_ABS / ABS_X                -6964
E: 3.718288 0003 0001 -4010	# EV_ABS / ABS_Y                -4010
E: 3.718288 0000 0000 0000	# ------------ SYN_REPORT (0) ---------- +2ms
E: 3.720240 0003 0000 -6960	# EV_ABS / ABS_X                -6960
E: 3.720240 0003 0001 -4020	# EV_ABS / ABS_Y                -4020
E: 3.720240 0000 0000 0000	# ------------ SYN_REPORT (0) ---------- +2ms
E: 3.724189 0003 0000 -6964	# EV_ABS / ABS_X                -6964
E: 3.724189 0003 0001 -4034	# EV_ABS / ABS_Y                -4034
E: 3.724189 0000 0000 0000	# ------------ SYN_REPORT (0) ---------- +4ms
E: 3.726169 0003 0000 -6972	# EV_ABS / ABS_X                -6972
E: 3.726169 0003 0001 -4059	# EV_ABS / ABS_Y                -4059
E: 3.726169 0000 0000 0000	# ------------ SYN_REPORT (0) ---------- +2ms
E: 3.728090 0003 0000 -7357	# EV_ABS / ABS_X                -7357
E: 3.728090 0003 0001 -4265	# EV_ABS / ABS_Y                -4265
E: 3.728090 0000 0000 0000	# ------------ SYN_REPORT (0) ---------- +2ms
E: 3.732039 0001 014a 0000	# EV_KEY / BTN_TOUCH            0
E: 3.732039 0000 0000 0000	# ------------ SYN_REPORT (0) ---------- +4ms
E: 4.816107 0001 014a 0001	# EV_KEY / BTN_TOUCH            1
E: 4.816107 0003 0000 -7775	# EV_ABS / ABS_X                -7775
E: 4.816107 0003 0001 -5119	# EV_ABS / ABS_Y                -5119
E: 4.816107 0000 0000 0000	# ------------ SYN_REPORT (0) ---------- +1084ms
E: 4.820052 0003 0000 -7771	# EV_ABS / ABS_X                -7771
E: 4.820052 0003 0001 -5121	# EV_ABS / ABS_Y                -5121
E: 4.820052 0000 0000 0000	# ------------ SYN_REPORT (0) ---------- +4ms
E: 4.822084 0003 0000 -7773	# EV_ABS / ABS_X                -7773
E: 4.822084 0003 0001 -5124	# EV_ABS / ABS_Y                -5124
E: 4.822084 0000 0000 0000	# ------------ SYN_REPORT (0) ---------- +2ms
E: 4.826058 0003 0000 -7774	# EV_ABS / ABS_X                -7774
E: 4.826058 0003 0001 -5126	# EV_ABS / ABS_Y                -5126
E: 4.826058 0000 0000 0000	# ------------ SYN_REPORT (0) ---------- +4ms
E: 4.828025 0003 0000 -7769	# EV_ABS / ABS_X                -7769
E: 4.828025 0003 0001 -5133	# EV_ABS / ABS_Y                -5133
E: 4.828025 0000 0000 0000	# ------------ SYN_REPORT (0) ---------- +2ms
E: 4.829981 0003 0000 -7771	# EV_ABS / ABS_X                -7771
E: 4.829981 0003 0001 -5140	# EV_ABS / ABS_Y                -5140
E: 4.829981 0000 0000 0000	# ------------ SYN_REPORT (0) ---------- +1ms
E: 4.833920 0003 0000 -7767	# EV_ABS / ABS_X                -7767
E: 4.833920 0003 0001 -5150	# EV_ABS / ABS_Y                -5150
E: 4.833920 0000 0000 0000	# ------------ SYN_REPORT (0) ---------- +4ms
E: 4.835838 0003 0000 -7757	# EV_ABS / ABS_X                -7757
E: 4.835838 0003 0001 -5162	# EV_ABS / ABS_Y                -5162
E: 4.835838 0000 0000 0000	# ------------ SYN_REPORT (0) ---------- +2ms
E: 4.837767 0003 0001 -5174	# EV_ABS / ABS_Y                -5174
E: 4.837767 0000 0000 0000	# ------------ SYN_REPORT (0) ---------- +2ms
E: 4.841725 0003 0000 -7766	# EV_ABS / ABS_X                -7766
E: 4.841725 0003 0001 -5189	# EV_ABS / ABS_Y                -5189
E: 4.841725 0000 0000 0000	# ------------ SYN_REPORT (0) ---------- +4ms
E: 4.843689 0003 0000 -7900	# EV_ABS / ABS_X                -7900
E: 4.843689 0003 0001 -5288	# EV_ABS / ABS_Y                -5288
E: 4.843689 0000 0000 0000	# ------------ SYN_REPORT (0) ---------- +2ms
E: 4.845636 0001 014a 0000	# EV_KEY / BTN_TOUCH            0
E: 4.845636 0000 0000 0000	# ------------ SYN_REPORT (0) ---------- +2ms
```
Maybe you can test the current state on a real device. But if you still can't tap and don't get BTN_TOUCH correctly, please re-open the issue!

thanks for your help
I did test on real device and BTN_TOUCH just got stuck with value 1. But maybe it was too early in the day when I was still sleeping. Will do later today more tests.
The problem I had is using 
`module variance delta=30`
from old config. With using this module BTN_TOUCH got stuck with value 1.

But without this module BTN_TOUCH is working fine.
Seems there was nothing wrong with ts_uinput at the end but problematic is variance module?

But Kodi is not happy yet:
```
16:00:13.102 T:3016482816   DEBUG: ProcessMouse: unknown mouse command 57605
16:00:13.102 T:3016482816   DEBUG: ProcessMouse: trying mouse action mousedrag
16:00:13.103 T:3016482816   DEBUG: ProcessMouse: unknown mouse command 57606
16:00:15.247 T:3016482816   DEBUG: ProcessMouse: unknown mouse command 57605
16:00:15.247 T:3016482816   DEBUG: ProcessMouse: trying mouse action mousedrag
16:00:15.248 T:3016482816   DEBUG: ProcessMouse: unknown mouse command 57606
16:00:15.383 T:3016482816   DEBUG: ProcessMouse: unknown mouse command 57605
16:00:15.383 T:3016482816   DEBUG: ProcessMouse: trying mouse action mousedrag
16:00:15.383 T:3016482816   DEBUG: ProcessMouse: unknown mouse command 57606
```
As indicated Kodi recognizes my touchscreen as ordinary mouse. Which even doesn't work :(
I will investigate more in next days and compare with my daemon where I had this working. I think I also have one smaller touchscreen with dual touch to test with.

But now I'm wondering with the state of touch support in Kodi. At least in v17. Maybe multitouch will not even work. Sadly I can't test with Kodi 18 because I don't have any regular touchscreen (hdmi + usb) to test it on x86 based system.
This should be verified to work with your provided evemu-recording. I currently don't have much time, but it should be done before the release:

* use only module_raw input
* evemu record ts_uinput against the evemu-sample
* compare in mtview or the like

[3M.3M.USB.Touchscreen.-.EX.II.evemu.record.txt](https://github.com/kergoth/tslib/files/1538762/3M.3M.USB.Touchscreen.-.EX.II.evemu.record.txt)

Maybe Kodi would not even work with my touchscreen but in this case I'm expecting from ts_uinput daemon to do whatever is necessary to emulate at least mouse for example. This is what my original daemon is capable and I'm expecting the same from this new daemon. If not then it is useless for my purpose without some extra patching.

There is also one extra feature I have in my daemon: showing cursor only when tapped on screen. When not tapped cursor is moved outside of visible area: https://github.com/vpeter4/tslib/blob/a5f00518cfe38002c47895424eda26746711a0da/tests/ts_uinput_touch.c#L617:L619 But this is a feature after everything else will work without a hitch ;)
I did look into why ts_uinput doesn't like to work with kodi. With this changes https://pastebin.com/H9fk6GkL it does. It adds ABS_PRESSURE event and send BTN_TOUCH event after pressure. I'm using only one finger touch. I'm not sure if kodi even supports multi touch events.
Thanks for helping! I still think that adding pressure to the input device is not correct here. The original device doesn't need it and so don't we. input-raw creates pressure for internal use, but it's output should be usable with the same properties as the original device.

But does your fix really need the following hunk?

```
@@ -419,6 +427,7 @@ static int setup_uinput(struct data_t *d
        if (ioctl(data->fd_uinput, UI_SET_EVBIT, EV_KEY) < 0 ||
            ioctl(data->fd_uinput, UI_SET_EVBIT, EV_SYN) < 0 ||
            ioctl(data->fd_uinput, UI_SET_KEYBIT, BTN_TOUCH) < 0 ||
+           ioctl(data->fd_uinput, UI_SET_ABSBIT, ABS_PRESSURE) < 0 ||
            ioctl(data->fd_uinput, UI_SET_EVBIT, EV_ABS) < 0) {
                perror("ioctl");
                goto err;
@@ -428,6 +437,9 @@ static int setup_uinput(struct data_t *d
        snprintf(uidev.name, UINPUT_MAX_NAME_SIZE, "%s", data->uinput_name);
        uidev.id.bustype = BUS_VIRTUAL;

+  uidev.absmin[ABS_PRESSURE] = 0;
+  uidev.absmax[ABS_PRESSURE] = 255;
+
        memset(bit, 0, sizeof(bit));

        /* get info on input device and copy setting over to uinput device */

```

thanks
Seems with yesterday's tests I missed one combination of two patches because now it works just with moving BTN_TOUCH. So the ABS_PRESSURE is not needed after all as you suspect :)

But would be nice to have feedback from others. Not just me :)
I'd like some feedback too, hence -rc3 now. I'll test for regressions next week and if ok, do the release. Thanks!
I do have another system with LVDS touchscreen but seems it is broken somehow :(
You seem to have a problem with tslib, or your hardware?

evemu tests look ok. I think I'll get other feedback too, and do regression tests myself. Please test if you can, but no stress; we'll cover testing this change and do a release early next year if ok.


Am 28. Dezember 2017 18:58:52 MEZ schrieb "Peter V." <notifications@github.com>:
>I do have another system with LVDS touchscreen but seems it is broken
>somehow :(

-- 
Martin Kepplinger
http://martinkepplinger.com
sent from mobile

No, no, tslib is ok - hardware is faulty (it doesn't boot) :)
My Qt5 app didn't receive any touch event after using this ts_uinput tool.
My configure is in the following.
TSLIB_TSDEVICE=/dev/input/event4 -->this is my touchscreen node.(ts_calibrate work fine.)
QT_QPA_GENERIC_PLUGINS=evdevtouch:/dev/input/event5-->this is virtual node generated by ts_uinput.(When I change this node to /dev/input/event4, It work fine too,But received point was not calibrated.)
 Output:
evtest /dev/input/event5
evtest /dev/input/event4
[event4.txt](https://github.com/kergoth/tslib/files/1608535/event4.txt)
[event5.txt](https://github.com/kergoth/tslib/files/1608536/event5.txt)
[uinput.txt](https://github.com/kergoth/tslib/files/1608537/uinput.txt)

I finally got my other display with dual touch up and running. It is https://shop.udoo.org/eu/catalog/product/view/id/23/s/video-kit-7-touch-for-quaddual/category/3/
It uses st1232 kernel module and doesn't need calibration. Kodi doesn't like it (no reaction on presses).
Probably because it doesn't support BTN_TOUCH as we already figure out it is needed.

evemu: https://pastebin.com/q9P3M8SG
```
# EVEMU 1.3
# Kernel: 3.14.79
# Input device name: "st1232-touchscreen"
# Input device ID: bus 0x18 vendor 0000 product 0000 version 0000
# Supported events:
#   Event type 0 (EV_SYN)
#     Event code 0 (SYN_REPORT)
#     Event code 1 (SYN_CONFIG)
#     Event code 2 (SYN_MT_REPORT)
#     Event code 3 (SYN_DROPPED)
#     Event code 4 ((null))
#     Event code 5 ((null))
#     Event code 6 ((null))
#     Event code 7 ((null))
#     Event code 8 ((null))
#     Event code 9 ((null))
#     Event code 10 ((null))
#     Event code 11 ((null))
#     Event code 12 ((null))
#     Event code 13 ((null))
#     Event code 14 ((null))
#     Event code 15 (SYN_MAX)
#   Event type 1 (EV_KEY)
#   Event type 3 (EV_ABS)
#     Event code 48 (ABS_MT_TOUCH_MAJOR)
#       Value        0
#       Min          0
#       Max        255
#       Fuzz         0
#       Flat         0
#       Resolution   0
#     Event code 53 (ABS_MT_POSITION_X)
#       Value        0
#       Min          0
#       Max        799
#       Fuzz         0
#       Flat         0
#       Resolution   0
#     Event code 54 (ABS_MT_POSITION_Y)
#       Value        0
#       Min          0
#       Max        479
#       Fuzz         0
#       Flat         0
#       Resolution   0
# Properties:
N: st1232-touchscreen
I: 0018 0000 0000 0000
P: 00 00 00 00 00 00 00 00
B: 00 0b 00 00 00 00 00 00 00
B: 01 00 00 00 00 00 00 00 00
B: 01 00 00 00 00 00 00 00 00
B: 01 00 00 00 00 00 00 00 00
B: 01 00 00 00 00 00 00 00 00
B: 01 00 00 00 00 00 00 00 00
B: 01 00 00 00 00 00 00 00 00
B: 01 00 00 00 00 00 00 00 00
B: 01 00 00 00 00 00 00 00 00
B: 01 00 00 00 00 00 00 00 00
B: 01 00 00 00 00 00 00 00 00
B: 01 00 00 00 00 00 00 00 00
B: 01 00 00 00 00 00 00 00 00
B: 02 00 00 00 00 00 00 00 00
B: 03 00 00 00 00 00 00 61 00
B: 04 00 00 00 00 00 00 00 00
B: 05 00 00 00 00 00 00 00 00
B: 11 00 00 00 00 00 00 00 00
B: 12 00 00 00 00 00 00 00 00
B: 14 00 00 00 00 00 00 00 00
B: 15 00 00 00 00 00 00 00 00
B: 15 00 00 00 00 00 00 00 00
A: 30 0 255 0 0 0
A: 35 0 799 0 0 0
A: 36 0 479 0 0 0
################################
#      Waiting for events      #
################################
E: 0.000001 0003 0030 0078	# EV_ABS / ABS_MT_TOUCH_MAJOR   78
E: 0.000001 0003 0035 0069	# EV_ABS / ABS_MT_POSITION_X    69
E: 0.000001 0003 0036 0423	# EV_ABS / ABS_MT_POSITION_Y    423
E: 0.000001 0000 0002 0000	# ++++++++++++ SYN_MT_REPORT (0) ++++++++++
E: 0.000001 0000 0000 0000	# ------------ SYN_REPORT (0) ---------- +0ms
E: 0.009515 0003 0030 0078	# EV_ABS / ABS_MT_TOUCH_MAJOR   78
E: 0.009515 0003 0035 0069	# EV_ABS / ABS_MT_POSITION_X    69
E: 0.009515 0003 0036 0423	# EV_ABS / ABS_MT_POSITION_Y    423
E: 0.009515 0000 0002 0000	# ++++++++++++ SYN_MT_REPORT (0) ++++++++++
E: 0.009515 0000 0000 0000	# ------------ SYN_REPORT (0) ---------- +9ms
E: 0.041196 0003 0030 0078	# EV_ABS / ABS_MT_TOUCH_MAJOR   78
E: 0.041196 0003 0035 0069	# EV_ABS / ABS_MT_POSITION_X    69
E: 0.041196 0003 0036 0423	# EV_ABS / ABS_MT_POSITION_Y    423
E: 0.041196 0000 0002 0000	# ++++++++++++ SYN_MT_REPORT (0) ++++++++++
E: 0.041196 0000 0000 0000	# ------------ SYN_REPORT (0) ---------- +32ms
E: 0.049278 0003 0030 0078	# EV_ABS / ABS_MT_TOUCH_MAJOR   78
E: 0.049278 0003 0035 0069	# EV_ABS / ABS_MT_POSITION_X    69
E: 0.049278 0003 0036 0423	# EV_ABS / ABS_MT_POSITION_Y    423
E: 0.049278 0000 0002 0000	# ++++++++++++ SYN_MT_REPORT (0) ++++++++++
E: 0.049278 0000 0000 0000	# ------------ SYN_REPORT (0) ---------- +8ms
E: 0.057394 0003 0030 0078	# EV_ABS / ABS_MT_TOUCH_MAJOR   78
E: 0.057394 0003 0035 0069	# EV_ABS / ABS_MT_POSITION_X    69
E: 0.057394 0003 0036 0423	# EV_ABS / ABS_MT_POSITION_Y    423
E: 0.057394 0000 0002 0000	# ++++++++++++ SYN_MT_REPORT (0) ++++++++++
E: 0.057394 0000 0000 0000	# ------------ SYN_REPORT (0) ---------- +8ms
E: 0.073234 0003 0030 0078	# EV_ABS / ABS_MT_TOUCH_MAJOR   78
E: 0.073234 0003 0035 0069	# EV_ABS / ABS_MT_POSITION_X    69
E: 0.073234 0003 0036 0423	# EV_ABS / ABS_MT_POSITION_Y    423
E: 0.073234 0000 0002 0000	# ++++++++++++ SYN_MT_REPORT (0) ++++++++++
E: 0.073234 0000 0000 0000	# ------------ SYN_REPORT (0) ---------- +16ms
E: 0.089217 0003 0030 0078	# EV_ABS / ABS_MT_TOUCH_MAJOR   78
E: 0.089217 0003 0035 0069	# EV_ABS / ABS_MT_POSITION_X    69
E: 0.089217 0003 0036 0423	# EV_ABS / ABS_MT_POSITION_Y    423
E: 0.089217 0000 0002 0000	# ++++++++++++ SYN_MT_REPORT (0) ++++++++++
E: 0.089217 0000 0000 0000	# ------------ SYN_REPORT (0) ---------- +16ms
E: 0.096849 0000 0002 0000	# ++++++++++++ SYN_MT_REPORT (0) ++++++++++
E: 0.096849 0000 0000 0000	# ------------ SYN_REPORT (0) ---------- +7ms
E: 3.844383 0003 0030 0053	# EV_ABS / ABS_MT_TOUCH_MAJOR   53
E: 3.844383 0003 0035 0058	# EV_ABS / ABS_MT_POSITION_X    58
E: 3.844383 0003 0036 0419	# EV_ABS / ABS_MT_POSITION_Y    419
E: 3.844383 0000 0002 0000	# ++++++++++++ SYN_MT_REPORT (0) ++++++++++
E: 3.844383 0000 0000 0000	# ------------ SYN_REPORT (0) ---------- +3748ms
E: 3.852155 0003 0030 0064	# EV_ABS / ABS_MT_TOUCH_MAJOR   64
E: 3.852155 0003 0035 0059	# EV_ABS / ABS_MT_POSITION_X    59
E: 3.852155 0003 0036 0420	# EV_ABS / ABS_MT_POSITION_Y    420
E: 3.852155 0000 0002 0000	# ++++++++++++ SYN_MT_REPORT (0) ++++++++++
E: 3.852155 0000 0000 0000	# ------------ SYN_REPORT (0) ---------- +8ms
E: 3.859883 0000 0002 0000	# ++++++++++++ SYN_MT_REPORT (0) ++++++++++
E: 3.859883 0000 0000 0000	# ------------ SYN_REPORT (0) ---------- +7ms
E: 4.901881 0003 0030 0065	# EV_ABS / ABS_MT_TOUCH_MAJOR   65
E: 4.901881 0003 0035 0070	# EV_ABS / ABS_MT_POSITION_X    70
E: 4.901881 0003 0036 0408	# EV_ABS / ABS_MT_POSITION_Y    408
E: 4.901881 0000 0002 0000	# ++++++++++++ SYN_MT_REPORT (0) ++++++++++
E: 4.901881 0000 0000 0000	# ------------ SYN_REPORT (0) ---------- +1042ms
E: 4.911468 0003 0030 0065	# EV_ABS / ABS_MT_TOUCH_MAJOR   65
E: 4.911468 0003 0035 0070	# EV_ABS / ABS_MT_POSITION_X    70
E: 4.911468 0003 0036 0408	# EV_ABS / ABS_MT_POSITION_Y    408
E: 4.911468 0000 0002 0000	# ++++++++++++ SYN_MT_REPORT (0) ++++++++++
E: 4.911468 0000 0000 0000	# ------------ SYN_REPORT (0) ---------- +10ms
E: 4.921044 0003 0030 0065	# EV_ABS / ABS_MT_TOUCH_MAJOR   65
E: 4.921044 0003 0035 0070	# EV_ABS / ABS_MT_POSITION_X    70
E: 4.921044 0003 0036 0408	# EV_ABS / ABS_MT_POSITION_Y    408
E: 4.921044 0000 0002 0000	# ++++++++++++ SYN_MT_REPORT (0) ++++++++++
E: 4.921044 0000 0000 0000	# ------------ SYN_REPORT (0) ---------- +10ms
E: 4.930664 0003 0030 0065	# EV_ABS / ABS_MT_TOUCH_MAJOR   65
E: 4.930664 0003 0035 0070	# EV_ABS / ABS_MT_POSITION_X    70
E: 4.930664 0003 0036 0408	# EV_ABS / ABS_MT_POSITION_Y    408
E: 4.930664 0000 0002 0000	# ++++++++++++ SYN_MT_REPORT (0) ++++++++++
E: 4.930664 0000 0000 0000	# ------------ SYN_REPORT (0) ---------- +9ms
E: 4.940227 0003 0030 0065	# EV_ABS / ABS_MT_TOUCH_MAJOR   65
E: 4.940227 0003 0035 0070	# EV_ABS / ABS_MT_POSITION_X    70
E: 4.940227 0003 0036 0408	# EV_ABS / ABS_MT_POSITION_Y    408
E: 4.940227 0000 0002 0000	# ++++++++++++ SYN_MT_REPORT (0) ++++++++++
E: 4.940227 0000 0000 0000	# ------------ SYN_REPORT (0) ---------- +10ms
E: 4.949812 0003 0030 0065	# EV_ABS / ABS_MT_TOUCH_MAJOR   65
E: 4.949812 0003 0035 0070	# EV_ABS / ABS_MT_POSITION_X    70
E: 4.949812 0003 0036 0408	# EV_ABS / ABS_MT_POSITION_Y    408
E: 4.949812 0000 0002 0000	# ++++++++++++ SYN_MT_REPORT (0) ++++++++++
E: 4.949812 0000 0000 0000	# ------------ SYN_REPORT (0) ---------- +9ms
E: 4.959367 0003 0030 0065	# EV_ABS / ABS_MT_TOUCH_MAJOR   65
E: 4.959367 0003 0035 0070	# EV_ABS / ABS_MT_POSITION_X    70
E: 4.959367 0003 0036 0408	# EV_ABS / ABS_MT_POSITION_Y    408
E: 4.959367 0000 0002 0000	# ++++++++++++ SYN_MT_REPORT (0) ++++++++++
E: 4.959367 0000 0000 0000	# ------------ SYN_REPORT (0) ---------- +10ms
E: 4.968952 0003 0030 0065	# EV_ABS / ABS_MT_TOUCH_MAJOR   65
E: 4.968952 0003 0035 0070	# EV_ABS / ABS_MT_POSITION_X    70
E: 4.968952 0003 0036 0408	# EV_ABS / ABS_MT_POSITION_Y    408
E: 4.968952 0000 0002 0000	# ++++++++++++ SYN_MT_REPORT (0) ++++++++++
E: 4.968952 0000 0000 0000	# ------------ SYN_REPORT (0) ---------- +9ms
E: 4.978550 0003 0030 0065	# EV_ABS / ABS_MT_TOUCH_MAJOR   65
E: 4.978550 0003 0035 0070	# EV_ABS / ABS_MT_POSITION_X    70
E: 4.978550 0003 0036 0408	# EV_ABS / ABS_MT_POSITION_Y    408
E: 4.978550 0000 0002 0000	# ++++++++++++ SYN_MT_REPORT (0) ++++++++++
E: 4.978550 0000 0000 0000	# ------------ SYN_REPORT (0) ---------- +10ms
E: 4.988139 0003 0030 0065	# EV_ABS / ABS_MT_TOUCH_MAJOR   65
E: 4.988139 0003 0035 0070	# EV_ABS / ABS_MT_POSITION_X    70
E: 4.988139 0003 0036 0408	# EV_ABS / ABS_MT_POSITION_Y    408
E: 4.988139 0000 0002 0000	# ++++++++++++ SYN_MT_REPORT (0) ++++++++++
E: 4.988139 0000 0000 0000	# ------------ SYN_REPORT (0) ---------- +10ms
E: 4.997761 0003 0030 0065	# EV_ABS / ABS_MT_TOUCH_MAJOR   65
E: 4.997761 0003 0035 0070	# EV_ABS / ABS_MT_POSITION_X    70
E: 4.997761 0003 0036 0408	# EV_ABS / ABS_MT_POSITION_Y    408
E: 4.997761 0000 0002 0000	# ++++++++++++ SYN_MT_REPORT (0) ++++++++++
E: 4.997761 0000 0000 0000	# ------------ SYN_REPORT (0) ---------- +9ms
E: 5.009023 0003 0030 0065	# EV_ABS / ABS_MT_TOUCH_MAJOR   65
E: 5.009023 0003 0035 0070	# EV_ABS / ABS_MT_POSITION_X    70
E: 5.009023 0003 0036 0408	# EV_ABS / ABS_MT_POSITION_Y    408
E: 5.009023 0000 0002 0000	# ++++++++++++ SYN_MT_REPORT (0) ++++++++++
E: 5.009023 0000 0000 0000	# ------------ SYN_REPORT (0) ---------- +12ms
E: 5.020451 0003 0030 0065	# EV_ABS / ABS_MT_TOUCH_MAJOR   65
E: 5.020451 0003 0035 0070	# EV_ABS / ABS_MT_POSITION_X    70
E: 5.020451 0003 0036 0408	# EV_ABS / ABS_MT_POSITION_Y    408
E: 5.020451 0000 0002 0000	# ++++++++++++ SYN_MT_REPORT (0) ++++++++++
E: 5.020451 0000 0000 0000	# ------------ SYN_REPORT (0) ---------- +11ms
E: 5.031841 0003 0030 0065	# EV_ABS / ABS_MT_TOUCH_MAJOR   65
E: 5.031841 0003 0035 0070	# EV_ABS / ABS_MT_POSITION_X    70
E: 5.031841 0003 0036 0408	# EV_ABS / ABS_MT_POSITION_Y    408
E: 5.031841 0000 0002 0000	# ++++++++++++ SYN_MT_REPORT (0) ++++++++++
E: 5.031841 0000 0000 0000	# ------------ SYN_REPORT (0) ---------- +11ms
E: 5.056798 0003 0030 0065	# EV_ABS / ABS_MT_TOUCH_MAJOR   65
E: 5.056798 0003 0035 0070	# EV_ABS / ABS_MT_POSITION_X    70
E: 5.056798 0003 0036 0408	# EV_ABS / ABS_MT_POSITION_Y    408
E: 5.056798 0000 0002 0000	# ++++++++++++ SYN_MT_REPORT (0) ++++++++++
E: 5.056798 0000 0000 0000	# ------------ SYN_REPORT (0) ---------- +25ms
E: 5.064904 0003 0030 0065	# EV_ABS / ABS_MT_TOUCH_MAJOR   65
E: 5.064904 0003 0035 0070	# EV_ABS / ABS_MT_POSITION_X    70
E: 5.064904 0003 0036 0408	# EV_ABS / ABS_MT_POSITION_Y    408
E: 5.064904 0000 0002 0000	# ++++++++++++ SYN_MT_REPORT (0) ++++++++++
E: 5.064904 0000 0000 0000	# ------------ SYN_REPORT (0) ---------- +8ms
E: 5.072979 0003 0030 0065	# EV_ABS / ABS_MT_TOUCH_MAJOR   65
E: 5.072979 0003 0035 0070	# EV_ABS / ABS_MT_POSITION_X    70
E: 5.072979 0003 0036 0408	# EV_ABS / ABS_MT_POSITION_Y    408
E: 5.072979 0000 0002 0000	# ++++++++++++ SYN_MT_REPORT (0) ++++++++++
E: 5.072979 0000 0000 0000	# ------------ SYN_REPORT (0) ---------- +8ms
E: 5.088328 0003 0030 0065	# EV_ABS / ABS_MT_TOUCH_MAJOR   65
E: 5.088328 0003 0035 0070	# EV_ABS / ABS_MT_POSITION_X    70
E: 5.088328 0003 0036 0408	# EV_ABS / ABS_MT_POSITION_Y    408
E: 5.088328 0000 0002 0000	# ++++++++++++ SYN_MT_REPORT (0) ++++++++++
E: 5.088328 0000 0000 0000	# ------------ SYN_REPORT (0) ---------- +16ms
E: 5.103788 0003 0030 0065	# EV_ABS / ABS_MT_TOUCH_MAJOR   65
E: 5.103788 0003 0035 0070	# EV_ABS / ABS_MT_POSITION_X    70
E: 5.103788 0003 0036 0408	# EV_ABS / ABS_MT_POSITION_Y    408
E: 5.103788 0000 0002 0000	# ++++++++++++ SYN_MT_REPORT (0) ++++++++++
E: 5.103788 0000 0000 0000	# ------------ SYN_REPORT (0) ---------- +15ms
E: 5.111397 0000 0002 0000	# ++++++++++++ SYN_MT_REPORT (0) ++++++++++
E: 5.111397 0000 0000 0000	# ------------ SYN_REPORT (0) ---------- +8ms
```

I was testing with tslib 1.15-rc3 (and also without commit https://github.com/kergoth/tslib/commit/5ff07756cabb6c02bdc0fe5995bed79c2f403fa2).
Sadly Kodi didn't like it with ts_uinput either. BTN_TOUCH is supported but not send from it.

evemu: https://pastebin.com/77duSB9A
```
# EVEMU 1.3
# Kernel: 3.14.79
# Input device name: "ts_uinput"
# Input device ID: bus 0x06 vendor 0000 product 0000 version 0000
# Supported events:
#   Event type 0 (EV_SYN)
#     Event code 0 (SYN_REPORT)
#     Event code 1 (SYN_CONFIG)
#     Event code 2 (SYN_MT_REPORT)
#     Event code 3 (SYN_DROPPED)
#     Event code 4 ((null))
#     Event code 5 ((null))
#     Event code 6 ((null))
#     Event code 7 ((null))
#     Event code 8 ((null))
#     Event code 9 ((null))
#     Event code 10 ((null))
#     Event code 11 ((null))
#     Event code 12 ((null))
#     Event code 13 ((null))
#     Event code 14 ((null))
#     Event code 15 (SYN_MAX)
#   Event type 1 (EV_KEY)
#     Event code 330 (BTN_TOUCH)
#   Event type 3 (EV_ABS)
#     Event code 48 (ABS_MT_TOUCH_MAJOR)
#       Value        0
#       Min          0
#       Max        255
#       Fuzz         0
#       Flat         0
#       Resolution   0
#     Event code 53 (ABS_MT_POSITION_X)
#       Value        0
#       Min          0
#       Max        799
#       Fuzz         0
#       Flat         0
#       Resolution   0
#     Event code 54 (ABS_MT_POSITION_Y)
#       Value        0
#       Min          0
#       Max        479
#       Fuzz         0
#       Flat         0
#       Resolution   0
# Properties:
N: ts_uinput
I: 0006 0000 0000 0000
P: 00 00 00 00 00 00 00 00
B: 00 0b 00 00 00 00 00 00 00
B: 01 00 00 00 00 00 00 00 00
B: 01 00 00 00 00 00 00 00 00
B: 01 00 00 00 00 00 00 00 00
B: 01 00 00 00 00 00 00 00 00
B: 01 00 00 00 00 00 00 00 00
B: 01 00 04 00 00 00 00 00 00
B: 01 00 00 00 00 00 00 00 00
B: 01 00 00 00 00 00 00 00 00
B: 01 00 00 00 00 00 00 00 00
B: 01 00 00 00 00 00 00 00 00
B: 01 00 00 00 00 00 00 00 00
B: 01 00 00 00 00 00 00 00 00
B: 02 00 00 00 00 00 00 00 00
B: 03 00 00 00 00 00 00 61 00
B: 04 00 00 00 00 00 00 00 00
B: 05 00 00 00 00 00 00 00 00
B: 11 00 00 00 00 00 00 00 00
B: 12 00 00 00 00 00 00 00 00
B: 14 00 00 00 00 00 00 00 00
B: 15 00 00 00 00 00 00 00 00
B: 15 00 00 00 00 00 00 00 00
A: 30 0 255 0 0 0
A: 35 0 799 0 0 0
A: 36 0 479 0 0 0
################################
#      Waiting for events      #
################################
E: 0.000001 0003 0035 0054	# EV_ABS / ABS_MT_POSITION_X    54
E: 0.000001 0003 0036 0425	# EV_ABS / ABS_MT_POSITION_Y    425
E: 0.000001 0003 0030 0044	# EV_ABS / ABS_MT_TOUCH_MAJOR   44
E: 0.000001 0000 0000 0000	# ------------ SYN_REPORT (0) ---------- +0ms
E: 0.008047 0003 0035 0054	# EV_ABS / ABS_MT_POSITION_X    54
E: 0.008047 0003 0036 0425	# EV_ABS / ABS_MT_POSITION_Y    425
E: 0.008047 0003 0030 0041	# EV_ABS / ABS_MT_TOUCH_MAJOR   41
E: 0.008047 0000 0000 0000	# ------------ SYN_REPORT (0) ---------- +8ms
E: 0.016133 0003 0035 0054	# EV_ABS / ABS_MT_POSITION_X    54
E: 0.016133 0003 0036 0425	# EV_ABS / ABS_MT_POSITION_Y    425
E: 0.016133 0003 0030 0039	# EV_ABS / ABS_MT_TOUCH_MAJOR   39
E: 0.016133 0000 0000 0000	# ------------ SYN_REPORT (0) ---------- +8ms
E: 0.031832 0003 0035 0054	# EV_ABS / ABS_MT_POSITION_X    54
E: 0.031832 0003 0036 0425	# EV_ABS / ABS_MT_POSITION_Y    425
E: 0.031832 0003 0030 0037	# EV_ABS / ABS_MT_TOUCH_MAJOR   37
E: 0.031832 0000 0000 0000	# ------------ SYN_REPORT (0) ---------- +15ms
E: 0.047621 0003 0035 0060	# EV_ABS / ABS_MT_POSITION_X    60
E: 0.047621 0003 0036 0421	# EV_ABS / ABS_MT_POSITION_Y    421
E: 0.047621 0003 0030 0026	# EV_ABS / ABS_MT_TOUCH_MAJOR   26
E: 0.047621 0000 0000 0000	# ------------ SYN_REPORT (0) ---------- +16ms
E: 2.092098 0003 0035 0070	# EV_ABS / ABS_MT_POSITION_X    70
E: 2.092098 0003 0036 0404	# EV_ABS / ABS_MT_POSITION_Y    404
E: 2.092098 0003 0030 0059	# EV_ABS / ABS_MT_TOUCH_MAJOR   59
E: 2.092098 0000 0000 0000	# ------------ SYN_REPORT (0) ---------- +2045ms
E: 2.101715 0003 0035 0070	# EV_ABS / ABS_MT_POSITION_X    70
E: 2.101715 0003 0036 0404	# EV_ABS / ABS_MT_POSITION_Y    404
E: 2.101715 0003 0030 0059	# EV_ABS / ABS_MT_TOUCH_MAJOR   59
E: 2.101715 0000 0000 0000	# ------------ SYN_REPORT (0) ---------- +9ms
E: 2.111237 0003 0035 0070	# EV_ABS / ABS_MT_POSITION_X    70
E: 2.111237 0003 0036 0404	# EV_ABS / ABS_MT_POSITION_Y    404
E: 2.111237 0003 0030 0059	# EV_ABS / ABS_MT_TOUCH_MAJOR   59
E: 2.111237 0000 0000 0000	# ------------ SYN_REPORT (0) ---------- +10ms
E: 2.120822 0003 0035 0070	# EV_ABS / ABS_MT_POSITION_X    70
E: 2.120822 0003 0036 0404	# EV_ABS / ABS_MT_POSITION_Y    404
E: 2.120822 0003 0030 0059	# EV_ABS / ABS_MT_TOUCH_MAJOR   59
E: 2.120822 0000 0000 0000	# ------------ SYN_REPORT (0) ---------- +9ms
E: 2.130381 0003 0035 0070	# EV_ABS / ABS_MT_POSITION_X    70
E: 2.130381 0003 0036 0404	# EV_ABS / ABS_MT_POSITION_Y    404
E: 2.130381 0003 0030 0059	# EV_ABS / ABS_MT_TOUCH_MAJOR   59
E: 2.130381 0000 0000 0000	# ------------ SYN_REPORT (0) ---------- +10ms
E: 2.139951 0003 0035 0070	# EV_ABS / ABS_MT_POSITION_X    70
E: 2.139951 0003 0036 0404	# EV_ABS / ABS_MT_POSITION_Y    404
E: 2.139951 0003 0030 0059	# EV_ABS / ABS_MT_TOUCH_MAJOR   59
E: 2.139951 0000 0000 0000	# ------------ SYN_REPORT (0) ---------- +9ms
E: 2.149522 0003 0035 0070	# EV_ABS / ABS_MT_POSITION_X    70
E: 2.149522 0003 0036 0404	# EV_ABS / ABS_MT_POSITION_Y    404
E: 2.149522 0003 0030 0059	# EV_ABS / ABS_MT_TOUCH_MAJOR   59
E: 2.149522 0000 0000 0000	# ------------ SYN_REPORT (0) ---------- +10ms
E: 2.159129 0003 0035 0070	# EV_ABS / ABS_MT_POSITION_X    70
E: 2.159129 0003 0036 0404	# EV_ABS / ABS_MT_POSITION_Y    404
E: 2.159129 0003 0030 0059	# EV_ABS / ABS_MT_TOUCH_MAJOR   59
E: 2.159129 0000 0000 0000	# ------------ SYN_REPORT (0) ---------- +10ms
E: 2.168674 0003 0035 0070	# EV_ABS / ABS_MT_POSITION_X    70
E: 2.168674 0003 0036 0404	# EV_ABS / ABS_MT_POSITION_Y    404
E: 2.168674 0003 0030 0059	# EV_ABS / ABS_MT_TOUCH_MAJOR   59
E: 2.168674 0000 0000 0000	# ------------ SYN_REPORT (0) ---------- +9ms
E: 2.178263 0003 0035 0070	# EV_ABS / ABS_MT_POSITION_X    70
E: 2.178263 0003 0036 0404	# EV_ABS / ABS_MT_POSITION_Y    404
E: 2.178263 0003 0030 0059	# EV_ABS / ABS_MT_TOUCH_MAJOR   59
E: 2.178263 0000 0000 0000	# ------------ SYN_REPORT (0) ---------- +10ms
E: 2.202521 0003 0035 0070	# EV_ABS / ABS_MT_POSITION_X    70
E: 2.202521 0003 0036 0404	# EV_ABS / ABS_MT_POSITION_Y    404
E: 2.202521 0003 0030 0059	# EV_ABS / ABS_MT_TOUCH_MAJOR   59
E: 2.202521 0000 0000 0000	# ------------ SYN_REPORT (0) ---------- +24ms
E: 2.210585 0003 0035 0070	# EV_ABS / ABS_MT_POSITION_X    70
E: 2.210585 0003 0036 0404	# EV_ABS / ABS_MT_POSITION_Y    404
E: 2.210585 0003 0030 0059	# EV_ABS / ABS_MT_TOUCH_MAJOR   59
E: 2.210585 0000 0000 0000	# ------------ SYN_REPORT (0) ---------- +8ms
E: 2.218701 0003 0035 0070	# EV_ABS / ABS_MT_POSITION_X    70
E: 2.218701 0003 0036 0404	# EV_ABS / ABS_MT_POSITION_Y    404
E: 2.218701 0003 0030 0059	# EV_ABS / ABS_MT_TOUCH_MAJOR   59
E: 2.218701 0000 0000 0000	# ------------ SYN_REPORT (0) ---------- +8ms
E: 2.234541 0003 0035 0070	# EV_ABS / ABS_MT_POSITION_X    70
E: 2.234541 0003 0036 0404	# EV_ABS / ABS_MT_POSITION_Y    404
E: 2.234541 0003 0030 0059	# EV_ABS / ABS_MT_TOUCH_MAJOR   59
E: 2.234541 0000 0000 0000	# ------------ SYN_REPORT (0) ---------- +16ms
E: 2.250523 0003 0035 0070	# EV_ABS / ABS_MT_POSITION_X    70
E: 2.250523 0003 0036 0404	# EV_ABS / ABS_MT_POSITION_Y    404
E: 2.250523 0003 0030 0059	# EV_ABS / ABS_MT_TOUCH_MAJOR   59
E: 2.250523 0000 0000 0000	# ------------ SYN_REPORT (0) ---------- +16ms
E: 4.161155 0003 0035 0075	# EV_ABS / ABS_MT_POSITION_X    75
E: 4.161155 0003 0036 0421	# EV_ABS / ABS_MT_POSITION_Y    421
E: 4.161155 0003 0030 0044	# EV_ABS / ABS_MT_TOUCH_MAJOR   44
E: 4.161155 0000 0000 0000	# ------------ SYN_REPORT (0) ---------- +1911ms
E: 4.169227 0003 0035 0075	# EV_ABS / ABS_MT_POSITION_X    75
E: 4.169227 0003 0036 0421	# EV_ABS / ABS_MT_POSITION_Y    421
E: 4.169227 0003 0030 0042	# EV_ABS / ABS_MT_TOUCH_MAJOR   42
E: 4.169227 0000 0000 0000	# ------------ SYN_REPORT (0) ---------- +8ms
E: 4.184769 0003 0035 0075	# EV_ABS / ABS_MT_POSITION_X    75
E: 4.184769 0003 0036 0421	# EV_ABS / ABS_MT_POSITION_Y    421
E: 4.184769 0003 0030 0040	# EV_ABS / ABS_MT_TOUCH_MAJOR   40
E: 4.184769 0000 0000 0000	# ------------ SYN_REPORT (0) ---------- +15ms
E: 4.200337 0003 0035 0076	# EV_ABS / ABS_MT_POSITION_X    76
E: 4.200337 0003 0036 0415	# EV_ABS / ABS_MT_POSITION_Y    415
E: 4.200337 0003 0030 0032	# EV_ABS / ABS_MT_TOUCH_MAJOR   32
E: 4.200337 0000 0000 0000	# ------------ SYN_REPORT (0) ---------- +16ms
```

My view on ts_uinput daemon is that it should support such cases just like my original daemon does.
If this is not possible by default then it should be configured with some arguments.

I think I wrote st1232-raw plugin to handle this. But obviously only for one finger.
Doing some more tests and I think this daemon needs some work to handle multi touch. I think it doesn't even send correctly SYN_MT_REPORT and SYN_REPORT.

https://pastebin.com/iPHr1w3K
this is a type A multitouch device and we indeed handle this in a wrong way. I haven't tested it myself until now. Thanks for your sample. We should keep that sample and fix it.
Ok. ts_uinput definitely cannot handle multitouch type A devices (with SYN_MT_REPORT). That would be a seperate issue.

For all other devices, please test the current master state if you can.
Sadly Kodi doesn't like tslib https://github.com/kergoth/tslib/commit/fbeabc67146095c5da787c5d849b9f14bbe0d6a4 with my single touch screen (3M 3M USB Touchscreen - EX II). I can select some item on main menu but when I tap on it it doesn't select it. I assume because BTN_TOUCH event is first and then X/Y coordinates. When first is X/Y coordinate and then BTN_TOUCH it works beautifully. No idea which fault is this (maybe Kodi's?).
  
At least that ordering is something that should be easily done ts_uinput, just pushed to master.
I think I'm not the right person to report such bugs because I'm testing only with Kodi. And after looking used code in Kodi 17.6 https://github.com/xbmc/xbmc/blob/Krypton/xbmc/input/linux/LinuxInputDevices.cpp 
(and kodi master is very similar but I can't test that https://github.com/xbmc/xbmc/blob/master/xbmc/platform/linux/input/LinuxInputDevices.cpp) it needs coordinates first and then BTN_TOUCH event which eventually fires left click at X/Y coordinate (because it simulates mouse). If BTN_TOUCH event is send before X/Y then it fires click at coordinate 0,0. And this doesn't work obviously :)

I will just patch my own build with this change - it will be easier.