{
    "commits": [
        {
            "associated_pull_request": [],
            "date": "2019-06-05 16:32:50+00:00",
            "diff": "varnishcache_varnish-cache/issue_3019/commit_78498c7b0e4b5c015a121f516805a621e78fd7db.diff",
            "diff_additions": 19,
            "diff_deletions": 10,
            "diff_file_size": 77485,
            "diff_url": "https://github.com/varnishcache/varnish-cache/commit/78498c7b0e4b5c015a121f516805a621e78fd7db.diff",
            "exists": true,
            "files": [
                {
                    "file_additions": 1,
                    "file_deletions": 0,
                    "file_exists": true,
                    "file_name": "bin/varnishd/cache/cache_panic.c",
                    "file_size": 22691
                },
                {
                    "file_additions": 5,
                    "file_deletions": 1,
                    "file_exists": true,
                    "file_name": "bin/varnishd/cache/cache_req.c",
                    "file_size": 8150
                },
                {
                    "file_additions": 1,
                    "file_deletions": 0,
                    "file_exists": true,
                    "file_name": "bin/varnishd/cache/cache_req_fsm.c",
                    "file_size": 31571
                },
                {
                    "file_additions": 8,
                    "file_deletions": 0,
                    "file_exists": true,
                    "file_name": "bin/varnishd/cache/cache_vpi.c",
                    "file_size": 7149
                },
                {
                    "file_additions": 4,
                    "file_deletions": 9,
                    "file_exists": true,
                    "file_name": "bin/varnishd/cache/cache_vrt_priv.c",
                    "file_size": 7924
                }
            ],
            "interesting": {
                "reopen": false,
                "status": false
            },
            "is_parent": true,
            "sha": "78498c7b0e4b5c015a121f516805a621e78fd7db"
        },
        {
            "associated_pull_request": [],
            "date": "2019-05-29 09:18:01+00:00",
            "diff": "varnishcache_varnish-cache/issue_3019/commit_c83eb4d6b2a2571df057f43fbb2c54bb626cccfc.diff",
            "diff_additions": 14,
            "diff_deletions": 12,
            "diff_file_size": 142058,
            "diff_url": "https://github.com/varnishcache/varnish-cache/commit/c83eb4d6b2a2571df057f43fbb2c54bb626cccfc.diff",
            "exists": true,
            "files": [
                {
                    "file_additions": 3,
                    "file_deletions": 2,
                    "file_exists": true,
                    "file_name": "bin/varnishd/cache/cache_esi_deliver.c",
                    "file_size": 22253
                },
                {
                    "file_additions": 1,
                    "file_deletions": 1,
                    "file_exists": true,
                    "file_name": "bin/varnishd/cache/cache_panic.c",
                    "file_size": 22691
                },
                {
                    "file_additions": 2,
                    "file_deletions": 1,
                    "file_exists": true,
                    "file_name": "bin/varnishd/cache/cache_req.c",
                    "file_size": 8150
                },
                {
                    "file_additions": 2,
                    "file_deletions": 4,
                    "file_exists": true,
                    "file_name": "bin/varnishd/cache/cache_req_fsm.c",
                    "file_size": 31571
                },
                {
                    "file_additions": 4,
                    "file_deletions": 2,
                    "file_exists": true,
                    "file_name": "bin/varnishd/cache/cache_vpi.c",
                    "file_size": 7149
                },
                {
                    "file_additions": 1,
                    "file_deletions": 1,
                    "file_exists": true,
                    "file_name": "bin/varnishd/http1/cache_http1_fsm.c",
                    "file_size": 11584
                },
                {
                    "file_additions": 1,
                    "file_deletions": 1,
                    "file_exists": true,
                    "file_name": "bin/varnishd/http2/cache_http2_proto.c",
                    "file_size": 38660
                }
            ],
            "interesting": {
                "reopen": false,
                "status": false
            },
            "is_parent": false,
            "sha": "c83eb4d6b2a2571df057f43fbb2c54bb626cccfc"
        },
        {
            "associated_pull_request": [],
            "date": "2019-05-29 09:18:01+00:00",
            "diff": "varnishcache_varnish-cache/issue_3019/commit_85f15b5edef065b58e303305b45faf92a5176572.diff",
            "diff_additions": 14,
            "diff_deletions": 12,
            "diff_file_size": 142058,
            "diff_url": "https://github.com/varnishcache/varnish-cache/commit/85f15b5edef065b58e303305b45faf92a5176572.diff",
            "exists": true,
            "files": [
                {
                    "file_additions": 3,
                    "file_deletions": 2,
                    "file_exists": true,
                    "file_name": "bin/varnishd/cache/cache_esi_deliver.c",
                    "file_size": 22253
                },
                {
                    "file_additions": 1,
                    "file_deletions": 1,
                    "file_exists": true,
                    "file_name": "bin/varnishd/cache/cache_panic.c",
                    "file_size": 22691
                },
                {
                    "file_additions": 2,
                    "file_deletions": 1,
                    "file_exists": true,
                    "file_name": "bin/varnishd/cache/cache_req.c",
                    "file_size": 8150
                },
                {
                    "file_additions": 2,
                    "file_deletions": 4,
                    "file_exists": true,
                    "file_name": "bin/varnishd/cache/cache_req_fsm.c",
                    "file_size": 31571
                },
                {
                    "file_additions": 4,
                    "file_deletions": 2,
                    "file_exists": true,
                    "file_name": "bin/varnishd/cache/cache_vpi.c",
                    "file_size": 7149
                },
                {
                    "file_additions": 1,
                    "file_deletions": 1,
                    "file_exists": true,
                    "file_name": "bin/varnishd/http1/cache_http1_fsm.c",
                    "file_size": 11584
                },
                {
                    "file_additions": 1,
                    "file_deletions": 1,
                    "file_exists": true,
                    "file_name": "bin/varnishd/http2/cache_http2_proto.c",
                    "file_size": 38660
                }
            ],
            "interesting": {
                "reopen": false,
                "status": false
            },
            "is_parent": false,
            "sha": "85f15b5edef065b58e303305b45faf92a5176572"
        },
        {
            "associated_pull_request": [],
            "date": "2019-05-29 09:18:01+00:00",
            "diff": "varnishcache_varnish-cache/issue_3019/commit_9891216adf50ff807301adb98c8ac7262ff276d3.diff",
            "diff_additions": 14,
            "diff_deletions": 12,
            "diff_file_size": 142058,
            "diff_url": "https://github.com/varnishcache/varnish-cache/commit/9891216adf50ff807301adb98c8ac7262ff276d3.diff",
            "exists": true,
            "files": [
                {
                    "file_additions": 3,
                    "file_deletions": 2,
                    "file_exists": true,
                    "file_name": "bin/varnishd/cache/cache_esi_deliver.c",
                    "file_size": 22253
                },
                {
                    "file_additions": 1,
                    "file_deletions": 1,
                    "file_exists": true,
                    "file_name": "bin/varnishd/cache/cache_panic.c",
                    "file_size": 22691
                },
                {
                    "file_additions": 2,
                    "file_deletions": 1,
                    "file_exists": true,
                    "file_name": "bin/varnishd/cache/cache_req.c",
                    "file_size": 8150
                },
                {
                    "file_additions": 2,
                    "file_deletions": 4,
                    "file_exists": true,
                    "file_name": "bin/varnishd/cache/cache_req_fsm.c",
                    "file_size": 31571
                },
                {
                    "file_additions": 4,
                    "file_deletions": 2,
                    "file_exists": true,
                    "file_name": "bin/varnishd/cache/cache_vpi.c",
                    "file_size": 7149
                },
                {
                    "file_additions": 1,
                    "file_deletions": 1,
                    "file_exists": true,
                    "file_name": "bin/varnishd/http1/cache_http1_fsm.c",
                    "file_size": 11584
                },
                {
                    "file_additions": 1,
                    "file_deletions": 1,
                    "file_exists": true,
                    "file_name": "bin/varnishd/http2/cache_http2_proto.c",
                    "file_size": 38660
                }
            ],
            "interesting": {
                "reopen": false,
                "status": false
            },
            "is_parent": false,
            "sha": "9891216adf50ff807301adb98c8ac7262ff276d3"
        },
        {
            "associated_pull_request": [
                "https://github.com/varnishcache/varnish-cache/pull/3117"
            ],
            "date": "2019-05-29 09:18:01+00:00",
            "diff": "varnishcache_varnish-cache/issue_3019/commit_fc04ea211f2769cdeb540115ed84ee8908a48cb8.diff",
            "diff_additions": 14,
            "diff_deletions": 12,
            "diff_file_size": 142058,
            "diff_url": "https://github.com/varnishcache/varnish-cache/commit/fc04ea211f2769cdeb540115ed84ee8908a48cb8.diff",
            "exists": true,
            "files": [
                {
                    "file_additions": 3,
                    "file_deletions": 2,
                    "file_exists": true,
                    "file_name": "bin/varnishd/cache/cache_esi_deliver.c",
                    "file_size": 22253
                },
                {
                    "file_additions": 1,
                    "file_deletions": 1,
                    "file_exists": true,
                    "file_name": "bin/varnishd/cache/cache_panic.c",
                    "file_size": 22691
                },
                {
                    "file_additions": 2,
                    "file_deletions": 1,
                    "file_exists": true,
                    "file_name": "bin/varnishd/cache/cache_req.c",
                    "file_size": 8150
                },
                {
                    "file_additions": 2,
                    "file_deletions": 4,
                    "file_exists": true,
                    "file_name": "bin/varnishd/cache/cache_req_fsm.c",
                    "file_size": 31571
                },
                {
                    "file_additions": 4,
                    "file_deletions": 2,
                    "file_exists": true,
                    "file_name": "bin/varnishd/cache/cache_vpi.c",
                    "file_size": 7149
                },
                {
                    "file_additions": 1,
                    "file_deletions": 1,
                    "file_exists": true,
                    "file_name": "bin/varnishd/http1/cache_http1_fsm.c",
                    "file_size": 11584
                },
                {
                    "file_additions": 1,
                    "file_deletions": 1,
                    "file_exists": true,
                    "file_name": "bin/varnishd/http2/cache_http2_proto.c",
                    "file_size": 38660
                }
            ],
            "interesting": {
                "reopen": false,
                "status": false
            },
            "is_parent": false,
            "sha": "fc04ea211f2769cdeb540115ed84ee8908a48cb8"
        },
        {
            "associated_pull_request": [
                "https://github.com/varnishcache/varnish-cache/pull/3117"
            ],
            "date": "2019-05-29 09:18:01+00:00",
            "diff": "varnishcache_varnish-cache/issue_3019/commit_fc04ea211f2769cdeb540115ed84ee8908a48cb8.diff",
            "diff_additions": 14,
            "diff_deletions": 12,
            "diff_file_size": 142058,
            "diff_url": "https://github.com/varnishcache/varnish-cache/commit/fc04ea211f2769cdeb540115ed84ee8908a48cb8.diff",
            "exists": true,
            "files": [
                {
                    "file_additions": 3,
                    "file_deletions": 2,
                    "file_exists": true,
                    "file_name": "bin/varnishd/cache/cache_esi_deliver.c",
                    "file_size": 22253
                },
                {
                    "file_additions": 1,
                    "file_deletions": 1,
                    "file_exists": true,
                    "file_name": "bin/varnishd/cache/cache_panic.c",
                    "file_size": 22691
                },
                {
                    "file_additions": 2,
                    "file_deletions": 1,
                    "file_exists": true,
                    "file_name": "bin/varnishd/cache/cache_req.c",
                    "file_size": 8150
                },
                {
                    "file_additions": 2,
                    "file_deletions": 4,
                    "file_exists": true,
                    "file_name": "bin/varnishd/cache/cache_req_fsm.c",
                    "file_size": 31571
                },
                {
                    "file_additions": 4,
                    "file_deletions": 2,
                    "file_exists": true,
                    "file_name": "bin/varnishd/cache/cache_vpi.c",
                    "file_size": 7149
                },
                {
                    "file_additions": 1,
                    "file_deletions": 1,
                    "file_exists": true,
                    "file_name": "bin/varnishd/http1/cache_http1_fsm.c",
                    "file_size": 11584
                },
                {
                    "file_additions": 1,
                    "file_deletions": 1,
                    "file_exists": true,
                    "file_name": "bin/varnishd/http2/cache_http2_proto.c",
                    "file_size": 38660
                }
            ],
            "interesting": {
                "reopen": false,
                "status": false
            },
            "is_parent": false,
            "sha": "fc04ea211f2769cdeb540115ed84ee8908a48cb8"
        },
        {
            "associated_pull_request": [],
            "date": "2019-05-29 09:18:01+00:00",
            "diff": "varnishcache_varnish-cache/issue_3019/commit_01de2da916f77c4fd3d4ae88122538b1fc687d0e.diff",
            "diff_additions": 14,
            "diff_deletions": 12,
            "diff_file_size": 142058,
            "diff_url": "https://github.com/varnishcache/varnish-cache/commit/01de2da916f77c4fd3d4ae88122538b1fc687d0e.diff",
            "exists": true,
            "files": [
                {
                    "file_additions": 3,
                    "file_deletions": 2,
                    "file_exists": true,
                    "file_name": "bin/varnishd/cache/cache_esi_deliver.c",
                    "file_size": 22253
                },
                {
                    "file_additions": 1,
                    "file_deletions": 1,
                    "file_exists": true,
                    "file_name": "bin/varnishd/cache/cache_panic.c",
                    "file_size": 22691
                },
                {
                    "file_additions": 2,
                    "file_deletions": 1,
                    "file_exists": true,
                    "file_name": "bin/varnishd/cache/cache_req.c",
                    "file_size": 8150
                },
                {
                    "file_additions": 2,
                    "file_deletions": 4,
                    "file_exists": true,
                    "file_name": "bin/varnishd/cache/cache_req_fsm.c",
                    "file_size": 31571
                },
                {
                    "file_additions": 4,
                    "file_deletions": 2,
                    "file_exists": true,
                    "file_name": "bin/varnishd/cache/cache_vpi.c",
                    "file_size": 7149
                },
                {
                    "file_additions": 1,
                    "file_deletions": 1,
                    "file_exists": true,
                    "file_name": "bin/varnishd/http1/cache_http1_fsm.c",
                    "file_size": 11584
                },
                {
                    "file_additions": 1,
                    "file_deletions": 1,
                    "file_exists": true,
                    "file_name": "bin/varnishd/http2/cache_http2_proto.c",
                    "file_size": 38660
                }
            ],
            "interesting": {
                "reopen": false,
                "status": false
            },
            "is_parent": false,
            "sha": "01de2da916f77c4fd3d4ae88122538b1fc687d0e"
        }
    ],
    "first_commit": "2019-06-06 12:25:30+00:00",
    "last_commit": "2020-03-27 08:08:59+00:00",
    "number": 3019,
    "pull_request": "None",
    "score": {
        "accidental_reopen_likely": false,
        "all_labels": [
            "b=bug",
            "r=trunk",
            "c=varnishd"
        ],
        "contains_keywords": [
            "confirm",
            "work",
            "fail",
            "chang",
            "fix",
            "issu",
            "patch",
            "perform",
            "debug",
            "reason",
            "test",
            "fault",
            "remov",
            "bug",
            "error",
            "crash"
        ],
        "fix_size": 32,
        "has_labels": [],
        "intersecting": {
            "computed_score": 1.0,
            "final_commit_size": 26,
            "intersection_size": 26,
            "previous_commits_size": 32
        },
        "is_makefile_based": true,
        "no_new_files": [],
        "no_other_files": false,
        "num_prohibited_files": 235283,
        "prohibited_files": [
            "server/src/main/java/com/genymobile/scrcpy/Device.java",
            "server/src/main/java/com/genymobile/scrcpy/wrappers/SurfaceControl.java",
            "server/src/main/java/com/genymobile/scrcpy/Device.java",
            "server/src/main/java/com/genymobile/scrcpy/wrappers/SurfaceControl.java",
            "app/meson.build",
            "app/scrcpy.1",
            "app/src/common.h",
            "app/src/scrcpy.h",
            "app/src/server.h",
            "server/src/main/java/com/genymobile/scrcpy/Workarounds.java"
        ],
        "reopen": true,
        "reopen_events": [
            [
                "2019-06-28 08:51:12+00:00",
                "commit"
            ],
            [
                "2019-07-01 11:52:10+00:00",
                "closed"
            ],
            [
                "2019-07-01 12:30:30+00:00",
                "reopened"
            ],
            [
                "2019-11-05 18:07:12+00:00",
                "commit"
            ],
            [
                "2019-11-07 11:18:17+00:00",
                "commit"
            ],
            [
                "2019-11-09 13:51:56+00:00",
                "commit"
            ],
            [
                "2019-11-13 08:47:40+00:00",
                "commit"
            ],
            [
                "2019-11-13 08:47:56+00:00",
                "closed"
            ],
            [
                "2019-11-13 08:47:56+00:00",
                "commit"
            ],
            [
                "2020-03-27 08:11:06+00:00",
                "commit"
            ]
        ],
        "status": false,
        "strategy": true,
        "total_changes": 185
    }
}