{
    "commits": [
        {
            "associated_pull_request": [],
            "date": "2020-06-18 00:48:24+00:00",
            "diff": "",
            "diff_additions": 0,
            "diff_deletions": 0,
            "diff_file_size": 0,
            "diff_url": "https://github.com/micropython/micropython/commit/ce02d5e3486ca0665e175e9690be910a06392edf.diff",
            "exists": true,
            "files": [],
            "interesting": {
                "reopen": false,
                "status": false
            },
            "is_parent": true,
            "sha": "ce02d5e3486ca0665e175e9690be910a06392edf"
        },
        {
            "associated_pull_request": [],
            "date": "2020-06-18 11:44:54+00:00",
            "diff": "micropython_micropython/issue_6167/commit_a65f0d5ac7fca4a2c8d334a8987d628234dcb73c.diff",
            "diff_additions": 1,
            "diff_deletions": 1,
            "diff_file_size": 15374,
            "diff_url": "https://github.com/micropython/micropython/commit/a65f0d5ac7fca4a2c8d334a8987d628234dcb73c.diff",
            "exists": true,
            "files": [
                {
                    "file_additions": 1,
                    "file_deletions": 1,
                    "file_exists": true,
                    "file_name": "ports/esp32/esp32_rmt.c",
                    "file_size": 15374
                }
            ],
            "interesting": {
                "reopen": false,
                "status": false
            },
            "is_parent": false,
            "sha": "a65f0d5ac7fca4a2c8d334a8987d628234dcb73c"
        },
        {
            "associated_pull_request": [],
            "date": "2020-06-18 11:44:54+00:00",
            "diff": "micropython_micropython/issue_6167/commit_4b4ab4cdb60ee8d2ed50b2feb5d66e95a6ad3407.diff",
            "diff_additions": 1,
            "diff_deletions": 1,
            "diff_file_size": 15374,
            "diff_url": "https://github.com/micropython/micropython/commit/4b4ab4cdb60ee8d2ed50b2feb5d66e95a6ad3407.diff",
            "exists": true,
            "files": [
                {
                    "file_additions": 1,
                    "file_deletions": 1,
                    "file_exists": true,
                    "file_name": "ports/esp32/esp32_rmt.c",
                    "file_size": 15374
                }
            ],
            "interesting": {
                "reopen": true,
                "status": false
            },
            "is_parent": false,
            "sha": "4b4ab4cdb60ee8d2ed50b2feb5d66e95a6ad3407"
        },
        {
            "associated_pull_request": [],
            "date": "2020-06-26 13:55:07+00:00",
            "diff": "micropython_micropython/issue_6167/commit_7dbef5377cd86a4f20a16acd3ad7798c4160aabc.diff",
            "diff_additions": 28,
            "diff_deletions": 2,
            "diff_file_size": 15374,
            "diff_url": "https://github.com/micropython/micropython/commit/7dbef5377cd86a4f20a16acd3ad7798c4160aabc.diff",
            "exists": true,
            "files": [
                {
                    "file_additions": 28,
                    "file_deletions": 2,
                    "file_exists": true,
                    "file_name": "ports/esp32/esp32_rmt.c",
                    "file_size": 15374
                }
            ],
            "interesting": {
                "reopen": false,
                "status": false
            },
            "is_parent": false,
            "sha": "7dbef5377cd86a4f20a16acd3ad7798c4160aabc"
        },
        {
            "associated_pull_request": [],
            "date": "2020-06-26 13:55:07+00:00",
            "diff": "micropython_micropython/issue_6167/commit_d0b016766ad1a4bb0ef70bcc81f950b46ead62e6.diff",
            "diff_additions": 28,
            "diff_deletions": 2,
            "diff_file_size": 15374,
            "diff_url": "https://github.com/micropython/micropython/commit/d0b016766ad1a4bb0ef70bcc81f950b46ead62e6.diff",
            "exists": true,
            "files": [
                {
                    "file_additions": 28,
                    "file_deletions": 2,
                    "file_exists": true,
                    "file_name": "ports/esp32/esp32_rmt.c",
                    "file_size": 15374
                }
            ],
            "interesting": {
                "reopen": false,
                "status": false
            },
            "is_parent": false,
            "sha": "d0b016766ad1a4bb0ef70bcc81f950b46ead62e6"
        }
    ],
    "first_commit": "2020-06-18 00:48:24+00:00",
    "last_commit": "2020-09-04 14:36:51+00:00",
    "number": 6167,
    "pull_request": "None",
    "score": {
        "accidental_reopen_likely": false,
        "all_labels": [
            "port-esp32"
        ],
        "contains_keywords": [
            "confirm",
            "work",
            "fail",
            "chang",
            "fix",
            "issu",
            "reason",
            "test",
            "attempt",
            "bug",
            "problem",
            "report",
            "workaround"
        ],
        "fix_size": 32,
        "has_labels": [],
        "intersecting": {
            "computed_score": 1.0,
            "final_commit_size": 31,
            "intersection_size": 31,
            "previous_commits_size": 32
        },
        "is_makefile_based": false,
        "no_new_files": [],
        "no_other_files": true,
        "num_prohibited_files": 35847,
        "prohibited_files": [
            "server/src/main/java/com/genymobile/scrcpy/Device.java",
            "server/src/main/java/com/genymobile/scrcpy/wrappers/SurfaceControl.java",
            "server/src/main/java/com/genymobile/scrcpy/Device.java",
            "server/src/main/java/com/genymobile/scrcpy/wrappers/SurfaceControl.java",
            "app/meson.build",
            "app/scrcpy.1",
            "app/src/common.h",
            "app/src/scrcpy.h",
            "app/src/server.h",
            "server/src/main/java/com/genymobile/scrcpy/Workarounds.java"
        ],
        "reopen": true,
        "reopen_events": [
            [
                "2020-06-18 11:45:19+00:00",
                "commit"
            ],
            [
                "2020-06-18 11:56:15+00:00",
                "commit"
            ],
            [
                "2020-06-19 12:14:35+00:00",
                "commit"
            ],
            [
                "2020-06-19 12:15:01+00:00",
                "closed"
            ],
            [
                "2020-06-20 23:56:39+00:00",
                "commit"
            ],
            [
                "2020-07-01 09:52:51+00:00",
                "commit"
            ],
            [
                "2020-07-20 06:31:39+00:00",
                "reopened"
            ],
            [
                "2020-07-20 14:58:46+00:00",
                "commit"
            ],
            [
                "2020-07-20 14:59:24+00:00",
                "closed"
            ],
            [
                "2020-09-04 14:37:32+00:00",
                "commit"
            ]
        ],
        "status": false,
        "strategy": true,
        "total_changes": 64
    }
}