{
    "covered_issues": [
        60,
        53,
        50,
        49,
        48,
        47,
        46,
        44,
        43,
        42,
        41,
        37,
        36,
        35,
        31,
        30,
        29,
        24,
        23,
        20,
        14,
        11,
        10,
        9,
        8,
        7,
        4,
        3,
        2
    ],
    "finished": true
}