{
    "commits": [
        {
            "associated_pull_request": [],
            "date": "2015-09-01 13:48:12+00:00",
            "diff": "openwall_john/issue_1726/commit_3701702afb5721a14574283c5fdf4d00e1df2448.diff",
            "diff_additions": 86,
            "diff_deletions": 65,
            "diff_file_size": 594225,
            "diff_url": "https://github.com/openwall/john/commit/3701702afb5721a14574283c5fdf4d00e1df2448.diff",
            "exists": true,
            "files": [
                {
                    "file_additions": 1,
                    "file_deletions": 1,
                    "file_exists": true,
                    "file_name": "src/BF_fmt.c",
                    "file_size": 4516
                },
                {
                    "file_additions": 2,
                    "file_deletions": 3,
                    "file_exists": true,
                    "file_name": "src/DES_fmt.c",
                    "file_size": 7830
                },
                {
                    "file_additions": 1,
                    "file_deletions": 1,
                    "file_exists": true,
                    "file_name": "src/LM_fmt.c",
                    "file_size": 5367
                },
                {
                    "file_additions": 1,
                    "file_deletions": 1,
                    "file_exists": true,
                    "file_name": "src/NETLM_fmt_plug.c",
                    "file_size": 10999
                },
                {
                    "file_additions": 1,
                    "file_deletions": 1,
                    "file_exists": true,
                    "file_name": "src/NETSPLITLM_fmt_plug.c",
                    "file_size": 8655
                },
                {
                    "file_additions": 3,
                    "file_deletions": 3,
                    "file_exists": true,
                    "file_name": "src/external.c",
                    "file_size": 17616
                },
                {
                    "file_additions": 1,
                    "file_deletions": 1,
                    "file_exists": true,
                    "file_name": "src/formats.c",
                    "file_size": 63259
                },
                {
                    "file_additions": 4,
                    "file_deletions": 4,
                    "file_exists": true,
                    "file_name": "src/inc.c",
                    "file_size": 22876
                },
                {
                    "file_additions": 20,
                    "file_deletions": 7,
                    "file_exists": true,
                    "file_name": "src/john.c",
                    "file_size": 59563
                },
                {
                    "file_additions": 1,
                    "file_deletions": 0,
                    "file_exists": true,
                    "file_name": "src/listconf.c",
                    "file_size": 38400
                },
                {
                    "file_additions": 19,
                    "file_deletions": 19,
                    "file_exists": true,
                    "file_name": "src/mask.c",
                    "file_size": 72846
                },
                {
                    "file_additions": 4,
                    "file_deletions": 4,
                    "file_exists": true,
                    "file_name": "src/mkv.c",
                    "file_size": 20323
                },
                {
                    "file_additions": 1,
                    "file_deletions": 1,
                    "file_exists": true,
                    "file_name": "src/opencl_DES_fmt_plug.c",
                    "file_size": 8799
                },
                {
                    "file_additions": 1,
                    "file_deletions": 1,
                    "file_exists": true,
                    "file_name": "src/opencl_lm_fmt_plug.c",
                    "file_size": 5087
                },
                {
                    "file_additions": 14,
                    "file_deletions": 6,
                    "file_exists": true,
                    "file_name": "src/options.c",
                    "file_size": 43796
                },
                {
                    "file_additions": 3,
                    "file_deletions": 3,
                    "file_exists": true,
                    "file_name": "src/pp.c",
                    "file_size": 58110
                },
                {
                    "file_additions": 1,
                    "file_deletions": 1,
                    "file_exists": true,
                    "file_name": "src/pst_fmt_plug.c",
                    "file_size": 4681
                },
                {
                    "file_additions": 1,
                    "file_deletions": 1,
                    "file_exists": true,
                    "file_name": "src/racf_fmt_plug.c",
                    "file_size": 10097
                },
                {
                    "file_additions": 2,
                    "file_deletions": 2,
                    "file_exists": true,
                    "file_name": "src/rules.c",
                    "file_size": 46947
                },
                {
                    "file_additions": 1,
                    "file_deletions": 1,
                    "file_exists": true,
                    "file_name": "src/sapB_fmt_plug.c",
                    "file_size": 24512
                },
                {
                    "file_additions": 1,
                    "file_deletions": 1,
                    "file_exists": true,
                    "file_name": "src/trip_fmt.c",
                    "file_size": 13382
                },
                {
                    "file_additions": 1,
                    "file_deletions": 1,
                    "file_exists": true,
                    "file_name": "src/vnc_fmt_plug.c",
                    "file_size": 9735
                },
                {
                    "file_additions": 2,
                    "file_deletions": 2,
                    "file_exists": true,
                    "file_name": "src/wordlist.c",
                    "file_size": 36829
                }
            ],
            "interesting": {
                "reopen": false,
                "status": false
            },
            "is_parent": true,
            "sha": "3701702afb5721a14574283c5fdf4d00e1df2448"
        },
        {
            "associated_pull_request": [],
            "date": "2015-09-01 15:11:26+00:00",
            "diff": "openwall_john/issue_1726/commit_8450e7f53f7aa1607d22e049d60f31b5a7abdbc7.diff",
            "diff_additions": 18,
            "diff_deletions": 19,
            "diff_file_size": 9026,
            "diff_url": "https://github.com/openwall/john/commit/8450e7f53f7aa1607d22e049d60f31b5a7abdbc7.diff",
            "exists": true,
            "files": [
                {
                    "file_additions": 18,
                    "file_deletions": 19,
                    "file_exists": true,
                    "file_name": "src/opencl_lotus5_fmt_plug.c",
                    "file_size": 9026
                }
            ],
            "interesting": {
                "reopen": true,
                "status": false
            },
            "is_parent": false,
            "sha": "8450e7f53f7aa1607d22e049d60f31b5a7abdbc7"
        },
        {
            "associated_pull_request": [],
            "date": "2015-10-06 15:12:39+00:00",
            "diff": "openwall_john/issue_1726/commit_3e295c835447a2a9b9b44e76ed1254c5f384b2e9.diff",
            "diff_additions": 9,
            "diff_deletions": 14,
            "diff_file_size": 9026,
            "diff_url": "https://github.com/openwall/john/commit/3e295c835447a2a9b9b44e76ed1254c5f384b2e9.diff",
            "exists": true,
            "files": [
                {
                    "file_additions": 9,
                    "file_deletions": 14,
                    "file_exists": true,
                    "file_name": "src/opencl_lotus5_fmt_plug.c",
                    "file_size": 9026
                }
            ],
            "interesting": {
                "reopen": true,
                "status": false
            },
            "is_parent": false,
            "sha": "3e295c835447a2a9b9b44e76ed1254c5f384b2e9"
        },
        {
            "associated_pull_request": [],
            "date": "2015-10-08 15:11:51+00:00",
            "diff": "openwall_john/issue_1726/commit_c6c76e7ebaebb58d22b9f09d9a394ef6443c7e48.diff",
            "diff_additions": 19,
            "diff_deletions": 16,
            "diff_file_size": 9026,
            "diff_url": "https://github.com/openwall/john/commit/c6c76e7ebaebb58d22b9f09d9a394ef6443c7e48.diff",
            "exists": true,
            "files": [
                {
                    "file_additions": 19,
                    "file_deletions": 16,
                    "file_exists": true,
                    "file_name": "src/opencl_lotus5_fmt_plug.c",
                    "file_size": 9026
                }
            ],
            "interesting": {
                "reopen": false,
                "status": false
            },
            "is_parent": false,
            "sha": "c6c76e7ebaebb58d22b9f09d9a394ef6443c7e48"
        },
        {
            "associated_pull_request": [],
            "date": "2016-09-07 13:19:25+00:00",
            "diff": "openwall_john/issue_1726/commit_c24852cb1607e0edaee25e97b08629239fd55f54.diff",
            "diff_additions": 3,
            "diff_deletions": 50,
            "diff_file_size": 9026,
            "diff_url": "https://github.com/openwall/john/commit/c24852cb1607e0edaee25e97b08629239fd55f54.diff",
            "exists": true,
            "files": [
                {
                    "file_additions": 3,
                    "file_deletions": 50,
                    "file_exists": true,
                    "file_name": "src/opencl_lotus5_fmt_plug.c",
                    "file_size": 9026
                }
            ],
            "interesting": {
                "reopen": false,
                "status": false
            },
            "is_parent": false,
            "sha": "c24852cb1607e0edaee25e97b08629239fd55f54"
        },
        {
            "associated_pull_request": [],
            "date": "2016-09-07 13:19:25+00:00",
            "diff": "openwall_john/issue_1726/commit_d0e36ee674b5b7aacdf93932fb3f43f659b5849a.diff",
            "diff_additions": 3,
            "diff_deletions": 50,
            "diff_file_size": 9026,
            "diff_url": "https://github.com/openwall/john/commit/d0e36ee674b5b7aacdf93932fb3f43f659b5849a.diff",
            "exists": true,
            "files": [
                {
                    "file_additions": 3,
                    "file_deletions": 50,
                    "file_exists": true,
                    "file_name": "src/opencl_lotus5_fmt_plug.c",
                    "file_size": 9026
                }
            ],
            "interesting": {
                "reopen": false,
                "status": false
            },
            "is_parent": false,
            "sha": "d0e36ee674b5b7aacdf93932fb3f43f659b5849a"
        }
    ],
    "first_commit": "2015-09-01 13:48:12+00:00",
    "last_commit": "2016-09-07 20:49:29+00:00",
    "number": 1726,
    "pull_request": "None",
    "score": {
        "accidental_reopen_likely": false,
        "all_labels": [
            "bug"
        ],
        "contains_keywords": [
            "work",
            "fail",
            "chang",
            "fix",
            "issu",
            "debug",
            "reason",
            "test",
            "fault",
            "leak",
            "remov",
            "bug",
            "error",
            "problem",
            "crash"
        ],
        "fix_size": 115,
        "has_labels": [
            "bug"
        ],
        "intersecting": {
            "computed_score": 1.0,
            "final_commit_size": 52,
            "intersection_size": 52,
            "previous_commits_size": 115
        },
        "is_makefile_based": false,
        "no_new_files": [],
        "no_other_files": false,
        "num_prohibited_files": 81532,
        "prohibited_files": [
            "server/src/main/java/com/genymobile/scrcpy/Device.java",
            "server/src/main/java/com/genymobile/scrcpy/wrappers/SurfaceControl.java",
            "server/src/main/java/com/genymobile/scrcpy/Device.java",
            "server/src/main/java/com/genymobile/scrcpy/wrappers/SurfaceControl.java",
            "app/meson.build",
            "app/scrcpy.1",
            "app/src/common.h",
            "app/src/scrcpy.h",
            "app/src/server.h",
            "server/src/main/java/com/genymobile/scrcpy/Workarounds.java"
        ],
        "reopen": true,
        "reopen_events": [
            [
                "2015-09-01 16:14:40+00:00",
                "closed"
            ],
            [
                "2015-09-01 16:14:40+00:00",
                "commit"
            ],
            [
                "2015-09-03 17:49:58+00:00",
                "reopened"
            ],
            [
                "2015-10-06 17:14:25+00:00",
                "closed"
            ],
            [
                "2015-10-06 17:14:25+00:00",
                "commit"
            ],
            [
                "2015-10-07 17:11:22+00:00",
                "reopened"
            ],
            [
                "2015-10-08 16:06:48+00:00",
                "commit"
            ],
            [
                "2016-09-07 20:02:14+00:00",
                "commit"
            ],
            [
                "2016-09-07 20:50:03+00:00",
                "commit"
            ],
            [
                "2018-02-17 11:40:40+00:00",
                "closed"
            ]
        ],
        "status": false,
        "strategy": true,
        "total_changes": 352
    }
}