{
    "category": [
        "memory",
        "network/protocol"
    ],
    "commits": [
        {
            "associated_pull_request": [
                "https://github.com/libjpeg-turbo/libjpeg-turbo/pull/425"
            ],
            "date": "2020-05-05 05:38:39",
            "diff": "",
            "diff_additions": 0,
            "diff_deletions": 0,
            "diff_file_size": 0,
            "diff_url": "https://github.com/libjpeg-turbo/libjpeg-turbo/commit/a2291b252de1413a13db61b21863ae7aea0946f3.diff",
            "exists": true,
            "files": [],
            "interesting": {
                "reopen": false,
                "status": false
            },
            "is_parent": true,
            "sha": "a2291b252de1413a13db61b21863ae7aea0946f3"
        },
        {
            "associated_pull_request": [],
            "date": "2020-06-02 19:15:37",
            "diff": "libjpeg-turbo_libjpeg-turbo/issue_433/commit_3de15e0c344d11d4b90f4a47136467053eb2d09a.diff",
            "diff_additions": 2,
            "diff_deletions": 2,
            "diff_file_size": 25423,
            "diff_url": "https://github.com/libjpeg-turbo/libjpeg-turbo/commit/3de15e0c344d11d4b90f4a47136467053eb2d09a.diff",
            "exists": true,
            "files": [
                {
                    "file_additions": 2,
                    "file_deletions": 2,
                    "file_exists": true,
                    "file_name": "rdppm.c",
                    "file_size": 25423
                }
            ],
            "interesting": {
                "reopen": false,
                "status": false
            },
            "is_parent": false,
            "sha": "3de15e0c344d11d4b90f4a47136467053eb2d09a"
        },
        {
            "associated_pull_request": [],
            "date": "2020-06-02 19:15:37",
            "diff": "libjpeg-turbo_libjpeg-turbo/issue_433/commit_5fad352f09d22b5ae3e553f32f8cf3ee570c72c1.diff",
            "diff_additions": 2,
            "diff_deletions": 2,
            "diff_file_size": 25423,
            "diff_url": "https://github.com/libjpeg-turbo/libjpeg-turbo/commit/5fad352f09d22b5ae3e553f32f8cf3ee570c72c1.diff",
            "exists": true,
            "files": [
                {
                    "file_additions": 2,
                    "file_deletions": 2,
                    "file_exists": true,
                    "file_name": "rdppm.c",
                    "file_size": 25423
                }
            ],
            "interesting": {
                "reopen": false,
                "status": true
            },
            "is_parent": false,
            "sha": "5fad352f09d22b5ae3e553f32f8cf3ee570c72c1"
        },
        {
            "associated_pull_request": [],
            "date": "2020-06-02 19:15:37",
            "diff": "libjpeg-turbo_libjpeg-turbo/issue_433/commit_1f7a5b8be2c84a1fdf946a486eceacffdeb88e72.diff",
            "diff_additions": 2,
            "diff_deletions": 2,
            "diff_file_size": 25423,
            "diff_url": "https://github.com/libjpeg-turbo/libjpeg-turbo/commit/1f7a5b8be2c84a1fdf946a486eceacffdeb88e72.diff",
            "exists": true,
            "files": [
                {
                    "file_additions": 2,
                    "file_deletions": 2,
                    "file_exists": true,
                    "file_name": "rdppm.c",
                    "file_size": 25423
                }
            ],
            "interesting": {
                "reopen": false,
                "status": true
            },
            "is_parent": false,
            "sha": "1f7a5b8be2c84a1fdf946a486eceacffdeb88e72"
        },
        {
            "associated_pull_request": [],
            "date": "2020-06-02 19:15:37",
            "diff": "libjpeg-turbo_libjpeg-turbo/issue_433/commit_1bfb0b5247f4fc8f6677639781ce468543490216.diff",
            "diff_additions": 3,
            "diff_deletions": 2,
            "diff_file_size": 25423,
            "diff_url": "https://github.com/libjpeg-turbo/libjpeg-turbo/commit/1bfb0b5247f4fc8f6677639781ce468543490216.diff",
            "exists": true,
            "files": [
                {
                    "file_additions": 3,
                    "file_deletions": 2,
                    "file_exists": true,
                    "file_name": "rdppm.c",
                    "file_size": 25423
                }
            ],
            "interesting": {
                "reopen": false,
                "status": false
            },
            "is_parent": false,
            "sha": "1bfb0b5247f4fc8f6677639781ce468543490216"
        }
    ],
    "first_commit": "2020-05-05 05:38:39",
    "last_commit": "2020-06-03 23:01:53",
    "number": 433,
    "pull_request": "None",
    "score": {
        "accidental_reopen_likely": false,
        "all_labels": [
            "bug",
            "fixed"
        ],
        "contains_keywords": [
            "chang",
            "crash",
            "test",
            "fix",
            "issu"
        ],
        "fix_size": 6,
        "has_labels": [
            "bug"
        ],
        "intersecting": {
            "computed_score": 0.6,
            "final_commit_size": 5,
            "intersection_size": 3,
            "previous_commits_size": 4
        },
        "is_makefile_based": true,
        "no_new_files": [],
        "no_other_files": true,
        "num_prohibited_files": 88275,
        "prohibited_files": [
            "hal/inc/pinmap_hal.h",
            "Debug/marvin.bin",
            "Debug/marvin.elf",
            "Debug/marvin.hex",
            "Debug/marvin.bin",
            "Debug/marvin.elf",
            "Debug/marvin.hex",
            "inc/spark_utilities.h",
            "Debug/marvin.bin",
            "Debug/marvin.elf"
        ],
        "reopen": false,
        "reopen_events": [
            [
                "2020-06-02 20:05:51",
                "commit"
            ],
            [
                "2020-06-02 20:05:52",
                "closed"
            ],
            [
                "2020-06-02 20:05:52",
                "commit"
            ],
            [
                "2020-06-03 22:59:57",
                "commit"
            ],
            [
                "2020-06-03 23:01:11",
                "commit"
            ],
            [
                "2020-06-03 23:02:33",
                "commit"
            ]
        ],
        "status": true,
        "strategy": true,
        "total_changes": 17
    }
}