{
    "category": [
        "feature request"
    ],
    "commits": [
        {
            "associated_pull_request": [],
            "date": "2017-08-15 02:42:52",
            "diff": "seasx_seaslog/issue_142/commit_06edbbe53051f9c5df2a35a77c3bcd145786b56d.diff",
            "diff_additions": 9,
            "diff_deletions": 2,
            "diff_file_size": 63339,
            "diff_url": "https://github.com/SeasX/SeasLog/commit/06edbbe53051f9c5df2a35a77c3bcd145786b56d.diff",
            "exists": true,
            "files": [
                {
                    "file_additions": 2,
                    "file_deletions": 0,
                    "file_exists": true,
                    "file_name": "seaslog.c",
                    "file_size": 43079
                },
                {
                    "file_additions": 2,
                    "file_deletions": 2,
                    "file_exists": true,
                    "file_name": "src/Appender.c",
                    "file_size": 9700
                },
                {
                    "file_additions": 5,
                    "file_deletions": 0,
                    "file_exists": true,
                    "file_name": "src/Request.c",
                    "file_size": 10560
                }
            ],
            "interesting": {
                "reopen": false,
                "status": false
            },
            "is_parent": true,
            "sha": "06edbbe53051f9c5df2a35a77c3bcd145786b56d"
        },
        {
            "associated_pull_request": [],
            "date": "2017-08-15 14:24:09",
            "diff": "seasx_seaslog/issue_142/commit_a68cf66ef661372de7dddc9cfcd61ef339bd9a3c.diff",
            "diff_additions": 194,
            "diff_deletions": 52,
            "diff_file_size": 61750,
            "diff_url": "https://github.com/SeasX/SeasLog/commit/a68cf66ef661372de7dddc9cfcd61ef339bd9a3c.diff",
            "exists": true,
            "files": [
                {
                    "file_additions": 3,
                    "file_deletions": 1,
                    "file_exists": true,
                    "file_name": "seaslog.c",
                    "file_size": 43079
                },
                {
                    "file_additions": 3,
                    "file_deletions": 51,
                    "file_exists": true,
                    "file_name": "src/Appender.c",
                    "file_size": 9700
                },
                {
                    "file_additions": 188,
                    "file_deletions": 0,
                    "file_exists": true,
                    "file_name": "src/StreamWrapper.c",
                    "file_size": 8971
                }
            ],
            "interesting": {
                "reopen": false,
                "status": true
            },
            "is_parent": false,
            "sha": "a68cf66ef661372de7dddc9cfcd61ef339bd9a3c"
        },
        {
            "associated_pull_request": [],
            "date": "2017-08-16 12:29:07",
            "diff": "seasx_seaslog/issue_142/commit_7cf6b941f708579db625cba9f1be7cc42a9b5f37.diff",
            "diff_additions": 19,
            "diff_deletions": 15,
            "diff_file_size": 15559,
            "diff_url": "https://github.com/SeasX/SeasLog/commit/7cf6b941f708579db625cba9f1be7cc42a9b5f37.diff",
            "exists": true,
            "files": [
                {
                    "file_additions": 6,
                    "file_deletions": 6,
                    "file_exists": true,
                    "file_name": "src/Buffer.c",
                    "file_size": 6588
                },
                {
                    "file_additions": 13,
                    "file_deletions": 9,
                    "file_exists": true,
                    "file_name": "src/StreamWrapper.c",
                    "file_size": 8971
                }
            ],
            "interesting": {
                "reopen": false,
                "status": false
            },
            "is_parent": false,
            "sha": "7cf6b941f708579db625cba9f1be7cc42a9b5f37"
        }
    ],
    "first_commit": "2017-08-15 02:42:52",
    "last_commit": "2017-08-16 12:29:07",
    "number": 142,
    "pull_request": "None",
    "score": {
        "accidental_reopen_likely": false,
        "all_labels": [
            "enhancement"
        ],
        "contains_keywords": [
            "bug"
        ],
        "fix_size": 85,
        "has_labels": [],
        "intersecting": {
            "computed_score": 0.0,
            "final_commit_size": 27,
            "intersection_size": 0,
            "previous_commits_size": 58
        },
        "is_makefile_based": false,
        "no_new_files": [
            "src/Buffer.c",
            "src/StreamWrapper.c"
        ],
        "no_other_files": false,
        "num_prohibited_files": 28281,
        "prohibited_files": [
            "kill.h",
            "meminfo.h",
            "kill.h",
            "meminfo.h",
            "kill.h",
            "meminfo.h",
            "testsuite_cli_test.go",
            "testsuite_cli_test.go",
            "common.mk",
            "i3bar/include/draw_util.h"
        ],
        "reopen": false,
        "reopen_events": [
            [
                "2017-08-15 14:24:15",
                "closed"
            ],
            [
                "2017-08-15 14:24:15",
                "commit"
            ],
            [
                "2017-08-16 12:29:14",
                "commit"
            ]
        ],
        "status": true,
        "strategy": true,
        "total_changes": 291
    }
}