{
    "commits": [
        {
            "associated_pull_request": [
                "https://github.com/planck-repl/planck/pull/819"
            ],
            "date": "2018-10-07 17:56:37+00:00",
            "diff": "",
            "diff_additions": 0,
            "diff_deletions": 0,
            "diff_file_size": 0,
            "diff_url": "https://github.com/planck-repl/planck/commit/0cf75371604cb37b0f52da7fe1de0f8ec67d27cf.diff",
            "exists": true,
            "files": [],
            "interesting": {
                "reopen": false,
                "status": false
            },
            "is_parent": true,
            "sha": "0cf75371604cb37b0f52da7fe1de0f8ec67d27cf"
        },
        {
            "associated_pull_request": [],
            "date": "2018-10-07 18:46:26+00:00",
            "diff": "planck-repl_planck/issue_820/commit_d6cda1fa5c7a3381e23d06fd3f0898f82aaf5692.diff",
            "diff_additions": 3,
            "diff_deletions": 1,
            "diff_file_size": 24994,
            "diff_url": "https://github.com/planck-repl/planck/commit/d6cda1fa5c7a3381e23d06fd3f0898f82aaf5692.diff",
            "exists": true,
            "files": [
                {
                    "file_additions": 3,
                    "file_deletions": 1,
                    "file_exists": true,
                    "file_name": "planck-c/main.c",
                    "file_size": 24994
                }
            ],
            "interesting": {
                "reopen": false,
                "status": false
            },
            "is_parent": false,
            "sha": "d6cda1fa5c7a3381e23d06fd3f0898f82aaf5692"
        },
        {
            "associated_pull_request": [],
            "date": "2018-10-07 18:46:26+00:00",
            "diff": "planck-repl_planck/issue_820/commit_3f566ad2baadaaaf615ed4c728a968a0a98fe61b.diff",
            "diff_additions": 15,
            "diff_deletions": 3,
            "diff_file_size": 24994,
            "diff_url": "https://github.com/planck-repl/planck/commit/3f566ad2baadaaaf615ed4c728a968a0a98fe61b.diff",
            "exists": true,
            "files": [
                {
                    "file_additions": 15,
                    "file_deletions": 3,
                    "file_exists": true,
                    "file_name": "planck-c/main.c",
                    "file_size": 24994
                }
            ],
            "interesting": {
                "reopen": true,
                "status": false
            },
            "is_parent": false,
            "sha": "3f566ad2baadaaaf615ed4c728a968a0a98fe61b"
        },
        {
            "associated_pull_request": [],
            "date": "2018-10-07 18:46:26+00:00",
            "diff": "planck-repl_planck/issue_820/commit_5e95d2d019f34b4cab382fa233b722ca3a294f99.diff",
            "diff_additions": 15,
            "diff_deletions": 3,
            "diff_file_size": 24994,
            "diff_url": "https://github.com/planck-repl/planck/commit/5e95d2d019f34b4cab382fa233b722ca3a294f99.diff",
            "exists": true,
            "files": [
                {
                    "file_additions": 15,
                    "file_deletions": 3,
                    "file_exists": true,
                    "file_name": "planck-c/main.c",
                    "file_size": 24994
                }
            ],
            "interesting": {
                "reopen": false,
                "status": false
            },
            "is_parent": false,
            "sha": "5e95d2d019f34b4cab382fa233b722ca3a294f99"
        },
        {
            "associated_pull_request": [],
            "date": "2018-10-07 18:46:26+00:00",
            "diff": "planck-repl_planck/issue_820/commit_7f1af5620740fdae7e0b113c640d4af62ba2b322.diff",
            "diff_additions": 15,
            "diff_deletions": 3,
            "diff_file_size": 24994,
            "diff_url": "https://github.com/planck-repl/planck/commit/7f1af5620740fdae7e0b113c640d4af62ba2b322.diff",
            "exists": true,
            "files": [
                {
                    "file_additions": 15,
                    "file_deletions": 3,
                    "file_exists": true,
                    "file_name": "planck-c/main.c",
                    "file_size": 24994
                }
            ],
            "interesting": {
                "reopen": false,
                "status": false
            },
            "is_parent": false,
            "sha": "7f1af5620740fdae7e0b113c640d4af62ba2b322"
        },
        {
            "associated_pull_request": [],
            "date": "2019-04-27 12:55:52+00:00",
            "diff": "planck-repl_planck/issue_820/commit_ac1904b322ab6fd18b0da76b86461651354b1503.diff",
            "diff_additions": 15,
            "diff_deletions": 3,
            "diff_file_size": 24994,
            "diff_url": "https://github.com/planck-repl/planck/commit/ac1904b322ab6fd18b0da76b86461651354b1503.diff",
            "exists": true,
            "files": [
                {
                    "file_additions": 15,
                    "file_deletions": 3,
                    "file_exists": true,
                    "file_name": "planck-c/main.c",
                    "file_size": 24994
                }
            ],
            "interesting": {
                "reopen": false,
                "status": false
            },
            "is_parent": false,
            "sha": "ac1904b322ab6fd18b0da76b86461651354b1503"
        },
        {
            "associated_pull_request": [],
            "date": "2019-04-27 12:55:52+00:00",
            "diff": "planck-repl_planck/issue_820/commit_d88ac1e19cdaa41458192edc9351c2cec9bdeed7.diff",
            "diff_additions": 15,
            "diff_deletions": 3,
            "diff_file_size": 24994,
            "diff_url": "https://github.com/planck-repl/planck/commit/d88ac1e19cdaa41458192edc9351c2cec9bdeed7.diff",
            "exists": true,
            "files": [
                {
                    "file_additions": 15,
                    "file_deletions": 3,
                    "file_exists": true,
                    "file_name": "planck-c/main.c",
                    "file_size": 24994
                }
            ],
            "interesting": {
                "reopen": false,
                "status": false
            },
            "is_parent": false,
            "sha": "d88ac1e19cdaa41458192edc9351c2cec9bdeed7"
        },
        {
            "associated_pull_request": [],
            "date": "2019-04-27 12:55:52+00:00",
            "diff": "planck-repl_planck/issue_820/commit_f4753b78745c431f2d5224ab6807020b17530742.diff",
            "diff_additions": 15,
            "diff_deletions": 3,
            "diff_file_size": 24994,
            "diff_url": "https://github.com/planck-repl/planck/commit/f4753b78745c431f2d5224ab6807020b17530742.diff",
            "exists": true,
            "files": [
                {
                    "file_additions": 15,
                    "file_deletions": 3,
                    "file_exists": true,
                    "file_name": "planck-c/main.c",
                    "file_size": 24994
                }
            ],
            "interesting": {
                "reopen": false,
                "status": false
            },
            "is_parent": false,
            "sha": "f4753b78745c431f2d5224ab6807020b17530742"
        },
        {
            "associated_pull_request": [
                "https://github.com/planck-repl/planck/pull/918"
            ],
            "date": "2019-04-27 12:55:52+00:00",
            "diff": "planck-repl_planck/issue_820/commit_59305fbac8296ccabe6ce53641971909cea159d1.diff",
            "diff_additions": 15,
            "diff_deletions": 3,
            "diff_file_size": 24994,
            "diff_url": "https://github.com/planck-repl/planck/commit/59305fbac8296ccabe6ce53641971909cea159d1.diff",
            "exists": true,
            "files": [
                {
                    "file_additions": 15,
                    "file_deletions": 3,
                    "file_exists": true,
                    "file_name": "planck-c/main.c",
                    "file_size": 24994
                }
            ],
            "interesting": {
                "reopen": false,
                "status": false
            },
            "is_parent": false,
            "sha": "59305fbac8296ccabe6ce53641971909cea159d1"
        },
        {
            "associated_pull_request": [
                "https://github.com/planck-repl/planck/pull/918"
            ],
            "date": "2019-04-27 16:29:47+00:00",
            "diff": "planck-repl_planck/issue_820/commit_89b07d855b6a66fadde32728281df2347bbe8933.diff",
            "diff_additions": 15,
            "diff_deletions": 3,
            "diff_file_size": 24994,
            "diff_url": "https://github.com/planck-repl/planck/commit/89b07d855b6a66fadde32728281df2347bbe8933.diff",
            "exists": true,
            "files": [
                {
                    "file_additions": 15,
                    "file_deletions": 3,
                    "file_exists": true,
                    "file_name": "planck-c/main.c",
                    "file_size": 24994
                }
            ],
            "interesting": {
                "reopen": false,
                "status": false
            },
            "is_parent": false,
            "sha": "89b07d855b6a66fadde32728281df2347bbe8933"
        }
    ],
    "first_commit": "2018-10-07 17:56:37+00:00",
    "last_commit": "2019-04-27 16:29:47+00:00",
    "number": 820,
    "pull_request": "None",
    "score": {
        "accidental_reopen_likely": false,
        "all_labels": [],
        "contains_keywords": [
            "issu",
            "test",
            "fault",
            "warn",
            "crash"
        ],
        "fix_size": 22,
        "has_labels": [],
        "intersecting": {
            "computed_score": 1.0,
            "final_commit_size": 19,
            "intersection_size": 19,
            "previous_commits_size": 22
        },
        "is_makefile_based": false,
        "no_new_files": [],
        "no_other_files": false,
        "num_prohibited_files": 555318,
        "prohibited_files": [
            "server/src/main/java/com/genymobile/scrcpy/Device.java",
            "server/src/main/java/com/genymobile/scrcpy/wrappers/SurfaceControl.java",
            "server/src/main/java/com/genymobile/scrcpy/Device.java",
            "server/src/main/java/com/genymobile/scrcpy/wrappers/SurfaceControl.java",
            "app/meson.build",
            "app/scrcpy.1",
            "app/src/common.h",
            "app/src/scrcpy.h",
            "app/src/server.h",
            "server/src/main/java/com/genymobile/scrcpy/Workarounds.java"
        ],
        "reopen": true,
        "reopen_events": [
            [
                "2018-10-07 18:46:35+00:00",
                "commit"
            ],
            [
                "2018-10-07 18:53:46+00:00",
                "commit"
            ],
            [
                "2018-10-07 19:34:10+00:00",
                "commit"
            ],
            [
                "2018-10-07 19:54:13+00:00",
                "closed"
            ],
            [
                "2018-10-15 12:11:38+00:00",
                "reopened"
            ],
            [
                "2018-10-15 12:39:23+00:00",
                "commit"
            ],
            [
                "2018-10-15 12:40:44+00:00",
                "commit"
            ],
            [
                "2019-04-27 12:56:43+00:00",
                "commit"
            ],
            [
                "2019-04-27 14:01:54+00:00",
                "commit"
            ],
            [
                "2019-04-27 14:40:22+00:00",
                "commit"
            ],
            [
                "2019-04-27 15:44:06+00:00",
                "commit"
            ],
            [
                "2019-04-27 16:29:48+00:00",
                "closed"
            ],
            [
                "2019-04-27 16:29:49+00:00",
                "commit"
            ]
        ],
        "status": false,
        "strategy": true,
        "total_changes": 148
    }
}