{
    "commits": [
        {
            "associated_pull_request": [
                "https://github.com/projectacrn/acrn-hypervisor/pull/4942"
            ],
            "date": "2020-06-15 19:08:09+00:00",
            "diff": "",
            "diff_additions": 0,
            "diff_deletions": 0,
            "diff_file_size": 0,
            "diff_url": "https://github.com/projectacrn/acrn-hypervisor/commit/13e8e3c7f22fa7396fdb2e4d76236fde4d27f684.diff",
            "exists": true,
            "files": [],
            "interesting": {
                "reopen": false,
                "status": false
            },
            "is_parent": true,
            "sha": "13e8e3c7f22fa7396fdb2e4d76236fde4d27f684"
        },
        {
            "associated_pull_request": [],
            "date": "2020-06-14 21:55:16+00:00",
            "diff": "projectacrn_acrn-hypervisor/issue_4945/commit_481e286975e4e4956da42947b8f9d401640d7fb2.diff",
            "diff_additions": 63,
            "diff_deletions": 6,
            "diff_file_size": 30463,
            "diff_url": "https://github.com/projectacrn/acrn-hypervisor/commit/481e286975e4e4956da42947b8f9d401640d7fb2.diff",
            "exists": true,
            "files": [
                {
                    "file_additions": 63,
                    "file_deletions": 6,
                    "file_exists": true,
                    "file_name": "devicemodel/hw/pci/virtio/virtio_net.c",
                    "file_size": 30463
                }
            ],
            "interesting": {
                "reopen": false,
                "status": false
            },
            "is_parent": false,
            "sha": "481e286975e4e4956da42947b8f9d401640d7fb2"
        },
        {
            "associated_pull_request": [],
            "date": "2020-06-14 21:55:16+00:00",
            "diff": "projectacrn_acrn-hypervisor/issue_4945/commit_0839335be99748245bfcd8c3379871dfd9dbf7ab.diff",
            "diff_additions": 69,
            "diff_deletions": 6,
            "diff_file_size": 30463,
            "diff_url": "https://github.com/projectacrn/acrn-hypervisor/commit/0839335be99748245bfcd8c3379871dfd9dbf7ab.diff",
            "exists": true,
            "files": [
                {
                    "file_additions": 69,
                    "file_deletions": 6,
                    "file_exists": true,
                    "file_name": "devicemodel/hw/pci/virtio/virtio_net.c",
                    "file_size": 30463
                }
            ],
            "interesting": {
                "reopen": true,
                "status": false
            },
            "is_parent": false,
            "sha": "0839335be99748245bfcd8c3379871dfd9dbf7ab"
        },
        {
            "associated_pull_request": [
                "https://github.com/projectacrn/acrn-hypervisor/pull/5031"
            ],
            "date": "2020-06-14 21:55:16+00:00",
            "diff": "projectacrn_acrn-hypervisor/issue_4945/commit_516a3911eab3c53aba6e509a745fff2610e8f689.diff",
            "diff_additions": 72,
            "diff_deletions": 7,
            "diff_file_size": 30463,
            "diff_url": "https://github.com/projectacrn/acrn-hypervisor/commit/516a3911eab3c53aba6e509a745fff2610e8f689.diff",
            "exists": true,
            "files": [
                {
                    "file_additions": 72,
                    "file_deletions": 7,
                    "file_exists": true,
                    "file_name": "devicemodel/hw/pci/virtio/virtio_net.c",
                    "file_size": 30463
                }
            ],
            "interesting": {
                "reopen": false,
                "status": false
            },
            "is_parent": false,
            "sha": "516a3911eab3c53aba6e509a745fff2610e8f689"
        },
        {
            "associated_pull_request": [
                "https://github.com/projectacrn/acrn-hypervisor/pull/5031"
            ],
            "date": "2020-06-14 21:55:16+00:00",
            "diff": "projectacrn_acrn-hypervisor/issue_4945/commit_3c9469d98a58c9a2a36fa9d58d3e0a76ffa1cc9f.diff",
            "diff_additions": 72,
            "diff_deletions": 7,
            "diff_file_size": 30463,
            "diff_url": "https://github.com/projectacrn/acrn-hypervisor/commit/3c9469d98a58c9a2a36fa9d58d3e0a76ffa1cc9f.diff",
            "exists": true,
            "files": [
                {
                    "file_additions": 72,
                    "file_deletions": 7,
                    "file_exists": true,
                    "file_name": "devicemodel/hw/pci/virtio/virtio_net.c",
                    "file_size": 30463
                }
            ],
            "interesting": {
                "reopen": false,
                "status": false
            },
            "is_parent": false,
            "sha": "3c9469d98a58c9a2a36fa9d58d3e0a76ffa1cc9f"
        }
    ],
    "first_commit": "2020-06-15 19:30:36+00:00",
    "last_commit": "2020-07-28 22:00:18+00:00",
    "number": 4945,
    "pull_request": "None",
    "score": {
        "accidental_reopen_likely": false,
        "all_labels": [
            "type: feature"
        ],
        "contains_keywords": [
            "work",
            "fix",
            "issu",
            "patch"
        ],
        "fix_size": 86,
        "has_labels": [],
        "intersecting": {
            "computed_score": 1.0,
            "final_commit_size": 75,
            "intersection_size": 75,
            "previous_commits_size": 86
        },
        "is_makefile_based": true,
        "no_new_files": [],
        "no_other_files": true,
        "num_prohibited_files": 228972,
        "prohibited_files": [
            "server/src/main/java/com/genymobile/scrcpy/Device.java",
            "server/src/main/java/com/genymobile/scrcpy/wrappers/SurfaceControl.java",
            "server/src/main/java/com/genymobile/scrcpy/Device.java",
            "server/src/main/java/com/genymobile/scrcpy/wrappers/SurfaceControl.java",
            "app/meson.build",
            "app/scrcpy.1",
            "app/src/common.h",
            "app/src/scrcpy.h",
            "app/src/server.h",
            "server/src/main/java/com/genymobile/scrcpy/Workarounds.java"
        ],
        "reopen": true,
        "reopen_events": [
            [
                "2020-06-16 00:36:56+00:00",
                "commit"
            ],
            [
                "2020-06-19 02:17:02+00:00",
                "commit"
            ],
            [
                "2020-06-28 05:05:31+00:00",
                "closed"
            ],
            [
                "2020-06-28 05:06:15+00:00",
                "reopened"
            ],
            [
                "2020-07-13 17:55:12+00:00",
                "commit"
            ],
            [
                "2020-07-14 05:02:23+00:00",
                "commit"
            ],
            [
                "2020-07-20 07:12:44+00:00",
                "commit"
            ],
            [
                "2020-07-20 16:43:41+00:00",
                "commit"
            ],
            [
                "2020-07-28 03:15:08+00:00",
                "commit"
            ],
            [
                "2020-07-28 20:41:38+00:00",
                "commit"
            ],
            [
                "2020-07-28 21:44:13+00:00",
                "commit"
            ],
            [
                "2020-07-28 22:00:21+00:00",
                "commit"
            ],
            [
                "2022-07-05 06:21:51+00:00",
                "closed"
            ]
        ],
        "status": false,
        "strategy": true,
        "total_changes": 302
    }
}