{
    "covered_issues": [
        577,
        576,
        573,
        572,
        571,
        570,
        568,
        566,
        562,
        560,
        557,
        555,
        548,
        544,
        538,
        537,
        533,
        532,
        528,
        527,
        521,
        520,
        518,
        514,
        511,
        508,
        507,
        496,
        495,
        493,
        491,
        490,
        489,
        480,
        478,
        469,
        462,
        460,
        454,
        452,
        451,
        450,
        447,
        442,
        432,
        431,
        428,
        425,
        423,
        421,
        420,
        419,
        416,
        414,
        413,
        412,
        404,
        400,
        395,
        392,
        391,
        388,
        380,
        378,
        376,
        375,
        367,
        366,
        365,
        362,
        361,
        359,
        357,
        355,
        350,
        339,
        337,
        336,
        335,
        334,
        323,
        318,
        314,
        312,
        305,
        301,
        297,
        294,
        291,
        287,
        284,
        279,
        264,
        263,
        259,
        258,
        256,
        255,
        248,
        247,
        246,
        244,
        243,
        242,
        241,
        240,
        239,
        238,
        235,
        230,
        224,
        222,
        219,
        218,
        217,
        216,
        215,
        214,
        213,
        212,
        209,
        208,
        205,
        204,
        203,
        200,
        199,
        198,
        195,
        193,
        192,
        188,
        187,
        184,
        172,
        164,
        157,
        153,
        151,
        142,
        136,
        134,
        116,
        114,
        111,
        106,
        105,
        103,
        102,
        101,
        99,
        97,
        96,
        95,
        94,
        93,
        92,
        90,
        89,
        88,
        83,
        81,
        80,
        76,
        75,
        74,
        72,
        71,
        68,
        66,
        64,
        56,
        55,
        50,
        49,
        48,
        47,
        46,
        45,
        42,
        40,
        35,
        33,
        32,
        23,
        22,
        21,
        17,
        10
    ],
    "finished": true
}