{
    "commits": [
        {
            "diff": "spring-projects_spring-boot/issue_162/commit_e9c649dfb2b1653f5e4f2fed421aa053e6fd42ce.diff",
            "diff_additions": 11,
            "diff_deletions": 1,
            "diff_file_size": 0,
            "files": [
                {
                    "file_additions": 0,
                    "file_deletions": 1,
                    "file_exists": false,
                    "file_name": "spring-boot/src/main/java/org/springframework/boot/logging/AbstractLoggingSystem.java",
                    "file_size": 0
                },
                {
                    "file_additions": 11,
                    "file_deletions": 0,
                    "file_exists": false,
                    "file_name": "spring-boot/src/main/java/org/springframework/boot/logging/log4j/Log4JLoggingSystem.java",
                    "file_size": 0
                }
            ],
            "interesting": {
                "reopened": false,
                "status": true
            },
            "sha": "e9c649dfb2b1653f5e4f2fed421aa053e6fd42ce"
        },
        {
            "diff": "spring-projects_spring-boot/issue_162/commit_60cb5fd35c67d194ab78b3d4703faa946408ea6e.diff",
            "diff_additions": 240,
            "diff_deletions": 0,
            "diff_file_size": 0,
            "files": [
                {
                    "file_additions": 32,
                    "file_deletions": 0,
                    "file_exists": false,
                    "file_name": "spring-boot-samples/spring-boot-sample-actuator-log4j/src/main/java/org/springframework/boot/sample/actuator/log4j/HelloWorldService.java",
                    "file_size": 0
                },
                {
                    "file_additions": 35,
                    "file_deletions": 0,
                    "file_exists": false,
                    "file_name": "spring-boot-samples/spring-boot-sample-actuator-log4j/src/main/java/org/springframework/boot/sample/actuator/log4j/SampleActuatorApplication.java",
                    "file_size": 0
                },
                {
                    "file_additions": 45,
                    "file_deletions": 0,
                    "file_exists": false,
                    "file_name": "spring-boot-samples/spring-boot-sample-actuator-log4j/src/main/java/org/springframework/boot/sample/actuator/log4j/SampleController.java",
                    "file_size": 0
                },
                {
                    "file_additions": 36,
                    "file_deletions": 0,
                    "file_exists": false,
                    "file_name": "spring-boot-samples/spring-boot-sample-actuator-log4j/src/main/java/org/springframework/boot/sample/actuator/log4j/ServiceProperties.java",
                    "file_size": 0
                },
                {
                    "file_additions": 92,
                    "file_deletions": 0,
                    "file_exists": false,
                    "file_name": "spring-boot-samples/spring-boot-sample-actuator-log4j/src/test/java/org/springframework/boot/sample/actuator/log4j/SampleActuatorApplicationTests.java",
                    "file_size": 0
                }
            ],
            "interesting": {
                "reopened": true,
                "status": true
            },
            "sha": "60cb5fd35c67d194ab78b3d4703faa946408ea6e"
        },
        {
            "diff": "spring-projects_spring-boot/issue_162/commit_aee42fcc18562d3c1e127b2b73d08e0e56dc9126.diff",
            "diff_additions": 5,
            "diff_deletions": 1,
            "diff_file_size": 0,
            "files": [
                {
                    "file_additions": 5,
                    "file_deletions": 1,
                    "file_exists": false,
                    "file_name": "spring-boot/src/main/java/org/springframework/boot/logging/logback/LogbackLoggingSystem.java",
                    "file_size": 0
                }
            ],
            "interesting": {
                "reopened": false,
                "status": false
            },
            "sha": "aee42fcc18562d3c1e127b2b73d08e0e56dc9126"
        },
        {
            "diff": "spring-projects_spring-boot/issue_162/commit_d4131a67bf9f10634bf6fd09debc1f81cfafbc6c.diff",
            "diff_additions": 240,
            "diff_deletions": 0,
            "diff_file_size": 0,
            "files": [
                {
                    "file_additions": 32,
                    "file_deletions": 0,
                    "file_exists": false,
                    "file_name": "spring-boot-samples/spring-boot-sample-actuator-log4j/src/main/java/org/springframework/boot/sample/actuator/log4j/HelloWorldService.java",
                    "file_size": 0
                },
                {
                    "file_additions": 35,
                    "file_deletions": 0,
                    "file_exists": false,
                    "file_name": "spring-boot-samples/spring-boot-sample-actuator-log4j/src/main/java/org/springframework/boot/sample/actuator/log4j/SampleActuatorApplication.java",
                    "file_size": 0
                },
                {
                    "file_additions": 45,
                    "file_deletions": 0,
                    "file_exists": false,
                    "file_name": "spring-boot-samples/spring-boot-sample-actuator-log4j/src/main/java/org/springframework/boot/sample/actuator/log4j/SampleController.java",
                    "file_size": 0
                },
                {
                    "file_additions": 36,
                    "file_deletions": 0,
                    "file_exists": false,
                    "file_name": "spring-boot-samples/spring-boot-sample-actuator-log4j/src/main/java/org/springframework/boot/sample/actuator/log4j/ServiceProperties.java",
                    "file_size": 0
                },
                {
                    "file_additions": 92,
                    "file_deletions": 0,
                    "file_exists": false,
                    "file_name": "spring-boot-samples/spring-boot-sample-actuator-log4j/src/test/java/org/springframework/boot/sample/actuator/log4j/SampleActuatorApplicationTests.java",
                    "file_size": 0
                }
            ],
            "interesting": {
                "reopened": false,
                "status": false
            },
            "sha": "d4131a67bf9f10634bf6fd09debc1f81cfafbc6c"
        },
        {
            "diff": "spring-projects_spring-boot/issue_162/commit_5c14493a97e3fc3f39e309b3853ff765581a18bc.diff",
            "diff_additions": 5,
            "diff_deletions": 1,
            "diff_file_size": 0,
            "files": [
                {
                    "file_additions": 5,
                    "file_deletions": 1,
                    "file_exists": false,
                    "file_name": "spring-boot/src/main/java/org/springframework/boot/logging/logback/LogbackLoggingSystem.java",
                    "file_size": 0
                }
            ],
            "interesting": {
                "reopened": false,
                "status": false
            },
            "sha": "5c14493a97e3fc3f39e309b3853ff765581a18bc"
        }
    ],
    "first_commit": "2013-12-16 16:21:08",
    "last_commit": "2013-12-24 09:54:35",
    "number": 162,
    "score": 144.0079365079365
}