{
    "covered_issues": [
        82,
        80,
        66,
        59,
        58,
        57,
        56,
        50,
        45,
        43,
        42,
        41,
        38,
        37,
        36,
        35,
        34,
        32,
        31,
        30,
        29,
        28,
        27,
        26,
        25,
        24,
        23,
        21,
        20,
        19,
        18,
        17,
        16,
        15,
        14,
        13,
        12,
        11,
        10,
        9,
        8,
        6,
        5,
        4,
        3,
        2,
        1
    ],
    "finished": true
}