{
    "commits": [
        {
            "associated_pull_request": [
                "https://github.com/alliedmodders/sourcemod/pull/903"
            ],
            "date": "2018-10-10 12:35:17+00:00",
            "diff": "alliedmodders_sourcemod/issue_892/commit_7dd733cf46ab781ce548fe1c7b1a16f8606d3147.diff",
            "diff_additions": 2,
            "diff_deletions": 2,
            "diff_file_size": 13802,
            "diff_url": "https://github.com/alliedmodders/sourcemod/commit/7dd733cf46ab781ce548fe1c7b1a16f8606d3147.diff",
            "exists": true,
            "files": [
                {
                    "file_additions": 2,
                    "file_deletions": 2,
                    "file_exists": true,
                    "file_name": "core/logic/smn_fakenatives.cpp",
                    "file_size": 13802
                }
            ],
            "interesting": {
                "reopen": false,
                "status": false
            },
            "is_parent": true,
            "sha": "7dd733cf46ab781ce548fe1c7b1a16f8606d3147"
        },
        {
            "associated_pull_request": [],
            "date": "2018-10-10 23:03:34+00:00",
            "diff": "alliedmodders_sourcemod/issue_892/commit_a4e169aa8fb534be30a130654fe589371e6cb935.diff",
            "diff_additions": 95,
            "diff_deletions": 1,
            "diff_file_size": 20742,
            "diff_url": "https://github.com/alliedmodders/sourcemod/commit/a4e169aa8fb534be30a130654fe589371e6cb935.diff",
            "exists": true,
            "files": [
                {
                    "file_additions": 95,
                    "file_deletions": 1,
                    "file_exists": true,
                    "file_name": "core/logic/smn_maplists.cpp",
                    "file_size": 20742
                }
            ],
            "interesting": {
                "reopen": false,
                "status": false
            },
            "is_parent": false,
            "sha": "a4e169aa8fb534be30a130654fe589371e6cb935"
        },
        {
            "associated_pull_request": [],
            "date": "2018-10-10 23:04:46+00:00",
            "diff": "alliedmodders_sourcemod/issue_892/commit_a659896f8acaa7d82839b209369a44c187300d91.diff",
            "diff_additions": 1,
            "diff_deletions": 95,
            "diff_file_size": 20742,
            "diff_url": "https://github.com/alliedmodders/sourcemod/commit/a659896f8acaa7d82839b209369a44c187300d91.diff",
            "exists": true,
            "files": [
                {
                    "file_additions": 1,
                    "file_deletions": 95,
                    "file_exists": true,
                    "file_name": "core/logic/smn_maplists.cpp",
                    "file_size": 20742
                }
            ],
            "interesting": {
                "reopen": true,
                "status": false
            },
            "is_parent": false,
            "sha": "a659896f8acaa7d82839b209369a44c187300d91"
        },
        {
            "associated_pull_request": [],
            "date": "2018-10-10 23:03:34+00:00",
            "diff": "alliedmodders_sourcemod/issue_892/commit_ef77973633f75e817b25b4d738a384fe41b170fb.diff",
            "diff_additions": 95,
            "diff_deletions": 1,
            "diff_file_size": 20742,
            "diff_url": "https://github.com/alliedmodders/sourcemod/commit/ef77973633f75e817b25b4d738a384fe41b170fb.diff",
            "exists": true,
            "files": [
                {
                    "file_additions": 95,
                    "file_deletions": 1,
                    "file_exists": true,
                    "file_name": "core/logic/smn_maplists.cpp",
                    "file_size": 20742
                }
            ],
            "interesting": {
                "reopen": false,
                "status": false
            },
            "is_parent": false,
            "sha": "ef77973633f75e817b25b4d738a384fe41b170fb"
        },
        {
            "associated_pull_request": [
                "https://github.com/alliedmodders/sourcemod/pull/907"
            ],
            "date": "2018-10-10 23:03:34+00:00",
            "diff": "alliedmodders_sourcemod/issue_892/commit_9f72399a6ab0b1f304dde00f727d6bc2b2326385.diff",
            "diff_additions": 101,
            "diff_deletions": 1,
            "diff_file_size": 20742,
            "diff_url": "https://github.com/alliedmodders/sourcemod/commit/9f72399a6ab0b1f304dde00f727d6bc2b2326385.diff",
            "exists": true,
            "files": [
                {
                    "file_additions": 101,
                    "file_deletions": 1,
                    "file_exists": true,
                    "file_name": "core/logic/smn_maplists.cpp",
                    "file_size": 20742
                }
            ],
            "interesting": {
                "reopen": false,
                "status": false
            },
            "is_parent": false,
            "sha": "9f72399a6ab0b1f304dde00f727d6bc2b2326385"
        },
        {
            "associated_pull_request": [
                "https://github.com/alliedmodders/sourcemod/pull/907"
            ],
            "date": "2018-10-11 14:20:10+00:00",
            "diff": "alliedmodders_sourcemod/issue_892/commit_c1d235a59cd368efe3174bcc0ce0a9137c340ca1.diff",
            "diff_additions": 101,
            "diff_deletions": 1,
            "diff_file_size": 20742,
            "diff_url": "https://github.com/alliedmodders/sourcemod/commit/c1d235a59cd368efe3174bcc0ce0a9137c340ca1.diff",
            "exists": true,
            "files": [
                {
                    "file_additions": 101,
                    "file_deletions": 1,
                    "file_exists": true,
                    "file_name": "core/logic/smn_maplists.cpp",
                    "file_size": 20742
                }
            ],
            "interesting": {
                "reopen": false,
                "status": false
            },
            "is_parent": false,
            "sha": "c1d235a59cd368efe3174bcc0ce0a9137c340ca1"
        }
    ],
    "first_commit": "2018-10-10 12:35:17+00:00",
    "last_commit": "2018-10-11 14:20:10+00:00",
    "number": 892,
    "pull_request": "None",
    "score": {
        "accidental_reopen_likely": false,
        "all_labels": [
            "Feature Request"
        ],
        "contains_keywords": [
            "fail"
        ],
        "fix_size": 102,
        "has_labels": [],
        "intersecting": {
            "computed_score": 1.0,
            "final_commit_size": 102,
            "intersection_size": 102,
            "previous_commits_size": 102
        },
        "is_makefile_based": false,
        "no_new_files": [],
        "no_other_files": true,
        "num_prohibited_files": 408219,
        "prohibited_files": [
            "server/src/main/java/com/genymobile/scrcpy/Device.java",
            "server/src/main/java/com/genymobile/scrcpy/wrappers/SurfaceControl.java",
            "server/src/main/java/com/genymobile/scrcpy/Device.java",
            "server/src/main/java/com/genymobile/scrcpy/wrappers/SurfaceControl.java",
            "app/meson.build",
            "app/scrcpy.1",
            "app/src/common.h",
            "app/src/scrcpy.h",
            "app/src/server.h",
            "server/src/main/java/com/genymobile/scrcpy/Workarounds.java"
        ],
        "reopen": true,
        "reopen_events": [
            [
                "2018-10-10 23:04:18+00:00",
                "closed"
            ],
            [
                "2018-10-10 23:04:18+00:00",
                "commit"
            ],
            [
                "2018-10-10 23:04:57+00:00",
                "commit"
            ],
            [
                "2018-10-10 23:07:04+00:00",
                "reopened"
            ],
            [
                "2018-10-10 23:07:29+00:00",
                "commit"
            ],
            [
                "2018-10-10 23:10:51+00:00",
                "commit"
            ],
            [
                "2018-10-11 11:46:46+00:00",
                "commit"
            ],
            [
                "2018-10-11 14:20:15+00:00",
                "closed"
            ],
            [
                "2018-10-11 14:20:15+00:00",
                "commit"
            ]
        ],
        "status": false,
        "strategy": true,
        "total_changes": 496
    }
}