{
    "commits": [
        {
            "diff": "google_guava/issue_2132/commit_1b0831c9f9229cd7049e24b2f62360b5e05bd78f.diff",
            "diff_additions": 1,
            "diff_deletions": 86,
            "diff_file_size": 85015,
            "files": [
                {
                    "file_additions": 0,
                    "file_deletions": 79,
                    "file_exists": true,
                    "file_name": "guava-gwt/src-super/com/google/common/collect/super/com/google/common/collect/Platform.java",
                    "file_size": 3820
                },
                {
                    "file_additions": 0,
                    "file_deletions": 6,
                    "file_exists": true,
                    "file_name": "guava/src/com/google/common/collect/Platform.java",
                    "file_size": 4959
                },
                {
                    "file_additions": 1,
                    "file_deletions": 1,
                    "file_exists": true,
                    "file_name": "guava/src/com/google/common/collect/Sets.java",
                    "file_size": 76236
                }
            ],
            "interesting": {
                "reopened": false,
                "status": false
            },
            "sha": "1b0831c9f9229cd7049e24b2f62360b5e05bd78f"
        },
        {
            "diff": "google_guava/issue_2132/commit_029eb13430c5767cde168bffa435fa0c5f885a5b.diff",
            "diff_additions": 65,
            "diff_deletions": 24,
            "diff_file_size": 47258,
            "files": [
                {
                    "file_additions": 65,
                    "file_deletions": 24,
                    "file_exists": true,
                    "file_name": "guava/src/com/google/common/net/MediaType.java",
                    "file_size": 47258
                }
            ],
            "interesting": {
                "reopened": false,
                "status": false
            },
            "sha": "029eb13430c5767cde168bffa435fa0c5f885a5b"
        },
        {
            "diff": "google_guava/issue_2132/commit_e382548a4914c1d3b07bebf3f8537a2ffd527fd5.diff",
            "diff_additions": 105,
            "diff_deletions": 66,
            "diff_file_size": 47258,
            "files": [
                {
                    "file_additions": 105,
                    "file_deletions": 66,
                    "file_exists": true,
                    "file_name": "guava/src/com/google/common/net/MediaType.java",
                    "file_size": 47258
                }
            ],
            "interesting": {
                "reopened": false,
                "status": false
            },
            "sha": "e382548a4914c1d3b07bebf3f8537a2ffd527fd5"
        },
        {
            "diff": "google_guava/issue_2132/commit_3b727e8649269a1213477a971083c0731189fbcd.diff",
            "diff_additions": 104,
            "diff_deletions": 66,
            "diff_file_size": 47258,
            "files": [
                {
                    "file_additions": 104,
                    "file_deletions": 66,
                    "file_exists": true,
                    "file_name": "guava/src/com/google/common/net/MediaType.java",
                    "file_size": 47258
                }
            ],
            "interesting": {
                "reopened": false,
                "status": false
            },
            "sha": "3b727e8649269a1213477a971083c0731189fbcd"
        },
        {
            "diff": "google_guava/issue_2132/commit_a71994767c4286527bbfe57d0da509e1cf7f6027.diff",
            "diff_additions": 67,
            "diff_deletions": 29,
            "diff_file_size": 47258,
            "files": [
                {
                    "file_additions": 67,
                    "file_deletions": 29,
                    "file_exists": true,
                    "file_name": "guava/src/com/google/common/net/MediaType.java",
                    "file_size": 47258
                }
            ],
            "interesting": {
                "reopened": false,
                "status": false
            },
            "sha": "a71994767c4286527bbfe57d0da509e1cf7f6027"
        },
        {
            "diff": "google_guava/issue_2132/commit_6c39f7156eda1d93141c7bb0b5f36348db6442c7.diff",
            "diff_additions": 59,
            "diff_deletions": 6,
            "diff_file_size": 47258,
            "files": [
                {
                    "file_additions": 59,
                    "file_deletions": 6,
                    "file_exists": true,
                    "file_name": "guava/src/com/google/common/net/MediaType.java",
                    "file_size": 47258
                }
            ],
            "interesting": {
                "reopened": false,
                "status": true
            },
            "sha": "6c39f7156eda1d93141c7bb0b5f36348db6442c7"
        },
        {
            "diff": "google_guava/issue_2132/commit_c72972d162e161284f3516c69066752d6e19b791.diff",
            "diff_additions": 85,
            "diff_deletions": 0,
            "diff_file_size": 47258,
            "files": [
                {
                    "file_additions": 85,
                    "file_deletions": 0,
                    "file_exists": true,
                    "file_name": "guava/src/com/google/common/net/MediaType.java",
                    "file_size": 47258
                }
            ],
            "interesting": {
                "reopened": false,
                "status": false
            },
            "sha": "c72972d162e161284f3516c69066752d6e19b791"
        },
        {
            "diff": "google_guava/issue_2132/commit_445c56885ce2616cf2b7690d8331964a3e099e85.diff",
            "diff_additions": 8,
            "diff_deletions": 0,
            "diff_file_size": 47258,
            "files": [
                {
                    "file_additions": 8,
                    "file_deletions": 0,
                    "file_exists": true,
                    "file_name": "guava/src/com/google/common/net/MediaType.java",
                    "file_size": 47258
                }
            ],
            "interesting": {
                "reopened": false,
                "status": false
            },
            "sha": "445c56885ce2616cf2b7690d8331964a3e099e85"
        }
    ],
    "first_commit": "2016-01-06 16:11:26",
    "last_commit": "2016-01-21 15:29:43",
    "number": 2132,
    "score": 352.00518806744486
}