{
    "covered_issues": [
        119,
        107,
        100,
        97,
        96,
        95,
        92,
        82,
        81,
        80,
        73,
        71,
        68,
        61,
        58,
        53,
        46,
        40,
        35,
        34,
        33,
        32,
        31,
        30,
        26,
        22,
        18,
        7
    ],
    "finished": true
}