{
    "covered_issues": [
        105,
        104,
        103,
        99,
        98,
        97,
        96,
        94,
        88,
        87,
        86,
        84,
        83,
        80,
        79,
        77,
        76,
        74,
        73,
        72,
        71,
        66,
        62,
        60,
        59,
        58,
        57,
        55,
        54,
        52,
        51,
        50,
        49,
        48,
        45,
        43,
        42,
        39,
        37,
        36,
        34,
        32,
        29,
        28,
        20,
        19,
        18,
        17,
        16,
        14,
        13,
        9,
        7,
        6,
        5,
        4,
        3
    ],
    "finished": true
}