{
    "commits": [
        {
            "associated_pull_request": [],
            "date": "2019-07-25 17:34:21+00:00",
            "diff": "",
            "diff_additions": 0,
            "diff_deletions": 0,
            "diff_file_size": 0,
            "diff_url": "https://github.com/AFLplusplus/AFLplusplus/commit/b83ce04bd73d9f2eee34835760ba61a8961de911.diff",
            "exists": true,
            "files": [],
            "interesting": {
                "reopen": false,
                "status": false
            },
            "is_parent": true,
            "sha": "b83ce04bd73d9f2eee34835760ba61a8961de911"
        },
        {
            "associated_pull_request": [
                "https://github.com/AFLplusplus/AFLplusplus/pull/1585"
            ],
            "date": "2022-07-22 12:20:59+00:00",
            "diff": "aflplusplus_aflplusplus/issue_2/commit_b6c1e20b6dbc0af3423841a07fdf547576a07a4c.diff",
            "diff_additions": 765,
            "diff_deletions": 132,
            "diff_file_size": 68900,
            "diff_url": "https://github.com/AFLplusplus/AFLplusplus/commit/b6c1e20b6dbc0af3423841a07fdf547576a07a4c.diff",
            "exists": true,
            "files": [
                {
                    "file_additions": 765,
                    "file_deletions": 132,
                    "file_exists": true,
                    "file_name": "src/afl-fuzz-redqueen.c",
                    "file_size": 68900
                }
            ],
            "interesting": {
                "reopen": false,
                "status": false
            },
            "is_parent": false,
            "sha": "b6c1e20b6dbc0af3423841a07fdf547576a07a4c"
        },
        {
            "associated_pull_request": [
                "https://github.com/AFLplusplus/AFLplusplus/pull/1711"
            ],
            "date": "2023-04-21 14:48:47+00:00",
            "diff": "aflplusplus_aflplusplus/issue_2/commit_e99d4ba976721127e16493a6b5ad8387fdaa9821.diff",
            "diff_additions": 76,
            "diff_deletions": 4,
            "diff_file_size": 64282,
            "diff_url": "https://github.com/AFLplusplus/AFLplusplus/commit/e99d4ba976721127e16493a6b5ad8387fdaa9821.diff",
            "exists": true,
            "files": [
                {
                    "file_additions": 7,
                    "file_deletions": 0,
                    "file_exists": true,
                    "file_name": "frida_mode/src/js/js_api.c",
                    "file_size": 6067
                },
                {
                    "file_additions": 36,
                    "file_deletions": 3,
                    "file_exists": true,
                    "file_name": "frida_mode/src/ranges.c",
                    "file_size": 16688
                },
                {
                    "file_additions": 33,
                    "file_deletions": 1,
                    "file_exists": true,
                    "file_name": "src/afl-showmap.c",
                    "file_size": 41527
                }
            ],
            "interesting": {
                "reopen": false,
                "status": false
            },
            "is_parent": false,
            "sha": "e99d4ba976721127e16493a6b5ad8387fdaa9821"
        }
    ],
    "first_commit": "2019-07-25 17:34:21+00:00",
    "last_commit": "2023-04-21 14:48:47+00:00",
    "number": 2,
    "pull_request": "None",
    "score": {
        "accidental_reopen_likely": false,
        "all_labels": [
            "enhancement",
            "help wanted"
        ],
        "contains_keywords": [
            "work",
            "fix",
            "issu",
            "perform",
            "debug",
            "test",
            "fault",
            "bug"
        ],
        "fix_size": 943,
        "has_labels": [],
        "intersecting": {
            "computed_score": 0.0,
            "final_commit_size": 82,
            "intersection_size": 0,
            "previous_commits_size": 861
        },
        "is_makefile_based": true,
        "no_new_files": [
            "frida_mode/src/js/js_api.c",
            "frida_mode/src/ranges.c",
            "src/afl-showmap.c"
        ],
        "no_other_files": false,
        "num_prohibited_files": 64375,
        "prohibited_files": [
            "server/src/main/java/com/genymobile/scrcpy/Device.java",
            "server/src/main/java/com/genymobile/scrcpy/wrappers/SurfaceControl.java",
            "server/src/main/java/com/genymobile/scrcpy/Device.java",
            "server/src/main/java/com/genymobile/scrcpy/wrappers/SurfaceControl.java",
            "app/meson.build",
            "app/scrcpy.1",
            "app/src/common.h",
            "app/src/scrcpy.h",
            "app/src/server.h",
            "server/src/main/java/com/genymobile/scrcpy/Workarounds.java"
        ],
        "reopen": true,
        "reopen_events": [
            [
                "2019-07-26 00:54:18+00:00",
                "commit"
            ],
            [
                "2019-08-21 12:09:51+00:00",
                "closed"
            ],
            [
                "2019-08-21 12:09:54+00:00",
                "reopened"
            ],
            [
                "2020-09-01 15:41:19+00:00",
                "closed"
            ],
            [
                "2022-04-21 16:45:51+00:00",
                "commit"
            ],
            [
                "2022-07-08 16:46:24+00:00",
                "commit"
            ],
            [
                "2022-11-19 11:14:04+00:00",
                "commit"
            ],
            [
                "2023-04-22 09:32:44+00:00",
                "commit"
            ]
        ],
        "status": false,
        "strategy": true,
        "total_changes": 977
    }
}