{
    "covered_issues": [
        588,
        587,
        583,
        580,
        572,
        570,
        569,
        567,
        566,
        565,
        563,
        562,
        561,
        557,
        555,
        554,
        552,
        548,
        546,
        544,
        543,
        542,
        540,
        538,
        534,
        531,
        527,
        521,
        518,
        517,
        513,
        512,
        510,
        509,
        508,
        507,
        506,
        504,
        503,
        489,
        488,
        487,
        481,
        479,
        478,
        477,
        475,
        473,
        471,
        470,
        469,
        468,
        467,
        466,
        463,
        461,
        460,
        459,
        458,
        456,
        455,
        453,
        446,
        444,
        443,
        442,
        441,
        440,
        439,
        437,
        432,
        431,
        430,
        429,
        428,
        427,
        426,
        423,
        422,
        419,
        418,
        417,
        416,
        415,
        414,
        412,
        410,
        408,
        407,
        403,
        400,
        399,
        397,
        396,
        395,
        394,
        390,
        389,
        388,
        387,
        386,
        385,
        383,
        382,
        376,
        373,
        370,
        369,
        368,
        367,
        366,
        365,
        364,
        362,
        360,
        358,
        357,
        352,
        351,
        350,
        349,
        348,
        343,
        342,
        341,
        338,
        336,
        335,
        334,
        333,
        331,
        329,
        328,
        327,
        326,
        325,
        323,
        322,
        320,
        319,
        318,
        317,
        316,
        315,
        313,
        312,
        311,
        307,
        304,
        303,
        301,
        299,
        298,
        295,
        294,
        293,
        292,
        289,
        284,
        280,
        279,
        275,
        274,
        272,
        267,
        266,
        265,
        262,
        261,
        258,
        257,
        256,
        254,
        251,
        248,
        246,
        245,
        243,
        242,
        239,
        238,
        237,
        236,
        235,
        231,
        230,
        228,
        227,
        226,
        224,
        222,
        220,
        218,
        217,
        214,
        213,
        212,
        211,
        209,
        208,
        207,
        206,
        205,
        204,
        202,
        201,
        199,
        198,
        197,
        196,
        194,
        191,
        186,
        185,
        184,
        182,
        180,
        179,
        178,
        176,
        175,
        173,
        171,
        170,
        169,
        168,
        167,
        165,
        164,
        163,
        162,
        161,
        160,
        158,
        157,
        156,
        155,
        153,
        152,
        151,
        150,
        147,
        146,
        144,
        143,
        142,
        141,
        140,
        139,
        138,
        137,
        136,
        135,
        134,
        129,
        128,
        126,
        125,
        117,
        116,
        115,
        114,
        112,
        111,
        110,
        108,
        107,
        106,
        105,
        101,
        100,
        98,
        97,
        96,
        95,
        92,
        90,
        87,
        86,
        85,
        84,
        83,
        81,
        78,
        76,
        75,
        73,
        72,
        71,
        67,
        65,
        64,
        60,
        59,
        58,
        57,
        56,
        54,
        53,
        52,
        51,
        50,
        48,
        47,
        46,
        45,
        42,
        41,
        40,
        39,
        37,
        36,
        34,
        33,
        32,
        31,
        28,
        27,
        26,
        21,
        20,
        19,
        18,
        17,
        14,
        13,
        12,
        11,
        10,
        9,
        8,
        6,
        3,
        211,
        112
    ],
    "finished": true
}