{
    "commits": [
        {
            "associated_pull_request": [],
            "date": "2015-04-27 05:02:23+00:00",
            "diff": "kevinlawler_kona/issue_110/commit_08d12b05d7b597af4f37115e9b2f647ce56b29f8.diff",
            "diff_additions": 3,
            "diff_deletions": 4,
            "diff_file_size": 47927,
            "diff_url": "https://github.com/kevinlawler/kona/commit/08d12b05d7b597af4f37115e9b2f647ce56b29f8.diff",
            "exists": true,
            "files": [
                {
                    "file_additions": 3,
                    "file_deletions": 4,
                    "file_exists": true,
                    "file_name": "src/0.c",
                    "file_size": 47927
                }
            ],
            "interesting": {
                "reopen": false,
                "status": false
            },
            "is_parent": true,
            "sha": "08d12b05d7b597af4f37115e9b2f647ce56b29f8"
        },
        {
            "associated_pull_request": [],
            "date": "2015-04-27 14:56:14+00:00",
            "diff": "kevinlawler_kona/issue_110/commit_ff952fdbeea9ba1eb58c910862cc8ad46125fbac.diff",
            "diff_additions": 38,
            "diff_deletions": 38,
            "diff_file_size": 47927,
            "diff_url": "https://github.com/kevinlawler/kona/commit/ff952fdbeea9ba1eb58c910862cc8ad46125fbac.diff",
            "exists": true,
            "files": [
                {
                    "file_additions": 38,
                    "file_deletions": 38,
                    "file_exists": true,
                    "file_name": "src/0.c",
                    "file_size": 47927
                }
            ],
            "interesting": {
                "reopen": true,
                "status": false
            },
            "is_parent": false,
            "sha": "ff952fdbeea9ba1eb58c910862cc8ad46125fbac"
        },
        {
            "associated_pull_request": [],
            "date": "2015-05-05 15:33:24+00:00",
            "diff": "kevinlawler_kona/issue_110/commit_6178a4972846b6745582fcde96bc5f98d3878a63.diff",
            "diff_additions": 2,
            "diff_deletions": 2,
            "diff_file_size": 47927,
            "diff_url": "https://github.com/kevinlawler/kona/commit/6178a4972846b6745582fcde96bc5f98d3878a63.diff",
            "exists": true,
            "files": [
                {
                    "file_additions": 2,
                    "file_deletions": 2,
                    "file_exists": true,
                    "file_name": "src/0.c",
                    "file_size": 47927
                }
            ],
            "interesting": {
                "reopen": false,
                "status": false
            },
            "is_parent": false,
            "sha": "6178a4972846b6745582fcde96bc5f98d3878a63"
        }
    ],
    "first_commit": "2015-04-27 05:02:23+00:00",
    "last_commit": "2015-05-05 15:33:24+00:00",
    "number": 110,
    "pull_request": "None",
    "score": {
        "accidental_reopen_likely": true,
        "all_labels": [
            "feature"
        ],
        "contains_keywords": [
            "work",
            "fail",
            "chang",
            "fix",
            "issu",
            "perform",
            "test",
            "bug",
            "error",
            "problem"
        ],
        "fix_size": 47,
        "has_labels": [],
        "intersecting": {
            "computed_score": 1.0,
            "final_commit_size": 3,
            "intersection_size": 3,
            "previous_commits_size": 47
        },
        "is_makefile_based": true,
        "no_new_files": [],
        "no_other_files": false,
        "num_prohibited_files": 152258,
        "prohibited_files": [
            "server/src/main/java/com/genymobile/scrcpy/Device.java",
            "server/src/main/java/com/genymobile/scrcpy/wrappers/SurfaceControl.java",
            "server/src/main/java/com/genymobile/scrcpy/Device.java",
            "server/src/main/java/com/genymobile/scrcpy/wrappers/SurfaceControl.java",
            "app/meson.build",
            "app/scrcpy.1",
            "app/src/common.h",
            "app/src/scrcpy.h",
            "app/src/server.h",
            "server/src/main/java/com/genymobile/scrcpy/Workarounds.java"
        ],
        "reopen": true,
        "reopen_events": [
            [
                "2015-04-27 14:47:02+00:00",
                "closed"
            ],
            [
                "2015-04-27 14:47:02+00:00",
                "commit"
            ],
            [
                "2015-05-05 15:22:30+00:00",
                "reopened"
            ],
            [
                "2015-05-05 15:23:56+00:00",
                "closed"
            ],
            [
                "2015-05-05 15:23:56+00:00",
                "commit"
            ]
        ],
        "status": false,
        "strategy": true,
        "total_changes": 87
    }
}