{
    "covered_issues": [
        54,
        49,
        41,
        25,
        16,
        15,
        13,
        12,
        10,
        8,
        7,
        3,
        2
    ],
    "finished": true
}