{
    "covered_issues": [
        126,
        116,
        115,
        114,
        113,
        110,
        107,
        106,
        105,
        103,
        102,
        101,
        100,
        95,
        94,
        90,
        89,
        88,
        86,
        85,
        84,
        83,
        81,
        79,
        78,
        77,
        74,
        72,
        70,
        68,
        67,
        65,
        64,
        61,
        60,
        56,
        51,
        49,
        44,
        43,
        41,
        38,
        37,
        35,
        30,
        29,
        28,
        25,
        24,
        23,
        22,
        21,
        18,
        17,
        15,
        13,
        12,
        10,
        9,
        8,
        7,
        6,
        5,
        2,
        1
    ],
    "finished": true
}