{
    "commits": [
        {
            "diff": "spring-projects_spring-boot/issue_308/commit_0f083c2f9dfa39f90980ee9ef4a8c9f969e8fde0.diff",
            "diff_additions": 64,
            "diff_deletions": 29,
            "diff_file_size": 0,
            "files": [
                {
                    "file_additions": 5,
                    "file_deletions": 5,
                    "file_exists": false,
                    "file_name": "spring-boot-cli/src/main/java/org/springframework/boot/cli/command/shell/PromptCommand.java",
                    "file_size": 0
                },
                {
                    "file_additions": 4,
                    "file_deletions": 24,
                    "file_exists": false,
                    "file_name": "spring-boot-cli/src/main/java/org/springframework/boot/cli/command/shell/Shell.java",
                    "file_size": 0
                },
                {
                    "file_additions": 55,
                    "file_deletions": 0,
                    "file_exists": false,
                    "file_name": "spring-boot-cli/src/main/java/org/springframework/boot/cli/command/shell/ShellPrompts.java",
                    "file_size": 0
                }
            ],
            "interesting": {
                "reopened": false,
                "status": false
            },
            "sha": "0f083c2f9dfa39f90980ee9ef4a8c9f969e8fde0"
        },
        {
            "diff": "spring-projects_spring-boot/issue_308/commit_b47db4cfe2bfda1c7b979507cf109b0af47bbf31.diff",
            "diff_additions": 94,
            "diff_deletions": 13,
            "diff_file_size": 0,
            "files": [
                {
                    "file_additions": 25,
                    "file_deletions": 10,
                    "file_exists": false,
                    "file_name": "spring-boot/src/main/java/org/springframework/boot/context/listener/ConfigFileApplicationListener.java",
                    "file_size": 0
                },
                {
                    "file_additions": 50,
                    "file_deletions": 0,
                    "file_exists": false,
                    "file_name": "spring-boot/src/test/java/org/springframework/boot/ReproTests.java",
                    "file_size": 0
                },
                {
                    "file_additions": 19,
                    "file_deletions": 3,
                    "file_exists": false,
                    "file_name": "spring-boot/src/test/java/org/springframework/boot/context/listener/ConfigFileApplicationListenerTests.java",
                    "file_size": 0
                }
            ],
            "interesting": {
                "reopened": true,
                "status": false
            },
            "sha": "b47db4cfe2bfda1c7b979507cf109b0af47bbf31"
        },
        {
            "diff": "spring-projects_spring-boot/issue_308/commit_6ddbf3bd92d189d072c73458b20cfd7c8d926215.diff",
            "diff_additions": 31,
            "diff_deletions": 13,
            "diff_file_size": 0,
            "files": [
                {
                    "file_additions": 25,
                    "file_deletions": 11,
                    "file_exists": false,
                    "file_name": "spring-boot/src/main/java/org/springframework/boot/context/listener/ConfigFileApplicationListener.java",
                    "file_size": 0
                },
                {
                    "file_additions": 6,
                    "file_deletions": 2,
                    "file_exists": false,
                    "file_name": "spring-boot/src/test/java/org/springframework/boot/context/listener/ConfigFileApplicationListenerTests.java",
                    "file_size": 0
                }
            ],
            "interesting": {
                "reopened": false,
                "status": false
            },
            "sha": "6ddbf3bd92d189d072c73458b20cfd7c8d926215"
        },
        {
            "diff": "spring-projects_spring-boot/issue_308/commit_a6fd3f0d797ba3927c16e1516268616aaf6c83a6.diff",
            "diff_additions": 94,
            "diff_deletions": 13,
            "diff_file_size": 0,
            "files": [
                {
                    "file_additions": 25,
                    "file_deletions": 10,
                    "file_exists": false,
                    "file_name": "spring-boot/src/main/java/org/springframework/boot/context/listener/ConfigFileApplicationListener.java",
                    "file_size": 0
                },
                {
                    "file_additions": 50,
                    "file_deletions": 0,
                    "file_exists": false,
                    "file_name": "spring-boot/src/test/java/org/springframework/boot/ReproTests.java",
                    "file_size": 0
                },
                {
                    "file_additions": 19,
                    "file_deletions": 3,
                    "file_exists": false,
                    "file_name": "spring-boot/src/test/java/org/springframework/boot/context/listener/ConfigFileApplicationListenerTests.java",
                    "file_size": 0
                }
            ],
            "interesting": {
                "reopened": false,
                "status": false
            },
            "sha": "a6fd3f0d797ba3927c16e1516268616aaf6c83a6"
        },
        {
            "diff": "spring-projects_spring-boot/issue_308/commit_b488eae4f489c179dd3a1bf2375e54b70c9037ce.diff",
            "diff_additions": 31,
            "diff_deletions": 13,
            "diff_file_size": 0,
            "files": [
                {
                    "file_additions": 25,
                    "file_deletions": 11,
                    "file_exists": false,
                    "file_name": "spring-boot/src/main/java/org/springframework/boot/context/listener/ConfigFileApplicationListener.java",
                    "file_size": 0
                },
                {
                    "file_additions": 6,
                    "file_deletions": 2,
                    "file_exists": false,
                    "file_name": "spring-boot/src/test/java/org/springframework/boot/context/listener/ConfigFileApplicationListenerTests.java",
                    "file_size": 0
                }
            ],
            "interesting": {
                "reopened": false,
                "status": false
            },
            "sha": "b488eae4f489c179dd3a1bf2375e54b70c9037ce"
        }
    ],
    "first_commit": "2014-02-04 05:25:12",
    "last_commit": "2014-02-04 22:06:02",
    "number": 308,
    "score": 144.01012658227847
}