{
    "covered_issues": [
        206,
        205,
        193,
        188,
        176,
        170,
        161,
        159,
        148,
        145,
        143,
        134,
        130,
        125,
        124,
        121,
        117,
        99,
        98,
        97,
        94,
        92,
        91,
        90,
        89,
        87,
        85,
        84,
        83,
        81,
        80,
        78,
        77,
        74,
        70,
        66,
        65,
        64,
        62,
        59,
        56,
        53,
        52,
        49,
        48,
        46,
        44,
        42,
        41,
        40,
        39,
        37,
        36,
        35,
        34,
        32,
        31,
        30,
        28,
        27,
        26,
        25,
        24,
        23,
        22,
        21,
        20,
        19,
        18,
        17,
        16,
        15,
        14,
        13,
        12,
        11,
        10,
        9,
        8,
        7,
        6,
        5,
        4,
        3,
        2,
        1
    ],
    "finished": true
}