{
    "covered_issues": [
        3406,
        3391,
        3383,
        3379,
        3373,
        3364,
        3355,
        3351,
        3349,
        3347,
        3344,
        3343,
        3342,
        3340,
        3339,
        3335,
        3328,
        3326,
        3323,
        3318,
        3316,
        3313,
        3312,
        3311,
        3310,
        3309,
        3305,
        3304,
        3301,
        3297,
        3296,
        3294,
        3287,
        3281,
        3279,
        3278,
        3277,
        3271,
        3266,
        3265,
        3261,
        3256,
        3254,
        3252,
        3251,
        3250,
        3249,
        3245,
        3243,
        3241,
        3237,
        3235,
        3234,
        3233,
        3232,
        3226,
        3224,
        3218,
        3217,
        3216,
        3215,
        3214,
        3212,
        3211,
        3208,
        3207,
        3204,
        3198,
        3194,
        3192,
        3191,
        3190,
        3188,
        3187,
        3182,
        3180,
        3179,
        3176,
        3174,
        3173,
        3170,
        3169,
        3167,
        3166,
        3165,
        3156,
        3155,
        3153,
        3143,
        3142,
        3141,
        3140,
        3136,
        3131,
        3129,
        3125,
        3120,
        3119,
        3118,
        3116,
        3110,
        3109,
        3108,
        3106,
        3105,
        3098,
        3095,
        3092,
        3089,
        3085,
        3082,
        3079,
        3078,
        3074,
        3073,
        3071,
        3066,
        3063,
        3061,
        3058,
        3057,
        3056,
        3055,
        3052,
        3049,
        3045,
        3044,
        3039,
        3036,
        3035,
        3031,
        3030,
        3028,
        3027,
        3025,
        3024,
        3021,
        3020,
        3019,
        3018,
        3017,
        3011,
        3009,
        3007,
        3003,
        3002,
        3001,
        3000,
        2997,
        2995,
        2994,
        2993,
        2988,
        2987,
        2981,
        2980,
        2979,
        2977,
        2976,
        2973,
        2972,
        2970,
        2965,
        2964,
        2963,
        2962,
        2960,
        2959,
        2956,
        2955,
        2954,
        2952,
        2951,
        2950,
        2949,
        2948,
        2946,
        2945,
        2944,
        2941,
        2940,
        2939,
        2937,
        2935,
        2933,
        2931,
        2928,
        2926,
        2925,
        2923,
        2922,
        2921,
        2920,
        2919,
        2918,
        2916,
        2913,
        2911,
        2910,
        2909,
        2908,
        2907,
        2904,
        2903,
        2902,
        2901,
        2897,
        2896,
        2895,
        2893,
        2892,
        2891,
        2890,
        2889,
        2887,
        2885,
        2884,
        2883,
        2882,
        2881,
        2880,
        2879,
        2878,
        2876,
        2875,
        2873,
        2872,
        2871,
        2870,
        2868,
        2867,
        2866,
        2865,
        2864,
        2858,
        2853,
        2849,
        2848,
        2847,
        2843,
        2840,
        2839,
        2835,
        2834,
        2833,
        2831,
        2828,
        2824,
        2823,
        2821,
        2816,
        2814,
        2813,
        2811,
        2809,
        2808,
        2806,
        2804,
        2803,
        2802,
        2800,
        2799,
        2798,
        2796,
        2794,
        2792,
        2788,
        2787,
        2786,
        2784,
        2783,
        2782,
        2781,
        2780,
        2779,
        2777,
        2775,
        2772,
        2764,
        2760,
        2758,
        2756,
        2755,
        2754,
        2753,
        2751,
        2749,
        2748,
        2746,
        2744,
        2743,
        2741,
        2740,
        2737,
        2733,
        2729,
        2728,
        2727,
        2726,
        2725,
        2724,
        2722,
        2721,
        2720,
        2719,
        2718,
        2716,
        2715,
        2714,
        2713,
        2711,
        2706,
        2703,
        2701,
        2699,
        2698,
        2696,
        2691,
        2690,
        2689,
        2688,
        2687,
        2685,
        2684,
        2683,
        2681,
        2680,
        2677,
        2676,
        2675,
        2670,
        2667,
        2666,
        2663,
        2662,
        2656,
        2653,
        2652,
        2651,
        2648,
        2647,
        2645,
        2640,
        2639,
        2635,
        2634,
        2632,
        2630,
        2626,
        2625,
        2624,
        2622,
        2621,
        2620,
        2619,
        2616,
        2614,
        2613,
        2612,
        2611,
        2604,
        2602,
        2601,
        2599,
        2598,
        2596,
        2595,
        2593,
        2591,
        2589,
        2588,
        2586,
        2585,
        2584,
        2578,
        2576,
        2575,
        2574,
        2570,
        2568,
        2566,
        2565,
        2564,
        2563,
        2556,
        2554,
        2546,
        2542,
        2541,
        2539,
        2538,
        2537,
        2536,
        2535,
        2534,
        2532,
        2530,
        2529,
        2527,
        2525,
        2523,
        2522,
        2521,
        2516,
        2514,
        2512,
        2511,
        2510,
        2507,
        2506,
        2504,
        2502,
        2498,
        2496,
        2494,
        2489,
        2488,
        2484,
        2482,
        2481,
        2479,
        2478,
        2477,
        2474,
        2471,
        2470,
        2467,
        2466,
        2464,
        2462,
        2457,
        2456,
        2445,
        2444,
        2443,
        2442,
        2441,
        2440,
        2439,
        2437,
        2436,
        2435,
        2433,
        2431,
        2430,
        2428,
        2426,
        2425,
        2424,
        2420,
        2418,
        2415,
        2414,
        2413,
        2412,
        2411,
        2410,
        2408,
        2407,
        2406,
        2405,
        2404,
        2403,
        2402,
        2400,
        2398,
        2397,
        2396,
        2395,
        2390,
        2384,
        2381,
        2380,
        2379,
        2376,
        2374,
        2373,
        2372,
        2371,
        2370,
        2366,
        2364,
        2363,
        2362,
        2361,
        2360,
        2359,
        2356,
        2355,
        2354,
        2352,
        2351,
        2350,
        2349,
        2348,
        2347,
        2346,
        2344,
        2343,
        2342,
        2341,
        2338,
        2337,
        2336,
        2335,
        2333,
        2331,
        2329,
        2328,
        2327,
        2326,
        2325,
        2324,
        2323,
        2321,
        2317,
        2315,
        2314,
        2313,
        2311,
        2308,
        2306,
        2305,
        2304,
        2302,
        2300,
        2299,
        2296,
        2295,
        2294,
        2293,
        2292,
        2291,
        2290,
        2289,
        2288,
        2286,
        2284,
        2280,
        2279,
        2278,
        2277,
        2275,
        2274,
        2272,
        2271,
        2270,
        2268,
        2266,
        2265,
        2264,
        2263,
        2258,
        2257,
        2254,
        2253,
        2252,
        2251,
        2247,
        2245,
        2244,
        2243,
        2242,
        2241,
        2240,
        2239,
        2237,
        2236,
        2235,
        2232,
        2230,
        2229,
        2227,
        2226,
        2225,
        2224,
        2223,
        2221,
        2219,
        2218,
        2216,
        2213,
        2212,
        2211,
        2209,
        2207,
        2206,
        2203,
        2202,
        2200,
        2199,
        2197,
        2194,
        2193,
        2189,
        2187,
        2186,
        2185,
        2183,
        2182,
        2181,
        2180,
        2179,
        2178,
        2177,
        2175,
        2170,
        2169,
        2168,
        2167,
        2166,
        2165,
        2164,
        2163,
        2162,
        2161,
        2160,
        2157,
        2156,
        2154,
        2150,
        2147,
        2146,
        2144,
        2143,
        2142,
        2141,
        2140,
        2139,
        2138,
        2134,
        2131,
        2130,
        2127,
        2126,
        2124,
        2123,
        2121,
        2118,
        2117,
        2116,
        2115,
        2114,
        2113,
        2111,
        2110,
        2109,
        2106,
        2105,
        2102,
        2101,
        2100,
        2099,
        2096,
        2095,
        2094,
        2092,
        2091,
        2089,
        2087,
        2085,
        2083,
        2082,
        2081,
        2080,
        2077,
        2076,
        2075,
        2074,
        2073,
        2072,
        2070,
        2069,
        2068,
        2067,
        2065,
        2061,
        2058,
        2052,
        2051,
        2050,
        2049,
        2048,
        2046,
        2045,
        2044,
        2043,
        2042,
        2041,
        2040,
        2039,
        2037,
        2036,
        2033,
        2031,
        2030,
        2029,
        2025,
        2023,
        2022,
        2016,
        2015,
        2014,
        2010,
        2009,
        2007,
        2005,
        2004,
        2002,
        2001,
        2000,
        1997,
        1994,
        1991,
        1990,
        1989,
        1988,
        1987,
        1984,
        1983,
        1981,
        1979,
        1978,
        1977,
        1975,
        1974,
        1973,
        1972,
        1971,
        1970,
        1969,
        1964,
        1963,
        1960,
        1959,
        1957,
        1954,
        1952,
        1951,
        1950,
        1948,
        1946,
        1945,
        1944,
        1943,
        1941,
        1940,
        1937,
        1936,
        1935,
        1932,
        1931,
        1930,
        1929,
        1928,
        1926,
        1925,
        1924,
        1923,
        1922,
        1917,
        1915,
        1914,
        1911,
        1908,
        1907,
        1904,
        1902,
        1898,
        1896,
        1894,
        1893,
        1892,
        1890,
        1888,
        1885,
        1883,
        1882,
        1881,
        1878,
        1874,
        1872,
        1870,
        1868,
        1864,
        1863,
        1862,
        1861,
        1858,
        1857,
        1856,
        1855,
        1854,
        1850,
        1849,
        1845,
        1843,
        1842,
        1841,
        1839,
        1836,
        1835,
        1833,
        1830,
        1828,
        1826,
        1825,
        1824,
        1823,
        1822,
        1821,
        1819,
        1818,
        1817,
        1815,
        1813,
        1812,
        1811,
        1810,
        1809,
        1807,
        1805,
        1804,
        1802,
        1801,
        1800,
        1799,
        1798,
        1797,
        1796,
        1795,
        1793,
        1792,
        1791,
        1789,
        1786,
        1785,
        1784,
        1783,
        1782,
        1781,
        1780,
        1779,
        1778,
        1777,
        1776,
        1775,
        1773,
        1772,
        1770,
        1769,
        1765,
        1764,
        1762,
        1760,
        1759,
        1758,
        1752,
        1751,
        1750,
        1749,
        1747,
        1745,
        1744,
        1742,
        1741,
        1740,
        1739,
        1737,
        1736,
        1734,
        1733,
        1732,
        1731,
        1728,
        1726,
        1725,
        1723,
        1722,
        1721,
        1718,
        1717,
        1716,
        1713,
        1712,
        1711,
        1709,
        1708,
        1707,
        1706,
        1705,
        1704,
        1703,
        1701,
        1699,
        1696,
        1693,
        1692,
        1691,
        1687,
        1686,
        1685,
        1684,
        1681,
        1680,
        1679,
        1677,
        1676,
        1675,
        1673,
        1672,
        1671,
        1670,
        1667,
        1666,
        1664,
        1663,
        1660,
        1657,
        1656,
        1655,
        1654,
        1651,
        1650,
        1644,
        1642,
        1641,
        1640,
        1639,
        1638,
        1637,
        1636,
        1635,
        1634,
        1633,
        1632,
        1631,
        1630,
        1628,
        1625,
        1624,
        1623,
        1622,
        1621,
        1620,
        1619,
        1618,
        1617,
        1616,
        1615,
        1614,
        1613,
        1612,
        1611,
        1610,
        1609,
        1608,
        1607,
        1606,
        1604,
        1603,
        1602,
        1600,
        1598,
        1597,
        1595,
        1594,
        1593,
        1592,
        1590,
        1588,
        1586,
        1584,
        1582,
        1581,
        1580,
        1579,
        1578,
        1577,
        1576,
        1574,
        1569,
        1567,
        1563,
        1562,
        1561,
        1560,
        1559,
        1556,
        1555,
        1554,
        1553,
        1552,
        1551,
        1549,
        1548,
        1547,
        1546,
        1545,
        1544,
        1543,
        1542,
        1536,
        1534,
        1531,
        1524,
        1523,
        1520,
        1518,
        1517,
        1515,
        1513,
        1512,
        1510,
        1508,
        1507,
        1505,
        1502,
        1501,
        1498,
        1495,
        1494,
        1493,
        1491,
        1490,
        1488,
        1485,
        1484,
        1483,
        1482,
        1481,
        1480,
        1479,
        1478,
        1476,
        1474,
        1473,
        1472,
        1471,
        1469,
        1468,
        1467,
        1463,
        1462,
        1461,
        1460,
        1459,
        1458,
        1457,
        1456,
        1455,
        1453,
        1452,
        1451,
        1449,
        1447,
        1446,
        1443,
        1440,
        1436,
        1434,
        1432,
        1428,
        1427,
        1425,
        1422,
        1420,
        1419,
        1418,
        1417,
        1416,
        1415,
        1411,
        1410,
        1409,
        1407,
        1406,
        1405,
        1404,
        1399,
        1395,
        1394,
        1393,
        1392,
        1391,
        1389,
        1387,
        1384,
        1383,
        1382,
        1381,
        1380,
        1375,
        1374,
        1373,
        1372,
        1371,
        1370,
        1369,
        1368,
        1366,
        1365,
        1364,
        1363,
        1361,
        1360,
        1356,
        1352,
        1351,
        1349,
        1348,
        1347,
        1346,
        1345,
        1344,
        1342,
        1340,
        1339,
        1338,
        1335,
        1334,
        1331,
        1329,
        1328,
        1326,
        1325,
        1321,
        1320,
        1319,
        1318,
        1316,
        1315,
        1314,
        1311,
        1309,
        1308,
        1306,
        1304,
        1303,
        1302,
        1301,
        1299,
        1298,
        1296,
        1293,
        1292,
        1290,
        1289,
        1288,
        1287,
        1281,
        1280,
        1276,
        1275,
        1274,
        1272,
        1270,
        1269,
        1268,
        1267,
        1266,
        1264,
        1262,
        1261,
        1259,
        1258,
        1256,
        1254,
        1250,
        1248,
        1246,
        1245,
        1244,
        1241,
        1238,
        1237,
        1236,
        1234,
        1232,
        1230,
        1229,
        1228,
        1227,
        1225,
        1224,
        1223,
        1220,
        1217,
        1209,
        1204,
        1196,
        1195,
        1194,
        1193,
        1189,
        1188,
        1187,
        1186,
        1181,
        1180,
        1178,
        1174,
        1173,
        1172,
        1171,
        1168,
        1166,
        1165,
        1164,
        1163,
        1161,
        1160,
        1159,
        1158,
        1152,
        1150,
        1149,
        1147,
        1146,
        1145,
        1144,
        1141,
        1139,
        1134,
        1133,
        1131,
        1130,
        1128,
        1124,
        1122,
        1121,
        1119,
        1118,
        1117,
        1115,
        1112,
        1109,
        1108,
        1107,
        1103,
        1101,
        1099,
        1098,
        1097,
        1096,
        1095,
        1094,
        1093,
        1092,
        1090,
        1089,
        1087,
        1086,
        1085,
        1084,
        1081,
        1080,
        1078,
        1077,
        1075,
        1074,
        1073,
        1071,
        1069,
        1066,
        1065,
        1059,
        1058,
        1053,
        1052,
        1047,
        1046,
        1045,
        1039,
        1038,
        1036,
        1035,
        1034,
        1033,
        1031,
        1027,
        1025,
        1024,
        1022,
        1020,
        1019,
        1015,
        1013,
        1012,
        1011,
        1009,
        1007,
        1006,
        1003,
        999,
        996,
        995,
        991,
        990,
        989,
        986,
        982,
        980,
        976,
        975,
        971,
        967,
        966,
        964,
        963,
        962,
        961,
        960,
        959,
        957,
        956,
        954,
        948,
        941,
        939,
        937,
        933,
        931,
        930,
        929,
        927,
        926,
        925,
        922,
        921,
        920,
        918,
        915,
        913,
        912,
        911,
        907,
        904,
        903,
        901,
        900,
        899,
        898,
        897,
        893,
        892,
        891,
        889,
        884,
        880,
        877,
        876,
        875,
        874,
        873,
        872,
        871,
        870,
        868,
        867,
        865,
        864,
        863,
        862,
        860,
        859,
        856,
        851,
        848,
        847,
        846,
        845,
        844,
        843,
        840,
        838,
        837,
        836,
        835,
        834,
        833,
        832,
        831,
        830,
        829,
        828,
        827,
        826,
        825,
        824,
        823,
        822,
        821,
        820,
        819,
        816,
        813,
        811,
        810,
        809,
        808,
        807,
        806,
        805,
        803,
        802,
        801,
        800,
        799,
        798,
        795,
        792,
        791,
        790,
        789,
        788,
        785,
        784,
        783,
        778,
        774,
        773,
        772,
        771,
        768,
        766,
        763,
        762,
        761,
        760,
        759,
        758,
        757,
        756,
        754,
        749,
        748,
        745,
        744,
        739,
        738,
        736,
        732,
        730,
        726,
        723,
        721,
        720,
        719,
        716,
        715,
        714,
        712,
        711,
        710,
        709,
        707,
        706,
        704,
        701,
        698,
        696,
        691,
        690,
        689,
        685,
        684,
        683,
        682,
        679,
        677,
        676,
        674,
        673,
        672,
        671,
        670,
        669,
        668,
        666,
        663,
        662,
        658,
        657,
        656,
        654,
        653,
        652,
        651,
        650,
        649,
        648,
        646,
        645,
        642,
        641,
        640,
        639,
        638,
        637,
        635,
        634,
        633,
        632,
        631,
        625,
        624,
        623,
        621,
        620,
        619,
        617,
        616,
        615,
        614,
        613,
        612,
        610,
        609,
        607,
        606,
        605,
        603,
        602,
        601,
        598,
        597,
        596,
        594,
        593,
        591,
        590,
        583,
        582,
        580,
        579,
        578,
        577,
        574,
        569,
        567,
        566,
        565,
        564,
        563,
        562,
        561,
        559,
        557,
        555,
        554,
        552,
        549,
        547,
        546,
        543,
        541,
        540,
        539,
        537,
        536,
        535,
        534,
        533,
        532,
        530,
        528,
        527,
        526,
        524,
        521,
        520,
        518,
        517,
        516,
        515,
        514,
        510,
        498,
        497,
        495,
        494,
        493,
        487,
        486,
        484,
        483,
        482,
        481,
        480,
        479,
        477,
        476,
        475,
        474,
        473,
        472,
        468,
        466,
        464,
        461,
        459,
        457,
        452,
        451,
        449,
        448,
        446,
        444,
        442,
        441,
        440,
        439,
        436,
        434,
        433,
        432,
        430,
        429,
        428,
        427,
        426,
        422,
        421,
        419,
        416,
        415,
        412,
        411,
        410,
        407,
        403,
        400,
        399,
        398,
        397,
        395,
        394,
        393,
        392,
        391,
        388,
        387,
        385,
        384,
        382,
        381,
        380,
        379,
        378,
        376,
        374,
        373,
        372,
        371,
        370,
        369,
        368,
        367,
        366,
        364,
        363,
        362,
        360,
        359,
        357,
        356,
        355,
        354,
        353,
        350,
        348,
        347,
        345,
        343,
        341,
        340,
        337,
        336,
        331,
        330,
        327,
        325,
        324,
        323,
        322,
        321,
        320,
        319,
        318,
        317,
        316,
        314,
        313,
        312,
        311,
        310,
        309,
        308,
        307,
        306,
        305,
        304,
        303,
        302,
        300,
        299,
        296,
        292,
        291,
        290,
        286,
        283,
        278,
        277,
        276,
        273,
        270,
        268,
        262,
        261,
        257,
        255,
        254,
        253,
        252,
        249,
        248,
        246,
        245,
        244,
        243,
        242,
        241,
        240,
        239,
        238,
        237,
        235,
        234,
        233,
        232,
        231,
        230,
        229,
        228,
        225,
        224,
        223,
        221,
        219,
        218,
        217,
        216,
        215,
        214,
        211,
        210,
        206,
        202,
        201,
        200,
        199,
        194,
        193,
        191,
        190,
        189,
        186,
        185,
        184,
        183,
        180,
        179,
        178,
        177,
        176,
        175,
        174,
        173,
        171,
        169,
        164,
        163,
        162,
        161,
        160,
        157,
        155,
        152,
        151,
        150,
        149,
        148,
        147,
        146,
        145,
        144,
        141,
        140,
        139,
        134,
        133,
        132,
        129,
        128,
        127,
        126,
        125,
        124,
        123,
        122,
        121,
        117,
        113,
        112,
        111,
        110,
        109,
        106,
        105,
        104,
        103,
        102,
        101,
        100,
        99,
        98,
        97,
        96,
        95,
        86,
        85,
        84,
        83,
        80,
        74,
        73,
        72,
        71,
        70,
        69,
        66,
        65,
        62,
        61,
        60,
        59,
        58,
        57,
        56,
        55,
        54,
        53,
        50,
        48,
        47,
        44,
        43,
        42,
        40,
        39,
        38,
        37,
        36,
        35,
        34,
        33,
        32,
        31,
        30,
        29,
        28,
        27,
        26,
        25,
        23,
        22,
        19,
        18,
        17,
        16,
        15,
        14,
        13,
        12,
        11,
        10,
        9,
        8,
        7,
        6,
        5,
        4,
        3,
        2,
        1,
        609,
        1624,
        3020,
        2507,
        609,
        1624,
        3020,
        2507
    ],
    "finished": true
}