{
    "covered_issues": [
        3006,
        2998,
        2995,
        2986,
        2977,
        2976,
        2973,
        2971,
        2962,
        2961,
        2960,
        2959,
        2955,
        2949,
        2947,
        2940,
        2934,
        2933,
        2932,
        2931,
        2930,
        2929,
        2925,
        2917,
        2916,
        2915,
        2913,
        2911,
        2910,
        2901,
        2898,
        2890,
        2887,
        2886,
        2885,
        2873,
        2872,
        2861,
        2855,
        2843,
        2840,
        2839,
        2838,
        2835,
        2828,
        2827,
        2825,
        2818,
        2812,
        2810,
        2808,
        2807,
        2805,
        2804,
        2801,
        2798,
        2795,
        2794,
        2787,
        2781,
        2779,
        2777,
        2772,
        2771,
        2770,
        2768,
        2766,
        2765,
        2763,
        2759,
        2756,
        2749,
        2746,
        2743,
        2742,
        2736,
        2730,
        2723,
        2721,
        2719,
        2713,
        2712,
        2710,
        2708,
        2707,
        2700,
        2698,
        2693,
        2671,
        2660,
        2659,
        2656,
        2651,
        2650,
        2649,
        2646,
        2644,
        2643,
        2642,
        2637,
        2634,
        2627,
        2625,
        2623,
        2622,
        2617,
        2601,
        2594,
        2586,
        2583,
        2581,
        2580,
        2572,
        2569,
        2564,
        2560,
        2559,
        2558,
        2557,
        2556,
        2555,
        2538,
        2535,
        2533,
        2531,
        2529,
        2522,
        2521,
        2520,
        2513,
        2512,
        2511,
        2510,
        2503,
        2497,
        2496,
        2490,
        2489,
        2488,
        2486,
        2480,
        2478,
        2477,
        2476,
        2474,
        2471,
        2468,
        2466,
        2465,
        2463,
        2457,
        2451,
        2446,
        2445,
        2437,
        2436,
        2435,
        2433,
        2431,
        2429,
        2427,
        2426,
        2416,
        2415,
        2413,
        2411,
        2406,
        2405,
        2404,
        2402,
        2398,
        2390,
        2389,
        2388,
        2387,
        2385,
        2384,
        2381,
        2376,
        2373,
        2372,
        2363,
        2362,
        2360,
        2358,
        2354,
        2351,
        2350,
        2349,
        2348,
        2341,
        2331,
        2328,
        2326,
        2325,
        2323,
        2318,
        2316,
        2315,
        2314,
        2312,
        2310,
        2307,
        2303,
        2302,
        2287,
        2285,
        2281,
        2278,
        2276,
        2275,
        2271,
        2270,
        2269,
        2266,
        2261,
        2260,
        2258,
        2254,
        2251,
        2249,
        2248,
        2239,
        2238,
        2229,
        2228,
        2223,
        2222,
        2220,
        2218,
        2215,
        2214,
        2200,
        2197,
        2191,
        2187,
        2185,
        2181,
        2180,
        2174,
        2165,
        2164,
        2163,
        2160,
        2158,
        2157,
        2156,
        2155,
        2154,
        2153,
        2152,
        2151,
        2150,
        2147,
        2146,
        2145,
        2144,
        2142,
        2136,
        2135,
        2134,
        2131,
        2130,
        2127,
        2126,
        2123,
        2122,
        2118,
        2116,
        2112,
        2109,
        2101,
        2100,
        2099,
        2097,
        2093,
        2092,
        2090,
        2089,
        2087,
        2085,
        2083,
        2077,
        2076,
        2068,
        2065,
        2061,
        2059,
        2056,
        2054,
        2053,
        2052,
        2048,
        2046,
        2045,
        2044,
        2043,
        2039,
        2037,
        2030,
        2028,
        2026,
        2025,
        2024,
        2021,
        2020,
        2012,
        2010,
        2008,
        2002,
        2001,
        1998,
        1997,
        1996,
        1994,
        1992,
        1989,
        1987,
        1985,
        1983,
        1982,
        1981,
        1973,
        1972,
        1971,
        1966,
        1964,
        1963,
        1962,
        1958,
        1955,
        1949,
        1947,
        1934,
        1927,
        1925,
        1924,
        1923,
        1922,
        1921,
        1918,
        1911,
        1910,
        1908,
        1905,
        1898,
        1897,
        1896,
        1884,
        1883,
        1882,
        1881,
        1875,
        1873,
        1869,
        1867,
        1862,
        1861,
        1859,
        1852,
        1850,
        1849,
        1848,
        1846,
        1845,
        1844,
        1843,
        1839,
        1837,
        1826,
        1824,
        1823,
        1822,
        1819,
        1818,
        1817,
        1815,
        1814,
        1813,
        1810,
        1806,
        1800,
        1798,
        1797,
        1795,
        1791,
        1786,
        1783,
        1772,
        1769,
        1758,
        1757,
        1756,
        1754,
        1753,
        1751,
        1750,
        1746,
        1741,
        1740,
        1735,
        1725,
        1722,
        1721,
        1718,
        1716,
        1715,
        1713,
        1710,
        1709,
        1707,
        1703,
        1701,
        1699,
        1696,
        1694,
        1693,
        1691,
        1689,
        1684,
        1683,
        1682,
        1681,
        1677,
        1667,
        1664,
        1662,
        1657,
        1656,
        1655,
        1654,
        1652,
        1649,
        1648,
        1647,
        1644,
        1642,
        1641,
        1640,
        1636,
        1635,
        1634,
        1633,
        1632,
        1630,
        1629,
        1624,
        1622,
        1618,
        1617,
        1615,
        1614,
        1613,
        1611,
        1610,
        1607,
        1605,
        1603,
        1599,
        1598,
        1595,
        1586,
        1565,
        1563,
        1562,
        1559,
        1557,
        1555,
        1553,
        1552,
        1546,
        1542,
        1537,
        1534,
        1530,
        1529,
        1528,
        1527,
        1526,
        1525,
        1524,
        1523,
        1522,
        1519,
        1518,
        1517,
        1513,
        1511,
        1510,
        1509,
        1506,
        1505,
        1503,
        1502,
        1494,
        1493,
        1492,
        1491,
        1490,
        1481,
        1479,
        1478,
        1476,
        1466,
        1465,
        1463,
        1458,
        1451,
        1448,
        1442,
        1439,
        1431,
        1426,
        1425,
        1424,
        1422,
        1420,
        1413,
        1412,
        1410,
        1409,
        1408,
        1406,
        1405,
        1392,
        1390,
        1382,
        1364,
        1354,
        1353,
        1348,
        1347,
        1339,
        1336,
        1330,
        1329,
        1326,
        1325,
        1324,
        1322,
        1316,
        1312,
        1304,
        1303,
        1295,
        1289,
        1287,
        1285,
        1282,
        1276,
        1275,
        1273,
        1272,
        1259,
        1250,
        1246,
        1244,
        1241,
        1240,
        1236,
        1234,
        1228,
        1227,
        1225,
        1223,
        1218,
        1217,
        1212,
        1208,
        1203,
        1202,
        1201,
        1200,
        1198,
        1196,
        1194,
        1193,
        1191,
        1186,
        1181,
        1176,
        1172,
        1170,
        1165,
        1151,
        1149,
        1146,
        1143,
        1142,
        1141,
        1140,
        1139,
        1134,
        1131,
        1129,
        1125,
        1123,
        1115,
        1109,
        1106,
        1100,
        1098,
        1096,
        1091,
        1090,
        1089,
        1087,
        1085,
        1083,
        1076,
        1073,
        1071,
        1066,
        1065,
        1063,
        1059,
        1057,
        1056,
        1052,
        1050,
        1049,
        1048,
        1046,
        1038,
        1037,
        1034,
        1031,
        1030,
        1024,
        1021,
        1019,
        1012,
        998,
        996,
        992,
        991,
        990,
        984,
        981,
        980,
        979,
        977,
        973,
        971,
        970,
        962,
        956,
        955,
        951,
        946,
        942,
        939,
        930,
        927,
        926,
        921,
        920,
        918,
        912,
        907,
        903,
        902,
        900,
        899,
        898,
        895,
        892,
        886,
        885,
        875,
        870,
        868,
        867,
        860,
        856,
        855,
        854,
        852,
        851,
        849,
        847,
        846,
        837,
        834,
        832,
        831,
        820,
        813,
        812,
        810,
        805,
        795,
        794,
        789,
        787,
        786,
        783,
        780,
        778,
        775,
        772,
        770,
        768,
        767,
        762,
        761,
        760,
        758,
        756,
        754,
        749,
        746,
        740,
        739,
        737,
        733,
        725,
        717,
        716,
        715,
        714,
        704,
        703,
        697,
        696,
        691,
        688,
        687,
        684,
        683,
        681,
        679,
        674,
        672,
        671,
        668,
        666,
        661,
        660,
        657,
        656,
        655,
        651,
        648,
        640,
        639,
        637,
        635,
        633,
        630,
        624,
        621,
        620,
        618,
        609,
        595,
        586,
        585,
        584,
        575,
        570,
        568,
        567,
        563,
        562,
        561,
        560,
        559,
        557,
        551,
        549,
        545,
        542,
        537,
        535,
        531,
        530,
        523,
        518,
        515,
        514,
        507,
        506,
        505,
        503,
        495,
        490,
        489,
        488,
        484,
        479,
        477,
        467,
        465,
        464,
        462,
        461,
        458,
        457,
        456,
        449,
        445,
        444,
        437,
        433,
        426,
        423,
        420,
        419,
        417,
        416,
        414,
        412,
        409,
        406,
        404,
        400,
        397,
        396,
        394,
        392,
        391,
        390,
        387,
        386,
        385,
        382,
        379,
        377,
        376,
        375,
        373,
        372,
        370,
        364,
        357,
        354,
        353,
        349,
        345,
        344,
        343,
        342,
        341,
        339,
        334,
        332,
        330,
        328,
        314,
        313,
        309,
        308,
        306,
        304,
        300,
        299,
        296,
        293,
        292,
        291,
        289,
        287,
        283,
        279,
        278,
        276,
        275,
        271,
        270,
        269,
        266,
        263,
        262,
        260,
        259,
        257,
        254,
        249,
        248,
        247,
        241,
        240,
        239,
        237,
        235,
        234,
        227,
        224,
        223,
        218,
        217,
        212,
        208,
        205,
        204,
        194,
        193,
        192,
        191,
        190,
        188,
        187,
        186,
        184,
        177,
        173,
        170,
        169,
        166,
        162,
        161,
        160,
        159,
        156,
        155,
        153,
        151,
        144,
        143,
        141,
        139,
        138,
        137,
        133,
        127,
        124,
        122,
        121,
        118,
        116,
        113,
        112,
        111,
        107,
        105,
        102,
        99,
        97,
        96,
        94,
        88,
        86,
        84,
        83,
        82,
        81,
        80,
        79,
        78,
        76,
        75,
        74,
        73,
        72,
        71,
        67,
        65,
        62,
        61,
        60,
        59,
        57,
        55,
        51,
        50,
        48,
        35,
        33,
        32,
        31,
        30,
        28,
        27,
        24,
        22,
        21,
        20,
        19,
        18,
        17,
        14,
        12,
        9,
        6,
        5
    ],
    "finished": true
}