{
    "category": [
        "memory",
        "control flow"
    ],
    "commits": [
        {
            "associated_pull_request": [
                "https://github.com/blacksphere/blackmagic/pull/125"
            ],
            "date": "2016-04-18 20:01:00",
            "diff": "blacksphere_blackmagic/issue_111/commit_e010cd763def53df30b6013676899d2ead4ab794.diff",
            "diff_additions": 4,
            "diff_deletions": 6,
            "diff_file_size": 2199,
            "diff_url": "https://github.com/blacksphere/blackmagic/commit/e010cd763def53df30b6013676899d2ead4ab794.diff",
            "exists": true,
            "files": [
                {
                    "file_additions": 4,
                    "file_deletions": 6,
                    "file_exists": true,
                    "file_name": "src/platforms/hydrabus/usbdfu.c",
                    "file_size": 2199
                }
            ],
            "interesting": {
                "reopen": false,
                "status": false
            },
            "is_parent": true,
            "sha": "e010cd763def53df30b6013676899d2ead4ab794"
        },
        {
            "associated_pull_request": [],
            "date": "2016-04-19 18:58:07",
            "diff": "blacksphere_blackmagic/issue_111/commit_2e42855f3c65c03a02038e86b97c71b4464e6f42.diff",
            "diff_additions": 65,
            "diff_deletions": 53,
            "diff_file_size": 42828,
            "diff_url": "https://github.com/blacksphere/blackmagic/commit/2e42855f3c65c03a02038e86b97c71b4464e6f42.diff",
            "exists": true,
            "files": [
                {
                    "file_additions": 0,
                    "file_deletions": 2,
                    "file_exists": false,
                    "file_name": "src/adiv5_swdp.c",
                    "file_size": 0
                },
                {
                    "file_additions": 11,
                    "file_deletions": 6,
                    "file_exists": true,
                    "file_name": "src/command.c",
                    "file_size": 13730
                },
                {
                    "file_additions": 4,
                    "file_deletions": 7,
                    "file_exists": false,
                    "file_name": "src/cortexm.c",
                    "file_size": 0
                },
                {
                    "file_additions": 0,
                    "file_deletions": 2,
                    "file_exists": false,
                    "file_name": "src/jtag_scan.c",
                    "file_size": 0
                },
                {
                    "file_additions": 3,
                    "file_deletions": 0,
                    "file_exists": true,
                    "file_name": "src/platforms/f4discovery/platform.c",
                    "file_size": 3505
                },
                {
                    "file_additions": 3,
                    "file_deletions": 0,
                    "file_exists": true,
                    "file_name": "src/platforms/hydrabus/platform.c",
                    "file_size": 3186
                },
                {
                    "file_additions": 16,
                    "file_deletions": 0,
                    "file_exists": true,
                    "file_name": "src/platforms/launchpad-icdi/platform.c",
                    "file_size": 3837
                },
                {
                    "file_additions": 0,
                    "file_deletions": 9,
                    "file_exists": false,
                    "file_name": "src/platforms/libftdi/jtagtap.c",
                    "file_size": 0
                },
                {
                    "file_additions": 8,
                    "file_deletions": 0,
                    "file_exists": false,
                    "file_name": "src/platforms/libftdi/platform.c",
                    "file_size": 0
                },
                {
                    "file_additions": 9,
                    "file_deletions": 0,
                    "file_exists": true,
                    "file_name": "src/platforms/native/platform.c",
                    "file_size": 9169
                },
                {
                    "file_additions": 7,
                    "file_deletions": 0,
                    "file_exists": true,
                    "file_name": "src/platforms/stlink/platform.c",
                    "file_size": 4280
                },
                {
                    "file_additions": 0,
                    "file_deletions": 13,
                    "file_exists": false,
                    "file_name": "src/platforms/stm32/jtagtap.c",
                    "file_size": 0
                },
                {
                    "file_additions": 3,
                    "file_deletions": 0,
                    "file_exists": true,
                    "file_name": "src/platforms/swlink/platform.c",
                    "file_size": 5121
                },
                {
                    "file_additions": 0,
                    "file_deletions": 12,
                    "file_exists": false,
                    "file_name": "src/platforms/tm4c/jtagtap.c",
                    "file_size": 0
                },
                {
                    "file_additions": 1,
                    "file_deletions": 1,
                    "file_exists": false,
                    "file_name": "src/samd.c",
                    "file_size": 0
                },
                {
                    "file_additions": 0,
                    "file_deletions": 1,
                    "file_exists": false,
                    "file_name": "src/target.c",
                    "file_size": 0
                }
            ],
            "interesting": {
                "reopen": false,
                "status": false
            },
            "is_parent": false,
            "sha": "2e42855f3c65c03a02038e86b97c71b4464e6f42"
        },
        {
            "associated_pull_request": [],
            "date": "2016-04-19 19:44:57",
            "diff": "blacksphere_blackmagic/issue_111/commit_9f8da8f30aa017ac56ed8223b776be524f79420e.diff",
            "diff_additions": 68,
            "diff_deletions": 53,
            "diff_file_size": 42828,
            "diff_url": "https://github.com/blacksphere/blackmagic/commit/9f8da8f30aa017ac56ed8223b776be524f79420e.diff",
            "exists": true,
            "files": [
                {
                    "file_additions": 0,
                    "file_deletions": 2,
                    "file_exists": false,
                    "file_name": "src/adiv5_swdp.c",
                    "file_size": 0
                },
                {
                    "file_additions": 11,
                    "file_deletions": 6,
                    "file_exists": true,
                    "file_name": "src/command.c",
                    "file_size": 13730
                },
                {
                    "file_additions": 4,
                    "file_deletions": 7,
                    "file_exists": false,
                    "file_name": "src/cortexm.c",
                    "file_size": 0
                },
                {
                    "file_additions": 0,
                    "file_deletions": 2,
                    "file_exists": false,
                    "file_name": "src/jtag_scan.c",
                    "file_size": 0
                },
                {
                    "file_additions": 3,
                    "file_deletions": 0,
                    "file_exists": true,
                    "file_name": "src/platforms/f4discovery/platform.c",
                    "file_size": 3505
                },
                {
                    "file_additions": 3,
                    "file_deletions": 0,
                    "file_exists": true,
                    "file_name": "src/platforms/hydrabus/platform.c",
                    "file_size": 3186
                },
                {
                    "file_additions": 16,
                    "file_deletions": 0,
                    "file_exists": true,
                    "file_name": "src/platforms/launchpad-icdi/platform.c",
                    "file_size": 3837
                },
                {
                    "file_additions": 0,
                    "file_deletions": 9,
                    "file_exists": false,
                    "file_name": "src/platforms/libftdi/jtagtap.c",
                    "file_size": 0
                },
                {
                    "file_additions": 8,
                    "file_deletions": 0,
                    "file_exists": false,
                    "file_name": "src/platforms/libftdi/platform.c",
                    "file_size": 0
                },
                {
                    "file_additions": 12,
                    "file_deletions": 0,
                    "file_exists": true,
                    "file_name": "src/platforms/native/platform.c",
                    "file_size": 9169
                },
                {
                    "file_additions": 7,
                    "file_deletions": 0,
                    "file_exists": true,
                    "file_name": "src/platforms/stlink/platform.c",
                    "file_size": 4280
                },
                {
                    "file_additions": 0,
                    "file_deletions": 13,
                    "file_exists": false,
                    "file_name": "src/platforms/stm32/jtagtap.c",
                    "file_size": 0
                },
                {
                    "file_additions": 3,
                    "file_deletions": 0,
                    "file_exists": true,
                    "file_name": "src/platforms/swlink/platform.c",
                    "file_size": 5121
                },
                {
                    "file_additions": 0,
                    "file_deletions": 12,
                    "file_exists": false,
                    "file_name": "src/platforms/tm4c/jtagtap.c",
                    "file_size": 0
                },
                {
                    "file_additions": 1,
                    "file_deletions": 1,
                    "file_exists": false,
                    "file_name": "src/samd.c",
                    "file_size": 0
                },
                {
                    "file_additions": 0,
                    "file_deletions": 1,
                    "file_exists": false,
                    "file_name": "src/target.c",
                    "file_size": 0
                }
            ],
            "interesting": {
                "reopen": false,
                "status": true
            },
            "is_parent": false,
            "sha": "9f8da8f30aa017ac56ed8223b776be524f79420e"
        },
        {
            "associated_pull_request": [
                "https://github.com/blacksphere/blackmagic/pull/129"
            ],
            "date": "2016-04-19 19:44:57",
            "diff": "blacksphere_blackmagic/issue_111/commit_cd1d72257fcb88d68e4794083a7745466e55a527.diff",
            "diff_additions": 68,
            "diff_deletions": 53,
            "diff_file_size": 42828,
            "diff_url": "https://github.com/blacksphere/blackmagic/commit/cd1d72257fcb88d68e4794083a7745466e55a527.diff",
            "exists": true,
            "files": [
                {
                    "file_additions": 0,
                    "file_deletions": 2,
                    "file_exists": false,
                    "file_name": "src/adiv5_swdp.c",
                    "file_size": 0
                },
                {
                    "file_additions": 11,
                    "file_deletions": 6,
                    "file_exists": true,
                    "file_name": "src/command.c",
                    "file_size": 13730
                },
                {
                    "file_additions": 4,
                    "file_deletions": 7,
                    "file_exists": false,
                    "file_name": "src/cortexm.c",
                    "file_size": 0
                },
                {
                    "file_additions": 0,
                    "file_deletions": 2,
                    "file_exists": false,
                    "file_name": "src/jtag_scan.c",
                    "file_size": 0
                },
                {
                    "file_additions": 3,
                    "file_deletions": 0,
                    "file_exists": true,
                    "file_name": "src/platforms/f4discovery/platform.c",
                    "file_size": 3505
                },
                {
                    "file_additions": 3,
                    "file_deletions": 0,
                    "file_exists": true,
                    "file_name": "src/platforms/hydrabus/platform.c",
                    "file_size": 3186
                },
                {
                    "file_additions": 16,
                    "file_deletions": 0,
                    "file_exists": true,
                    "file_name": "src/platforms/launchpad-icdi/platform.c",
                    "file_size": 3837
                },
                {
                    "file_additions": 0,
                    "file_deletions": 9,
                    "file_exists": false,
                    "file_name": "src/platforms/libftdi/jtagtap.c",
                    "file_size": 0
                },
                {
                    "file_additions": 8,
                    "file_deletions": 0,
                    "file_exists": false,
                    "file_name": "src/platforms/libftdi/platform.c",
                    "file_size": 0
                },
                {
                    "file_additions": 12,
                    "file_deletions": 0,
                    "file_exists": true,
                    "file_name": "src/platforms/native/platform.c",
                    "file_size": 9169
                },
                {
                    "file_additions": 7,
                    "file_deletions": 0,
                    "file_exists": true,
                    "file_name": "src/platforms/stlink/platform.c",
                    "file_size": 4280
                },
                {
                    "file_additions": 0,
                    "file_deletions": 13,
                    "file_exists": false,
                    "file_name": "src/platforms/stm32/jtagtap.c",
                    "file_size": 0
                },
                {
                    "file_additions": 3,
                    "file_deletions": 0,
                    "file_exists": true,
                    "file_name": "src/platforms/swlink/platform.c",
                    "file_size": 5121
                },
                {
                    "file_additions": 0,
                    "file_deletions": 12,
                    "file_exists": false,
                    "file_name": "src/platforms/tm4c/jtagtap.c",
                    "file_size": 0
                },
                {
                    "file_additions": 1,
                    "file_deletions": 1,
                    "file_exists": false,
                    "file_name": "src/samd.c",
                    "file_size": 0
                },
                {
                    "file_additions": 0,
                    "file_deletions": 1,
                    "file_exists": false,
                    "file_name": "src/target.c",
                    "file_size": 0
                }
            ],
            "interesting": {
                "reopen": false,
                "status": false
            },
            "is_parent": false,
            "sha": "cd1d72257fcb88d68e4794083a7745466e55a527"
        }
    ],
    "first_commit": "2016-04-18 20:01:00",
    "last_commit": "2016-04-19 20:12:16",
    "number": 111,
    "pull_request": "None",
    "score": {
        "accidental_reopen_likely": false,
        "all_labels": [],
        "contains_keywords": [
            "fail",
            "bug",
            "problem",
            "debug"
        ],
        "fix_size": 134,
        "has_labels": [],
        "intersecting": {
            "computed_score": 1.0,
            "final_commit_size": 134,
            "intersection_size": 134,
            "previous_commits_size": 134
        },
        "is_makefile_based": true,
        "no_new_files": [],
        "no_other_files": false,
        "num_prohibited_files": 42866,
        "prohibited_files": [
            "hal/inc/pinmap_hal.h",
            "Debug/marvin.bin",
            "Debug/marvin.elf",
            "Debug/marvin.hex",
            "Debug/marvin.bin",
            "Debug/marvin.elf",
            "Debug/marvin.hex",
            "inc/spark_utilities.h",
            "Debug/marvin.bin",
            "Debug/marvin.elf"
        ],
        "reopen": false,
        "reopen_events": [
            [
                "2016-04-19 18:58:15",
                "commit"
            ],
            [
                "2016-04-19 19:45:09",
                "commit"
            ],
            [
                "2016-04-19 20:12:27",
                "commit"
            ],
            [
                "2016-04-19 20:20:36",
                "closed"
            ]
        ],
        "status": true,
        "strategy": true,
        "total_changes": 370
    }
}