{
    "commits": [
        {
            "associated_pull_request": [],
            "date": "2015-11-22 08:39:35+00:00",
            "diff": "",
            "diff_additions": 0,
            "diff_deletions": 0,
            "diff_file_size": 0,
            "diff_url": "https://github.com/weechat/weechat/commit/c7b781bc54e6016c4d478e3f6a5f366b061cc2ed.diff",
            "exists": true,
            "files": [],
            "interesting": {
                "reopen": false,
                "status": false
            },
            "is_parent": true,
            "sha": "c7b781bc54e6016c4d478e3f6a5f366b061cc2ed"
        },
        {
            "associated_pull_request": [],
            "date": "2015-11-24 06:44:21+00:00",
            "diff": "weechat_weechat/issue_602/commit_9e9dd27bb3240731a33a431e5679dd974cd0b1c0.diff",
            "diff_additions": 1,
            "diff_deletions": 1,
            "diff_file_size": 266809,
            "diff_url": "https://github.com/weechat/weechat/commit/9e9dd27bb3240731a33a431e5679dd974cd0b1c0.diff",
            "exists": true,
            "files": [
                {
                    "file_additions": 1,
                    "file_deletions": 1,
                    "file_exists": true,
                    "file_name": "src/plugins/irc/irc-server.c",
                    "file_size": 266809
                }
            ],
            "interesting": {
                "reopen": true,
                "status": false
            },
            "is_parent": false,
            "sha": "9e9dd27bb3240731a33a431e5679dd974cd0b1c0"
        },
        {
            "associated_pull_request": [],
            "date": "2015-11-24 19:26:06+00:00",
            "diff": "weechat_weechat/issue_602/commit_4fca6c58c8d817363a20da6691c1e9705f6234f1.diff",
            "diff_additions": 7,
            "diff_deletions": 1,
            "diff_file_size": 266809,
            "diff_url": "https://github.com/weechat/weechat/commit/4fca6c58c8d817363a20da6691c1e9705f6234f1.diff",
            "exists": true,
            "files": [
                {
                    "file_additions": 7,
                    "file_deletions": 1,
                    "file_exists": true,
                    "file_name": "src/plugins/irc/irc-server.c",
                    "file_size": 266809
                }
            ],
            "interesting": {
                "reopen": false,
                "status": false
            },
            "is_parent": false,
            "sha": "4fca6c58c8d817363a20da6691c1e9705f6234f1"
        }
    ],
    "first_commit": "2015-11-22 08:39:35+00:00",
    "last_commit": "2015-11-24 19:26:06+00:00",
    "number": 602,
    "pull_request": "None",
    "score": {
        "accidental_reopen_likely": false,
        "all_labels": [
            "bug"
        ],
        "contains_keywords": [
            "fix",
            "issu"
        ],
        "fix_size": 8,
        "has_labels": [
            "bug"
        ],
        "intersecting": {
            "computed_score": 0.25,
            "final_commit_size": 8,
            "intersection_size": 2,
            "previous_commits_size": 2
        },
        "is_makefile_based": true,
        "no_new_files": [],
        "no_other_files": false,
        "num_prohibited_files": 78243,
        "prohibited_files": [
            "server/src/main/java/com/genymobile/scrcpy/Device.java",
            "server/src/main/java/com/genymobile/scrcpy/wrappers/SurfaceControl.java",
            "server/src/main/java/com/genymobile/scrcpy/Device.java",
            "server/src/main/java/com/genymobile/scrcpy/wrappers/SurfaceControl.java",
            "app/meson.build",
            "app/scrcpy.1",
            "app/src/common.h",
            "app/src/scrcpy.h",
            "app/src/server.h",
            "server/src/main/java/com/genymobile/scrcpy/Workarounds.java"
        ],
        "reopen": true,
        "reopen_events": [
            [
                "2015-11-24 06:44:46+00:00",
                "closed"
            ],
            [
                "2015-11-24 06:44:46+00:00",
                "commit"
            ],
            [
                "2015-11-24 12:50:27+00:00",
                "reopened"
            ],
            [
                "2015-11-24 19:27:04+00:00",
                "commit"
            ],
            [
                "2015-11-24 19:27:39+00:00",
                "closed"
            ]
        ],
        "status": false,
        "strategy": true,
        "total_changes": 10
    }
}