{
    "commits": [
        {
            "associated_pull_request": [],
            "date": "2020-09-19 10:48:58+00:00",
            "diff": "ptitseb_box86/issue_202/commit_ab644d0638900228598cd765890090a287b9f5c5.diff",
            "diff_additions": 25,
            "diff_deletions": 0,
            "diff_file_size": 110849,
            "diff_url": "https://github.com/ptitSeb/box86/commit/ab644d0638900228598cd765890090a287b9f5c5.diff",
            "exists": true,
            "files": [
                {
                    "file_additions": 25,
                    "file_deletions": 0,
                    "file_exists": true,
                    "file_name": "src/wrapped/wrappedlibc.c",
                    "file_size": 110849
                }
            ],
            "interesting": {
                "reopen": false,
                "status": false
            },
            "is_parent": true,
            "sha": "ab644d0638900228598cd765890090a287b9f5c5"
        },
        {
            "associated_pull_request": [],
            "date": "2020-09-19 12:13:41+00:00",
            "diff": "ptitseb_box86/issue_202/commit_2fa19e8caee483b2064b9fdaa8b343799dc5993d.diff",
            "diff_additions": 12,
            "diff_deletions": 0,
            "diff_file_size": 110849,
            "diff_url": "https://github.com/ptitSeb/box86/commit/2fa19e8caee483b2064b9fdaa8b343799dc5993d.diff",
            "exists": true,
            "files": [
                {
                    "file_additions": 12,
                    "file_deletions": 0,
                    "file_exists": true,
                    "file_name": "src/wrapped/wrappedlibc.c",
                    "file_size": 110849
                }
            ],
            "interesting": {
                "reopen": true,
                "status": false
            },
            "is_parent": false,
            "sha": "2fa19e8caee483b2064b9fdaa8b343799dc5993d"
        },
        {
            "associated_pull_request": [],
            "date": "2020-09-27 12:14:31+00:00",
            "diff": "ptitseb_box86/issue_202/commit_e72cd086b49abdc186df2e55a2ddad1f33ed7689.diff",
            "diff_additions": 32,
            "diff_deletions": 33,
            "diff_file_size": 110849,
            "diff_url": "https://github.com/ptitSeb/box86/commit/e72cd086b49abdc186df2e55a2ddad1f33ed7689.diff",
            "exists": true,
            "files": [
                {
                    "file_additions": 32,
                    "file_deletions": 33,
                    "file_exists": true,
                    "file_name": "src/wrapped/wrappedlibc.c",
                    "file_size": 110849
                }
            ],
            "interesting": {
                "reopen": false,
                "status": false
            },
            "is_parent": false,
            "sha": "e72cd086b49abdc186df2e55a2ddad1f33ed7689"
        }
    ],
    "first_commit": "2020-09-19 10:48:58+00:00",
    "last_commit": "2020-09-27 12:14:31+00:00",
    "number": 202,
    "pull_request": "None",
    "score": {
        "accidental_reopen_likely": false,
        "all_labels": [],
        "contains_keywords": [],
        "fix_size": 66,
        "has_labels": [],
        "intersecting": {
            "computed_score": 0.018518518518518517,
            "final_commit_size": 54,
            "intersection_size": 1,
            "previous_commits_size": 13
        },
        "is_makefile_based": true,
        "no_new_files": [],
        "no_other_files": false,
        "num_prohibited_files": 107031,
        "prohibited_files": [
            "server/src/main/java/com/genymobile/scrcpy/Device.java",
            "server/src/main/java/com/genymobile/scrcpy/wrappers/SurfaceControl.java",
            "server/src/main/java/com/genymobile/scrcpy/Device.java",
            "server/src/main/java/com/genymobile/scrcpy/wrappers/SurfaceControl.java",
            "app/meson.build",
            "app/scrcpy.1",
            "app/src/common.h",
            "app/src/scrcpy.h",
            "app/src/server.h",
            "server/src/main/java/com/genymobile/scrcpy/Workarounds.java"
        ],
        "reopen": true,
        "reopen_events": [
            [
                "2020-09-19 12:14:01+00:00",
                "commit"
            ],
            [
                "2020-09-19 12:21:37+00:00",
                "closed"
            ],
            [
                "2020-09-25 10:27:04+00:00",
                "reopened"
            ],
            [
                "2020-09-27 12:23:11+00:00",
                "commit"
            ],
            [
                "2020-09-28 02:33:06+00:00",
                "closed"
            ]
        ],
        "status": false,
        "strategy": true,
        "total_changes": 102
    }
}