{
    "all_issues": 6793,
    "interesting_issues": 2,
    "last_update": "2023-10-28 22:52:43.539340",
    "license": {
        "download": "https://raw.githubusercontent.com/ElementsProject/lightning/master/LICENSE",
        "name": "Other"
    },
    "ratio": 0.00029442072721919626,
    "size": 92101,
    "stars": 2654,
    "url": "https://github.com/ElementsProject/lightning"
}