{
    "category": [
        "GUI",
        "wrong API usage"
    ],
    "commits": [
        {
            "associated_pull_request": [
                "https://github.com/kamailio/kamailio/pull/776"
            ],
            "date": "2016-09-13 10:03:44",
            "diff": "kamailio_kamailio/issue_777/commit_0eaf0771b747452ca72d218242c40b7285c42574.diff",
            "diff_additions": 122,
            "diff_deletions": 18,
            "diff_file_size": 0,
            "diff_url": "https://github.com/kamailio/kamailio/commit/0eaf0771b747452ca72d218242c40b7285c42574.diff",
            "exists": true,
            "files": [
                {
                    "file_additions": 51,
                    "file_deletions": 15,
                    "file_exists": false,
                    "file_name": "modules/sca/sca.c",
                    "file_size": 0
                },
                {
                    "file_additions": 15,
                    "file_deletions": 3,
                    "file_exists": false,
                    "file_name": "modules/sca/sca_call_info.c",
                    "file_size": 0
                },
                {
                    "file_additions": 56,
                    "file_deletions": 0,
                    "file_exists": false,
                    "file_name": "modules/sca/sca_util.c",
                    "file_size": 0
                }
            ],
            "interesting": {
                "reopen": false,
                "status": false
            },
            "is_parent": true,
            "sha": "0eaf0771b747452ca72d218242c40b7285c42574"
        },
        {
            "associated_pull_request": [],
            "date": "2016-09-13 09:00:34",
            "diff": "kamailio_kamailio/issue_777/commit_2bea57a916b7f4dd0936bc0d3ab8629454afb90a.diff",
            "diff_additions": 12,
            "diff_deletions": 4,
            "diff_file_size": 0,
            "diff_url": "https://github.com/kamailio/kamailio/commit/2bea57a916b7f4dd0936bc0d3ab8629454afb90a.diff",
            "exists": true,
            "files": [
                {
                    "file_additions": 12,
                    "file_deletions": 4,
                    "file_exists": false,
                    "file_name": "modules/sca/sca_subscribe.c",
                    "file_size": 0
                }
            ],
            "interesting": {
                "reopen": false,
                "status": false
            },
            "is_parent": false,
            "sha": "2bea57a916b7f4dd0936bc0d3ab8629454afb90a"
        },
        {
            "associated_pull_request": [],
            "date": "2016-09-13 09:00:34",
            "diff": "kamailio_kamailio/issue_777/commit_f9fada529a7ccdd4c65a0973a0f542481c83853a.diff",
            "diff_additions": 11,
            "diff_deletions": 4,
            "diff_file_size": 0,
            "diff_url": "https://github.com/kamailio/kamailio/commit/f9fada529a7ccdd4c65a0973a0f542481c83853a.diff",
            "exists": true,
            "files": [
                {
                    "file_additions": 11,
                    "file_deletions": 4,
                    "file_exists": false,
                    "file_name": "modules/sca/sca_subscribe.c",
                    "file_size": 0
                }
            ],
            "interesting": {
                "reopen": false,
                "status": true
            },
            "is_parent": false,
            "sha": "f9fada529a7ccdd4c65a0973a0f542481c83853a"
        },
        {
            "associated_pull_request": [
                "https://github.com/kamailio/kamailio/pull/778"
            ],
            "date": "2016-09-13 09:00:34",
            "diff": "kamailio_kamailio/issue_777/commit_179bfcd7eabde187b70e7deceb93c576b17ecc75.diff",
            "diff_additions": 11,
            "diff_deletions": 4,
            "diff_file_size": 0,
            "diff_url": "https://github.com/kamailio/kamailio/commit/179bfcd7eabde187b70e7deceb93c576b17ecc75.diff",
            "exists": true,
            "files": [
                {
                    "file_additions": 11,
                    "file_deletions": 4,
                    "file_exists": false,
                    "file_name": "modules/sca/sca_subscribe.c",
                    "file_size": 0
                }
            ],
            "interesting": {
                "reopen": false,
                "status": false
            },
            "is_parent": false,
            "sha": "179bfcd7eabde187b70e7deceb93c576b17ecc75"
        }
    ],
    "first_commit": "2016-09-13 10:03:44",
    "last_commit": "2016-09-14 16:22:51",
    "number": 777,
    "pull_request": "None",
    "score": {
        "accidental_reopen_likely": false,
        "all_labels": [],
        "contains_keywords": [],
        "fix_size": 20,
        "has_labels": [],
        "intersecting": {
            "computed_score": 1.0,
            "final_commit_size": 16,
            "intersection_size": 16,
            "previous_commits_size": 20
        },
        "is_makefile_based": true,
        "no_new_files": [],
        "no_other_files": false,
        "num_prohibited_files": 38408,
        "prohibited_files": [
            "kill.h",
            "meminfo.h",
            "kill.h",
            "meminfo.h",
            "kill.h",
            "meminfo.h",
            "testsuite_cli_test.go",
            "testsuite_cli_test.go",
            "common.mk",
            "i3bar/include/draw_util.h"
        ],
        "reopen": false,
        "reopen_events": [
            [
                "2016-09-13 13:21:39",
                "commit"
            ],
            [
                "2016-09-14 16:20:02",
                "commit"
            ],
            [
                "2016-09-14 16:23:18",
                "commit"
            ],
            [
                "2016-09-15 06:39:44",
                "closed"
            ]
        ],
        "status": true,
        "strategy": true,
        "total_changes": 186
    }
}