{
    "covered_issues": [
        787,
        784,
        782,
        780,
        778,
        776,
        770,
        769,
        761,
        760,
        759,
        756,
        753,
        750,
        746,
        744,
        738,
        722,
        717,
        713,
        704,
        702,
        699,
        698,
        697,
        680,
        676,
        670,
        669,
        666,
        662,
        661,
        659,
        651,
        649,
        632,
        606,
        605,
        595,
        590,
        580,
        579,
        572,
        569,
        566,
        555,
        543,
        542,
        540,
        531,
        526,
        525,
        523,
        522,
        510,
        493,
        484,
        475,
        467,
        462,
        457,
        451,
        449,
        447,
        444,
        443,
        442,
        434,
        432,
        431,
        428,
        424,
        419,
        418,
        414,
        412,
        410,
        408,
        402,
        396,
        394,
        383,
        378,
        374,
        371,
        369,
        367,
        361,
        357,
        356,
        353,
        350,
        339,
        335,
        332,
        331,
        330,
        328,
        323,
        320,
        319,
        318,
        314,
        312,
        309,
        306,
        305,
        304,
        303,
        302,
        298,
        297,
        292,
        290,
        289,
        287,
        286,
        281,
        280,
        276,
        270,
        266,
        263,
        259,
        258,
        257,
        255,
        252,
        248,
        243,
        241,
        237,
        236,
        233,
        232,
        230,
        226,
        218,
        217,
        216,
        212,
        211,
        208,
        205,
        204,
        202,
        199,
        197,
        192,
        187,
        185,
        184,
        182,
        180,
        175,
        174,
        169,
        167,
        166,
        164,
        163,
        162,
        161,
        154,
        153,
        148,
        147,
        143,
        141,
        136,
        135,
        121,
        119,
        117,
        106,
        104,
        103,
        99,
        98,
        96,
        95,
        92,
        91,
        89,
        88,
        87,
        85,
        79,
        75,
        73,
        71,
        68,
        61,
        59,
        55,
        54,
        53,
        50,
        45,
        43,
        42,
        39,
        38,
        34,
        33,
        28,
        27,
        23,
        21,
        20,
        18,
        17,
        5,
        3
    ],
    "finished": true
}