{
    "commits": [
        {
            "associated_pull_request": [],
            "date": "2016-08-04 18:33:07+00:00",
            "diff": "libuv_libuv/issue_973/commit_44820a549c317539c865d7e8d573605b1fbe2deb.diff",
            "diff_additions": 0,
            "diff_deletions": 2,
            "diff_file_size": 31068,
            "diff_url": "https://github.com/libuv/libuv/commit/44820a549c317539c865d7e8d573605b1fbe2deb.diff",
            "exists": true,
            "files": [
                {
                    "file_additions": 0,
                    "file_deletions": 2,
                    "file_exists": true,
                    "file_name": "src/unix/process.c",
                    "file_size": 31068
                }
            ],
            "interesting": {
                "reopen": false,
                "status": false
            },
            "is_parent": true,
            "sha": "44820a549c317539c865d7e8d573605b1fbe2deb"
        },
        {
            "associated_pull_request": [],
            "date": "2016-08-04 18:35:39+00:00",
            "diff": "libuv_libuv/issue_973/commit_708148fccd47b65a835e290342902781bc8d8548.diff",
            "diff_additions": 1,
            "diff_deletions": 1,
            "diff_file_size": 13307,
            "diff_url": "https://github.com/libuv/libuv/commit/708148fccd47b65a835e290342902781bc8d8548.diff",
            "exists": true,
            "files": [
                {
                    "file_additions": 1,
                    "file_deletions": 1,
                    "file_exists": true,
                    "file_name": "src/unix/tty.c",
                    "file_size": 13307
                }
            ],
            "interesting": {
                "reopen": false,
                "status": false
            },
            "is_parent": false,
            "sha": "708148fccd47b65a835e290342902781bc8d8548"
        },
        {
            "associated_pull_request": [],
            "date": "2016-08-04 18:35:39+00:00",
            "diff": "libuv_libuv/issue_973/commit_37e08f6638d4495b6219dc67f02ce78a3b917530.diff",
            "diff_additions": 1,
            "diff_deletions": 1,
            "diff_file_size": 13307,
            "diff_url": "https://github.com/libuv/libuv/commit/37e08f6638d4495b6219dc67f02ce78a3b917530.diff",
            "exists": true,
            "files": [
                {
                    "file_additions": 1,
                    "file_deletions": 1,
                    "file_exists": true,
                    "file_name": "src/unix/tty.c",
                    "file_size": 13307
                }
            ],
            "interesting": {
                "reopen": false,
                "status": false
            },
            "is_parent": false,
            "sha": "37e08f6638d4495b6219dc67f02ce78a3b917530"
        },
        {
            "associated_pull_request": [],
            "date": "2016-08-04 18:35:39+00:00",
            "diff": "libuv_libuv/issue_973/commit_5ff4635b28f095ac27ad8b6101420f94a7fbda96.diff",
            "diff_additions": 1,
            "diff_deletions": 1,
            "diff_file_size": 13307,
            "diff_url": "https://github.com/libuv/libuv/commit/5ff4635b28f095ac27ad8b6101420f94a7fbda96.diff",
            "exists": true,
            "files": [
                {
                    "file_additions": 1,
                    "file_deletions": 1,
                    "file_exists": true,
                    "file_name": "src/unix/tty.c",
                    "file_size": 13307
                }
            ],
            "interesting": {
                "reopen": false,
                "status": false
            },
            "is_parent": false,
            "sha": "5ff4635b28f095ac27ad8b6101420f94a7fbda96"
        },
        {
            "associated_pull_request": [],
            "date": "2016-08-04 18:35:39+00:00",
            "diff": "libuv_libuv/issue_973/commit_7e2253fcf0a4a034d2c80a6ea116d869ad12b09b.diff",
            "diff_additions": 1,
            "diff_deletions": 1,
            "diff_file_size": 13307,
            "diff_url": "https://github.com/libuv/libuv/commit/7e2253fcf0a4a034d2c80a6ea116d869ad12b09b.diff",
            "exists": true,
            "files": [
                {
                    "file_additions": 1,
                    "file_deletions": 1,
                    "file_exists": true,
                    "file_name": "src/unix/tty.c",
                    "file_size": 13307
                }
            ],
            "interesting": {
                "reopen": false,
                "status": false
            },
            "is_parent": false,
            "sha": "7e2253fcf0a4a034d2c80a6ea116d869ad12b09b"
        },
        {
            "associated_pull_request": [],
            "date": "2016-08-04 18:35:39+00:00",
            "diff": "libuv_libuv/issue_973/commit_ac39c2d737ad7427f5bf12cc465ce5c99a65a11b.diff",
            "diff_additions": 1,
            "diff_deletions": 1,
            "diff_file_size": 13307,
            "diff_url": "https://github.com/libuv/libuv/commit/ac39c2d737ad7427f5bf12cc465ce5c99a65a11b.diff",
            "exists": true,
            "files": [
                {
                    "file_additions": 1,
                    "file_deletions": 1,
                    "file_exists": true,
                    "file_name": "src/unix/tty.c",
                    "file_size": 13307
                }
            ],
            "interesting": {
                "reopen": false,
                "status": false
            },
            "is_parent": false,
            "sha": "ac39c2d737ad7427f5bf12cc465ce5c99a65a11b"
        },
        {
            "associated_pull_request": [],
            "date": "2016-08-04 18:35:39+00:00",
            "diff": "libuv_libuv/issue_973/commit_7720a3f024970924f35d827506fc0e92d1d72c67.diff",
            "diff_additions": 1,
            "diff_deletions": 1,
            "diff_file_size": 13307,
            "diff_url": "https://github.com/libuv/libuv/commit/7720a3f024970924f35d827506fc0e92d1d72c67.diff",
            "exists": true,
            "files": [
                {
                    "file_additions": 1,
                    "file_deletions": 1,
                    "file_exists": true,
                    "file_name": "src/unix/tty.c",
                    "file_size": 13307
                }
            ],
            "interesting": {
                "reopen": false,
                "status": false
            },
            "is_parent": false,
            "sha": "7720a3f024970924f35d827506fc0e92d1d72c67"
        },
        {
            "associated_pull_request": [],
            "date": "2016-08-04 18:35:39+00:00",
            "diff": "libuv_libuv/issue_973/commit_abcf8e5e1f3c6b434ca60eed51f75e53e9bdf2fb.diff",
            "diff_additions": 1,
            "diff_deletions": 1,
            "diff_file_size": 13307,
            "diff_url": "https://github.com/libuv/libuv/commit/abcf8e5e1f3c6b434ca60eed51f75e53e9bdf2fb.diff",
            "exists": true,
            "files": [
                {
                    "file_additions": 1,
                    "file_deletions": 1,
                    "file_exists": true,
                    "file_name": "src/unix/tty.c",
                    "file_size": 13307
                }
            ],
            "interesting": {
                "reopen": true,
                "status": false
            },
            "is_parent": false,
            "sha": "abcf8e5e1f3c6b434ca60eed51f75e53e9bdf2fb"
        },
        {
            "associated_pull_request": [],
            "date": "2016-08-04 18:35:39+00:00",
            "diff": "libuv_libuv/issue_973/commit_9d3680d63d0fe9904fef2cbd45d5750d399ece39.diff",
            "diff_additions": 1,
            "diff_deletions": 1,
            "diff_file_size": 13307,
            "diff_url": "https://github.com/libuv/libuv/commit/9d3680d63d0fe9904fef2cbd45d5750d399ece39.diff",
            "exists": true,
            "files": [
                {
                    "file_additions": 1,
                    "file_deletions": 1,
                    "file_exists": true,
                    "file_name": "src/unix/tty.c",
                    "file_size": 13307
                }
            ],
            "interesting": {
                "reopen": false,
                "status": false
            },
            "is_parent": false,
            "sha": "9d3680d63d0fe9904fef2cbd45d5750d399ece39"
        },
        {
            "associated_pull_request": [],
            "date": "2016-08-04 18:35:39+00:00",
            "diff": "libuv_libuv/issue_973/commit_5cc109e255a11db2c95635e60355dba8b1b4b609.diff",
            "diff_additions": 1,
            "diff_deletions": 1,
            "diff_file_size": 13307,
            "diff_url": "https://github.com/libuv/libuv/commit/5cc109e255a11db2c95635e60355dba8b1b4b609.diff",
            "exists": true,
            "files": [
                {
                    "file_additions": 1,
                    "file_deletions": 1,
                    "file_exists": true,
                    "file_name": "src/unix/tty.c",
                    "file_size": 13307
                }
            ],
            "interesting": {
                "reopen": false,
                "status": false
            },
            "is_parent": false,
            "sha": "5cc109e255a11db2c95635e60355dba8b1b4b609"
        },
        {
            "associated_pull_request": [
                "https://github.com/libuv/libuv/pull/2649"
            ],
            "date": "2016-08-04 18:35:39+00:00",
            "diff": "libuv_libuv/issue_973/commit_1399d851b112ad8376ef2a46303e72fd55125439.diff",
            "diff_additions": 1,
            "diff_deletions": 1,
            "diff_file_size": 13307,
            "diff_url": "https://github.com/libuv/libuv/commit/1399d851b112ad8376ef2a46303e72fd55125439.diff",
            "exists": true,
            "files": [
                {
                    "file_additions": 1,
                    "file_deletions": 1,
                    "file_exists": true,
                    "file_name": "src/unix/tty.c",
                    "file_size": 13307
                }
            ],
            "interesting": {
                "reopen": false,
                "status": false
            },
            "is_parent": false,
            "sha": "1399d851b112ad8376ef2a46303e72fd55125439"
        }
    ],
    "first_commit": "2016-08-04 18:33:07+00:00",
    "last_commit": "2020-01-12 22:40:13+00:00",
    "number": 973,
    "pull_request": "None",
    "score": {
        "accidental_reopen_likely": false,
        "all_labels": [],
        "contains_keywords": [
            "work",
            "chang",
            "fix",
            "issu",
            "patch",
            "reason",
            "fault",
            "bug",
            "error",
            "report"
        ],
        "fix_size": 4,
        "has_labels": [],
        "intersecting": {
            "computed_score": 1.0,
            "final_commit_size": 2,
            "intersection_size": 2,
            "previous_commits_size": 4
        },
        "is_makefile_based": true,
        "no_new_files": [],
        "no_other_files": true,
        "num_prohibited_files": 42306,
        "prohibited_files": [
            "server/src/main/java/com/genymobile/scrcpy/Device.java",
            "server/src/main/java/com/genymobile/scrcpy/wrappers/SurfaceControl.java",
            "server/src/main/java/com/genymobile/scrcpy/Device.java",
            "server/src/main/java/com/genymobile/scrcpy/wrappers/SurfaceControl.java",
            "app/meson.build",
            "app/scrcpy.1",
            "app/src/common.h",
            "app/src/scrcpy.h",
            "app/src/server.h",
            "server/src/main/java/com/genymobile/scrcpy/Workarounds.java"
        ],
        "reopen": true,
        "reopen_events": [
            [
                "2016-08-04 18:38:15+00:00",
                "commit"
            ],
            [
                "2017-11-17 23:13:22+00:00",
                "commit"
            ],
            [
                "2018-04-02 23:46:35+00:00",
                "commit"
            ],
            [
                "2018-11-14 04:52:04+00:00",
                "commit"
            ],
            [
                "2018-11-14 06:12:29+00:00",
                "commit"
            ],
            [
                "2018-11-14 06:57:15+00:00",
                "commit"
            ],
            [
                "2019-05-28 23:07:45+00:00",
                "commit"
            ],
            [
                "2019-06-10 15:41:28+00:00",
                "commit"
            ],
            [
                "2019-11-18 23:38:13+00:00",
                "closed"
            ],
            [
                "2019-11-18 23:47:56+00:00",
                "reopened"
            ],
            [
                "2020-01-10 21:35:39+00:00",
                "commit"
            ],
            [
                "2020-01-10 21:36:10+00:00",
                "commit"
            ],
            [
                "2020-01-12 22:41:26+00:00",
                "closed"
            ],
            [
                "2020-01-12 22:41:26+00:00",
                "commit"
            ]
        ],
        "status": false,
        "strategy": true,
        "total_changes": 22
    }
}