{
    "commits": [
        {
            "associated_pull_request": [
                "https://github.com/GenericMappingTools/gmt/pull/4052"
            ],
            "date": "2020-08-25 21:55:11+00:00",
            "diff": "genericmappingtools_gmt/issue_4055/commit_201d9ee04869372dc53546eb6a0ed7a70037cc4b.diff",
            "diff_additions": 13,
            "diff_deletions": 13,
            "diff_file_size": 1513133,
            "diff_url": "https://github.com/GenericMappingTools/gmt/commit/201d9ee04869372dc53546eb6a0ed7a70037cc4b.diff",
            "exists": true,
            "files": [
                {
                    "file_additions": 1,
                    "file_deletions": 1,
                    "file_exists": true,
                    "file_name": "src/gmt_init.c",
                    "file_size": 952294
                },
                {
                    "file_additions": 8,
                    "file_deletions": 8,
                    "file_exists": true,
                    "file_name": "src/gmt_shore.c",
                    "file_size": 81291
                },
                {
                    "file_additions": 1,
                    "file_deletions": 1,
                    "file_exists": true,
                    "file_name": "src/gmtselect.c",
                    "file_size": 49195
                },
                {
                    "file_additions": 1,
                    "file_deletions": 1,
                    "file_exists": true,
                    "file_name": "src/grdlandmask.c",
                    "file_size": 31742
                },
                {
                    "file_additions": 1,
                    "file_deletions": 1,
                    "file_exists": true,
                    "file_name": "src/grdmath.c",
                    "file_size": 337717
                },
                {
                    "file_additions": 1,
                    "file_deletions": 1,
                    "file_exists": true,
                    "file_name": "src/pscoast.c",
                    "file_size": 60894
                }
            ],
            "interesting": {
                "reopen": false,
                "status": false
            },
            "is_parent": true,
            "sha": "201d9ee04869372dc53546eb6a0ed7a70037cc4b"
        },
        {
            "associated_pull_request": [
                "https://github.com/GenericMappingTools/gmt/pull/4058"
            ],
            "date": "2020-08-26 00:06:52+00:00",
            "diff": "genericmappingtools_gmt/issue_4055/commit_1435b60170f61df76e7babf11fa5b10b41885eed.diff",
            "diff_additions": 12,
            "diff_deletions": 4,
            "diff_file_size": 92867,
            "diff_url": "https://github.com/GenericMappingTools/gmt/commit/1435b60170f61df76e7babf11fa5b10b41885eed.diff",
            "exists": true,
            "files": [
                {
                    "file_additions": 12,
                    "file_deletions": 4,
                    "file_exists": true,
                    "file_name": "src/subplot.c",
                    "file_size": 92867
                }
            ],
            "interesting": {
                "reopen": false,
                "status": false
            },
            "is_parent": false,
            "sha": "1435b60170f61df76e7babf11fa5b10b41885eed"
        },
        {
            "associated_pull_request": [
                "https://github.com/GenericMappingTools/gmt/pull/4072"
            ],
            "date": "2020-08-27 17:02:56+00:00",
            "diff": "genericmappingtools_gmt/issue_4055/commit_b1d6216e399dfac908b017db44437858e7a80e84.diff",
            "diff_additions": 1,
            "diff_deletions": 0,
            "diff_file_size": 481597,
            "diff_url": "https://github.com/GenericMappingTools/gmt/commit/b1d6216e399dfac908b017db44437858e7a80e84.diff",
            "exists": true,
            "files": [
                {
                    "file_additions": 1,
                    "file_deletions": 0,
                    "file_exists": true,
                    "file_name": "src/gmt_map.c",
                    "file_size": 481597
                }
            ],
            "interesting": {
                "reopen": false,
                "status": false
            },
            "is_parent": false,
            "sha": "b1d6216e399dfac908b017db44437858e7a80e84"
        },
        {
            "associated_pull_request": [
                "https://github.com/GenericMappingTools/gmt/pull/4072"
            ],
            "date": "2020-08-27 18:38:45+00:00",
            "diff": "genericmappingtools_gmt/issue_4055/commit_3bb2a1da9caa0a17f9d12d8735909d1aa44c9c92.diff",
            "diff_additions": 1,
            "diff_deletions": 0,
            "diff_file_size": 481597,
            "diff_url": "https://github.com/GenericMappingTools/gmt/commit/3bb2a1da9caa0a17f9d12d8735909d1aa44c9c92.diff",
            "exists": true,
            "files": [
                {
                    "file_additions": 1,
                    "file_deletions": 0,
                    "file_exists": true,
                    "file_name": "src/gmt_map.c",
                    "file_size": 481597
                }
            ],
            "interesting": {
                "reopen": false,
                "status": false
            },
            "is_parent": false,
            "sha": "3bb2a1da9caa0a17f9d12d8735909d1aa44c9c92"
        },
        {
            "associated_pull_request": [
                "https://github.com/GenericMappingTools/gmt/pull/4073"
            ],
            "date": "2020-08-27 18:38:45+00:00",
            "diff": "genericmappingtools_gmt/issue_4055/commit_76d96a892bee8c1eeb87058a3f08cebd5acd89f0.diff",
            "diff_additions": 1,
            "diff_deletions": 0,
            "diff_file_size": 481597,
            "diff_url": "https://github.com/GenericMappingTools/gmt/commit/76d96a892bee8c1eeb87058a3f08cebd5acd89f0.diff",
            "exists": true,
            "files": [
                {
                    "file_additions": 1,
                    "file_deletions": 0,
                    "file_exists": true,
                    "file_name": "src/gmt_map.c",
                    "file_size": 481597
                }
            ],
            "interesting": {
                "reopen": false,
                "status": false
            },
            "is_parent": false,
            "sha": "76d96a892bee8c1eeb87058a3f08cebd5acd89f0"
        },
        {
            "associated_pull_request": [
                "https://github.com/GenericMappingTools/gmt/pull/4073"
            ],
            "date": "2020-08-27 18:59:18+00:00",
            "diff": "genericmappingtools_gmt/issue_4055/commit_806e040a535705446035298d5cefd5fda62b3ea5.diff",
            "diff_additions": 1,
            "diff_deletions": 0,
            "diff_file_size": 481597,
            "diff_url": "https://github.com/GenericMappingTools/gmt/commit/806e040a535705446035298d5cefd5fda62b3ea5.diff",
            "exists": true,
            "files": [
                {
                    "file_additions": 1,
                    "file_deletions": 0,
                    "file_exists": true,
                    "file_name": "src/gmt_map.c",
                    "file_size": 481597
                }
            ],
            "interesting": {
                "reopen": false,
                "status": false
            },
            "is_parent": false,
            "sha": "806e040a535705446035298d5cefd5fda62b3ea5"
        }
    ],
    "first_commit": "2020-08-25 21:55:11+00:00",
    "last_commit": "2020-08-27 18:59:18+00:00",
    "number": 4055,
    "pull_request": "None",
    "score": {
        "accidental_reopen_likely": false,
        "all_labels": [],
        "contains_keywords": [
            "work",
            "issu",
            "reason",
            "test",
            "fault",
            "error",
            "crash"
        ],
        "fix_size": 15,
        "has_labels": [],
        "intersecting": {
            "computed_score": 1.0,
            "final_commit_size": 2,
            "intersection_size": 2,
            "previous_commits_size": 15
        },
        "is_makefile_based": true,
        "no_new_files": [],
        "no_other_files": false,
        "num_prohibited_files": 548046,
        "prohibited_files": [
            "server/src/main/java/com/genymobile/scrcpy/Device.java",
            "server/src/main/java/com/genymobile/scrcpy/wrappers/SurfaceControl.java",
            "server/src/main/java/com/genymobile/scrcpy/Device.java",
            "server/src/main/java/com/genymobile/scrcpy/wrappers/SurfaceControl.java",
            "app/meson.build",
            "app/scrcpy.1",
            "app/src/common.h",
            "app/src/scrcpy.h",
            "app/src/server.h",
            "server/src/main/java/com/genymobile/scrcpy/Workarounds.java"
        ],
        "reopen": true,
        "reopen_events": [
            [
                "2020-08-26 00:06:59+00:00",
                "commit"
            ],
            [
                "2020-08-26 03:04:12+00:00",
                "closed"
            ],
            [
                "2020-08-26 03:04:15+00:00",
                "commit"
            ],
            [
                "2020-08-26 03:05:10+00:00",
                "commit"
            ],
            [
                "2020-08-26 03:15:36+00:00",
                "commit"
            ],
            [
                "2020-08-26 12:22:40+00:00",
                "reopened"
            ],
            [
                "2020-08-27 17:03:04+00:00",
                "commit"
            ],
            [
                "2020-08-27 18:38:45+00:00",
                "closed"
            ],
            [
                "2020-08-27 18:38:47+00:00",
                "commit"
            ],
            [
                "2020-08-27 18:39:36+00:00",
                "commit"
            ],
            [
                "2020-08-27 18:59:19+00:00",
                "commit"
            ]
        ],
        "status": false,
        "strategy": true,
        "total_changes": 46
    }
}