{
    "category": [
        "control flow",
        "wrong API usage"
    ],
    "commits": [
        {
            "associated_pull_request": [
                "https://github.com/akermu/emacs-libvterm/pull/105"
            ],
            "date": "2019-07-31 12:37:38",
            "diff": "akermu_emacs-libvterm/issue_69/commit_7765a7e03e62c954c7ac0a606d513c7e2f59611d.diff",
            "diff_additions": 37,
            "diff_deletions": 1,
            "diff_file_size": 50741,
            "diff_url": "https://github.com/akermu/emacs-libvterm/commit/7765a7e03e62c954c7ac0a606d513c7e2f59611d.diff",
            "exists": true,
            "files": [
                {
                    "file_additions": 37,
                    "file_deletions": 1,
                    "file_exists": true,
                    "file_name": "vterm-module.c",
                    "file_size": 50741
                }
            ],
            "interesting": {
                "reopen": false,
                "status": false
            },
            "is_parent": true,
            "sha": "7765a7e03e62c954c7ac0a606d513c7e2f59611d"
        },
        {
            "associated_pull_request": [
                "https://github.com/akermu/emacs-libvterm/pull/105"
            ],
            "date": "2019-07-31 12:39:45",
            "diff": "akermu_emacs-libvterm/issue_69/commit_ecd362b5d92f62626b18258eeef2b2a04706c86e.diff",
            "diff_additions": 2,
            "diff_deletions": 0,
            "diff_file_size": 50741,
            "diff_url": "https://github.com/akermu/emacs-libvterm/commit/ecd362b5d92f62626b18258eeef2b2a04706c86e.diff",
            "exists": true,
            "files": [
                {
                    "file_additions": 2,
                    "file_deletions": 0,
                    "file_exists": true,
                    "file_name": "vterm-module.c",
                    "file_size": 50741
                }
            ],
            "interesting": {
                "reopen": true,
                "status": false
            },
            "is_parent": false,
            "sha": "ecd362b5d92f62626b18258eeef2b2a04706c86e"
        },
        {
            "associated_pull_request": [
                "https://github.com/akermu/emacs-libvterm/pull/107"
            ],
            "date": "2019-07-31 14:13:27",
            "diff": "akermu_emacs-libvterm/issue_69/commit_f018462e1b533c74c458bfbb2a0a4b5a1622b982.diff",
            "diff_additions": 2,
            "diff_deletions": 0,
            "diff_file_size": 50741,
            "diff_url": "https://github.com/akermu/emacs-libvterm/commit/f018462e1b533c74c458bfbb2a0a4b5a1622b982.diff",
            "exists": true,
            "files": [
                {
                    "file_additions": 2,
                    "file_deletions": 0,
                    "file_exists": true,
                    "file_name": "vterm-module.c",
                    "file_size": 50741
                }
            ],
            "interesting": {
                "reopen": false,
                "status": false
            },
            "is_parent": false,
            "sha": "f018462e1b533c74c458bfbb2a0a4b5a1622b982"
        }
    ],
    "first_commit": "2019-07-31 12:38:45",
    "last_commit": "2019-07-31 14:13:27",
    "number": 69,
    "pull_request": "None",
    "score": {
        "accidental_reopen_likely": false,
        "all_labels": [],
        "contains_keywords": [],
        "fix_size": 5,
        "has_labels": [],
        "intersecting": {
            "computed_score": 0.3333333333333333,
            "final_commit_size": 3,
            "intersection_size": 1,
            "previous_commits_size": 3
        },
        "is_makefile_based": true,
        "no_new_files": [],
        "no_other_files": false,
        "num_prohibited_files": 2682,
        "prohibited_files": [
            "hal/inc/pinmap_hal.h",
            "Debug/marvin.bin",
            "Debug/marvin.elf",
            "Debug/marvin.hex",
            "Debug/marvin.bin",
            "Debug/marvin.elf",
            "Debug/marvin.hex",
            "inc/spark_utilities.h",
            "Debug/marvin.bin",
            "Debug/marvin.elf"
        ],
        "reopen": true,
        "reopen_events": [
            [
                "2019-07-31 12:40:10",
                "commit"
            ],
            [
                "2019-07-31 12:46:32",
                "closed"
            ],
            [
                "2019-07-31 12:46:32",
                "commit"
            ],
            [
                "2019-07-31 13:51:00",
                "reopened"
            ],
            [
                "2019-07-31 14:13:45",
                "commit"
            ],
            [
                "2019-07-31 14:29:35",
                "closed"
            ]
        ],
        "status": false,
        "strategy": true,
        "total_changes": 42
    }
}