{
    "all_issues": 506,
    "interesting_issues": 2,
    "last_update": "2023-11-02 23:47:48.497427",
    "license": {
        "download": "https://raw.githubusercontent.com/lanoxx/tilda/master/COPYING",
        "name": "GNU General Public License v2.0"
    },
    "ratio": 0.003952569169960474,
    "size": 3944,
    "stars": 1208,
    "url": "https://github.com/lanoxx/tilda"
}