{
    "commits": [
        {
            "associated_pull_request": [],
            "date": "2020-12-06 12:00:35+00:00",
            "diff": "cyring_corefreq/issue_214/commit_9966db7d91108656da3bcc66b34b8dd45d57c172.diff",
            "diff_additions": 4,
            "diff_deletions": 2,
            "diff_file_size": 634052,
            "diff_url": "https://github.com/cyring/CoreFreq/commit/9966db7d91108656da3bcc66b34b8dd45d57c172.diff",
            "exists": true,
            "files": [
                {
                    "file_additions": 4,
                    "file_deletions": 2,
                    "file_exists": true,
                    "file_name": "corefreqk.c",
                    "file_size": 634052
                }
            ],
            "interesting": {
                "reopen": false,
                "status": false
            },
            "is_parent": true,
            "sha": "9966db7d91108656da3bcc66b34b8dd45d57c172"
        },
        {
            "associated_pull_request": [],
            "date": "2020-12-06 20:56:12+00:00",
            "diff": "cyring_corefreq/issue_214/commit_de506b7c12c16a90333d38ab9cf565177ae02d7a.diff",
            "diff_additions": 9,
            "diff_deletions": 9,
            "diff_file_size": 634052,
            "diff_url": "https://github.com/cyring/CoreFreq/commit/de506b7c12c16a90333d38ab9cf565177ae02d7a.diff",
            "exists": true,
            "files": [
                {
                    "file_additions": 9,
                    "file_deletions": 9,
                    "file_exists": true,
                    "file_name": "corefreqk.c",
                    "file_size": 634052
                }
            ],
            "interesting": {
                "reopen": true,
                "status": false
            },
            "is_parent": false,
            "sha": "de506b7c12c16a90333d38ab9cf565177ae02d7a"
        },
        {
            "associated_pull_request": [],
            "date": "2022-01-23 11:40:12+00:00",
            "diff": "cyring_corefreq/issue_214/commit_3b226c21e38b78a2e507c3b85658502a7f522e68.diff",
            "diff_additions": 16,
            "diff_deletions": 14,
            "diff_file_size": 634052,
            "diff_url": "https://github.com/cyring/CoreFreq/commit/3b226c21e38b78a2e507c3b85658502a7f522e68.diff",
            "exists": true,
            "files": [
                {
                    "file_additions": 16,
                    "file_deletions": 14,
                    "file_exists": true,
                    "file_name": "corefreqk.c",
                    "file_size": 634052
                }
            ],
            "interesting": {
                "reopen": false,
                "status": false
            },
            "is_parent": false,
            "sha": "3b226c21e38b78a2e507c3b85658502a7f522e68"
        }
    ],
    "first_commit": "2020-12-06 12:00:35+00:00",
    "last_commit": "2022-01-23 11:40:12+00:00",
    "number": 214,
    "pull_request": "None",
    "score": {
        "accidental_reopen_likely": false,
        "all_labels": [
            "enhancement"
        ],
        "contains_keywords": [
            "chang",
            "fix",
            "issu",
            "patch",
            "debug",
            "reason",
            "test",
            "fault",
            "bug",
            "error",
            "crash"
        ],
        "fix_size": 38,
        "has_labels": [],
        "intersecting": {
            "computed_score": 0.034482758620689655,
            "final_commit_size": 29,
            "intersection_size": 1,
            "previous_commits_size": 10
        },
        "is_makefile_based": true,
        "no_new_files": [],
        "no_other_files": false,
        "num_prohibited_files": 141080,
        "prohibited_files": [
            "server/src/main/java/com/genymobile/scrcpy/Device.java",
            "server/src/main/java/com/genymobile/scrcpy/wrappers/SurfaceControl.java",
            "server/src/main/java/com/genymobile/scrcpy/Device.java",
            "server/src/main/java/com/genymobile/scrcpy/wrappers/SurfaceControl.java",
            "app/meson.build",
            "app/scrcpy.1",
            "app/src/common.h",
            "app/src/scrcpy.h",
            "app/src/server.h",
            "server/src/main/java/com/genymobile/scrcpy/Workarounds.java"
        ],
        "reopen": true,
        "reopen_events": [
            [
                "2020-12-06 20:56:52+00:00",
                "commit"
            ],
            [
                "2020-12-07 06:34:26+00:00",
                "closed"
            ],
            [
                "2022-01-22 15:51:57+00:00",
                "reopened"
            ],
            [
                "2022-01-23 11:40:33+00:00",
                "commit"
            ],
            [
                "2022-05-08 16:54:57+00:00",
                "closed"
            ]
        ],
        "status": false,
        "strategy": true,
        "total_changes": 54
    }
}