{
    "category": [
        "memory"
    ],
    "commits": [
        {
            "associated_pull_request": [],
            "date": "2018-08-18 13:16:37",
            "diff": "",
            "diff_additions": 0,
            "diff_deletions": 0,
            "diff_file_size": 0,
            "diff_url": "https://github.com/SeasX/SeasLog/commit/8a3f4817f5e7a55b764933a18f759ffedd9345c4.diff",
            "exists": true,
            "files": [],
            "interesting": {
                "reopen": false,
                "status": false
            },
            "is_parent": true,
            "sha": "8a3f4817f5e7a55b764933a18f759ffedd9345c4"
        },
        {
            "associated_pull_request": [],
            "date": "2018-09-02 09:53:40",
            "diff": "seasx_seaslog/issue_218/commit_f8aef3fee93e769a2e33dd47bde54f1bc3469937.diff",
            "diff_additions": 70,
            "diff_deletions": 5,
            "diff_file_size": 52050,
            "diff_url": "https://github.com/SeasX/SeasLog/commit/f8aef3fee93e769a2e33dd47bde54f1bc3469937.diff",
            "exists": true,
            "files": [
                {
                    "file_additions": 57,
                    "file_deletions": 2,
                    "file_exists": true,
                    "file_name": "seaslog.c",
                    "file_size": 43079
                },
                {
                    "file_additions": 13,
                    "file_deletions": 3,
                    "file_exists": true,
                    "file_name": "src/StreamWrapper.c",
                    "file_size": 8971
                }
            ],
            "interesting": {
                "reopen": false,
                "status": false
            },
            "is_parent": false,
            "sha": "f8aef3fee93e769a2e33dd47bde54f1bc3469937"
        },
        {
            "associated_pull_request": [],
            "date": "2018-09-03 09:56:10",
            "diff": "seasx_seaslog/issue_218/commit_ed77de680bb1ccb5aa86cdded9a9cf3470691df4.diff",
            "diff_additions": 62,
            "diff_deletions": 53,
            "diff_file_size": 52050,
            "diff_url": "https://github.com/SeasX/SeasLog/commit/ed77de680bb1ccb5aa86cdded9a9cf3470691df4.diff",
            "exists": true,
            "files": [
                {
                    "file_additions": 12,
                    "file_deletions": 14,
                    "file_exists": true,
                    "file_name": "seaslog.c",
                    "file_size": 43079
                },
                {
                    "file_additions": 50,
                    "file_deletions": 39,
                    "file_exists": true,
                    "file_name": "src/StreamWrapper.c",
                    "file_size": 8971
                }
            ],
            "interesting": {
                "reopen": false,
                "status": false
            },
            "is_parent": false,
            "sha": "ed77de680bb1ccb5aa86cdded9a9cf3470691df4"
        },
        {
            "associated_pull_request": [],
            "date": "2018-09-03 10:32:46",
            "diff": "seasx_seaslog/issue_218/commit_f59cee16b86e1b6741fc3feafc876a380965c3d5.diff",
            "diff_additions": 6,
            "diff_deletions": 0,
            "diff_file_size": 8971,
            "diff_url": "https://github.com/SeasX/SeasLog/commit/f59cee16b86e1b6741fc3feafc876a380965c3d5.diff",
            "exists": true,
            "files": [
                {
                    "file_additions": 6,
                    "file_deletions": 0,
                    "file_exists": true,
                    "file_name": "src/StreamWrapper.c",
                    "file_size": 8971
                }
            ],
            "interesting": {
                "reopen": false,
                "status": false
            },
            "is_parent": false,
            "sha": "f59cee16b86e1b6741fc3feafc876a380965c3d5"
        },
        {
            "associated_pull_request": [],
            "date": "2018-09-03 12:13:31",
            "diff": "seasx_seaslog/issue_218/commit_30055dc1ab60687e21ce267eb9cf2698b242afa8.diff",
            "diff_additions": 8,
            "diff_deletions": 1,
            "diff_file_size": 8971,
            "diff_url": "https://github.com/SeasX/SeasLog/commit/30055dc1ab60687e21ce267eb9cf2698b242afa8.diff",
            "exists": true,
            "files": [
                {
                    "file_additions": 8,
                    "file_deletions": 1,
                    "file_exists": true,
                    "file_name": "src/StreamWrapper.c",
                    "file_size": 8971
                }
            ],
            "interesting": {
                "reopen": false,
                "status": false
            },
            "is_parent": false,
            "sha": "30055dc1ab60687e21ce267eb9cf2698b242afa8"
        }
    ],
    "first_commit": "2018-08-18 13:16:37",
    "last_commit": "2018-09-04 00:16:57",
    "number": 218,
    "pull_request": "None",
    "score": {
        "accidental_reopen_likely": false,
        "all_labels": [],
        "contains_keywords": [
            "leak"
        ],
        "fix_size": 149,
        "has_labels": [],
        "intersecting": {
            "computed_score": 0.7777777777777778,
            "final_commit_size": 9,
            "intersection_size": 7,
            "previous_commits_size": 147
        },
        "is_makefile_based": false,
        "no_new_files": [],
        "no_other_files": false,
        "num_prohibited_files": 37682,
        "prohibited_files": [
            "kill.h",
            "meminfo.h",
            "kill.h",
            "meminfo.h",
            "kill.h",
            "meminfo.h",
            "testsuite_cli_test.go",
            "testsuite_cli_test.go",
            "common.mk",
            "i3bar/include/draw_util.h"
        ],
        "reopen": false,
        "reopen_events": [
            [
                "2018-09-02 09:53:16",
                "commit"
            ],
            [
                "2018-09-02 10:39:33",
                "commit"
            ],
            [
                "2018-09-02 10:40:27",
                "commit"
            ],
            [
                "2018-09-03 09:55:49",
                "commit"
            ],
            [
                "2018-09-03 10:32:20",
                "commit"
            ],
            [
                "2018-09-03 12:13:11",
                "commit"
            ],
            [
                "2018-09-03 12:46:43",
                "closed"
            ],
            [
                "2018-09-03 13:18:11",
                "commit"
            ],
            [
                "2018-09-03 13:20:18",
                "commit"
            ],
            [
                "2018-09-04 00:16:26",
                "commit"
            ]
        ],
        "status": true,
        "strategy": true,
        "total_changes": 205
    }
}