{
    "category": [
        "GUI",
        "control flow"
    ],
    "commits": [
        {
            "associated_pull_request": [
                "https://github.com/tsl0922/ttyd/pull/56"
            ],
            "date": "2017-04-21 11:56:59",
            "diff": "",
            "diff_additions": 0,
            "diff_deletions": 0,
            "diff_file_size": 0,
            "diff_url": "https://github.com/tsl0922/ttyd/commit/b3db11c2c1bd937cd05438020b610dfd1d402526.diff",
            "exists": true,
            "files": [],
            "interesting": {
                "reopen": false,
                "status": false
            },
            "is_parent": true,
            "sha": "b3db11c2c1bd937cd05438020b610dfd1d402526"
        },
        {
            "associated_pull_request": [],
            "date": "2017-04-24 21:28:54",
            "diff": "tsl0922_ttyd/issue_43/commit_a901d2670ac7f41326b9fa4b8cc8908fbb3c3928.diff",
            "diff_additions": 3,
            "diff_deletions": 1,
            "diff_file_size": 8887,
            "diff_url": "https://github.com/tsl0922/ttyd/commit/a901d2670ac7f41326b9fa4b8cc8908fbb3c3928.diff",
            "exists": true,
            "files": [
                {
                    "file_additions": 3,
                    "file_deletions": 1,
                    "file_exists": true,
                    "file_name": "src/http.c",
                    "file_size": 8887
                }
            ],
            "interesting": {
                "reopen": false,
                "status": false
            },
            "is_parent": false,
            "sha": "a901d2670ac7f41326b9fa4b8cc8908fbb3c3928"
        },
        {
            "associated_pull_request": [],
            "date": "2017-04-24 21:28:54",
            "diff": "tsl0922_ttyd/issue_43/commit_1f6423b80c02b0e3268acefd5ddcffd1f4f1f49e.diff",
            "diff_additions": 2,
            "diff_deletions": 1,
            "diff_file_size": 8887,
            "diff_url": "https://github.com/tsl0922/ttyd/commit/1f6423b80c02b0e3268acefd5ddcffd1f4f1f49e.diff",
            "exists": true,
            "files": [
                {
                    "file_additions": 2,
                    "file_deletions": 1,
                    "file_exists": true,
                    "file_name": "src/http.c",
                    "file_size": 8887
                }
            ],
            "interesting": {
                "reopen": false,
                "status": true
            },
            "is_parent": false,
            "sha": "1f6423b80c02b0e3268acefd5ddcffd1f4f1f49e"
        },
        {
            "associated_pull_request": [],
            "date": "2017-04-24 21:28:54",
            "diff": "tsl0922_ttyd/issue_43/commit_f6361caa50b921d376df3808365ea815f237e64a.diff",
            "diff_additions": 2,
            "diff_deletions": 1,
            "diff_file_size": 8887,
            "diff_url": "https://github.com/tsl0922/ttyd/commit/f6361caa50b921d376df3808365ea815f237e64a.diff",
            "exists": true,
            "files": [
                {
                    "file_additions": 2,
                    "file_deletions": 1,
                    "file_exists": true,
                    "file_name": "src/http.c",
                    "file_size": 8887
                }
            ],
            "interesting": {
                "reopen": false,
                "status": false
            },
            "is_parent": false,
            "sha": "f6361caa50b921d376df3808365ea815f237e64a"
        }
    ],
    "first_commit": "2017-04-21 11:56:59",
    "last_commit": "2017-04-25 12:35:41",
    "number": 43,
    "pull_request": "None",
    "score": {
        "accidental_reopen_likely": false,
        "all_labels": [
            "bug"
        ],
        "contains_keywords": [
            "report",
            "fix",
            "patch",
            "test",
            "issu",
            "chang"
        ],
        "fix_size": 7,
        "has_labels": [
            "bug"
        ],
        "intersecting": {
            "computed_score": 1.0,
            "final_commit_size": 4,
            "intersection_size": 4,
            "previous_commits_size": 7
        },
        "is_makefile_based": true,
        "no_new_files": [],
        "no_other_files": false,
        "num_prohibited_files": 67061,
        "prohibited_files": [
            "kill.h",
            "meminfo.h",
            "kill.h",
            "meminfo.h",
            "kill.h",
            "meminfo.h",
            "testsuite_cli_test.go",
            "testsuite_cli_test.go",
            "common.mk",
            "i3bar/include/draw_util.h"
        ],
        "reopen": false,
        "reopen_events": [
            [
                "2017-04-24 21:28:55",
                "commit"
            ],
            [
                "2017-04-25 12:34:50",
                "closed"
            ],
            [
                "2017-04-25 12:34:50",
                "commit"
            ],
            [
                "2017-04-25 12:35:42",
                "commit"
            ]
        ],
        "status": true,
        "strategy": true,
        "total_changes": 10
    }
}