{
    "commits": [
        {
            "associated_pull_request": [],
            "date": "2021-06-04 06:59:14+00:00",
            "diff": "",
            "diff_additions": 0,
            "diff_deletions": 0,
            "diff_file_size": 0,
            "diff_url": "https://github.com/OpenSIPS/opensips/commit/5d5e956fb53e4f4ac8826b23b0f0a1600b7b14df.diff",
            "exists": true,
            "files": [],
            "interesting": {
                "reopen": false,
                "status": false
            },
            "is_parent": true,
            "sha": "5d5e956fb53e4f4ac8826b23b0f0a1600b7b14df"
        },
        {
            "associated_pull_request": [],
            "date": "2021-05-21 21:12:10+00:00",
            "diff": "opensips_opensips/issue_2351/commit_700b718db6520094c8ab458698088fd1d60c6eb3.diff",
            "diff_additions": 2,
            "diff_deletions": 0,
            "diff_file_size": 101143,
            "diff_url": "https://github.com/OpenSIPS/opensips/commit/700b718db6520094c8ab458698088fd1d60c6eb3.diff",
            "exists": true,
            "files": [
                {
                    "file_additions": 1,
                    "file_deletions": 0,
                    "file_exists": true,
                    "file_name": "modules/mid_registrar/save.c",
                    "file_size": 69281
                },
                {
                    "file_additions": 1,
                    "file_deletions": 0,
                    "file_exists": true,
                    "file_name": "modules/registrar/save.c",
                    "file_size": 31862
                }
            ],
            "interesting": {
                "reopen": false,
                "status": false
            },
            "is_parent": false,
            "sha": "700b718db6520094c8ab458698088fd1d60c6eb3"
        },
        {
            "associated_pull_request": [],
            "date": "2021-06-17 15:09:50+00:00",
            "diff": "opensips_opensips/issue_2351/commit_60f1a532531cefe5696edc0844b7ccb0b36be4c6.diff",
            "diff_additions": 178,
            "diff_deletions": 71,
            "diff_file_size": 270712,
            "diff_url": "https://github.com/OpenSIPS/opensips/commit/60f1a532531cefe5696edc0844b7ccb0b36be4c6.diff",
            "exists": true,
            "files": [
                {
                    "file_additions": 21,
                    "file_deletions": 18,
                    "file_exists": true,
                    "file_name": "modules/mid_registrar/save.c",
                    "file_size": 69281
                },
                {
                    "file_additions": 11,
                    "file_deletions": 9,
                    "file_exists": true,
                    "file_name": "modules/registrar/save.c",
                    "file_size": 31862
                },
                {
                    "file_additions": 4,
                    "file_deletions": 4,
                    "file_exists": true,
                    "file_name": "modules/registrar/test/test.c",
                    "file_size": 6221
                },
                {
                    "file_additions": 1,
                    "file_deletions": 1,
                    "file_exists": true,
                    "file_name": "modules/usrloc/dlist.c",
                    "file_size": 32668
                },
                {
                    "file_additions": 2,
                    "file_deletions": 2,
                    "file_exists": true,
                    "file_name": "modules/usrloc/ucontact.c",
                    "file_size": 25052
                },
                {
                    "file_additions": 1,
                    "file_deletions": 1,
                    "file_exists": true,
                    "file_name": "modules/usrloc/udomain.c",
                    "file_size": 35171
                },
                {
                    "file_additions": 121,
                    "file_deletions": 22,
                    "file_exists": true,
                    "file_name": "modules/usrloc/ul_cluster.c",
                    "file_size": 26042
                },
                {
                    "file_additions": 4,
                    "file_deletions": 3,
                    "file_exists": true,
                    "file_name": "modules/usrloc/ul_mi.c",
                    "file_size": 17645
                },
                {
                    "file_additions": 13,
                    "file_deletions": 11,
                    "file_exists": true,
                    "file_name": "modules/usrloc/urecord.c",
                    "file_size": 26770
                }
            ],
            "interesting": {
                "reopen": true,
                "status": false
            },
            "is_parent": false,
            "sha": "60f1a532531cefe5696edc0844b7ccb0b36be4c6"
        },
        {
            "associated_pull_request": [],
            "date": "2021-06-17 15:09:50+00:00",
            "diff": "opensips_opensips/issue_2351/commit_65feaf1b72f83b1bca981b90d7e1234733236562.diff",
            "diff_additions": 178,
            "diff_deletions": 71,
            "diff_file_size": 270712,
            "diff_url": "https://github.com/OpenSIPS/opensips/commit/65feaf1b72f83b1bca981b90d7e1234733236562.diff",
            "exists": true,
            "files": [
                {
                    "file_additions": 21,
                    "file_deletions": 18,
                    "file_exists": true,
                    "file_name": "modules/mid_registrar/save.c",
                    "file_size": 69281
                },
                {
                    "file_additions": 11,
                    "file_deletions": 9,
                    "file_exists": true,
                    "file_name": "modules/registrar/save.c",
                    "file_size": 31862
                },
                {
                    "file_additions": 4,
                    "file_deletions": 4,
                    "file_exists": true,
                    "file_name": "modules/registrar/test/test.c",
                    "file_size": 6221
                },
                {
                    "file_additions": 1,
                    "file_deletions": 1,
                    "file_exists": true,
                    "file_name": "modules/usrloc/dlist.c",
                    "file_size": 32668
                },
                {
                    "file_additions": 2,
                    "file_deletions": 2,
                    "file_exists": true,
                    "file_name": "modules/usrloc/ucontact.c",
                    "file_size": 25052
                },
                {
                    "file_additions": 1,
                    "file_deletions": 1,
                    "file_exists": true,
                    "file_name": "modules/usrloc/udomain.c",
                    "file_size": 35171
                },
                {
                    "file_additions": 121,
                    "file_deletions": 22,
                    "file_exists": true,
                    "file_name": "modules/usrloc/ul_cluster.c",
                    "file_size": 26042
                },
                {
                    "file_additions": 4,
                    "file_deletions": 3,
                    "file_exists": true,
                    "file_name": "modules/usrloc/ul_mi.c",
                    "file_size": 17645
                },
                {
                    "file_additions": 13,
                    "file_deletions": 11,
                    "file_exists": true,
                    "file_name": "modules/usrloc/urecord.c",
                    "file_size": 26770
                }
            ],
            "interesting": {
                "reopen": false,
                "status": false
            },
            "is_parent": false,
            "sha": "65feaf1b72f83b1bca981b90d7e1234733236562"
        },
        {
            "associated_pull_request": [
                "https://github.com/naveenecosmob/opensips/pull/1",
                "https://github.com/naveenecosmob/opensips/pull/5"
            ],
            "date": "2021-06-17 15:09:50+00:00",
            "diff": "opensips_opensips/issue_2351/commit_7ea363272cc34e3ac94ee3f7f41ee65e951cfbcb.diff",
            "diff_additions": 178,
            "diff_deletions": 71,
            "diff_file_size": 270712,
            "diff_url": "https://github.com/OpenSIPS/opensips/commit/7ea363272cc34e3ac94ee3f7f41ee65e951cfbcb.diff",
            "exists": true,
            "files": [
                {
                    "file_additions": 21,
                    "file_deletions": 18,
                    "file_exists": true,
                    "file_name": "modules/mid_registrar/save.c",
                    "file_size": 69281
                },
                {
                    "file_additions": 11,
                    "file_deletions": 9,
                    "file_exists": true,
                    "file_name": "modules/registrar/save.c",
                    "file_size": 31862
                },
                {
                    "file_additions": 4,
                    "file_deletions": 4,
                    "file_exists": true,
                    "file_name": "modules/registrar/test/test.c",
                    "file_size": 6221
                },
                {
                    "file_additions": 1,
                    "file_deletions": 1,
                    "file_exists": true,
                    "file_name": "modules/usrloc/dlist.c",
                    "file_size": 32668
                },
                {
                    "file_additions": 2,
                    "file_deletions": 2,
                    "file_exists": true,
                    "file_name": "modules/usrloc/ucontact.c",
                    "file_size": 25052
                },
                {
                    "file_additions": 1,
                    "file_deletions": 1,
                    "file_exists": true,
                    "file_name": "modules/usrloc/udomain.c",
                    "file_size": 35171
                },
                {
                    "file_additions": 121,
                    "file_deletions": 22,
                    "file_exists": true,
                    "file_name": "modules/usrloc/ul_cluster.c",
                    "file_size": 26042
                },
                {
                    "file_additions": 4,
                    "file_deletions": 3,
                    "file_exists": true,
                    "file_name": "modules/usrloc/ul_mi.c",
                    "file_size": 17645
                },
                {
                    "file_additions": 13,
                    "file_deletions": 11,
                    "file_exists": true,
                    "file_name": "modules/usrloc/urecord.c",
                    "file_size": 26770
                }
            ],
            "interesting": {
                "reopen": false,
                "status": false
            },
            "is_parent": false,
            "sha": "7ea363272cc34e3ac94ee3f7f41ee65e951cfbcb"
        }
    ],
    "first_commit": "2021-06-04 07:02:26+00:00",
    "last_commit": "2021-06-18 10:16:58+00:00",
    "number": 2351,
    "pull_request": "None",
    "score": {
        "accidental_reopen_likely": false,
        "all_labels": [
            "bug",
            "fixed"
        ],
        "contains_keywords": [
            "confirm",
            "work",
            "fail",
            "fix",
            "issu",
            "CI",
            "test",
            "attempt",
            "fault",
            "remov",
            "bug",
            "problem",
            "crash",
            "report"
        ],
        "fix_size": 240,
        "has_labels": [
            "bug"
        ],
        "intersecting": {
            "computed_score": 1.0,
            "final_commit_size": 235,
            "intersection_size": 235,
            "previous_commits_size": 240
        },
        "is_makefile_based": true,
        "no_new_files": [],
        "no_other_files": false,
        "num_prohibited_files": 311913,
        "prohibited_files": [
            "server/src/main/java/com/genymobile/scrcpy/Device.java",
            "server/src/main/java/com/genymobile/scrcpy/wrappers/SurfaceControl.java",
            "server/src/main/java/com/genymobile/scrcpy/Device.java",
            "server/src/main/java/com/genymobile/scrcpy/wrappers/SurfaceControl.java",
            "app/meson.build",
            "app/scrcpy.1",
            "app/src/common.h",
            "app/src/scrcpy.h",
            "app/src/server.h",
            "server/src/main/java/com/genymobile/scrcpy/Workarounds.java"
        ],
        "reopen": true,
        "reopen_events": [
            [
                "2021-06-04 16:56:56+00:00",
                "commit"
            ],
            [
                "2021-06-04 16:57:14+00:00",
                "commit"
            ],
            [
                "2021-06-04 16:57:36+00:00",
                "commit"
            ],
            [
                "2021-06-17 17:11:32+00:00",
                "closed"
            ],
            [
                "2021-06-17 17:11:32+00:00",
                "commit"
            ],
            [
                "2021-06-17 17:17:09+00:00",
                "reopened"
            ],
            [
                "2021-06-17 18:39:49+00:00",
                "commit"
            ],
            [
                "2021-06-18 10:18:28+00:00",
                "commit"
            ],
            [
                "2021-06-22 08:46:19+00:00",
                "closed"
            ]
        ],
        "status": false,
        "strategy": true,
        "total_changes": 749
    }
}