{
    "covered_issues": [
        171,
        146,
        144,
        140,
        135,
        132,
        130,
        127,
        123,
        122,
        120,
        119,
        118,
        117,
        114,
        110,
        108,
        101,
        99,
        98,
        97,
        96,
        94,
        93,
        90,
        89,
        83,
        77,
        76,
        75,
        72,
        68,
        67,
        66,
        65,
        64,
        62,
        61,
        60,
        59,
        57,
        53,
        52,
        51,
        50,
        49,
        47,
        46,
        45,
        44,
        43,
        42,
        41,
        38,
        37,
        36,
        35,
        34,
        33,
        32,
        31,
        30,
        29,
        27,
        26,
        25,
        24,
        23,
        22,
        21,
        20,
        19,
        17,
        16,
        15,
        13,
        12,
        11,
        9,
        8,
        7,
        6,
        5,
        4,
        3,
        2,
        1
    ],
    "finished": true
}