{
    "covered_issues": [
        364,
        358,
        357,
        352,
        346,
        345,
        343,
        332,
        326,
        315,
        314,
        313,
        312,
        306,
        290,
        271,
        265,
        263,
        262,
        260,
        259,
        258,
        257,
        256,
        253,
        251,
        250,
        248,
        246,
        245,
        244,
        243,
        242,
        241,
        240,
        239,
        238,
        236,
        234,
        232,
        231,
        229,
        227,
        223,
        222,
        217,
        213,
        212,
        210,
        205,
        202,
        201,
        200,
        199,
        198,
        197,
        194,
        190,
        188,
        183,
        181,
        180,
        179,
        178,
        177,
        176,
        175,
        174,
        173,
        171,
        165,
        160,
        158,
        157,
        156,
        155,
        152,
        162,
        151,
        163,
        147,
        145,
        142,
        140,
        138,
        135,
        133,
        132,
        128,
        127,
        125,
        122,
        120,
        118,
        114,
        113,
        112,
        109,
        106,
        105,
        103,
        101,
        95,
        94,
        92,
        81,
        80,
        79,
        73,
        72,
        71,
        70,
        69,
        67,
        65,
        64,
        63,
        62,
        61,
        59,
        56,
        54,
        52,
        50,
        48,
        46,
        45,
        44,
        42,
        38,
        37,
        36,
        35,
        32,
        31,
        29,
        27,
        21,
        20,
        18,
        17,
        16,
        15,
        14,
        13,
        10,
        9,
        8,
        6,
        5,
        3,
        2,
        1
    ],
    "finished": true
}