{
    "category": [
        "GUI",
        "feature request"
    ],
    "commits": [
        {
            "associated_pull_request": [
                "https://github.com/i3/i3/pull/3074"
            ],
            "date": "2017-12-09 14:52:01",
            "diff": "i3_i3/issue_3075/commit_9d2d602d6086e66a98389b17b475c092a6c1ac37.diff",
            "diff_additions": 4,
            "diff_deletions": 4,
            "diff_file_size": 56840,
            "diff_url": "https://github.com/i3/i3/commit/9d2d602d6086e66a98389b17b475c092a6c1ac37.diff",
            "exists": true,
            "files": [
                {
                    "file_additions": 1,
                    "file_deletions": 0,
                    "file_exists": true,
                    "file_name": "src/floating.c",
                    "file_size": 31383
                },
                {
                    "file_additions": 3,
                    "file_deletions": 4,
                    "file_exists": true,
                    "file_name": "src/tree.c",
                    "file_size": 25457
                }
            ],
            "interesting": {
                "reopen": false,
                "status": false
            },
            "is_parent": true,
            "sha": "9d2d602d6086e66a98389b17b475c092a6c1ac37"
        },
        {
            "associated_pull_request": [],
            "date": "2017-12-09 20:17:48",
            "diff": "i3_i3/issue_3075/commit_5558f5035a1300d4aa497d94ddd38bc8d2c579c4.diff",
            "diff_additions": 3,
            "diff_deletions": 2,
            "diff_file_size": 41568,
            "diff_url": "https://github.com/i3/i3/commit/5558f5035a1300d4aa497d94ddd38bc8d2c579c4.diff",
            "exists": true,
            "files": [
                {
                    "file_additions": 2,
                    "file_deletions": 1,
                    "file_exists": true,
                    "file_name": "src/output.c",
                    "file_size": 4114
                },
                {
                    "file_additions": 1,
                    "file_deletions": 1,
                    "file_exists": true,
                    "file_name": "src/workspace.c",
                    "file_size": 37454
                }
            ],
            "interesting": {
                "reopen": false,
                "status": false
            },
            "is_parent": false,
            "sha": "5558f5035a1300d4aa497d94ddd38bc8d2c579c4"
        },
        {
            "associated_pull_request": [],
            "date": "2017-12-09 20:17:48",
            "diff": "i3_i3/issue_3075/commit_87693e69421335f3222dc80df9cafb1e04505637.diff",
            "diff_additions": 4,
            "diff_deletions": 1,
            "diff_file_size": 41568,
            "diff_url": "https://github.com/i3/i3/commit/87693e69421335f3222dc80df9cafb1e04505637.diff",
            "exists": true,
            "files": [
                {
                    "file_additions": 2,
                    "file_deletions": 1,
                    "file_exists": true,
                    "file_name": "src/output.c",
                    "file_size": 4114
                },
                {
                    "file_additions": 2,
                    "file_deletions": 0,
                    "file_exists": true,
                    "file_name": "src/workspace.c",
                    "file_size": 37454
                }
            ],
            "interesting": {
                "reopen": false,
                "status": true
            },
            "is_parent": false,
            "sha": "87693e69421335f3222dc80df9cafb1e04505637"
        },
        {
            "associated_pull_request": [],
            "date": "2017-12-09 20:17:48",
            "diff": "i3_i3/issue_3075/commit_9ec0638bc34a623aef4997a79aae383b833888b6.diff",
            "diff_additions": 4,
            "diff_deletions": 1,
            "diff_file_size": 41568,
            "diff_url": "https://github.com/i3/i3/commit/9ec0638bc34a623aef4997a79aae383b833888b6.diff",
            "exists": true,
            "files": [
                {
                    "file_additions": 2,
                    "file_deletions": 1,
                    "file_exists": true,
                    "file_name": "src/output.c",
                    "file_size": 4114
                },
                {
                    "file_additions": 2,
                    "file_deletions": 0,
                    "file_exists": true,
                    "file_name": "src/workspace.c",
                    "file_size": 37454
                }
            ],
            "interesting": {
                "reopen": false,
                "status": false
            },
            "is_parent": false,
            "sha": "9ec0638bc34a623aef4997a79aae383b833888b6"
        },
        {
            "associated_pull_request": [
                "https://github.com/i3/i3/pull/3078"
            ],
            "date": "2017-12-09 20:17:48",
            "diff": "i3_i3/issue_3075/commit_d134745c4f1717d3ab6c2dc28f55e5c75b983950.diff",
            "diff_additions": 7,
            "diff_deletions": 1,
            "diff_file_size": 41568,
            "diff_url": "https://github.com/i3/i3/commit/d134745c4f1717d3ab6c2dc28f55e5c75b983950.diff",
            "exists": true,
            "files": [
                {
                    "file_additions": 2,
                    "file_deletions": 1,
                    "file_exists": true,
                    "file_name": "src/output.c",
                    "file_size": 4114
                },
                {
                    "file_additions": 5,
                    "file_deletions": 0,
                    "file_exists": true,
                    "file_name": "src/workspace.c",
                    "file_size": 37454
                }
            ],
            "interesting": {
                "reopen": false,
                "status": false
            },
            "is_parent": false,
            "sha": "d134745c4f1717d3ab6c2dc28f55e5c75b983950"
        },
        {
            "associated_pull_request": [
                "https://github.com/i3/i3/pull/3078"
            ],
            "date": "2017-12-10 21:02:10",
            "diff": "i3_i3/issue_3075/commit_57ee66ad25feebf016db599827118f40899238b3.diff",
            "diff_additions": 7,
            "diff_deletions": 1,
            "diff_file_size": 41568,
            "diff_url": "https://github.com/i3/i3/commit/57ee66ad25feebf016db599827118f40899238b3.diff",
            "exists": true,
            "files": [
                {
                    "file_additions": 2,
                    "file_deletions": 1,
                    "file_exists": true,
                    "file_name": "src/output.c",
                    "file_size": 4114
                },
                {
                    "file_additions": 5,
                    "file_deletions": 0,
                    "file_exists": true,
                    "file_name": "src/workspace.c",
                    "file_size": 37454
                }
            ],
            "interesting": {
                "reopen": false,
                "status": false
            },
            "is_parent": false,
            "sha": "57ee66ad25feebf016db599827118f40899238b3"
        }
    ],
    "first_commit": "2017-12-09 14:52:01",
    "last_commit": "2017-12-10 21:02:10",
    "number": 3075,
    "pull_request": "None",
    "score": {
        "accidental_reopen_likely": false,
        "all_labels": [
            "4.14",
            "bug",
            "reproducible"
        ],
        "contains_keywords": [
            "work",
            "fix",
            "patch",
            "fault",
            "bug",
            "issu",
            "chang",
            "crash",
            "problem"
        ],
        "fix_size": 12,
        "has_labels": [
            "bug"
        ],
        "intersecting": {
            "computed_score": 1.0,
            "final_commit_size": 9,
            "intersection_size": 9,
            "previous_commits_size": 12
        },
        "is_makefile_based": false,
        "no_new_files": [],
        "no_other_files": false,
        "num_prohibited_files": 132628,
        "prohibited_files": [
            "kill.h",
            "meminfo.h",
            "kill.h",
            "meminfo.h",
            "kill.h",
            "meminfo.h",
            "testsuite_cli_test.go",
            "testsuite_cli_test.go",
            "common.mk",
            "i3bar/include/draw_util.h"
        ],
        "reopen": false,
        "reopen_events": [
            [
                "2017-12-09 20:18:24",
                "commit"
            ],
            [
                "2017-12-10 13:16:24",
                "commit"
            ],
            [
                "2017-12-10 13:26:14",
                "commit"
            ],
            [
                "2017-12-10 19:39:09",
                "commit"
            ],
            [
                "2017-12-10 21:02:11",
                "closed"
            ],
            [
                "2017-12-10 21:02:12",
                "commit"
            ]
        ],
        "status": true,
        "strategy": true,
        "total_changes": 39
    }
}