{
    "commits": [
        {
            "diff": "spring-projects_spring-boot/issue_24987/commit_c9a2c4e326b4cf0f0c46f33e42b006f0615ff231.diff",
            "diff_additions": 27,
            "diff_deletions": 27,
            "diff_file_size": 248349,
            "files": [
                {
                    "file_additions": 1,
                    "file_deletions": 1,
                    "file_exists": true,
                    "file_name": "spring-boot-project/spring-boot-actuator-autoconfigure/src/main/java/org/springframework/boot/actuate/autoconfigure/endpoint/expose/IncludeExcludeEndpointFilter.java",
                    "file_size": 7979
                },
                {
                    "file_additions": 1,
                    "file_deletions": 1,
                    "file_exists": true,
                    "file_name": "spring-boot-project/spring-boot-actuator-autoconfigure/src/main/java/org/springframework/boot/actuate/autoconfigure/security/reactive/ReactiveManagementWebSecurityAutoConfiguration.java",
                    "file_size": 3613
                },
                {
                    "file_additions": 1,
                    "file_deletions": 1,
                    "file_exists": true,
                    "file_name": "spring-boot-project/spring-boot-actuator-autoconfigure/src/main/java/org/springframework/boot/actuate/autoconfigure/security/servlet/ManagementWebSecurityAutoConfiguration.java",
                    "file_size": 3501
                },
                {
                    "file_additions": 1,
                    "file_deletions": 1,
                    "file_exists": true,
                    "file_name": "spring-boot-project/spring-boot-actuator-autoconfigure/src/test/java/org/springframework/boot/actuate/autoconfigure/endpoint/condition/ConditionalOnAvailableEndpointTests.java",
                    "file_size": 10982
                },
                {
                    "file_additions": 1,
                    "file_deletions": 1,
                    "file_exists": true,
                    "file_name": "spring-boot-project/spring-boot-actuator-autoconfigure/src/test/java/org/springframework/boot/actuate/autoconfigure/info/InfoEndpointAutoConfigurationTests.java",
                    "file_size": 1901
                },
                {
                    "file_additions": 1,
                    "file_deletions": 1,
                    "file_exists": true,
                    "file_name": "spring-boot-project/spring-boot-actuator-autoconfigure/src/test/java/org/springframework/boot/actuate/autoconfigure/integrationtest/WebMvcEndpointExposureIntegrationTests.java",
                    "file_size": 10993
                },
                {
                    "file_additions": 1,
                    "file_deletions": 1,
                    "file_exists": true,
                    "file_name": "spring-boot-project/spring-boot-actuator-autoconfigure/src/test/java/org/springframework/boot/actuate/autoconfigure/security/reactive/ReactiveManagementWebSecurityAutoConfigurationTests.java",
                    "file_size": 8903
                },
                {
                    "file_additions": 1,
                    "file_deletions": 1,
                    "file_exists": true,
                    "file_name": "spring-boot-project/spring-boot-actuator/src/main/java/org/springframework/boot/actuate/endpoint/web/reactive/AbstractWebFluxEndpointHandlerMapping.java",
                    "file_size": 16054
                },
                {
                    "file_additions": 1,
                    "file_deletions": 1,
                    "file_exists": true,
                    "file_name": "spring-boot-project/spring-boot-actuator/src/main/java/org/springframework/boot/actuate/endpoint/web/reactive/ControllerEndpointHandlerMapping.java",
                    "file_size": 4563
                },
                {
                    "file_additions": 1,
                    "file_deletions": 1,
                    "file_exists": true,
                    "file_name": "spring-boot-project/spring-boot-autoconfigure/src/main/java/org/springframework/boot/autoconfigure/data/couchbase/CouchbaseClientFactoryDependentConfiguration.java",
                    "file_size": 2259
                },
                {
                    "file_additions": 1,
                    "file_deletions": 1,
                    "file_exists": true,
                    "file_name": "spring-boot-project/spring-boot-autoconfigure/src/main/java/org/springframework/boot/autoconfigure/data/couchbase/CouchbaseDataConfiguration.java",
                    "file_size": 3690
                },
                {
                    "file_additions": 1,
                    "file_deletions": 1,
                    "file_exists": true,
                    "file_name": "spring-boot-project/spring-boot-autoconfigure/src/main/java/org/springframework/boot/autoconfigure/elasticsearch/ElasticsearchRestClientConfigurations.java",
                    "file_size": 7223
                },
                {
                    "file_additions": 1,
                    "file_deletions": 1,
                    "file_exists": true,
                    "file_name": "spring-boot-project/spring-boot-autoconfigure/src/main/java/org/springframework/boot/autoconfigure/kafka/KafkaProperties.java",
                    "file_size": 33863
                },
                {
                    "file_additions": 1,
                    "file_deletions": 1,
                    "file_exists": true,
                    "file_name": "spring-boot-project/spring-boot-autoconfigure/src/main/java/org/springframework/boot/autoconfigure/transaction/jta/JtaAutoConfiguration.java",
                    "file_size": 2056
                },
                {
                    "file_additions": 1,
                    "file_deletions": 1,
                    "file_exists": true,
                    "file_name": "spring-boot-project/spring-boot-autoconfigure/src/test/java/org/springframework/boot/autoconfigure/kafka/KafkaAutoConfigurationTests.java",
                    "file_size": 38135
                },
                {
                    "file_additions": 1,
                    "file_deletions": 1,
                    "file_exists": true,
                    "file_name": "spring-boot-project/spring-boot-autoconfigure/src/test/java/org/springframework/boot/autoconfigure/security/oauth2/resource/reactive/ReactiveOAuth2ResourceServerAutoConfigurationTests.java",
                    "file_size": 22367
                },
                {
                    "file_additions": 1,
                    "file_deletions": 1,
                    "file_exists": true,
                    "file_name": "spring-boot-project/spring-boot-autoconfigure/src/test/java/org/springframework/boot/autoconfigure/security/oauth2/resource/servlet/OAuth2ResourceServerAutoConfigurationTests.java",
                    "file_size": 21973
                },
                {
                    "file_additions": 1,
                    "file_deletions": 1,
                    "file_exists": true,
                    "file_name": "spring-boot-project/spring-boot-autoconfigure/src/test/java/org/springframework/boot/autoconfigure/transaction/jta/JtaAutoConfigurationTests.java",
                    "file_size": 7727
                },
                {
                    "file_additions": 1,
                    "file_deletions": 1,
                    "file_exists": true,
                    "file_name": "spring-boot-project/spring-boot-test-autoconfigure/src/main/java/org/springframework/boot/test/autoconfigure/web/client/MockRestServiceServerAutoConfiguration.java",
                    "file_size": 4620
                },
                {
                    "file_additions": 1,
                    "file_deletions": 1,
                    "file_exists": true,
                    "file_name": "spring-boot-project/spring-boot-test/src/main/java/org/springframework/boot/test/web/client/RootUriRequestExpectationManager.java",
                    "file_size": 7253
                },
                {
                    "file_additions": 1,
                    "file_deletions": 1,
                    "file_exists": true,
                    "file_name": "spring-boot-project/spring-boot-tools/spring-boot-gradle-plugin/src/test/java/org/springframework/boot/gradle/junit/GradleCompatibilityExtension.java",
                    "file_size": 4525
                },
                {
                    "file_additions": 1,
                    "file_deletions": 1,
                    "file_exists": true,
                    "file_name": "spring-boot-tests/spring-boot-smoke-tests/spring-boot-smoke-test-actuator-custom-security/src/main/java/smoketest/actuator/customsecurity/SecurityConfiguration.java",
                    "file_size": 2998
                },
                {
                    "file_additions": 1,
                    "file_deletions": 1,
                    "file_exists": true,
                    "file_name": "spring-boot-tests/spring-boot-smoke-tests/spring-boot-smoke-test-actuator/src/test/java/smoketest/actuator/SampleActuatorApplicationTests.java",
                    "file_size": 7604
                },
                {
                    "file_additions": 1,
                    "file_deletions": 1,
                    "file_exists": true,
                    "file_name": "spring-boot-tests/spring-boot-smoke-tests/spring-boot-smoke-test-secure-jersey/src/main/java/smoketest/secure/jersey/SecurityConfiguration.java",
                    "file_size": 2073
                },
                {
                    "file_additions": 1,
                    "file_deletions": 1,
                    "file_exists": true,
                    "file_name": "spring-boot-tests/spring-boot-smoke-tests/spring-boot-smoke-test-secure-webflux/src/test/java/smoketest/secure/webflux/ManagementPortSampleSecureWebFluxTests.java",
                    "file_size": 4076
                },
                {
                    "file_additions": 1,
                    "file_deletions": 1,
                    "file_exists": true,
                    "file_name": "spring-boot-tests/spring-boot-smoke-tests/spring-boot-smoke-test-secure-webflux/src/test/java/smoketest/secure/webflux/SampleSecureWebFluxApplicationTests.java",
                    "file_size": 2462
                },
                {
                    "file_additions": 1,
                    "file_deletions": 1,
                    "file_exists": true,
                    "file_name": "spring-boot-tests/spring-boot-smoke-tests/spring-boot-smoke-test-secure-webflux/src/test/java/smoketest/secure/webflux/SampleSecureWebFluxCustomSecurityTests.java",
                    "file_size": 4956
                }
            ],
            "interesting": {
                "reopened": false,
                "status": false
            },
            "sha": "c9a2c4e326b4cf0f0c46f33e42b006f0615ff231"
        },
        {
            "diff": "spring-projects_spring-boot/issue_24987/commit_48276b58e3bf134744bb9b197c276d0e76a34ccc.diff",
            "diff_additions": 127,
            "diff_deletions": 5,
            "diff_file_size": 23508,
            "files": [
                {
                    "file_additions": 35,
                    "file_deletions": 2,
                    "file_exists": true,
                    "file_name": "spring-boot-project/spring-boot-autoconfigure/src/main/java/org/springframework/boot/autoconfigure/couchbase/CouchbaseAutoConfiguration.java",
                    "file_size": 6319
                },
                {
                    "file_additions": 57,
                    "file_deletions": 0,
                    "file_exists": true,
                    "file_name": "spring-boot-project/spring-boot-autoconfigure/src/main/java/org/springframework/boot/autoconfigure/couchbase/CouchbaseProperties.java",
                    "file_size": 6434
                },
                {
                    "file_additions": 23,
                    "file_deletions": 2,
                    "file_exists": true,
                    "file_name": "spring-boot-project/spring-boot-autoconfigure/src/test/java/org/springframework/boot/autoconfigure/couchbase/CouchbaseAutoConfigurationIntegrationTests.java",
                    "file_size": 2932
                },
                {
                    "file_additions": 12,
                    "file_deletions": 1,
                    "file_exists": true,
                    "file_name": "spring-boot-project/spring-boot-autoconfigure/src/test/java/org/springframework/boot/autoconfigure/couchbase/CouchbaseAutoConfigurationTests.java",
                    "file_size": 7823
                }
            ],
            "interesting": {
                "reopened": false,
                "status": true
            },
            "sha": "48276b58e3bf134744bb9b197c276d0e76a34ccc"
        },
        {
            "diff": "spring-projects_spring-boot/issue_24987/commit_b1cb529036f1944dae3de36276f48b50c60e2ce9.diff",
            "diff_additions": 131,
            "diff_deletions": 5,
            "diff_file_size": 23508,
            "files": [
                {
                    "file_additions": 37,
                    "file_deletions": 2,
                    "file_exists": true,
                    "file_name": "spring-boot-project/spring-boot-autoconfigure/src/main/java/org/springframework/boot/autoconfigure/couchbase/CouchbaseAutoConfiguration.java",
                    "file_size": 6319
                },
                {
                    "file_additions": 59,
                    "file_deletions": 0,
                    "file_exists": true,
                    "file_name": "spring-boot-project/spring-boot-autoconfigure/src/main/java/org/springframework/boot/autoconfigure/couchbase/CouchbaseProperties.java",
                    "file_size": 6434
                },
                {
                    "file_additions": 23,
                    "file_deletions": 2,
                    "file_exists": true,
                    "file_name": "spring-boot-project/spring-boot-autoconfigure/src/test/java/org/springframework/boot/autoconfigure/couchbase/CouchbaseAutoConfigurationIntegrationTests.java",
                    "file_size": 2932
                },
                {
                    "file_additions": 12,
                    "file_deletions": 1,
                    "file_exists": true,
                    "file_name": "spring-boot-project/spring-boot-autoconfigure/src/test/java/org/springframework/boot/autoconfigure/couchbase/CouchbaseAutoConfigurationTests.java",
                    "file_size": 7823
                }
            ],
            "interesting": {
                "reopened": false,
                "status": true
            },
            "sha": "b1cb529036f1944dae3de36276f48b50c60e2ce9"
        },
        {
            "diff": "spring-projects_spring-boot/issue_24987/commit_c2206fa51ed8a0419a0aea5fa77467fdc2a33874.diff",
            "diff_additions": 131,
            "diff_deletions": 5,
            "diff_file_size": 23508,
            "files": [
                {
                    "file_additions": 37,
                    "file_deletions": 2,
                    "file_exists": true,
                    "file_name": "spring-boot-project/spring-boot-autoconfigure/src/main/java/org/springframework/boot/autoconfigure/couchbase/CouchbaseAutoConfiguration.java",
                    "file_size": 6319
                },
                {
                    "file_additions": 59,
                    "file_deletions": 0,
                    "file_exists": true,
                    "file_name": "spring-boot-project/spring-boot-autoconfigure/src/main/java/org/springframework/boot/autoconfigure/couchbase/CouchbaseProperties.java",
                    "file_size": 6434
                },
                {
                    "file_additions": 23,
                    "file_deletions": 2,
                    "file_exists": true,
                    "file_name": "spring-boot-project/spring-boot-autoconfigure/src/test/java/org/springframework/boot/autoconfigure/couchbase/CouchbaseAutoConfigurationIntegrationTests.java",
                    "file_size": 2932
                },
                {
                    "file_additions": 12,
                    "file_deletions": 1,
                    "file_exists": true,
                    "file_name": "spring-boot-project/spring-boot-autoconfigure/src/test/java/org/springframework/boot/autoconfigure/couchbase/CouchbaseAutoConfigurationTests.java",
                    "file_size": 7823
                }
            ],
            "interesting": {
                "reopened": false,
                "status": false
            },
            "sha": "c2206fa51ed8a0419a0aea5fa77467fdc2a33874"
        }
    ],
    "first_commit": "2021-01-27 03:06:48",
    "last_commit": "2021-01-27 22:57:37",
    "number": 24987,
    "score": 352.0087336244541
}