{
    "covered_issues": [
        647,
        645,
        641,
        638,
        635,
        634,
        633,
        614,
        607,
        596,
        595,
        592,
        591,
        588,
        587,
        575,
        570,
        566,
        563,
        548,
        545,
        542,
        540,
        538,
        535,
        527,
        525,
        516,
        512,
        511,
        508,
        507,
        498,
        497,
        496,
        495,
        494,
        493,
        491,
        489,
        487,
        486,
        485,
        483,
        474,
        471,
        467,
        464,
        460,
        457,
        449,
        442,
        440,
        435,
        434,
        432,
        429,
        427,
        424,
        423,
        419,
        418,
        417,
        415,
        414,
        413,
        412,
        411,
        408,
        407,
        398,
        393,
        392,
        389,
        385,
        377,
        369,
        368,
        367,
        364,
        362,
        355,
        352,
        347,
        341,
        337,
        332,
        330,
        328,
        327,
        325,
        324,
        323,
        322,
        320,
        316,
        315,
        310,
        307,
        306,
        304,
        301,
        286,
        285,
        283,
        282,
        281,
        280,
        279,
        278,
        275,
        274,
        273,
        272,
        270,
        267,
        265,
        264,
        262,
        261,
        260,
        257,
        253,
        244,
        243,
        240,
        239,
        238,
        236,
        233,
        232,
        231,
        230,
        229,
        228,
        223,
        213,
        212,
        211,
        210,
        209,
        208,
        207,
        206,
        205,
        204,
        202,
        201,
        200,
        199,
        196,
        195,
        193,
        192,
        190,
        189,
        188,
        187,
        186,
        185,
        183,
        181,
        180,
        178,
        177,
        175,
        173,
        172,
        170,
        169,
        168,
        167,
        166,
        164,
        163,
        162,
        161,
        160,
        159,
        158,
        157,
        156,
        155,
        154,
        153,
        152,
        151,
        149,
        148,
        147,
        146,
        145,
        144,
        143,
        142,
        141,
        140,
        139,
        138,
        137,
        136,
        135,
        134,
        133,
        132,
        131,
        130,
        128,
        127,
        126,
        124,
        121,
        114,
        113,
        112,
        111,
        110,
        109,
        108,
        105,
        104,
        103,
        102,
        101,
        99,
        98,
        97,
        95,
        94,
        93,
        92,
        91,
        90,
        89,
        87,
        86,
        85,
        84,
        83,
        82,
        81,
        80,
        79,
        78,
        73,
        72,
        71,
        69,
        68,
        66,
        65,
        64,
        63,
        62,
        61,
        60,
        59,
        58,
        57,
        56,
        55,
        53,
        50,
        49,
        48,
        47,
        43,
        42,
        41,
        38,
        37,
        35,
        34,
        32,
        31,
        30,
        29,
        28,
        27,
        26,
        25,
        24,
        23,
        22,
        21,
        20,
        18,
        17,
        15,
        13,
        12,
        11,
        10,
        9,
        8,
        7,
        6,
        5,
        4,
        3,
        2,
        1
    ],
    "finished": true
}