{
    "category": [
        "memory",
        "feature request"
    ],
    "commits": [
        {
            "associated_pull_request": [
                "https://github.com/radareorg/radare2/pull/8557"
            ],
            "date": "2017-09-18 20:14:25",
            "diff": "radareorg_radare2/issue_8487/commit_8c12935303fdb6bb2573775ae7ced1ac5c255f3a.diff",
            "diff_additions": 4,
            "diff_deletions": 4,
            "diff_file_size": 18419,
            "diff_url": "https://github.com/radareorg/radare2/commit/8c12935303fdb6bb2573775ae7ced1ac5c255f3a.diff",
            "exists": true,
            "files": [
                {
                    "file_additions": 4,
                    "file_deletions": 4,
                    "file_exists": true,
                    "file_name": "libr/io/io.c",
                    "file_size": 18419
                }
            ],
            "interesting": {
                "reopen": false,
                "status": false
            },
            "is_parent": true,
            "sha": "8c12935303fdb6bb2573775ae7ced1ac5c255f3a"
        },
        {
            "associated_pull_request": [
                "https://github.com/radareorg/radare2/pull/8556"
            ],
            "date": "2017-09-18 20:15:05",
            "diff": "radareorg_radare2/issue_8487/commit_493a6d00f818908b75b2fc234f0c730b6b4b1126.diff",
            "diff_additions": 43,
            "diff_deletions": 0,
            "diff_file_size": 200867,
            "diff_url": "https://github.com/radareorg/radare2/commit/493a6d00f818908b75b2fc234f0c730b6b4b1126.diff",
            "exists": true,
            "files": [
                {
                    "file_additions": 43,
                    "file_deletions": 0,
                    "file_exists": true,
                    "file_name": "libr/core/cmd_print.c",
                    "file_size": 200867
                }
            ],
            "interesting": {
                "reopen": true,
                "status": false
            },
            "is_parent": false,
            "sha": "493a6d00f818908b75b2fc234f0c730b6b4b1126"
        },
        {
            "associated_pull_request": [],
            "date": "2017-09-26 10:49:23",
            "diff": "radareorg_radare2/issue_8487/commit_45b0c9b3f31e55a584fa96dbab3474862233aa55.diff",
            "diff_additions": 18,
            "diff_deletions": 5,
            "diff_file_size": 16509,
            "diff_url": "https://github.com/radareorg/radare2/commit/45b0c9b3f31e55a584fa96dbab3474862233aa55.diff",
            "exists": true,
            "files": [
                {
                    "file_additions": 7,
                    "file_deletions": 3,
                    "file_exists": true,
                    "file_name": "libr/util/buf.c",
                    "file_size": 16509
                },
                {
                    "file_additions": 11,
                    "file_deletions": 2,
                    "file_exists": false,
                    "file_name": "libr/util/p_format.c",
                    "file_size": 0
                }
            ],
            "interesting": {
                "reopen": true,
                "status": true
            },
            "is_parent": false,
            "sha": "45b0c9b3f31e55a584fa96dbab3474862233aa55"
        }
    ],
    "first_commit": "2017-09-18 20:14:25",
    "last_commit": "2017-09-26 10:49:23",
    "number": 8487,
    "pull_request": "None",
    "score": {
        "accidental_reopen_likely": false,
        "all_labels": [
            "bug",
            "pf",
            "test-required"
        ],
        "contains_keywords": [
            "test",
            "fix",
            "issu",
            "CI",
            "fault"
        ],
        "fix_size": 67,
        "has_labels": [
            "bug"
        ],
        "intersecting": {
            "computed_score": 0.0,
            "final_commit_size": 23,
            "intersection_size": 0,
            "previous_commits_size": 44
        },
        "is_makefile_based": true,
        "no_new_files": [
            "libr/util/buf.c",
            "libr/util/p_format.c"
        ],
        "no_other_files": true,
        "num_prohibited_files": 46902,
        "prohibited_files": [
            "hal/inc/pinmap_hal.h",
            "Debug/marvin.bin",
            "Debug/marvin.elf",
            "Debug/marvin.hex",
            "Debug/marvin.bin",
            "Debug/marvin.elf",
            "Debug/marvin.hex",
            "inc/spark_utilities.h",
            "Debug/marvin.bin",
            "Debug/marvin.elf"
        ],
        "reopen": true,
        "reopen_events": [
            [
                "2017-09-18 20:15:08",
                "closed"
            ],
            [
                "2017-09-18 20:15:08",
                "commit"
            ],
            [
                "2017-09-26 10:36:59",
                "reopened"
            ],
            [
                "2017-09-26 10:49:35",
                "closed"
            ],
            [
                "2017-09-26 10:49:35",
                "commit"
            ],
            [
                "2017-09-26 11:02:06",
                "reopened"
            ],
            [
                "2017-09-28 10:04:24",
                "closed"
            ]
        ],
        "status": false,
        "strategy": true,
        "total_changes": 74
    }
}