{
    "covered_issues": [
        687,
        666,
        663,
        661,
        652,
        650,
        649,
        647,
        638,
        637,
        636,
        631,
        630,
        627,
        626,
        617,
        611,
        610,
        606,
        605,
        602,
        596,
        593,
        591,
        590,
        585,
        582,
        580,
        577,
        576,
        574,
        572,
        569,
        566,
        563,
        552,
        549,
        541,
        534,
        531,
        527,
        521,
        519,
        515,
        510,
        486,
        481,
        480,
        479,
        478,
        474,
        468,
        467,
        466,
        464,
        462,
        457,
        452,
        447,
        444,
        439,
        438,
        437,
        436,
        434,
        433,
        427,
        424,
        423,
        421,
        420,
        419,
        418,
        417,
        411,
        407,
        405,
        398,
        396,
        395,
        392,
        390,
        388,
        384,
        378,
        373,
        372,
        371,
        369,
        367,
        361,
        360,
        358,
        355,
        354,
        352,
        351,
        350,
        348,
        346,
        344,
        343,
        342,
        339,
        337,
        336,
        331,
        329,
        328,
        327,
        323,
        320,
        317,
        316,
        315,
        314,
        313,
        309,
        307,
        306,
        305,
        302,
        301,
        298,
        295,
        293,
        290,
        288,
        282,
        280,
        279,
        275,
        273,
        270,
        269,
        268,
        265,
        263,
        259,
        256,
        251,
        246,
        239,
        235,
        234,
        230,
        229,
        224,
        220,
        219,
        216,
        208,
        207,
        201,
        200,
        197,
        196,
        195,
        194,
        191,
        188,
        184,
        182,
        181,
        168,
        157,
        155,
        147,
        145,
        144,
        143,
        138,
        137,
        135,
        133,
        130,
        129,
        127,
        118,
        116,
        115,
        114,
        113,
        110,
        107,
        106,
        104,
        101,
        100,
        93,
        88,
        87,
        86,
        83,
        77,
        76,
        75,
        73,
        72,
        71,
        70,
        69,
        67,
        63,
        61,
        60,
        53,
        52,
        48,
        43,
        41,
        40,
        39,
        24,
        22,
        19,
        16,
        14,
        13,
        10,
        7,
        4,
        3,
        2
    ],
    "finished": true
}