{
    "category": [
        "hardware/OS",
        "feature request"
    ],
    "commits": [
        {
            "associated_pull_request": [],
            "date": "2020-09-28 08:44:52",
            "diff": "",
            "diff_additions": 0,
            "diff_deletions": 0,
            "diff_file_size": 0,
            "diff_url": "https://github.com/rsyslog/rsyslog/commit/9f9d1539203c47e9ec483c90c696237f3525313c.diff",
            "exists": true,
            "files": [],
            "interesting": {
                "reopen": false,
                "status": false
            },
            "is_parent": true,
            "sha": "9f9d1539203c47e9ec483c90c696237f3525313c"
        },
        {
            "associated_pull_request": [],
            "date": "2020-10-02 16:42:37",
            "diff": "rsyslog_rsyslog/issue_4385/commit_2753ad57133eda7bc4c5469f504565c68fe0c7d8.diff",
            "diff_additions": 79,
            "diff_deletions": 1,
            "diff_file_size": 308052,
            "diff_url": "https://github.com/rsyslog/rsyslog/commit/2753ad57133eda7bc4c5469f504565c68fe0c7d8.diff",
            "exists": true,
            "files": [
                {
                    "file_additions": 52,
                    "file_deletions": 0,
                    "file_exists": true,
                    "file_name": "grammar/rainerscript.c",
                    "file_size": 151646
                },
                {
                    "file_additions": 27,
                    "file_deletions": 1,
                    "file_exists": true,
                    "file_name": "runtime/msg.c",
                    "file_size": 156406
                }
            ],
            "interesting": {
                "reopen": false,
                "status": true
            },
            "is_parent": false,
            "sha": "2753ad57133eda7bc4c5469f504565c68fe0c7d8"
        },
        {
            "associated_pull_request": [],
            "date": "2020-10-02 16:42:37",
            "diff": "rsyslog_rsyslog/issue_4385/commit_f6d73d28de3f014cdccb96362e8379933887ab7a.diff",
            "diff_additions": 76,
            "diff_deletions": 1,
            "diff_file_size": 308052,
            "diff_url": "https://github.com/rsyslog/rsyslog/commit/f6d73d28de3f014cdccb96362e8379933887ab7a.diff",
            "exists": true,
            "files": [
                {
                    "file_additions": 52,
                    "file_deletions": 0,
                    "file_exists": true,
                    "file_name": "grammar/rainerscript.c",
                    "file_size": 151646
                },
                {
                    "file_additions": 24,
                    "file_deletions": 1,
                    "file_exists": true,
                    "file_name": "runtime/msg.c",
                    "file_size": 156406
                }
            ],
            "interesting": {
                "reopen": false,
                "status": true
            },
            "is_parent": false,
            "sha": "f6d73d28de3f014cdccb96362e8379933887ab7a"
        },
        {
            "associated_pull_request": [],
            "date": "2020-10-02 16:42:37",
            "diff": "rsyslog_rsyslog/issue_4385/commit_ffa662750eb15d15064872848c03d94ceb871f0b.diff",
            "diff_additions": 98,
            "diff_deletions": 7,
            "diff_file_size": 385428,
            "diff_url": "https://github.com/rsyslog/rsyslog/commit/ffa662750eb15d15064872848c03d94ceb871f0b.diff",
            "exists": true,
            "files": [
                {
                    "file_additions": 53,
                    "file_deletions": 0,
                    "file_exists": true,
                    "file_name": "grammar/rainerscript.c",
                    "file_size": 151646
                },
                {
                    "file_additions": 44,
                    "file_deletions": 6,
                    "file_exists": true,
                    "file_name": "runtime/msg.c",
                    "file_size": 156406
                },
                {
                    "file_additions": 1,
                    "file_deletions": 1,
                    "file_exists": true,
                    "file_name": "template.c",
                    "file_size": 77376
                }
            ],
            "interesting": {
                "reopen": false,
                "status": true
            },
            "is_parent": false,
            "sha": "ffa662750eb15d15064872848c03d94ceb871f0b"
        },
        {
            "associated_pull_request": [],
            "date": "2020-10-02 16:42:37",
            "diff": "rsyslog_rsyslog/issue_4385/commit_4c8ea99e1821beefb1f32d5feb94e07ef88aa0b7.diff",
            "diff_additions": 98,
            "diff_deletions": 7,
            "diff_file_size": 385428,
            "diff_url": "https://github.com/rsyslog/rsyslog/commit/4c8ea99e1821beefb1f32d5feb94e07ef88aa0b7.diff",
            "exists": true,
            "files": [
                {
                    "file_additions": 53,
                    "file_deletions": 0,
                    "file_exists": true,
                    "file_name": "grammar/rainerscript.c",
                    "file_size": 151646
                },
                {
                    "file_additions": 44,
                    "file_deletions": 6,
                    "file_exists": true,
                    "file_name": "runtime/msg.c",
                    "file_size": 156406
                },
                {
                    "file_additions": 1,
                    "file_deletions": 1,
                    "file_exists": true,
                    "file_name": "template.c",
                    "file_size": 77376
                }
            ],
            "interesting": {
                "reopen": false,
                "status": true
            },
            "is_parent": false,
            "sha": "4c8ea99e1821beefb1f32d5feb94e07ef88aa0b7"
        },
        {
            "associated_pull_request": [],
            "date": "2020-10-02 16:42:37",
            "diff": "rsyslog_rsyslog/issue_4385/commit_334ca7a54cb1782adc82590be8e8618f055d0174.diff",
            "diff_additions": 80,
            "diff_deletions": 7,
            "diff_file_size": 385428,
            "diff_url": "https://github.com/rsyslog/rsyslog/commit/334ca7a54cb1782adc82590be8e8618f055d0174.diff",
            "exists": true,
            "files": [
                {
                    "file_additions": 47,
                    "file_deletions": 0,
                    "file_exists": true,
                    "file_name": "grammar/rainerscript.c",
                    "file_size": 151646
                },
                {
                    "file_additions": 32,
                    "file_deletions": 6,
                    "file_exists": true,
                    "file_name": "runtime/msg.c",
                    "file_size": 156406
                },
                {
                    "file_additions": 1,
                    "file_deletions": 1,
                    "file_exists": true,
                    "file_name": "template.c",
                    "file_size": 77376
                }
            ],
            "interesting": {
                "reopen": false,
                "status": false
            },
            "is_parent": false,
            "sha": "334ca7a54cb1782adc82590be8e8618f055d0174"
        },
        {
            "associated_pull_request": [
                "https://github.com/rsyslog/rsyslog/pull/4435"
            ],
            "date": "2020-10-02 16:42:37",
            "diff": "rsyslog_rsyslog/issue_4385/commit_d247c31888e7c7b5f59e536a822b9563ec26628f.diff",
            "diff_additions": 80,
            "diff_deletions": 7,
            "diff_file_size": 385428,
            "diff_url": "https://github.com/rsyslog/rsyslog/commit/d247c31888e7c7b5f59e536a822b9563ec26628f.diff",
            "exists": true,
            "files": [
                {
                    "file_additions": 47,
                    "file_deletions": 0,
                    "file_exists": true,
                    "file_name": "grammar/rainerscript.c",
                    "file_size": 151646
                },
                {
                    "file_additions": 32,
                    "file_deletions": 6,
                    "file_exists": true,
                    "file_name": "runtime/msg.c",
                    "file_size": 156406
                },
                {
                    "file_additions": 1,
                    "file_deletions": 1,
                    "file_exists": true,
                    "file_name": "template.c",
                    "file_size": 77376
                }
            ],
            "interesting": {
                "reopen": false,
                "status": false
            },
            "is_parent": false,
            "sha": "d247c31888e7c7b5f59e536a822b9563ec26628f"
        }
    ],
    "first_commit": "2020-09-28 08:44:52",
    "last_commit": "2020-10-05 10:38:58",
    "number": 4385,
    "pull_request": "None",
    "score": {
        "accidental_reopen_likely": false,
        "all_labels": [],
        "contains_keywords": [
            "issu",
            "CI"
        ],
        "fix_size": 137,
        "has_labels": [],
        "intersecting": {
            "computed_score": 1.0,
            "final_commit_size": 85,
            "intersection_size": 85,
            "previous_commits_size": 137
        },
        "is_makefile_based": true,
        "no_new_files": [],
        "no_other_files": false,
        "num_prohibited_files": 17644,
        "prohibited_files": [
            "hal/inc/pinmap_hal.h",
            "Debug/marvin.bin",
            "Debug/marvin.elf",
            "Debug/marvin.hex",
            "Debug/marvin.bin",
            "Debug/marvin.elf",
            "Debug/marvin.hex",
            "inc/spark_utilities.h",
            "Debug/marvin.bin",
            "Debug/marvin.elf"
        ],
        "reopen": false,
        "reopen_events": [
            [
                "2020-10-02 16:45:19",
                "commit"
            ],
            [
                "2020-10-02 16:47:44",
                "commit"
            ],
            [
                "2020-10-03 17:10:38",
                "commit"
            ],
            [
                "2020-10-03 17:11:22",
                "commit"
            ],
            [
                "2020-10-05 06:48:34",
                "commit"
            ],
            [
                "2020-10-05 10:39:25",
                "commit"
            ],
            [
                "2020-10-06 08:39:23",
                "closed"
            ]
        ],
        "status": true,
        "strategy": true,
        "total_changes": 541
    }
}