{
    "commits": [
        {
            "associated_pull_request": [],
            "date": "2016-02-29 09:41:27+00:00",
            "diff": "",
            "diff_additions": 0,
            "diff_deletions": 0,
            "diff_file_size": 0,
            "diff_url": "https://github.com/radareorg/radare2/commit/39c87354df08e27029c2b2e9057d867f380147a4.diff",
            "exists": true,
            "files": [],
            "interesting": {
                "reopen": false,
                "status": false
            },
            "is_parent": true,
            "sha": "39c87354df08e27029c2b2e9057d867f380147a4"
        },
        {
            "associated_pull_request": [],
            "date": "2016-02-29 14:55:25+00:00",
            "diff": "radareorg_radare2/issue_4190/commit_35338139950c9c043cfe97a4870bc78a4b7eab37.diff",
            "diff_additions": 1,
            "diff_deletions": 1,
            "diff_file_size": 129484,
            "diff_url": "https://github.com/radareorg/radare2/commit/35338139950c9c043cfe97a4870bc78a4b7eab37.diff",
            "exists": true,
            "files": [
                {
                    "file_additions": 1,
                    "file_deletions": 1,
                    "file_exists": true,
                    "file_name": "libr/core/visual.c",
                    "file_size": 129484
                }
            ],
            "interesting": {
                "reopen": true,
                "status": false
            },
            "is_parent": false,
            "sha": "35338139950c9c043cfe97a4870bc78a4b7eab37"
        },
        {
            "associated_pull_request": [],
            "date": "2016-03-07 02:35:13+00:00",
            "diff": "radareorg_radare2/issue_4190/commit_377ff92134927ad4107950008f1ee93986f96626.diff",
            "diff_additions": 14,
            "diff_deletions": 12,
            "diff_file_size": 129484,
            "diff_url": "https://github.com/radareorg/radare2/commit/377ff92134927ad4107950008f1ee93986f96626.diff",
            "exists": true,
            "files": [
                {
                    "file_additions": 14,
                    "file_deletions": 12,
                    "file_exists": true,
                    "file_name": "libr/core/visual.c",
                    "file_size": 129484
                }
            ],
            "interesting": {
                "reopen": false,
                "status": false
            },
            "is_parent": false,
            "sha": "377ff92134927ad4107950008f1ee93986f96626"
        }
    ],
    "first_commit": "2016-02-29 09:41:27+00:00",
    "last_commit": "2016-03-07 02:35:13+00:00",
    "number": 4190,
    "pull_request": "None",
    "score": {
        "accidental_reopen_likely": false,
        "all_labels": [
            "regression"
        ],
        "contains_keywords": [
            "fix",
            "issu"
        ],
        "fix_size": 21,
        "has_labels": [],
        "intersecting": {
            "computed_score": 0.09523809523809523,
            "final_commit_size": 21,
            "intersection_size": 2,
            "previous_commits_size": 2
        },
        "is_makefile_based": true,
        "no_new_files": [],
        "no_other_files": true,
        "num_prohibited_files": 10078,
        "prohibited_files": [
            "server/src/main/java/com/genymobile/scrcpy/Device.java",
            "server/src/main/java/com/genymobile/scrcpy/wrappers/SurfaceControl.java",
            "server/src/main/java/com/genymobile/scrcpy/Device.java",
            "server/src/main/java/com/genymobile/scrcpy/wrappers/SurfaceControl.java",
            "app/meson.build",
            "app/scrcpy.1",
            "app/src/common.h",
            "app/src/scrcpy.h",
            "app/src/server.h",
            "server/src/main/java/com/genymobile/scrcpy/Workarounds.java"
        ],
        "reopen": true,
        "reopen_events": [
            [
                "2016-02-29 14:55:35+00:00",
                "closed"
            ],
            [
                "2016-02-29 14:55:35+00:00",
                "commit"
            ],
            [
                "2016-03-06 16:38:33+00:00",
                "reopened"
            ],
            [
                "2016-03-07 02:35:19+00:00",
                "closed"
            ],
            [
                "2016-03-07 02:35:19+00:00",
                "commit"
            ]
        ],
        "status": false,
        "strategy": true,
        "total_changes": 28
    }
}