{
    "commits": [
        {
            "diff": "spring-projects_spring-boot/issue_13026/commit_4e96587dc80b2f9d7c468830a7c71a6b6a11380f.diff",
            "diff_additions": 31,
            "diff_deletions": 31,
            "diff_file_size": 0,
            "files": [
                {
                    "file_additions": 1,
                    "file_deletions": 1,
                    "file_exists": false,
                    "file_name": "spring-boot-actuator/src/main/java/org/springframework/boot/actuate/autoconfigure/EndpointWebMvcChildContextConfiguration.java",
                    "file_size": 0
                },
                {
                    "file_additions": 2,
                    "file_deletions": 2,
                    "file_exists": false,
                    "file_name": "spring-boot-actuator/src/main/java/org/springframework/boot/actuate/autoconfigure/ShellProperties.java",
                    "file_size": 0
                },
                {
                    "file_additions": 2,
                    "file_deletions": 2,
                    "file_exists": false,
                    "file_name": "spring-boot-actuator/src/main/java/org/springframework/boot/actuate/metrics/dropwizard/DropwizardMetricServices.java",
                    "file_size": 0
                },
                {
                    "file_additions": 1,
                    "file_deletions": 1,
                    "file_exists": false,
                    "file_name": "spring-boot-actuator/src/test/java/org/springframework/boot/actuate/endpoint/ConfigurationPropertiesReportEndpointProxyTests.java",
                    "file_size": 0
                },
                {
                    "file_additions": 2,
                    "file_deletions": 2,
                    "file_exists": false,
                    "file_name": "spring-boot-actuator/src/test/java/org/springframework/boot/actuate/endpoint/mvc/HalBrowserMvcEndpointVanillaIntegrationTests.java",
                    "file_size": 0
                },
                {
                    "file_additions": 1,
                    "file_deletions": 1,
                    "file_exists": false,
                    "file_name": "spring-boot-actuator/src/test/java/org/springframework/boot/actuate/health/ElasticsearchHealthIndicatorTests.java",
                    "file_size": 0
                },
                {
                    "file_additions": 1,
                    "file_deletions": 1,
                    "file_exists": false,
                    "file_name": "spring-boot-autoconfigure/src/main/java/org/springframework/boot/autoconfigure/AutoConfigurationPackages.java",
                    "file_size": 0
                },
                {
                    "file_additions": 1,
                    "file_deletions": 1,
                    "file_exists": false,
                    "file_name": "spring-boot-autoconfigure/src/main/java/org/springframework/boot/autoconfigure/mongo/embedded/EmbeddedMongoAutoConfiguration.java",
                    "file_size": 0
                },
                {
                    "file_additions": 1,
                    "file_deletions": 1,
                    "file_exists": false,
                    "file_name": "spring-boot-autoconfigure/src/main/java/org/springframework/boot/autoconfigure/template/PathBasedTemplateAvailabilityProvider.java",
                    "file_size": 0
                },
                {
                    "file_additions": 1,
                    "file_deletions": 1,
                    "file_exists": false,
                    "file_name": "spring-boot-autoconfigure/src/test/java/org/springframework/boot/autoconfigure/cache/CacheAutoConfigurationTests.java",
                    "file_size": 0
                },
                {
                    "file_additions": 1,
                    "file_deletions": 1,
                    "file_exists": false,
                    "file_name": "spring-boot-autoconfigure/src/test/java/org/springframework/boot/autoconfigure/jms/artemis/ArtemisAutoConfigurationTests.java",
                    "file_size": 0
                },
                {
                    "file_additions": 1,
                    "file_deletions": 1,
                    "file_exists": false,
                    "file_name": "spring-boot-autoconfigure/src/test/java/org/springframework/boot/autoconfigure/jndi/TestableInitialContextFactory.java",
                    "file_size": 0
                },
                {
                    "file_additions": 1,
                    "file_deletions": 1,
                    "file_exists": false,
                    "file_name": "spring-boot-cli/src/main/java/org/springframework/boot/cli/command/init/InitializrServiceMetadata.java",
                    "file_size": 0
                },
                {
                    "file_additions": 1,
                    "file_deletions": 1,
                    "file_exists": false,
                    "file_name": "spring-boot-devtools/src/main/java/org/springframework/boot/devtools/livereload/Connection.java",
                    "file_size": 0
                },
                {
                    "file_additions": 1,
                    "file_deletions": 1,
                    "file_exists": false,
                    "file_name": "spring-boot-devtools/src/main/java/org/springframework/boot/devtools/restart/Restarter.java",
                    "file_size": 0
                },
                {
                    "file_additions": 3,
                    "file_deletions": 3,
                    "file_exists": false,
                    "file_name": "spring-boot-devtools/src/main/java/org/springframework/boot/devtools/restart/classloader/RestartClassLoader.java",
                    "file_size": 0
                },
                {
                    "file_additions": 1,
                    "file_deletions": 1,
                    "file_exists": false,
                    "file_name": "spring-boot-devtools/src/main/java/org/springframework/boot/devtools/tunnel/payload/HttpTunnelPayload.java",
                    "file_size": 0
                },
                {
                    "file_additions": 1,
                    "file_deletions": 1,
                    "file_exists": false,
                    "file_name": "spring-boot-devtools/src/test/java/org/springframework/boot/devtools/restart/SilentExitExceptionHandlerTests.java",
                    "file_size": 0
                },
                {
                    "file_additions": 1,
                    "file_deletions": 1,
                    "file_exists": false,
                    "file_name": "spring-boot-test/src/main/java/org/springframework/boot/test/json/AbstractJsonMarshalTester.java",
                    "file_size": 0
                },
                {
                    "file_additions": 1,
                    "file_deletions": 1,
                    "file_exists": false,
                    "file_name": "spring-boot-test/src/test/java/org/springframework/boot/test/json/GsonTesterTests.java",
                    "file_size": 0
                },
                {
                    "file_additions": 1,
                    "file_deletions": 1,
                    "file_exists": false,
                    "file_name": "spring-boot-test/src/test/java/org/springframework/boot/test/json/JacksonTesterTests.java",
                    "file_size": 0
                },
                {
                    "file_additions": 1,
                    "file_deletions": 1,
                    "file_exists": false,
                    "file_name": "spring-boot/src/main/java/org/springframework/boot/context/ConfigurationWarningsApplicationContextInitializer.java",
                    "file_size": 0
                },
                {
                    "file_additions": 1,
                    "file_deletions": 1,
                    "file_exists": false,
                    "file_name": "spring-boot/src/main/java/org/springframework/boot/context/embedded/undertow/UndertowEmbeddedServletContainer.java",
                    "file_size": 0
                },
                {
                    "file_additions": 1,
                    "file_deletions": 1,
                    "file_exists": false,
                    "file_name": "spring-boot/src/main/java/org/springframework/boot/web/client/RestTemplateBuilder.java",
                    "file_size": 0
                },
                {
                    "file_additions": 1,
                    "file_deletions": 1,
                    "file_exists": false,
                    "file_name": "spring-boot/src/main/java/org/springframework/boot/yaml/SpringProfileDocumentMatcher.java",
                    "file_size": 0
                },
                {
                    "file_additions": 1,
                    "file_deletions": 1,
                    "file_exists": false,
                    "file_name": "spring-boot/src/test/java/org/springframework/boot/jackson/JsonComponentModuleTests.java",
                    "file_size": 0
                }
            ],
            "interesting": {
                "reopened": false,
                "status": false
            },
            "sha": "4e96587dc80b2f9d7c468830a7c71a6b6a11380f"
        },
        {
            "diff": "spring-projects_spring-boot/issue_13026/commit_128fb3c33cec7a3fe3f8549a92d30599c3d8341f.diff",
            "diff_additions": 9,
            "diff_deletions": 3,
            "diff_file_size": 0,
            "files": [
                {
                    "file_additions": 6,
                    "file_deletions": 1,
                    "file_exists": false,
                    "file_name": "spring-boot-autoconfigure/src/main/java/org/springframework/boot/autoconfigure/mail/MailSenderAutoConfiguration.java",
                    "file_size": 0
                },
                {
                    "file_additions": 3,
                    "file_deletions": 2,
                    "file_exists": false,
                    "file_name": "spring-boot-autoconfigure/src/test/java/org/springframework/boot/autoconfigure/mail/MailSenderAutoConfigurationTests.java",
                    "file_size": 0
                }
            ],
            "interesting": {
                "reopened": true,
                "status": false
            },
            "sha": "128fb3c33cec7a3fe3f8549a92d30599c3d8341f"
        },
        {
            "diff": "spring-projects_spring-boot/issue_13026/commit_f745f20c8ccf610e8bd9db17e95d2420745ea6aa.diff",
            "diff_additions": 129,
            "diff_deletions": 64,
            "diff_file_size": 0,
            "files": [
                {
                    "file_additions": 3,
                    "file_deletions": 3,
                    "file_exists": false,
                    "file_name": "spring-boot-autoconfigure/src/main/java/org/springframework/boot/autoconfigure/mail/MailProperties.java",
                    "file_size": 0
                },
                {
                    "file_additions": 5,
                    "file_deletions": 56,
                    "file_exists": false,
                    "file_name": "spring-boot-autoconfigure/src/main/java/org/springframework/boot/autoconfigure/mail/MailSenderAutoConfiguration.java",
                    "file_size": 0
                },
                {
                    "file_additions": 14,
                    "file_deletions": 4,
                    "file_exists": false,
                    "file_name": "spring-boot-autoconfigure/src/main/java/org/springframework/boot/autoconfigure/mail/MailSenderJndiConfiguration.java",
                    "file_size": 0
                },
                {
                    "file_additions": 76,
                    "file_deletions": 0,
                    "file_exists": false,
                    "file_name": "spring-boot-autoconfigure/src/main/java/org/springframework/boot/autoconfigure/mail/MailSenderPropertiesConfiguration.java",
                    "file_size": 0
                },
                {
                    "file_additions": 31,
                    "file_deletions": 1,
                    "file_exists": false,
                    "file_name": "spring-boot-autoconfigure/src/test/java/org/springframework/boot/autoconfigure/mail/MailSenderAutoConfigurationTests.java",
                    "file_size": 0
                }
            ],
            "interesting": {
                "reopened": false,
                "status": false
            },
            "sha": "f745f20c8ccf610e8bd9db17e95d2420745ea6aa"
        }
    ],
    "first_commit": "2018-05-03 16:46:15",
    "last_commit": "2018-05-31 14:20:40",
    "number": 13026,
    "score": 128.01498127340824
}