{
    "covered_issues": [
        303,
        297,
        294,
        292,
        289,
        283,
        281,
        279,
        278,
        274,
        273,
        272,
        271,
        268,
        267,
        266,
        262,
        259,
        256,
        253,
        252,
        247,
        246,
        244,
        243,
        241,
        240,
        238,
        237,
        229,
        227,
        226,
        225,
        224,
        223,
        222,
        220,
        219,
        218,
        217,
        216,
        212,
        210,
        209,
        208,
        207,
        206,
        204,
        203,
        202,
        201,
        198,
        196,
        195,
        194,
        193,
        192,
        191,
        190,
        189,
        187,
        185,
        183,
        181,
        179,
        178,
        177,
        176,
        175,
        174,
        173,
        172,
        171,
        170,
        169,
        168,
        167,
        166,
        165,
        164,
        162,
        161,
        160,
        159,
        158,
        157,
        156,
        155,
        153,
        151,
        150,
        148,
        147,
        145,
        143,
        142,
        141,
        140,
        139,
        138,
        137,
        136,
        135,
        134,
        133,
        132,
        131,
        130,
        129,
        128,
        127,
        126,
        125,
        124,
        123,
        122,
        121,
        120,
        119,
        118,
        117,
        116,
        114,
        113,
        112,
        111,
        110,
        109,
        108,
        107,
        106,
        105,
        104,
        103,
        102,
        101,
        100,
        99,
        98,
        97,
        96,
        95,
        94,
        93,
        92,
        91,
        90,
        89,
        88,
        87,
        86,
        84,
        83,
        81,
        80,
        79,
        78,
        77,
        76,
        75,
        74,
        73,
        72,
        71,
        70,
        69,
        68,
        67,
        66,
        65,
        64,
        63,
        62,
        61,
        60,
        59,
        58,
        57,
        56,
        55,
        53,
        52,
        51,
        48,
        47,
        46,
        45,
        43,
        42,
        41,
        39,
        37,
        35,
        34,
        33,
        32,
        31,
        30,
        29,
        28,
        26,
        25,
        24,
        22,
        21,
        19,
        18,
        16,
        13,
        12,
        10,
        9,
        8,
        7,
        6,
        5,
        4,
        3,
        2
    ],
    "finished": true
}