{
    "commits": [
        {
            "associated_pull_request": [],
            "date": "2022-06-07 17:22:01+00:00",
            "diff": "",
            "diff_additions": 0,
            "diff_deletions": 0,
            "diff_file_size": 0,
            "diff_url": "https://github.com/darktable-org/darktable/commit/c1f1a011ed606b8d4ebaebb9bee1ade2a4accc5d.diff",
            "exists": true,
            "files": [],
            "interesting": {
                "reopen": false,
                "status": false
            },
            "is_parent": true,
            "sha": "c1f1a011ed606b8d4ebaebb9bee1ade2a4accc5d"
        },
        {
            "associated_pull_request": [],
            "date": "2022-06-07 17:27:52+00:00",
            "diff": "darktable-org_darktable/issue_12001/commit_03d4f4ae248e639fdeda1f95943f2ebafdd3df23.diff",
            "diff_additions": 27,
            "diff_deletions": 11,
            "diff_file_size": 213945,
            "diff_url": "https://github.com/darktable-org/darktable/commit/03d4f4ae248e639fdeda1f95943f2ebafdd3df23.diff",
            "exists": true,
            "files": [
                {
                    "file_additions": 2,
                    "file_deletions": 2,
                    "file_exists": true,
                    "file_name": "src/common/darktable.c",
                    "file_size": 77975
                },
                {
                    "file_additions": 25,
                    "file_deletions": 9,
                    "file_exists": true,
                    "file_name": "src/common/opencl.c",
                    "file_size": 135970
                }
            ],
            "interesting": {
                "reopen": false,
                "status": false
            },
            "is_parent": false,
            "sha": "03d4f4ae248e639fdeda1f95943f2ebafdd3df23"
        },
        {
            "associated_pull_request": [
                "https://github.com/darktable-org/darktable/pull/12030"
            ],
            "date": "2022-06-12 17:11:50+00:00",
            "diff": "darktable-org_darktable/issue_12001/commit_67802becee4bb3512975567f294707329642e55d.diff",
            "diff_additions": 28,
            "diff_deletions": 4,
            "diff_file_size": 135970,
            "diff_url": "https://github.com/darktable-org/darktable/commit/67802becee4bb3512975567f294707329642e55d.diff",
            "exists": true,
            "files": [
                {
                    "file_additions": 28,
                    "file_deletions": 4,
                    "file_exists": true,
                    "file_name": "src/common/opencl.c",
                    "file_size": 135970
                }
            ],
            "interesting": {
                "reopen": false,
                "status": false
            },
            "is_parent": false,
            "sha": "67802becee4bb3512975567f294707329642e55d"
        },
        {
            "associated_pull_request": [
                "https://github.com/darktable-org/darktable/pull/12030"
            ],
            "date": "2022-06-12 17:11:50+00:00",
            "diff": "darktable-org_darktable/issue_12001/commit_6e25214102ecd7b1ba215373cbd401d63da86693.diff",
            "diff_additions": 28,
            "diff_deletions": 4,
            "diff_file_size": 135970,
            "diff_url": "https://github.com/darktable-org/darktable/commit/6e25214102ecd7b1ba215373cbd401d63da86693.diff",
            "exists": true,
            "files": [
                {
                    "file_additions": 28,
                    "file_deletions": 4,
                    "file_exists": true,
                    "file_name": "src/common/opencl.c",
                    "file_size": 135970
                }
            ],
            "interesting": {
                "reopen": true,
                "status": false
            },
            "is_parent": false,
            "sha": "6e25214102ecd7b1ba215373cbd401d63da86693"
        },
        {
            "associated_pull_request": [],
            "date": "2022-06-12 17:11:50+00:00",
            "diff": "darktable-org_darktable/issue_12001/commit_b63b27950d01b98b2a352c0d9829d180f93be3c5.diff",
            "diff_additions": 28,
            "diff_deletions": 4,
            "diff_file_size": 135970,
            "diff_url": "https://github.com/darktable-org/darktable/commit/b63b27950d01b98b2a352c0d9829d180f93be3c5.diff",
            "exists": true,
            "files": [
                {
                    "file_additions": 28,
                    "file_deletions": 4,
                    "file_exists": true,
                    "file_name": "src/common/opencl.c",
                    "file_size": 135970
                }
            ],
            "interesting": {
                "reopen": false,
                "status": false
            },
            "is_parent": false,
            "sha": "b63b27950d01b98b2a352c0d9829d180f93be3c5"
        }
    ],
    "first_commit": "2022-06-07 17:22:01+00:00",
    "last_commit": "2022-07-17 14:23:19+00:00",
    "number": 12001,
    "pull_request": "None",
    "score": {
        "accidental_reopen_likely": false,
        "all_labels": [],
        "contains_keywords": [
            "confirm",
            "work",
            "fail",
            "chang",
            "fix",
            "issu",
            "perform",
            "debug",
            "reason",
            "test",
            "fault",
            "remov",
            "bug",
            "error",
            "problem",
            "crash",
            "report"
        ],
        "fix_size": 69,
        "has_labels": [],
        "intersecting": {
            "computed_score": 0.7575757575757576,
            "final_commit_size": 33,
            "intersection_size": 25,
            "previous_commits_size": 61
        },
        "is_makefile_based": true,
        "no_new_files": [],
        "no_other_files": false,
        "num_prohibited_files": 66994,
        "prohibited_files": [
            "server/src/main/java/com/genymobile/scrcpy/Device.java",
            "server/src/main/java/com/genymobile/scrcpy/wrappers/SurfaceControl.java",
            "server/src/main/java/com/genymobile/scrcpy/Device.java",
            "server/src/main/java/com/genymobile/scrcpy/wrappers/SurfaceControl.java",
            "app/meson.build",
            "app/scrcpy.1",
            "app/src/common.h",
            "app/src/scrcpy.h",
            "app/src/server.h",
            "server/src/main/java/com/genymobile/scrcpy/Workarounds.java"
        ],
        "reopen": true,
        "reopen_events": [
            [
                "2022-06-07 17:32:06+00:00",
                "commit"
            ],
            [
                "2022-06-12 17:28:01+00:00",
                "commit"
            ],
            [
                "2022-06-12 17:52:31+00:00",
                "commit"
            ],
            [
                "2022-06-14 06:26:38+00:00",
                "closed"
            ],
            [
                "2022-06-17 04:41:47+00:00",
                "reopened"
            ],
            [
                "2022-07-17 15:05:42+00:00",
                "commit"
            ],
            [
                "2022-09-24 05:53:55+00:00",
                "closed"
            ]
        ],
        "status": false,
        "strategy": true,
        "total_changes": 134
    }
}