{
    "commits": [
        {
            "associated_pull_request": [
                "https://github.com/FreeRADIUS/freeradius-server/pull/1716"
            ],
            "date": "2016-09-07 13:07:29+00:00",
            "diff": "",
            "diff_additions": 0,
            "diff_deletions": 0,
            "diff_file_size": 0,
            "diff_url": "https://github.com/FreeRADIUS/freeradius-server/commit/bd41524fd9d8b07575fd38d14609d707a170133d.diff",
            "exists": true,
            "files": [],
            "interesting": {
                "reopen": false,
                "status": false
            },
            "is_parent": true,
            "sha": "bd41524fd9d8b07575fd38d14609d707a170133d"
        },
        {
            "associated_pull_request": [],
            "date": "2016-09-07 13:42:04+00:00",
            "diff": "freeradius_freeradius-server/issue_1717/commit_31f3948aded3367a741c9d54b85eee46f9061070.diff",
            "diff_additions": 2,
            "diff_deletions": 1,
            "diff_file_size": 33520,
            "diff_url": "https://github.com/FreeRADIUS/freeradius-server/commit/31f3948aded3367a741c9d54b85eee46f9061070.diff",
            "exists": true,
            "files": [
                {
                    "file_additions": 2,
                    "file_deletions": 1,
                    "file_exists": true,
                    "file_name": "src/modules/rlm_sql/drivers/rlm_sql_cassandra/rlm_sql_cassandra.c",
                    "file_size": 33520
                }
            ],
            "interesting": {
                "reopen": true,
                "status": false
            },
            "is_parent": false,
            "sha": "31f3948aded3367a741c9d54b85eee46f9061070"
        },
        {
            "associated_pull_request": [],
            "date": "2016-09-13 14:37:27+00:00",
            "diff": "freeradius_freeradius-server/issue_1717/commit_621573b24e7b3572c7ece4dff67fe99394d6c5df.diff",
            "diff_additions": 2,
            "diff_deletions": 2,
            "diff_file_size": 33520,
            "diff_url": "https://github.com/FreeRADIUS/freeradius-server/commit/621573b24e7b3572c7ece4dff67fe99394d6c5df.diff",
            "exists": true,
            "files": [
                {
                    "file_additions": 2,
                    "file_deletions": 2,
                    "file_exists": true,
                    "file_name": "src/modules/rlm_sql/drivers/rlm_sql_cassandra/rlm_sql_cassandra.c",
                    "file_size": 33520
                }
            ],
            "interesting": {
                "reopen": false,
                "status": false
            },
            "is_parent": false,
            "sha": "621573b24e7b3572c7ece4dff67fe99394d6c5df"
        }
    ],
    "first_commit": "2016-09-07 13:07:29+00:00",
    "last_commit": "2016-09-13 14:37:27+00:00",
    "number": 1717,
    "pull_request": "None",
    "score": {
        "accidental_reopen_likely": false,
        "all_labels": [],
        "contains_keywords": [
            "work",
            "fail",
            "chang",
            "fix",
            "issu",
            "perform",
            "debug",
            "reason",
            "test",
            "fault",
            "warn",
            "bug",
            "error",
            "problem",
            "report"
        ],
        "fix_size": 5,
        "has_labels": [],
        "intersecting": {
            "computed_score": 0.3333333333333333,
            "final_commit_size": 3,
            "intersection_size": 1,
            "previous_commits_size": 3
        },
        "is_makefile_based": true,
        "no_new_files": [],
        "no_other_files": true,
        "num_prohibited_files": 87398,
        "prohibited_files": [
            "server/src/main/java/com/genymobile/scrcpy/Device.java",
            "server/src/main/java/com/genymobile/scrcpy/wrappers/SurfaceControl.java",
            "server/src/main/java/com/genymobile/scrcpy/Device.java",
            "server/src/main/java/com/genymobile/scrcpy/wrappers/SurfaceControl.java",
            "app/meson.build",
            "app/scrcpy.1",
            "app/src/common.h",
            "app/src/scrcpy.h",
            "app/src/server.h",
            "server/src/main/java/com/genymobile/scrcpy/Workarounds.java"
        ],
        "reopen": true,
        "reopen_events": [
            [
                "2016-09-07 15:31:24+00:00",
                "commit"
            ],
            [
                "2016-09-08 23:56:11+00:00",
                "closed"
            ],
            [
                "2016-09-11 13:27:21+00:00",
                "reopened"
            ],
            [
                "2016-09-13 14:37:52+00:00",
                "commit"
            ],
            [
                "2016-09-15 08:30:22+00:00",
                "closed"
            ]
        ],
        "status": false,
        "strategy": true,
        "total_changes": 7
    }
}