{
    "covered_issues": [
        73,
        68,
        47,
        41,
        29,
        25,
        23,
        22,
        21,
        19,
        15,
        14,
        8,
        6,
        4,
        2
    ],
    "finished": true
}