{
    "all_issues": 280,
    "interesting_issues": 4,
    "last_update": "2023-11-07 07:01:51.107853",
    "license": {
        "download": "https://raw.githubusercontent.com/tats/w3m/master/COPYING",
        "name": "Other"
    },
    "ratio": 0.014285714285714285,
    "size": 33087,
    "stars": 717,
    "url": "https://github.com/tats/w3m"
}