{
    "category": [
        "memory",
        "network/protocol"
    ],
    "commits": [
        {
            "associated_pull_request": [],
            "date": "2016-07-30 19:09:51",
            "diff": "json-c_json-c/issue_195/commit_7d637362b7e42792322651c68f6e4f4334592c6f.diff",
            "diff_additions": 5,
            "diff_deletions": 3,
            "diff_file_size": 8106,
            "diff_url": "https://github.com/json-c/json-c/commit/7d637362b7e42792322651c68f6e4f4334592c6f.diff",
            "exists": true,
            "files": [
                {
                    "file_additions": 5,
                    "file_deletions": 3,
                    "file_exists": true,
                    "file_name": "tests/test_util_file.c",
                    "file_size": 8106
                }
            ],
            "interesting": {
                "reopen": false,
                "status": false
            },
            "is_parent": true,
            "sha": "7d637362b7e42792322651c68f6e4f4334592c6f"
        },
        {
            "associated_pull_request": [],
            "date": "2016-07-31 01:34:58",
            "diff": "json-c_json-c/issue_195/commit_4091b9c87ea293fd8bc3b05bc5b032e09697eefe.diff",
            "diff_additions": 44,
            "diff_deletions": 10,
            "diff_file_size": 36210,
            "diff_url": "https://github.com/json-c/json-c/commit/4091b9c87ea293fd8bc3b05bc5b032e09697eefe.diff",
            "exists": true,
            "files": [
                {
                    "file_additions": 33,
                    "file_deletions": 10,
                    "file_exists": true,
                    "file_name": "json_tokener.c",
                    "file_size": 34623
                },
                {
                    "file_additions": 11,
                    "file_deletions": 0,
                    "file_exists": true,
                    "file_name": "tests/test_locale.c",
                    "file_size": 1587
                }
            ],
            "interesting": {
                "reopen": true,
                "status": false
            },
            "is_parent": false,
            "sha": "4091b9c87ea293fd8bc3b05bc5b032e09697eefe"
        },
        {
            "associated_pull_request": [],
            "date": "2016-07-31 18:39:56",
            "diff": "json-c_json-c/issue_195/commit_fa76e4a8c96c9678712534fd59cce8e8d9d98fa1.diff",
            "diff_additions": 24,
            "diff_deletions": 4,
            "diff_file_size": 36210,
            "diff_url": "https://github.com/json-c/json-c/commit/fa76e4a8c96c9678712534fd59cce8e8d9d98fa1.diff",
            "exists": true,
            "files": [
                {
                    "file_additions": 5,
                    "file_deletions": 1,
                    "file_exists": true,
                    "file_name": "json_tokener.c",
                    "file_size": 34623
                },
                {
                    "file_additions": 19,
                    "file_deletions": 3,
                    "file_exists": true,
                    "file_name": "tests/test_locale.c",
                    "file_size": 1587
                }
            ],
            "interesting": {
                "reopen": false,
                "status": false
            },
            "is_parent": false,
            "sha": "fa76e4a8c96c9678712534fd59cce8e8d9d98fa1"
        }
    ],
    "first_commit": "2016-07-30 19:09:51",
    "last_commit": "2016-07-31 18:43:14",
    "number": 195,
    "pull_request": "None",
    "score": {
        "accidental_reopen_likely": false,
        "all_labels": [],
        "contains_keywords": [
            "fail",
            "chang",
            "problem",
            "test",
            "fix",
            "patch",
            "issu",
            "work",
            "fault"
        ],
        "fix_size": 69,
        "has_labels": [],
        "intersecting": {
            "computed_score": 0.3448275862068966,
            "final_commit_size": 29,
            "intersection_size": 10,
            "previous_commits_size": 50
        },
        "is_makefile_based": true,
        "no_new_files": [],
        "no_other_files": false,
        "num_prohibited_files": 30573,
        "prohibited_files": [
            "hal/inc/pinmap_hal.h",
            "Debug/marvin.bin",
            "Debug/marvin.elf",
            "Debug/marvin.hex",
            "Debug/marvin.bin",
            "Debug/marvin.elf",
            "Debug/marvin.hex",
            "inc/spark_utilities.h",
            "Debug/marvin.bin",
            "Debug/marvin.elf"
        ],
        "reopen": true,
        "reopen_events": [
            [
                "2016-07-31 01:35:48",
                "commit"
            ],
            [
                "2016-07-31 01:35:55",
                "closed"
            ],
            [
                "2016-07-31 16:54:32",
                "reopened"
            ],
            [
                "2016-07-31 18:43:33",
                "commit"
            ],
            [
                "2016-07-31 18:43:55",
                "closed"
            ]
        ],
        "status": false,
        "strategy": true,
        "total_changes": 90
    }
}