{
    "covered_issues": [
        486,
        483,
        477,
        474,
        433,
        432,
        429,
        428,
        424,
        423,
        418,
        417,
        415,
        413,
        412,
        399,
        382,
        381,
        356,
        355,
        348,
        346,
        341,
        335,
        328,
        322,
        318,
        317,
        313,
        309,
        303,
        300,
        292,
        284,
        283,
        282,
        280,
        278,
        275,
        273,
        272,
        271,
        270,
        269,
        268,
        267,
        265,
        264,
        263,
        256,
        254,
        253,
        252,
        250,
        228,
        227,
        223,
        216,
        215,
        208,
        207,
        198,
        195,
        188,
        183,
        179,
        176,
        174,
        173,
        172,
        170,
        169,
        168,
        165,
        164,
        161,
        159,
        156,
        154,
        153,
        152,
        151,
        144,
        142,
        141,
        140,
        137,
        136,
        135,
        134,
        133,
        132,
        131,
        129,
        128,
        126,
        122,
        121,
        119,
        118,
        116,
        115,
        114,
        113,
        112,
        111,
        110,
        109,
        108,
        107,
        106,
        105,
        104,
        103,
        102,
        101,
        100,
        98,
        97,
        96,
        95,
        94,
        90,
        87,
        86,
        84,
        83,
        82,
        81,
        80,
        79,
        78,
        77,
        76,
        75,
        74,
        72,
        71,
        69,
        68,
        67,
        66,
        62,
        61,
        60,
        59,
        57,
        56,
        55,
        54,
        53,
        43,
        41,
        40,
        38,
        37,
        36,
        35,
        34,
        33,
        32,
        31,
        30,
        29,
        28,
        27,
        24,
        23,
        22,
        21,
        20,
        19,
        18,
        17,
        16,
        15,
        14,
        13,
        11,
        10,
        9,
        8,
        7,
        6,
        5,
        4,
        3,
        2,
        1
    ],
    "finished": true
}