{
    "category": [
        "build/refactor/preprocessing",
        "GUI"
    ],
    "commits": [
        {
            "associated_pull_request": [],
            "date": "2018-03-31 06:24:47",
            "diff": "imagemagick_imagemagick/issue_1069/commit_c02e4a4c4dcb73c1644275522bd8da810f929c8f.diff",
            "diff_additions": 2,
            "diff_deletions": 0,
            "diff_file_size": 17071,
            "diff_url": "https://github.com/ImageMagick/ImageMagick/commit/c02e4a4c4dcb73c1644275522bd8da810f929c8f.diff",
            "exists": true,
            "files": [
                {
                    "file_additions": 2,
                    "file_deletions": 0,
                    "file_exists": true,
                    "file_name": "coders/rla.c",
                    "file_size": 17071
                }
            ],
            "interesting": {
                "reopen": false,
                "status": false
            },
            "is_parent": true,
            "sha": "c02e4a4c4dcb73c1644275522bd8da810f929c8f"
        },
        {
            "associated_pull_request": [],
            "date": "2018-03-31 12:26:41",
            "diff": "imagemagick_imagemagick/issue_1069/commit_d8a210faca233f604d03f7cf2726513918e74256.diff",
            "diff_additions": 76,
            "diff_deletions": 88,
            "diff_file_size": 0,
            "diff_url": "https://github.com/ImageMagick/ImageMagick/commit/d8a210faca233f604d03f7cf2726513918e74256.diff",
            "exists": true,
            "files": [
                {
                    "file_additions": 76,
                    "file_deletions": 88,
                    "file_exists": false,
                    "file_name": "magick/draw.c",
                    "file_size": 0
                }
            ],
            "interesting": {
                "reopen": false,
                "status": true
            },
            "is_parent": false,
            "sha": "d8a210faca233f604d03f7cf2726513918e74256"
        },
        {
            "associated_pull_request": [],
            "date": "2018-03-31 12:27:42",
            "diff": "imagemagick_imagemagick/issue_1069/commit_5fb86b2fb0b030b00eeb37d83b4df4513799d2d2.diff",
            "diff_additions": 74,
            "diff_deletions": 86,
            "diff_file_size": 331935,
            "diff_url": "https://github.com/ImageMagick/ImageMagick/commit/5fb86b2fb0b030b00eeb37d83b4df4513799d2d2.diff",
            "exists": true,
            "files": [
                {
                    "file_additions": 73,
                    "file_deletions": 85,
                    "file_exists": true,
                    "file_name": "MagickCore/draw.c",
                    "file_size": 255008
                },
                {
                    "file_additions": 1,
                    "file_deletions": 1,
                    "file_exists": true,
                    "file_name": "coders/pict.c",
                    "file_size": 76927
                }
            ],
            "interesting": {
                "reopen": false,
                "status": false
            },
            "is_parent": false,
            "sha": "5fb86b2fb0b030b00eeb37d83b4df4513799d2d2"
        }
    ],
    "first_commit": "2018-03-31 06:25:21",
    "last_commit": "2018-03-31 12:29:09",
    "number": 1069,
    "pull_request": "None",
    "score": {
        "accidental_reopen_likely": false,
        "all_labels": [],
        "contains_keywords": [
            "fail",
            "report",
            "problem",
            "fix",
            "patch",
            "issu"
        ],
        "fix_size": 278,
        "has_labels": [],
        "intersecting": {
            "computed_score": 0.0,
            "final_commit_size": 138,
            "intersection_size": 0,
            "previous_commits_size": 140
        },
        "is_makefile_based": true,
        "no_new_files": [
            "MagickCore/draw.c",
            "coders/pict.c"
        ],
        "no_other_files": true,
        "num_prohibited_files": 43296,
        "prohibited_files": [
            "hal/inc/pinmap_hal.h",
            "Debug/marvin.bin",
            "Debug/marvin.elf",
            "Debug/marvin.hex",
            "Debug/marvin.bin",
            "Debug/marvin.elf",
            "Debug/marvin.hex",
            "inc/spark_utilities.h",
            "Debug/marvin.bin",
            "Debug/marvin.elf"
        ],
        "reopen": false,
        "reopen_events": [
            [
                "2018-03-31 12:27:17",
                "commit"
            ],
            [
                "2018-03-31 12:29:16",
                "commit"
            ],
            [
                "2018-04-14 00:04:59",
                "closed"
            ]
        ],
        "status": true,
        "strategy": true,
        "total_changes": 326
    }
}