{
    "all_issues": 1100,
    "interesting_issues": 7,
    "last_update": "2021-05-18 06:09:49.014954",
    "license": {
        "download": "https://raw.githubusercontent.com/shadow/shadow/main/LICENSE",
        "name": "Other"
    },
    "ratio": 0.006363636363636364,
    "size": 22372,
    "stars": 919,
    "url": "https://github.com/shadow/shadow"
}