{
    "category": [
        "build/refactor/preprocessing",
        "wrong API usage"
    ],
    "commits": [
        {
            "associated_pull_request": [],
            "date": "2015-02-09 03:26:01",
            "diff": "jonas_tig/issue_370/commit_196c4bc47d1c147e24f27e04001724d41c6ccf3d.diff",
            "diff_additions": 399,
            "diff_deletions": 5,
            "diff_file_size": 159767,
            "diff_url": "https://github.com/jonas/tig/commit/196c4bc47d1c147e24f27e04001724d41c6ccf3d.diff",
            "exists": true,
            "files": [
                {
                    "file_additions": 17,
                    "file_deletions": 0,
                    "file_exists": true,
                    "file_name": "src/io.c",
                    "file_size": 15517
                },
                {
                    "file_additions": 7,
                    "file_deletions": 1,
                    "file_exists": true,
                    "file_name": "src/keys.c",
                    "file_size": 16533
                },
                {
                    "file_additions": 15,
                    "file_deletions": 0,
                    "file_exists": true,
                    "file_name": "src/line.c",
                    "file_size": 5868
                },
                {
                    "file_additions": 226,
                    "file_deletions": 4,
                    "file_exists": true,
                    "file_name": "src/options.c",
                    "file_size": 39446
                },
                {
                    "file_additions": 10,
                    "file_deletions": 0,
                    "file_exists": true,
                    "file_name": "src/prompt.c",
                    "file_size": 27115
                },
                {
                    "file_additions": 26,
                    "file_deletions": 0,
                    "file_exists": true,
                    "file_name": "src/refdb.c",
                    "file_size": 11935
                },
                {
                    "file_additions": 98,
                    "file_deletions": 0,
                    "file_exists": true,
                    "file_name": "src/view.c",
                    "file_size": 43353
                }
            ],
            "interesting": {
                "reopen": false,
                "status": false
            },
            "is_parent": true,
            "sha": "196c4bc47d1c147e24f27e04001724d41c6ccf3d"
        },
        {
            "associated_pull_request": [],
            "date": "2015-02-09 15:00:00",
            "diff": "jonas_tig/issue_370/commit_e843f0e53b56ac49b471e0935bff385de40fcc99.diff",
            "diff_additions": 9,
            "diff_deletions": 6,
            "diff_file_size": 17235,
            "diff_url": "https://github.com/jonas/tig/commit/e843f0e53b56ac49b471e0935bff385de40fcc99.diff",
            "exists": true,
            "files": [
                {
                    "file_additions": 6,
                    "file_deletions": 4,
                    "file_exists": true,
                    "file_name": "src/refdb.c",
                    "file_size": 11935
                },
                {
                    "file_additions": 3,
                    "file_deletions": 2,
                    "file_exists": true,
                    "file_name": "src/repo.c",
                    "file_size": 5300
                }
            ],
            "interesting": {
                "reopen": false,
                "status": true
            },
            "is_parent": false,
            "sha": "e843f0e53b56ac49b471e0935bff385de40fcc99"
        },
        {
            "associated_pull_request": [],
            "date": "2015-02-10 04:14:52",
            "diff": "jonas_tig/issue_370/commit_370f8051c4a02d1168b24aa330b2fb371c765ee4.diff",
            "diff_additions": 20,
            "diff_deletions": 6,
            "diff_file_size": 11935,
            "diff_url": "https://github.com/jonas/tig/commit/370f8051c4a02d1168b24aa330b2fb371c765ee4.diff",
            "exists": true,
            "files": [
                {
                    "file_additions": 20,
                    "file_deletions": 6,
                    "file_exists": true,
                    "file_name": "src/refdb.c",
                    "file_size": 11935
                }
            ],
            "interesting": {
                "reopen": false,
                "status": false
            },
            "is_parent": false,
            "sha": "370f8051c4a02d1168b24aa330b2fb371c765ee4"
        }
    ],
    "first_commit": "2015-02-09 05:03:01",
    "last_commit": "2015-02-10 04:17:19",
    "number": 370,
    "pull_request": "None",
    "score": {
        "accidental_reopen_likely": false,
        "all_labels": [],
        "contains_keywords": [
            "work",
            "report",
            "fix",
            "fault",
            "bug",
            "test",
            "remov",
            "issu",
            "workaround",
            "chang"
        ],
        "fix_size": 31,
        "has_labels": [],
        "intersecting": {
            "computed_score": 0.4074074074074074,
            "final_commit_size": 27,
            "intersection_size": 11,
            "previous_commits_size": 15
        },
        "is_makefile_based": true,
        "no_new_files": [],
        "no_other_files": false,
        "num_prohibited_files": 44753,
        "prohibited_files": [
            "kill.h",
            "meminfo.h",
            "kill.h",
            "meminfo.h",
            "kill.h",
            "meminfo.h",
            "testsuite_cli_test.go",
            "testsuite_cli_test.go",
            "common.mk",
            "i3bar/include/draw_util.h"
        ],
        "reopen": false,
        "reopen_events": [
            [
                "2015-02-09 15:05:17",
                "commit"
            ],
            [
                "2015-02-10 04:18:15",
                "closed"
            ],
            [
                "2015-02-10 04:18:15",
                "commit"
            ]
        ],
        "status": true,
        "strategy": true,
        "total_changes": 445
    }
}