{
    "category": [
        "feature request"
    ],
    "commits": [
        {
            "associated_pull_request": [],
            "date": "2018-10-29 20:22:08",
            "diff": "radareorg_radare2/issue_11947/commit_2df4d9f60446f618d7bba29d812d58ff67ef1659.diff",
            "diff_additions": 4,
            "diff_deletions": 0,
            "diff_file_size": 34704,
            "diff_url": "https://github.com/radareorg/radare2/commit/2df4d9f60446f618d7bba29d812d58ff67ef1659.diff",
            "exists": true,
            "files": [
                {
                    "file_additions": 4,
                    "file_deletions": 0,
                    "file_exists": true,
                    "file_name": "libr/core/cmd_info.c",
                    "file_size": 34704
                }
            ],
            "interesting": {
                "reopen": false,
                "status": false
            },
            "is_parent": true,
            "sha": "2df4d9f60446f618d7bba29d812d58ff67ef1659"
        },
        {
            "associated_pull_request": [],
            "date": "2018-10-29 20:57:01",
            "diff": "radareorg_radare2/issue_11947/commit_01c1dfb00b1cf5f86eda8c037d05c2fcee747f7a.diff",
            "diff_additions": 95,
            "diff_deletions": 0,
            "diff_file_size": 161840,
            "diff_url": "https://github.com/radareorg/radare2/commit/01c1dfb00b1cf5f86eda8c037d05c2fcee747f7a.diff",
            "exists": true,
            "files": [
                {
                    "file_additions": 89,
                    "file_deletions": 0,
                    "file_exists": true,
                    "file_name": "libr/core/cbin.c",
                    "file_size": 127136
                },
                {
                    "file_additions": 6,
                    "file_deletions": 0,
                    "file_exists": true,
                    "file_name": "libr/core/cmd_info.c",
                    "file_size": 34704
                }
            ],
            "interesting": {
                "reopen": false,
                "status": true
            },
            "is_parent": false,
            "sha": "01c1dfb00b1cf5f86eda8c037d05c2fcee747f7a"
        },
        {
            "associated_pull_request": [],
            "date": "2018-10-29 21:01:27",
            "diff": "radareorg_radare2/issue_11947/commit_ee1c5cbccbf35e62c612dfbb32b5c14fac2bc1cd.diff",
            "diff_additions": 97,
            "diff_deletions": 2,
            "diff_file_size": 161840,
            "diff_url": "https://github.com/radareorg/radare2/commit/ee1c5cbccbf35e62c612dfbb32b5c14fac2bc1cd.diff",
            "exists": true,
            "files": [
                {
                    "file_additions": 89,
                    "file_deletions": 0,
                    "file_exists": true,
                    "file_name": "libr/core/cbin.c",
                    "file_size": 127136
                },
                {
                    "file_additions": 8,
                    "file_deletions": 2,
                    "file_exists": true,
                    "file_name": "libr/core/cmd_info.c",
                    "file_size": 34704
                }
            ],
            "interesting": {
                "reopen": false,
                "status": true
            },
            "is_parent": false,
            "sha": "ee1c5cbccbf35e62c612dfbb32b5c14fac2bc1cd"
        },
        {
            "associated_pull_request": [
                "https://github.com/radareorg/radare2/pull/11987"
            ],
            "date": "2018-10-29 21:02:17",
            "diff": "radareorg_radare2/issue_11947/commit_442504ea3c317229f205529b44f60229e410c5b6.diff",
            "diff_additions": 95,
            "diff_deletions": 51,
            "diff_file_size": 161840,
            "diff_url": "https://github.com/radareorg/radare2/commit/442504ea3c317229f205529b44f60229e410c5b6.diff",
            "exists": true,
            "files": [
                {
                    "file_additions": 89,
                    "file_deletions": 0,
                    "file_exists": true,
                    "file_name": "libr/core/cbin.c",
                    "file_size": 127136
                },
                {
                    "file_additions": 6,
                    "file_deletions": 2,
                    "file_exists": true,
                    "file_name": "libr/core/cmd_info.c",
                    "file_size": 34704
                },
                {
                    "file_additions": 0,
                    "file_deletions": 49,
                    "file_exists": false,
                    "file_name": "libr/core/cmd_section.c",
                    "file_size": 0
                }
            ],
            "interesting": {
                "reopen": false,
                "status": true
            },
            "is_parent": false,
            "sha": "442504ea3c317229f205529b44f60229e410c5b6"
        },
        {
            "associated_pull_request": [
                "https://github.com/radareorg/radare2/pull/11987"
            ],
            "date": "2018-10-29 22:33:40",
            "diff": "radareorg_radare2/issue_11947/commit_583c7c95ba471860d93ab9e9b6adc85e5bac6037.diff",
            "diff_additions": 95,
            "diff_deletions": 2,
            "diff_file_size": 161840,
            "diff_url": "https://github.com/radareorg/radare2/commit/583c7c95ba471860d93ab9e9b6adc85e5bac6037.diff",
            "exists": true,
            "files": [
                {
                    "file_additions": 89,
                    "file_deletions": 0,
                    "file_exists": true,
                    "file_name": "libr/core/cbin.c",
                    "file_size": 127136
                },
                {
                    "file_additions": 6,
                    "file_deletions": 2,
                    "file_exists": true,
                    "file_name": "libr/core/cmd_info.c",
                    "file_size": 34704
                }
            ],
            "interesting": {
                "reopen": false,
                "status": false
            },
            "is_parent": false,
            "sha": "583c7c95ba471860d93ab9e9b6adc85e5bac6037"
        }
    ],
    "first_commit": "2018-10-29 20:22:08",
    "last_commit": "2018-10-29 22:33:40",
    "number": 11947,
    "pull_request": "None",
    "score": {
        "accidental_reopen_likely": false,
        "all_labels": [
            "RBin"
        ],
        "contains_keywords": [
            "fix"
        ],
        "fix_size": 151,
        "has_labels": [],
        "intersecting": {
            "computed_score": 1.0,
            "final_commit_size": 97,
            "intersection_size": 97,
            "previous_commits_size": 151
        },
        "is_makefile_based": true,
        "no_new_files": [],
        "no_other_files": false,
        "num_prohibited_files": 76370,
        "prohibited_files": [
            "hal/inc/pinmap_hal.h",
            "Debug/marvin.bin",
            "Debug/marvin.elf",
            "Debug/marvin.hex",
            "Debug/marvin.bin",
            "Debug/marvin.elf",
            "Debug/marvin.hex",
            "inc/spark_utilities.h",
            "Debug/marvin.bin",
            "Debug/marvin.elf"
        ],
        "reopen": false,
        "reopen_events": [
            [
                "2018-10-29 20:57:11",
                "commit"
            ],
            [
                "2018-10-29 21:01:34",
                "commit"
            ],
            [
                "2018-10-29 21:02:24",
                "commit"
            ],
            [
                "2018-10-29 22:33:44",
                "closed"
            ],
            [
                "2018-10-29 22:33:44",
                "commit"
            ]
        ],
        "status": true,
        "strategy": true,
        "total_changes": 441
    }
}