{
    "commits": [
        {
            "associated_pull_request": [],
            "date": "2015-11-29 04:48:22+00:00",
            "diff": "htacg_tidy-html5/issue_327/commit_3708d429bcacb67ec27904a07b814f6225c117d9.diff",
            "diff_additions": 31,
            "diff_deletions": 1,
            "diff_file_size": 162739,
            "diff_url": "https://github.com/htacg/tidy-html5/commit/3708d429bcacb67ec27904a07b814f6225c117d9.diff",
            "exists": true,
            "files": [
                {
                    "file_additions": 18,
                    "file_deletions": 1,
                    "file_exists": true,
                    "file_name": "src/pprint.c",
                    "file_size": 82411
                },
                {
                    "file_additions": 13,
                    "file_deletions": 0,
                    "file_exists": true,
                    "file_name": "src/tidylib.c",
                    "file_size": 80328
                }
            ],
            "interesting": {
                "reopen": false,
                "status": false
            },
            "is_parent": true,
            "sha": "3708d429bcacb67ec27904a07b814f6225c117d9"
        },
        {
            "associated_pull_request": [],
            "date": "2015-11-29 05:21:49+00:00",
            "diff": "htacg_tidy-html5/issue_327/commit_61cfcb15550bfa5b266cb238d0e34b18d810bad9.diff",
            "diff_additions": 4,
            "diff_deletions": 0,
            "diff_file_size": 205053,
            "diff_url": "https://github.com/htacg/tidy-html5/commit/61cfcb15550bfa5b266cb238d0e34b18d810bad9.diff",
            "exists": true,
            "files": [
                {
                    "file_additions": 4,
                    "file_deletions": 0,
                    "file_exists": true,
                    "file_name": "src/parser.c",
                    "file_size": 205053
                }
            ],
            "interesting": {
                "reopen": true,
                "status": false
            },
            "is_parent": false,
            "sha": "61cfcb15550bfa5b266cb238d0e34b18d810bad9"
        },
        {
            "associated_pull_request": [],
            "date": "2015-12-05 11:45:59+00:00",
            "diff": "htacg_tidy-html5/issue_327/commit_9caecb80cf632cf0d332922e96f408ac19a09f6e.diff",
            "diff_additions": 0,
            "diff_deletions": 4,
            "diff_file_size": 205053,
            "diff_url": "https://github.com/htacg/tidy-html5/commit/9caecb80cf632cf0d332922e96f408ac19a09f6e.diff",
            "exists": true,
            "files": [
                {
                    "file_additions": 0,
                    "file_deletions": 4,
                    "file_exists": true,
                    "file_name": "src/parser.c",
                    "file_size": 205053
                }
            ],
            "interesting": {
                "reopen": false,
                "status": false
            },
            "is_parent": false,
            "sha": "9caecb80cf632cf0d332922e96f408ac19a09f6e"
        }
    ],
    "first_commit": "2015-11-29 04:48:22+00:00",
    "last_commit": "2015-12-05 12:02:33+00:00",
    "number": 327,
    "pull_request": "None",
    "score": {
        "accidental_reopen_likely": false,
        "all_labels": [
            "Technical Discussion"
        ],
        "contains_keywords": [
            "confirm",
            "work",
            "fail",
            "chang",
            "fix",
            "issu",
            "test",
            "fault",
            "warn",
            "bug",
            "error",
            "problem",
            "report"
        ],
        "fix_size": 5,
        "has_labels": [],
        "intersecting": {
            "computed_score": 1.0,
            "final_commit_size": 5,
            "intersection_size": 5,
            "previous_commits_size": 5
        },
        "is_makefile_based": true,
        "no_new_files": [],
        "no_other_files": false,
        "num_prohibited_files": 120444,
        "prohibited_files": [
            "server/src/main/java/com/genymobile/scrcpy/Device.java",
            "server/src/main/java/com/genymobile/scrcpy/wrappers/SurfaceControl.java",
            "server/src/main/java/com/genymobile/scrcpy/Device.java",
            "server/src/main/java/com/genymobile/scrcpy/wrappers/SurfaceControl.java",
            "app/meson.build",
            "app/scrcpy.1",
            "app/src/common.h",
            "app/src/scrcpy.h",
            "app/src/server.h",
            "server/src/main/java/com/genymobile/scrcpy/Workarounds.java"
        ],
        "reopen": true,
        "reopen_events": [
            [
                "2015-11-29 05:21:56+00:00",
                "commit"
            ],
            [
                "2015-11-29 12:14:40+00:00",
                "closed"
            ],
            [
                "2015-11-30 19:50:17+00:00",
                "reopened"
            ],
            [
                "2015-12-05 12:02:56+00:00",
                "commit"
            ],
            [
                "2015-12-05 12:02:56+00:00",
                "commit"
            ],
            [
                "2015-12-05 12:53:50+00:00",
                "closed"
            ]
        ],
        "status": false,
        "strategy": true,
        "total_changes": 40
    }
}