{
    "covered_issues": [
        203,
        200,
        188,
        176,
        175,
        174,
        173,
        172,
        167,
        166,
        165,
        160,
        156,
        155,
        154,
        152,
        151,
        150,
        149,
        145,
        144,
        143,
        140,
        137,
        135,
        134,
        133,
        132,
        131,
        130,
        129,
        128,
        127,
        126,
        125,
        124,
        123,
        122,
        121,
        120,
        119,
        118,
        117,
        115,
        114,
        113,
        111,
        110,
        109,
        106,
        105,
        104,
        103,
        102,
        101,
        100,
        99,
        98,
        97,
        96,
        95,
        94,
        93,
        92,
        90,
        89,
        88,
        87,
        85,
        83,
        82,
        81,
        80,
        79,
        77,
        76,
        74,
        73,
        71,
        67,
        66,
        64,
        63,
        62,
        61,
        60,
        59,
        58,
        57,
        55,
        54,
        52,
        51,
        50,
        49,
        47,
        46,
        45,
        44,
        43,
        42,
        41,
        40,
        39,
        37,
        34,
        33,
        32,
        28,
        27,
        26,
        25,
        23,
        22,
        21,
        20,
        19,
        18,
        17,
        16,
        15,
        14,
        12,
        11,
        10,
        8,
        6,
        5,
        4,
        3,
        2,
        1
    ],
    "finished": true
}