{
    "all_issues": 1075,
    "interesting_issues": 2,
    "last_update": "2023-11-07 15:01:55.196992",
    "license": {
        "download": "https://raw.githubusercontent.com/MiKTeX/miktex/next/COPYING.md",
        "name": "Other"
    },
    "ratio": 0.0018604651162790699,
    "size": 96434,
    "stars": 681,
    "url": "https://github.com/MiKTeX/miktex"
}