{
    "commits": [
        {
            "associated_pull_request": [],
            "date": "2017-06-16 20:08:28+00:00",
            "diff": "jgmenu_jgmenu/issue_31/commit_9a5e6c9b9c116e5acf2bbe5613722a2d499ab1a7.diff",
            "diff_additions": 59,
            "diff_deletions": 15,
            "diff_file_size": 0,
            "diff_url": "https://github.com/jgmenu/jgmenu/commit/9a5e6c9b9c116e5acf2bbe5613722a2d499ab1a7.diff",
            "exists": true,
            "files": [
                {
                    "file_additions": 8,
                    "file_deletions": 0,
                    "file_exists": false,
                    "file_name": "config.c",
                    "file_size": 0
                },
                {
                    "file_additions": 45,
                    "file_deletions": 14,
                    "file_exists": false,
                    "file_name": "jgmenu.c",
                    "file_size": 0
                },
                {
                    "file_additions": 6,
                    "file_deletions": 1,
                    "file_exists": false,
                    "file_name": "x11-ui.c",
                    "file_size": 0
                }
            ],
            "interesting": {
                "reopen": false,
                "status": false
            },
            "is_parent": true,
            "sha": "9a5e6c9b9c116e5acf2bbe5613722a2d499ab1a7"
        },
        {
            "associated_pull_request": [],
            "date": "2017-06-17 20:53:43+00:00",
            "diff": "jgmenu_jgmenu/issue_31/commit_6264435b6516a81646f1164773a48f532b9de220.diff",
            "diff_additions": 6,
            "diff_deletions": 8,
            "diff_file_size": 0,
            "diff_url": "https://github.com/jgmenu/jgmenu/commit/6264435b6516a81646f1164773a48f532b9de220.diff",
            "exists": true,
            "files": [
                {
                    "file_additions": 3,
                    "file_deletions": 2,
                    "file_exists": false,
                    "file_name": "icon.c",
                    "file_size": 0
                },
                {
                    "file_additions": 3,
                    "file_deletions": 6,
                    "file_exists": false,
                    "file_name": "jgmenu.c",
                    "file_size": 0
                }
            ],
            "interesting": {
                "reopen": false,
                "status": false
            },
            "is_parent": false,
            "sha": "6264435b6516a81646f1164773a48f532b9de220"
        },
        {
            "associated_pull_request": [],
            "date": "2017-06-18 21:26:05+00:00",
            "diff": "jgmenu_jgmenu/issue_31/commit_6b6e975df2de03743db123bd051a397336bf1d9e.diff",
            "diff_additions": 76,
            "diff_deletions": 68,
            "diff_file_size": 0,
            "diff_url": "https://github.com/jgmenu/jgmenu/commit/6b6e975df2de03743db123bd051a397336bf1d9e.diff",
            "exists": true,
            "files": [
                {
                    "file_additions": 9,
                    "file_deletions": 68,
                    "file_exists": false,
                    "file_name": "jgmenu.c",
                    "file_size": 0
                },
                {
                    "file_additions": 67,
                    "file_deletions": 0,
                    "file_exists": false,
                    "file_name": "theme.c",
                    "file_size": 0
                }
            ],
            "interesting": {
                "reopen": false,
                "status": false
            },
            "is_parent": false,
            "sha": "6b6e975df2de03743db123bd051a397336bf1d9e"
        },
        {
            "associated_pull_request": [],
            "date": "2017-06-19 20:03:44+00:00",
            "diff": "jgmenu_jgmenu/issue_31/commit_ce13f3eeb7fd778ccecea2b98829c49a6aa33951.diff",
            "diff_additions": 140,
            "diff_deletions": 56,
            "diff_file_size": 0,
            "diff_url": "https://github.com/jgmenu/jgmenu/commit/ce13f3eeb7fd778ccecea2b98829c49a6aa33951.diff",
            "exists": true,
            "files": [
                {
                    "file_additions": 5,
                    "file_deletions": 1,
                    "file_exists": false,
                    "file_name": "config.c",
                    "file_size": 0
                },
                {
                    "file_additions": 71,
                    "file_deletions": 0,
                    "file_exists": false,
                    "file_name": "gtkconf.c",
                    "file_size": 0
                },
                {
                    "file_additions": 1,
                    "file_deletions": 1,
                    "file_exists": false,
                    "file_name": "jgmenu.c",
                    "file_size": 0
                },
                {
                    "file_additions": 44,
                    "file_deletions": 54,
                    "file_exists": false,
                    "file_name": "theme.c",
                    "file_size": 0
                },
                {
                    "file_additions": 19,
                    "file_deletions": 0,
                    "file_exists": false,
                    "file_name": "util.c",
                    "file_size": 0
                }
            ],
            "interesting": {
                "reopen": true,
                "status": false
            },
            "is_parent": false,
            "sha": "ce13f3eeb7fd778ccecea2b98829c49a6aa33951"
        },
        {
            "associated_pull_request": [],
            "date": "2017-06-21 20:24:14+00:00",
            "diff": "jgmenu_jgmenu/issue_31/commit_bab86d34a4bad68b5fc7a204a374fae38305e54d.diff",
            "diff_additions": 80,
            "diff_deletions": 81,
            "diff_file_size": 0,
            "diff_url": "https://github.com/jgmenu/jgmenu/commit/bab86d34a4bad68b5fc7a204a374fae38305e54d.diff",
            "exists": true,
            "files": [
                {
                    "file_additions": 48,
                    "file_deletions": 48,
                    "file_exists": false,
                    "file_name": "config.c",
                    "file_size": 0
                },
                {
                    "file_additions": 12,
                    "file_deletions": 13,
                    "file_exists": false,
                    "file_name": "font.c",
                    "file_size": 0
                },
                {
                    "file_additions": 9,
                    "file_deletions": 10,
                    "file_exists": false,
                    "file_name": "jgmenu.c",
                    "file_size": 0
                },
                {
                    "file_additions": 11,
                    "file_deletions": 10,
                    "file_exists": false,
                    "file_name": "theme.c",
                    "file_size": 0
                }
            ],
            "interesting": {
                "reopen": false,
                "status": false
            },
            "is_parent": false,
            "sha": "bab86d34a4bad68b5fc7a204a374fae38305e54d"
        }
    ],
    "first_commit": "2017-06-16 20:08:28+00:00",
    "last_commit": "2017-06-21 20:24:14+00:00",
    "number": 31,
    "pull_request": "None",
    "score": {
        "accidental_reopen_likely": false,
        "all_labels": [],
        "contains_keywords": [
            "chang",
            "issu",
            "test",
            "fault",
            "remov"
        ],
        "fix_size": 249,
        "has_labels": [],
        "intersecting": {
            "computed_score": 0.29464285714285715,
            "final_commit_size": 112,
            "intersection_size": 33,
            "previous_commits_size": 170
        },
        "is_makefile_based": true,
        "no_new_files": [
            "font.c"
        ],
        "no_other_files": false,
        "num_prohibited_files": 299100,
        "prohibited_files": [
            "server/src/main/java/com/genymobile/scrcpy/Device.java",
            "server/src/main/java/com/genymobile/scrcpy/wrappers/SurfaceControl.java",
            "server/src/main/java/com/genymobile/scrcpy/Device.java",
            "server/src/main/java/com/genymobile/scrcpy/wrappers/SurfaceControl.java",
            "app/meson.build",
            "app/scrcpy.1",
            "app/src/common.h",
            "app/src/scrcpy.h",
            "app/src/server.h",
            "server/src/main/java/com/genymobile/scrcpy/Workarounds.java"
        ],
        "reopen": true,
        "reopen_events": [
            [
                "2017-06-17 20:59:36+00:00",
                "commit"
            ],
            [
                "2017-06-18 21:29:13+00:00",
                "commit"
            ],
            [
                "2017-06-19 20:06:05+00:00",
                "commit"
            ],
            [
                "2017-06-20 21:13:26+00:00",
                "closed"
            ],
            [
                "2017-06-21 16:22:55+00:00",
                "reopened"
            ],
            [
                "2017-06-21 20:32:26+00:00",
                "commit"
            ],
            [
                "2017-06-28 05:00:15+00:00",
                "closed"
            ]
        ],
        "status": false,
        "strategy": true,
        "total_changes": 589
    }
}