{
    "commits": [
        {
            "associated_pull_request": [],
            "date": "2022-09-15 20:00:55+00:00",
            "diff": "",
            "diff_additions": 0,
            "diff_deletions": 0,
            "diff_file_size": 0,
            "diff_url": "https://github.com/yugabyte/yugabyte-db/commit/0f7474cb52a779a2070aa9847e934bb7961f08f3.diff",
            "exists": true,
            "files": [],
            "interesting": {
                "reopen": false,
                "status": false
            },
            "is_parent": true,
            "sha": "0f7474cb52a779a2070aa9847e934bb7961f08f3"
        },
        {
            "associated_pull_request": [],
            "date": "2022-09-01 22:20:45+00:00",
            "diff": "yugabyte_yugabyte-db/issue_13611/commit_eeba784f15e9aea2f0840b46e71722fe11f78c68.diff",
            "diff_additions": 3,
            "diff_deletions": 1,
            "diff_file_size": 198078,
            "diff_url": "https://github.com/yugabyte/yugabyte-db/commit/eeba784f15e9aea2f0840b46e71722fe11f78c68.diff",
            "exists": true,
            "files": [
                {
                    "file_additions": 2,
                    "file_deletions": 0,
                    "file_exists": true,
                    "file_name": "src/yb/client/snapshot-txn-test.cc",
                    "file_size": 36110
                },
                {
                    "file_additions": 1,
                    "file_deletions": 1,
                    "file_exists": true,
                    "file_name": "src/yb/consensus/raft_consensus.cc",
                    "file_size": 161968
                }
            ],
            "interesting": {
                "reopen": true,
                "status": false
            },
            "is_parent": false,
            "sha": "eeba784f15e9aea2f0840b46e71722fe11f78c68"
        },
        {
            "associated_pull_request": [],
            "date": "2022-09-01 22:20:45+00:00",
            "diff": "yugabyte_yugabyte-db/issue_13611/commit_b15e73ec8109c23e7b7f1b0d6337fd2215e60bb6.diff",
            "diff_additions": 3,
            "diff_deletions": 1,
            "diff_file_size": 198078,
            "diff_url": "https://github.com/yugabyte/yugabyte-db/commit/b15e73ec8109c23e7b7f1b0d6337fd2215e60bb6.diff",
            "exists": true,
            "files": [
                {
                    "file_additions": 2,
                    "file_deletions": 0,
                    "file_exists": true,
                    "file_name": "src/yb/client/snapshot-txn-test.cc",
                    "file_size": 36110
                },
                {
                    "file_additions": 1,
                    "file_deletions": 1,
                    "file_exists": true,
                    "file_name": "src/yb/consensus/raft_consensus.cc",
                    "file_size": 161968
                }
            ],
            "interesting": {
                "reopen": false,
                "status": false
            },
            "is_parent": false,
            "sha": "b15e73ec8109c23e7b7f1b0d6337fd2215e60bb6"
        },
        {
            "associated_pull_request": [],
            "date": "2022-09-18 23:53:20+00:00",
            "diff": "yugabyte_yugabyte-db/issue_13611/commit_0b5fb12ecffc57d33fdd5080f7ce6a732fc64043.diff",
            "diff_additions": 3,
            "diff_deletions": 1,
            "diff_file_size": 198078,
            "diff_url": "https://github.com/yugabyte/yugabyte-db/commit/0b5fb12ecffc57d33fdd5080f7ce6a732fc64043.diff",
            "exists": true,
            "files": [
                {
                    "file_additions": 2,
                    "file_deletions": 0,
                    "file_exists": true,
                    "file_name": "src/yb/client/snapshot-txn-test.cc",
                    "file_size": 36110
                },
                {
                    "file_additions": 1,
                    "file_deletions": 1,
                    "file_exists": true,
                    "file_name": "src/yb/consensus/raft_consensus.cc",
                    "file_size": 161968
                }
            ],
            "interesting": {
                "reopen": false,
                "status": false
            },
            "is_parent": false,
            "sha": "0b5fb12ecffc57d33fdd5080f7ce6a732fc64043"
        }
    ],
    "first_commit": "2022-09-15 20:10:37+00:00",
    "last_commit": "2022-09-21 21:52:20+00:00",
    "number": 13611,
    "pull_request": "None",
    "score": {
        "accidental_reopen_likely": false,
        "all_labels": [
            "kind/bug",
            "area/docdb",
            "priority/medium",
            "2.14 Backport Required"
        ],
        "contains_keywords": [
            "work",
            "chang",
            "issu",
            "test",
            "fault"
        ],
        "fix_size": 7,
        "has_labels": [],
        "intersecting": {
            "computed_score": 0.8,
            "final_commit_size": 5,
            "intersection_size": 4,
            "previous_commits_size": 6
        },
        "is_makefile_based": true,
        "no_new_files": [],
        "no_other_files": true,
        "num_prohibited_files": 45495,
        "prohibited_files": [
            "server/src/main/java/com/genymobile/scrcpy/Device.java",
            "server/src/main/java/com/genymobile/scrcpy/wrappers/SurfaceControl.java",
            "server/src/main/java/com/genymobile/scrcpy/Device.java",
            "server/src/main/java/com/genymobile/scrcpy/wrappers/SurfaceControl.java",
            "app/meson.build",
            "app/scrcpy.1",
            "app/src/common.h",
            "app/src/scrcpy.h",
            "app/src/server.h",
            "server/src/main/java/com/genymobile/scrcpy/Workarounds.java"
        ],
        "reopen": true,
        "reopen_events": [
            [
                "2022-09-15 22:24:35+00:00",
                "commit"
            ],
            [
                "2022-09-15 22:28:56+00:00",
                "closed"
            ],
            [
                "2022-09-16 04:26:32+00:00",
                "reopened"
            ],
            [
                "2022-09-20 21:07:27+00:00",
                "commit"
            ],
            [
                "2022-09-21 21:52:22+00:00",
                "commit"
            ],
            [
                "2022-09-22 18:12:16+00:00",
                "closed"
            ]
        ],
        "status": false,
        "strategy": true,
        "total_changes": 12
    }
}