{
    "covered_issues": [
        168,
        152,
        148,
        132,
        130,
        124,
        122,
        121,
        120,
        118,
        117,
        116,
        115,
        113,
        112,
        108,
        107,
        102,
        101,
        100,
        98,
        96,
        95,
        94,
        93,
        92,
        91,
        90,
        89,
        88,
        87,
        86,
        85,
        84,
        83,
        81,
        79,
        76,
        75,
        74,
        73,
        72,
        71,
        69,
        68,
        67,
        66,
        65,
        64,
        63,
        61,
        60,
        59,
        57,
        56,
        54,
        53,
        52,
        51,
        50,
        49,
        48,
        47,
        46,
        45,
        44,
        43,
        42,
        41,
        40,
        39,
        38,
        37,
        36,
        35,
        34,
        33,
        32,
        31,
        30,
        29,
        28,
        27,
        26,
        24,
        23,
        22,
        21,
        19,
        18,
        17,
        16,
        14,
        13,
        12,
        11,
        5,
        4,
        2,
        1
    ],
    "finished": true
}