{
    "commits": [
        {
            "associated_pull_request": [],
            "date": "2016-07-10 16:08:42+00:00",
            "diff": "herculesws_hercules/issue_1240/commit_f269a1d050be968368287fd510fcdc6552c9639f.diff",
            "diff_additions": 19,
            "diff_deletions": 7,
            "diff_file_size": 80590,
            "diff_url": "https://github.com/HerculesWS/Hercules/commit/f269a1d050be968368287fd510fcdc6552c9639f.diff",
            "exists": true,
            "files": [
                {
                    "file_additions": 18,
                    "file_deletions": 6,
                    "file_exists": false,
                    "file_name": "src/login/account_sql.c",
                    "file_size": 0
                },
                {
                    "file_additions": 1,
                    "file_deletions": 1,
                    "file_exists": true,
                    "file_name": "src/login/login.c",
                    "file_size": 80590
                }
            ],
            "interesting": {
                "reopen": false,
                "status": false
            },
            "is_parent": true,
            "sha": "f269a1d050be968368287fd510fcdc6552c9639f"
        },
        {
            "associated_pull_request": [],
            "date": "2016-07-11 03:55:47+00:00",
            "diff": "herculesws_hercules/issue_1240/commit_ff77dde4a110a66ee92288a3a67c2e4ead414b7b.diff",
            "diff_additions": 3,
            "diff_deletions": 0,
            "diff_file_size": 405788,
            "diff_url": "https://github.com/HerculesWS/Hercules/commit/ff77dde4a110a66ee92288a3a67c2e4ead414b7b.diff",
            "exists": true,
            "files": [
                {
                    "file_additions": 3,
                    "file_deletions": 0,
                    "file_exists": true,
                    "file_name": "src/map/pc.c",
                    "file_size": 405788
                }
            ],
            "interesting": {
                "reopen": false,
                "status": false
            },
            "is_parent": false,
            "sha": "ff77dde4a110a66ee92288a3a67c2e4ead414b7b"
        },
        {
            "associated_pull_request": [],
            "date": "2016-07-11 03:55:47+00:00",
            "diff": "herculesws_hercules/issue_1240/commit_a329fa0607a53cc37d6619d3e25da1d5f1d59ba2.diff",
            "diff_additions": 3,
            "diff_deletions": 0,
            "diff_file_size": 405788,
            "diff_url": "https://github.com/HerculesWS/Hercules/commit/a329fa0607a53cc37d6619d3e25da1d5f1d59ba2.diff",
            "exists": true,
            "files": [
                {
                    "file_additions": 3,
                    "file_deletions": 0,
                    "file_exists": true,
                    "file_name": "src/map/pc.c",
                    "file_size": 405788
                }
            ],
            "interesting": {
                "reopen": false,
                "status": false
            },
            "is_parent": false,
            "sha": "a329fa0607a53cc37d6619d3e25da1d5f1d59ba2"
        },
        {
            "associated_pull_request": [],
            "date": "2016-07-11 03:55:47+00:00",
            "diff": "herculesws_hercules/issue_1240/commit_b89dd1428b2d357c8bbe016573fb0ab25ade2782.diff",
            "diff_additions": 8,
            "diff_deletions": 1,
            "diff_file_size": 1599484,
            "diff_url": "https://github.com/HerculesWS/Hercules/commit/b89dd1428b2d357c8bbe016573fb0ab25ade2782.diff",
            "exists": true,
            "files": [
                {
                    "file_additions": 1,
                    "file_deletions": 0,
                    "file_exists": true,
                    "file_name": "src/map/battle.c",
                    "file_size": 316714
                },
                {
                    "file_additions": 2,
                    "file_deletions": 1,
                    "file_exists": true,
                    "file_name": "src/map/clif.c",
                    "file_size": 876982
                },
                {
                    "file_additions": 5,
                    "file_deletions": 0,
                    "file_exists": true,
                    "file_name": "src/map/pc.c",
                    "file_size": 405788
                }
            ],
            "interesting": {
                "reopen": false,
                "status": false
            },
            "is_parent": false,
            "sha": "b89dd1428b2d357c8bbe016573fb0ab25ade2782"
        }
    ],
    "first_commit": "2016-07-10 16:09:14+00:00",
    "last_commit": "2016-07-14 02:54:09+00:00",
    "number": 1240,
    "pull_request": "None",
    "score": {
        "accidental_reopen_likely": false,
        "all_labels": [],
        "contains_keywords": [
            "issu"
        ],
        "fix_size": 12,
        "has_labels": [],
        "intersecting": {
            "computed_score": 0.2727272727272727,
            "final_commit_size": 11,
            "intersection_size": 3,
            "previous_commits_size": 4
        },
        "is_makefile_based": true,
        "no_new_files": [
            "src/map/battle.c",
            "src/map/clif.c"
        ],
        "no_other_files": false,
        "num_prohibited_files": 239446,
        "prohibited_files": [
            "server/src/main/java/com/genymobile/scrcpy/Device.java",
            "server/src/main/java/com/genymobile/scrcpy/wrappers/SurfaceControl.java",
            "server/src/main/java/com/genymobile/scrcpy/Device.java",
            "server/src/main/java/com/genymobile/scrcpy/wrappers/SurfaceControl.java",
            "app/meson.build",
            "app/scrcpy.1",
            "app/src/common.h",
            "app/src/scrcpy.h",
            "app/src/server.h",
            "server/src/main/java/com/genymobile/scrcpy/Workarounds.java"
        ],
        "reopen": true,
        "reopen_events": [
            [
                "2016-07-11 03:58:39+00:00",
                "commit"
            ],
            [
                "2016-07-11 04:21:37+00:00",
                "commit"
            ],
            [
                "2016-07-11 15:59:37+00:00",
                "closed"
            ],
            [
                "2016-07-11 15:59:37+00:00",
                "commit"
            ],
            [
                "2016-07-11 16:27:02+00:00",
                "reopened"
            ],
            [
                "2016-07-14 02:58:58+00:00",
                "closed"
            ],
            [
                "2016-07-14 02:58:58+00:00",
                "commit"
            ]
        ],
        "status": false,
        "strategy": true,
        "total_changes": 41
    }
}