{
    "covered_issues": [
        139,
        137,
        136,
        135,
        134,
        133,
        131,
        130,
        125,
        122,
        121,
        120,
        119,
        118,
        117,
        116,
        114,
        113,
        112,
        109,
        108,
        106,
        104,
        103,
        102,
        101,
        100,
        98,
        96,
        95,
        94,
        92,
        91,
        88,
        87,
        86,
        85,
        84,
        83,
        82,
        81,
        80,
        79,
        78,
        76,
        75,
        74,
        73,
        72,
        71,
        70,
        69,
        68,
        67,
        66,
        61,
        60,
        59,
        58,
        57,
        56,
        55,
        54,
        53,
        52,
        51,
        50,
        49,
        48,
        47,
        46,
        45,
        44,
        43,
        41,
        40,
        38,
        36,
        30,
        29,
        28,
        27,
        26,
        25,
        24,
        23,
        22,
        21,
        20,
        19,
        18,
        17,
        16,
        15,
        14,
        13,
        12,
        11,
        10,
        9,
        8,
        7,
        6,
        5,
        4,
        3,
        2,
        1
    ],
    "finished": true
}