{
    "commits": [
        {
            "associated_pull_request": [],
            "date": "2022-02-01 17:25:06+00:00",
            "diff": "haproxy_haproxy/issue_1561/commit_c17c31c822dc4a5f3270f6ae4f96afa50fb7390f.diff",
            "diff_additions": 1,
            "diff_deletions": 1,
            "diff_file_size": 170390,
            "diff_url": "https://github.com/haproxy/haproxy/commit/c17c31c822dc4a5f3270f6ae4f96afa50fb7390f.diff",
            "exists": true,
            "files": [
                {
                    "file_additions": 1,
                    "file_deletions": 1,
                    "file_exists": true,
                    "file_name": "src/mux_h1.c",
                    "file_size": 170390
                }
            ],
            "interesting": {
                "reopen": false,
                "status": false
            },
            "is_parent": true,
            "sha": "c17c31c822dc4a5f3270f6ae4f96afa50fb7390f"
        },
        {
            "associated_pull_request": [],
            "date": "2022-02-21 14:12:54+00:00",
            "diff": "haproxy_haproxy/issue_1561/commit_ec361bbd843781fb15ebbfca6aea57455d3ac3f8.diff",
            "diff_additions": 1,
            "diff_deletions": 1,
            "diff_file_size": 240082,
            "diff_url": "https://github.com/haproxy/haproxy/commit/ec361bbd843781fb15ebbfca6aea57455d3ac3f8.diff",
            "exists": true,
            "files": [
                {
                    "file_additions": 1,
                    "file_deletions": 1,
                    "file_exists": true,
                    "file_name": "src/mux_h2.c",
                    "file_size": 240082
                }
            ],
            "interesting": {
                "reopen": true,
                "status": false
            },
            "is_parent": false,
            "sha": "ec361bbd843781fb15ebbfca6aea57455d3ac3f8"
        },
        {
            "associated_pull_request": [],
            "date": "2022-02-21 14:12:54+00:00",
            "diff": "haproxy_haproxy/issue_1561/commit_83f3d3dcdfc9c0678f83fd37af967ec21fcfb37d.diff",
            "diff_additions": 1,
            "diff_deletions": 1,
            "diff_file_size": 240082,
            "diff_url": "https://github.com/haproxy/haproxy/commit/83f3d3dcdfc9c0678f83fd37af967ec21fcfb37d.diff",
            "exists": true,
            "files": [
                {
                    "file_additions": 1,
                    "file_deletions": 1,
                    "file_exists": true,
                    "file_name": "src/mux_h2.c",
                    "file_size": 240082
                }
            ],
            "interesting": {
                "reopen": false,
                "status": false
            },
            "is_parent": false,
            "sha": "83f3d3dcdfc9c0678f83fd37af967ec21fcfb37d"
        },
        {
            "associated_pull_request": [],
            "date": "2022-02-21 14:12:54+00:00",
            "diff": "haproxy_haproxy/issue_1561/commit_2a9207a702939999eec62f25b643ba52a75e0509.diff",
            "diff_additions": 1,
            "diff_deletions": 1,
            "diff_file_size": 240082,
            "diff_url": "https://github.com/haproxy/haproxy/commit/2a9207a702939999eec62f25b643ba52a75e0509.diff",
            "exists": true,
            "files": [
                {
                    "file_additions": 1,
                    "file_deletions": 1,
                    "file_exists": true,
                    "file_name": "src/mux_h2.c",
                    "file_size": 240082
                }
            ],
            "interesting": {
                "reopen": false,
                "status": false
            },
            "is_parent": false,
            "sha": "2a9207a702939999eec62f25b643ba52a75e0509"
        },
        {
            "associated_pull_request": [],
            "date": "2022-02-21 14:12:54+00:00",
            "diff": "haproxy_haproxy/issue_1561/commit_9e0fa8771e668b631f65bf22d3607427643d9ebd.diff",
            "diff_additions": 1,
            "diff_deletions": 1,
            "diff_file_size": 240082,
            "diff_url": "https://github.com/haproxy/haproxy/commit/9e0fa8771e668b631f65bf22d3607427643d9ebd.diff",
            "exists": true,
            "files": [
                {
                    "file_additions": 1,
                    "file_deletions": 1,
                    "file_exists": true,
                    "file_name": "src/mux_h2.c",
                    "file_size": 240082
                }
            ],
            "interesting": {
                "reopen": false,
                "status": false
            },
            "is_parent": false,
            "sha": "9e0fa8771e668b631f65bf22d3607427643d9ebd"
        },
        {
            "associated_pull_request": [],
            "date": "2022-02-21 14:12:54+00:00",
            "diff": "haproxy_haproxy/issue_1561/commit_aabd4f919ef0e03b0fb5ca6608d8edd46676089a.diff",
            "diff_additions": 1,
            "diff_deletions": 1,
            "diff_file_size": 240082,
            "diff_url": "https://github.com/haproxy/haproxy/commit/aabd4f919ef0e03b0fb5ca6608d8edd46676089a.diff",
            "exists": true,
            "files": [
                {
                    "file_additions": 1,
                    "file_deletions": 1,
                    "file_exists": true,
                    "file_name": "src/mux_h2.c",
                    "file_size": 240082
                }
            ],
            "interesting": {
                "reopen": false,
                "status": false
            },
            "is_parent": false,
            "sha": "aabd4f919ef0e03b0fb5ca6608d8edd46676089a"
        }
    ],
    "first_commit": "2022-02-21 15:05:47+00:00",
    "last_commit": "2022-03-01 14:34:41+00:00",
    "number": 1561,
    "pull_request": "None",
    "score": {
        "accidental_reopen_likely": false,
        "all_labels": [
            "type: bug",
            "status: fixed"
        ],
        "contains_keywords": [
            "confirm",
            "work",
            "fail",
            "fix",
            "issu",
            "patch",
            "reason",
            "test",
            "fault",
            "bug",
            "error",
            "crash",
            "report"
        ],
        "fix_size": 6,
        "has_labels": [],
        "intersecting": {
            "computed_score": 0.5,
            "final_commit_size": 2,
            "intersection_size": 1,
            "previous_commits_size": 5
        },
        "is_makefile_based": true,
        "no_new_files": [],
        "no_other_files": true,
        "num_prohibited_files": 224462,
        "prohibited_files": [
            "server/src/main/java/com/genymobile/scrcpy/Device.java",
            "server/src/main/java/com/genymobile/scrcpy/wrappers/SurfaceControl.java",
            "server/src/main/java/com/genymobile/scrcpy/Device.java",
            "server/src/main/java/com/genymobile/scrcpy/wrappers/SurfaceControl.java",
            "app/meson.build",
            "app/scrcpy.1",
            "app/src/common.h",
            "app/src/scrcpy.h",
            "app/src/server.h",
            "server/src/main/java/com/genymobile/scrcpy/Workarounds.java"
        ],
        "reopen": true,
        "reopen_events": [
            [
                "2022-02-21 15:33:03+00:00",
                "commit"
            ],
            [
                "2022-02-23 15:35:47+00:00",
                "closed"
            ],
            [
                "2022-02-23 15:39:56+00:00",
                "reopened"
            ],
            [
                "2022-02-26 06:25:23+00:00",
                "commit"
            ],
            [
                "2022-02-26 06:25:24+00:00",
                "commit"
            ],
            [
                "2022-02-26 06:25:26+00:00",
                "commit"
            ],
            [
                "2022-02-26 06:25:29+00:00",
                "commit"
            ],
            [
                "2022-03-01 18:01:17+00:00",
                "closed"
            ],
            [
                "2022-03-02 06:25:28+00:00",
                "commit"
            ]
        ],
        "status": false,
        "strategy": true,
        "total_changes": 12
    }
}