{
    "covered_issues": [
        273,
        249,
        209,
        162,
        143,
        138,
        130,
        124,
        117,
        93,
        84,
        76,
        67,
        59,
        58,
        52,
        50,
        47,
        41,
        39,
        38,
        35,
        31,
        26,
        24,
        17,
        14,
        13,
        10,
        8,
        7,
        5,
        4
    ],
    "finished": true
}