{
    "commits": [
        {
            "diff": "elastic_elasticsearch/issue_41256/commit_b53554c8058d4f626b9afdd4e8ae48af506dc9e7.diff",
            "diff_additions": 16,
            "diff_deletions": 5,
            "diff_file_size": 62710,
            "files": [
                {
                    "file_additions": 12,
                    "file_deletions": 2,
                    "file_exists": true,
                    "file_name": "x-pack/plugin/ml/src/main/java/org/elasticsearch/xpack/ml/job/process/autodetect/AutodetectCommunicator.java",
                    "file_size": 17799
                },
                {
                    "file_additions": 4,
                    "file_deletions": 3,
                    "file_exists": true,
                    "file_name": "x-pack/plugin/ml/src/main/java/org/elasticsearch/xpack/ml/job/process/autodetect/AutodetectProcessManager.java",
                    "file_size": 44911
                }
            ],
            "interesting": {
                "reopened": false,
                "status": false
            },
            "sha": "b53554c8058d4f626b9afdd4e8ae48af506dc9e7"
        },
        {
            "diff": "elastic_elasticsearch/issue_41256/commit_00139ae8ae195a5487d2509611cb8e0bfe0ebb9b.diff",
            "diff_additions": 2,
            "diff_deletions": 0,
            "diff_file_size": 0,
            "files": [
                {
                    "file_additions": 2,
                    "file_deletions": 0,
                    "file_exists": false,
                    "file_name": "buildSrc/src/test/java/org/elasticsearch/gradle/testclusters/TestClustersPluginIT.java",
                    "file_size": 0
                }
            ],
            "interesting": {
                "reopened": false,
                "status": false
            },
            "sha": "00139ae8ae195a5487d2509611cb8e0bfe0ebb9b"
        },
        {
            "diff": "elastic_elasticsearch/issue_41256/commit_36d416d5bd202aa080a26cab129b350cb25de626.diff",
            "diff_additions": 1,
            "diff_deletions": 0,
            "diff_file_size": 0,
            "files": [
                {
                    "file_additions": 1,
                    "file_deletions": 0,
                    "file_exists": false,
                    "file_name": "buildSrc/src/test/java/org/elasticsearch/gradle/testclusters/TestClustersPluginIT.java",
                    "file_size": 0
                }
            ],
            "interesting": {
                "reopened": true,
                "status": false
            },
            "sha": "36d416d5bd202aa080a26cab129b350cb25de626"
        },
        {
            "diff": "elastic_elasticsearch/issue_41256/commit_335ed64b24f9925c9e2106dc16d3f87f0a344395.diff",
            "diff_additions": 4,
            "diff_deletions": 1,
            "diff_file_size": 0,
            "files": [
                {
                    "file_additions": 4,
                    "file_deletions": 1,
                    "file_exists": false,
                    "file_name": "buildSrc/src/test/java/org/elasticsearch/gradle/testclusters/TestClustersPluginIT.java",
                    "file_size": 0
                }
            ],
            "interesting": {
                "reopened": false,
                "status": false
            },
            "sha": "335ed64b24f9925c9e2106dc16d3f87f0a344395"
        },
        {
            "diff": "elastic_elasticsearch/issue_41256/commit_0e3617e0ee7f7718fd4079dd5d67c3667bc3dee0.diff",
            "diff_additions": 3,
            "diff_deletions": 0,
            "diff_file_size": 0,
            "files": [
                {
                    "file_additions": 3,
                    "file_deletions": 0,
                    "file_exists": false,
                    "file_name": "buildSrc/src/test/java/org/elasticsearch/gradle/testclusters/TestClustersPluginIT.java",
                    "file_size": 0
                }
            ],
            "interesting": {
                "reopened": false,
                "status": false
            },
            "sha": "0e3617e0ee7f7718fd4079dd5d67c3667bc3dee0"
        },
        {
            "diff": "elastic_elasticsearch/issue_41256/commit_e47bca0a8a4178f73c1657899fa270b2d39b275b.diff",
            "diff_additions": 4,
            "diff_deletions": 1,
            "diff_file_size": 0,
            "files": [
                {
                    "file_additions": 4,
                    "file_deletions": 1,
                    "file_exists": false,
                    "file_name": "buildSrc/src/test/java/org/elasticsearch/gradle/testclusters/TestClustersPluginIT.java",
                    "file_size": 0
                }
            ],
            "interesting": {
                "reopened": false,
                "status": false
            },
            "sha": "e47bca0a8a4178f73c1657899fa270b2d39b275b"
        },
        {
            "diff": "elastic_elasticsearch/issue_41256/commit_56fe136aa1098988de4ae975045fb30e56cbb24f.diff",
            "diff_additions": 2,
            "diff_deletions": 0,
            "diff_file_size": 0,
            "files": [
                {
                    "file_additions": 2,
                    "file_deletions": 0,
                    "file_exists": false,
                    "file_name": "buildSrc/src/test/java/org/elasticsearch/gradle/testclusters/TestClustersPluginIT.java",
                    "file_size": 0
                }
            ],
            "interesting": {
                "reopened": false,
                "status": false
            },
            "sha": "56fe136aa1098988de4ae975045fb30e56cbb24f"
        },
        {
            "diff": "elastic_elasticsearch/issue_41256/commit_4483e627dd3d40f11cf8e8aa77809a56ef0878d6.diff",
            "diff_additions": 1,
            "diff_deletions": 0,
            "diff_file_size": 0,
            "files": [
                {
                    "file_additions": 1,
                    "file_deletions": 0,
                    "file_exists": false,
                    "file_name": "buildSrc/src/test/java/org/elasticsearch/gradle/testclusters/TestClustersPluginIT.java",
                    "file_size": 0
                }
            ],
            "interesting": {
                "reopened": false,
                "status": false
            },
            "sha": "4483e627dd3d40f11cf8e8aa77809a56ef0878d6"
        },
        {
            "diff": "elastic_elasticsearch/issue_41256/commit_77c30f0ff50ff119ed8a0dbb2eb662566386fef1.diff",
            "diff_additions": 4,
            "diff_deletions": 1,
            "diff_file_size": 0,
            "files": [
                {
                    "file_additions": 4,
                    "file_deletions": 1,
                    "file_exists": false,
                    "file_name": "buildSrc/src/test/java/org/elasticsearch/gradle/testclusters/TestClustersPluginIT.java",
                    "file_size": 0
                }
            ],
            "interesting": {
                "reopened": false,
                "status": false
            },
            "sha": "77c30f0ff50ff119ed8a0dbb2eb662566386fef1"
        },
        {
            "diff": "elastic_elasticsearch/issue_41256/commit_04c4a14ef6ab1347c9cb24e510375c123388e985.diff",
            "diff_additions": 2,
            "diff_deletions": 1,
            "diff_file_size": 0,
            "files": [
                {
                    "file_additions": 2,
                    "file_deletions": 1,
                    "file_exists": false,
                    "file_name": "buildSrc/src/test/java/org/elasticsearch/gradle/testclusters/TestClustersPluginIT.java",
                    "file_size": 0
                }
            ],
            "interesting": {
                "reopened": false,
                "status": false
            },
            "sha": "04c4a14ef6ab1347c9cb24e510375c123388e985"
        },
        {
            "diff": "elastic_elasticsearch/issue_41256/commit_23670f8c2b96268d22f8da4670f89755124e2fb4.diff",
            "diff_additions": 53,
            "diff_deletions": 211,
            "diff_file_size": 0,
            "files": [
                {
                    "file_additions": 0,
                    "file_deletions": 163,
                    "file_exists": false,
                    "file_name": "buildSrc/src/test/java/org/elasticsearch/gradle/testclusters/TestClustersPluginIT.java",
                    "file_size": 0
                },
                {
                    "file_additions": 0,
                    "file_deletions": 30,
                    "file_exists": false,
                    "file_name": "buildSrc/src/testKit/testclusters/dummyPlugin/src/main/java/DummyPlugin.java",
                    "file_size": 0
                },
                {
                    "file_additions": 53,
                    "file_deletions": 18,
                    "file_exists": false,
                    "file_name": "qa/build-standalone-example-plugins/src/test/java/org/elasticsearch/test/plugins/BuildExamplePluginsIT.java",
                    "file_size": 0
                }
            ],
            "interesting": {
                "reopened": false,
                "status": false
            },
            "sha": "23670f8c2b96268d22f8da4670f89755124e2fb4"
        },
        {
            "diff": "elastic_elasticsearch/issue_41256/commit_5ebd0b3630efe212614f360085ea44e46282e7ef.diff",
            "diff_additions": 53,
            "diff_deletions": 211,
            "diff_file_size": 0,
            "files": [
                {
                    "file_additions": 0,
                    "file_deletions": 163,
                    "file_exists": false,
                    "file_name": "buildSrc/src/test/java/org/elasticsearch/gradle/testclusters/TestClustersPluginIT.java",
                    "file_size": 0
                },
                {
                    "file_additions": 0,
                    "file_deletions": 30,
                    "file_exists": false,
                    "file_name": "buildSrc/src/testKit/testclusters/dummyPlugin/src/main/java/DummyPlugin.java",
                    "file_size": 0
                },
                {
                    "file_additions": 53,
                    "file_deletions": 18,
                    "file_exists": false,
                    "file_name": "qa/build-standalone-example-plugins/src/test/java/org/elasticsearch/test/plugins/BuildExamplePluginsIT.java",
                    "file_size": 0
                }
            ],
            "interesting": {
                "reopened": false,
                "status": true
            },
            "sha": "5ebd0b3630efe212614f360085ea44e46282e7ef"
        },
        {
            "diff": "elastic_elasticsearch/issue_41256/commit_da6e0c64d1ede54bfeacf648ec11631e312c9106.diff",
            "diff_additions": 72,
            "diff_deletions": 465,
            "diff_file_size": 9043,
            "files": [
                {
                    "file_additions": 1,
                    "file_deletions": 1,
                    "file_exists": true,
                    "file_name": "buildSrc/src/main/java/org/elasticsearch/gradle/testclusters/TestClustersPlugin.java",
                    "file_size": 9043
                },
                {
                    "file_additions": 0,
                    "file_deletions": 161,
                    "file_exists": false,
                    "file_name": "buildSrc/src/test/java/org/elasticsearch/gradle/BuildExamplePluginsIT.java",
                    "file_size": 0
                },
                {
                    "file_additions": 2,
                    "file_deletions": 2,
                    "file_exists": false,
                    "file_name": "buildSrc/src/test/java/org/elasticsearch/gradle/BuildPluginIT.java",
                    "file_size": 0
                },
                {
                    "file_additions": 0,
                    "file_deletions": 1,
                    "file_exists": false,
                    "file_name": "buildSrc/src/test/java/org/elasticsearch/gradle/DistributionDownloadPluginIT.java",
                    "file_size": 0
                },
                {
                    "file_additions": 0,
                    "file_deletions": 1,
                    "file_exists": false,
                    "file_name": "buildSrc/src/test/java/org/elasticsearch/gradle/JdkDownloadPluginIT.java",
                    "file_size": 0
                },
                {
                    "file_additions": 69,
                    "file_deletions": 0,
                    "file_exists": false,
                    "file_name": "buildSrc/src/test/java/org/elasticsearch/gradle/plugin/PluginBuildPluginTests.java",
                    "file_size": 0
                },
                {
                    "file_additions": 0,
                    "file_deletions": 39,
                    "file_exists": false,
                    "file_name": "buildSrc/src/test/java/org/elasticsearch/gradle/precommit/JarHellTaskIT.java",
                    "file_size": 0
                },
                {
                    "file_additions": 0,
                    "file_deletions": 4,
                    "file_exists": false,
                    "file_name": "buildSrc/src/test/java/org/elasticsearch/gradle/test/GradleIntegrationTestCase.java",
                    "file_size": 0
                },
                {
                    "file_additions": 0,
                    "file_deletions": 219,
                    "file_exists": false,
                    "file_name": "buildSrc/src/test/java/org/elasticsearch/gradle/testclusters/TestClustersPluginIT.java",
                    "file_size": 0
                },
                {
                    "file_additions": 0,
                    "file_deletions": 7,
                    "file_exists": false,
                    "file_name": "buildSrc/src/testKit/jarHell/src/main/java/org/apache/logging/log4j/Logger.java",
                    "file_size": 0
                },
                {
                    "file_additions": 0,
                    "file_deletions": 30,
                    "file_exists": false,
                    "file_name": "buildSrc/src/testKit/testclusters/dummyPlugin/src/main/java/DummyPlugin.java",
                    "file_size": 0
                }
            ],
            "interesting": {
                "reopened": false,
                "status": false
            },
            "sha": "da6e0c64d1ede54bfeacf648ec11631e312c9106"
        },
        {
            "diff": "elastic_elasticsearch/issue_41256/commit_3648481eb2017bcef06f782234c3167854f64c43.diff",
            "diff_additions": 72,
            "diff_deletions": 465,
            "diff_file_size": 9043,
            "files": [
                {
                    "file_additions": 1,
                    "file_deletions": 1,
                    "file_exists": true,
                    "file_name": "buildSrc/src/main/java/org/elasticsearch/gradle/testclusters/TestClustersPlugin.java",
                    "file_size": 9043
                },
                {
                    "file_additions": 0,
                    "file_deletions": 161,
                    "file_exists": false,
                    "file_name": "buildSrc/src/test/java/org/elasticsearch/gradle/BuildExamplePluginsIT.java",
                    "file_size": 0
                },
                {
                    "file_additions": 2,
                    "file_deletions": 2,
                    "file_exists": false,
                    "file_name": "buildSrc/src/test/java/org/elasticsearch/gradle/BuildPluginIT.java",
                    "file_size": 0
                },
                {
                    "file_additions": 0,
                    "file_deletions": 1,
                    "file_exists": false,
                    "file_name": "buildSrc/src/test/java/org/elasticsearch/gradle/DistributionDownloadPluginIT.java",
                    "file_size": 0
                },
                {
                    "file_additions": 0,
                    "file_deletions": 1,
                    "file_exists": false,
                    "file_name": "buildSrc/src/test/java/org/elasticsearch/gradle/JdkDownloadPluginIT.java",
                    "file_size": 0
                },
                {
                    "file_additions": 69,
                    "file_deletions": 0,
                    "file_exists": false,
                    "file_name": "buildSrc/src/test/java/org/elasticsearch/gradle/plugin/PluginBuildPluginTests.java",
                    "file_size": 0
                },
                {
                    "file_additions": 0,
                    "file_deletions": 39,
                    "file_exists": false,
                    "file_name": "buildSrc/src/test/java/org/elasticsearch/gradle/precommit/JarHellTaskIT.java",
                    "file_size": 0
                },
                {
                    "file_additions": 0,
                    "file_deletions": 4,
                    "file_exists": false,
                    "file_name": "buildSrc/src/test/java/org/elasticsearch/gradle/test/GradleIntegrationTestCase.java",
                    "file_size": 0
                },
                {
                    "file_additions": 0,
                    "file_deletions": 219,
                    "file_exists": false,
                    "file_name": "buildSrc/src/test/java/org/elasticsearch/gradle/testclusters/TestClustersPluginIT.java",
                    "file_size": 0
                },
                {
                    "file_additions": 0,
                    "file_deletions": 7,
                    "file_exists": false,
                    "file_name": "buildSrc/src/testKit/jarHell/src/main/java/org/apache/logging/log4j/Logger.java",
                    "file_size": 0
                },
                {
                    "file_additions": 0,
                    "file_deletions": 30,
                    "file_exists": false,
                    "file_name": "buildSrc/src/testKit/testclusters/dummyPlugin/src/main/java/DummyPlugin.java",
                    "file_size": 0
                }
            ],
            "interesting": {
                "reopened": false,
                "status": false
            },
            "sha": "3648481eb2017bcef06f782234c3167854f64c43"
        }
    ],
    "first_commit": "2019-04-16 12:43:00",
    "last_commit": "2019-09-30 07:37:52",
    "number": 41256,
    "score": 208.00242424242424
}