{
    "covered_issues": [
        561,
        555,
        551,
        549,
        547,
        543,
        542,
        540,
        536,
        533,
        529,
        525,
        521,
        520,
        517,
        516,
        513,
        510,
        508,
        507,
        504,
        500,
        497,
        496,
        495,
        493,
        492,
        490,
        489,
        483,
        482,
        476,
        474,
        471,
        468,
        467,
        464,
        463,
        461,
        459,
        457,
        455,
        450,
        449,
        445,
        444,
        443,
        441,
        439,
        438,
        436,
        435,
        433,
        432,
        426,
        424,
        423,
        422,
        420,
        419,
        416,
        414,
        409,
        407,
        406,
        404,
        403,
        399,
        394,
        393,
        391,
        390,
        387,
        383,
        382,
        381,
        376,
        373,
        369,
        366,
        363,
        359,
        357,
        354,
        353,
        349,
        348,
        346,
        345,
        342,
        341,
        339,
        338,
        337,
        336,
        335,
        334,
        332,
        331,
        328,
        327,
        325,
        324,
        323,
        322,
        321,
        320,
        319,
        318,
        315,
        314,
        312,
        311,
        310,
        309,
        306,
        305,
        303,
        302,
        301,
        300,
        298,
        297,
        296,
        294,
        293,
        292,
        291,
        290,
        289,
        287,
        285,
        282,
        281,
        280,
        279,
        278,
        277,
        274,
        273,
        272,
        271,
        270,
        269,
        268,
        267,
        265,
        264,
        263,
        262,
        261,
        260,
        259,
        258,
        257,
        256,
        254,
        253,
        252,
        250,
        248,
        246,
        244,
        243,
        242,
        241,
        239,
        238,
        237,
        236,
        235,
        234,
        233,
        232,
        230,
        229,
        227,
        224,
        223,
        221,
        220,
        219,
        218,
        217,
        216,
        214,
        213,
        209,
        208,
        207,
        206,
        205,
        204,
        202,
        201,
        198,
        197,
        196,
        195,
        193,
        192,
        191,
        190,
        189,
        188,
        184,
        182,
        180,
        179,
        178,
        176,
        174,
        173,
        172,
        171,
        170,
        169,
        167,
        165,
        163,
        162,
        154,
        152,
        151,
        149,
        144,
        143,
        141,
        138,
        137,
        132,
        130,
        129,
        128,
        126,
        117,
        115,
        106,
        105,
        104,
        103,
        102,
        99,
        96,
        95,
        94,
        93,
        87,
        85,
        84,
        77,
        71,
        70,
        69,
        68,
        67,
        62,
        58,
        56,
        55,
        54,
        51,
        49,
        48,
        47,
        46,
        41,
        39,
        34,
        33,
        32,
        31,
        30,
        27,
        26,
        25,
        24,
        23,
        22,
        21,
        20,
        19,
        17,
        16,
        15,
        14,
        13,
        12,
        10,
        8,
        6,
        5,
        3,
        2,
        1
    ],
    "finished": true
}