{
    "category": [
        "hardware/OS",
        "GUI"
    ],
    "commits": [
        {
            "associated_pull_request": [
                "https://github.com/surge-synthesizer/surge/pull/2797"
            ],
            "date": "2020-10-07 15:13:44",
            "diff": "surge-synthesizer_surge/issue_2763/commit_1f893418e8ec3e85b7a04259a7879308802042c7.diff",
            "diff_additions": 14,
            "diff_deletions": 2,
            "diff_file_size": 41057,
            "diff_url": "https://github.com/surge-synthesizer/surge/commit/1f893418e8ec3e85b7a04259a7879308802042c7.diff",
            "exists": true,
            "files": [
                {
                    "file_additions": 14,
                    "file_deletions": 2,
                    "file_exists": true,
                    "file_name": "src/common/dsp/SurgeVoice.cpp",
                    "file_size": 41057
                }
            ],
            "interesting": {
                "reopen": false,
                "status": false
            },
            "is_parent": true,
            "sha": "1f893418e8ec3e85b7a04259a7879308802042c7"
        },
        {
            "associated_pull_request": [],
            "date": "2020-10-01 21:47:44",
            "diff": "surge-synthesizer_surge/issue_2763/commit_93a9c6f2b969b5ebec603fc20d9a8ec138fa3606.diff",
            "diff_additions": 1718,
            "diff_deletions": 1672,
            "diff_file_size": 274412,
            "diff_url": "https://github.com/surge-synthesizer/surge/commit/93a9c6f2b969b5ebec603fc20d9a8ec138fa3606.diff",
            "exists": true,
            "files": [
                {
                    "file_additions": 24,
                    "file_deletions": 5,
                    "file_exists": true,
                    "file_name": "src/common/Parameter.cpp",
                    "file_size": 122346
                },
                {
                    "file_additions": 281,
                    "file_deletions": 0,
                    "file_exists": true,
                    "file_name": "src/common/SkinModel.cpp",
                    "file_size": 30523
                },
                {
                    "file_additions": 157,
                    "file_deletions": 0,
                    "file_exists": true,
                    "file_name": "src/common/SkinModelImpl.cpp",
                    "file_size": 8986
                },
                {
                    "file_additions": 232,
                    "file_deletions": 272,
                    "file_exists": true,
                    "file_name": "src/common/SurgePatch.cpp",
                    "file_size": 112557
                },
                {
                    "file_additions": 0,
                    "file_deletions": 43,
                    "file_exists": false,
                    "file_name": "src/common/gui/COscillatorDisplay.cpp",
                    "file_size": 0
                },
                {
                    "file_additions": 0,
                    "file_deletions": 39,
                    "file_exists": false,
                    "file_name": "src/common/gui/CPatchBrowser.cpp",
                    "file_size": 0
                },
                {
                    "file_additions": 0,
                    "file_deletions": 198,
                    "file_exists": false,
                    "file_name": "src/common/gui/CStatusPanel.cpp",
                    "file_size": 0
                },
                {
                    "file_additions": 177,
                    "file_deletions": 20,
                    "file_exists": false,
                    "file_name": "src/common/gui/SkinSupport.cpp",
                    "file_size": 0
                },
                {
                    "file_additions": 3,
                    "file_deletions": 0,
                    "file_exists": false,
                    "file_name": "src/common/gui/SurgeBitmaps.cpp",
                    "file_size": 0
                },
                {
                    "file_additions": 844,
                    "file_deletions": 1095,
                    "file_exists": false,
                    "file_name": "src/common/gui/SurgeGUIEditor.cpp",
                    "file_size": 0
                }
            ],
            "interesting": {
                "reopen": false,
                "status": true
            },
            "is_parent": false,
            "sha": "93a9c6f2b969b5ebec603fc20d9a8ec138fa3606"
        },
        {
            "associated_pull_request": [
                "https://github.com/surge-synthesizer/surge/pull/2800"
            ],
            "date": "2020-10-07 21:35:15",
            "diff": "surge-synthesizer_surge/issue_2763/commit_f02fc9ff24b6623ab798eb874b9582c0b7b6d966.diff",
            "diff_additions": 1,
            "diff_deletions": 0,
            "diff_file_size": 0,
            "diff_url": "https://github.com/surge-synthesizer/surge/commit/f02fc9ff24b6623ab798eb874b9582c0b7b6d966.diff",
            "exists": true,
            "files": [
                {
                    "file_additions": 1,
                    "file_deletions": 0,
                    "file_exists": false,
                    "file_name": "src/common/gui/SurgeGUIEditor.cpp",
                    "file_size": 0
                }
            ],
            "interesting": {
                "reopen": false,
                "status": true
            },
            "is_parent": false,
            "sha": "f02fc9ff24b6623ab798eb874b9582c0b7b6d966"
        },
        {
            "associated_pull_request": [
                "https://github.com/surge-synthesizer/surge/pull/2800"
            ],
            "date": "2020-10-07 21:37:28",
            "diff": "surge-synthesizer_surge/issue_2763/commit_21e80cea79c5b0b4582b5c23cc8d54d888f2bc9f.diff",
            "diff_additions": 1,
            "diff_deletions": 0,
            "diff_file_size": 0,
            "diff_url": "https://github.com/surge-synthesizer/surge/commit/21e80cea79c5b0b4582b5c23cc8d54d888f2bc9f.diff",
            "exists": true,
            "files": [
                {
                    "file_additions": 1,
                    "file_deletions": 0,
                    "file_exists": false,
                    "file_name": "src/common/gui/SurgeGUIEditor.cpp",
                    "file_size": 0
                }
            ],
            "interesting": {
                "reopen": false,
                "status": false
            },
            "is_parent": false,
            "sha": "21e80cea79c5b0b4582b5c23cc8d54d888f2bc9f"
        },
        {
            "associated_pull_request": [
                "https://github.com/surge-synthesizer/surge/pull/2857"
            ],
            "date": "2020-10-13 14:45:09",
            "diff": "surge-synthesizer_surge/issue_2763/commit_0c6c87e1d8138f6be6d4e8de801176d3da748560.diff",
            "diff_additions": 18,
            "diff_deletions": 1,
            "diff_file_size": 0,
            "diff_url": "https://github.com/surge-synthesizer/surge/commit/0c6c87e1d8138f6be6d4e8de801176d3da748560.diff",
            "exists": true,
            "files": [
                {
                    "file_additions": 3,
                    "file_deletions": 0,
                    "file_exists": false,
                    "file_name": "src/common/gui/CSwitchControl.cpp",
                    "file_size": 0
                },
                {
                    "file_additions": 15,
                    "file_deletions": 1,
                    "file_exists": false,
                    "file_name": "src/common/gui/SurgeGUIEditor.cpp",
                    "file_size": 0
                }
            ],
            "interesting": {
                "reopen": false,
                "status": false
            },
            "is_parent": false,
            "sha": "0c6c87e1d8138f6be6d4e8de801176d3da748560"
        },
        {
            "associated_pull_request": [
                "https://github.com/surge-synthesizer/surge/pull/2857"
            ],
            "date": "2020-10-13 21:33:22",
            "diff": "surge-synthesizer_surge/issue_2763/commit_f61927a71a2a6ff98b9731aedaca15a7205bcd00.diff",
            "diff_additions": 18,
            "diff_deletions": 1,
            "diff_file_size": 0,
            "diff_url": "https://github.com/surge-synthesizer/surge/commit/f61927a71a2a6ff98b9731aedaca15a7205bcd00.diff",
            "exists": true,
            "files": [
                {
                    "file_additions": 3,
                    "file_deletions": 0,
                    "file_exists": false,
                    "file_name": "src/common/gui/CSwitchControl.cpp",
                    "file_size": 0
                },
                {
                    "file_additions": 15,
                    "file_deletions": 1,
                    "file_exists": false,
                    "file_name": "src/common/gui/SurgeGUIEditor.cpp",
                    "file_size": 0
                }
            ],
            "interesting": {
                "reopen": false,
                "status": false
            },
            "is_parent": false,
            "sha": "f61927a71a2a6ff98b9731aedaca15a7205bcd00"
        }
    ],
    "first_commit": "2020-10-07 15:13:44",
    "last_commit": "2020-10-13 21:33:22",
    "number": 2763,
    "pull_request": "None",
    "score": {
        "accidental_reopen_likely": false,
        "all_labels": [
            "Skinning Engine"
        ],
        "contains_keywords": [
            "remov",
            "issu",
            "problem",
            "crash",
            "attempt",
            "chang",
            "work",
            "fix",
            "report",
            "test",
            "bug"
        ],
        "fix_size": 2611,
        "has_labels": [],
        "intersecting": {
            "computed_score": 1.0,
            "final_commit_size": 21,
            "intersection_size": 21,
            "previous_commits_size": 2611
        },
        "is_makefile_based": true,
        "no_new_files": [],
        "no_other_files": false,
        "num_prohibited_files": 66436,
        "prohibited_files": [
            "tools/building.py",
            "tools/building.py",
            "tools/building.py",
            "emcc.py",
            "src/library_emmalloc.js",
            "src/shell.js",
            "tests/test_core.py",
            "src/shell.js",
            "tests/test_core.py",
            "src/library.js"
        ],
        "reopen": false,
        "reopen_events": [
            [
                "2020-10-07 19:10:06",
                "commit"
            ],
            [
                "2020-10-07 19:32:36",
                "commit"
            ],
            [
                "2020-10-07 19:57:34",
                "commit"
            ],
            [
                "2020-10-07 21:35:56",
                "commit"
            ],
            [
                "2020-10-07 21:37:30",
                "commit"
            ],
            [
                "2020-10-13 21:24:33",
                "commit"
            ],
            [
                "2020-10-13 21:33:22",
                "closed"
            ],
            [
                "2020-10-13 21:33:24",
                "commit"
            ]
        ],
        "status": true,
        "strategy": true,
        "total_changes": 3446
    }
}