{
    "category": [
        "network/protocols",
        "build/refactor/preprocessing"
    ],
    "commits": [
        {
            "associated_pull_request": [
                "https://github.com/zephyrproject-rtos/zephyr/pull/28926"
            ],
            "date": "2020-10-02 15:35:55",
            "diff": "zephyrproject-rtos_zephyr/issue_29150/commit_accaab21129f6970fb8824397e0b3d6f7966ee80.diff",
            "diff_additions": 415,
            "diff_deletions": 0,
            "diff_file_size": 152691,
            "diff_url": "https://github.com/zephyrproject-rtos/zephyr/commit/accaab21129f6970fb8824397e0b3d6f7966ee80.diff",
            "exists": true,
            "files": [
                {
                    "file_additions": 415,
                    "file_deletions": 0,
                    "file_exists": true,
                    "file_name": "subsys/net/ip/net_shell.c",
                    "file_size": 152691
                }
            ],
            "interesting": {
                "reopen": false,
                "status": true
            },
            "is_parent": true,
            "sha": "accaab21129f6970fb8824397e0b3d6f7966ee80"
        },
        {
            "associated_pull_request": [
                "https://github.com/zephyrproject-rtos/zephyr/pull/29181"
            ],
            "date": "2020-10-14 07:53:16",
            "diff": "zephyrproject-rtos_zephyr/issue_29150/commit_2b03afde5aded8ed8eec946757a75265b4bf1047.diff",
            "diff_additions": 12,
            "diff_deletions": 6,
            "diff_file_size": 129100,
            "diff_url": "https://github.com/zephyrproject-rtos/zephyr/commit/2b03afde5aded8ed8eec946757a75265b4bf1047.diff",
            "exists": true,
            "files": [
                {
                    "file_additions": 12,
                    "file_deletions": 6,
                    "file_exists": true,
                    "file_name": "subsys/bluetooth/host/gatt.c",
                    "file_size": 129100
                }
            ],
            "interesting": {
                "reopen": false,
                "status": false
            },
            "is_parent": false,
            "sha": "2b03afde5aded8ed8eec946757a75265b4bf1047"
        },
        {
            "associated_pull_request": [
                "https://github.com/zephyrproject-rtos/zephyr/pull/29181"
            ],
            "date": "2020-10-14 07:53:16",
            "diff": "zephyrproject-rtos_zephyr/issue_29150/commit_34cf1c74c21b10acfbc6504cd9bc212317c726d0.diff",
            "diff_additions": 12,
            "diff_deletions": 6,
            "diff_file_size": 129100,
            "diff_url": "https://github.com/zephyrproject-rtos/zephyr/commit/34cf1c74c21b10acfbc6504cd9bc212317c726d0.diff",
            "exists": true,
            "files": [
                {
                    "file_additions": 12,
                    "file_deletions": 6,
                    "file_exists": true,
                    "file_name": "subsys/bluetooth/host/gatt.c",
                    "file_size": 129100
                }
            ],
            "interesting": {
                "reopen": false,
                "status": true
            },
            "is_parent": false,
            "sha": "34cf1c74c21b10acfbc6504cd9bc212317c726d0"
        },
        {
            "associated_pull_request": [
                "https://github.com/zephyrproject-rtos/zephyr/pull/29225"
            ],
            "date": "2020-10-14 07:53:16",
            "diff": "zephyrproject-rtos_zephyr/issue_29150/commit_9fb2b210495e528880875580a6adb40682fad176.diff",
            "diff_additions": 12,
            "diff_deletions": 6,
            "diff_file_size": 129100,
            "diff_url": "https://github.com/zephyrproject-rtos/zephyr/commit/9fb2b210495e528880875580a6adb40682fad176.diff",
            "exists": true,
            "files": [
                {
                    "file_additions": 12,
                    "file_deletions": 6,
                    "file_exists": true,
                    "file_name": "subsys/bluetooth/host/gatt.c",
                    "file_size": 129100
                }
            ],
            "interesting": {
                "reopen": false,
                "status": false
            },
            "is_parent": false,
            "sha": "9fb2b210495e528880875580a6adb40682fad176"
        },
        {
            "associated_pull_request": [],
            "date": "2020-10-14 07:53:16",
            "diff": "zephyrproject-rtos_zephyr/issue_29150/commit_2c2ed6ecadc6fdbaeb212f11981a4d50fc7cfc16.diff",
            "diff_additions": 12,
            "diff_deletions": 6,
            "diff_file_size": 129100,
            "diff_url": "https://github.com/zephyrproject-rtos/zephyr/commit/2c2ed6ecadc6fdbaeb212f11981a4d50fc7cfc16.diff",
            "exists": true,
            "files": [
                {
                    "file_additions": 12,
                    "file_deletions": 6,
                    "file_exists": true,
                    "file_name": "subsys/bluetooth/host/gatt.c",
                    "file_size": 129100
                }
            ],
            "interesting": {
                "reopen": false,
                "status": false
            },
            "is_parent": false,
            "sha": "2c2ed6ecadc6fdbaeb212f11981a4d50fc7cfc16"
        },
        {
            "associated_pull_request": [],
            "date": "2020-10-14 07:53:16",
            "diff": "zephyrproject-rtos_zephyr/issue_29150/commit_d594a42693bc77c966b031752f788507fd882b13.diff",
            "diff_additions": 12,
            "diff_deletions": 6,
            "diff_file_size": 129100,
            "diff_url": "https://github.com/zephyrproject-rtos/zephyr/commit/d594a42693bc77c966b031752f788507fd882b13.diff",
            "exists": true,
            "files": [
                {
                    "file_additions": 12,
                    "file_deletions": 6,
                    "file_exists": true,
                    "file_name": "subsys/bluetooth/host/gatt.c",
                    "file_size": 129100
                }
            ],
            "interesting": {
                "reopen": false,
                "status": false
            },
            "is_parent": false,
            "sha": "d594a42693bc77c966b031752f788507fd882b13"
        },
        {
            "associated_pull_request": [],
            "date": "2020-10-14 07:53:16",
            "diff": "zephyrproject-rtos_zephyr/issue_29150/commit_61e7293701a4b64a108fca1911c042e6de33e94a.diff",
            "diff_additions": 12,
            "diff_deletions": 6,
            "diff_file_size": 129100,
            "diff_url": "https://github.com/zephyrproject-rtos/zephyr/commit/61e7293701a4b64a108fca1911c042e6de33e94a.diff",
            "exists": true,
            "files": [
                {
                    "file_additions": 12,
                    "file_deletions": 6,
                    "file_exists": true,
                    "file_name": "subsys/bluetooth/host/gatt.c",
                    "file_size": 129100
                }
            ],
            "interesting": {
                "reopen": false,
                "status": false
            },
            "is_parent": false,
            "sha": "61e7293701a4b64a108fca1911c042e6de33e94a"
        },
        {
            "associated_pull_request": [
                "https://github.com/zephyrproject-rtos/zephyr/pull/29225"
            ],
            "date": "2020-10-14 07:53:16",
            "diff": "zephyrproject-rtos_zephyr/issue_29150/commit_c2a0b0f50bdb3c928e9d329cea93157e7cf0a469.diff",
            "diff_additions": 12,
            "diff_deletions": 6,
            "diff_file_size": 129100,
            "diff_url": "https://github.com/zephyrproject-rtos/zephyr/commit/c2a0b0f50bdb3c928e9d329cea93157e7cf0a469.diff",
            "exists": true,
            "files": [
                {
                    "file_additions": 12,
                    "file_deletions": 6,
                    "file_exists": true,
                    "file_name": "subsys/bluetooth/host/gatt.c",
                    "file_size": 129100
                }
            ],
            "interesting": {
                "reopen": false,
                "status": false
            },
            "is_parent": false,
            "sha": "c2a0b0f50bdb3c928e9d329cea93157e7cf0a469"
        }
    ],
    "first_commit": "2020-10-13 10:42:50",
    "last_commit": "2020-11-17 21:47:02",
    "number": 29150,
    "pull_request": "None",
    "score": {
        "accidental_reopen_likely": false,
        "all_labels": [
            "Regression",
            "area: Bluetooth",
            "bug",
            "priority: medium"
        ],
        "contains_keywords": [
            "fail",
            "fix",
            "work"
        ],
        "fix_size": 42,
        "has_labels": [
            "bug"
        ],
        "intersecting": {
            "computed_score": 1.0,
            "final_commit_size": 18,
            "intersection_size": 18,
            "previous_commits_size": 42
        },
        "is_makefile_based": true,
        "no_new_files": [],
        "no_other_files": false,
        "num_prohibited_files": 91136,
        "prohibited_files": [
            "hal/inc/pinmap_hal.h",
            "Debug/marvin.bin",
            "Debug/marvin.elf",
            "Debug/marvin.hex",
            "Debug/marvin.bin",
            "Debug/marvin.elf",
            "Debug/marvin.hex",
            "inc/spark_utilities.h",
            "Debug/marvin.bin",
            "Debug/marvin.elf"
        ],
        "reopen": false,
        "reopen_events": [
            [
                "2020-10-14 07:59:12",
                "commit"
            ],
            [
                "2020-10-14 15:35:24",
                "closed"
            ],
            [
                "2020-10-14 15:35:26",
                "commit"
            ],
            [
                "2020-10-15 11:39:35",
                "commit"
            ],
            [
                "2020-10-15 12:04:57",
                "commit"
            ],
            [
                "2020-10-27 10:16:27",
                "commit"
            ],
            [
                "2020-10-27 12:18:49",
                "commit"
            ],
            [
                "2020-11-17 21:47:04",
                "commit"
            ]
        ],
        "status": true,
        "strategy": true,
        "total_changes": 541
    }
}