{
    "category": [
        "hardware/OS",
        "build/refactor/preprocessing"
    ],
    "commits": [
        {
            "associated_pull_request": [
                "https://github.com/stlink-org/stlink/pull/969"
            ],
            "date": "2020-03-23 18:11:18",
            "diff": "",
            "diff_additions": 0,
            "diff_deletions": 0,
            "diff_file_size": 0,
            "diff_url": "https://github.com/stlink-org/stlink/commit/10ae5294cd03aacfc07312010f026d3cb12ea56c.diff",
            "exists": true,
            "files": [],
            "interesting": {
                "reopen": false,
                "status": false
            },
            "is_parent": true,
            "sha": "10ae5294cd03aacfc07312010f026d3cb12ea56c"
        },
        {
            "associated_pull_request": [],
            "date": "2020-03-23 21:09:03",
            "diff": "stlink-org_stlink/issue_211/commit_d2b5f8dbfbb0458e90cde4c90de025e7ae518b7b.diff",
            "diff_additions": 0,
            "diff_deletions": 7,
            "diff_file_size": 0,
            "diff_url": "https://github.com/stlink-org/stlink/commit/d2b5f8dbfbb0458e90cde4c90de025e7ae518b7b.diff",
            "exists": true,
            "files": [
                {
                    "file_additions": 0,
                    "file_deletions": 7,
                    "file_exists": false,
                    "file_name": "src/sg.c",
                    "file_size": 0
                }
            ],
            "interesting": {
                "reopen": false,
                "status": true
            },
            "is_parent": false,
            "sha": "d2b5f8dbfbb0458e90cde4c90de025e7ae518b7b"
        },
        {
            "associated_pull_request": [
                "https://github.com/stlink-org/stlink/pull/969"
            ],
            "date": "2020-03-24 01:21:03",
            "diff": "stlink-org_stlink/issue_211/commit_e3c76aa67315db32bd303303023d6c74c51e900b.diff",
            "diff_additions": 0,
            "diff_deletions": 9,
            "diff_file_size": 0,
            "diff_url": "https://github.com/stlink-org/stlink/commit/e3c76aa67315db32bd303303023d6c74c51e900b.diff",
            "exists": true,
            "files": [
                {
                    "file_additions": 0,
                    "file_deletions": 9,
                    "file_exists": false,
                    "file_name": "src/sg.c",
                    "file_size": 0
                }
            ],
            "interesting": {
                "reopen": true,
                "status": false
            },
            "is_parent": false,
            "sha": "e3c76aa67315db32bd303303023d6c74c51e900b"
        },
        {
            "associated_pull_request": [],
            "date": "2020-03-24 01:21:03",
            "diff": "stlink-org_stlink/issue_211/commit_fd373af7f3f683057210dfd32b1eda05dc1761be.diff",
            "diff_additions": 0,
            "diff_deletions": 9,
            "diff_file_size": 0,
            "diff_url": "https://github.com/stlink-org/stlink/commit/fd373af7f3f683057210dfd32b1eda05dc1761be.diff",
            "exists": true,
            "files": [
                {
                    "file_additions": 0,
                    "file_deletions": 9,
                    "file_exists": false,
                    "file_name": "src/sg.c",
                    "file_size": 0
                }
            ],
            "interesting": {
                "reopen": false,
                "status": false
            },
            "is_parent": false,
            "sha": "fd373af7f3f683057210dfd32b1eda05dc1761be"
        },
        {
            "associated_pull_request": [],
            "date": "2020-03-24 01:21:03",
            "diff": "stlink-org_stlink/issue_211/commit_32d9ab29bb6f69804b4086e4f84842c9d8afbb51.diff",
            "diff_additions": 0,
            "diff_deletions": 9,
            "diff_file_size": 0,
            "diff_url": "https://github.com/stlink-org/stlink/commit/32d9ab29bb6f69804b4086e4f84842c9d8afbb51.diff",
            "exists": true,
            "files": [
                {
                    "file_additions": 0,
                    "file_deletions": 9,
                    "file_exists": false,
                    "file_name": "src/sg.c",
                    "file_size": 0
                }
            ],
            "interesting": {
                "reopen": false,
                "status": false
            },
            "is_parent": false,
            "sha": "32d9ab29bb6f69804b4086e4f84842c9d8afbb51"
        },
        {
            "associated_pull_request": [],
            "date": "2020-03-24 01:21:03",
            "diff": "stlink-org_stlink/issue_211/commit_83f9a3df232198514ca6dcae6b1673892acf1cd1.diff",
            "diff_additions": 0,
            "diff_deletions": 9,
            "diff_file_size": 0,
            "diff_url": "https://github.com/stlink-org/stlink/commit/83f9a3df232198514ca6dcae6b1673892acf1cd1.diff",
            "exists": true,
            "files": [
                {
                    "file_additions": 0,
                    "file_deletions": 9,
                    "file_exists": false,
                    "file_name": "src/sg.c",
                    "file_size": 0
                }
            ],
            "interesting": {
                "reopen": false,
                "status": false
            },
            "is_parent": false,
            "sha": "83f9a3df232198514ca6dcae6b1673892acf1cd1"
        }
    ],
    "first_commit": "2020-03-23 18:11:18",
    "last_commit": "2020-04-06 16:29:35",
    "number": 211,
    "pull_request": "None",
    "score": {
        "accidental_reopen_likely": false,
        "all_labels": [
            "code/compatibility",
            "code/refactoring",
            "dependency/libusb",
            "status/resolved"
        ],
        "contains_keywords": [
            "issu"
        ],
        "fix_size": 10,
        "has_labels": [],
        "intersecting": {
            "computed_score": 1.0,
            "final_commit_size": 10,
            "intersection_size": 10,
            "previous_commits_size": 10
        },
        "is_makefile_based": true,
        "no_new_files": [],
        "no_other_files": true,
        "num_prohibited_files": 25840,
        "prohibited_files": [
            "kill.h",
            "meminfo.h",
            "kill.h",
            "meminfo.h",
            "kill.h",
            "meminfo.h",
            "testsuite_cli_test.go",
            "testsuite_cli_test.go",
            "common.mk",
            "i3bar/include/draw_util.h"
        ],
        "reopen": true,
        "reopen_events": [
            [
                "2016-05-03 14:35:36",
                "closed"
            ],
            [
                "2020-03-19 01:40:23",
                "reopened"
            ],
            [
                "2020-03-23 21:10:47",
                "commit"
            ],
            [
                "2020-03-23 21:17:03",
                "closed"
            ],
            [
                "2020-03-24 01:22:53",
                "commit"
            ],
            [
                "2020-03-26 09:30:02",
                "reopened"
            ],
            [
                "2020-03-31 12:53:35",
                "commit"
            ],
            [
                "2020-03-31 14:59:26",
                "commit"
            ],
            [
                "2020-04-03 09:45:27",
                "closed"
            ],
            [
                "2020-04-06 16:42:11",
                "commit"
            ]
        ],
        "status": false,
        "strategy": true,
        "total_changes": 43
    }
}