{
    "category": [
        "control flow",
        "feature request"
    ],
    "commits": [
        {
            "associated_pull_request": [
                "https://github.com/netdata/netdata/pull/7988"
            ],
            "date": "2020-02-14 09:54:26",
            "diff": "netdata_netdata/issue_6503/commit_f4e1012f5ffe1231c25e22f7350d2928b443c69f.diff",
            "diff_additions": 479,
            "diff_deletions": 10,
            "diff_file_size": 0,
            "diff_url": "https://github.com/netdata/netdata/commit/f4e1012f5ffe1231c25e22f7350d2928b443c69f.diff",
            "exists": true,
            "files": [
                {
                    "file_additions": 337,
                    "file_deletions": 0,
                    "file_exists": false,
                    "file_name": "aclk/aclk_lws_wss_client.c",
                    "file_size": 0
                },
                {
                    "file_additions": 7,
                    "file_deletions": 3,
                    "file_exists": false,
                    "file_name": "aclk/agent_cloud_link.c",
                    "file_size": 0
                },
                {
                    "file_additions": 135,
                    "file_deletions": 7,
                    "file_exists": false,
                    "file_name": "aclk/mqtt.c",
                    "file_size": 0
                }
            ],
            "interesting": {
                "reopen": false,
                "status": false
            },
            "is_parent": true,
            "sha": "f4e1012f5ffe1231c25e22f7350d2928b443c69f"
        },
        {
            "associated_pull_request": [],
            "date": "2020-02-14 13:05:42",
            "diff": "netdata_netdata/issue_6503/commit_8c24524b7db46cd28e210c8a3e0dc611f0f81df4.diff",
            "diff_additions": 4,
            "diff_deletions": 0,
            "diff_file_size": 34721,
            "diff_url": "https://github.com/netdata/netdata/commit/8c24524b7db46cd28e210c8a3e0dc611f0f81df4.diff",
            "exists": true,
            "files": [
                {
                    "file_additions": 4,
                    "file_deletions": 0,
                    "file_exists": true,
                    "file_name": "backends/prometheus/backend_prometheus.c",
                    "file_size": 34721
                }
            ],
            "interesting": {
                "reopen": false,
                "status": false
            },
            "is_parent": false,
            "sha": "8c24524b7db46cd28e210c8a3e0dc611f0f81df4"
        },
        {
            "associated_pull_request": [],
            "date": "2020-02-14 15:11:49",
            "diff": "netdata_netdata/issue_6503/commit_0bffb3aba9130330f133d15f4ef01c4f09553fca.diff",
            "diff_additions": 46,
            "diff_deletions": 13,
            "diff_file_size": 93688,
            "diff_url": "https://github.com/netdata/netdata/commit/0bffb3aba9130330f133d15f4ef01c4f09553fca.diff",
            "exists": true,
            "files": [
                {
                    "file_additions": 2,
                    "file_deletions": 2,
                    "file_exists": true,
                    "file_name": "backends/prometheus/backend_prometheus.c",
                    "file_size": 34721
                },
                {
                    "file_additions": 44,
                    "file_deletions": 11,
                    "file_exists": true,
                    "file_name": "database/rrdhost.c",
                    "file_size": 58967
                }
            ],
            "interesting": {
                "reopen": false,
                "status": true
            },
            "is_parent": false,
            "sha": "0bffb3aba9130330f133d15f4ef01c4f09553fca"
        },
        {
            "associated_pull_request": [],
            "date": "2020-02-24 16:34:32",
            "diff": "netdata_netdata/issue_6503/commit_4e6a3c5331f02a6b60dcd3b7e189093f06080e2c.diff",
            "diff_additions": 1,
            "diff_deletions": 1,
            "diff_file_size": 58967,
            "diff_url": "https://github.com/netdata/netdata/commit/4e6a3c5331f02a6b60dcd3b7e189093f06080e2c.diff",
            "exists": true,
            "files": [
                {
                    "file_additions": 1,
                    "file_deletions": 1,
                    "file_exists": true,
                    "file_name": "database/rrdhost.c",
                    "file_size": 58967
                }
            ],
            "interesting": {
                "reopen": false,
                "status": true
            },
            "is_parent": false,
            "sha": "4e6a3c5331f02a6b60dcd3b7e189093f06080e2c"
        },
        {
            "associated_pull_request": [],
            "date": "2020-02-24 17:24:59",
            "diff": "netdata_netdata/issue_6503/commit_6199a32c09210e6fccfdcda7f1f7a6f664f6c1b0.diff",
            "diff_additions": 1,
            "diff_deletions": 1,
            "diff_file_size": 58967,
            "diff_url": "https://github.com/netdata/netdata/commit/6199a32c09210e6fccfdcda7f1f7a6f664f6c1b0.diff",
            "exists": true,
            "files": [
                {
                    "file_additions": 1,
                    "file_deletions": 1,
                    "file_exists": true,
                    "file_name": "database/rrdhost.c",
                    "file_size": 58967
                }
            ],
            "interesting": {
                "reopen": false,
                "status": true
            },
            "is_parent": false,
            "sha": "6199a32c09210e6fccfdcda7f1f7a6f664f6c1b0"
        },
        {
            "associated_pull_request": [],
            "date": "2020-02-24 17:25:24",
            "diff": "netdata_netdata/issue_6503/commit_64f1017ffce8d2c16cfb3675397bc58226da689e.diff",
            "diff_additions": 1,
            "diff_deletions": 1,
            "diff_file_size": 58967,
            "diff_url": "https://github.com/netdata/netdata/commit/64f1017ffce8d2c16cfb3675397bc58226da689e.diff",
            "exists": true,
            "files": [
                {
                    "file_additions": 1,
                    "file_deletions": 1,
                    "file_exists": true,
                    "file_name": "database/rrdhost.c",
                    "file_size": 58967
                }
            ],
            "interesting": {
                "reopen": false,
                "status": true
            },
            "is_parent": false,
            "sha": "64f1017ffce8d2c16cfb3675397bc58226da689e"
        },
        {
            "associated_pull_request": [],
            "date": "2020-02-24 21:25:48",
            "diff": "netdata_netdata/issue_6503/commit_8c6a85cccedb8024653cbe75ccdc106c3a1a074a.diff",
            "diff_additions": 6,
            "diff_deletions": 3,
            "diff_file_size": 175086,
            "diff_url": "https://github.com/netdata/netdata/commit/8c6a85cccedb8024653cbe75ccdc106c3a1a074a.diff",
            "exists": true,
            "files": [
                {
                    "file_additions": 1,
                    "file_deletions": 0,
                    "file_exists": true,
                    "file_name": "daemon/unit_test.c",
                    "file_size": 85570
                },
                {
                    "file_additions": 3,
                    "file_deletions": 3,
                    "file_exists": true,
                    "file_name": "database/rrdhost.c",
                    "file_size": 58967
                },
                {
                    "file_additions": 2,
                    "file_deletions": 0,
                    "file_exists": true,
                    "file_name": "streaming/rrdpush.c",
                    "file_size": 30549
                }
            ],
            "interesting": {
                "reopen": false,
                "status": true
            },
            "is_parent": false,
            "sha": "8c6a85cccedb8024653cbe75ccdc106c3a1a074a"
        },
        {
            "associated_pull_request": [],
            "date": "2020-02-24 21:31:08",
            "diff": "netdata_netdata/issue_6503/commit_f40f2d783a03ac5625245732a1370ef6f80aea62.diff",
            "diff_additions": 2,
            "diff_deletions": 2,
            "diff_file_size": 30549,
            "diff_url": "https://github.com/netdata/netdata/commit/f40f2d783a03ac5625245732a1370ef6f80aea62.diff",
            "exists": true,
            "files": [
                {
                    "file_additions": 2,
                    "file_deletions": 2,
                    "file_exists": true,
                    "file_name": "streaming/rrdpush.c",
                    "file_size": 30549
                }
            ],
            "interesting": {
                "reopen": false,
                "status": false
            },
            "is_parent": false,
            "sha": "f40f2d783a03ac5625245732a1370ef6f80aea62"
        },
        {
            "associated_pull_request": [],
            "date": "2020-02-24 16:27:32",
            "diff": "netdata_netdata/issue_6503/commit_e3028ff1d083780044bc3a2211d44a5899a63878.diff",
            "diff_additions": 9,
            "diff_deletions": 6,
            "diff_file_size": 175086,
            "diff_url": "https://github.com/netdata/netdata/commit/e3028ff1d083780044bc3a2211d44a5899a63878.diff",
            "exists": true,
            "files": [
                {
                    "file_additions": 1,
                    "file_deletions": 0,
                    "file_exists": true,
                    "file_name": "daemon/unit_test.c",
                    "file_size": 85570
                },
                {
                    "file_additions": 6,
                    "file_deletions": 6,
                    "file_exists": true,
                    "file_name": "database/rrdhost.c",
                    "file_size": 58967
                },
                {
                    "file_additions": 2,
                    "file_deletions": 0,
                    "file_exists": true,
                    "file_name": "streaming/rrdpush.c",
                    "file_size": 30549
                }
            ],
            "interesting": {
                "reopen": false,
                "status": false
            },
            "is_parent": false,
            "sha": "e3028ff1d083780044bc3a2211d44a5899a63878"
        }
    ],
    "first_commit": "2020-02-14 09:54:26",
    "last_commit": "2020-02-24 21:35:33",
    "number": 6503,
    "pull_request": "None",
    "score": {
        "accidental_reopen_likely": false,
        "all_labels": [
            "Epic",
            "Roadmap",
            "discussion",
            "feature request",
            "priority/high"
        ],
        "contains_keywords": [
            "fail",
            "warn",
            "chang",
            "reason",
            "confirm",
            "error",
            "problem",
            "fix",
            "remov",
            "issu",
            "work",
            "perform",
            "fault"
        ],
        "fix_size": 66,
        "has_labels": [],
        "intersecting": {
            "computed_score": 1.0,
            "final_commit_size": 12,
            "intersection_size": 12,
            "previous_commits_size": 66
        },
        "is_makefile_based": true,
        "no_new_files": [],
        "no_other_files": false,
        "num_prohibited_files": 92584,
        "prohibited_files": [
            "hal/inc/pinmap_hal.h",
            "Debug/marvin.bin",
            "Debug/marvin.elf",
            "Debug/marvin.hex",
            "Debug/marvin.bin",
            "Debug/marvin.elf",
            "Debug/marvin.hex",
            "inc/spark_utilities.h",
            "Debug/marvin.bin",
            "Debug/marvin.elf"
        ],
        "reopen": false,
        "reopen_events": [
            [
                "2020-02-14 15:12:08",
                "commit"
            ],
            [
                "2020-02-14 15:12:08",
                "commit"
            ],
            [
                "2020-02-24 16:16:22",
                "commit"
            ],
            [
                "2020-02-24 16:25:33",
                "commit"
            ],
            [
                "2020-02-24 16:27:41",
                "commit"
            ],
            [
                "2020-02-24 16:34:41",
                "commit"
            ],
            [
                "2020-02-24 17:25:07",
                "commit"
            ],
            [
                "2020-02-24 17:25:33",
                "commit"
            ],
            [
                "2020-02-24 21:25:59",
                "commit"
            ],
            [
                "2020-02-24 21:31:17",
                "commit"
            ],
            [
                "2020-02-24 21:36:53",
                "commit"
            ],
            [
                "2020-11-18 15:21:27",
                "closed"
            ]
        ],
        "status": true,
        "strategy": true,
        "total_changes": 586
    }
}