{
    "category": [
        "build/refactor/preprocessing",
        "network/protocol",
        "feature request"
    ],
    "commits": [
        {
            "associated_pull_request": [],
            "date": "2020-07-27 15:59:24",
            "diff": "",
            "diff_additions": 0,
            "diff_deletions": 0,
            "diff_file_size": 0,
            "diff_url": "https://github.com/cc65/cc65/commit/cdd23edd37f44e730fe00acd66ccffeb626d3499.diff",
            "exists": true,
            "files": [],
            "interesting": {
                "reopen": false,
                "status": false
            },
            "is_parent": true,
            "sha": "cdd23edd37f44e730fe00acd66ccffeb626d3499"
        },
        {
            "associated_pull_request": [
                "https://github.com/cc65/cc65/pull/1129"
            ],
            "date": "2020-07-28 11:47:47",
            "diff": "cc65_cc65/issue_1047/commit_7c506d395802b5adccd70867e79e936817f5c41e.diff",
            "diff_additions": 82,
            "diff_deletions": 0,
            "diff_file_size": 0,
            "diff_url": "https://github.com/cc65/cc65/commit/7c506d395802b5adccd70867e79e936817f5c41e.diff",
            "exists": true,
            "files": [
                {
                    "file_additions": 82,
                    "file_deletions": 0,
                    "file_exists": false,
                    "file_name": "test/err/bug1047.c",
                    "file_size": 0
                }
            ],
            "interesting": {
                "reopen": false,
                "status": false
            },
            "is_parent": false,
            "sha": "7c506d395802b5adccd70867e79e936817f5c41e"
        },
        {
            "associated_pull_request": [],
            "date": "2020-08-30 18:47:25",
            "diff": "cc65_cc65/issue_1047/commit_ae99c7cccae144cc55c26f5129edb31db61348b5.diff",
            "diff_additions": 284,
            "diff_deletions": 3,
            "diff_file_size": 139593,
            "diff_url": "https://github.com/cc65/cc65/commit/ae99c7cccae144cc55c26f5129edb31db61348b5.diff",
            "exists": true,
            "files": [
                {
                    "file_additions": 2,
                    "file_deletions": 2,
                    "file_exists": true,
                    "file_name": "src/cc65/declare.c",
                    "file_size": 89028
                },
                {
                    "file_additions": 2,
                    "file_deletions": 1,
                    "file_exists": true,
                    "file_name": "src/cc65/symtab.c",
                    "file_size": 44209
                },
                {
                    "file_additions": 280,
                    "file_deletions": 0,
                    "file_exists": true,
                    "file_name": "test/val/char-bitfield.c",
                    "file_size": 6356
                }
            ],
            "interesting": {
                "reopen": false,
                "status": true
            },
            "is_parent": false,
            "sha": "ae99c7cccae144cc55c26f5129edb31db61348b5"
        },
        {
            "associated_pull_request": [],
            "date": "2020-08-30 18:47:25",
            "diff": "cc65_cc65/issue_1047/commit_b3c3335aa667397993c1ed2f56b9014641dd4e19.diff",
            "diff_additions": 284,
            "diff_deletions": 3,
            "diff_file_size": 141658,
            "diff_url": "https://github.com/cc65/cc65/commit/b3c3335aa667397993c1ed2f56b9014641dd4e19.diff",
            "exists": true,
            "files": [
                {
                    "file_additions": 2,
                    "file_deletions": 2,
                    "file_exists": true,
                    "file_name": "src/cc65/declare.c",
                    "file_size": 89028
                },
                {
                    "file_additions": 2,
                    "file_deletions": 1,
                    "file_exists": true,
                    "file_name": "src/cc65/symtab.c",
                    "file_size": 44209
                },
                {
                    "file_additions": 0,
                    "file_deletions": 0,
                    "file_exists": true,
                    "file_name": "test/val/bug1047.c",
                    "file_size": 2065
                },
                {
                    "file_additions": 280,
                    "file_deletions": 0,
                    "file_exists": true,
                    "file_name": "test/val/char-bitfield.c",
                    "file_size": 6356
                }
            ],
            "interesting": {
                "reopen": false,
                "status": false
            },
            "is_parent": false,
            "sha": "b3c3335aa667397993c1ed2f56b9014641dd4e19"
        },
        {
            "associated_pull_request": [],
            "date": "2020-08-30 18:47:25",
            "diff": "cc65_cc65/issue_1047/commit_bb5b7f45921154b1655a6ba8648edda12025059e.diff",
            "diff_additions": 285,
            "diff_deletions": 4,
            "diff_file_size": 141658,
            "diff_url": "https://github.com/cc65/cc65/commit/bb5b7f45921154b1655a6ba8648edda12025059e.diff",
            "exists": true,
            "files": [
                {
                    "file_additions": 3,
                    "file_deletions": 3,
                    "file_exists": true,
                    "file_name": "src/cc65/declare.c",
                    "file_size": 89028
                },
                {
                    "file_additions": 2,
                    "file_deletions": 1,
                    "file_exists": true,
                    "file_name": "src/cc65/symtab.c",
                    "file_size": 44209
                },
                {
                    "file_additions": 0,
                    "file_deletions": 0,
                    "file_exists": true,
                    "file_name": "test/val/bug1047.c",
                    "file_size": 2065
                },
                {
                    "file_additions": 280,
                    "file_deletions": 0,
                    "file_exists": true,
                    "file_name": "test/val/char-bitfield.c",
                    "file_size": 6356
                }
            ],
            "interesting": {
                "reopen": false,
                "status": false
            },
            "is_parent": false,
            "sha": "bb5b7f45921154b1655a6ba8648edda12025059e"
        },
        {
            "associated_pull_request": [],
            "date": "2020-08-30 18:47:25",
            "diff": "cc65_cc65/issue_1047/commit_9c447afd39fa614762d158cf0854567165b5d1b1.diff",
            "diff_additions": 285,
            "diff_deletions": 4,
            "diff_file_size": 141658,
            "diff_url": "https://github.com/cc65/cc65/commit/9c447afd39fa614762d158cf0854567165b5d1b1.diff",
            "exists": true,
            "files": [
                {
                    "file_additions": 3,
                    "file_deletions": 3,
                    "file_exists": true,
                    "file_name": "src/cc65/declare.c",
                    "file_size": 89028
                },
                {
                    "file_additions": 2,
                    "file_deletions": 1,
                    "file_exists": true,
                    "file_name": "src/cc65/symtab.c",
                    "file_size": 44209
                },
                {
                    "file_additions": 0,
                    "file_deletions": 0,
                    "file_exists": true,
                    "file_name": "test/val/bug1047.c",
                    "file_size": 2065
                },
                {
                    "file_additions": 280,
                    "file_deletions": 0,
                    "file_exists": true,
                    "file_name": "test/val/char-bitfield.c",
                    "file_size": 6356
                }
            ],
            "interesting": {
                "reopen": false,
                "status": false
            },
            "is_parent": false,
            "sha": "9c447afd39fa614762d158cf0854567165b5d1b1"
        },
        {
            "associated_pull_request": [],
            "date": "2020-08-30 18:47:25",
            "diff": "cc65_cc65/issue_1047/commit_900680080a230c944546b72786f00eb33bf960fd.diff",
            "diff_additions": 392,
            "diff_deletions": 4,
            "diff_file_size": 148530,
            "diff_url": "https://github.com/cc65/cc65/commit/900680080a230c944546b72786f00eb33bf960fd.diff",
            "exists": true,
            "files": [
                {
                    "file_additions": 3,
                    "file_deletions": 3,
                    "file_exists": true,
                    "file_name": "src/cc65/declare.c",
                    "file_size": 89028
                },
                {
                    "file_additions": 2,
                    "file_deletions": 1,
                    "file_exists": true,
                    "file_name": "src/cc65/symtab.c",
                    "file_size": 44209
                },
                {
                    "file_additions": 0,
                    "file_deletions": 0,
                    "file_exists": true,
                    "file_name": "test/val/bug1047.c",
                    "file_size": 2065
                },
                {
                    "file_additions": 280,
                    "file_deletions": 0,
                    "file_exists": true,
                    "file_name": "test/val/char-bitfield.c",
                    "file_size": 6356
                },
                {
                    "file_additions": 107,
                    "file_deletions": 0,
                    "file_exists": true,
                    "file_name": "test/val/enum-bitfield.c",
                    "file_size": 6872
                }
            ],
            "interesting": {
                "reopen": false,
                "status": false
            },
            "is_parent": false,
            "sha": "900680080a230c944546b72786f00eb33bf960fd"
        },
        {
            "associated_pull_request": [
                "https://github.com/cc65/cc65/pull/1238"
            ],
            "date": "2020-08-30 18:47:25",
            "diff": "cc65_cc65/issue_1047/commit_d56eb8d9869d15ca887b2d5ad745779576fdc5cc.diff",
            "diff_additions": 396,
            "diff_deletions": 5,
            "diff_file_size": 148530,
            "diff_url": "https://github.com/cc65/cc65/commit/d56eb8d9869d15ca887b2d5ad745779576fdc5cc.diff",
            "exists": true,
            "files": [
                {
                    "file_additions": 3,
                    "file_deletions": 3,
                    "file_exists": true,
                    "file_name": "src/cc65/declare.c",
                    "file_size": 89028
                },
                {
                    "file_additions": 6,
                    "file_deletions": 2,
                    "file_exists": true,
                    "file_name": "src/cc65/symtab.c",
                    "file_size": 44209
                },
                {
                    "file_additions": 0,
                    "file_deletions": 0,
                    "file_exists": true,
                    "file_name": "test/val/bug1047.c",
                    "file_size": 2065
                },
                {
                    "file_additions": 280,
                    "file_deletions": 0,
                    "file_exists": true,
                    "file_name": "test/val/char-bitfield.c",
                    "file_size": 6356
                },
                {
                    "file_additions": 107,
                    "file_deletions": 0,
                    "file_exists": true,
                    "file_name": "test/val/enum-bitfield.c",
                    "file_size": 6872
                }
            ],
            "interesting": {
                "reopen": false,
                "status": false
            },
            "is_parent": false,
            "sha": "d56eb8d9869d15ca887b2d5ad745779576fdc5cc"
        },
        {
            "associated_pull_request": [
                "https://github.com/cc65/cc65/pull/1238"
            ],
            "date": "2020-08-30 18:47:25",
            "diff": "cc65_cc65/issue_1047/commit_4e4e4c2d2194c2c1f73d8c4503b4c6c56e1aa9a7.diff",
            "diff_additions": 396,
            "diff_deletions": 5,
            "diff_file_size": 148530,
            "diff_url": "https://github.com/cc65/cc65/commit/4e4e4c2d2194c2c1f73d8c4503b4c6c56e1aa9a7.diff",
            "exists": true,
            "files": [
                {
                    "file_additions": 3,
                    "file_deletions": 3,
                    "file_exists": true,
                    "file_name": "src/cc65/declare.c",
                    "file_size": 89028
                },
                {
                    "file_additions": 6,
                    "file_deletions": 2,
                    "file_exists": true,
                    "file_name": "src/cc65/symtab.c",
                    "file_size": 44209
                },
                {
                    "file_additions": 0,
                    "file_deletions": 0,
                    "file_exists": true,
                    "file_name": "test/val/bug1047.c",
                    "file_size": 2065
                },
                {
                    "file_additions": 280,
                    "file_deletions": 0,
                    "file_exists": true,
                    "file_name": "test/val/char-bitfield.c",
                    "file_size": 6356
                },
                {
                    "file_additions": 107,
                    "file_deletions": 0,
                    "file_exists": true,
                    "file_name": "test/val/enum-bitfield.c",
                    "file_size": 6872
                }
            ],
            "interesting": {
                "reopen": false,
                "status": false
            },
            "is_parent": false,
            "sha": "4e4e4c2d2194c2c1f73d8c4503b4c6c56e1aa9a7"
        }
    ],
    "first_commit": "2020-07-27 15:59:24",
    "last_commit": "2020-09-08 12:24:04",
    "number": 1047,
    "pull_request": "None",
    "score": {
        "accidental_reopen_likely": false,
        "all_labels": [
            "enhancement"
        ],
        "contains_keywords": [
            "work",
            "bug",
            "test",
            "chang"
        ],
        "fix_size": 122,
        "has_labels": [],
        "intersecting": {
            "computed_score": 1.0,
            "final_commit_size": 119,
            "intersection_size": 119,
            "previous_commits_size": 122
        },
        "is_makefile_based": true,
        "no_new_files": [],
        "no_other_files": false,
        "num_prohibited_files": 51276,
        "prohibited_files": [
            "kill.h",
            "meminfo.h",
            "kill.h",
            "meminfo.h",
            "kill.h",
            "meminfo.h",
            "testsuite_cli_test.go",
            "testsuite_cli_test.go",
            "common.mk",
            "i3bar/include/draw_util.h"
        ],
        "reopen": false,
        "reopen_events": [
            [
                "2020-07-28 11:48:35",
                "commit"
            ],
            [
                "2020-07-28 20:03:03",
                "commit"
            ],
            [
                "2020-08-30 18:52:49",
                "commit"
            ],
            [
                "2020-09-04 17:41:54",
                "commit"
            ],
            [
                "2020-09-04 17:45:46",
                "commit"
            ],
            [
                "2020-09-05 18:06:34",
                "commit"
            ],
            [
                "2020-09-07 19:19:39",
                "commit"
            ],
            [
                "2020-09-08 06:48:07",
                "commit"
            ],
            [
                "2020-09-08 12:24:05",
                "closed"
            ],
            [
                "2020-09-08 12:24:07",
                "commit"
            ]
        ],
        "status": true,
        "strategy": true,
        "total_changes": 2432
    }
}