{
    "category": [
        "GUI",
        "control flow"
    ],
    "commits": [
        {
            "associated_pull_request": [
                "https://github.com/timescale/timescaledb/pull/2437"
            ],
            "date": "2020-09-23 06:05:09",
            "diff": "",
            "diff_additions": 0,
            "diff_deletions": 0,
            "diff_file_size": 0,
            "diff_url": "https://github.com/timescale/timescaledb/commit/c2fb4ab75378191ea431a99c373857a2e0857c78.diff",
            "exists": true,
            "files": [],
            "interesting": {
                "reopen": false,
                "status": false
            },
            "is_parent": true,
            "sha": "c2fb4ab75378191ea431a99c373857a2e0857c78"
        },
        {
            "associated_pull_request": [],
            "date": "2020-09-24 12:19:43",
            "diff": "timescale_timescaledb/issue_2198/commit_1728471c98e7b207a42ac53eb460e59f65c8bef1.diff",
            "diff_additions": 47,
            "diff_deletions": 14,
            "diff_file_size": 59414,
            "diff_url": "https://github.com/timescale/timescaledb/commit/1728471c98e7b207a42ac53eb460e59f65c8bef1.diff",
            "exists": true,
            "files": [
                {
                    "file_additions": 12,
                    "file_deletions": 4,
                    "file_exists": true,
                    "file_name": "tsl/src/continuous_aggs/invalidation.c",
                    "file_size": 33559
                },
                {
                    "file_additions": 35,
                    "file_deletions": 10,
                    "file_exists": true,
                    "file_name": "tsl/src/continuous_aggs/refresh.c",
                    "file_size": 25855
                }
            ],
            "interesting": {
                "reopen": false,
                "status": true
            },
            "is_parent": false,
            "sha": "1728471c98e7b207a42ac53eb460e59f65c8bef1"
        },
        {
            "associated_pull_request": [],
            "date": "2020-09-24 12:19:43",
            "diff": "timescale_timescaledb/issue_2198/commit_38d88a2e5d7e93b793d91da0d10ca39f4d310daa.diff",
            "diff_additions": 93,
            "diff_deletions": 44,
            "diff_file_size": 59414,
            "diff_url": "https://github.com/timescale/timescaledb/commit/38d88a2e5d7e93b793d91da0d10ca39f4d310daa.diff",
            "exists": true,
            "files": [
                {
                    "file_additions": 12,
                    "file_deletions": 4,
                    "file_exists": true,
                    "file_name": "tsl/src/continuous_aggs/invalidation.c",
                    "file_size": 33559
                },
                {
                    "file_additions": 81,
                    "file_deletions": 40,
                    "file_exists": true,
                    "file_name": "tsl/src/continuous_aggs/refresh.c",
                    "file_size": 25855
                }
            ],
            "interesting": {
                "reopen": false,
                "status": true
            },
            "is_parent": false,
            "sha": "38d88a2e5d7e93b793d91da0d10ca39f4d310daa"
        },
        {
            "associated_pull_request": [],
            "date": "2020-09-24 12:19:43",
            "diff": "timescale_timescaledb/issue_2198/commit_48d34a9d2f98e2c49d0a2a9ff40b9da07f5ea046.diff",
            "diff_additions": 93,
            "diff_deletions": 44,
            "diff_file_size": 59414,
            "diff_url": "https://github.com/timescale/timescaledb/commit/48d34a9d2f98e2c49d0a2a9ff40b9da07f5ea046.diff",
            "exists": true,
            "files": [
                {
                    "file_additions": 12,
                    "file_deletions": 4,
                    "file_exists": true,
                    "file_name": "tsl/src/continuous_aggs/invalidation.c",
                    "file_size": 33559
                },
                {
                    "file_additions": 81,
                    "file_deletions": 40,
                    "file_exists": true,
                    "file_name": "tsl/src/continuous_aggs/refresh.c",
                    "file_size": 25855
                }
            ],
            "interesting": {
                "reopen": false,
                "status": false
            },
            "is_parent": false,
            "sha": "48d34a9d2f98e2c49d0a2a9ff40b9da07f5ea046"
        },
        {
            "associated_pull_request": [],
            "date": "2020-09-24 12:19:43",
            "diff": "timescale_timescaledb/issue_2198/commit_cdf20ca50d5a7acbf1c0c9eb8a19bd78d062310e.diff",
            "diff_additions": 96,
            "diff_deletions": 45,
            "diff_file_size": 59414,
            "diff_url": "https://github.com/timescale/timescaledb/commit/cdf20ca50d5a7acbf1c0c9eb8a19bd78d062310e.diff",
            "exists": true,
            "files": [
                {
                    "file_additions": 12,
                    "file_deletions": 4,
                    "file_exists": true,
                    "file_name": "tsl/src/continuous_aggs/invalidation.c",
                    "file_size": 33559
                },
                {
                    "file_additions": 84,
                    "file_deletions": 41,
                    "file_exists": true,
                    "file_name": "tsl/src/continuous_aggs/refresh.c",
                    "file_size": 25855
                }
            ],
            "interesting": {
                "reopen": false,
                "status": false
            },
            "is_parent": false,
            "sha": "cdf20ca50d5a7acbf1c0c9eb8a19bd78d062310e"
        },
        {
            "associated_pull_request": [],
            "date": "2020-09-24 12:19:43",
            "diff": "timescale_timescaledb/issue_2198/commit_9b97a9bd05943fb66fa4df099fd268d03fc9e20f.diff",
            "diff_additions": 96,
            "diff_deletions": 45,
            "diff_file_size": 59414,
            "diff_url": "https://github.com/timescale/timescaledb/commit/9b97a9bd05943fb66fa4df099fd268d03fc9e20f.diff",
            "exists": true,
            "files": [
                {
                    "file_additions": 12,
                    "file_deletions": 4,
                    "file_exists": true,
                    "file_name": "tsl/src/continuous_aggs/invalidation.c",
                    "file_size": 33559
                },
                {
                    "file_additions": 84,
                    "file_deletions": 41,
                    "file_exists": true,
                    "file_name": "tsl/src/continuous_aggs/refresh.c",
                    "file_size": 25855
                }
            ],
            "interesting": {
                "reopen": false,
                "status": false
            },
            "is_parent": false,
            "sha": "9b97a9bd05943fb66fa4df099fd268d03fc9e20f"
        },
        {
            "associated_pull_request": [
                "https://github.com/timescale/timescaledb/pull/2460"
            ],
            "date": "2020-09-24 12:19:43",
            "diff": "timescale_timescaledb/issue_2198/commit_64b1048c04cc5f911aa1e0f58ce47702ea589cc2.diff",
            "diff_additions": 129,
            "diff_deletions": 39,
            "diff_file_size": 59414,
            "diff_url": "https://github.com/timescale/timescaledb/commit/64b1048c04cc5f911aa1e0f58ce47702ea589cc2.diff",
            "exists": true,
            "files": [
                {
                    "file_additions": 12,
                    "file_deletions": 4,
                    "file_exists": true,
                    "file_name": "tsl/src/continuous_aggs/invalidation.c",
                    "file_size": 33559
                },
                {
                    "file_additions": 117,
                    "file_deletions": 35,
                    "file_exists": true,
                    "file_name": "tsl/src/continuous_aggs/refresh.c",
                    "file_size": 25855
                }
            ],
            "interesting": {
                "reopen": false,
                "status": false
            },
            "is_parent": false,
            "sha": "64b1048c04cc5f911aa1e0f58ce47702ea589cc2"
        },
        {
            "associated_pull_request": [
                "https://github.com/timescale/timescaledb/pull/2460"
            ],
            "date": "2020-09-24 12:19:43",
            "diff": "timescale_timescaledb/issue_2198/commit_66c63476e5905a5f78d6aca263ccebae1e911105.diff",
            "diff_additions": 129,
            "diff_deletions": 39,
            "diff_file_size": 59414,
            "diff_url": "https://github.com/timescale/timescaledb/commit/66c63476e5905a5f78d6aca263ccebae1e911105.diff",
            "exists": true,
            "files": [
                {
                    "file_additions": 12,
                    "file_deletions": 4,
                    "file_exists": true,
                    "file_name": "tsl/src/continuous_aggs/invalidation.c",
                    "file_size": 33559
                },
                {
                    "file_additions": 117,
                    "file_deletions": 35,
                    "file_exists": true,
                    "file_name": "tsl/src/continuous_aggs/refresh.c",
                    "file_size": 25855
                }
            ],
            "interesting": {
                "reopen": false,
                "status": false
            },
            "is_parent": false,
            "sha": "66c63476e5905a5f78d6aca263ccebae1e911105"
        }
    ],
    "first_commit": "2020-09-24 14:01:48",
    "last_commit": "2020-09-29 20:03:07",
    "number": 2198,
    "pull_request": "None",
    "score": {
        "accidental_reopen_likely": false,
        "all_labels": [
            "bug",
            "continuous_aggregate",
            "testing"
        ],
        "contains_keywords": [
            "chang",
            "error",
            "bug",
            "problem",
            "fix",
            "issu",
            "work"
        ],
        "fix_size": 170,
        "has_labels": [
            "bug"
        ],
        "intersecting": {
            "computed_score": 1.0,
            "final_commit_size": 145,
            "intersection_size": 145,
            "previous_commits_size": 170
        },
        "is_makefile_based": true,
        "no_new_files": [],
        "no_other_files": false,
        "num_prohibited_files": 131510,
        "prohibited_files": [
            "hal/inc/pinmap_hal.h",
            "Debug/marvin.bin",
            "Debug/marvin.elf",
            "Debug/marvin.hex",
            "Debug/marvin.bin",
            "Debug/marvin.elf",
            "Debug/marvin.hex",
            "inc/spark_utilities.h",
            "Debug/marvin.bin",
            "Debug/marvin.elf"
        ],
        "reopen": false,
        "reopen_events": [
            [
                "2020-09-28 14:53:09",
                "commit"
            ],
            [
                "2020-09-28 15:00:47",
                "commit"
            ],
            [
                "2020-09-28 15:32:10",
                "commit"
            ],
            [
                "2020-09-28 17:32:32",
                "commit"
            ],
            [
                "2020-09-28 17:33:54",
                "commit"
            ],
            [
                "2020-09-29 08:12:08",
                "commit"
            ],
            [
                "2020-09-29 10:34:38",
                "commit"
            ],
            [
                "2020-09-29 17:49:20",
                "commit"
            ],
            [
                "2020-09-29 20:03:09",
                "closed"
            ],
            [
                "2020-09-29 20:03:10",
                "commit"
            ]
        ],
        "status": true,
        "strategy": true,
        "total_changes": 953
    }
}