{
    "commits": [
        {
            "associated_pull_request": [],
            "date": "2019-01-18 15:37:36+00:00",
            "diff": "dresden-elektronik_deconz-rest-plugin/issue_1053/commit_76827ebf220672eea0148dad302fa976b20fc7f7.diff",
            "diff_additions": 2,
            "diff_deletions": 1,
            "diff_file_size": 683199,
            "diff_url": "https://github.com/dresden-elektronik/deconz-rest-plugin/commit/76827ebf220672eea0148dad302fa976b20fc7f7.diff",
            "exists": true,
            "files": [
                {
                    "file_additions": 2,
                    "file_deletions": 1,
                    "file_exists": true,
                    "file_name": "de_web_plugin.cpp",
                    "file_size": 683199
                }
            ],
            "interesting": {
                "reopen": false,
                "status": false
            },
            "is_parent": true,
            "sha": "76827ebf220672eea0148dad302fa976b20fc7f7"
        },
        {
            "associated_pull_request": [],
            "date": "2019-01-18 16:03:15+00:00",
            "diff": "dresden-elektronik_deconz-rest-plugin/issue_1053/commit_d25baa104b0512e98baa617699ebcd83a80f5733.diff",
            "diff_additions": 8,
            "diff_deletions": 7,
            "diff_file_size": 849916,
            "diff_url": "https://github.com/dresden-elektronik/deconz-rest-plugin/commit/d25baa104b0512e98baa617699ebcd83a80f5733.diff",
            "exists": true,
            "files": [
                {
                    "file_additions": 1,
                    "file_deletions": 0,
                    "file_exists": true,
                    "file_name": "bindings.cpp",
                    "file_size": 166717
                },
                {
                    "file_additions": 7,
                    "file_deletions": 7,
                    "file_exists": true,
                    "file_name": "de_web_plugin.cpp",
                    "file_size": 683199
                }
            ],
            "interesting": {
                "reopen": true,
                "status": false
            },
            "is_parent": false,
            "sha": "d25baa104b0512e98baa617699ebcd83a80f5733"
        },
        {
            "associated_pull_request": [],
            "date": "2019-02-01 16:10:21+00:00",
            "diff": "dresden-elektronik_deconz-rest-plugin/issue_1053/commit_7ba2af26785eba2179003fedaed3488921072336.diff",
            "diff_additions": 5,
            "diff_deletions": 2,
            "diff_file_size": 909043,
            "diff_url": "https://github.com/dresden-elektronik/deconz-rest-plugin/commit/7ba2af26785eba2179003fedaed3488921072336.diff",
            "exists": true,
            "files": [
                {
                    "file_additions": 4,
                    "file_deletions": 1,
                    "file_exists": true,
                    "file_name": "database.cpp",
                    "file_size": 225844
                },
                {
                    "file_additions": 1,
                    "file_deletions": 1,
                    "file_exists": true,
                    "file_name": "de_web_plugin.cpp",
                    "file_size": 683199
                }
            ],
            "interesting": {
                "reopen": false,
                "status": false
            },
            "is_parent": false,
            "sha": "7ba2af26785eba2179003fedaed3488921072336"
        },
        {
            "associated_pull_request": [],
            "date": "2019-02-10 09:34:32+00:00",
            "diff": "dresden-elektronik_deconz-rest-plugin/issue_1053/commit_e679c9e56e381c48a10c1fd9f0a3da7f427d7036.diff",
            "diff_additions": 122,
            "diff_deletions": 25,
            "diff_file_size": 878416,
            "diff_url": "https://github.com/dresden-elektronik/deconz-rest-plugin/commit/e679c9e56e381c48a10c1fd9f0a3da7f427d7036.diff",
            "exists": true,
            "files": [
                {
                    "file_additions": 68,
                    "file_deletions": 1,
                    "file_exists": true,
                    "file_name": "bindings.cpp",
                    "file_size": 166717
                },
                {
                    "file_additions": 10,
                    "file_deletions": 5,
                    "file_exists": true,
                    "file_name": "de_web_plugin.cpp",
                    "file_size": 683199
                },
                {
                    "file_additions": 44,
                    "file_deletions": 19,
                    "file_exists": true,
                    "file_name": "ias_zone.cpp",
                    "file_size": 28500
                }
            ],
            "interesting": {
                "reopen": false,
                "status": false
            },
            "is_parent": false,
            "sha": "e679c9e56e381c48a10c1fd9f0a3da7f427d7036"
        }
    ],
    "first_commit": "2019-01-18 15:37:36+00:00",
    "last_commit": "2019-02-10 09:34:32+00:00",
    "number": 1053,
    "pull_request": "None",
    "score": {
        "accidental_reopen_likely": false,
        "all_labels": [
            "Device Request",
            "stale"
        ],
        "contains_keywords": [
            "work",
            "fix",
            "issu",
            "test",
            "problem",
            "report"
        ],
        "fix_size": 153,
        "has_labels": [],
        "intersecting": {
            "computed_score": 0.014814814814814815,
            "final_commit_size": 135,
            "intersection_size": 2,
            "previous_commits_size": 20
        },
        "is_makefile_based": true,
        "no_new_files": [
            "ias_zone.cpp"
        ],
        "no_other_files": false,
        "num_prohibited_files": 175117,
        "prohibited_files": [
            "server/src/main/java/com/genymobile/scrcpy/Device.java",
            "server/src/main/java/com/genymobile/scrcpy/wrappers/SurfaceControl.java",
            "server/src/main/java/com/genymobile/scrcpy/Device.java",
            "server/src/main/java/com/genymobile/scrcpy/wrappers/SurfaceControl.java",
            "app/meson.build",
            "app/scrcpy.1",
            "app/src/common.h",
            "app/src/scrcpy.h",
            "app/src/server.h",
            "server/src/main/java/com/genymobile/scrcpy/Workarounds.java"
        ],
        "reopen": true,
        "reopen_events": [
            [
                "2019-01-18 16:03:28+00:00",
                "commit"
            ],
            [
                "2019-01-18 16:15:29+00:00",
                "closed"
            ],
            [
                "2019-01-18 16:15:35+00:00",
                "reopened"
            ],
            [
                "2019-02-01 16:10:33+00:00",
                "commit"
            ],
            [
                "2019-02-10 09:35:46+00:00",
                "commit"
            ],
            [
                "2019-06-22 19:05:05+00:00",
                "closed"
            ]
        ],
        "status": false,
        "strategy": true,
        "total_changes": 172
    }
}