{
    "all_issues": 1124,
    "interesting_issues": 1,
    "last_update": "2021-05-18 06:20:57.918128",
    "license": {
        "download": "https://raw.githubusercontent.com/rizinorg/rizin/dev/COPYING",
        "name": "GNU Lesser General Public License v3.0"
    },
    "ratio": 0.0008896797153024911,
    "size": 121796,
    "stars": 822,
    "url": "https://github.com/rizinorg/rizin"
}