{
    "covered_issues": [
        252,
        244,
        241,
        234,
        233,
        226,
        223,
        222,
        219,
        217,
        211,
        203,
        200,
        196,
        195,
        193,
        191,
        189,
        187,
        185,
        184,
        183,
        182,
        181,
        179,
        178,
        176,
        175,
        174,
        173,
        172,
        171,
        170,
        168,
        166,
        165,
        164,
        163,
        162,
        159,
        157,
        156,
        155,
        154,
        153,
        152,
        150,
        149,
        148,
        147,
        146,
        145,
        144,
        143,
        142,
        141,
        140,
        139,
        137,
        136,
        135,
        134,
        133,
        132,
        131,
        130,
        129,
        128,
        127,
        126,
        125,
        124,
        122,
        121,
        120,
        119,
        118,
        117,
        116,
        115,
        114,
        113,
        111,
        110,
        109,
        108,
        106,
        105,
        104,
        103,
        102,
        101,
        100,
        99,
        98,
        97,
        96,
        95,
        94,
        93,
        92,
        91,
        90,
        89,
        88,
        87,
        86,
        85,
        84,
        83,
        82,
        81,
        80,
        79,
        78,
        77,
        75,
        74,
        73,
        72,
        71,
        70,
        69,
        68,
        67,
        66,
        65,
        63,
        62,
        61,
        60,
        58,
        57,
        56,
        55,
        54,
        53,
        52,
        51,
        50,
        49,
        48,
        47,
        46,
        45,
        44,
        43,
        42,
        41,
        40,
        39,
        38,
        36,
        35,
        34,
        33,
        32,
        31,
        30,
        29,
        28,
        26,
        25,
        24,
        23,
        21,
        20,
        18,
        17,
        15,
        13,
        11,
        8,
        7,
        6,
        5,
        4,
        3,
        2
    ],
    "finished": true
}