{
    "commits": [
        {
            "associated_pull_request": [
                "https://github.com/DaveGamble/cJSON/pull/50"
            ],
            "date": "2016-11-04 01:23:08+00:00",
            "diff": "",
            "diff_additions": 0,
            "diff_deletions": 0,
            "diff_file_size": 0,
            "diff_url": "https://github.com/DaveGamble/cJSON/commit/050829f2746320edd6917f77e966dbfe7fcb129b.diff",
            "exists": true,
            "files": [],
            "interesting": {
                "reopen": false,
                "status": false
            },
            "is_parent": true,
            "sha": "050829f2746320edd6917f77e966dbfe7fcb129b"
        },
        {
            "associated_pull_request": [],
            "date": "2016-11-05 14:26:18+00:00",
            "diff": "davegamble_cjson/issue_26/commit_3ea491c0a603f50ca0fb2505badd332fbd141f75.diff",
            "diff_additions": 1,
            "diff_deletions": 1,
            "diff_file_size": 77959,
            "diff_url": "https://github.com/DaveGamble/cJSON/commit/3ea491c0a603f50ca0fb2505badd332fbd141f75.diff",
            "exists": true,
            "files": [
                {
                    "file_additions": 1,
                    "file_deletions": 1,
                    "file_exists": true,
                    "file_name": "cJSON.c",
                    "file_size": 77959
                }
            ],
            "interesting": {
                "reopen": true,
                "status": false
            },
            "is_parent": false,
            "sha": "3ea491c0a603f50ca0fb2505badd332fbd141f75"
        },
        {
            "associated_pull_request": [],
            "date": "2016-11-07 17:53:16+00:00",
            "diff": "davegamble_cjson/issue_26/commit_a148520ffb0a287ef61e6ba3ff8161be5c844bf5.diff",
            "diff_additions": 1,
            "diff_deletions": 1,
            "diff_file_size": 77959,
            "diff_url": "https://github.com/DaveGamble/cJSON/commit/a148520ffb0a287ef61e6ba3ff8161be5c844bf5.diff",
            "exists": true,
            "files": [
                {
                    "file_additions": 1,
                    "file_deletions": 1,
                    "file_exists": true,
                    "file_name": "cJSON.c",
                    "file_size": 77959
                }
            ],
            "interesting": {
                "reopen": false,
                "status": false
            },
            "is_parent": false,
            "sha": "a148520ffb0a287ef61e6ba3ff8161be5c844bf5"
        }
    ],
    "first_commit": "2016-11-04 01:23:08+00:00",
    "last_commit": "2016-11-07 17:53:16+00:00",
    "number": 26,
    "pull_request": "None",
    "score": {
        "accidental_reopen_likely": false,
        "all_labels": [
            "wontfix"
        ],
        "contains_keywords": [
            "work",
            "chang",
            "fix",
            "issu",
            "perform",
            "test",
            "fault",
            "warn",
            "bug"
        ],
        "fix_size": 3,
        "has_labels": [],
        "intersecting": {
            "computed_score": 0.5,
            "final_commit_size": 2,
            "intersection_size": 1,
            "previous_commits_size": 2
        },
        "is_makefile_based": true,
        "no_new_files": [],
        "no_other_files": true,
        "num_prohibited_files": 19478,
        "prohibited_files": [
            "server/src/main/java/com/genymobile/scrcpy/Device.java",
            "server/src/main/java/com/genymobile/scrcpy/wrappers/SurfaceControl.java",
            "server/src/main/java/com/genymobile/scrcpy/Device.java",
            "server/src/main/java/com/genymobile/scrcpy/wrappers/SurfaceControl.java",
            "app/meson.build",
            "app/scrcpy.1",
            "app/src/common.h",
            "app/src/scrcpy.h",
            "app/src/server.h",
            "server/src/main/java/com/genymobile/scrcpy/Workarounds.java"
        ],
        "reopen": true,
        "reopen_events": [
            [
                "2016-11-05 14:28:31+00:00",
                "closed"
            ],
            [
                "2016-11-05 14:28:31+00:00",
                "commit"
            ],
            [
                "2016-11-07 12:07:33+00:00",
                "reopened"
            ],
            [
                "2016-11-07 17:53:38+00:00",
                "closed"
            ],
            [
                "2016-11-07 17:53:38+00:00",
                "commit"
            ]
        ],
        "status": false,
        "strategy": true,
        "total_changes": 4
    }
}