{
    "covered_issues": [
        1096,
        1079,
        1072,
        1070,
        1064,
        1058,
        1045,
        1037,
        1024,
        1017,
        999,
        998,
        984,
        977,
        976,
        968,
        961,
        959,
        958,
        943,
        937,
        933,
        929,
        915,
        911,
        910,
        906,
        856,
        853,
        852,
        850,
        843,
        840,
        839,
        838,
        837,
        831,
        818,
        813,
        808,
        703,
        698,
        694,
        693,
        690,
        644,
        629,
        628,
        615,
        610,
        605,
        584,
        568,
        567,
        555,
        547,
        544,
        538,
        537,
        529,
        521,
        518,
        517,
        516,
        515,
        514,
        512,
        508,
        507,
        506,
        500,
        497,
        496,
        495,
        493,
        464,
        455,
        454,
        452,
        435,
        362,
        360,
        352,
        324,
        322,
        319,
        300,
        294,
        288,
        284,
        276,
        272,
        231,
        204,
        203,
        189,
        186,
        166,
        165,
        152,
        137,
        110,
        104,
        90,
        88,
        70,
        66,
        63,
        51,
        50,
        49,
        47,
        46,
        39,
        38,
        37,
        35,
        34,
        33,
        32,
        31,
        30,
        29,
        28,
        27,
        26,
        25,
        24,
        23,
        22,
        21,
        20,
        19,
        18,
        17,
        16,
        15,
        14,
        13,
        12,
        11,
        10,
        9,
        8,
        7,
        6,
        5,
        4,
        3,
        2,
        1
    ],
    "finished": true
}