{
    "commits": [
        {
            "associated_pull_request": [],
            "date": "2018-06-18 10:24:32+00:00",
            "diff": "chenall_grub4dos/issue_179/commit_f4c9146ebb77884f788558a0537b57292994bea4.diff",
            "diff_additions": 1,
            "diff_deletions": 1,
            "diff_file_size": 69561,
            "diff_url": "https://github.com/chenall/grub4dos/commit/f4c9146ebb77884f788558a0537b57292994bea4.diff",
            "exists": true,
            "files": [
                {
                    "file_additions": 1,
                    "file_deletions": 1,
                    "file_exists": true,
                    "file_name": "stage2/graphics.c",
                    "file_size": 69561
                }
            ],
            "interesting": {
                "reopen": false,
                "status": false
            },
            "is_parent": true,
            "sha": "f4c9146ebb77884f788558a0537b57292994bea4"
        },
        {
            "associated_pull_request": [],
            "date": "2018-06-29 02:32:43+00:00",
            "diff": "chenall_grub4dos/issue_179/commit_3b3bf0dcf1ee0a78606723af823ea9282022bc42.diff",
            "diff_additions": 28,
            "diff_deletions": 14,
            "diff_file_size": 658788,
            "diff_url": "https://github.com/chenall/grub4dos/commit/3b3bf0dcf1ee0a78606723af823ea9282022bc42.diff",
            "exists": true,
            "files": [
                {
                    "file_additions": 6,
                    "file_deletions": 1,
                    "file_exists": true,
                    "file_name": "stage2/builtins.c",
                    "file_size": 506182
                },
                {
                    "file_additions": 1,
                    "file_deletions": 1,
                    "file_exists": true,
                    "file_name": "stage2/graphics.c",
                    "file_size": 69561
                },
                {
                    "file_additions": 21,
                    "file_deletions": 12,
                    "file_exists": true,
                    "file_name": "stage2/stage2.c",
                    "file_size": 83045
                }
            ],
            "interesting": {
                "reopen": true,
                "status": false
            },
            "is_parent": false,
            "sha": "3b3bf0dcf1ee0a78606723af823ea9282022bc42"
        },
        {
            "associated_pull_request": [],
            "date": "2018-07-01 14:01:17+00:00",
            "diff": "chenall_grub4dos/issue_179/commit_b519902005d1b2cdb5ea2a1ac00cf2e96d0f36a9.diff",
            "diff_additions": 32,
            "diff_deletions": 10,
            "diff_file_size": 589227,
            "diff_url": "https://github.com/chenall/grub4dos/commit/b519902005d1b2cdb5ea2a1ac00cf2e96d0f36a9.diff",
            "exists": true,
            "files": [
                {
                    "file_additions": 15,
                    "file_deletions": 1,
                    "file_exists": true,
                    "file_name": "stage2/builtins.c",
                    "file_size": 506182
                },
                {
                    "file_additions": 17,
                    "file_deletions": 9,
                    "file_exists": true,
                    "file_name": "stage2/stage2.c",
                    "file_size": 83045
                }
            ],
            "interesting": {
                "reopen": false,
                "status": false
            },
            "is_parent": false,
            "sha": "b519902005d1b2cdb5ea2a1ac00cf2e96d0f36a9"
        }
    ],
    "first_commit": "2018-06-18 10:24:32+00:00",
    "last_commit": "2018-07-01 14:01:17+00:00",
    "number": 179,
    "pull_request": "None",
    "score": {
        "accidental_reopen_likely": false,
        "all_labels": [],
        "contains_keywords": [
            "work",
            "chang",
            "issu",
            "fault",
            "remov",
            "bug",
            "problem",
            "workaround"
        ],
        "fix_size": 68,
        "has_labels": [],
        "intersecting": {
            "computed_score": 0.325,
            "final_commit_size": 40,
            "intersection_size": 13,
            "previous_commits_size": 41
        },
        "is_makefile_based": true,
        "no_new_files": [],
        "no_other_files": true,
        "num_prohibited_files": 193458,
        "prohibited_files": [
            "server/src/main/java/com/genymobile/scrcpy/Device.java",
            "server/src/main/java/com/genymobile/scrcpy/wrappers/SurfaceControl.java",
            "server/src/main/java/com/genymobile/scrcpy/Device.java",
            "server/src/main/java/com/genymobile/scrcpy/wrappers/SurfaceControl.java",
            "app/meson.build",
            "app/scrcpy.1",
            "app/src/common.h",
            "app/src/scrcpy.h",
            "app/src/server.h",
            "server/src/main/java/com/genymobile/scrcpy/Workarounds.java"
        ],
        "reopen": true,
        "reopen_events": [
            [
                "2018-06-29 02:33:05+00:00",
                "commit"
            ],
            [
                "2018-06-29 09:01:45+00:00",
                "closed"
            ],
            [
                "2018-06-29 11:22:54+00:00",
                "reopened"
            ],
            [
                "2018-07-01 14:01:43+00:00",
                "commit"
            ],
            [
                "2018-07-03 10:55:40+00:00",
                "closed"
            ]
        ],
        "status": false,
        "strategy": true,
        "total_changes": 86
    }
}