{
    "covered_issues": [
        294,
        292,
        291,
        288,
        283,
        279,
        278,
        271,
        257,
        254,
        250,
        249,
        238,
        201,
        198,
        197,
        186,
        184,
        183,
        156,
        155,
        148,
        121,
        76,
        73,
        71,
        69,
        66,
        39,
        38,
        19,
        12
    ],
    "finished": true
}