{
    "covered_issues": [
        1219,
        1206,
        1198,
        1189,
        1180,
        1173,
        1172,
        1166,
        1163,
        1161,
        1160,
        1153,
        1149,
        1147,
        1146,
        1143,
        1142,
        1137,
        1135,
        1133,
        1130,
        1126,
        1118,
        1112,
        1111,
        1109,
        1106,
        1103,
        1102,
        1101,
        1100,
        1096,
        1093,
        1090,
        1087,
        1085,
        1084,
        1080,
        1079,
        1077,
        1071,
        1068,
        1066,
        1063,
        1059,
        1058,
        1056,
        1052,
        1051,
        1050,
        1048,
        1045,
        1043,
        1041,
        1037,
        1036,
        1032,
        1029,
        1028,
        1026,
        1025,
        1024,
        1023,
        1021,
        1019,
        1016,
        1015,
        1014,
        1013,
        1010,
        1009,
        1007,
        1006,
        1005,
        1002,
        1001,
        1000,
        999,
        995,
        993,
        992,
        990,
        986,
        982,
        980,
        979,
        978,
        977,
        976,
        975,
        974,
        969,
        967,
        966,
        964,
        962,
        958,
        957,
        956,
        955,
        954,
        953,
        951,
        950,
        949,
        948,
        946,
        945,
        944,
        942,
        941,
        940,
        939,
        938,
        934,
        932,
        929,
        927,
        925,
        924,
        923,
        922,
        921,
        920,
        916,
        915,
        912,
        911,
        909,
        907,
        906,
        905,
        902,
        901,
        900,
        898,
        897,
        896,
        893,
        888,
        887,
        882,
        880,
        878,
        876,
        874,
        873,
        872,
        868,
        863,
        861,
        859,
        853,
        852,
        851,
        850,
        843,
        842,
        841,
        839,
        838,
        836,
        835,
        833,
        831,
        829,
        828,
        827,
        824,
        822,
        820,
        818,
        817,
        816,
        815,
        812,
        808,
        807,
        806,
        805,
        804,
        801,
        795,
        794,
        792,
        790,
        789,
        788,
        787,
        786,
        785,
        784,
        783,
        778,
        777,
        772,
        768,
        767,
        765,
        764,
        763,
        762,
        761,
        760,
        759,
        757,
        755,
        754,
        752,
        749,
        748,
        747,
        746,
        745,
        744,
        743,
        740,
        739,
        737,
        734,
        731,
        730,
        728,
        727,
        726,
        725,
        724,
        722,
        721,
        720,
        718,
        714,
        710,
        709,
        707,
        706,
        704,
        703,
        698,
        696,
        693,
        691,
        690,
        688,
        687,
        686,
        683,
        682,
        681,
        679,
        678,
        677,
        676,
        675,
        672,
        671,
        670,
        668,
        667,
        665,
        664,
        663,
        662,
        661,
        660,
        658,
        657,
        654,
        653,
        649,
        648,
        646,
        645,
        644,
        643,
        642,
        641,
        640,
        639,
        638,
        636,
        635,
        634,
        633,
        632,
        631,
        630,
        629,
        628,
        627,
        626,
        625,
        623,
        619,
        618,
        616,
        615,
        614,
        613,
        612,
        609,
        604,
        602,
        599,
        596,
        594,
        591,
        589,
        583,
        580,
        579,
        578,
        577,
        575,
        574,
        573,
        572,
        571,
        570,
        565,
        563,
        559,
        557,
        553,
        546,
        543,
        540,
        539,
        538,
        536,
        533,
        529,
        526,
        524,
        522,
        520,
        518,
        516,
        513,
        512,
        511,
        510,
        508,
        506,
        505,
        500,
        497,
        495,
        494,
        493,
        492,
        490,
        486,
        484,
        483,
        480,
        479,
        478,
        476,
        470,
        469,
        467,
        464,
        458,
        457,
        456,
        451,
        446,
        445,
        443,
        438,
        437,
        436,
        435,
        433,
        432,
        431,
        430,
        429,
        427,
        422,
        419,
        415,
        414,
        413,
        412,
        408,
        405,
        404,
        399,
        398,
        397,
        395,
        394,
        392,
        384,
        383,
        382,
        377,
        375,
        373,
        370,
        368,
        363,
        362,
        360,
        359,
        358,
        356,
        355,
        350,
        347,
        341,
        340,
        339,
        338,
        337,
        336,
        334,
        331,
        329,
        328,
        327,
        326,
        325,
        323,
        322,
        321,
        320,
        319,
        318,
        314,
        313,
        311,
        310,
        307,
        306,
        305,
        304,
        302,
        300,
        294,
        293,
        291,
        289,
        288,
        284,
        283,
        281,
        280,
        279,
        277,
        276,
        275,
        273,
        272,
        271,
        268,
        267,
        264,
        263,
        262,
        261,
        259,
        258,
        257,
        256,
        255,
        254,
        253,
        252,
        251,
        250,
        249,
        248,
        247,
        246,
        245,
        244,
        241,
        240,
        239,
        238,
        236,
        233,
        229,
        228,
        227,
        225,
        224,
        221,
        220,
        219,
        216,
        215,
        213,
        212,
        211,
        208,
        207,
        205,
        202,
        199,
        198,
        197,
        196,
        195,
        194,
        193,
        192,
        191,
        188,
        187,
        184,
        182,
        181,
        180,
        177,
        176,
        173,
        172,
        171,
        169,
        166,
        165,
        164,
        163,
        162,
        161,
        160,
        159,
        158,
        157,
        155,
        154,
        153,
        152,
        151,
        150,
        149,
        143,
        142,
        141,
        139,
        138,
        137,
        135,
        134,
        132,
        131,
        130,
        129,
        128,
        124,
        123,
        122,
        121,
        118,
        116,
        115,
        114,
        113,
        112,
        111,
        110,
        108,
        106,
        105,
        104,
        103,
        102,
        99,
        98,
        95,
        93,
        92,
        91,
        90,
        88,
        87,
        86,
        85,
        84,
        83,
        82,
        81,
        80,
        79,
        78,
        77,
        74,
        72,
        70,
        69,
        68,
        67,
        66,
        65,
        64,
        63,
        60,
        57,
        56,
        55,
        54,
        53,
        52,
        51,
        50,
        49,
        48,
        47,
        46,
        44,
        42,
        41,
        40,
        38,
        37,
        36,
        35,
        34,
        33,
        32,
        31,
        30,
        29,
        28,
        27,
        26,
        23,
        22,
        19,
        17,
        16,
        15,
        14,
        13,
        12,
        11,
        10,
        9,
        8,
        7,
        6,
        5,
        4,
        3,
        2
    ],
    "finished": true
}