{
    "covered_issues": [
        70,
        67,
        65,
        64,
        56,
        54,
        53,
        51,
        50,
        44,
        43,
        42,
        41,
        40,
        35,
        34,
        33,
        32,
        31,
        30,
        29,
        28,
        22,
        21,
        18,
        17,
        16,
        15,
        14,
        13,
        12,
        11,
        10,
        9,
        8,
        7,
        6
    ],
    "finished": true
}