{
    "covered_issues": [
        73,
        69,
        66,
        61,
        60,
        59,
        58,
        56,
        54,
        53,
        50,
        49,
        48,
        47,
        45,
        42,
        40,
        38,
        34,
        33,
        31,
        30,
        29,
        28,
        27,
        24,
        23,
        18,
        14,
        12,
        9,
        6,
        5,
        4,
        3,
        2,
        1
    ],
    "finished": true
}