{
    "category": [
        "hardware/OS",
        "build/refactor/preprocessing"
    ],
    "commits": [
        {
            "associated_pull_request": [],
            "date": "2015-03-09 12:27:59",
            "diff": "openwall_john/issue_1076/commit_63a84004a4887a0c66923b5c24ea241c2eb6511e.diff",
            "diff_additions": 7,
            "diff_deletions": 10,
            "diff_file_size": 0,
            "diff_url": "https://github.com/openwall/john/commit/63a84004a4887a0c66923b5c24ea241c2eb6511e.diff",
            "exists": true,
            "files": [
                {
                    "file_additions": 7,
                    "file_deletions": 10,
                    "file_exists": false,
                    "file_name": "src/cuda_cryptsha256_fmt_plug.c",
                    "file_size": 0
                }
            ],
            "interesting": {
                "reopen": false,
                "status": false
            },
            "is_parent": true,
            "sha": "63a84004a4887a0c66923b5c24ea241c2eb6511e"
        },
        {
            "associated_pull_request": [],
            "date": "2015-03-09 23:27:17",
            "diff": "openwall_john/issue_1076/commit_4177c1f044c106979df1d9bc33bc41380b0a9315.diff",
            "diff_additions": 2,
            "diff_deletions": 2,
            "diff_file_size": 31695,
            "diff_url": "https://github.com/openwall/john/commit/4177c1f044c106979df1d9bc33bc41380b0a9315.diff",
            "exists": true,
            "files": [
                {
                    "file_additions": 2,
                    "file_deletions": 2,
                    "file_exists": true,
                    "file_name": "src/cracker.c",
                    "file_size": 31695
                }
            ],
            "interesting": {
                "reopen": true,
                "status": false
            },
            "is_parent": false,
            "sha": "4177c1f044c106979df1d9bc33bc41380b0a9315"
        },
        {
            "associated_pull_request": [],
            "date": "2015-03-10 00:08:45",
            "diff": "openwall_john/issue_1076/commit_0e516e26d0f3fc9c3d02942527d0ebf628945dce.diff",
            "diff_additions": 3,
            "diff_deletions": 2,
            "diff_file_size": 31695,
            "diff_url": "https://github.com/openwall/john/commit/0e516e26d0f3fc9c3d02942527d0ebf628945dce.diff",
            "exists": true,
            "files": [
                {
                    "file_additions": 3,
                    "file_deletions": 2,
                    "file_exists": true,
                    "file_name": "src/cracker.c",
                    "file_size": 31695
                }
            ],
            "interesting": {
                "reopen": false,
                "status": false
            },
            "is_parent": false,
            "sha": "0e516e26d0f3fc9c3d02942527d0ebf628945dce"
        }
    ],
    "first_commit": "2015-03-09 20:40:59",
    "last_commit": "2015-03-10 00:08:45",
    "number": 1076,
    "pull_request": "None",
    "score": {
        "accidental_reopen_likely": false,
        "all_labels": [
            "bug"
        ],
        "contains_keywords": [
            "report",
            "chang",
            "error",
            "bug",
            "problem",
            "test",
            "fix",
            "patch",
            "fault"
        ],
        "fix_size": 8,
        "has_labels": [
            "bug"
        ],
        "intersecting": {
            "computed_score": 0.5,
            "final_commit_size": 6,
            "intersection_size": 3,
            "previous_commits_size": 5
        },
        "is_makefile_based": false,
        "no_new_files": [],
        "no_other_files": false,
        "num_prohibited_files": 66312,
        "prohibited_files": [
            "hal/inc/pinmap_hal.h",
            "Debug/marvin.bin",
            "Debug/marvin.elf",
            "Debug/marvin.hex",
            "Debug/marvin.bin",
            "Debug/marvin.elf",
            "Debug/marvin.hex",
            "inc/spark_utilities.h",
            "Debug/marvin.bin",
            "Debug/marvin.elf"
        ],
        "reopen": true,
        "reopen_events": [
            [
                "2015-03-09 23:29:07",
                "closed"
            ],
            [
                "2015-03-09 23:29:07",
                "commit"
            ],
            [
                "2015-03-09 23:31:08",
                "reopened"
            ],
            [
                "2015-03-10 00:19:11",
                "closed"
            ],
            [
                "2015-03-10 00:19:11",
                "commit"
            ]
        ],
        "status": false,
        "strategy": true,
        "total_changes": 26
    }
}