{
    "commits": [
        {
            "diff": "spring-projects_spring-boot/issue_645/commit_708d5ade9f6730cd7509946f97c0c4d277c2951f.diff",
            "diff_additions": 96,
            "diff_deletions": 2,
            "diff_file_size": 0,
            "files": [
                {
                    "file_additions": 2,
                    "file_deletions": 2,
                    "file_exists": false,
                    "file_name": "spring-boot-actuator/src/main/java/org/springframework/boot/actuate/endpoint/mvc/JolokiaMvcEndpoint.java",
                    "file_size": 0
                },
                {
                    "file_additions": 94,
                    "file_deletions": 0,
                    "file_exists": false,
                    "file_name": "spring-boot-actuator/src/test/java/org/springframework/boot/actuate/endpoint/mvc/JolokiaEndpointContextPathTests.java",
                    "file_size": 0
                }
            ],
            "interesting": {
                "reopened": false,
                "status": true
            },
            "sha": "708d5ade9f6730cd7509946f97c0c4d277c2951f"
        },
        {
            "diff": "spring-projects_spring-boot/issue_645/commit_e73b8ce29c1914f233bc17cc368170b84907f197.diff",
            "diff_additions": 11,
            "diff_deletions": 0,
            "diff_file_size": 0,
            "files": [
                {
                    "file_additions": 11,
                    "file_deletions": 0,
                    "file_exists": false,
                    "file_name": "spring-boot/src/test/java/org/springframework/boot/context/config/ConfigFileApplicationListenerTests.java",
                    "file_size": 0
                }
            ],
            "interesting": {
                "reopened": false,
                "status": false
            },
            "sha": "e73b8ce29c1914f233bc17cc368170b84907f197"
        },
        {
            "diff": "spring-projects_spring-boot/issue_645/commit_3a6d4efe2897e50df10aa78bb177d8a3f2754dbb.diff",
            "diff_additions": 31,
            "diff_deletions": 11,
            "diff_file_size": 0,
            "files": [
                {
                    "file_additions": 6,
                    "file_deletions": 1,
                    "file_exists": false,
                    "file_name": "spring-boot/src/main/java/org/springframework/boot/context/config/ConfigFileApplicationListener.java",
                    "file_size": 0
                },
                {
                    "file_additions": 25,
                    "file_deletions": 9,
                    "file_exists": false,
                    "file_name": "spring-boot/src/test/java/org/springframework/boot/context/config/ConfigFileApplicationListenerTests.java",
                    "file_size": 0
                },
                {
                    "file_additions": 0,
                    "file_deletions": 1,
                    "file_exists": false,
                    "file_name": "spring-boot/src/test/java/org/springframework/boot/context/properties/ConfigurationPropertiesBindingPostProcessorTests.java",
                    "file_size": 0
                }
            ],
            "interesting": {
                "reopened": false,
                "status": false
            },
            "sha": "3a6d4efe2897e50df10aa78bb177d8a3f2754dbb"
        },
        {
            "diff": "spring-projects_spring-boot/issue_645/commit_52d46798a151bacbf48355b6046b73899ed51ff4.diff",
            "diff_additions": 11,
            "diff_deletions": 0,
            "diff_file_size": 0,
            "files": [
                {
                    "file_additions": 11,
                    "file_deletions": 0,
                    "file_exists": false,
                    "file_name": "spring-boot/src/test/java/org/springframework/boot/context/config/ConfigFileApplicationListenerTests.java",
                    "file_size": 0
                }
            ],
            "interesting": {
                "reopened": false,
                "status": false
            },
            "sha": "52d46798a151bacbf48355b6046b73899ed51ff4"
        },
        {
            "diff": "spring-projects_spring-boot/issue_645/commit_013b6344bb7d00f2f9cbb9355300182d3f5fa26e.diff",
            "diff_additions": 31,
            "diff_deletions": 11,
            "diff_file_size": 0,
            "files": [
                {
                    "file_additions": 6,
                    "file_deletions": 1,
                    "file_exists": false,
                    "file_name": "spring-boot/src/main/java/org/springframework/boot/context/config/ConfigFileApplicationListener.java",
                    "file_size": 0
                },
                {
                    "file_additions": 25,
                    "file_deletions": 9,
                    "file_exists": false,
                    "file_name": "spring-boot/src/test/java/org/springframework/boot/context/config/ConfigFileApplicationListenerTests.java",
                    "file_size": 0
                },
                {
                    "file_additions": 0,
                    "file_deletions": 1,
                    "file_exists": false,
                    "file_name": "spring-boot/src/test/java/org/springframework/boot/context/properties/ConfigurationPropertiesBindingPostProcessorTests.java",
                    "file_size": 0
                }
            ],
            "interesting": {
                "reopened": false,
                "status": false
            },
            "sha": "013b6344bb7d00f2f9cbb9355300182d3f5fa26e"
        }
    ],
    "first_commit": "2014-04-08 08:58:17",
    "last_commit": "2014-06-06 17:44:11",
    "number": 645,
    "score": 144.01960784313727
}