{
    "covered_issues": [
        701,
        700,
        699,
        698,
        697,
        695,
        694,
        693,
        692,
        691,
        687,
        686,
        683,
        681,
        679,
        675,
        674,
        669,
        668,
        656,
        651,
        650,
        648,
        644,
        635,
        629,
        628,
        627,
        625,
        623,
        616,
        615,
        604,
        602,
        596,
        594,
        593,
        592,
        588,
        587,
        585,
        584,
        583,
        581,
        580,
        578,
        577,
        576,
        575,
        574,
        573,
        572,
        571,
        570,
        568,
        567,
        565,
        562,
        560,
        558,
        557,
        556,
        555,
        552,
        551,
        550,
        548,
        545,
        543,
        541,
        537,
        536,
        535,
        534,
        533,
        532,
        529,
        528,
        526,
        525,
        524,
        523,
        519,
        511,
        508,
        507,
        500,
        499,
        498,
        497,
        496,
        492,
        491,
        490,
        489,
        486,
        485,
        484,
        483,
        480,
        475,
        474,
        473,
        468,
        466,
        464,
        459,
        458,
        456,
        448,
        447,
        446,
        441,
        438,
        437,
        436,
        435,
        434,
        433,
        432,
        431,
        430,
        428,
        427,
        425,
        423,
        422,
        421,
        419,
        417,
        416,
        415,
        414,
        413,
        412,
        411,
        409,
        408,
        406,
        405,
        404,
        403,
        402,
        401,
        399,
        398,
        397,
        396,
        395,
        391,
        390,
        388,
        386,
        385,
        384,
        377,
        376,
        375,
        374,
        373,
        371,
        370,
        369,
        365,
        364,
        363,
        361,
        360,
        359,
        358,
        355,
        354,
        353,
        352,
        351,
        347,
        343,
        342,
        340,
        339,
        338,
        336,
        335,
        334,
        333,
        332,
        331,
        330,
        329,
        328,
        326,
        324,
        321,
        320,
        319,
        318,
        317,
        316,
        311,
        310,
        309,
        307,
        305,
        303,
        299,
        298,
        295,
        294,
        289,
        288,
        287,
        286,
        285,
        284,
        283,
        282,
        281,
        280,
        279,
        278,
        277,
        276,
        275,
        274,
        273,
        272,
        271,
        270,
        269,
        268,
        267,
        266,
        265,
        264,
        263,
        262,
        261,
        260,
        259,
        258,
        257,
        256,
        255,
        254,
        253,
        252,
        251,
        250,
        249,
        248,
        247,
        246,
        245,
        244,
        243,
        242,
        241,
        240,
        239,
        238,
        237,
        236,
        235,
        234,
        233,
        232,
        231,
        230,
        229,
        228,
        227,
        226,
        225,
        224,
        223,
        222,
        221,
        220,
        219,
        218,
        217,
        216,
        215,
        214,
        212,
        211,
        210,
        209,
        208,
        207,
        206,
        205,
        204,
        203,
        202,
        201,
        200,
        199,
        198,
        197,
        196,
        195,
        194,
        193,
        192,
        190,
        189,
        188,
        187,
        186,
        185,
        184,
        183,
        182,
        181,
        180,
        179,
        178,
        177,
        176,
        175,
        174,
        173,
        172,
        171,
        170,
        169,
        168,
        167,
        166,
        164,
        163,
        162,
        161,
        160,
        159,
        158,
        157,
        156,
        155,
        154,
        153,
        152,
        151,
        150,
        149,
        148,
        147,
        146,
        145,
        144,
        143,
        142,
        141,
        140,
        139,
        138,
        136,
        135,
        134,
        133,
        132,
        131,
        130,
        129,
        128,
        127,
        126,
        125,
        124,
        123,
        122,
        121,
        120,
        119,
        118,
        117,
        116,
        115,
        114,
        113,
        112,
        111,
        110,
        109,
        108,
        107,
        106,
        105,
        104,
        103,
        102,
        101,
        100,
        99,
        98,
        97,
        96,
        95,
        94,
        93,
        92,
        91,
        90,
        89,
        88,
        87,
        86,
        85,
        84,
        83,
        82,
        81,
        80,
        79,
        78,
        77,
        76,
        75,
        74,
        73,
        72,
        71,
        70,
        69,
        68,
        67,
        66,
        65,
        64,
        63,
        62,
        61,
        60,
        59,
        58,
        57,
        56,
        55,
        54,
        53,
        52,
        51,
        50,
        49,
        48,
        47,
        46,
        45,
        44,
        43,
        42,
        41,
        40,
        39,
        38,
        37,
        36,
        35,
        34,
        33,
        32,
        31,
        30,
        29,
        28,
        27,
        26,
        25,
        24,
        23,
        22,
        21,
        20,
        19,
        18,
        17,
        16,
        15,
        14,
        13,
        12,
        11,
        10,
        9,
        8,
        7,
        6,
        5,
        4,
        3,
        2,
        1
    ],
    "finished": true
}