{
    "commits": [
        {
            "associated_pull_request": [],
            "date": "2015-11-03 16:38:59+00:00",
            "diff": "",
            "diff_additions": 0,
            "diff_deletions": 0,
            "diff_file_size": 0,
            "diff_url": "https://github.com/mintty/mintty/commit/6e5d43cd31adea8ed00f87d4afe4c1220fd0fd1e.diff",
            "exists": true,
            "files": [],
            "interesting": {
                "reopen": false,
                "status": false
            },
            "is_parent": true,
            "sha": "6e5d43cd31adea8ed00f87d4afe4c1220fd0fd1e"
        },
        {
            "associated_pull_request": [],
            "date": "2015-11-04 17:24:53+00:00",
            "diff": "mintty_mintty/issue_486/commit_4669cb0831a065b07b9ac5a5c23b4f0db45d59cc.diff",
            "diff_additions": 5,
            "diff_deletions": 1,
            "diff_file_size": 218965,
            "diff_url": "https://github.com/mintty/mintty/commit/4669cb0831a065b07b9ac5a5c23b4f0db45d59cc.diff",
            "exists": true,
            "files": [
                {
                    "file_additions": 5,
                    "file_deletions": 1,
                    "file_exists": true,
                    "file_name": "src/winmain.c",
                    "file_size": 218965
                }
            ],
            "interesting": {
                "reopen": true,
                "status": false
            },
            "is_parent": false,
            "sha": "4669cb0831a065b07b9ac5a5c23b4f0db45d59cc"
        },
        {
            "associated_pull_request": [],
            "date": "2015-11-11 17:10:06+00:00",
            "diff": "mintty_mintty/issue_486/commit_d58c80a8412cbc94c0a3ab6fb59d70d880a2e50b.diff",
            "diff_additions": 9,
            "diff_deletions": 1,
            "diff_file_size": 218965,
            "diff_url": "https://github.com/mintty/mintty/commit/d58c80a8412cbc94c0a3ab6fb59d70d880a2e50b.diff",
            "exists": true,
            "files": [
                {
                    "file_additions": 9,
                    "file_deletions": 1,
                    "file_exists": true,
                    "file_name": "src/winmain.c",
                    "file_size": 218965
                }
            ],
            "interesting": {
                "reopen": false,
                "status": false
            },
            "is_parent": false,
            "sha": "d58c80a8412cbc94c0a3ab6fb59d70d880a2e50b"
        },
        {
            "associated_pull_request": [],
            "date": "2015-11-26 17:22:50+00:00",
            "diff": "mintty_mintty/issue_486/commit_2d90fda965e2e4dab667b5341ef52f8551a8c26f.diff",
            "diff_additions": 99,
            "diff_deletions": 22,
            "diff_file_size": 255606,
            "diff_url": "https://github.com/mintty/mintty/commit/2d90fda965e2e4dab667b5341ef52f8551a8c26f.diff",
            "exists": true,
            "files": [
                {
                    "file_additions": 11,
                    "file_deletions": 6,
                    "file_exists": true,
                    "file_name": "src/child.c",
                    "file_size": 36641
                },
                {
                    "file_additions": 88,
                    "file_deletions": 16,
                    "file_exists": true,
                    "file_name": "src/winmain.c",
                    "file_size": 218965
                }
            ],
            "interesting": {
                "reopen": false,
                "status": false
            },
            "is_parent": false,
            "sha": "2d90fda965e2e4dab667b5341ef52f8551a8c26f"
        }
    ],
    "first_commit": "2015-11-03 16:38:59+00:00",
    "last_commit": "2015-11-26 17:22:50+00:00",
    "number": 486,
    "pull_request": "None",
    "score": {
        "accidental_reopen_likely": false,
        "all_labels": [],
        "contains_keywords": [
            "confirm",
            "work",
            "chang",
            "fix",
            "issu",
            "reason",
            "test",
            "attempt",
            "fault",
            "remov",
            "problem"
        ],
        "fix_size": 123,
        "has_labels": [],
        "intersecting": {
            "computed_score": 0.07627118644067797,
            "final_commit_size": 118,
            "intersection_size": 9,
            "previous_commits_size": 14
        },
        "is_makefile_based": true,
        "no_new_files": [
            "src/child.c"
        ],
        "no_other_files": false,
        "num_prohibited_files": 144902,
        "prohibited_files": [
            "server/src/main/java/com/genymobile/scrcpy/Device.java",
            "server/src/main/java/com/genymobile/scrcpy/wrappers/SurfaceControl.java",
            "server/src/main/java/com/genymobile/scrcpy/Device.java",
            "server/src/main/java/com/genymobile/scrcpy/wrappers/SurfaceControl.java",
            "app/meson.build",
            "app/scrcpy.1",
            "app/src/common.h",
            "app/src/scrcpy.h",
            "app/src/server.h",
            "server/src/main/java/com/genymobile/scrcpy/Workarounds.java"
        ],
        "reopen": true,
        "reopen_events": [
            [
                "2015-11-04 17:25:48+00:00",
                "closed"
            ],
            [
                "2015-11-04 17:25:48+00:00",
                "commit"
            ],
            [
                "2015-11-04 17:26:40+00:00",
                "reopened"
            ],
            [
                "2015-11-11 17:10:34+00:00",
                "commit"
            ],
            [
                "2015-11-12 16:51:53+00:00",
                "commit"
            ],
            [
                "2015-11-13 13:50:15+00:00",
                "closed"
            ],
            [
                "2015-11-26 17:28:55+00:00",
                "commit"
            ]
        ],
        "status": false,
        "strategy": true,
        "total_changes": 137
    }
}