{
    "covered_issues": [
        104,
        101,
        100,
        88,
        87,
        86,
        85,
        82,
        81,
        80,
        77,
        76,
        74,
        71,
        52,
        47,
        44,
        33,
        31,
        30,
        19,
        15,
        9,
        4,
        2
    ],
    "finished": true
}