{
    "commits": [
        {
            "associated_pull_request": [],
            "date": "2023-02-17 03:09:33+00:00",
            "diff": "",
            "diff_additions": 0,
            "diff_deletions": 0,
            "diff_file_size": 0,
            "diff_url": "https://github.com/miniupnp/miniupnp/commit/e439318cf782e30066d430f27a1365e013a5ab94.diff",
            "exists": true,
            "files": [],
            "interesting": {
                "reopen": false,
                "status": false
            },
            "is_parent": true,
            "sha": "e439318cf782e30066d430f27a1365e013a5ab94"
        },
        {
            "associated_pull_request": [],
            "date": "2023-04-05 14:03:13+00:00",
            "diff": "miniupnp_miniupnp/issue_652/commit_5ca1a82f7fa9720b0be0fa3e2e7f4612b7192b33.diff",
            "diff_additions": 4,
            "diff_deletions": 1,
            "diff_file_size": 11199,
            "diff_url": "https://github.com/miniupnp/miniupnp/commit/5ca1a82f7fa9720b0be0fa3e2e7f4612b7192b33.diff",
            "exists": true,
            "files": [
                {
                    "file_additions": 4,
                    "file_deletions": 1,
                    "file_exists": true,
                    "file_name": "miniupnpd/upnppermissions.c",
                    "file_size": 11199
                }
            ],
            "interesting": {
                "reopen": false,
                "status": false
            },
            "is_parent": false,
            "sha": "5ca1a82f7fa9720b0be0fa3e2e7f4612b7192b33"
        },
        {
            "associated_pull_request": [],
            "date": "2023-04-23 09:48:47+00:00",
            "diff": "miniupnp_miniupnp/issue_652/commit_69611047bb5eb19a6574367898a478aaaafabcc4.diff",
            "diff_additions": 16,
            "diff_deletions": 1,
            "diff_file_size": 11199,
            "diff_url": "https://github.com/miniupnp/miniupnp/commit/69611047bb5eb19a6574367898a478aaaafabcc4.diff",
            "exists": true,
            "files": [
                {
                    "file_additions": 16,
                    "file_deletions": 1,
                    "file_exists": true,
                    "file_name": "miniupnpd/upnppermissions.c",
                    "file_size": 11199
                }
            ],
            "interesting": {
                "reopen": false,
                "status": true
            },
            "is_parent": false,
            "sha": "69611047bb5eb19a6574367898a478aaaafabcc4"
        },
        {
            "associated_pull_request": [],
            "date": "2023-04-23 09:48:47+00:00",
            "diff": "miniupnp_miniupnp/issue_652/commit_861298fa2467c3bf0c2893b2b675aa2ab836e0a2.diff",
            "diff_additions": 16,
            "diff_deletions": 1,
            "diff_file_size": 11199,
            "diff_url": "https://github.com/miniupnp/miniupnp/commit/861298fa2467c3bf0c2893b2b675aa2ab836e0a2.diff",
            "exists": true,
            "files": [
                {
                    "file_additions": 16,
                    "file_deletions": 1,
                    "file_exists": true,
                    "file_name": "miniupnpd/upnppermissions.c",
                    "file_size": 11199
                }
            ],
            "interesting": {
                "reopen": false,
                "status": false
            },
            "is_parent": false,
            "sha": "861298fa2467c3bf0c2893b2b675aa2ab836e0a2"
        }
    ],
    "first_commit": "2023-02-17 03:09:33+00:00",
    "last_commit": "2023-04-05 14:03:13+00:00",
    "number": 652,
    "pull_request": "None",
    "score": {
        "accidental_reopen_likely": false,
        "all_labels": [
            "miniupnpd"
        ],
        "contains_keywords": [
            "work",
            "fix",
            "issu",
            "patch",
            "debug",
            "test",
            "bug",
            "error",
            "problem",
            "report",
            "workaround"
        ],
        "fix_size": 21,
        "has_labels": [],
        "intersecting": {
            "computed_score": 1.0,
            "final_commit_size": 17,
            "intersection_size": 17,
            "previous_commits_size": 21
        },
        "is_makefile_based": false,
        "no_new_files": [],
        "no_other_files": true,
        "num_prohibited_files": 203016,
        "prohibited_files": [
            "server/src/main/java/com/genymobile/scrcpy/Device.java",
            "server/src/main/java/com/genymobile/scrcpy/wrappers/SurfaceControl.java",
            "server/src/main/java/com/genymobile/scrcpy/Device.java",
            "server/src/main/java/com/genymobile/scrcpy/wrappers/SurfaceControl.java",
            "app/meson.build",
            "app/scrcpy.1",
            "app/src/common.h",
            "app/src/scrcpy.h",
            "app/src/server.h",
            "server/src/main/java/com/genymobile/scrcpy/Workarounds.java"
        ],
        "reopen": false,
        "reopen_events": [
            [
                "2023-04-05 14:04:12+00:00",
                "commit"
            ],
            [
                "2023-04-23 09:49:37+00:00",
                "commit"
            ],
            [
                "2023-04-23 09:51:31+00:00",
                "commit"
            ],
            [
                "2023-04-24 19:18:31+00:00",
                "closed"
            ],
            [
                "2023-04-24 19:18:31+00:00",
                "commit"
            ]
        ],
        "status": true,
        "strategy": true,
        "total_changes": 39
    }
}