{
    "category": [
        "hardware/OS",
        "build/refactor/preprocessing"
    ],
    "commits": [
        {
            "associated_pull_request": [],
            "date": "2015-06-24 18:57:05",
            "diff": "open62541_open62541/issue_280/commit_27966a3d6c6444a22944d55fc423edc665024552.diff",
            "diff_additions": 3,
            "diff_deletions": 23,
            "diff_file_size": 0,
            "diff_url": "https://github.com/open62541/open62541/commit/27966a3d6c6444a22944d55fc423edc665024552.diff",
            "exists": true,
            "files": [
                {
                    "file_additions": 3,
                    "file_deletions": 23,
                    "file_exists": false,
                    "file_name": "examples/server.c",
                    "file_size": 0
                }
            ],
            "interesting": {
                "reopen": false,
                "status": false
            },
            "is_parent": true,
            "sha": "27966a3d6c6444a22944d55fc423edc665024552"
        },
        {
            "associated_pull_request": [],
            "date": "2015-07-07 15:12:41",
            "diff": "open62541_open62541/issue_280/commit_9c55fe640d837b4cbe7941b999584d3f56879e07.diff",
            "diff_additions": 3309,
            "diff_deletions": 2665,
            "diff_file_size": 369999,
            "diff_url": "https://github.com/open62541/open62541/commit/9c55fe640d837b4cbe7941b999584d3f56879e07.diff",
            "exists": true,
            "files": [
                {
                    "file_additions": 24,
                    "file_deletions": 28,
                    "file_exists": true,
                    "file_name": "examples/client.c",
                    "file_size": 12716
                },
                {
                    "file_additions": 69,
                    "file_deletions": 148,
                    "file_exists": false,
                    "file_name": "examples/networklayer_tcp.c",
                    "file_size": 0
                },
                {
                    "file_additions": 66,
                    "file_deletions": 134,
                    "file_exists": false,
                    "file_name": "examples/server.c",
                    "file_size": 0
                },
                {
                    "file_additions": 6,
                    "file_deletions": 8,
                    "file_exists": false,
                    "file_name": "examples/server_simple.c",
                    "file_size": 0
                },
                {
                    "file_additions": 22,
                    "file_deletions": 34,
                    "file_exists": true,
                    "file_name": "src/client/ua_client.c",
                    "file_size": 29099
                },
                {
                    "file_additions": 0,
                    "file_deletions": 181,
                    "file_exists": false,
                    "file_name": "src/server/ua_methodcalls.c",
                    "file_size": 0
                },
                {
                    "file_additions": 0,
                    "file_deletions": 4,
                    "file_exists": true,
                    "file_name": "src/server/ua_nodes.c",
                    "file_size": 26062
                },
                {
                    "file_additions": 1,
                    "file_deletions": 0,
                    "file_exists": false,
                    "file_name": "src/server/ua_nodestore.c",
                    "file_size": 0
                },
                {
                    "file_additions": 0,
                    "file_deletions": 2,
                    "file_exists": false,
                    "file_name": "src/server/ua_nodestore_concurrent.c",
                    "file_size": 0
                },
                {
                    "file_additions": 23,
                    "file_deletions": 34,
                    "file_exists": true,
                    "file_name": "src/server/ua_server.c",
                    "file_size": 27294
                },
                {
                    "file_additions": 69,
                    "file_deletions": 0,
                    "file_exists": false,
                    "file_name": "src/server/ua_server_addressspace.c",
                    "file_size": 0
                },
                {
                    "file_additions": 0,
                    "file_deletions": 3,
                    "file_exists": true,
                    "file_name": "src/server/ua_server_binary.c",
                    "file_size": 37143
                },
                {
                    "file_additions": 1,
                    "file_deletions": 2,
                    "file_exists": false,
                    "file_name": "src/server/ua_server_worker.c",
                    "file_size": 0
                },
                {
                    "file_additions": 29,
                    "file_deletions": 46,
                    "file_exists": true,
                    "file_name": "src/server/ua_services_attribute.c",
                    "file_size": 79262
                },
                {
                    "file_additions": 8,
                    "file_deletions": 6,
                    "file_exists": true,
                    "file_name": "src/server/ua_services_session.c",
                    "file_size": 34533
                },
                {
                    "file_additions": 23,
                    "file_deletions": 28,
                    "file_exists": true,
                    "file_name": "src/ua_types.c",
                    "file_size": 50149
                },
                {
                    "file_additions": 1087,
                    "file_deletions": 834,
                    "file_exists": true,
                    "file_name": "src/ua_types_encoding_binary.c",
                    "file_size": 73741
                },
                {
                    "file_additions": 1462,
                    "file_deletions": 1139,
                    "file_exists": false,
                    "file_name": "tests/check_builtin.c",
                    "file_size": 0
                },
                {
                    "file_additions": 419,
                    "file_deletions": 34,
                    "file_exists": false,
                    "file_name": "tests/check_services_attributes.c",
                    "file_size": 0
                }
            ],
            "interesting": {
                "reopen": false,
                "status": false
            },
            "is_parent": false,
            "sha": "9c55fe640d837b4cbe7941b999584d3f56879e07"
        },
        {
            "associated_pull_request": [],
            "date": "2015-07-08 06:19:39",
            "diff": "open62541_open62541/issue_280/commit_f4629df4412d839bdfc254db10230a75cf1f815b.diff",
            "diff_additions": 400,
            "diff_deletions": 7,
            "diff_file_size": 132314,
            "diff_url": "https://github.com/open62541/open62541/commit/f4629df4412d839bdfc254db10230a75cf1f815b.diff",
            "exists": true,
            "files": [
                {
                    "file_additions": 23,
                    "file_deletions": 1,
                    "file_exists": true,
                    "file_name": "examples/client.c",
                    "file_size": 12716
                },
                {
                    "file_additions": 32,
                    "file_deletions": 1,
                    "file_exists": false,
                    "file_name": "examples/server.c",
                    "file_size": 0
                },
                {
                    "file_additions": 45,
                    "file_deletions": 0,
                    "file_exists": true,
                    "file_name": "src/client/ua_client.c",
                    "file_size": 29099
                },
                {
                    "file_additions": 19,
                    "file_deletions": 4,
                    "file_exists": true,
                    "file_name": "src/server/ua_nodes.c",
                    "file_size": 26062
                },
                {
                    "file_additions": 1,
                    "file_deletions": 0,
                    "file_exists": false,
                    "file_name": "src/server/ua_nodestore.c",
                    "file_size": 0
                },
                {
                    "file_additions": 1,
                    "file_deletions": 1,
                    "file_exists": true,
                    "file_name": "src/server/ua_server.c",
                    "file_size": 27294
                },
                {
                    "file_additions": 69,
                    "file_deletions": 0,
                    "file_exists": false,
                    "file_name": "src/server/ua_server_addressspace.c",
                    "file_size": 0
                },
                {
                    "file_additions": 6,
                    "file_deletions": 0,
                    "file_exists": true,
                    "file_name": "src/server/ua_server_binary.c",
                    "file_size": 37143
                },
                {
                    "file_additions": 204,
                    "file_deletions": 0,
                    "file_exists": false,
                    "file_name": "src/server/ua_services_call.c",
                    "file_size": 0
                }
            ],
            "interesting": {
                "reopen": false,
                "status": false
            },
            "is_parent": false,
            "sha": "f4629df4412d839bdfc254db10230a75cf1f815b"
        }
    ],
    "first_commit": "2015-06-26 20:46:27",
    "last_commit": "2015-07-08 06:19:39",
    "number": 280,
    "pull_request": "None",
    "score": {
        "accidental_reopen_likely": false,
        "all_labels": [
            "Type: Enhancement"
        ],
        "contains_keywords": [
            "work",
            "attempt",
            "fix",
            "patch",
            "bug",
            "test",
            "remov",
            "issu",
            "error",
            "workaround",
            "chang",
            "fail",
            "leak",
            "problem"
        ],
        "fix_size": 4329,
        "has_labels": [],
        "intersecting": {
            "computed_score": 0.7536231884057971,
            "final_commit_size": 207,
            "intersection_size": 156,
            "previous_commits_size": 4278
        },
        "is_makefile_based": true,
        "no_new_files": [],
        "no_other_files": false,
        "num_prohibited_files": 29986,
        "prohibited_files": [
            "kill.h",
            "meminfo.h",
            "kill.h",
            "meminfo.h",
            "kill.h",
            "meminfo.h",
            "testsuite_cli_test.go",
            "testsuite_cli_test.go",
            "common.mk",
            "i3bar/include/draw_util.h"
        ],
        "reopen": false,
        "reopen_events": [
            [
                "2015-06-26 20:47:44",
                "commit"
            ],
            [
                "2015-06-26 20:55:53",
                "closed"
            ],
            [
                "2015-06-26 20:55:53",
                "commit"
            ],
            [
                "2015-06-27 10:50:03",
                "commit"
            ],
            [
                "2015-07-07 15:12:51",
                "commit"
            ],
            [
                "2015-07-08 06:20:21",
                "commit"
            ]
        ],
        "status": true,
        "strategy": true,
        "total_changes": 6407
    }
}