{
    "commits": [
        {
            "associated_pull_request": [],
            "date": "2012-09-02 00:41:22+00:00",
            "diff": "xiehuc_pidgin-lwqq/issue_57/commit_dcc6542329b5ceb05ae8b9a08267f5d9b4c83538.diff",
            "diff_additions": 1,
            "diff_deletions": 0,
            "diff_file_size": 19193,
            "diff_url": "https://github.com/xiehuc/pidgin-lwqq/commit/dcc6542329b5ceb05ae8b9a08267f5d9b4c83538.diff",
            "exists": true,
            "files": [
                {
                    "file_additions": 1,
                    "file_deletions": 0,
                    "file_exists": true,
                    "file_name": "src/translate.c",
                    "file_size": 19193
                }
            ],
            "interesting": {
                "reopen": false,
                "status": false
            },
            "is_parent": true,
            "sha": "dcc6542329b5ceb05ae8b9a08267f5d9b4c83538"
        },
        {
            "associated_pull_request": [],
            "date": "2012-09-02 09:13:05+00:00",
            "diff": "xiehuc_pidgin-lwqq/issue_57/commit_51c1715f681f9cfdf840480eaea0c6d7effc971f.diff",
            "diff_additions": 3,
            "diff_deletions": 2,
            "diff_file_size": 116773,
            "diff_url": "https://github.com/xiehuc/pidgin-lwqq/commit/51c1715f681f9cfdf840480eaea0c6d7effc971f.diff",
            "exists": true,
            "files": [
                {
                    "file_additions": 2,
                    "file_deletions": 2,
                    "file_exists": false,
                    "file_name": "src/liblwqq/msg.c",
                    "file_size": 0
                },
                {
                    "file_additions": 1,
                    "file_deletions": 0,
                    "file_exists": true,
                    "file_name": "src/webqq.c",
                    "file_size": 116773
                }
            ],
            "interesting": {
                "reopen": true,
                "status": false
            },
            "is_parent": false,
            "sha": "51c1715f681f9cfdf840480eaea0c6d7effc971f"
        },
        {
            "associated_pull_request": [],
            "date": "2012-10-23 02:44:11+00:00",
            "diff": "xiehuc_pidgin-lwqq/issue_57/commit_cbf073b431c33cdad371544ae49ef265011040ee.diff",
            "diff_additions": 29,
            "diff_deletions": 8,
            "diff_file_size": 116773,
            "diff_url": "https://github.com/xiehuc/pidgin-lwqq/commit/cbf073b431c33cdad371544ae49ef265011040ee.diff",
            "exists": true,
            "files": [
                {
                    "file_additions": 25,
                    "file_deletions": 4,
                    "file_exists": false,
                    "file_name": "src/liblwqq/msg.c",
                    "file_size": 0
                },
                {
                    "file_additions": 4,
                    "file_deletions": 4,
                    "file_exists": true,
                    "file_name": "src/webqq.c",
                    "file_size": 116773
                }
            ],
            "interesting": {
                "reopen": false,
                "status": false
            },
            "is_parent": false,
            "sha": "cbf073b431c33cdad371544ae49ef265011040ee"
        }
    ],
    "first_commit": "2012-09-02 00:41:22+00:00",
    "last_commit": "2012-10-23 02:44:58+00:00",
    "number": 57,
    "pull_request": "None",
    "score": {
        "accidental_reopen_likely": false,
        "all_labels": [],
        "contains_keywords": [
            "fix",
            "issu",
            "test",
            "bug"
        ],
        "fix_size": 35,
        "has_labels": [],
        "intersecting": {
            "computed_score": 0.0625,
            "final_commit_size": 32,
            "intersection_size": 2,
            "previous_commits_size": 5
        },
        "is_makefile_based": true,
        "no_new_files": [],
        "no_other_files": false,
        "num_prohibited_files": 187621,
        "prohibited_files": [
            "server/src/main/java/com/genymobile/scrcpy/Device.java",
            "server/src/main/java/com/genymobile/scrcpy/wrappers/SurfaceControl.java",
            "server/src/main/java/com/genymobile/scrcpy/Device.java",
            "server/src/main/java/com/genymobile/scrcpy/wrappers/SurfaceControl.java",
            "app/meson.build",
            "app/scrcpy.1",
            "app/src/common.h",
            "app/src/scrcpy.h",
            "app/src/server.h",
            "server/src/main/java/com/genymobile/scrcpy/Workarounds.java"
        ],
        "reopen": true,
        "reopen_events": [
            [
                "2012-09-02 09:13:16+00:00",
                "commit"
            ],
            [
                "2012-09-02 16:39:44+00:00",
                "closed"
            ],
            [
                "2012-09-09 13:22:23+00:00",
                "reopened"
            ],
            [
                "2012-10-23 02:45:12+00:00",
                "commit"
            ],
            [
                "2012-10-23 02:45:24+00:00",
                "closed"
            ]
        ],
        "status": false,
        "strategy": true,
        "total_changes": 43
    }
}