{
    "category": [
        "hardware/OS",
        "wrong API usage"
    ],
    "commits": [
        {
            "associated_pull_request": [
                "https://github.com/surge-synthesizer/surge/pull/2682"
            ],
            "date": "2020-09-24 11:32:12",
            "diff": "surge-synthesizer_surge/issue_2605/commit_41beca6c7a360cd1ffceb5d72a2899173049f859.diff",
            "diff_additions": 24,
            "diff_deletions": 3,
            "diff_file_size": 0,
            "diff_url": "https://github.com/surge-synthesizer/surge/commit/41beca6c7a360cd1ffceb5d72a2899173049f859.diff",
            "exists": true,
            "files": [
                {
                    "file_additions": 24,
                    "file_deletions": 3,
                    "file_exists": false,
                    "file_name": "src/common/dsp/LfoModulationSource.cpp",
                    "file_size": 0
                }
            ],
            "interesting": {
                "reopen": false,
                "status": false
            },
            "is_parent": true,
            "sha": "41beca6c7a360cd1ffceb5d72a2899173049f859"
        },
        {
            "associated_pull_request": [],
            "date": "2020-09-24 12:50:18",
            "diff": "surge-synthesizer_surge/issue_2605/commit_f1ecf5abde0b78854c2392a3698fa60b2e3597ff.diff",
            "diff_additions": 1253,
            "diff_deletions": 1386,
            "diff_file_size": 2861,
            "diff_url": "https://github.com/surge-synthesizer/surge/commit/f1ecf5abde0b78854c2392a3698fa60b2e3597ff.diff",
            "exists": true,
            "files": [
                {
                    "file_additions": 177,
                    "file_deletions": 0,
                    "file_exists": false,
                    "file_name": "src/common/dsp/AudioInputOscillator.cpp",
                    "file_size": 0
                },
                {
                    "file_additions": 4,
                    "file_deletions": 137,
                    "file_exists": false,
                    "file_name": "src/common/dsp/FM2Oscillator.cpp",
                    "file_size": 0
                },
                {
                    "file_additions": 155,
                    "file_deletions": 0,
                    "file_exists": false,
                    "file_name": "src/common/dsp/FM3Oscillator.cpp",
                    "file_size": 0
                },
                {
                    "file_additions": 14,
                    "file_deletions": 825,
                    "file_exists": true,
                    "file_name": "src/common/dsp/Oscillator.cpp",
                    "file_size": 2861
                },
                {
                    "file_additions": 2,
                    "file_deletions": 1,
                    "file_exists": false,
                    "file_name": "src/common/dsp/SampleAndHoldOscillator.cpp",
                    "file_size": 0
                },
                {
                    "file_additions": 680,
                    "file_deletions": 0,
                    "file_exists": false,
                    "file_name": "src/common/dsp/SinOscillator.cpp",
                    "file_size": 0
                },
                {
                    "file_additions": 2,
                    "file_deletions": 1,
                    "file_exists": false,
                    "file_name": "src/common/dsp/SurgeSuperOscillator.cpp",
                    "file_size": 0
                },
                {
                    "file_additions": 1,
                    "file_deletions": 1,
                    "file_exists": false,
                    "file_name": "src/common/dsp/WavetableOscillator.cpp",
                    "file_size": 0
                },
                {
                    "file_additions": 3,
                    "file_deletions": 4,
                    "file_exists": false,
                    "file_name": "src/common/dsp/WindowOscillator.cpp",
                    "file_size": 0
                },
                {
                    "file_additions": 1,
                    "file_deletions": 1,
                    "file_exists": false,
                    "file_name": "src/common/dsp/effect/ConditionerEffect.cpp",
                    "file_size": 0
                },
                {
                    "file_additions": 1,
                    "file_deletions": 1,
                    "file_exists": false,
                    "file_name": "src/common/dsp/effect/DistortionEffect.cpp",
                    "file_size": 0
                },
                {
                    "file_additions": 1,
                    "file_deletions": 1,
                    "file_exists": false,
                    "file_name": "src/common/dsp/effect/DualDelayEffect.cpp",
                    "file_size": 0
                },
                {
                    "file_additions": 13,
                    "file_deletions": 401,
                    "file_exists": false,
                    "file_name": "src/common/dsp/effect/Effect.cpp",
                    "file_size": 0
                },
                {
                    "file_additions": 186,
                    "file_deletions": 0,
                    "file_exists": false,
                    "file_name": "src/common/dsp/effect/Eq3BandEffect.cpp",
                    "file_size": 0
                },
                {
                    "file_additions": 1,
                    "file_deletions": 1,
                    "file_exists": false,
                    "file_name": "src/common/dsp/effect/FlangerEffect.cpp",
                    "file_size": 0
                },
                {
                    "file_additions": 1,
                    "file_deletions": 1,
                    "file_exists": false,
                    "file_name": "src/common/dsp/effect/FreqshiftEffect.cpp",
                    "file_size": 0
                },
                {
                    "file_additions": 1,
                    "file_deletions": 1,
                    "file_exists": false,
                    "file_name": "src/common/dsp/effect/PhaserEffect.cpp",
                    "file_size": 0
                },
                {
                    "file_additions": 1,
                    "file_deletions": 1,
                    "file_exists": false,
                    "file_name": "src/common/dsp/effect/Reverb1Effect.cpp",
                    "file_size": 0
                },
                {
                    "file_additions": 1,
                    "file_deletions": 1,
                    "file_exists": false,
                    "file_name": "src/common/dsp/effect/Reverb2Effect.cpp",
                    "file_size": 0
                },
                {
                    "file_additions": 5,
                    "file_deletions": 5,
                    "file_exists": false,
                    "file_name": "src/common/dsp/effect/RingModulatorEffect.cpp",
                    "file_size": 0
                },
                {
                    "file_additions": 1,
                    "file_deletions": 1,
                    "file_exists": false,
                    "file_name": "src/common/dsp/effect/RotarySpeakerEffect.cpp",
                    "file_size": 0
                },
                {
                    "file_additions": 1,
                    "file_deletions": 1,
                    "file_exists": false,
                    "file_name": "src/common/dsp/effect/VocoderEffect.cpp",
                    "file_size": 0
                },
                {
                    "file_additions": 1,
                    "file_deletions": 1,
                    "file_exists": false,
                    "file_name": "src/common/gui/SurgeGUIEditor.cpp",
                    "file_size": 0
                }
            ],
            "interesting": {
                "reopen": false,
                "status": true
            },
            "is_parent": false,
            "sha": "f1ecf5abde0b78854c2392a3698fa60b2e3597ff"
        },
        {
            "associated_pull_request": [
                "https://github.com/surge-synthesizer/surge/pull/2684"
            ],
            "date": "2020-09-24 12:50:18",
            "diff": "surge-synthesizer_surge/issue_2605/commit_c5418f6fbf63cf46f9011f1aea66bd01bafda64e.diff",
            "diff_additions": 1254,
            "diff_deletions": 1383,
            "diff_file_size": 2861,
            "diff_url": "https://github.com/surge-synthesizer/surge/commit/c5418f6fbf63cf46f9011f1aea66bd01bafda64e.diff",
            "exists": true,
            "files": [
                {
                    "file_additions": 177,
                    "file_deletions": 0,
                    "file_exists": false,
                    "file_name": "src/common/dsp/AudioInputOscillator.cpp",
                    "file_size": 0
                },
                {
                    "file_additions": 4,
                    "file_deletions": 137,
                    "file_exists": false,
                    "file_name": "src/common/dsp/FM2Oscillator.cpp",
                    "file_size": 0
                },
                {
                    "file_additions": 155,
                    "file_deletions": 0,
                    "file_exists": false,
                    "file_name": "src/common/dsp/FM3Oscillator.cpp",
                    "file_size": 0
                },
                {
                    "file_additions": 14,
                    "file_deletions": 825,
                    "file_exists": true,
                    "file_name": "src/common/dsp/Oscillator.cpp",
                    "file_size": 2861
                },
                {
                    "file_additions": 2,
                    "file_deletions": 1,
                    "file_exists": false,
                    "file_name": "src/common/dsp/SampleAndHoldOscillator.cpp",
                    "file_size": 0
                },
                {
                    "file_additions": 680,
                    "file_deletions": 0,
                    "file_exists": false,
                    "file_name": "src/common/dsp/SinOscillator.cpp",
                    "file_size": 0
                },
                {
                    "file_additions": 2,
                    "file_deletions": 1,
                    "file_exists": false,
                    "file_name": "src/common/dsp/SurgeSuperOscillator.cpp",
                    "file_size": 0
                },
                {
                    "file_additions": 1,
                    "file_deletions": 1,
                    "file_exists": false,
                    "file_name": "src/common/dsp/WavetableOscillator.cpp",
                    "file_size": 0
                },
                {
                    "file_additions": 4,
                    "file_deletions": 1,
                    "file_exists": false,
                    "file_name": "src/common/dsp/WindowOscillator.cpp",
                    "file_size": 0
                },
                {
                    "file_additions": 1,
                    "file_deletions": 1,
                    "file_exists": false,
                    "file_name": "src/common/dsp/effect/ConditionerEffect.cpp",
                    "file_size": 0
                },
                {
                    "file_additions": 1,
                    "file_deletions": 1,
                    "file_exists": false,
                    "file_name": "src/common/dsp/effect/DistortionEffect.cpp",
                    "file_size": 0
                },
                {
                    "file_additions": 1,
                    "file_deletions": 1,
                    "file_exists": false,
                    "file_name": "src/common/dsp/effect/DualDelayEffect.cpp",
                    "file_size": 0
                },
                {
                    "file_additions": 13,
                    "file_deletions": 401,
                    "file_exists": false,
                    "file_name": "src/common/dsp/effect/Effect.cpp",
                    "file_size": 0
                },
                {
                    "file_additions": 186,
                    "file_deletions": 0,
                    "file_exists": false,
                    "file_name": "src/common/dsp/effect/Eq3BandEffect.cpp",
                    "file_size": 0
                },
                {
                    "file_additions": 1,
                    "file_deletions": 1,
                    "file_exists": false,
                    "file_name": "src/common/dsp/effect/FlangerEffect.cpp",
                    "file_size": 0
                },
                {
                    "file_additions": 1,
                    "file_deletions": 1,
                    "file_exists": false,
                    "file_name": "src/common/dsp/effect/FreqshiftEffect.cpp",
                    "file_size": 0
                },
                {
                    "file_additions": 1,
                    "file_deletions": 1,
                    "file_exists": false,
                    "file_name": "src/common/dsp/effect/PhaserEffect.cpp",
                    "file_size": 0
                },
                {
                    "file_additions": 1,
                    "file_deletions": 1,
                    "file_exists": false,
                    "file_name": "src/common/dsp/effect/Reverb1Effect.cpp",
                    "file_size": 0
                },
                {
                    "file_additions": 1,
                    "file_deletions": 1,
                    "file_exists": false,
                    "file_name": "src/common/dsp/effect/Reverb2Effect.cpp",
                    "file_size": 0
                },
                {
                    "file_additions": 5,
                    "file_deletions": 5,
                    "file_exists": false,
                    "file_name": "src/common/dsp/effect/RingModulatorEffect.cpp",
                    "file_size": 0
                },
                {
                    "file_additions": 1,
                    "file_deletions": 1,
                    "file_exists": false,
                    "file_name": "src/common/dsp/effect/RotarySpeakerEffect.cpp",
                    "file_size": 0
                },
                {
                    "file_additions": 1,
                    "file_deletions": 1,
                    "file_exists": false,
                    "file_name": "src/common/dsp/effect/VocoderEffect.cpp",
                    "file_size": 0
                },
                {
                    "file_additions": 1,
                    "file_deletions": 1,
                    "file_exists": false,
                    "file_name": "src/common/gui/SurgeGUIEditor.cpp",
                    "file_size": 0
                }
            ],
            "interesting": {
                "reopen": false,
                "status": false
            },
            "is_parent": false,
            "sha": "c5418f6fbf63cf46f9011f1aea66bd01bafda64e"
        },
        {
            "associated_pull_request": [
                "https://github.com/surge-synthesizer/surge/pull/2684"
            ],
            "date": "2020-09-24 14:07:36",
            "diff": "surge-synthesizer_surge/issue_2605/commit_b28a98958e2b4cb28855e34fc5a35567efbb7cca.diff",
            "diff_additions": 1254,
            "diff_deletions": 1383,
            "diff_file_size": 2861,
            "diff_url": "https://github.com/surge-synthesizer/surge/commit/b28a98958e2b4cb28855e34fc5a35567efbb7cca.diff",
            "exists": true,
            "files": [
                {
                    "file_additions": 177,
                    "file_deletions": 0,
                    "file_exists": false,
                    "file_name": "src/common/dsp/AudioInputOscillator.cpp",
                    "file_size": 0
                },
                {
                    "file_additions": 4,
                    "file_deletions": 137,
                    "file_exists": false,
                    "file_name": "src/common/dsp/FM2Oscillator.cpp",
                    "file_size": 0
                },
                {
                    "file_additions": 155,
                    "file_deletions": 0,
                    "file_exists": false,
                    "file_name": "src/common/dsp/FM3Oscillator.cpp",
                    "file_size": 0
                },
                {
                    "file_additions": 14,
                    "file_deletions": 825,
                    "file_exists": true,
                    "file_name": "src/common/dsp/Oscillator.cpp",
                    "file_size": 2861
                },
                {
                    "file_additions": 2,
                    "file_deletions": 1,
                    "file_exists": false,
                    "file_name": "src/common/dsp/SampleAndHoldOscillator.cpp",
                    "file_size": 0
                },
                {
                    "file_additions": 680,
                    "file_deletions": 0,
                    "file_exists": false,
                    "file_name": "src/common/dsp/SinOscillator.cpp",
                    "file_size": 0
                },
                {
                    "file_additions": 2,
                    "file_deletions": 1,
                    "file_exists": false,
                    "file_name": "src/common/dsp/SurgeSuperOscillator.cpp",
                    "file_size": 0
                },
                {
                    "file_additions": 1,
                    "file_deletions": 1,
                    "file_exists": false,
                    "file_name": "src/common/dsp/WavetableOscillator.cpp",
                    "file_size": 0
                },
                {
                    "file_additions": 4,
                    "file_deletions": 1,
                    "file_exists": false,
                    "file_name": "src/common/dsp/WindowOscillator.cpp",
                    "file_size": 0
                },
                {
                    "file_additions": 1,
                    "file_deletions": 1,
                    "file_exists": false,
                    "file_name": "src/common/dsp/effect/ConditionerEffect.cpp",
                    "file_size": 0
                },
                {
                    "file_additions": 1,
                    "file_deletions": 1,
                    "file_exists": false,
                    "file_name": "src/common/dsp/effect/DistortionEffect.cpp",
                    "file_size": 0
                },
                {
                    "file_additions": 1,
                    "file_deletions": 1,
                    "file_exists": false,
                    "file_name": "src/common/dsp/effect/DualDelayEffect.cpp",
                    "file_size": 0
                },
                {
                    "file_additions": 13,
                    "file_deletions": 401,
                    "file_exists": false,
                    "file_name": "src/common/dsp/effect/Effect.cpp",
                    "file_size": 0
                },
                {
                    "file_additions": 186,
                    "file_deletions": 0,
                    "file_exists": false,
                    "file_name": "src/common/dsp/effect/Eq3BandEffect.cpp",
                    "file_size": 0
                },
                {
                    "file_additions": 1,
                    "file_deletions": 1,
                    "file_exists": false,
                    "file_name": "src/common/dsp/effect/FlangerEffect.cpp",
                    "file_size": 0
                },
                {
                    "file_additions": 1,
                    "file_deletions": 1,
                    "file_exists": false,
                    "file_name": "src/common/dsp/effect/FreqshiftEffect.cpp",
                    "file_size": 0
                },
                {
                    "file_additions": 1,
                    "file_deletions": 1,
                    "file_exists": false,
                    "file_name": "src/common/dsp/effect/PhaserEffect.cpp",
                    "file_size": 0
                },
                {
                    "file_additions": 1,
                    "file_deletions": 1,
                    "file_exists": false,
                    "file_name": "src/common/dsp/effect/Reverb1Effect.cpp",
                    "file_size": 0
                },
                {
                    "file_additions": 1,
                    "file_deletions": 1,
                    "file_exists": false,
                    "file_name": "src/common/dsp/effect/Reverb2Effect.cpp",
                    "file_size": 0
                },
                {
                    "file_additions": 5,
                    "file_deletions": 5,
                    "file_exists": false,
                    "file_name": "src/common/dsp/effect/RingModulatorEffect.cpp",
                    "file_size": 0
                },
                {
                    "file_additions": 1,
                    "file_deletions": 1,
                    "file_exists": false,
                    "file_name": "src/common/dsp/effect/RotarySpeakerEffect.cpp",
                    "file_size": 0
                },
                {
                    "file_additions": 1,
                    "file_deletions": 1,
                    "file_exists": false,
                    "file_name": "src/common/dsp/effect/VocoderEffect.cpp",
                    "file_size": 0
                },
                {
                    "file_additions": 1,
                    "file_deletions": 1,
                    "file_exists": false,
                    "file_name": "src/common/gui/SurgeGUIEditor.cpp",
                    "file_size": 0
                }
            ],
            "interesting": {
                "reopen": false,
                "status": false
            },
            "is_parent": false,
            "sha": "b28a98958e2b4cb28855e34fc5a35567efbb7cca"
        }
    ],
    "first_commit": "2020-09-24 11:32:12",
    "last_commit": "2020-09-24 14:07:36",
    "number": 2605,
    "pull_request": "None",
    "score": {
        "accidental_reopen_likely": false,
        "all_labels": [
            "Code Cleanup"
        ],
        "contains_keywords": [
            "fix"
        ],
        "fix_size": 1433,
        "has_labels": [],
        "intersecting": {
            "computed_score": 1.0,
            "final_commit_size": 1432,
            "intersection_size": 1432,
            "previous_commits_size": 1433
        },
        "is_makefile_based": true,
        "no_new_files": [],
        "no_other_files": false,
        "num_prohibited_files": 33930,
        "prohibited_files": [
            "tools/building.py",
            "tools/building.py",
            "tools/building.py",
            "emcc.py",
            "src/library_emmalloc.js",
            "src/shell.js",
            "tests/test_core.py",
            "src/shell.js",
            "tests/test_core.py",
            "src/library.js"
        ],
        "reopen": false,
        "reopen_events": [
            [
                "2020-09-24 12:51:12",
                "commit"
            ],
            [
                "2020-09-24 13:57:36",
                "commit"
            ],
            [
                "2020-09-24 14:07:37",
                "closed"
            ],
            [
                "2020-09-24 14:07:39",
                "commit"
            ]
        ],
        "status": true,
        "strategy": true,
        "total_changes": 7940
    }
}