{
    "covered_issues": [
        1020,
        1019,
        968,
        944,
        937,
        844,
        843,
        818,
        816,
        789,
        657,
        645,
        622,
        509,
        506,
        488,
        475,
        468,
        403,
        350,
        338,
        327,
        314,
        267,
        256,
        251,
        231,
        217,
        203,
        130,
        128,
        120,
        111,
        110,
        109,
        108,
        102,
        100,
        71,
        66,
        65,
        53,
        44,
        43,
        42,
        39,
        37,
        35,
        34
    ],
    "finished": true
}