{
    "all_issues": 3264,
    "interesting_issues": 3,
    "last_update": "2021-05-16 20:11:09.187716",
    "license": {
        "download": "https://raw.githubusercontent.com/pocoproject/poco/master/LICENSE",
        "name": "Other"
    },
    "ratio": 0.0009191176470588235,
    "size": 138227,
    "stars": 5195,
    "url": "https://github.com/pocoproject/poco"
}