{
    "covered_issues": [
        150,
        140,
        134,
        130,
        129,
        108,
        103,
        80,
        78,
        74,
        72,
        71,
        69,
        68,
        66,
        63,
        61,
        60,
        59,
        58,
        55,
        51,
        50,
        48,
        46,
        45,
        42,
        32,
        31,
        29,
        21,
        20,
        19,
        17,
        16,
        15,
        14,
        11,
        9,
        8,
        7,
        6,
        3,
        2,
        1
    ],
    "finished": true
}