{
    "category": [
        "hardware/OS",
        "feature request"
    ],
    "commits": [
        {
            "associated_pull_request": [
                "https://github.com/surge-synthesizer/surge/pull/1561"
            ],
            "date": "2020-02-10 22:02:30",
            "diff": "surge-synthesizer_surge/issue_1552/commit_db0c460b3c966d07de9ee54c9abd9dea5aa470a8.diff",
            "diff_additions": 186,
            "diff_deletions": 19,
            "diff_file_size": 40400,
            "diff_url": "https://github.com/surge-synthesizer/surge/commit/db0c460b3c966d07de9ee54c9abd9dea5aa470a8.diff",
            "exists": true,
            "files": [
                {
                    "file_additions": 4,
                    "file_deletions": 1,
                    "file_exists": false,
                    "file_name": "src/common/dsp/SampleAndHoldOscillator.cpp",
                    "file_size": 0
                },
                {
                    "file_additions": 28,
                    "file_deletions": 1,
                    "file_exists": false,
                    "file_name": "src/common/dsp/SurgeSuperOscillator.cpp",
                    "file_size": 0
                },
                {
                    "file_additions": 4,
                    "file_deletions": 1,
                    "file_exists": false,
                    "file_name": "src/common/dsp/WavetableOscillator.cpp",
                    "file_size": 0
                },
                {
                    "file_additions": 2,
                    "file_deletions": 4,
                    "file_exists": false,
                    "file_name": "src/common/dsp/WindowOscillator.cpp",
                    "file_size": 0
                },
                {
                    "file_additions": 18,
                    "file_deletions": 12,
                    "file_exists": true,
                    "file_name": "src/headless/UnitTestUtilities.cpp",
                    "file_size": 6745
                },
                {
                    "file_additions": 130,
                    "file_deletions": 0,
                    "file_exists": true,
                    "file_name": "src/headless/UnitTestsDSP.cpp",
                    "file_size": 33655
                }
            ],
            "interesting": {
                "reopen": false,
                "status": false
            },
            "is_parent": true,
            "sha": "db0c460b3c966d07de9ee54c9abd9dea5aa470a8"
        },
        {
            "associated_pull_request": [],
            "date": "2020-02-12 01:23:11",
            "diff": "surge-synthesizer_surge/issue_1552/commit_d9a1557560c983a9b08f28dc332b42a61f1152c1.diff",
            "diff_additions": 25,
            "diff_deletions": 9,
            "diff_file_size": 156001,
            "diff_url": "https://github.com/surge-synthesizer/surge/commit/d9a1557560c983a9b08f28dc332b42a61f1152c1.diff",
            "exists": true,
            "files": [
                {
                    "file_additions": 5,
                    "file_deletions": 2,
                    "file_exists": true,
                    "file_name": "src/common/Parameter.cpp",
                    "file_size": 122346
                },
                {
                    "file_additions": 3,
                    "file_deletions": 2,
                    "file_exists": false,
                    "file_name": "src/common/dsp/SampleAndHoldOscillator.cpp",
                    "file_size": 0
                },
                {
                    "file_additions": 5,
                    "file_deletions": 2,
                    "file_exists": false,
                    "file_name": "src/common/dsp/SurgeSuperOscillator.cpp",
                    "file_size": 0
                },
                {
                    "file_additions": 2,
                    "file_deletions": 1,
                    "file_exists": false,
                    "file_name": "src/common/dsp/WavetableOscillator.cpp",
                    "file_size": 0
                },
                {
                    "file_additions": 3,
                    "file_deletions": 2,
                    "file_exists": false,
                    "file_name": "src/common/dsp/WindowOscillator.cpp",
                    "file_size": 0
                },
                {
                    "file_additions": 7,
                    "file_deletions": 0,
                    "file_exists": true,
                    "file_name": "src/headless/UnitTestsDSP.cpp",
                    "file_size": 33655
                }
            ],
            "interesting": {
                "reopen": false,
                "status": true
            },
            "is_parent": false,
            "sha": "d9a1557560c983a9b08f28dc332b42a61f1152c1"
        },
        {
            "associated_pull_request": [
                "https://github.com/surge-synthesizer/surge/pull/1562"
            ],
            "date": "2020-02-12 01:23:11",
            "diff": "surge-synthesizer_surge/issue_1552/commit_44116ef74d70c93defe54b4beb0b2da121359854.diff",
            "diff_additions": 26,
            "diff_deletions": 10,
            "diff_file_size": 156001,
            "diff_url": "https://github.com/surge-synthesizer/surge/commit/44116ef74d70c93defe54b4beb0b2da121359854.diff",
            "exists": true,
            "files": [
                {
                    "file_additions": 5,
                    "file_deletions": 2,
                    "file_exists": true,
                    "file_name": "src/common/Parameter.cpp",
                    "file_size": 122346
                },
                {
                    "file_additions": 3,
                    "file_deletions": 2,
                    "file_exists": false,
                    "file_name": "src/common/dsp/SampleAndHoldOscillator.cpp",
                    "file_size": 0
                },
                {
                    "file_additions": 5,
                    "file_deletions": 2,
                    "file_exists": false,
                    "file_name": "src/common/dsp/SurgeSuperOscillator.cpp",
                    "file_size": 0
                },
                {
                    "file_additions": 2,
                    "file_deletions": 1,
                    "file_exists": false,
                    "file_name": "src/common/dsp/WavetableOscillator.cpp",
                    "file_size": 0
                },
                {
                    "file_additions": 3,
                    "file_deletions": 2,
                    "file_exists": false,
                    "file_name": "src/common/dsp/WindowOscillator.cpp",
                    "file_size": 0
                },
                {
                    "file_additions": 8,
                    "file_deletions": 1,
                    "file_exists": true,
                    "file_name": "src/headless/UnitTestsDSP.cpp",
                    "file_size": 33655
                }
            ],
            "interesting": {
                "reopen": false,
                "status": false
            },
            "is_parent": false,
            "sha": "44116ef74d70c93defe54b4beb0b2da121359854"
        },
        {
            "associated_pull_request": [
                "https://github.com/surge-synthesizer/surge/pull/1562"
            ],
            "date": "2020-02-12 01:40:17",
            "diff": "surge-synthesizer_surge/issue_1552/commit_bf23770270136a0bb00df3959e790c2fe84564d6.diff",
            "diff_additions": 26,
            "diff_deletions": 10,
            "diff_file_size": 156001,
            "diff_url": "https://github.com/surge-synthesizer/surge/commit/bf23770270136a0bb00df3959e790c2fe84564d6.diff",
            "exists": true,
            "files": [
                {
                    "file_additions": 5,
                    "file_deletions": 2,
                    "file_exists": true,
                    "file_name": "src/common/Parameter.cpp",
                    "file_size": 122346
                },
                {
                    "file_additions": 3,
                    "file_deletions": 2,
                    "file_exists": false,
                    "file_name": "src/common/dsp/SampleAndHoldOscillator.cpp",
                    "file_size": 0
                },
                {
                    "file_additions": 5,
                    "file_deletions": 2,
                    "file_exists": false,
                    "file_name": "src/common/dsp/SurgeSuperOscillator.cpp",
                    "file_size": 0
                },
                {
                    "file_additions": 2,
                    "file_deletions": 1,
                    "file_exists": false,
                    "file_name": "src/common/dsp/WavetableOscillator.cpp",
                    "file_size": 0
                },
                {
                    "file_additions": 3,
                    "file_deletions": 2,
                    "file_exists": false,
                    "file_name": "src/common/dsp/WindowOscillator.cpp",
                    "file_size": 0
                },
                {
                    "file_additions": 8,
                    "file_deletions": 1,
                    "file_exists": true,
                    "file_name": "src/headless/UnitTestsDSP.cpp",
                    "file_size": 33655
                }
            ],
            "interesting": {
                "reopen": false,
                "status": false
            },
            "is_parent": false,
            "sha": "bf23770270136a0bb00df3959e790c2fe84564d6"
        }
    ],
    "first_commit": "2020-02-10 22:02:30",
    "last_commit": "2020-02-12 01:40:17",
    "number": 1552,
    "pull_request": "None",
    "score": {
        "accidental_reopen_likely": false,
        "all_labels": [
            "DSP",
            "Feature Request"
        ],
        "contains_keywords": [
            "issu",
            "problem",
            "chang",
            "work",
            "fix",
            "reason",
            "test"
        ],
        "fix_size": 36,
        "has_labels": [],
        "intersecting": {
            "computed_score": 1.0,
            "final_commit_size": 36,
            "intersection_size": 36,
            "previous_commits_size": 36
        },
        "is_makefile_based": true,
        "no_new_files": [],
        "no_other_files": true,
        "num_prohibited_files": 39836,
        "prohibited_files": [
            "tools/building.py",
            "tools/building.py",
            "tools/building.py",
            "emcc.py",
            "src/library_emmalloc.js",
            "src/shell.js",
            "tests/test_core.py",
            "src/shell.js",
            "tests/test_core.py",
            "src/library.js"
        ],
        "reopen": false,
        "reopen_events": [
            [
                "2020-02-12 01:24:04",
                "commit"
            ],
            [
                "2020-02-12 01:31:41",
                "commit"
            ],
            [
                "2020-02-12 01:40:18",
                "closed"
            ],
            [
                "2020-02-12 01:40:19",
                "commit"
            ]
        ],
        "status": true,
        "strategy": true,
        "total_changes": 311
    }
}