{
    "all_issues": 231,
    "interesting_issues": 11,
    "last_update": "2021-05-16 11:01:11.204231",
    "license": {
        "download": "https://raw.githubusercontent.com/cyring/CoreFreq/master/LICENSE",
        "name": "GNU General Public License v2.0"
    },
    "ratio": 0.047619047619047616,
    "size": 11357,
    "stars": 1048,
    "url": "https://github.com/cyring/CoreFreq"
}