{
    "covered_issues": [
        94,
        91,
        88,
        87,
        86,
        85,
        84,
        83,
        82,
        81,
        78,
        77,
        75,
        73,
        72,
        71,
        70,
        69,
        68,
        66,
        65,
        64,
        62,
        61,
        60,
        59,
        58,
        57,
        56,
        55,
        54,
        53,
        52,
        51,
        50,
        49,
        48,
        47,
        46,
        45,
        44,
        42,
        41,
        40,
        39,
        38,
        37,
        36,
        35,
        34,
        33,
        32,
        31,
        30,
        29,
        28,
        27,
        26,
        25,
        24,
        23,
        22,
        21,
        20,
        17,
        16,
        15,
        14,
        13,
        4
    ],
    "finished": true
}