{
    "covered_issues": [
        1166,
        1164,
        1162,
        1161,
        1160,
        1158,
        1157,
        1152,
        1151,
        1146,
        1142,
        1133,
        1132,
        1129,
        1128,
        1124,
        1122,
        1121,
        1110,
        1109,
        1107,
        1106,
        1105,
        1097,
        1095,
        1094,
        1091,
        1084,
        1083,
        1081,
        1080,
        1079,
        1077,
        1076,
        1075,
        1073,
        1070,
        1068,
        1066,
        1065,
        1064,
        1062,
        1060,
        1059,
        1058,
        1057,
        1054,
        1048,
        1047,
        1046,
        1042,
        1030,
        976,
        971,
        962,
        956,
        955,
        947,
        942,
        930,
        929,
        924,
        920,
        903,
        901,
        891,
        890,
        889,
        888,
        883,
        882,
        879,
        878,
        876,
        874,
        872,
        870,
        868,
        862,
        859,
        858,
        857,
        855,
        853,
        848,
        847,
        844,
        841,
        819,
        812,
        808,
        805,
        803,
        802,
        801,
        800,
        799,
        798,
        794,
        778,
        775,
        773,
        768,
        767,
        764,
        762,
        758,
        750,
        749,
        744,
        740,
        736,
        733,
        730,
        728,
        726,
        725,
        722,
        720,
        715,
        711,
        698,
        689,
        664,
        663,
        658,
        657,
        655,
        654,
        652,
        651,
        644,
        631,
        630,
        625,
        617,
        616,
        614,
        609,
        608,
        607,
        602,
        600,
        596,
        595,
        593,
        592,
        590,
        588,
        586,
        585,
        582,
        579,
        577,
        569,
        568,
        567,
        565,
        563,
        562,
        559,
        543,
        542,
        541,
        538,
        530,
        525,
        514,
        503,
        501,
        499,
        498,
        493,
        477,
        444,
        434,
        423,
        386,
        381,
        380,
        378,
        376,
        375,
        374,
        367,
        360,
        359,
        353,
        352,
        345,
        344,
        343,
        342,
        341,
        339,
        303,
        282,
        228,
        215,
        212,
        192,
        184,
        182,
        167,
        154,
        146,
        137,
        113,
        112,
        111,
        89,
        74,
        69,
        68,
        66,
        59,
        39,
        38,
        37,
        36,
        35,
        34,
        33,
        32,
        31,
        30,
        29,
        28,
        27,
        26,
        25,
        24,
        23,
        22,
        20,
        19,
        18,
        17,
        16,
        15,
        14,
        13,
        12,
        10,
        9,
        8,
        7,
        6,
        4,
        3,
        2,
        1
    ],
    "finished": true
}