{
    "category": [
        "memory"
    ],
    "commits": [
        {
            "associated_pull_request": [
                "https://github.com/varnishcache/varnish-cache/pull/2944"
            ],
            "date": "2019-03-14 10:57:00",
            "diff": "varnishcache_varnish-cache/issue_2946/commit_d0b398738eb615969ae4f92095b130949b0006d7.diff",
            "diff_additions": 2,
            "diff_deletions": 0,
            "diff_file_size": 3035,
            "diff_url": "https://github.com/varnishcache/varnish-cache/commit/d0b398738eb615969ae4f92095b130949b0006d7.diff",
            "exists": true,
            "files": [
                {
                    "file_additions": 2,
                    "file_deletions": 0,
                    "file_exists": true,
                    "file_name": "lib/libvarnish/vte.c",
                    "file_size": 3035
                }
            ],
            "interesting": {
                "reopen": false,
                "status": false
            },
            "is_parent": true,
            "sha": "d0b398738eb615969ae4f92095b130949b0006d7"
        },
        {
            "associated_pull_request": [],
            "date": "2019-03-14 13:49:29",
            "diff": "varnishcache_varnish-cache/issue_2946/commit_d190196e8818c8c792218005a442079f05706a19.diff",
            "diff_additions": 2,
            "diff_deletions": 2,
            "diff_file_size": 30644,
            "diff_url": "https://github.com/varnishcache/varnish-cache/commit/d190196e8818c8c792218005a442079f05706a19.diff",
            "exists": true,
            "files": [
                {
                    "file_additions": 2,
                    "file_deletions": 2,
                    "file_exists": true,
                    "file_name": "bin/varnishd/cache/cache_fetch.c",
                    "file_size": 30644
                }
            ],
            "interesting": {
                "reopen": false,
                "status": false
            },
            "is_parent": false,
            "sha": "d190196e8818c8c792218005a442079f05706a19"
        },
        {
            "associated_pull_request": [],
            "date": "2019-03-15 09:05:51",
            "diff": "varnishcache_varnish-cache/issue_2946/commit_c3a2154991b605d03f49e72b65ee0b633f7f570b.diff",
            "diff_additions": 2,
            "diff_deletions": 0,
            "diff_file_size": 30644,
            "diff_url": "https://github.com/varnishcache/varnish-cache/commit/c3a2154991b605d03f49e72b65ee0b633f7f570b.diff",
            "exists": true,
            "files": [
                {
                    "file_additions": 2,
                    "file_deletions": 0,
                    "file_exists": true,
                    "file_name": "bin/varnishd/cache/cache_fetch.c",
                    "file_size": 30644
                }
            ],
            "interesting": {
                "reopen": false,
                "status": false
            },
            "is_parent": false,
            "sha": "c3a2154991b605d03f49e72b65ee0b633f7f570b"
        },
        {
            "associated_pull_request": [],
            "date": "2019-03-14 13:49:29",
            "diff": "varnishcache_varnish-cache/issue_2946/commit_c0c814fa23f7c38e0e20cac624b00c6ffa684cf4.diff",
            "diff_additions": 2,
            "diff_deletions": 0,
            "diff_file_size": 30644,
            "diff_url": "https://github.com/varnishcache/varnish-cache/commit/c0c814fa23f7c38e0e20cac624b00c6ffa684cf4.diff",
            "exists": true,
            "files": [
                {
                    "file_additions": 2,
                    "file_deletions": 0,
                    "file_exists": true,
                    "file_name": "bin/varnishd/cache/cache_fetch.c",
                    "file_size": 30644
                }
            ],
            "interesting": {
                "reopen": false,
                "status": false
            },
            "is_parent": false,
            "sha": "c0c814fa23f7c38e0e20cac624b00c6ffa684cf4"
        },
        {
            "associated_pull_request": [],
            "date": "2019-03-14 13:49:29",
            "diff": "varnishcache_varnish-cache/issue_2946/commit_de3e581eb49ac3fbfc0f001f3fcd7db5e1ffea7f.diff",
            "diff_additions": 2,
            "diff_deletions": 0,
            "diff_file_size": 30644,
            "diff_url": "https://github.com/varnishcache/varnish-cache/commit/de3e581eb49ac3fbfc0f001f3fcd7db5e1ffea7f.diff",
            "exists": true,
            "files": [
                {
                    "file_additions": 2,
                    "file_deletions": 0,
                    "file_exists": true,
                    "file_name": "bin/varnishd/cache/cache_fetch.c",
                    "file_size": 30644
                }
            ],
            "interesting": {
                "reopen": true,
                "status": false
            },
            "is_parent": false,
            "sha": "de3e581eb49ac3fbfc0f001f3fcd7db5e1ffea7f"
        },
        {
            "associated_pull_request": [],
            "date": "2019-03-17 10:45:18",
            "diff": "varnishcache_varnish-cache/issue_2946/commit_4555de35c05fb00a3bfde3167d147ac8c96a6202.diff",
            "diff_additions": 3,
            "diff_deletions": 0,
            "diff_file_size": 30644,
            "diff_url": "https://github.com/varnishcache/varnish-cache/commit/4555de35c05fb00a3bfde3167d147ac8c96a6202.diff",
            "exists": true,
            "files": [
                {
                    "file_additions": 3,
                    "file_deletions": 0,
                    "file_exists": true,
                    "file_name": "bin/varnishd/cache/cache_fetch.c",
                    "file_size": 30644
                }
            ],
            "interesting": {
                "reopen": false,
                "status": false
            },
            "is_parent": false,
            "sha": "4555de35c05fb00a3bfde3167d147ac8c96a6202"
        },
        {
            "associated_pull_request": [],
            "date": "2019-03-17 10:45:18",
            "diff": "varnishcache_varnish-cache/issue_2946/commit_99da8c8c8a3babad15e5a79ba12f25678bf3f5f1.diff",
            "diff_additions": 3,
            "diff_deletions": 0,
            "diff_file_size": 30644,
            "diff_url": "https://github.com/varnishcache/varnish-cache/commit/99da8c8c8a3babad15e5a79ba12f25678bf3f5f1.diff",
            "exists": true,
            "files": [
                {
                    "file_additions": 3,
                    "file_deletions": 0,
                    "file_exists": true,
                    "file_name": "bin/varnishd/cache/cache_fetch.c",
                    "file_size": 30644
                }
            ],
            "interesting": {
                "reopen": false,
                "status": false
            },
            "is_parent": false,
            "sha": "99da8c8c8a3babad15e5a79ba12f25678bf3f5f1"
        },
        {
            "associated_pull_request": [],
            "date": "2019-03-17 10:45:18",
            "diff": "varnishcache_varnish-cache/issue_2946/commit_26580deba2e9ca39d46e34e8b3ece478723aabe5.diff",
            "diff_additions": 3,
            "diff_deletions": 0,
            "diff_file_size": 30644,
            "diff_url": "https://github.com/varnishcache/varnish-cache/commit/26580deba2e9ca39d46e34e8b3ece478723aabe5.diff",
            "exists": true,
            "files": [
                {
                    "file_additions": 3,
                    "file_deletions": 0,
                    "file_exists": true,
                    "file_name": "bin/varnishd/cache/cache_fetch.c",
                    "file_size": 30644
                }
            ],
            "interesting": {
                "reopen": false,
                "status": false
            },
            "is_parent": false,
            "sha": "26580deba2e9ca39d46e34e8b3ece478723aabe5"
        },
        {
            "associated_pull_request": [],
            "date": "2019-03-17 10:45:18",
            "diff": "varnishcache_varnish-cache/issue_2946/commit_f239fc77822fe89059d835df403580e9613691c5.diff",
            "diff_additions": 3,
            "diff_deletions": 0,
            "diff_file_size": 30644,
            "diff_url": "https://github.com/varnishcache/varnish-cache/commit/f239fc77822fe89059d835df403580e9613691c5.diff",
            "exists": true,
            "files": [
                {
                    "file_additions": 3,
                    "file_deletions": 0,
                    "file_exists": true,
                    "file_name": "bin/varnishd/cache/cache_fetch.c",
                    "file_size": 30644
                }
            ],
            "interesting": {
                "reopen": false,
                "status": false
            },
            "is_parent": false,
            "sha": "f239fc77822fe89059d835df403580e9613691c5"
        },
        {
            "associated_pull_request": [],
            "date": "2019-03-17 10:45:18",
            "diff": "varnishcache_varnish-cache/issue_2946/commit_e4fcf25b2f7d160df328a8169a4caff008a048f7.diff",
            "diff_additions": 3,
            "diff_deletions": 0,
            "diff_file_size": 30644,
            "diff_url": "https://github.com/varnishcache/varnish-cache/commit/e4fcf25b2f7d160df328a8169a4caff008a048f7.diff",
            "exists": true,
            "files": [
                {
                    "file_additions": 3,
                    "file_deletions": 0,
                    "file_exists": true,
                    "file_name": "bin/varnishd/cache/cache_fetch.c",
                    "file_size": 30644
                }
            ],
            "interesting": {
                "reopen": false,
                "status": false
            },
            "is_parent": false,
            "sha": "e4fcf25b2f7d160df328a8169a4caff008a048f7"
        },
        {
            "associated_pull_request": [],
            "date": "2019-03-17 10:45:18",
            "diff": "varnishcache_varnish-cache/issue_2946/commit_e28d9471b0ac3ea6aeb7cc2329c4d9d94e3f2176.diff",
            "diff_additions": 3,
            "diff_deletions": 0,
            "diff_file_size": 30644,
            "diff_url": "https://github.com/varnishcache/varnish-cache/commit/e28d9471b0ac3ea6aeb7cc2329c4d9d94e3f2176.diff",
            "exists": true,
            "files": [
                {
                    "file_additions": 3,
                    "file_deletions": 0,
                    "file_exists": true,
                    "file_name": "bin/varnishd/cache/cache_fetch.c",
                    "file_size": 30644
                }
            ],
            "interesting": {
                "reopen": false,
                "status": false
            },
            "is_parent": false,
            "sha": "e28d9471b0ac3ea6aeb7cc2329c4d9d94e3f2176"
        },
        {
            "associated_pull_request": [],
            "date": "2019-03-17 10:45:18",
            "diff": "varnishcache_varnish-cache/issue_2946/commit_089d7f27ba94c621ed0d685a0daf2bb4bccde43f.diff",
            "diff_additions": 3,
            "diff_deletions": 0,
            "diff_file_size": 30644,
            "diff_url": "https://github.com/varnishcache/varnish-cache/commit/089d7f27ba94c621ed0d685a0daf2bb4bccde43f.diff",
            "exists": true,
            "files": [
                {
                    "file_additions": 3,
                    "file_deletions": 0,
                    "file_exists": true,
                    "file_name": "bin/varnishd/cache/cache_fetch.c",
                    "file_size": 30644
                }
            ],
            "interesting": {
                "reopen": false,
                "status": false
            },
            "is_parent": false,
            "sha": "089d7f27ba94c621ed0d685a0daf2bb4bccde43f"
        },
        {
            "associated_pull_request": [],
            "date": "2019-03-17 10:45:18",
            "diff": "varnishcache_varnish-cache/issue_2946/commit_c1bd13322d35a50ccadf8962f2ca896cb4bc4807.diff",
            "diff_additions": 3,
            "diff_deletions": 0,
            "diff_file_size": 30644,
            "diff_url": "https://github.com/varnishcache/varnish-cache/commit/c1bd13322d35a50ccadf8962f2ca896cb4bc4807.diff",
            "exists": true,
            "files": [
                {
                    "file_additions": 3,
                    "file_deletions": 0,
                    "file_exists": true,
                    "file_name": "bin/varnishd/cache/cache_fetch.c",
                    "file_size": 30644
                }
            ],
            "interesting": {
                "reopen": false,
                "status": false
            },
            "is_parent": false,
            "sha": "c1bd13322d35a50ccadf8962f2ca896cb4bc4807"
        },
        {
            "associated_pull_request": [],
            "date": "2019-03-17 10:45:18",
            "diff": "varnishcache_varnish-cache/issue_2946/commit_750a9dbe9eae4bd101dbfe20228c8db35c55abc9.diff",
            "diff_additions": 3,
            "diff_deletions": 0,
            "diff_file_size": 30644,
            "diff_url": "https://github.com/varnishcache/varnish-cache/commit/750a9dbe9eae4bd101dbfe20228c8db35c55abc9.diff",
            "exists": true,
            "files": [
                {
                    "file_additions": 3,
                    "file_deletions": 0,
                    "file_exists": true,
                    "file_name": "bin/varnishd/cache/cache_fetch.c",
                    "file_size": 30644
                }
            ],
            "interesting": {
                "reopen": false,
                "status": false
            },
            "is_parent": false,
            "sha": "750a9dbe9eae4bd101dbfe20228c8db35c55abc9"
        },
        {
            "associated_pull_request": [
                "https://github.com/varnishcache/varnish-cache/pull/2951"
            ],
            "date": "2019-03-17 10:45:18",
            "diff": "varnishcache_varnish-cache/issue_2946/commit_9c10c5aca8b2595997f5ce490991d734d6af6928.diff",
            "diff_additions": 5,
            "diff_deletions": 0,
            "diff_file_size": 30644,
            "diff_url": "https://github.com/varnishcache/varnish-cache/commit/9c10c5aca8b2595997f5ce490991d734d6af6928.diff",
            "exists": true,
            "files": [
                {
                    "file_additions": 5,
                    "file_deletions": 0,
                    "file_exists": true,
                    "file_name": "bin/varnishd/cache/cache_fetch.c",
                    "file_size": 30644
                }
            ],
            "interesting": {
                "reopen": false,
                "status": true
            },
            "is_parent": false,
            "sha": "9c10c5aca8b2595997f5ce490991d734d6af6928"
        },
        {
            "associated_pull_request": [],
            "date": "2019-03-14 13:49:29",
            "diff": "varnishcache_varnish-cache/issue_2946/commit_86adc05431bf1a34dad04292cb8337885baae3aa.diff",
            "diff_additions": 2,
            "diff_deletions": 0,
            "diff_file_size": 30644,
            "diff_url": "https://github.com/varnishcache/varnish-cache/commit/86adc05431bf1a34dad04292cb8337885baae3aa.diff",
            "exists": true,
            "files": [
                {
                    "file_additions": 2,
                    "file_deletions": 0,
                    "file_exists": true,
                    "file_name": "bin/varnishd/cache/cache_fetch.c",
                    "file_size": 30644
                }
            ],
            "interesting": {
                "reopen": false,
                "status": false
            },
            "is_parent": false,
            "sha": "86adc05431bf1a34dad04292cb8337885baae3aa"
        },
        {
            "associated_pull_request": [],
            "date": "2019-03-17 10:45:18",
            "diff": "varnishcache_varnish-cache/issue_2946/commit_e8ec37b490b668920b057efdf88cf2e387b58296.diff",
            "diff_additions": 5,
            "diff_deletions": 0,
            "diff_file_size": 30644,
            "diff_url": "https://github.com/varnishcache/varnish-cache/commit/e8ec37b490b668920b057efdf88cf2e387b58296.diff",
            "exists": true,
            "files": [
                {
                    "file_additions": 5,
                    "file_deletions": 0,
                    "file_exists": true,
                    "file_name": "bin/varnishd/cache/cache_fetch.c",
                    "file_size": 30644
                }
            ],
            "interesting": {
                "reopen": false,
                "status": false
            },
            "is_parent": false,
            "sha": "e8ec37b490b668920b057efdf88cf2e387b58296"
        }
    ],
    "first_commit": "2019-03-14 10:57:00",
    "last_commit": "2019-07-11 23:34:47",
    "number": 2946,
    "pull_request": "None",
    "score": {
        "accidental_reopen_likely": false,
        "all_labels": [],
        "contains_keywords": [
            "fix",
            "reason",
            "fault",
            "test",
            "remov",
            "error",
            "chang",
            "leak"
        ],
        "fix_size": 13,
        "has_labels": [],
        "intersecting": {
            "computed_score": 1.0,
            "final_commit_size": 6,
            "intersection_size": 6,
            "previous_commits_size": 13
        },
        "is_makefile_based": true,
        "no_new_files": [],
        "no_other_files": false,
        "num_prohibited_files": 324534,
        "prohibited_files": [
            "kill.h",
            "meminfo.h",
            "kill.h",
            "meminfo.h",
            "kill.h",
            "meminfo.h",
            "testsuite_cli_test.go",
            "testsuite_cli_test.go",
            "common.mk",
            "i3bar/include/draw_util.h"
        ],
        "reopen": true,
        "reopen_events": [
            [
                "2019-03-14 13:51:05",
                "commit"
            ],
            [
                "2019-03-14 15:49:27",
                "commit"
            ],
            [
                "2019-03-14 16:05:24",
                "commit"
            ],
            [
                "2019-03-15 08:52:26",
                "commit"
            ],
            [
                "2019-03-15 08:59:19",
                "commit"
            ],
            [
                "2019-03-15 08:59:19",
                "commit"
            ],
            [
                "2019-03-15 08:59:19",
                "commit"
            ],
            [
                "2019-03-15 09:08:00",
                "commit"
            ],
            [
                "2019-03-15 09:19:03",
                "commit"
            ],
            [
                "2019-03-15 09:22:38",
                "closed"
            ],
            [
                "2019-03-15 09:22:38",
                "commit"
            ],
            [
                "2019-03-15 12:07:34",
                "reopened"
            ],
            [
                "2019-03-17 13:13:49",
                "commit"
            ],
            [
                "2019-03-17 13:22:00",
                "commit"
            ],
            [
                "2019-03-22 14:34:14",
                "commit"
            ],
            [
                "2019-03-23 17:07:23",
                "commit"
            ],
            [
                "2019-04-04 17:25:10",
                "commit"
            ],
            [
                "2019-04-08 08:22:04",
                "commit"
            ],
            [
                "2019-04-08 14:50:12",
                "commit"
            ],
            [
                "2019-04-10 11:22:19",
                "commit"
            ],
            [
                "2019-04-10 11:39:45",
                "commit"
            ],
            [
                "2019-04-15 13:38:25",
                "commit"
            ],
            [
                "2019-04-15 13:38:56",
                "closed"
            ],
            [
                "2019-07-11 23:40:05",
                "commit"
            ],
            [
                "2019-07-11 23:40:05",
                "commit"
            ]
        ],
        "status": false,
        "strategy": true,
        "total_changes": 51
    }
}