{
    "commits": [
        {
            "associated_pull_request": [],
            "date": "2015-01-09 10:57:46+00:00",
            "diff": "tuanpmt_esp_mqtt/issue_24/commit_fa88410ed45f98c73da4a83990571df1d8063b99.diff",
            "diff_additions": 4,
            "diff_deletions": 7,
            "diff_file_size": 0,
            "diff_url": "https://github.com/tuanpmt/esp_mqtt/commit/fa88410ed45f98c73da4a83990571df1d8063b99.diff",
            "exists": true,
            "files": [
                {
                    "file_additions": 3,
                    "file_deletions": 5,
                    "file_exists": false,
                    "file_name": "user/config.c",
                    "file_size": 0
                },
                {
                    "file_additions": 1,
                    "file_deletions": 2,
                    "file_exists": false,
                    "file_name": "user/mqtt.c",
                    "file_size": 0
                }
            ],
            "interesting": {
                "reopen": false,
                "status": false
            },
            "is_parent": true,
            "sha": "fa88410ed45f98c73da4a83990571df1d8063b99"
        },
        {
            "associated_pull_request": [],
            "date": "2015-01-13 11:56:03+00:00",
            "diff": "tuanpmt_esp_mqtt/issue_24/commit_1995cb812a54f001362661f30281e31e3e6c9708.diff",
            "diff_additions": 294,
            "diff_deletions": 84,
            "diff_file_size": 4552,
            "diff_url": "https://github.com/tuanpmt/esp_mqtt/commit/1995cb812a54f001362661f30281e31e3e6c9708.diff",
            "exists": true,
            "files": [
                {
                    "file_additions": 1,
                    "file_deletions": 1,
                    "file_exists": false,
                    "file_name": "user/config.c",
                    "file_size": 0
                },
                {
                    "file_additions": 42,
                    "file_deletions": 79,
                    "file_exists": false,
                    "file_name": "user/mqtt.c",
                    "file_size": 0
                },
                {
                    "file_additions": 129,
                    "file_deletions": 0,
                    "file_exists": false,
                    "file_name": "user/proto.c",
                    "file_size": 0
                },
                {
                    "file_additions": 51,
                    "file_deletions": 0,
                    "file_exists": false,
                    "file_name": "user/queue.c",
                    "file_size": 0
                },
                {
                    "file_additions": 67,
                    "file_deletions": 0,
                    "file_exists": false,
                    "file_name": "user/ringbuf.c",
                    "file_size": 0
                },
                {
                    "file_additions": 4,
                    "file_deletions": 4,
                    "file_exists": true,
                    "file_name": "user/user_main.c",
                    "file_size": 4552
                }
            ],
            "interesting": {
                "reopen": true,
                "status": false
            },
            "is_parent": false,
            "sha": "1995cb812a54f001362661f30281e31e3e6c9708"
        },
        {
            "associated_pull_request": [],
            "date": "2015-01-14 02:14:13+00:00",
            "diff": "tuanpmt_esp_mqtt/issue_24/commit_008fd11b590f671c5093ef73dd9b08f4eb488aa1.diff",
            "diff_additions": 12,
            "diff_deletions": 14,
            "diff_file_size": 4552,
            "diff_url": "https://github.com/tuanpmt/esp_mqtt/commit/008fd11b590f671c5093ef73dd9b08f4eb488aa1.diff",
            "exists": true,
            "files": [
                {
                    "file_additions": 7,
                    "file_deletions": 7,
                    "file_exists": false,
                    "file_name": "user/mqtt.c",
                    "file_size": 0
                },
                {
                    "file_additions": 1,
                    "file_deletions": 1,
                    "file_exists": false,
                    "file_name": "user/proto.c",
                    "file_size": 0
                },
                {
                    "file_additions": 4,
                    "file_deletions": 6,
                    "file_exists": true,
                    "file_name": "user/user_main.c",
                    "file_size": 4552
                }
            ],
            "interesting": {
                "reopen": false,
                "status": false
            },
            "is_parent": false,
            "sha": "008fd11b590f671c5093ef73dd9b08f4eb488aa1"
        }
    ],
    "first_commit": "2015-01-09 10:57:46+00:00",
    "last_commit": "2015-01-14 02:14:13+00:00",
    "number": 24,
    "pull_request": "None",
    "score": {
        "accidental_reopen_likely": false,
        "all_labels": [],
        "contains_keywords": [
            "work",
            "fail",
            "fix",
            "issu",
            "CI",
            "debug",
            "reason",
            "test",
            "warn",
            "bug",
            "problem",
            "crash"
        ],
        "fix_size": 127,
        "has_labels": [],
        "intersecting": {
            "computed_score": 0.7,
            "final_commit_size": 20,
            "intersection_size": 14,
            "previous_commits_size": 121
        },
        "is_makefile_based": true,
        "no_new_files": [
            "user/proto.c"
        ],
        "no_other_files": false,
        "num_prohibited_files": 159591,
        "prohibited_files": [
            "server/src/main/java/com/genymobile/scrcpy/Device.java",
            "server/src/main/java/com/genymobile/scrcpy/wrappers/SurfaceControl.java",
            "server/src/main/java/com/genymobile/scrcpy/Device.java",
            "server/src/main/java/com/genymobile/scrcpy/wrappers/SurfaceControl.java",
            "app/meson.build",
            "app/scrcpy.1",
            "app/src/common.h",
            "app/src/scrcpy.h",
            "app/src/server.h",
            "server/src/main/java/com/genymobile/scrcpy/Workarounds.java"
        ],
        "reopen": true,
        "reopen_events": [
            [
                "2015-01-13 11:57:49+00:00",
                "closed"
            ],
            [
                "2015-01-13 11:57:49+00:00",
                "commit"
            ],
            [
                "2015-01-13 12:51:48+00:00",
                "reopened"
            ],
            [
                "2015-01-14 02:14:30+00:00",
                "closed"
            ],
            [
                "2015-01-14 02:14:30+00:00",
                "commit"
            ]
        ],
        "status": false,
        "strategy": true,
        "total_changes": 415
    }
}