{
    "commits": [
        {
            "diff": "elastic_elasticsearch/issue_50209/commit_7b863dc25b358a1de8a026c5aff2f9cae739aca9.diff",
            "diff_additions": 2,
            "diff_deletions": 1,
            "diff_file_size": 13455,
            "files": [
                {
                    "file_additions": 2,
                    "file_deletions": 1,
                    "file_exists": true,
                    "file_name": "server/src/main/java/org/elasticsearch/indices/recovery/RecoverySettings.java",
                    "file_size": 13455
                }
            ],
            "interesting": {
                "reopened": false,
                "status": false
            },
            "sha": "7b863dc25b358a1de8a026c5aff2f9cae739aca9"
        },
        {
            "diff": "elastic_elasticsearch/issue_50209/commit_b7b2c7c60a8f5cea93a8d94bcd912ab4592b1fec.diff",
            "diff_additions": 1,
            "diff_deletions": 0,
            "diff_file_size": 14046,
            "files": [
                {
                    "file_additions": 1,
                    "file_deletions": 0,
                    "file_exists": true,
                    "file_name": "modules/ingest-common/src/test/java/org/elasticsearch/ingest/common/CsvProcessorTests.java",
                    "file_size": 14046
                }
            ],
            "interesting": {
                "reopened": true,
                "status": false
            },
            "sha": "b7b2c7c60a8f5cea93a8d94bcd912ab4592b1fec"
        },
        {
            "diff": "elastic_elasticsearch/issue_50209/commit_8ff65f355f7556f113fbd70bcea8cfacb590f1a2.diff",
            "diff_additions": 2,
            "diff_deletions": 1,
            "diff_file_size": 14046,
            "files": [
                {
                    "file_additions": 2,
                    "file_deletions": 1,
                    "file_exists": true,
                    "file_name": "modules/ingest-common/src/test/java/org/elasticsearch/ingest/common/CsvProcessorTests.java",
                    "file_size": 14046
                }
            ],
            "interesting": {
                "reopened": false,
                "status": false
            },
            "sha": "8ff65f355f7556f113fbd70bcea8cfacb590f1a2"
        },
        {
            "diff": "elastic_elasticsearch/issue_50209/commit_4ea1b06562ff41ea4e32cbea1f0d426b6564192a.diff",
            "diff_additions": 2,
            "diff_deletions": 1,
            "diff_file_size": 14046,
            "files": [
                {
                    "file_additions": 2,
                    "file_deletions": 1,
                    "file_exists": true,
                    "file_name": "modules/ingest-common/src/test/java/org/elasticsearch/ingest/common/CsvProcessorTests.java",
                    "file_size": 14046
                }
            ],
            "interesting": {
                "reopened": false,
                "status": false
            },
            "sha": "4ea1b06562ff41ea4e32cbea1f0d426b6564192a"
        },
        {
            "diff": "elastic_elasticsearch/issue_50209/commit_ac1bff6bfecd9b4a7b157717355612bd497c3291.diff",
            "diff_additions": 2,
            "diff_deletions": 1,
            "diff_file_size": 14046,
            "files": [
                {
                    "file_additions": 2,
                    "file_deletions": 1,
                    "file_exists": true,
                    "file_name": "modules/ingest-common/src/test/java/org/elasticsearch/ingest/common/CsvProcessorTests.java",
                    "file_size": 14046
                }
            ],
            "interesting": {
                "reopened": false,
                "status": false
            },
            "sha": "ac1bff6bfecd9b4a7b157717355612bd497c3291"
        },
        {
            "diff": "elastic_elasticsearch/issue_50209/commit_c827f6f440e4c50649ed710e205498ac3e1a91fc.diff",
            "diff_additions": 2,
            "diff_deletions": 1,
            "diff_file_size": 14046,
            "files": [
                {
                    "file_additions": 2,
                    "file_deletions": 1,
                    "file_exists": true,
                    "file_name": "modules/ingest-common/src/test/java/org/elasticsearch/ingest/common/CsvProcessorTests.java",
                    "file_size": 14046
                }
            ],
            "interesting": {
                "reopened": false,
                "status": false
            },
            "sha": "c827f6f440e4c50649ed710e205498ac3e1a91fc"
        }
    ],
    "first_commit": "2019-12-16 20:59:54",
    "last_commit": "2020-02-07 20:00:39",
    "number": 50209,
    "score": 144.25
}