{
    "commits": [
        {
            "associated_pull_request": [],
            "date": "2014-12-22 21:24:47+00:00",
            "diff": "esnet_iperf/issue_230/commit_4450b1b86d4d6f61d3f408c44f4e87f3c1a5d700.diff",
            "diff_additions": 1,
            "diff_deletions": 1,
            "diff_file_size": 169127,
            "diff_url": "https://github.com/esnet/iperf/commit/4450b1b86d4d6f61d3f408c44f4e87f3c1a5d700.diff",
            "exists": true,
            "files": [
                {
                    "file_additions": 1,
                    "file_deletions": 1,
                    "file_exists": true,
                    "file_name": "src/iperf_api.c",
                    "file_size": 169127
                }
            ],
            "interesting": {
                "reopen": false,
                "status": false
            },
            "is_parent": true,
            "sha": "4450b1b86d4d6f61d3f408c44f4e87f3c1a5d700"
        },
        {
            "associated_pull_request": [],
            "date": "2014-12-22 22:45:40+00:00",
            "diff": "esnet_iperf/issue_230/commit_dba611dbe4914f3eb908cec782cd9b5eee1450da.diff",
            "diff_additions": 21,
            "diff_deletions": 1,
            "diff_file_size": 199466,
            "diff_url": "https://github.com/esnet/iperf/commit/dba611dbe4914f3eb908cec782cd9b5eee1450da.diff",
            "exists": true,
            "files": [
                {
                    "file_additions": 18,
                    "file_deletions": 1,
                    "file_exists": true,
                    "file_name": "src/iperf_api.c",
                    "file_size": 169127
                },
                {
                    "file_additions": 1,
                    "file_deletions": 0,
                    "file_exists": true,
                    "file_name": "src/iperf_locale.c",
                    "file_size": 24795
                },
                {
                    "file_additions": 2,
                    "file_deletions": 0,
                    "file_exists": true,
                    "file_name": "src/main.c",
                    "file_size": 5544
                }
            ],
            "interesting": {
                "reopen": true,
                "status": false
            },
            "is_parent": false,
            "sha": "dba611dbe4914f3eb908cec782cd9b5eee1450da"
        },
        {
            "associated_pull_request": [],
            "date": "2014-12-22 22:45:40+00:00",
            "diff": "esnet_iperf/issue_230/commit_f2685ece93ca1dbb9a1bc06aeecd5d11a4e98443.diff",
            "diff_additions": 23,
            "diff_deletions": 3,
            "diff_file_size": 199466,
            "diff_url": "https://github.com/esnet/iperf/commit/f2685ece93ca1dbb9a1bc06aeecd5d11a4e98443.diff",
            "exists": true,
            "files": [
                {
                    "file_additions": 19,
                    "file_deletions": 2,
                    "file_exists": true,
                    "file_name": "src/iperf_api.c",
                    "file_size": 169127
                },
                {
                    "file_additions": 2,
                    "file_deletions": 1,
                    "file_exists": true,
                    "file_name": "src/iperf_locale.c",
                    "file_size": 24795
                },
                {
                    "file_additions": 2,
                    "file_deletions": 0,
                    "file_exists": true,
                    "file_name": "src/main.c",
                    "file_size": 5544
                }
            ],
            "interesting": {
                "reopen": false,
                "status": false
            },
            "is_parent": false,
            "sha": "f2685ece93ca1dbb9a1bc06aeecd5d11a4e98443"
        }
    ],
    "first_commit": "2014-12-22 21:24:47+00:00",
    "last_commit": "2015-01-08 19:29:02+00:00",
    "number": 230,
    "pull_request": "None",
    "score": {
        "accidental_reopen_likely": false,
        "all_labels": [
            "enhancement"
        ],
        "contains_keywords": [
            "fix",
            "issu",
            "patch",
            "reason",
            "test",
            "error",
            "problem"
        ],
        "fix_size": 49,
        "has_labels": [],
        "intersecting": {
            "computed_score": 0.1111111111111111,
            "final_commit_size": 27,
            "intersection_size": 3,
            "previous_commits_size": 25
        },
        "is_makefile_based": true,
        "no_new_files": [],
        "no_other_files": false,
        "num_prohibited_files": 64956,
        "prohibited_files": [
            "server/src/main/java/com/genymobile/scrcpy/Device.java",
            "server/src/main/java/com/genymobile/scrcpy/wrappers/SurfaceControl.java",
            "server/src/main/java/com/genymobile/scrcpy/Device.java",
            "server/src/main/java/com/genymobile/scrcpy/wrappers/SurfaceControl.java",
            "app/meson.build",
            "app/scrcpy.1",
            "app/src/common.h",
            "app/src/scrcpy.h",
            "app/src/server.h",
            "server/src/main/java/com/genymobile/scrcpy/Workarounds.java"
        ],
        "reopen": true,
        "reopen_events": [
            [
                "2014-12-22 22:47:46+00:00",
                "closed"
            ],
            [
                "2014-12-22 22:47:46+00:00",
                "commit"
            ],
            [
                "2014-12-22 22:49:20+00:00",
                "reopened"
            ],
            [
                "2015-01-08 19:29:19+00:00",
                "commit"
            ],
            [
                "2015-01-14 16:27:45+00:00",
                "closed"
            ]
        ],
        "status": false,
        "strategy": true,
        "total_changes": 50
    }
}