{
    "covered_issues": [
        858,
        850,
        848,
        846,
        844,
        842,
        840,
        838,
        837,
        827,
        823,
        822,
        820,
        814,
        807,
        806,
        803,
        802,
        797,
        796,
        791,
        786,
        785,
        780,
        776,
        773,
        771,
        767,
        766,
        760,
        758,
        756,
        755,
        754,
        752,
        747,
        743,
        742,
        735,
        730,
        729,
        728,
        726,
        725,
        723,
        719,
        716,
        715,
        710,
        709,
        702,
        699,
        693,
        692,
        690,
        689,
        686,
        685,
        684,
        683,
        682,
        679,
        676,
        674,
        672,
        671,
        670,
        669,
        668,
        661,
        660,
        659,
        658,
        655,
        653,
        651,
        649,
        647,
        646,
        642,
        641,
        637,
        636,
        635,
        634,
        633,
        631,
        629,
        628,
        623,
        622,
        621,
        620,
        618,
        617,
        616,
        615,
        613,
        609,
        608,
        606,
        605,
        593,
        587,
        585,
        584,
        583,
        582,
        579,
        578,
        577,
        574,
        573,
        571,
        565,
        564,
        562,
        559,
        556,
        550,
        549,
        547,
        546,
        544,
        538,
        537,
        536,
        534,
        532,
        531,
        528,
        524,
        523,
        521,
        520,
        518,
        517,
        515,
        513,
        512,
        505,
        504,
        503,
        502,
        494,
        488,
        486,
        480,
        479,
        477,
        470,
        464,
        463,
        461,
        456,
        455,
        450,
        447,
        445,
        442,
        424,
        422,
        419,
        417,
        416,
        415,
        413,
        404,
        397,
        396,
        387,
        384,
        382,
        378,
        377,
        373,
        371,
        368,
        361,
        356,
        351,
        340,
        332,
        314,
        305,
        296,
        294,
        293,
        290,
        288,
        287,
        280,
        276,
        275,
        274,
        272,
        262,
        258,
        254,
        252,
        250,
        249,
        247,
        246,
        245,
        244,
        236,
        235,
        232,
        227,
        223,
        222,
        221,
        214,
        213,
        212,
        206,
        204,
        200,
        199,
        198,
        192,
        191,
        190,
        189,
        185,
        183,
        173,
        172,
        171,
        166,
        165,
        158,
        154,
        149,
        136,
        128,
        122,
        121,
        117,
        111,
        110,
        109,
        108,
        101,
        100,
        98,
        95,
        94,
        93,
        89,
        88,
        82,
        81,
        79,
        78,
        76,
        75,
        61,
        60,
        58,
        57,
        51,
        50,
        49,
        45,
        41,
        39,
        38,
        35,
        34,
        33,
        28,
        27,
        22,
        21,
        1
    ],
    "finished": true
}