{
    "commits": [
        {
            "associated_pull_request": [],
            "date": "2023-01-19 18:49:54+00:00",
            "diff": "",
            "diff_additions": 0,
            "diff_deletions": 0,
            "diff_file_size": 0,
            "diff_url": "https://github.com/php/php-src/commit/0df92d218e88a0070fcebd5391e7ba8fa0f4c4a5.diff",
            "exists": true,
            "files": [],
            "interesting": {
                "reopen": false,
                "status": true
            },
            "is_parent": true,
            "sha": "0df92d218e88a0070fcebd5391e7ba8fa0f4c4a5"
        },
        {
            "associated_pull_request": [],
            "date": "2023-01-19 19:15:42+00:00",
            "diff": "php_php-src/issue_10292/commit_57d20e27ea86978d3178b9621e898f3604ececb0.diff",
            "diff_additions": 3,
            "diff_deletions": 2,
            "diff_file_size": 22361,
            "diff_url": "https://github.com/php/php-src/commit/57d20e27ea86978d3178b9621e898f3604ececb0.diff",
            "exists": true,
            "files": [
                {
                    "file_additions": 3,
                    "file_deletions": 2,
                    "file_exists": true,
                    "file_name": "ext/random/random.c",
                    "file_size": 22361
                }
            ],
            "interesting": {
                "reopen": false,
                "status": false
            },
            "is_parent": false,
            "sha": "57d20e27ea86978d3178b9621e898f3604ececb0"
        },
        {
            "associated_pull_request": [
                "https://github.com/php/php-src/pull/10380"
            ],
            "date": "2023-01-20 22:35:08+00:00",
            "diff": "php_php-src/issue_10292/commit_1f05d6ef8050803dd9ba4ae640697fff534e93a2.diff",
            "diff_additions": 3,
            "diff_deletions": 2,
            "diff_file_size": 22361,
            "diff_url": "https://github.com/php/php-src/commit/1f05d6ef8050803dd9ba4ae640697fff534e93a2.diff",
            "exists": true,
            "files": [
                {
                    "file_additions": 3,
                    "file_deletions": 2,
                    "file_exists": true,
                    "file_name": "ext/random/random.c",
                    "file_size": 22361
                }
            ],
            "interesting": {
                "reopen": false,
                "status": true
            },
            "is_parent": false,
            "sha": "1f05d6ef8050803dd9ba4ae640697fff534e93a2"
        }
    ],
    "first_commit": "2023-01-19 18:49:54+00:00",
    "last_commit": "2023-01-24 18:56:29+00:00",
    "number": 10292,
    "pull_request": "None",
    "score": {
        "accidental_reopen_likely": false,
        "all_labels": [
            "Bug",
            "Extension: standard",
            "Status: Verified",
            "Extension: random"
        ],
        "contains_keywords": [
            "work",
            "chang",
            "fix",
            "issu",
            "reason",
            "fault",
            "bug",
            "error",
            "problem"
        ],
        "fix_size": 6,
        "has_labels": [],
        "intersecting": {
            "computed_score": 1.0,
            "final_commit_size": 6,
            "intersection_size": 6,
            "previous_commits_size": 6
        },
        "is_makefile_based": false,
        "no_new_files": [],
        "no_other_files": false,
        "num_prohibited_files": 5624,
        "prohibited_files": [
            "server/src/main/java/com/genymobile/scrcpy/Device.java",
            "server/src/main/java/com/genymobile/scrcpy/wrappers/SurfaceControl.java",
            "server/src/main/java/com/genymobile/scrcpy/Device.java",
            "server/src/main/java/com/genymobile/scrcpy/wrappers/SurfaceControl.java",
            "app/meson.build",
            "app/scrcpy.1",
            "app/src/common.h",
            "app/src/scrcpy.h",
            "app/src/server.h",
            "server/src/main/java/com/genymobile/scrcpy/Workarounds.java"
        ],
        "reopen": false,
        "reopen_events": [
            [
                "2023-01-19 19:16:31+00:00",
                "commit"
            ],
            [
                "2023-01-19 19:18:45+00:00",
                "commit"
            ],
            [
                "2023-01-20 22:35:10+00:00",
                "closed"
            ],
            [
                "2023-01-20 22:35:11+00:00",
                "commit"
            ],
            [
                "2023-01-24 09:20:14+00:00",
                "commit"
            ],
            [
                "2023-01-24 18:57:48+00:00",
                "commit"
            ],
            [
                "2023-01-24 18:57:49+00:00",
                "commit"
            ],
            [
                "2023-01-24 18:57:49+00:00",
                "commit"
            ]
        ],
        "status": true,
        "strategy": true,
        "total_changes": 10
    }
}