{
    "commits": [
        {
            "associated_pull_request": [],
            "date": "2020-06-08 21:17:54+00:00",
            "diff": "hamlib_hamlib/issue_288/commit_62cf4e5a882270b8515af198718b6abe192ae2e6.diff",
            "diff_additions": 5,
            "diff_deletions": 5,
            "diff_file_size": 3298,
            "diff_url": "https://github.com/Hamlib/Hamlib/commit/62cf4e5a882270b8515af198718b6abe192ae2e6.diff",
            "exists": true,
            "files": [
                {
                    "file_additions": 1,
                    "file_deletions": 1,
                    "file_exists": true,
                    "file_name": "amplifiers/elecraft/kpa1500.c",
                    "file_size": 3298
                },
                {
                    "file_additions": 2,
                    "file_deletions": 2,
                    "file_exists": false,
                    "file_name": "dummy/amp_dummy.c",
                    "file_size": 0
                },
                {
                    "file_additions": 2,
                    "file_deletions": 2,
                    "file_exists": false,
                    "file_name": "dummy/netampctl.c",
                    "file_size": 0
                }
            ],
            "interesting": {
                "reopen": false,
                "status": false
            },
            "is_parent": true,
            "sha": "62cf4e5a882270b8515af198718b6abe192ae2e6"
        },
        {
            "associated_pull_request": [],
            "date": "2020-06-09 04:04:04+00:00",
            "diff": "hamlib_hamlib/issue_288/commit_c5732d542ecf8e01f1da17d834deaa90f86c5bed.diff",
            "diff_additions": 61,
            "diff_deletions": 29,
            "diff_file_size": 274691,
            "diff_url": "https://github.com/Hamlib/Hamlib/commit/c5732d542ecf8e01f1da17d834deaa90f86c5bed.diff",
            "exists": true,
            "files": [
                {
                    "file_additions": 61,
                    "file_deletions": 29,
                    "file_exists": true,
                    "file_name": "rigs/icom/icom.c",
                    "file_size": 274691
                }
            ],
            "interesting": {
                "reopen": false,
                "status": false
            },
            "is_parent": false,
            "sha": "c5732d542ecf8e01f1da17d834deaa90f86c5bed"
        },
        {
            "associated_pull_request": [],
            "date": "2020-06-09 04:09:21+00:00",
            "diff": "hamlib_hamlib/issue_288/commit_718fcdf0c11660d3712e9a9527f47bd5b6010df5.diff",
            "diff_additions": 18,
            "diff_deletions": 15,
            "diff_file_size": 274691,
            "diff_url": "https://github.com/Hamlib/Hamlib/commit/718fcdf0c11660d3712e9a9527f47bd5b6010df5.diff",
            "exists": true,
            "files": [
                {
                    "file_additions": 18,
                    "file_deletions": 15,
                    "file_exists": true,
                    "file_name": "rigs/icom/icom.c",
                    "file_size": 274691
                }
            ],
            "interesting": {
                "reopen": false,
                "status": false
            },
            "is_parent": false,
            "sha": "718fcdf0c11660d3712e9a9527f47bd5b6010df5"
        },
        {
            "associated_pull_request": [],
            "date": "2020-06-09 17:16:45+00:00",
            "diff": "hamlib_hamlib/issue_288/commit_ee8dde16ea35142242ade73745b0b5cf22cef709.diff",
            "diff_additions": 5,
            "diff_deletions": 0,
            "diff_file_size": 274691,
            "diff_url": "https://github.com/Hamlib/Hamlib/commit/ee8dde16ea35142242ade73745b0b5cf22cef709.diff",
            "exists": true,
            "files": [
                {
                    "file_additions": 5,
                    "file_deletions": 0,
                    "file_exists": true,
                    "file_name": "rigs/icom/icom.c",
                    "file_size": 274691
                }
            ],
            "interesting": {
                "reopen": true,
                "status": false
            },
            "is_parent": false,
            "sha": "ee8dde16ea35142242ade73745b0b5cf22cef709"
        },
        {
            "associated_pull_request": [],
            "date": "2020-06-11 13:15:52+00:00",
            "diff": "hamlib_hamlib/issue_288/commit_b910fa0c5854eecb9222ceb4160ff237ee4e7f77.diff",
            "diff_additions": 23,
            "diff_deletions": 5,
            "diff_file_size": 274691,
            "diff_url": "https://github.com/Hamlib/Hamlib/commit/b910fa0c5854eecb9222ceb4160ff237ee4e7f77.diff",
            "exists": true,
            "files": [
                {
                    "file_additions": 23,
                    "file_deletions": 5,
                    "file_exists": true,
                    "file_name": "rigs/icom/icom.c",
                    "file_size": 274691
                }
            ],
            "interesting": {
                "reopen": false,
                "status": false
            },
            "is_parent": false,
            "sha": "b910fa0c5854eecb9222ceb4160ff237ee4e7f77"
        }
    ],
    "first_commit": "2020-06-08 21:17:54+00:00",
    "last_commit": "2020-06-11 13:15:52+00:00",
    "number": 288,
    "pull_request": "None",
    "score": {
        "accidental_reopen_likely": false,
        "all_labels": [
            "bug"
        ],
        "contains_keywords": [
            "issu",
            "fault"
        ],
        "fix_size": 136,
        "has_labels": [
            "bug"
        ],
        "intersecting": {
            "computed_score": 0.17857142857142858,
            "final_commit_size": 28,
            "intersection_size": 5,
            "previous_commits_size": 113
        },
        "is_makefile_based": true,
        "no_new_files": [],
        "no_other_files": false,
        "num_prohibited_files": 337577,
        "prohibited_files": [
            "server/src/main/java/com/genymobile/scrcpy/Device.java",
            "server/src/main/java/com/genymobile/scrcpy/wrappers/SurfaceControl.java",
            "server/src/main/java/com/genymobile/scrcpy/Device.java",
            "server/src/main/java/com/genymobile/scrcpy/wrappers/SurfaceControl.java",
            "app/meson.build",
            "app/scrcpy.1",
            "app/src/common.h",
            "app/src/scrcpy.h",
            "app/src/server.h",
            "server/src/main/java/com/genymobile/scrcpy/Workarounds.java"
        ],
        "reopen": true,
        "reopen_events": [
            [
                "2020-06-09 04:04:50+00:00",
                "commit"
            ],
            [
                "2020-06-09 04:10:20+00:00",
                "commit"
            ],
            [
                "2020-06-09 04:31:39+00:00",
                "closed"
            ],
            [
                "2020-06-09 17:20:23+00:00",
                "commit"
            ],
            [
                "2020-06-11 13:15:39+00:00",
                "reopened"
            ],
            [
                "2020-06-11 13:17:33+00:00",
                "commit"
            ],
            [
                "2020-06-12 22:58:13+00:00",
                "closed"
            ]
        ],
        "status": false,
        "strategy": true,
        "total_changes": 166
    }
}