{
    "category": [
        "memory",
        "build/refactor/preprocessing"
    ],
    "commits": [
        {
            "associated_pull_request": [],
            "date": "2016-01-11 02:18:43",
            "diff": "radareorg_radare2/issue_3944/commit_fea5e916a6249a40fcdeec8c500ed33b1c92136a.diff",
            "diff_additions": 21,
            "diff_deletions": 5,
            "diff_file_size": 0,
            "diff_url": "https://github.com/radareorg/radare2/commit/fea5e916a6249a40fcdeec8c500ed33b1c92136a.diff",
            "exists": true,
            "files": [
                {
                    "file_additions": 21,
                    "file_deletions": 5,
                    "file_exists": false,
                    "file_name": "libr/util/diff.c",
                    "file_size": 0
                }
            ],
            "interesting": {
                "reopen": false,
                "status": true
            },
            "is_parent": true,
            "sha": "fea5e916a6249a40fcdeec8c500ed33b1c92136a"
        },
        {
            "associated_pull_request": [],
            "date": "2016-01-11 11:04:08",
            "diff": "radareorg_radare2/issue_3944/commit_fe49555c1da90fde20f7b0a1e0cbe154bd65aca9.diff",
            "diff_additions": 4,
            "diff_deletions": 4,
            "diff_file_size": 50690,
            "diff_url": "https://github.com/radareorg/radare2/commit/fe49555c1da90fde20f7b0a1e0cbe154bd65aca9.diff",
            "exists": true,
            "files": [
                {
                    "file_additions": 4,
                    "file_deletions": 4,
                    "file_exists": true,
                    "file_name": "libr/cons/dietline.c",
                    "file_size": 50690
                }
            ],
            "interesting": {
                "reopen": true,
                "status": true
            },
            "is_parent": false,
            "sha": "fe49555c1da90fde20f7b0a1e0cbe154bd65aca9"
        },
        {
            "associated_pull_request": [],
            "date": "2016-10-10 08:20:06",
            "diff": "radareorg_radare2/issue_3944/commit_3ae8b9813b5fa883e3d1c900cd724e73ed7d23eb.diff",
            "diff_additions": 189,
            "diff_deletions": 169,
            "diff_file_size": 27196,
            "diff_url": "https://github.com/radareorg/radare2/commit/3ae8b9813b5fa883e3d1c900cd724e73ed7d23eb.diff",
            "exists": true,
            "files": [
                {
                    "file_additions": 149,
                    "file_deletions": 147,
                    "file_exists": true,
                    "file_name": "libr/anal/p/anal_8051.c",
                    "file_size": 27196
                },
                {
                    "file_additions": 34,
                    "file_deletions": 17,
                    "file_exists": false,
                    "file_name": "libr/asm/arch/8051/8051.c",
                    "file_size": 0
                },
                {
                    "file_additions": 6,
                    "file_deletions": 5,
                    "file_exists": false,
                    "file_name": "libr/asm/code.c",
                    "file_size": 0
                }
            ],
            "interesting": {
                "reopen": false,
                "status": true
            },
            "is_parent": false,
            "sha": "3ae8b9813b5fa883e3d1c900cd724e73ed7d23eb"
        }
    ],
    "first_commit": "2016-01-11 02:18:43",
    "last_commit": "2016-10-10 08:20:51",
    "number": 3944,
    "pull_request": "None",
    "score": {
        "accidental_reopen_likely": false,
        "all_labels": [
            "refactor",
            "regression",
            "test-required"
        ],
        "contains_keywords": [
            "fail",
            "report",
            "chang",
            "confirm",
            "error",
            "bug",
            "problem",
            "crash",
            "test",
            "fix",
            "patch",
            "remov",
            "issu",
            "work",
            "fault",
            "debug"
        ],
        "fix_size": 327,
        "has_labels": [],
        "intersecting": {
            "computed_score": 0.0,
            "final_commit_size": 322,
            "intersection_size": 0,
            "previous_commits_size": 5
        },
        "is_makefile_based": true,
        "no_new_files": [
            "libr/anal/p/anal_8051.c",
            "libr/asm/arch/8051/8051.c",
            "libr/asm/code.c"
        ],
        "no_other_files": true,
        "num_prohibited_files": 46785,
        "prohibited_files": [
            "hal/inc/pinmap_hal.h",
            "Debug/marvin.bin",
            "Debug/marvin.elf",
            "Debug/marvin.hex",
            "Debug/marvin.bin",
            "Debug/marvin.elf",
            "Debug/marvin.hex",
            "inc/spark_utilities.h",
            "Debug/marvin.bin",
            "Debug/marvin.elf"
        ],
        "reopen": true,
        "reopen_events": [
            [
                "2016-01-11 11:21:11",
                "closed"
            ],
            [
                "2016-01-11 11:21:11",
                "commit"
            ],
            [
                "2016-01-11 12:29:37",
                "reopened"
            ],
            [
                "2016-10-10 08:20:57",
                "commit"
            ],
            [
                "2018-02-02 21:02:24",
                "closed"
            ]
        ],
        "status": false,
        "strategy": true,
        "total_changes": 392
    }
}