{
    "covered_issues": [
        66,
        65,
        63,
        57,
        54,
        50,
        48,
        47,
        46,
        43,
        42,
        41,
        40,
        39,
        38,
        36,
        34,
        33,
        32,
        31,
        30,
        29,
        28,
        27,
        26,
        24,
        21,
        20,
        19,
        18,
        17,
        16,
        15,
        14,
        13,
        12,
        10,
        9,
        8,
        7,
        6,
        3,
        2,
        1
    ],
    "finished": true
}