{
    "category": [
        "hardware/OS",
        "control flow"
    ],
    "commits": [
        {
            "associated_pull_request": [
                "https://github.com/rsyslog/rsyslog/pull/3081"
            ],
            "date": "2018-09-28 08:10:32",
            "diff": "",
            "diff_additions": 0,
            "diff_deletions": 0,
            "diff_file_size": 0,
            "diff_url": "https://github.com/rsyslog/rsyslog/commit/73e8182b24cdf9b8a078fe36c31d657aa819e939.diff",
            "exists": true,
            "files": [],
            "interesting": {
                "reopen": false,
                "status": false
            },
            "is_parent": true,
            "sha": "73e8182b24cdf9b8a078fe36c31d657aa819e939"
        },
        {
            "associated_pull_request": [],
            "date": "2018-09-28 09:12:20",
            "diff": "rsyslog_rsyslog/issue_3066/commit_16fc157cfc1b40a45fca82253a1dbcef0e211c9a.diff",
            "diff_additions": 14,
            "diff_deletions": 0,
            "diff_file_size": 127015,
            "diff_url": "https://github.com/rsyslog/rsyslog/commit/16fc157cfc1b40a45fca82253a1dbcef0e211c9a.diff",
            "exists": true,
            "files": [
                {
                    "file_additions": 14,
                    "file_deletions": 0,
                    "file_exists": true,
                    "file_name": "runtime/queue.c",
                    "file_size": 127015
                }
            ],
            "interesting": {
                "reopen": false,
                "status": true
            },
            "is_parent": false,
            "sha": "16fc157cfc1b40a45fca82253a1dbcef0e211c9a"
        },
        {
            "associated_pull_request": [],
            "date": "2018-09-28 09:12:20",
            "diff": "rsyslog_rsyslog/issue_3066/commit_377ad922a1eb19d864646224cdcba2058a96c341.diff",
            "diff_additions": 15,
            "diff_deletions": 0,
            "diff_file_size": 146568,
            "diff_url": "https://github.com/rsyslog/rsyslog/commit/377ad922a1eb19d864646224cdcba2058a96c341.diff",
            "exists": true,
            "files": [
                {
                    "file_additions": 1,
                    "file_deletions": 0,
                    "file_exists": true,
                    "file_name": "runtime/libgcry.c",
                    "file_size": 19553
                },
                {
                    "file_additions": 14,
                    "file_deletions": 0,
                    "file_exists": true,
                    "file_name": "runtime/queue.c",
                    "file_size": 127015
                }
            ],
            "interesting": {
                "reopen": false,
                "status": true
            },
            "is_parent": false,
            "sha": "377ad922a1eb19d864646224cdcba2058a96c341"
        },
        {
            "associated_pull_request": [],
            "date": "2018-09-28 09:12:20",
            "diff": "rsyslog_rsyslog/issue_3066/commit_a09a35bf212c29dade7495b9824d7c990b5790d4.diff",
            "diff_additions": 17,
            "diff_deletions": 0,
            "diff_file_size": 146568,
            "diff_url": "https://github.com/rsyslog/rsyslog/commit/a09a35bf212c29dade7495b9824d7c990b5790d4.diff",
            "exists": true,
            "files": [
                {
                    "file_additions": 3,
                    "file_deletions": 0,
                    "file_exists": true,
                    "file_name": "runtime/libgcry.c",
                    "file_size": 19553
                },
                {
                    "file_additions": 14,
                    "file_deletions": 0,
                    "file_exists": true,
                    "file_name": "runtime/queue.c",
                    "file_size": 127015
                }
            ],
            "interesting": {
                "reopen": false,
                "status": true
            },
            "is_parent": false,
            "sha": "a09a35bf212c29dade7495b9824d7c990b5790d4"
        },
        {
            "associated_pull_request": [
                "https://github.com/rsyslog/rsyslog/pull/3081"
            ],
            "date": "2018-09-28 09:12:20",
            "diff": "rsyslog_rsyslog/issue_3066/commit_e01e74dcc98e60ddc03435b361261dc44ee6f0af.diff",
            "diff_additions": 20,
            "diff_deletions": 0,
            "diff_file_size": 146568,
            "diff_url": "https://github.com/rsyslog/rsyslog/commit/e01e74dcc98e60ddc03435b361261dc44ee6f0af.diff",
            "exists": true,
            "files": [
                {
                    "file_additions": 6,
                    "file_deletions": 0,
                    "file_exists": true,
                    "file_name": "runtime/libgcry.c",
                    "file_size": 19553
                },
                {
                    "file_additions": 14,
                    "file_deletions": 0,
                    "file_exists": true,
                    "file_name": "runtime/queue.c",
                    "file_size": 127015
                }
            ],
            "interesting": {
                "reopen": false,
                "status": false
            },
            "is_parent": false,
            "sha": "e01e74dcc98e60ddc03435b361261dc44ee6f0af"
        }
    ],
    "first_commit": "2018-09-28 08:10:32",
    "last_commit": "2018-09-28 12:09:13",
    "number": 3066,
    "pull_request": "None",
    "score": {
        "accidental_reopen_likely": false,
        "all_labels": [
            "testbench"
        ],
        "contains_keywords": [
            "bug",
            "test",
            "fix",
            "issu"
        ],
        "fix_size": 23,
        "has_labels": [],
        "intersecting": {
            "computed_score": 0.8636363636363636,
            "final_commit_size": 22,
            "intersection_size": 19,
            "previous_commits_size": 20
        },
        "is_makefile_based": true,
        "no_new_files": [],
        "no_other_files": false,
        "num_prohibited_files": 7141,
        "prohibited_files": [
            "hal/inc/pinmap_hal.h",
            "Debug/marvin.bin",
            "Debug/marvin.elf",
            "Debug/marvin.hex",
            "Debug/marvin.bin",
            "Debug/marvin.elf",
            "Debug/marvin.hex",
            "inc/spark_utilities.h",
            "Debug/marvin.bin",
            "Debug/marvin.elf"
        ],
        "reopen": false,
        "reopen_events": [
            [
                "2018-09-28 08:33:19",
                "commit"
            ],
            [
                "2018-09-28 09:14:05",
                "commit"
            ],
            [
                "2018-09-28 09:14:05",
                "commit"
            ],
            [
                "2018-09-28 09:24:36",
                "commit"
            ],
            [
                "2018-09-28 09:24:36",
                "commit"
            ],
            [
                "2018-09-28 10:34:10",
                "commit"
            ],
            [
                "2018-09-28 11:30:15",
                "commit"
            ],
            [
                "2018-09-28 12:09:21",
                "commit"
            ],
            [
                "2018-09-28 15:54:52",
                "closed"
            ]
        ],
        "status": true,
        "strategy": true,
        "total_changes": 66
    }
}