{
    "commits": [
        {
            "associated_pull_request": [
                "https://github.com/cockpit-project/cockpit/pull/15234"
            ],
            "date": "2021-01-28 09:56:47+00:00",
            "diff": "",
            "diff_additions": 0,
            "diff_deletions": 0,
            "diff_file_size": 0,
            "diff_url": "https://github.com/cockpit-project/cockpit/commit/e36e0dc56f6ee6e43adac3809920a41e37c238b5.diff",
            "exists": true,
            "files": [],
            "interesting": {
                "reopen": false,
                "status": false
            },
            "is_parent": true,
            "sha": "e36e0dc56f6ee6e43adac3809920a41e37c238b5"
        },
        {
            "associated_pull_request": [],
            "date": "2021-01-29 15:13:18+00:00",
            "diff": "cockpit-project_cockpit/issue_15077/commit_4e138d24007cd62d264f163a4f5e2e8fc7f7e218.diff",
            "diff_additions": 17,
            "diff_deletions": 0,
            "diff_file_size": 50923,
            "diff_url": "https://github.com/cockpit-project/cockpit/commit/4e138d24007cd62d264f163a4f5e2e8fc7f7e218.diff",
            "exists": true,
            "files": [
                {
                    "file_additions": 17,
                    "file_deletions": 0,
                    "file_exists": true,
                    "file_name": "src/ws/cockpitauth.c",
                    "file_size": 50923
                }
            ],
            "interesting": {
                "reopen": true,
                "status": false
            },
            "is_parent": false,
            "sha": "4e138d24007cd62d264f163a4f5e2e8fc7f7e218"
        },
        {
            "associated_pull_request": [],
            "date": "2023-04-05 15:03:45+00:00",
            "diff": "cockpit-project_cockpit/issue_15077/commit_76075a5d12e4e73d537ec3c9b99e4c8e2976961d.diff",
            "diff_additions": 7,
            "diff_deletions": 0,
            "diff_file_size": 50923,
            "diff_url": "https://github.com/cockpit-project/cockpit/commit/76075a5d12e4e73d537ec3c9b99e4c8e2976961d.diff",
            "exists": true,
            "files": [
                {
                    "file_additions": 7,
                    "file_deletions": 0,
                    "file_exists": true,
                    "file_name": "src/ws/cockpitauth.c",
                    "file_size": 50923
                }
            ],
            "interesting": {
                "reopen": false,
                "status": true
            },
            "is_parent": false,
            "sha": "76075a5d12e4e73d537ec3c9b99e4c8e2976961d"
        },
        {
            "associated_pull_request": [
                "https://github.com/cockpit-project/cockpit/pull/18609"
            ],
            "date": "2023-04-05 15:03:45+00:00",
            "diff": "cockpit-project_cockpit/issue_15077/commit_211c14b39b787bf817f6cd94e7e596e150fd32a7.diff",
            "diff_additions": 7,
            "diff_deletions": 0,
            "diff_file_size": 50923,
            "diff_url": "https://github.com/cockpit-project/cockpit/commit/211c14b39b787bf817f6cd94e7e596e150fd32a7.diff",
            "exists": true,
            "files": [
                {
                    "file_additions": 7,
                    "file_deletions": 0,
                    "file_exists": true,
                    "file_name": "src/ws/cockpitauth.c",
                    "file_size": 50923
                }
            ],
            "interesting": {
                "reopen": false,
                "status": true
            },
            "is_parent": false,
            "sha": "211c14b39b787bf817f6cd94e7e596e150fd32a7"
        },
        {
            "associated_pull_request": [
                "https://github.com/cockpit-project/cockpit/pull/18609"
            ],
            "date": "2023-04-05 15:03:45+00:00",
            "diff": "cockpit-project_cockpit/issue_15077/commit_29500b32c66dff16ec4aabf119a5772f007a007e.diff",
            "diff_additions": 7,
            "diff_deletions": 0,
            "diff_file_size": 50923,
            "diff_url": "https://github.com/cockpit-project/cockpit/commit/29500b32c66dff16ec4aabf119a5772f007a007e.diff",
            "exists": true,
            "files": [
                {
                    "file_additions": 7,
                    "file_deletions": 0,
                    "file_exists": true,
                    "file_name": "src/ws/cockpitauth.c",
                    "file_size": 50923
                }
            ],
            "interesting": {
                "reopen": false,
                "status": false
            },
            "is_parent": false,
            "sha": "29500b32c66dff16ec4aabf119a5772f007a007e"
        }
    ],
    "first_commit": "2021-01-29 11:12:08+00:00",
    "last_commit": "2023-04-07 04:41:16+00:00",
    "number": 15077,
    "pull_request": "None",
    "score": {
        "accidental_reopen_likely": false,
        "all_labels": [],
        "contains_keywords": [
            "work",
            "fail",
            "chang",
            "fix",
            "issu",
            "reason",
            "test",
            "attempt",
            "fault",
            "remov",
            "bug",
            "error",
            "report"
        ],
        "fix_size": 25,
        "has_labels": [],
        "intersecting": {
            "computed_score": 1.0,
            "final_commit_size": 8,
            "intersection_size": 8,
            "previous_commits_size": 25
        },
        "is_makefile_based": true,
        "no_new_files": [],
        "no_other_files": false,
        "num_prohibited_files": 39102,
        "prohibited_files": [
            "server/src/main/java/com/genymobile/scrcpy/Device.java",
            "server/src/main/java/com/genymobile/scrcpy/wrappers/SurfaceControl.java",
            "server/src/main/java/com/genymobile/scrcpy/Device.java",
            "server/src/main/java/com/genymobile/scrcpy/wrappers/SurfaceControl.java",
            "app/meson.build",
            "app/scrcpy.1",
            "app/src/common.h",
            "app/src/scrcpy.h",
            "app/src/server.h",
            "server/src/main/java/com/genymobile/scrcpy/Workarounds.java"
        ],
        "reopen": true,
        "reopen_events": [
            [
                "2021-01-29 15:13:42+00:00",
                "commit"
            ],
            [
                "2021-02-12 07:48:46+00:00",
                "closed"
            ],
            [
                "2023-04-05 15:18:50+00:00",
                "reopened"
            ],
            [
                "2023-04-05 15:25:08+00:00",
                "commit"
            ],
            [
                "2023-04-06 06:08:44+00:00",
                "commit"
            ],
            [
                "2023-04-07 04:41:18+00:00",
                "closed"
            ],
            [
                "2023-04-07 04:41:20+00:00",
                "commit"
            ]
        ],
        "status": false,
        "strategy": true,
        "total_changes": 38
    }
}