{
    "category": [
        "memory",
        "hardware/OS"
    ],
    "commits": [
        {
            "associated_pull_request": [],
            "date": "2020-04-11 15:17:30",
            "diff": "yshui_picom/issue_381/commit_17831a7be3ecf02b874738009fbb2e244de6bd67.diff",
            "diff_additions": 4,
            "diff_deletions": 5,
            "diff_file_size": 56336,
            "diff_url": "https://github.com/yshui/picom/commit/17831a7be3ecf02b874738009fbb2e244de6bd67.diff",
            "exists": true,
            "files": [
                {
                    "file_additions": 2,
                    "file_deletions": 2,
                    "file_exists": true,
                    "file_name": "src/config_libconfig.c",
                    "file_size": 20963
                },
                {
                    "file_additions": 2,
                    "file_deletions": 3,
                    "file_exists": true,
                    "file_name": "src/options.c",
                    "file_size": 35373
                }
            ],
            "interesting": {
                "reopen": false,
                "status": false
            },
            "is_parent": true,
            "sha": "17831a7be3ecf02b874738009fbb2e244de6bd67"
        },
        {
            "associated_pull_request": [],
            "date": "2020-04-20 04:33:26",
            "diff": "yshui_picom/issue_381/commit_701eb0a2f36d4e4242bda128bb664db43cabbd0b.diff",
            "diff_additions": 1,
            "diff_deletions": 0,
            "diff_file_size": 45676,
            "diff_url": "https://github.com/yshui/picom/commit/701eb0a2f36d4e4242bda128bb664db43cabbd0b.diff",
            "exists": true,
            "files": [
                {
                    "file_additions": 1,
                    "file_deletions": 0,
                    "file_exists": true,
                    "file_name": "src/opengl.c",
                    "file_size": 45676
                }
            ],
            "interesting": {
                "reopen": true,
                "status": false
            },
            "is_parent": false,
            "sha": "701eb0a2f36d4e4242bda128bb664db43cabbd0b"
        },
        {
            "associated_pull_request": [],
            "date": "2020-04-20 18:10:53",
            "diff": "yshui_picom/issue_381/commit_d1f4969fc1efed4af5bd06ba86fdd11624e60a63.diff",
            "diff_additions": 5,
            "diff_deletions": 5,
            "diff_file_size": 90220,
            "diff_url": "https://github.com/yshui/picom/commit/d1f4969fc1efed4af5bd06ba86fdd11624e60a63.diff",
            "exists": true,
            "files": [
                {
                    "file_additions": 1,
                    "file_deletions": 0,
                    "file_exists": true,
                    "file_name": "src/opengl.c",
                    "file_size": 45676
                },
                {
                    "file_additions": 4,
                    "file_deletions": 5,
                    "file_exists": true,
                    "file_name": "src/render.c",
                    "file_size": 44544
                }
            ],
            "interesting": {
                "reopen": false,
                "status": false
            },
            "is_parent": false,
            "sha": "d1f4969fc1efed4af5bd06ba86fdd11624e60a63"
        }
    ],
    "first_commit": "2020-04-11 15:17:30",
    "last_commit": "2020-04-20 18:10:53",
    "number": 381,
    "pull_request": "None",
    "score": {
        "accidental_reopen_likely": false,
        "all_labels": [
            "bug"
        ],
        "contains_keywords": [
            "work",
            "report",
            "fix",
            "fault",
            "bug",
            "remov",
            "workaround",
            "debug",
            "chang",
            "crash",
            "problem"
        ],
        "fix_size": 12,
        "has_labels": [
            "bug"
        ],
        "intersecting": {
            "computed_score": 0.09090909090909091,
            "final_commit_size": 11,
            "intersection_size": 1,
            "previous_commits_size": 2
        },
        "is_makefile_based": false,
        "no_new_files": [
            "src/render.c"
        ],
        "no_other_files": false,
        "num_prohibited_files": 11057,
        "prohibited_files": [
            "kill.h",
            "meminfo.h",
            "kill.h",
            "meminfo.h",
            "kill.h",
            "meminfo.h",
            "testsuite_cli_test.go",
            "testsuite_cli_test.go",
            "common.mk",
            "i3bar/include/draw_util.h"
        ],
        "reopen": true,
        "reopen_events": [
            [
                "2020-04-20 04:35:10",
                "closed"
            ],
            [
                "2020-04-20 04:35:10",
                "commit"
            ],
            [
                "2020-04-20 12:29:43",
                "reopened"
            ],
            [
                "2020-04-20 18:25:01",
                "commit"
            ],
            [
                "2020-04-20 18:25:01",
                "commit"
            ],
            [
                "2020-04-21 04:40:48",
                "closed"
            ]
        ],
        "status": false,
        "strategy": true,
        "total_changes": 20
    }
}