{
    "covered_issues": [
        30,
        29,
        28,
        27,
        25,
        24,
        22,
        18,
        17,
        16,
        15,
        14,
        13,
        12,
        10,
        9,
        8,
        7,
        5,
        4,
        2
    ],
    "finished": true
}