{
    "covered_issues": [
        776,
        775,
        772,
        771,
        758,
        757,
        755,
        753,
        749,
        747,
        741,
        739,
        732,
        730,
        724,
        718,
        717,
        715,
        713,
        709,
        708,
        707,
        705,
        701,
        699,
        690,
        689,
        685,
        681,
        678,
        677,
        676,
        673,
        672,
        669,
        666,
        663,
        662,
        660,
        659,
        654,
        652,
        646,
        645,
        640,
        639,
        637,
        636,
        633,
        631,
        630,
        629,
        628,
        619,
        617,
        611,
        606,
        605,
        604,
        599,
        598,
        595,
        594,
        590,
        582,
        581,
        580,
        567,
        565,
        564,
        562,
        558,
        553,
        551,
        550,
        548,
        544,
        538,
        536,
        535,
        534,
        522,
        520,
        518,
        517,
        516,
        514,
        513,
        511,
        508,
        506,
        504,
        503,
        502,
        501,
        491,
        487,
        486,
        485,
        483,
        482,
        478,
        477,
        476,
        474,
        473,
        472,
        471,
        469,
        467,
        466,
        465,
        464,
        463,
        462,
        461,
        460,
        459,
        458,
        457,
        455,
        451,
        449,
        447,
        446,
        445,
        444,
        443,
        441,
        438,
        437,
        435,
        434,
        430,
        429,
        428,
        426,
        425,
        422,
        421,
        418,
        417,
        412,
        409,
        405,
        404,
        402,
        399,
        394,
        391,
        390,
        389,
        387,
        386,
        384,
        382,
        381,
        380,
        379,
        378,
        377,
        376,
        375,
        374,
        372,
        371,
        370,
        365,
        364,
        362,
        359,
        356,
        354,
        353,
        352,
        348,
        347,
        345,
        344,
        343,
        338,
        337,
        335,
        334,
        333,
        331,
        330,
        329,
        328,
        327,
        326,
        325,
        324,
        323,
        322,
        321,
        319,
        316,
        314,
        313,
        312,
        311,
        310,
        309,
        308,
        304,
        301,
        299,
        298,
        297,
        296,
        295,
        294,
        293,
        292,
        290,
        288,
        287,
        286,
        282,
        279,
        278,
        277,
        276,
        272,
        271,
        270,
        267,
        266,
        265,
        263,
        261,
        260,
        254,
        252,
        249,
        247,
        246,
        245,
        244,
        239,
        238,
        236,
        233,
        232,
        230,
        229,
        228,
        227,
        226,
        225,
        224,
        222,
        221,
        220,
        219,
        218,
        214,
        213,
        211,
        209,
        207,
        204,
        200,
        199,
        197,
        195,
        194,
        192,
        187,
        184,
        183,
        182,
        179,
        178,
        177,
        173,
        168,
        167,
        164,
        163,
        161,
        157,
        156,
        153,
        151,
        149,
        148,
        147,
        146,
        145,
        144,
        143,
        142,
        141,
        140,
        138,
        137,
        136,
        134,
        133,
        132,
        126,
        123,
        121,
        118,
        115,
        114
    ],
    "finished": true
}