{
    "covered_issues": [
        83,
        82,
        77,
        76,
        75,
        74,
        73,
        72,
        71,
        70,
        69,
        68,
        67,
        66,
        65,
        64,
        63,
        62,
        61,
        60,
        59,
        58,
        57,
        56,
        55,
        51,
        50,
        49,
        48,
        47,
        46,
        45,
        44,
        43,
        42,
        41,
        39,
        38,
        37,
        36,
        35,
        34,
        30,
        27,
        26,
        25,
        24,
        23,
        22,
        14,
        12,
        11,
        8,
        7,
        6,
        5,
        4,
        3
    ],
    "finished": true
}