{
    "covered_issues": [
        791,
        781,
        771,
        767,
        761,
        760,
        759,
        758,
        755,
        746,
        744,
        737,
        735,
        734,
        733,
        732,
        723,
        721,
        720,
        713,
        708,
        696,
        691,
        690,
        688,
        686,
        684,
        683,
        678,
        673,
        672,
        665,
        664,
        662,
        660,
        659,
        658,
        657,
        655,
        654,
        649,
        644,
        640,
        638,
        637,
        627,
        626,
        625,
        623,
        622,
        614,
        613,
        611,
        607,
        603,
        601,
        599,
        598,
        597,
        594,
        591,
        588,
        578,
        577,
        576,
        573,
        571,
        570,
        568,
        565,
        564,
        563,
        562,
        560,
        559,
        556,
        554,
        553,
        551,
        550,
        549,
        547,
        544,
        536,
        534,
        529,
        526,
        524,
        522,
        520,
        519,
        517,
        515,
        512,
        510,
        508,
        503,
        502,
        501,
        500,
        497,
        487,
        486,
        482,
        479,
        478,
        477,
        476,
        474,
        473,
        469,
        467,
        466,
        465,
        462,
        461,
        456,
        453,
        447,
        446,
        444,
        443,
        442,
        441,
        440,
        438,
        432,
        431,
        430,
        423,
        412,
        406,
        405,
        404,
        402,
        401,
        400,
        399,
        398,
        394,
        388,
        377,
        376,
        373,
        370,
        368,
        361,
        356,
        354,
        351,
        346,
        345,
        336,
        333,
        328,
        326,
        324,
        321,
        318,
        309,
        308,
        307,
        306,
        305,
        302,
        301,
        299,
        298,
        294,
        293,
        292,
        291,
        289,
        286,
        281,
        280,
        278,
        272,
        271,
        267,
        265,
        262,
        248,
        246,
        238,
        234,
        233,
        231,
        221,
        218,
        213,
        212,
        211,
        205,
        203,
        202,
        194,
        192,
        191,
        190,
        189,
        188,
        186,
        185,
        184,
        182,
        181,
        180,
        179,
        178,
        176,
        175,
        173,
        161,
        152,
        150,
        146,
        145,
        144,
        141,
        134,
        133,
        131,
        123,
        120,
        119,
        116,
        113,
        110,
        109,
        108,
        100,
        79,
        73,
        71,
        68,
        65,
        62,
        61,
        58,
        57,
        53,
        43,
        34,
        32,
        28,
        26,
        24,
        23,
        21,
        13
    ],
    "finished": true
}