{
    "covered_issues": [
        243,
        240,
        239,
        238,
        237,
        233,
        232,
        231,
        229,
        226,
        225,
        224,
        222,
        221,
        218,
        217,
        216,
        211,
        208,
        207,
        205,
        203,
        202,
        201,
        199,
        198,
        196,
        194,
        193,
        191,
        190,
        189,
        188,
        187,
        184,
        177,
        176,
        175,
        172,
        170,
        167,
        166,
        165,
        162,
        160,
        158,
        152,
        149,
        148,
        145,
        144,
        141,
        140,
        139,
        138,
        134,
        132,
        131,
        130,
        129,
        128,
        127,
        126,
        124,
        122,
        119,
        118,
        117,
        116,
        115,
        114,
        113,
        111,
        110,
        109,
        108,
        106,
        105,
        101,
        100,
        96,
        95,
        93,
        90,
        88,
        87,
        84,
        83,
        82,
        81,
        78,
        77,
        76,
        75,
        74,
        73,
        72,
        71,
        66,
        65,
        57,
        56,
        54,
        53,
        51,
        48,
        47,
        42,
        39,
        38,
        36,
        34,
        33,
        32,
        31,
        29,
        27,
        26,
        25,
        24,
        23,
        22,
        21,
        20,
        19,
        18,
        13,
        11,
        10,
        9,
        8,
        6,
        1
    ],
    "finished": true
}