{
    "covered_issues": [
        277,
        271,
        263,
        259,
        257,
        250,
        249,
        242,
        237,
        233,
        232,
        227,
        219,
        216,
        214,
        211,
        196,
        195,
        192,
        184,
        182,
        178,
        176,
        173,
        172,
        171,
        165,
        162,
        159,
        158,
        157,
        152,
        148,
        145,
        141,
        140,
        132,
        126,
        124,
        123,
        122,
        116,
        108,
        107,
        106,
        99,
        94,
        93,
        77,
        76,
        73,
        72,
        71,
        69,
        61,
        60,
        56,
        55,
        54,
        53,
        51,
        48,
        47,
        46,
        41,
        39,
        37,
        35,
        34,
        30,
        29,
        28,
        27,
        23,
        20,
        19,
        18,
        16,
        15,
        14,
        12,
        10,
        9,
        8,
        6
    ],
    "finished": true
}