{
    "commits": [
        {
            "diff": "elastic_elasticsearch/issue_47550/commit_d8b4556e2dfa48b38baf614e3ac99196be07055c.diff",
            "diff_additions": 312,
            "diff_deletions": 98,
            "diff_file_size": 162877,
            "files": [
                {
                    "file_additions": 1,
                    "file_deletions": 1,
                    "file_exists": true,
                    "file_name": "modules/lang-expression/src/main/java/org/elasticsearch/script/expression/ExpressionScoreScript.java",
                    "file_size": 2716
                },
                {
                    "file_additions": 1,
                    "file_deletions": 1,
                    "file_exists": true,
                    "file_name": "modules/lang-expression/src/main/java/org/elasticsearch/script/expression/ExpressionScriptEngine.java",
                    "file_size": 24368
                },
                {
                    "file_additions": 1,
                    "file_deletions": 1,
                    "file_exists": true,
                    "file_name": "modules/lang-painless/src/main/java/org/elasticsearch/painless/action/PainlessExecuteAction.java",
                    "file_size": 25583
                },
                {
                    "file_additions": 2,
                    "file_deletions": 2,
                    "file_exists": true,
                    "file_name": "plugins/examples/script-expert-scoring/src/main/java/org/elasticsearch/example/expertscript/ExpertScriptPlugin.java",
                    "file_size": 6937
                },
                {
                    "file_additions": 1,
                    "file_deletions": 10,
                    "file_exists": true,
                    "file_name": "server/src/main/java/org/elasticsearch/common/lucene/search/function/ScriptScoreFunction.java",
                    "file_size": 4314
                },
                {
                    "file_additions": 85,
                    "file_deletions": 46,
                    "file_exists": true,
                    "file_name": "server/src/main/java/org/elasticsearch/common/lucene/search/function/ScriptScoreQuery.java",
                    "file_size": 12871
                },
                {
                    "file_additions": 3,
                    "file_deletions": 4,
                    "file_exists": true,
                    "file_name": "server/src/main/java/org/elasticsearch/index/query/QueryBuilders.java",
                    "file_size": 27139
                },
                {
                    "file_additions": 26,
                    "file_deletions": 16,
                    "file_exists": true,
                    "file_name": "server/src/main/java/org/elasticsearch/index/query/functionscore/ScriptScoreQueryBuilder.java",
                    "file_size": 7547
                },
                {
                    "file_additions": 28,
                    "file_deletions": 3,
                    "file_exists": true,
                    "file_name": "server/src/main/java/org/elasticsearch/script/ScoreScript.java",
                    "file_size": 8759
                },
                {
                    "file_additions": 2,
                    "file_deletions": 7,
                    "file_exists": true,
                    "file_name": "server/src/test/java/org/elasticsearch/index/query/ScriptScoreQueryBuilderTests.java",
                    "file_size": 5994
                },
                {
                    "file_additions": 2,
                    "file_deletions": 2,
                    "file_exists": false,
                    "file_name": "server/src/test/java/org/elasticsearch/search/functionscore/ExplainableScriptIT.java",
                    "file_size": 0
                },
                {
                    "file_additions": 3,
                    "file_deletions": 4,
                    "file_exists": false,
                    "file_name": "server/src/test/java/org/elasticsearch/search/query/ScriptScoreQueryIT.java",
                    "file_size": 0
                },
                {
                    "file_additions": 156,
                    "file_deletions": 0,
                    "file_exists": true,
                    "file_name": "server/src/test/java/org/elasticsearch/search/query/ScriptScoreQueryTests.java",
                    "file_size": 7008
                },
                {
                    "file_additions": 1,
                    "file_deletions": 1,
                    "file_exists": true,
                    "file_name": "test/framework/src/main/java/org/elasticsearch/script/MockScriptEngine.java",
                    "file_size": 29641
                }
            ],
            "interesting": {
                "reopened": false,
                "status": false
            },
            "sha": "d8b4556e2dfa48b38baf614e3ac99196be07055c"
        },
        {
            "diff": "elastic_elasticsearch/issue_47550/commit_e244d65869c2864f372af066724f1bf1f5c729a1.diff",
            "diff_additions": 56,
            "diff_deletions": 43,
            "diff_file_size": 216143,
            "files": [
                {
                    "file_additions": 47,
                    "file_deletions": 39,
                    "file_exists": true,
                    "file_name": "server/src/main/java/org/elasticsearch/cluster/SnapshotsInProgress.java",
                    "file_size": 38577
                },
                {
                    "file_additions": 9,
                    "file_deletions": 4,
                    "file_exists": true,
                    "file_name": "server/src/main/java/org/elasticsearch/snapshots/SnapshotsService.java",
                    "file_size": 177566
                }
            ],
            "interesting": {
                "reopened": false,
                "status": false
            },
            "sha": "e244d65869c2864f372af066724f1bf1f5c729a1"
        },
        {
            "diff": "elastic_elasticsearch/issue_47550/commit_afd22ca85efdb1e29795866eb34e81314a667f61.diff",
            "diff_additions": 56,
            "diff_deletions": 43,
            "diff_file_size": 216143,
            "files": [
                {
                    "file_additions": 47,
                    "file_deletions": 39,
                    "file_exists": true,
                    "file_name": "server/src/main/java/org/elasticsearch/cluster/SnapshotsInProgress.java",
                    "file_size": 38577
                },
                {
                    "file_additions": 9,
                    "file_deletions": 4,
                    "file_exists": true,
                    "file_name": "server/src/main/java/org/elasticsearch/snapshots/SnapshotsService.java",
                    "file_size": 177566
                }
            ],
            "interesting": {
                "reopened": false,
                "status": false
            },
            "sha": "afd22ca85efdb1e29795866eb34e81314a667f61"
        },
        {
            "diff": "elastic_elasticsearch/issue_47550/commit_9abe067d3fc057c04fe8a4e0a73bd6b043e73940.diff",
            "diff_additions": 56,
            "diff_deletions": 43,
            "diff_file_size": 216143,
            "files": [
                {
                    "file_additions": 47,
                    "file_deletions": 39,
                    "file_exists": true,
                    "file_name": "server/src/main/java/org/elasticsearch/cluster/SnapshotsInProgress.java",
                    "file_size": 38577
                },
                {
                    "file_additions": 9,
                    "file_deletions": 4,
                    "file_exists": true,
                    "file_name": "server/src/main/java/org/elasticsearch/snapshots/SnapshotsService.java",
                    "file_size": 177566
                }
            ],
            "interesting": {
                "reopened": false,
                "status": false
            },
            "sha": "9abe067d3fc057c04fe8a4e0a73bd6b043e73940"
        },
        {
            "diff": "elastic_elasticsearch/issue_47550/commit_22679c793211479d07c61924684a5750fde9e50d.diff",
            "diff_additions": 56,
            "diff_deletions": 43,
            "diff_file_size": 216143,
            "files": [
                {
                    "file_additions": 47,
                    "file_deletions": 39,
                    "file_exists": true,
                    "file_name": "server/src/main/java/org/elasticsearch/cluster/SnapshotsInProgress.java",
                    "file_size": 38577
                },
                {
                    "file_additions": 9,
                    "file_deletions": 4,
                    "file_exists": true,
                    "file_name": "server/src/main/java/org/elasticsearch/snapshots/SnapshotsService.java",
                    "file_size": 177566
                }
            ],
            "interesting": {
                "reopened": false,
                "status": false
            },
            "sha": "22679c793211479d07c61924684a5750fde9e50d"
        },
        {
            "diff": "elastic_elasticsearch/issue_47550/commit_6c9687b2696c3340e0a9f999e8484fcec1e824f1.diff",
            "diff_additions": 56,
            "diff_deletions": 43,
            "diff_file_size": 216143,
            "files": [
                {
                    "file_additions": 47,
                    "file_deletions": 39,
                    "file_exists": true,
                    "file_name": "server/src/main/java/org/elasticsearch/cluster/SnapshotsInProgress.java",
                    "file_size": 38577
                },
                {
                    "file_additions": 9,
                    "file_deletions": 4,
                    "file_exists": true,
                    "file_name": "server/src/main/java/org/elasticsearch/snapshots/SnapshotsService.java",
                    "file_size": 177566
                }
            ],
            "interesting": {
                "reopened": false,
                "status": false
            },
            "sha": "6c9687b2696c3340e0a9f999e8484fcec1e824f1"
        },
        {
            "diff": "elastic_elasticsearch/issue_47550/commit_29c5391b1891f371d4d84ce62e1160d37dda72cb.diff",
            "diff_additions": 120,
            "diff_deletions": 21,
            "diff_file_size": 237890,
            "files": [
                {
                    "file_additions": 15,
                    "file_deletions": 13,
                    "file_exists": true,
                    "file_name": "server/src/main/java/org/elasticsearch/action/admin/cluster/snapshots/status/TransportSnapshotsStatusAction.java",
                    "file_size": 21747
                },
                {
                    "file_additions": 47,
                    "file_deletions": 3,
                    "file_exists": true,
                    "file_name": "server/src/main/java/org/elasticsearch/cluster/SnapshotsInProgress.java",
                    "file_size": 38577
                },
                {
                    "file_additions": 9,
                    "file_deletions": 5,
                    "file_exists": true,
                    "file_name": "server/src/main/java/org/elasticsearch/snapshots/SnapshotsService.java",
                    "file_size": 177566
                },
                {
                    "file_additions": 49,
                    "file_deletions": 0,
                    "file_exists": false,
                    "file_name": "server/src/test/java/org/elasticsearch/snapshots/DedicatedClusterSnapshotRestoreIT.java",
                    "file_size": 0
                }
            ],
            "interesting": {
                "reopened": true,
                "status": false
            },
            "sha": "29c5391b1891f371d4d84ce62e1160d37dda72cb"
        },
        {
            "diff": "elastic_elasticsearch/issue_47550/commit_b0c8c7e9cfdb1b2326db5293d02ef5e8f9139055.diff",
            "diff_additions": 20,
            "diff_deletions": 3,
            "diff_file_size": 272860,
            "files": [
                {
                    "file_additions": 6,
                    "file_deletions": 1,
                    "file_exists": true,
                    "file_name": "server/src/main/java/org/elasticsearch/snapshots/SnapshotsService.java",
                    "file_size": 177566
                },
                {
                    "file_additions": 14,
                    "file_deletions": 2,
                    "file_exists": true,
                    "file_name": "server/src/test/java/org/elasticsearch/snapshots/SnapshotResiliencyTests.java",
                    "file_size": 95294
                }
            ],
            "interesting": {
                "reopened": false,
                "status": false
            },
            "sha": "b0c8c7e9cfdb1b2326db5293d02ef5e8f9139055"
        },
        {
            "diff": "elastic_elasticsearch/issue_47550/commit_c9c60bc9d6ba6161e6e036e3b1b5d51e789c8bf1.diff",
            "diff_additions": 20,
            "diff_deletions": 3,
            "diff_file_size": 272860,
            "files": [
                {
                    "file_additions": 6,
                    "file_deletions": 1,
                    "file_exists": true,
                    "file_name": "server/src/main/java/org/elasticsearch/snapshots/SnapshotsService.java",
                    "file_size": 177566
                },
                {
                    "file_additions": 14,
                    "file_deletions": 2,
                    "file_exists": true,
                    "file_name": "server/src/test/java/org/elasticsearch/snapshots/SnapshotResiliencyTests.java",
                    "file_size": 95294
                }
            ],
            "interesting": {
                "reopened": false,
                "status": false
            },
            "sha": "c9c60bc9d6ba6161e6e036e3b1b5d51e789c8bf1"
        },
        {
            "diff": "elastic_elasticsearch/issue_47550/commit_f0d8c785e324d3d61057f17ea0bac0a45fd92b41.diff",
            "diff_additions": 20,
            "diff_deletions": 3,
            "diff_file_size": 272860,
            "files": [
                {
                    "file_additions": 6,
                    "file_deletions": 1,
                    "file_exists": true,
                    "file_name": "server/src/main/java/org/elasticsearch/snapshots/SnapshotsService.java",
                    "file_size": 177566
                },
                {
                    "file_additions": 14,
                    "file_deletions": 2,
                    "file_exists": true,
                    "file_name": "server/src/test/java/org/elasticsearch/snapshots/SnapshotResiliencyTests.java",
                    "file_size": 95294
                }
            ],
            "interesting": {
                "reopened": false,
                "status": false
            },
            "sha": "f0d8c785e324d3d61057f17ea0bac0a45fd92b41"
        },
        {
            "diff": "elastic_elasticsearch/issue_47550/commit_bb43fc0dca8635abb4b4e79c79605cb92d6cac66.diff",
            "diff_additions": 20,
            "diff_deletions": 6,
            "diff_file_size": 272860,
            "files": [
                {
                    "file_additions": 6,
                    "file_deletions": 1,
                    "file_exists": true,
                    "file_name": "server/src/main/java/org/elasticsearch/snapshots/SnapshotsService.java",
                    "file_size": 177566
                },
                {
                    "file_additions": 14,
                    "file_deletions": 5,
                    "file_exists": true,
                    "file_name": "server/src/test/java/org/elasticsearch/snapshots/SnapshotResiliencyTests.java",
                    "file_size": 95294
                }
            ],
            "interesting": {
                "reopened": false,
                "status": false
            },
            "sha": "bb43fc0dca8635abb4b4e79c79605cb92d6cac66"
        }
    ],
    "first_commit": "2019-10-04 02:35:59",
    "last_commit": "2020-03-31 07:52:45",
    "number": 47550,
    "score": 208.00350569675723
}