{
    "commits": [
        {
            "associated_pull_request": [
                "https://github.com/nginx/unit/pull/719"
            ],
            "date": "2022-06-09 12:39:59+00:00",
            "diff": "nginx_unit/issue_562/commit_9b4b4925b38333b8d7795331d27db9811f43d72a.diff",
            "diff_additions": 5,
            "diff_deletions": 41,
            "diff_file_size": 37383,
            "diff_url": "https://github.com/nginx/unit/commit/9b4b4925b38333b8d7795331d27db9811f43d72a.diff",
            "exists": true,
            "files": [
                {
                    "file_additions": 5,
                    "file_deletions": 41,
                    "file_exists": true,
                    "file_name": "src/ruby/nxt_ruby.c",
                    "file_size": 37383
                }
            ],
            "interesting": {
                "reopen": false,
                "status": false
            },
            "is_parent": true,
            "sha": "9b4b4925b38333b8d7795331d27db9811f43d72a"
        },
        {
            "associated_pull_request": [],
            "date": "2022-07-28 03:00:15+00:00",
            "diff": "nginx_unit/issue_562/commit_2bd4a455278dbce756c1dc8be07515f73d611e3b.diff",
            "diff_additions": 2,
            "diff_deletions": 2,
            "diff_file_size": 37383,
            "diff_url": "https://github.com/nginx/unit/commit/2bd4a455278dbce756c1dc8be07515f73d611e3b.diff",
            "exists": true,
            "files": [
                {
                    "file_additions": 2,
                    "file_deletions": 2,
                    "file_exists": true,
                    "file_name": "src/ruby/nxt_ruby.c",
                    "file_size": 37383
                }
            ],
            "interesting": {
                "reopen": true,
                "status": false
            },
            "is_parent": false,
            "sha": "2bd4a455278dbce756c1dc8be07515f73d611e3b"
        },
        {
            "associated_pull_request": [],
            "date": "2022-08-31 11:49:15+00:00",
            "diff": "nginx_unit/issue_562/commit_b26624fc10cc1f4eb88c16ac8fb5b6b4b61895fc.diff",
            "diff_additions": 2,
            "diff_deletions": 0,
            "diff_file_size": 37383,
            "diff_url": "https://github.com/nginx/unit/commit/b26624fc10cc1f4eb88c16ac8fb5b6b4b61895fc.diff",
            "exists": true,
            "files": [
                {
                    "file_additions": 2,
                    "file_deletions": 0,
                    "file_exists": true,
                    "file_name": "src/ruby/nxt_ruby.c",
                    "file_size": 37383
                }
            ],
            "interesting": {
                "reopen": false,
                "status": false
            },
            "is_parent": false,
            "sha": "b26624fc10cc1f4eb88c16ac8fb5b6b4b61895fc"
        },
        {
            "associated_pull_request": [],
            "date": "2022-08-31 11:49:15+00:00",
            "diff": "nginx_unit/issue_562/commit_b26624fc10cc1f4eb88c16ac8fb5b6b4b61895fc.diff",
            "diff_additions": 2,
            "diff_deletions": 0,
            "diff_file_size": 37383,
            "diff_url": "https://github.com/nginx/unit/commit/b26624fc10cc1f4eb88c16ac8fb5b6b4b61895fc.diff",
            "exists": true,
            "files": [
                {
                    "file_additions": 2,
                    "file_deletions": 0,
                    "file_exists": true,
                    "file_name": "src/ruby/nxt_ruby.c",
                    "file_size": 37383
                }
            ],
            "interesting": {
                "reopen": false,
                "status": false
            },
            "is_parent": false,
            "sha": "b26624fc10cc1f4eb88c16ac8fb5b6b4b61895fc"
        }
    ],
    "first_commit": "2022-07-27 10:46:42+00:00",
    "last_commit": "2022-08-31 12:17:02+00:00",
    "number": 562,
    "pull_request": "None",
    "score": {
        "accidental_reopen_likely": false,
        "all_labels": [],
        "contains_keywords": [
            "confirm",
            "work",
            "fail",
            "chang",
            "fix",
            "issu",
            "patch",
            "debug",
            "reason",
            "test",
            "fault",
            "warn",
            "bug",
            "error",
            "problem",
            "crash",
            "report"
        ],
        "fix_size": 5,
        "has_labels": [],
        "intersecting": {
            "computed_score": 1.0,
            "final_commit_size": 3,
            "intersection_size": 3,
            "previous_commits_size": 5
        },
        "is_makefile_based": false,
        "no_new_files": [],
        "no_other_files": false,
        "num_prohibited_files": 131590,
        "prohibited_files": [
            "server/src/main/java/com/genymobile/scrcpy/Device.java",
            "server/src/main/java/com/genymobile/scrcpy/wrappers/SurfaceControl.java",
            "server/src/main/java/com/genymobile/scrcpy/Device.java",
            "server/src/main/java/com/genymobile/scrcpy/wrappers/SurfaceControl.java",
            "app/meson.build",
            "app/scrcpy.1",
            "app/src/common.h",
            "app/src/scrcpy.h",
            "app/src/server.h",
            "server/src/main/java/com/genymobile/scrcpy/Workarounds.java"
        ],
        "reopen": true,
        "reopen_events": [
            [
                "2022-07-28 04:16:06+00:00",
                "commit"
            ],
            [
                "2022-07-28 04:16:08+00:00",
                "closed"
            ],
            [
                "2022-07-28 04:16:08+00:00",
                "commit"
            ],
            [
                "2022-08-23 07:56:55+00:00",
                "reopened"
            ],
            [
                "2022-08-31 12:27:49+00:00",
                "commit"
            ],
            [
                "2022-09-01 11:23:07+00:00",
                "closed"
            ],
            [
                "2022-09-01 11:23:07+00:00",
                "commit"
            ]
        ],
        "status": false,
        "strategy": true,
        "total_changes": 54
    }
}