{
    "commits": [
        {
            "associated_pull_request": [],
            "date": "2020-09-16 19:05:51+00:00",
            "diff": "libusb_libusb/issue_1128/commit_ff8fe9397d4c61f072d209703f854c9f62ed17e3.diff",
            "diff_additions": 675,
            "diff_deletions": 0,
            "diff_file_size": 32931,
            "diff_url": "https://github.com/libusb/libusb/commit/ff8fe9397d4c61f072d209703f854c9f62ed17e3.diff",
            "exists": true,
            "files": [
                {
                    "file_additions": 626,
                    "file_deletions": 0,
                    "file_exists": true,
                    "file_name": "libusb/os/emscripten_webusb.cpp",
                    "file_size": 23699
                },
                {
                    "file_additions": 49,
                    "file_deletions": 0,
                    "file_exists": true,
                    "file_name": "libusb/os/events_posix.c",
                    "file_size": 9232
                }
            ],
            "interesting": {
                "reopen": false,
                "status": false
            },
            "is_parent": true,
            "sha": "ff8fe9397d4c61f072d209703f854c9f62ed17e3"
        },
        {
            "associated_pull_request": [],
            "date": "2022-08-03 06:51:37+00:00",
            "diff": "libusb_libusb/issue_1128/commit_47751f0b7d09fdbad1f276b46ccabb81d651169b.diff",
            "diff_additions": 45,
            "diff_deletions": 0,
            "diff_file_size": 4159,
            "diff_url": "https://github.com/libusb/libusb/commit/47751f0b7d09fdbad1f276b46ccabb81d651169b.diff",
            "exists": true,
            "files": [
                {
                    "file_additions": 45,
                    "file_deletions": 0,
                    "file_exists": true,
                    "file_name": "tests/stress_mt.c",
                    "file_size": 4159
                }
            ],
            "interesting": {
                "reopen": true,
                "status": false
            },
            "is_parent": false,
            "sha": "47751f0b7d09fdbad1f276b46ccabb81d651169b"
        },
        {
            "associated_pull_request": [],
            "date": "2023-02-11 09:32:25+00:00",
            "diff": "libusb_libusb/issue_1128/commit_7f6600219fe09c8a669840a4eb1926d00e9b77ec.diff",
            "diff_additions": 14,
            "diff_deletions": 0,
            "diff_file_size": 4159,
            "diff_url": "https://github.com/libusb/libusb/commit/7f6600219fe09c8a669840a4eb1926d00e9b77ec.diff",
            "exists": true,
            "files": [
                {
                    "file_additions": 14,
                    "file_deletions": 0,
                    "file_exists": true,
                    "file_name": "tests/stress_mt.c",
                    "file_size": 4159
                }
            ],
            "interesting": {
                "reopen": false,
                "status": false
            },
            "is_parent": false,
            "sha": "7f6600219fe09c8a669840a4eb1926d00e9b77ec"
        },
        {
            "associated_pull_request": [],
            "date": "2023-02-11 09:32:25+00:00",
            "diff": "libusb_libusb/issue_1128/commit_7af65bf744119313064a4a9f6300d29716770755.diff",
            "diff_additions": 14,
            "diff_deletions": 0,
            "diff_file_size": 4159,
            "diff_url": "https://github.com/libusb/libusb/commit/7af65bf744119313064a4a9f6300d29716770755.diff",
            "exists": true,
            "files": [
                {
                    "file_additions": 14,
                    "file_deletions": 0,
                    "file_exists": true,
                    "file_name": "tests/stress_mt.c",
                    "file_size": 4159
                }
            ],
            "interesting": {
                "reopen": false,
                "status": false
            },
            "is_parent": false,
            "sha": "7af65bf744119313064a4a9f6300d29716770755"
        },
        {
            "associated_pull_request": [],
            "date": "2023-02-11 09:32:25+00:00",
            "diff": "libusb_libusb/issue_1128/commit_dd1bf62539d51143f2ddfd48cb091ef4b2c461f1.diff",
            "diff_additions": 14,
            "diff_deletions": 0,
            "diff_file_size": 4159,
            "diff_url": "https://github.com/libusb/libusb/commit/dd1bf62539d51143f2ddfd48cb091ef4b2c461f1.diff",
            "exists": true,
            "files": [
                {
                    "file_additions": 14,
                    "file_deletions": 0,
                    "file_exists": true,
                    "file_name": "tests/stress_mt.c",
                    "file_size": 4159
                }
            ],
            "interesting": {
                "reopen": false,
                "status": false
            },
            "is_parent": false,
            "sha": "dd1bf62539d51143f2ddfd48cb091ef4b2c461f1"
        },
        {
            "associated_pull_request": [],
            "date": "2023-02-27 09:46:43+00:00",
            "diff": "libusb_libusb/issue_1128/commit_53fcc6d046b5f4e4ab00392c8e2b086abdf6ba2a.diff",
            "diff_additions": 77,
            "diff_deletions": 7,
            "diff_file_size": 4159,
            "diff_url": "https://github.com/libusb/libusb/commit/53fcc6d046b5f4e4ab00392c8e2b086abdf6ba2a.diff",
            "exists": true,
            "files": [
                {
                    "file_additions": 77,
                    "file_deletions": 7,
                    "file_exists": true,
                    "file_name": "tests/stress_mt.c",
                    "file_size": 4159
                }
            ],
            "interesting": {
                "reopen": false,
                "status": false
            },
            "is_parent": false,
            "sha": "53fcc6d046b5f4e4ab00392c8e2b086abdf6ba2a"
        },
        {
            "associated_pull_request": [],
            "date": "2023-02-27 09:46:43+00:00",
            "diff": "libusb_libusb/issue_1128/commit_ab61296036889ab2a2a9ef77aae808766039a311.diff",
            "diff_additions": 77,
            "diff_deletions": 7,
            "diff_file_size": 4159,
            "diff_url": "https://github.com/libusb/libusb/commit/ab61296036889ab2a2a9ef77aae808766039a311.diff",
            "exists": true,
            "files": [
                {
                    "file_additions": 77,
                    "file_deletions": 7,
                    "file_exists": true,
                    "file_name": "tests/stress_mt.c",
                    "file_size": 4159
                }
            ],
            "interesting": {
                "reopen": false,
                "status": false
            },
            "is_parent": false,
            "sha": "ab61296036889ab2a2a9ef77aae808766039a311"
        }
    ],
    "first_commit": "2022-06-26 18:44:54+00:00",
    "last_commit": "2023-03-12 13:52:08+00:00",
    "number": 1128,
    "pull_request": "None",
    "score": {
        "accidental_reopen_likely": false,
        "all_labels": [
            "enhancement",
            "windows",
            "Examples"
        ],
        "contains_keywords": [
            "confirm",
            "work",
            "fail",
            "chang",
            "fix",
            "issu",
            "patch",
            "perform",
            "debug",
            "test",
            "fault",
            "leak",
            "remov",
            "warn",
            "bug",
            "error",
            "problem",
            "crash",
            "report",
            "workaround"
        ],
        "fix_size": 80,
        "has_labels": [],
        "intersecting": {
            "computed_score": 1.0,
            "final_commit_size": 80,
            "intersection_size": 80,
            "previous_commits_size": 80
        },
        "is_makefile_based": true,
        "no_new_files": [],
        "no_other_files": false,
        "num_prohibited_files": 211762,
        "prohibited_files": [
            "server/src/main/java/com/genymobile/scrcpy/Device.java",
            "server/src/main/java/com/genymobile/scrcpy/wrappers/SurfaceControl.java",
            "server/src/main/java/com/genymobile/scrcpy/Device.java",
            "server/src/main/java/com/genymobile/scrcpy/wrappers/SurfaceControl.java",
            "app/meson.build",
            "app/scrcpy.1",
            "app/src/common.h",
            "app/src/scrcpy.h",
            "app/src/server.h",
            "server/src/main/java/com/genymobile/scrcpy/Workarounds.java"
        ],
        "reopen": true,
        "reopen_events": [
            [
                "2022-09-01 14:28:25+00:00",
                "commit"
            ],
            [
                "2022-12-19 20:55:30+00:00",
                "commit"
            ],
            [
                "2023-01-23 14:37:00+00:00",
                "closed"
            ],
            [
                "2023-01-24 11:44:35+00:00",
                "reopened"
            ],
            [
                "2023-02-11 09:34:37+00:00",
                "commit"
            ],
            [
                "2023-02-11 12:19:10+00:00",
                "commit"
            ],
            [
                "2023-02-11 12:34:19+00:00",
                "commit"
            ],
            [
                "2023-03-12 13:37:19+00:00",
                "commit"
            ],
            [
                "2023-03-12 13:53:14+00:00",
                "closed"
            ],
            [
                "2023-03-12 13:53:14+00:00",
                "commit"
            ]
        ],
        "status": false,
        "strategy": true,
        "total_changes": 930
    }
}