{
    "commits": [
        {
            "associated_pull_request": [],
            "date": "2013-01-11 13:31:02+00:00",
            "diff": "chjj_compton/issue_75/commit_57c5854fd0e3e0526bd99ea61b1fad78d8ad772c.diff",
            "diff_additions": 251,
            "diff_deletions": 110,
            "diff_file_size": 213303,
            "diff_url": "https://github.com/chjj/compton/commit/57c5854fd0e3e0526bd99ea61b1fad78d8ad772c.diff",
            "exists": true,
            "files": [
                {
                    "file_additions": 251,
                    "file_deletions": 110,
                    "file_exists": true,
                    "file_name": "src/compton.c",
                    "file_size": 213303
                }
            ],
            "interesting": {
                "reopen": false,
                "status": false
            },
            "is_parent": true,
            "sha": "57c5854fd0e3e0526bd99ea61b1fad78d8ad772c"
        },
        {
            "associated_pull_request": [],
            "date": "2013-01-12 14:21:35+00:00",
            "diff": "chjj_compton/issue_75/commit_2165c42d2792afdc544af142313470eb9810e62f.diff",
            "diff_additions": 183,
            "diff_deletions": 49,
            "diff_file_size": 213303,
            "diff_url": "https://github.com/chjj/compton/commit/2165c42d2792afdc544af142313470eb9810e62f.diff",
            "exists": true,
            "files": [
                {
                    "file_additions": 183,
                    "file_deletions": 49,
                    "file_exists": true,
                    "file_name": "src/compton.c",
                    "file_size": 213303
                }
            ],
            "interesting": {
                "reopen": false,
                "status": false
            },
            "is_parent": false,
            "sha": "2165c42d2792afdc544af142313470eb9810e62f"
        },
        {
            "associated_pull_request": [],
            "date": "2013-01-13 05:44:05+00:00",
            "diff": "chjj_compton/issue_75/commit_e60fe72dcb4bfb0c6373a4cc0405b917d4bc15d2.diff",
            "diff_additions": 22,
            "diff_deletions": 12,
            "diff_file_size": 213303,
            "diff_url": "https://github.com/chjj/compton/commit/e60fe72dcb4bfb0c6373a4cc0405b917d4bc15d2.diff",
            "exists": true,
            "files": [
                {
                    "file_additions": 22,
                    "file_deletions": 12,
                    "file_exists": true,
                    "file_name": "src/compton.c",
                    "file_size": 213303
                }
            ],
            "interesting": {
                "reopen": true,
                "status": false
            },
            "is_parent": false,
            "sha": "e60fe72dcb4bfb0c6373a4cc0405b917d4bc15d2"
        },
        {
            "associated_pull_request": [],
            "date": "2013-01-29 01:57:04+00:00",
            "diff": "chjj_compton/issue_75/commit_42e17cb4e9ed6f05f09d8ed612d7c9ef08468def.diff",
            "diff_additions": 77,
            "diff_deletions": 22,
            "diff_file_size": 213303,
            "diff_url": "https://github.com/chjj/compton/commit/42e17cb4e9ed6f05f09d8ed612d7c9ef08468def.diff",
            "exists": true,
            "files": [
                {
                    "file_additions": 77,
                    "file_deletions": 22,
                    "file_exists": true,
                    "file_name": "src/compton.c",
                    "file_size": 213303
                }
            ],
            "interesting": {
                "reopen": false,
                "status": false
            },
            "is_parent": false,
            "sha": "42e17cb4e9ed6f05f09d8ed612d7c9ef08468def"
        },
        {
            "associated_pull_request": [],
            "date": "2018-12-22 00:36:06+00:00",
            "diff": "chjj_compton/issue_75/commit_d6a54c25e96aa4729211de22a8ea9298556ac37d.diff",
            "diff_additions": 5,
            "diff_deletions": 1,
            "diff_file_size": 0,
            "diff_url": "https://github.com/chjj/compton/commit/d6a54c25e96aa4729211de22a8ea9298556ac37d.diff",
            "exists": true,
            "files": [
                {
                    "file_additions": 1,
                    "file_deletions": 1,
                    "file_exists": false,
                    "file_name": "src/render.c",
                    "file_size": 0
                },
                {
                    "file_additions": 4,
                    "file_deletions": 0,
                    "file_exists": false,
                    "file_name": "src/win.c",
                    "file_size": 0
                }
            ],
            "interesting": {
                "reopen": false,
                "status": false
            },
            "is_parent": false,
            "sha": "d6a54c25e96aa4729211de22a8ea9298556ac37d"
        }
    ],
    "first_commit": "2013-01-11 13:31:02+00:00",
    "last_commit": "2018-12-22 00:36:06+00:00",
    "number": 75,
    "pull_request": "None",
    "score": {
        "accidental_reopen_likely": false,
        "all_labels": [
            "feature-req"
        ],
        "contains_keywords": [
            "confirm",
            "work",
            "fail",
            "chang",
            "fix",
            "issu",
            "patch",
            "perform",
            "debug",
            "reason",
            "test",
            "fault",
            "leak",
            "warn",
            "bug",
            "problem",
            "report"
        ],
        "fix_size": 345,
        "has_labels": [],
        "intersecting": {
            "computed_score": 0.0,
            "final_commit_size": 7,
            "intersection_size": 0,
            "previous_commits_size": 338
        },
        "is_makefile_based": true,
        "no_new_files": [
            "src/render.c",
            "src/win.c"
        ],
        "no_other_files": false,
        "num_prohibited_files": 212700,
        "prohibited_files": [
            "server/src/main/java/com/genymobile/scrcpy/Device.java",
            "server/src/main/java/com/genymobile/scrcpy/wrappers/SurfaceControl.java",
            "server/src/main/java/com/genymobile/scrcpy/Device.java",
            "server/src/main/java/com/genymobile/scrcpy/wrappers/SurfaceControl.java",
            "app/meson.build",
            "app/scrcpy.1",
            "app/src/common.h",
            "app/src/scrcpy.h",
            "app/src/server.h",
            "server/src/main/java/com/genymobile/scrcpy/Workarounds.java"
        ],
        "reopen": true,
        "reopen_events": [
            [
                "2013-01-12 14:47:18+00:00",
                "commit"
            ],
            [
                "2013-01-28 03:28:13+00:00",
                "closed"
            ],
            [
                "2013-01-28 03:28:13+00:00",
                "commit"
            ],
            [
                "2013-01-28 14:43:40+00:00",
                "reopened"
            ],
            [
                "2013-01-29 02:13:01+00:00",
                "commit"
            ],
            [
                "2013-01-29 04:36:46+00:00",
                "closed"
            ],
            [
                "2019-01-09 21:36:30+00:00",
                "commit"
            ]
        ],
        "status": false,
        "strategy": true,
        "total_changes": 732
    }
}