{
    "commits": [
        {
            "associated_pull_request": [],
            "date": "2020-01-10 18:46:59+00:00",
            "diff": "dosemu2_dosemu2/issue_982/commit_ae0cc06ff175ad109c35125841af84d0e008a40f.diff",
            "diff_additions": 179,
            "diff_deletions": 0,
            "diff_file_size": 48352,
            "diff_url": "https://github.com/dosemu2/dosemu2/commit/ae0cc06ff175ad109c35125841af84d0e008a40f.diff",
            "exists": true,
            "files": [
                {
                    "file_additions": 91,
                    "file_deletions": 0,
                    "file_exists": true,
                    "file_name": "src/base/init/config.c",
                    "file_size": 44498
                },
                {
                    "file_additions": 88,
                    "file_deletions": 0,
                    "file_exists": true,
                    "file_name": "src/plugin/json/locale.c",
                    "file_size": 3854
                }
            ],
            "interesting": {
                "reopen": false,
                "status": false
            },
            "is_parent": true,
            "sha": "ae0cc06ff175ad109c35125841af84d0e008a40f"
        },
        {
            "associated_pull_request": [],
            "date": "2020-01-10 23:26:18+00:00",
            "diff": "dosemu2_dosemu2/issue_982/commit_9d7e809dee00ddcbbd9ec6a109baa59b8d4f207d.diff",
            "diff_additions": 52,
            "diff_deletions": 16,
            "diff_file_size": 228106,
            "diff_url": "https://github.com/dosemu2/dosemu2/commit/9d7e809dee00ddcbbd9ec6a109baa59b8d4f207d.diff",
            "exists": true,
            "files": [
                {
                    "file_additions": 40,
                    "file_deletions": 13,
                    "file_exists": true,
                    "file_name": "src/base/emu-i386/kvm.c",
                    "file_size": 43545
                },
                {
                    "file_additions": 12,
                    "file_deletions": 3,
                    "file_exists": true,
                    "file_name": "src/dosext/dpmi/dpmi.c",
                    "file_size": 184561
                }
            ],
            "interesting": {
                "reopen": true,
                "status": false
            },
            "is_parent": false,
            "sha": "9d7e809dee00ddcbbd9ec6a109baa59b8d4f207d"
        },
        {
            "associated_pull_request": [],
            "date": "2020-01-11 01:08:14+00:00",
            "diff": "dosemu2_dosemu2/issue_982/commit_81dad6a4399b08894451bc696f2a8f480e8c26c2.diff",
            "diff_additions": 44,
            "diff_deletions": 1,
            "diff_file_size": 301948,
            "diff_url": "https://github.com/dosemu2/dosemu2/commit/81dad6a4399b08894451bc696f2a8f480e8c26c2.diff",
            "exists": true,
            "files": [
                {
                    "file_additions": 19,
                    "file_deletions": 1,
                    "file_exists": true,
                    "file_name": "src/base/emu-i386/kvm.c",
                    "file_size": 43545
                },
                {
                    "file_additions": 24,
                    "file_deletions": 0,
                    "file_exists": true,
                    "file_name": "src/dosext/dpmi/dpmi.c",
                    "file_size": 184561
                },
                {
                    "file_additions": 1,
                    "file_deletions": 0,
                    "file_exists": true,
                    "file_name": "src/plugin/debugger/mhpdbgc.c",
                    "file_size": 73842
                }
            ],
            "interesting": {
                "reopen": false,
                "status": false
            },
            "is_parent": false,
            "sha": "81dad6a4399b08894451bc696f2a8f480e8c26c2"
        },
        {
            "associated_pull_request": [],
            "date": "2020-01-11 02:15:25+00:00",
            "diff": "dosemu2_dosemu2/issue_982/commit_57a112dd0269eea54d96ea3f3bf8aa98e09181af.diff",
            "diff_additions": 79,
            "diff_deletions": 26,
            "diff_file_size": 301948,
            "diff_url": "https://github.com/dosemu2/dosemu2/commit/57a112dd0269eea54d96ea3f3bf8aa98e09181af.diff",
            "exists": true,
            "files": [
                {
                    "file_additions": 48,
                    "file_deletions": 19,
                    "file_exists": true,
                    "file_name": "src/base/emu-i386/kvm.c",
                    "file_size": 43545
                },
                {
                    "file_additions": 29,
                    "file_deletions": 7,
                    "file_exists": true,
                    "file_name": "src/dosext/dpmi/dpmi.c",
                    "file_size": 184561
                },
                {
                    "file_additions": 2,
                    "file_deletions": 0,
                    "file_exists": true,
                    "file_name": "src/plugin/debugger/mhpdbgc.c",
                    "file_size": 73842
                }
            ],
            "interesting": {
                "reopen": false,
                "status": false
            },
            "is_parent": false,
            "sha": "57a112dd0269eea54d96ea3f3bf8aa98e09181af"
        },
        {
            "associated_pull_request": [],
            "date": "2020-01-11 02:15:25+00:00",
            "diff": "dosemu2_dosemu2/issue_982/commit_e97269b796a7415c93a52a29a9901635ab9fe057.diff",
            "diff_additions": 79,
            "diff_deletions": 26,
            "diff_file_size": 301948,
            "diff_url": "https://github.com/dosemu2/dosemu2/commit/e97269b796a7415c93a52a29a9901635ab9fe057.diff",
            "exists": true,
            "files": [
                {
                    "file_additions": 48,
                    "file_deletions": 19,
                    "file_exists": true,
                    "file_name": "src/base/emu-i386/kvm.c",
                    "file_size": 43545
                },
                {
                    "file_additions": 29,
                    "file_deletions": 7,
                    "file_exists": true,
                    "file_name": "src/dosext/dpmi/dpmi.c",
                    "file_size": 184561
                },
                {
                    "file_additions": 2,
                    "file_deletions": 0,
                    "file_exists": true,
                    "file_name": "src/plugin/debugger/mhpdbgc.c",
                    "file_size": 73842
                }
            ],
            "interesting": {
                "reopen": false,
                "status": false
            },
            "is_parent": false,
            "sha": "e97269b796a7415c93a52a29a9901635ab9fe057"
        },
        {
            "associated_pull_request": [],
            "date": "2020-01-11 02:15:25+00:00",
            "diff": "dosemu2_dosemu2/issue_982/commit_e1223ea3a3f420892fa8c3cc4400f7300996b52f.diff",
            "diff_additions": 76,
            "diff_deletions": 26,
            "diff_file_size": 301948,
            "diff_url": "https://github.com/dosemu2/dosemu2/commit/e1223ea3a3f420892fa8c3cc4400f7300996b52f.diff",
            "exists": true,
            "files": [
                {
                    "file_additions": 50,
                    "file_deletions": 19,
                    "file_exists": true,
                    "file_name": "src/base/emu-i386/kvm.c",
                    "file_size": 43545
                },
                {
                    "file_additions": 24,
                    "file_deletions": 7,
                    "file_exists": true,
                    "file_name": "src/dosext/dpmi/dpmi.c",
                    "file_size": 184561
                },
                {
                    "file_additions": 2,
                    "file_deletions": 0,
                    "file_exists": true,
                    "file_name": "src/plugin/debugger/mhpdbgc.c",
                    "file_size": 73842
                }
            ],
            "interesting": {
                "reopen": false,
                "status": false
            },
            "is_parent": false,
            "sha": "e1223ea3a3f420892fa8c3cc4400f7300996b52f"
        },
        {
            "associated_pull_request": [],
            "date": "2020-01-11 02:15:25+00:00",
            "diff": "dosemu2_dosemu2/issue_982/commit_b6105f17cda3bd1b821dd0646fd1430e5b9f7c8c.diff",
            "diff_additions": 77,
            "diff_deletions": 26,
            "diff_file_size": 301948,
            "diff_url": "https://github.com/dosemu2/dosemu2/commit/b6105f17cda3bd1b821dd0646fd1430e5b9f7c8c.diff",
            "exists": true,
            "files": [
                {
                    "file_additions": 50,
                    "file_deletions": 19,
                    "file_exists": true,
                    "file_name": "src/base/emu-i386/kvm.c",
                    "file_size": 43545
                },
                {
                    "file_additions": 24,
                    "file_deletions": 7,
                    "file_exists": true,
                    "file_name": "src/dosext/dpmi/dpmi.c",
                    "file_size": 184561
                },
                {
                    "file_additions": 3,
                    "file_deletions": 0,
                    "file_exists": true,
                    "file_name": "src/plugin/debugger/mhpdbgc.c",
                    "file_size": 73842
                }
            ],
            "interesting": {
                "reopen": false,
                "status": false
            },
            "is_parent": false,
            "sha": "b6105f17cda3bd1b821dd0646fd1430e5b9f7c8c"
        },
        {
            "associated_pull_request": [
                "https://github.com/dosemu2/dosemu2/pull/985"
            ],
            "date": "2020-01-11 02:15:25+00:00",
            "diff": "dosemu2_dosemu2/issue_982/commit_b04bd5b7227b459b018a6468236bca58d248f3b5.diff",
            "diff_additions": 79,
            "diff_deletions": 27,
            "diff_file_size": 301948,
            "diff_url": "https://github.com/dosemu2/dosemu2/commit/b04bd5b7227b459b018a6468236bca58d248f3b5.diff",
            "exists": true,
            "files": [
                {
                    "file_additions": 52,
                    "file_deletions": 20,
                    "file_exists": true,
                    "file_name": "src/base/emu-i386/kvm.c",
                    "file_size": 43545
                },
                {
                    "file_additions": 24,
                    "file_deletions": 7,
                    "file_exists": true,
                    "file_name": "src/dosext/dpmi/dpmi.c",
                    "file_size": 184561
                },
                {
                    "file_additions": 3,
                    "file_deletions": 0,
                    "file_exists": true,
                    "file_name": "src/plugin/debugger/mhpdbgc.c",
                    "file_size": 73842
                }
            ],
            "interesting": {
                "reopen": false,
                "status": false
            },
            "is_parent": false,
            "sha": "b04bd5b7227b459b018a6468236bca58d248f3b5"
        },
        {
            "associated_pull_request": [
                "https://github.com/dosemu2/dosemu2/pull/985"
            ],
            "date": "2020-01-11 02:15:25+00:00",
            "diff": "dosemu2_dosemu2/issue_982/commit_b04bd5b7227b459b018a6468236bca58d248f3b5.diff",
            "diff_additions": 79,
            "diff_deletions": 27,
            "diff_file_size": 301948,
            "diff_url": "https://github.com/dosemu2/dosemu2/commit/b04bd5b7227b459b018a6468236bca58d248f3b5.diff",
            "exists": true,
            "files": [
                {
                    "file_additions": 52,
                    "file_deletions": 20,
                    "file_exists": true,
                    "file_name": "src/base/emu-i386/kvm.c",
                    "file_size": 43545
                },
                {
                    "file_additions": 24,
                    "file_deletions": 7,
                    "file_exists": true,
                    "file_name": "src/dosext/dpmi/dpmi.c",
                    "file_size": 184561
                },
                {
                    "file_additions": 3,
                    "file_deletions": 0,
                    "file_exists": true,
                    "file_name": "src/plugin/debugger/mhpdbgc.c",
                    "file_size": 73842
                }
            ],
            "interesting": {
                "reopen": false,
                "status": false
            },
            "is_parent": false,
            "sha": "b04bd5b7227b459b018a6468236bca58d248f3b5"
        },
        {
            "associated_pull_request": [
                "https://github.com/dosemu2/dosemu2/pull/985"
            ],
            "date": "2020-01-12 12:57:24+00:00",
            "diff": "dosemu2_dosemu2/issue_982/commit_d76703a8162fece289e2564d551342bcdc5452b2.diff",
            "diff_additions": 79,
            "diff_deletions": 27,
            "diff_file_size": 301948,
            "diff_url": "https://github.com/dosemu2/dosemu2/commit/d76703a8162fece289e2564d551342bcdc5452b2.diff",
            "exists": true,
            "files": [
                {
                    "file_additions": 52,
                    "file_deletions": 20,
                    "file_exists": true,
                    "file_name": "src/base/emu-i386/kvm.c",
                    "file_size": 43545
                },
                {
                    "file_additions": 24,
                    "file_deletions": 7,
                    "file_exists": true,
                    "file_name": "src/dosext/dpmi/dpmi.c",
                    "file_size": 184561
                },
                {
                    "file_additions": 3,
                    "file_deletions": 0,
                    "file_exists": true,
                    "file_name": "src/plugin/debugger/mhpdbgc.c",
                    "file_size": 73842
                }
            ],
            "interesting": {
                "reopen": false,
                "status": false
            },
            "is_parent": false,
            "sha": "d76703a8162fece289e2564d551342bcdc5452b2"
        },
        {
            "associated_pull_request": [],
            "date": "2020-01-15 14:23:34+00:00",
            "diff": "dosemu2_dosemu2/issue_982/commit_c33ea42839e3e2f5084852e483f90ffe048f2d34.diff",
            "diff_additions": 6,
            "diff_deletions": 6,
            "diff_file_size": 184561,
            "diff_url": "https://github.com/dosemu2/dosemu2/commit/c33ea42839e3e2f5084852e483f90ffe048f2d34.diff",
            "exists": true,
            "files": [
                {
                    "file_additions": 6,
                    "file_deletions": 6,
                    "file_exists": true,
                    "file_name": "src/dosext/dpmi/dpmi.c",
                    "file_size": 184561
                }
            ],
            "interesting": {
                "reopen": false,
                "status": false
            },
            "is_parent": false,
            "sha": "c33ea42839e3e2f5084852e483f90ffe048f2d34"
        },
        {
            "associated_pull_request": [],
            "date": "2020-01-15 17:02:15+00:00",
            "diff": "dosemu2_dosemu2/issue_982/commit_94225ebc9902120f58b753521bcd6a3f3179b5c5.diff",
            "diff_additions": 11,
            "diff_deletions": 38,
            "diff_file_size": 204686,
            "diff_url": "https://github.com/dosemu2/dosemu2/commit/94225ebc9902120f58b753521bcd6a3f3179b5c5.diff",
            "exists": true,
            "files": [
                {
                    "file_additions": 6,
                    "file_deletions": 2,
                    "file_exists": true,
                    "file_name": "src/base/emu-i386/do_vm86.c",
                    "file_size": 20125
                },
                {
                    "file_additions": 5,
                    "file_deletions": 36,
                    "file_exists": true,
                    "file_name": "src/dosext/dpmi/dpmi.c",
                    "file_size": 184561
                }
            ],
            "interesting": {
                "reopen": false,
                "status": false
            },
            "is_parent": false,
            "sha": "94225ebc9902120f58b753521bcd6a3f3179b5c5"
        },
        {
            "associated_pull_request": [],
            "date": "2020-06-17 00:04:23+00:00",
            "diff": "dosemu2_dosemu2/issue_982/commit_508cf28ddab6b42b9fbb53bd769944982dbaf495.diff",
            "diff_additions": 4,
            "diff_deletions": 2,
            "diff_file_size": 90067,
            "diff_url": "https://github.com/dosemu2/dosemu2/commit/508cf28ddab6b42b9fbb53bd769944982dbaf495.diff",
            "exists": true,
            "files": [
                {
                    "file_additions": 4,
                    "file_deletions": 2,
                    "file_exists": true,
                    "file_name": "src/base/emu-i386/simx86/codegen-x86.c",
                    "file_size": 90067
                }
            ],
            "interesting": {
                "reopen": false,
                "status": false
            },
            "is_parent": false,
            "sha": "508cf28ddab6b42b9fbb53bd769944982dbaf495"
        },
        {
            "associated_pull_request": [],
            "date": "2020-06-17 14:12:55+00:00",
            "diff": "dosemu2_dosemu2/issue_982/commit_0b6fe4f17f4c10000224b5e737efc574d0417c68.diff",
            "diff_additions": 2,
            "diff_deletions": 11,
            "diff_file_size": 90067,
            "diff_url": "https://github.com/dosemu2/dosemu2/commit/0b6fe4f17f4c10000224b5e737efc574d0417c68.diff",
            "exists": true,
            "files": [
                {
                    "file_additions": 2,
                    "file_deletions": 11,
                    "file_exists": true,
                    "file_name": "src/base/emu-i386/simx86/codegen-x86.c",
                    "file_size": 90067
                }
            ],
            "interesting": {
                "reopen": false,
                "status": false
            },
            "is_parent": false,
            "sha": "0b6fe4f17f4c10000224b5e737efc574d0417c68"
        }
    ],
    "first_commit": "2020-01-10 22:14:36+00:00",
    "last_commit": "2020-06-18 13:13:05+00:00",
    "number": 982,
    "pull_request": "None",
    "score": {
        "accidental_reopen_likely": false,
        "all_labels": [
            "enhancement"
        ],
        "contains_keywords": [
            "work",
            "chang",
            "fix",
            "issu",
            "patch",
            "perform",
            "debug",
            "reason",
            "test",
            "attempt",
            "fault",
            "remov",
            "bug",
            "error",
            "problem",
            "crash"
        ],
        "fix_size": 248,
        "has_labels": [],
        "intersecting": {
            "computed_score": 0.46153846153846156,
            "final_commit_size": 13,
            "intersection_size": 6,
            "previous_commits_size": 241
        },
        "is_makefile_based": true,
        "no_new_files": [],
        "no_other_files": false,
        "num_prohibited_files": 987837,
        "prohibited_files": [
            "server/src/main/java/com/genymobile/scrcpy/Device.java",
            "server/src/main/java/com/genymobile/scrcpy/wrappers/SurfaceControl.java",
            "server/src/main/java/com/genymobile/scrcpy/Device.java",
            "server/src/main/java/com/genymobile/scrcpy/wrappers/SurfaceControl.java",
            "app/meson.build",
            "app/scrcpy.1",
            "app/src/common.h",
            "app/src/scrcpy.h",
            "app/src/server.h",
            "server/src/main/java/com/genymobile/scrcpy/Workarounds.java"
        ],
        "reopen": true,
        "reopen_events": [
            [
                "2020-01-07 23:29:02+00:00",
                "closed"
            ],
            [
                "2020-01-09 00:26:21+00:00",
                "reopened"
            ],
            [
                "2020-01-10 23:29:01+00:00",
                "closed"
            ],
            [
                "2020-01-10 23:29:01+00:00",
                "commit"
            ],
            [
                "2020-01-10 23:34:15+00:00",
                "reopened"
            ],
            [
                "2020-01-11 01:08:43+00:00",
                "commit"
            ],
            [
                "2020-01-11 02:16:31+00:00",
                "commit"
            ],
            [
                "2020-01-11 12:56:00+00:00",
                "commit"
            ],
            [
                "2020-01-11 13:44:07+00:00",
                "commit"
            ],
            [
                "2020-01-11 13:56:10+00:00",
                "commit"
            ],
            [
                "2020-01-12 03:26:18+00:00",
                "commit"
            ],
            [
                "2020-01-12 12:57:26+00:00",
                "closed"
            ],
            [
                "2020-01-12 12:57:26+00:00",
                "commit"
            ],
            [
                "2020-01-12 12:57:26+00:00",
                "commit"
            ],
            [
                "2020-01-15 14:25:33+00:00",
                "commit"
            ],
            [
                "2020-01-15 17:08:31+00:00",
                "commit"
            ],
            [
                "2020-06-17 00:12:55+00:00",
                "commit"
            ],
            [
                "2020-06-18 13:15:13+00:00",
                "commit"
            ]
        ],
        "status": false,
        "strategy": true,
        "total_changes": 1105
    }
}