{
    "category": [
        "build/refactor/preprocessing"
    ],
    "commits": [
        {
            "associated_pull_request": [],
            "date": "2019-06-25 15:24:04",
            "diff": "opensips_opensips/issue_1734/commit_1f7af0bdc9021f369e4234cf14eb16ecc1c4dfee.diff",
            "diff_additions": 7,
            "diff_deletions": 8,
            "diff_file_size": 47751,
            "diff_url": "https://github.com/OpenSIPS/opensips/commit/1f7af0bdc9021f369e4234cf14eb16ecc1c4dfee.diff",
            "exists": true,
            "files": [
                {
                    "file_additions": 1,
                    "file_deletions": 2,
                    "file_exists": true,
                    "file_name": "lib/sliblist.c",
                    "file_size": 4603
                },
                {
                    "file_additions": 2,
                    "file_deletions": 2,
                    "file_exists": true,
                    "file_name": "statistics.c",
                    "file_size": 21520
                },
                {
                    "file_additions": 4,
                    "file_deletions": 4,
                    "file_exists": true,
                    "file_name": "timer.c",
                    "file_size": 21628
                }
            ],
            "interesting": {
                "reopen": false,
                "status": true
            },
            "is_parent": true,
            "sha": "1f7af0bdc9021f369e4234cf14eb16ecc1c4dfee"
        },
        {
            "associated_pull_request": [],
            "date": "2019-06-25 14:55:33",
            "diff": "opensips_opensips/issue_1734/commit_82c446d2922fca59942e8b7835516486d8771fb4.diff",
            "diff_additions": 38,
            "diff_deletions": 18,
            "diff_file_size": 54096,
            "diff_url": "https://github.com/OpenSIPS/opensips/commit/82c446d2922fca59942e8b7835516486d8771fb4.diff",
            "exists": true,
            "files": [
                {
                    "file_additions": 38,
                    "file_deletions": 18,
                    "file_exists": true,
                    "file_name": "modules/sql_cacher/sql_cacher.c",
                    "file_size": 54096
                }
            ],
            "interesting": {
                "reopen": false,
                "status": true
            },
            "is_parent": false,
            "sha": "82c446d2922fca59942e8b7835516486d8771fb4"
        },
        {
            "associated_pull_request": [],
            "date": "2019-06-25 14:55:33",
            "diff": "opensips_opensips/issue_1734/commit_ab7e931286058c9f6696cc0dc43cac06e39f4045.diff",
            "diff_additions": 38,
            "diff_deletions": 18,
            "diff_file_size": 54096,
            "diff_url": "https://github.com/OpenSIPS/opensips/commit/ab7e931286058c9f6696cc0dc43cac06e39f4045.diff",
            "exists": true,
            "files": [
                {
                    "file_additions": 38,
                    "file_deletions": 18,
                    "file_exists": true,
                    "file_name": "modules/sql_cacher/sql_cacher.c",
                    "file_size": 54096
                }
            ],
            "interesting": {
                "reopen": false,
                "status": false
            },
            "is_parent": false,
            "sha": "ab7e931286058c9f6696cc0dc43cac06e39f4045"
        }
    ],
    "first_commit": "2019-06-25 15:24:04",
    "last_commit": "2019-06-25 15:36:24",
    "number": 1734,
    "pull_request": "None",
    "score": {
        "accidental_reopen_likely": false,
        "all_labels": [],
        "contains_keywords": [
            "fail",
            "warn",
            "crash",
            "fix"
        ],
        "fix_size": 87,
        "has_labels": [],
        "intersecting": {
            "computed_score": 0.3269230769230769,
            "final_commit_size": 52,
            "intersection_size": 17,
            "previous_commits_size": 52
        },
        "is_makefile_based": true,
        "no_new_files": [],
        "no_other_files": false,
        "num_prohibited_files": 44700,
        "prohibited_files": [
            "hal/inc/pinmap_hal.h",
            "Debug/marvin.bin",
            "Debug/marvin.elf",
            "Debug/marvin.hex",
            "Debug/marvin.bin",
            "Debug/marvin.elf",
            "Debug/marvin.hex",
            "inc/spark_utilities.h",
            "Debug/marvin.bin",
            "Debug/marvin.elf"
        ],
        "reopen": false,
        "reopen_events": [
            [
                "2019-06-25 15:26:00",
                "closed"
            ],
            [
                "2019-06-25 15:26:00",
                "commit"
            ],
            [
                "2019-06-25 15:36:14",
                "commit"
            ],
            [
                "2019-06-25 15:37:01",
                "commit"
            ]
        ],
        "status": true,
        "strategy": true,
        "total_changes": 127
    }
}