{
    "category": [
        "build/refactor/preprocessing",
        "network/protocol"
    ],
    "commits": [
        {
            "associated_pull_request": [],
            "date": "2017-04-24 10:18:43",
            "diff": "eclipse_paho.mqtt.c/issue_186/commit_475992f135b3454bc3dd7439b97d9c749432191b.diff",
            "diff_additions": 12,
            "diff_deletions": 4,
            "diff_file_size": 22294,
            "diff_url": "https://github.com/eclipse/paho.mqtt.c/commit/475992f135b3454bc3dd7439b97d9c749432191b.diff",
            "exists": true,
            "files": [
                {
                    "file_additions": 11,
                    "file_deletions": 3,
                    "file_exists": true,
                    "file_name": "src/MQTTProtocolOut.c",
                    "file_size": 13006
                },
                {
                    "file_additions": 1,
                    "file_deletions": 1,
                    "file_exists": true,
                    "file_name": "src/samples/paho_c_sub.c",
                    "file_size": 9288
                }
            ],
            "interesting": {
                "reopen": false,
                "status": false
            },
            "is_parent": true,
            "sha": "475992f135b3454bc3dd7439b97d9c749432191b"
        },
        {
            "associated_pull_request": [],
            "date": "2017-04-24 13:05:48",
            "diff": "eclipse_paho.mqtt.c/issue_186/commit_8332e25b170f0ca87daa4db6e66096b53faec38e.diff",
            "diff_additions": 18,
            "diff_deletions": 7,
            "diff_file_size": 28343,
            "diff_url": "https://github.com/eclipse/paho.mqtt.c/commit/8332e25b170f0ca87daa4db6e66096b53faec38e.diff",
            "exists": true,
            "files": [
                {
                    "file_additions": 18,
                    "file_deletions": 7,
                    "file_exists": true,
                    "file_name": "src/Socket.c",
                    "file_size": 28343
                }
            ],
            "interesting": {
                "reopen": false,
                "status": true
            },
            "is_parent": false,
            "sha": "8332e25b170f0ca87daa4db6e66096b53faec38e"
        },
        {
            "associated_pull_request": [],
            "date": "2017-04-24 21:15:52",
            "diff": "eclipse_paho.mqtt.c/issue_186/commit_5a33d7958fa34b42444fb392b3471af2d01c989f.diff",
            "diff_additions": 1,
            "diff_deletions": 1,
            "diff_file_size": 28343,
            "diff_url": "https://github.com/eclipse/paho.mqtt.c/commit/5a33d7958fa34b42444fb392b3471af2d01c989f.diff",
            "exists": true,
            "files": [
                {
                    "file_additions": 1,
                    "file_deletions": 1,
                    "file_exists": true,
                    "file_name": "src/Socket.c",
                    "file_size": 28343
                }
            ],
            "interesting": {
                "reopen": false,
                "status": false
            },
            "is_parent": false,
            "sha": "5a33d7958fa34b42444fb392b3471af2d01c989f"
        },
        {
            "associated_pull_request": [],
            "date": "2017-05-14 21:26:21",
            "diff": "eclipse_paho.mqtt.c/issue_186/commit_2fb4dae1ed16b6a23dcd0823bbe9ddc52c797c87.diff",
            "diff_additions": 514,
            "diff_deletions": 450,
            "diff_file_size": 375385,
            "diff_url": "https://github.com/eclipse/paho.mqtt.c/commit/2fb4dae1ed16b6a23dcd0823bbe9ddc52c797c87.diff",
            "exists": true,
            "files": [
                {
                    "file_additions": 257,
                    "file_deletions": 292,
                    "file_exists": true,
                    "file_name": "src/MQTTAsync.c",
                    "file_size": 47373
                },
                {
                    "file_additions": 41,
                    "file_deletions": 18,
                    "file_exists": true,
                    "file_name": "src/MQTTClient.c",
                    "file_size": 81130
                },
                {
                    "file_additions": 1,
                    "file_deletions": 1,
                    "file_exists": true,
                    "file_name": "src/MQTTPersistence.c",
                    "file_size": 25517
                },
                {
                    "file_additions": 3,
                    "file_deletions": 2,
                    "file_exists": true,
                    "file_name": "src/MQTTPersistenceDefault.c",
                    "file_size": 21664
                },
                {
                    "file_additions": 11,
                    "file_deletions": 3,
                    "file_exists": true,
                    "file_name": "src/MQTTProtocolOut.c",
                    "file_size": 13006
                },
                {
                    "file_additions": 29,
                    "file_deletions": 23,
                    "file_exists": true,
                    "file_name": "src/MQTTVersion.c",
                    "file_size": 6063
                },
                {
                    "file_additions": 57,
                    "file_deletions": 37,
                    "file_exists": true,
                    "file_name": "src/SSLSocket.c",
                    "file_size": 31590
                },
                {
                    "file_additions": 20,
                    "file_deletions": 8,
                    "file_exists": true,
                    "file_name": "src/Socket.c",
                    "file_size": 28343
                },
                {
                    "file_additions": 7,
                    "file_deletions": 1,
                    "file_exists": true,
                    "file_name": "src/SocketBuffer.c",
                    "file_size": 10658
                },
                {
                    "file_additions": 3,
                    "file_deletions": 3,
                    "file_exists": true,
                    "file_name": "src/samples/MQTTAsync_publish.c",
                    "file_size": 5033
                },
                {
                    "file_additions": 8,
                    "file_deletions": 7,
                    "file_exists": true,
                    "file_name": "src/samples/MQTTAsync_subscribe.c",
                    "file_size": 4952
                },
                {
                    "file_additions": 4,
                    "file_deletions": 4,
                    "file_exists": true,
                    "file_name": "src/samples/MQTTClient_publish.c",
                    "file_size": 2543
                },
                {
                    "file_additions": 4,
                    "file_deletions": 4,
                    "file_exists": true,
                    "file_name": "src/samples/MQTTClient_publish_async.c",
                    "file_size": 3604
                },
                {
                    "file_additions": 5,
                    "file_deletions": 4,
                    "file_exists": true,
                    "file_name": "src/samples/MQTTClient_subscribe.c",
                    "file_size": 3410
                },
                {
                    "file_additions": 1,
                    "file_deletions": 1,
                    "file_exists": true,
                    "file_name": "src/samples/paho_c_sub.c",
                    "file_size": 9288
                },
                {
                    "file_additions": 63,
                    "file_deletions": 42,
                    "file_exists": true,
                    "file_name": "test/test5.c",
                    "file_size": 81211
                }
            ],
            "interesting": {
                "reopen": false,
                "status": false
            },
            "is_parent": false,
            "sha": "2fb4dae1ed16b6a23dcd0823bbe9ddc52c797c87"
        },
        {
            "associated_pull_request": [
                "https://github.com/eclipse/paho.mqtt.c/pull/254"
            ],
            "date": "2017-05-14 22:11:44",
            "diff": "eclipse_paho.mqtt.c/issue_186/commit_aadd42414ab38fca7bd71ba756f57611a2012dea.diff",
            "diff_additions": 315,
            "diff_deletions": 259,
            "diff_file_size": 375385,
            "diff_url": "https://github.com/eclipse/paho.mqtt.c/commit/aadd42414ab38fca7bd71ba756f57611a2012dea.diff",
            "exists": true,
            "files": [
                {
                    "file_additions": 74,
                    "file_deletions": 119,
                    "file_exists": true,
                    "file_name": "src/MQTTAsync.c",
                    "file_size": 47373
                },
                {
                    "file_additions": 32,
                    "file_deletions": 4,
                    "file_exists": true,
                    "file_name": "src/MQTTClient.c",
                    "file_size": 81130
                },
                {
                    "file_additions": 1,
                    "file_deletions": 1,
                    "file_exists": true,
                    "file_name": "src/MQTTPersistence.c",
                    "file_size": 25517
                },
                {
                    "file_additions": 3,
                    "file_deletions": 2,
                    "file_exists": true,
                    "file_name": "src/MQTTPersistenceDefault.c",
                    "file_size": 21664
                },
                {
                    "file_additions": 11,
                    "file_deletions": 3,
                    "file_exists": true,
                    "file_name": "src/MQTTProtocolOut.c",
                    "file_size": 13006
                },
                {
                    "file_additions": 29,
                    "file_deletions": 23,
                    "file_exists": true,
                    "file_name": "src/MQTTVersion.c",
                    "file_size": 6063
                },
                {
                    "file_additions": 57,
                    "file_deletions": 37,
                    "file_exists": true,
                    "file_name": "src/SSLSocket.c",
                    "file_size": 31590
                },
                {
                    "file_additions": 18,
                    "file_deletions": 7,
                    "file_exists": true,
                    "file_name": "src/Socket.c",
                    "file_size": 28343
                },
                {
                    "file_additions": 7,
                    "file_deletions": 1,
                    "file_exists": true,
                    "file_name": "src/SocketBuffer.c",
                    "file_size": 10658
                },
                {
                    "file_additions": 3,
                    "file_deletions": 3,
                    "file_exists": true,
                    "file_name": "src/samples/MQTTAsync_publish.c",
                    "file_size": 5033
                },
                {
                    "file_additions": 4,
                    "file_deletions": 4,
                    "file_exists": true,
                    "file_name": "src/samples/MQTTAsync_subscribe.c",
                    "file_size": 4952
                },
                {
                    "file_additions": 4,
                    "file_deletions": 4,
                    "file_exists": true,
                    "file_name": "src/samples/MQTTClient_publish.c",
                    "file_size": 2543
                },
                {
                    "file_additions": 4,
                    "file_deletions": 4,
                    "file_exists": true,
                    "file_name": "src/samples/MQTTClient_publish_async.c",
                    "file_size": 3604
                },
                {
                    "file_additions": 4,
                    "file_deletions": 4,
                    "file_exists": true,
                    "file_name": "src/samples/MQTTClient_subscribe.c",
                    "file_size": 3410
                },
                {
                    "file_additions": 1,
                    "file_deletions": 1,
                    "file_exists": true,
                    "file_name": "src/samples/paho_c_sub.c",
                    "file_size": 9288
                },
                {
                    "file_additions": 63,
                    "file_deletions": 42,
                    "file_exists": true,
                    "file_name": "test/test5.c",
                    "file_size": 81211
                }
            ],
            "interesting": {
                "reopen": false,
                "status": false
            },
            "is_parent": false,
            "sha": "aadd42414ab38fca7bd71ba756f57611a2012dea"
        }
    ],
    "first_commit": "2017-04-24 10:18:43",
    "last_commit": "2017-05-14 22:11:44",
    "number": 186,
    "pull_request": "None",
    "score": {
        "accidental_reopen_likely": false,
        "all_labels": [
            "bug",
            "fix added"
        ],
        "contains_keywords": [
            "report",
            "error",
            "bug",
            "test",
            "fix",
            "issu",
            "work"
        ],
        "fix_size": 838,
        "has_labels": [
            "bug"
        ],
        "intersecting": {
            "computed_score": 0.9575371549893843,
            "final_commit_size": 471,
            "intersection_size": 451,
            "previous_commits_size": 818
        },
        "is_makefile_based": true,
        "no_new_files": [],
        "no_other_files": false,
        "num_prohibited_files": 86367,
        "prohibited_files": [
            "hal/inc/pinmap_hal.h",
            "Debug/marvin.bin",
            "Debug/marvin.elf",
            "Debug/marvin.hex",
            "Debug/marvin.bin",
            "Debug/marvin.elf",
            "Debug/marvin.hex",
            "inc/spark_utilities.h",
            "Debug/marvin.bin",
            "Debug/marvin.elf"
        ],
        "reopen": false,
        "reopen_events": [
            [
                "2017-04-24 13:06:11",
                "commit"
            ],
            [
                "2017-04-24 21:16:23",
                "commit"
            ],
            [
                "2017-05-01 10:40:09",
                "closed"
            ],
            [
                "2017-05-14 21:44:50",
                "commit"
            ],
            [
                "2017-05-14 22:12:38",
                "commit"
            ]
        ],
        "status": true,
        "strategy": true,
        "total_changes": 1581
    }
}