{
    "all_issues": 822,
    "interesting_issues": 3,
    "last_update": "2021-05-16 11:01:11.214309",
    "license": {
        "download": "https://raw.githubusercontent.com/NagiosEnterprises/nagioscore/master/LICENSE",
        "name": "GNU General Public License v2.0"
    },
    "ratio": 0.0036496350364963502,
    "size": 25461,
    "stars": 965,
    "url": "https://github.com/NagiosEnterprises/nagioscore"
}