{
    "category": [
        "hardware/OS",
        "GUI"
    ],
    "commits": [
        {
            "associated_pull_request": [
                "https://github.com/surge-synthesizer/surge/pull/1981"
            ],
            "date": "2020-05-29 14:16:43",
            "diff": "surge-synthesizer_surge/issue_1659/commit_50a0c27201db8a82769081161c489d855f12ebab.diff",
            "diff_additions": 12,
            "diff_deletions": 83,
            "diff_file_size": 148437,
            "diff_url": "https://github.com/surge-synthesizer/surge/commit/50a0c27201db8a82769081161c489d855f12ebab.diff",
            "exists": true,
            "files": [
                {
                    "file_additions": 3,
                    "file_deletions": 3,
                    "file_exists": true,
                    "file_name": "src/common/Parameter.cpp",
                    "file_size": 122346
                },
                {
                    "file_additions": 3,
                    "file_deletions": 14,
                    "file_exists": true,
                    "file_name": "src/common/SurgeSynthesizerIO.cpp",
                    "file_size": 16959
                },
                {
                    "file_additions": 1,
                    "file_deletions": 14,
                    "file_exists": true,
                    "file_name": "src/common/UserDefaults.cpp",
                    "file_size": 9132
                },
                {
                    "file_additions": 1,
                    "file_deletions": 13,
                    "file_exists": false,
                    "file_name": "src/common/WavSupport.cpp",
                    "file_size": 0
                },
                {
                    "file_additions": 2,
                    "file_deletions": 15,
                    "file_exists": false,
                    "file_name": "src/common/gui/COscillatorDisplay.cpp",
                    "file_size": 0
                },
                {
                    "file_additions": 1,
                    "file_deletions": 11,
                    "file_exists": false,
                    "file_name": "src/common/gui/SkinSupport.cpp",
                    "file_size": 0
                },
                {
                    "file_additions": 1,
                    "file_deletions": 13,
                    "file_exists": false,
                    "file_name": "src/common/gui/SurgeGUIEditor.cpp",
                    "file_size": 0
                }
            ],
            "interesting": {
                "reopen": false,
                "status": false
            },
            "is_parent": true,
            "sha": "50a0c27201db8a82769081161c489d855f12ebab"
        },
        {
            "associated_pull_request": [],
            "date": "2020-05-29 15:48:06",
            "diff": "surge-synthesizer_surge/issue_1659/commit_2c9e818d20bc8df116655ab04b761c906d1821a2.diff",
            "diff_additions": 19,
            "diff_deletions": 2,
            "diff_file_size": 0,
            "diff_url": "https://github.com/surge-synthesizer/surge/commit/2c9e818d20bc8df116655ab04b761c906d1821a2.diff",
            "exists": true,
            "files": [
                {
                    "file_additions": 19,
                    "file_deletions": 2,
                    "file_exists": false,
                    "file_name": "src/common/gui/CLFOGui.cpp",
                    "file_size": 0
                }
            ],
            "interesting": {
                "reopen": false,
                "status": false
            },
            "is_parent": false,
            "sha": "2c9e818d20bc8df116655ab04b761c906d1821a2"
        },
        {
            "associated_pull_request": [
                "https://github.com/surge-synthesizer/surge/pull/1983"
            ],
            "date": "2020-05-29 15:48:06",
            "diff": "surge-synthesizer_surge/issue_1659/commit_82749147cbb3b51ea137b36cfda6fe69811d5174.diff",
            "diff_additions": 26,
            "diff_deletions": 8,
            "diff_file_size": 0,
            "diff_url": "https://github.com/surge-synthesizer/surge/commit/82749147cbb3b51ea137b36cfda6fe69811d5174.diff",
            "exists": true,
            "files": [
                {
                    "file_additions": 26,
                    "file_deletions": 8,
                    "file_exists": false,
                    "file_name": "src/common/gui/CLFOGui.cpp",
                    "file_size": 0
                }
            ],
            "interesting": {
                "reopen": false,
                "status": false
            },
            "is_parent": false,
            "sha": "82749147cbb3b51ea137b36cfda6fe69811d5174"
        },
        {
            "associated_pull_request": [
                "https://github.com/surge-synthesizer/surge/pull/1983"
            ],
            "date": "2020-05-29 18:01:52",
            "diff": "surge-synthesizer_surge/issue_1659/commit_7a2bd49fafae7f78d451b4f7f0c78dac29503ae1.diff",
            "diff_additions": 26,
            "diff_deletions": 8,
            "diff_file_size": 0,
            "diff_url": "https://github.com/surge-synthesizer/surge/commit/7a2bd49fafae7f78d451b4f7f0c78dac29503ae1.diff",
            "exists": true,
            "files": [
                {
                    "file_additions": 26,
                    "file_deletions": 8,
                    "file_exists": false,
                    "file_name": "src/common/gui/CLFOGui.cpp",
                    "file_size": 0
                }
            ],
            "interesting": {
                "reopen": true,
                "status": true
            },
            "is_parent": false,
            "sha": "7a2bd49fafae7f78d451b4f7f0c78dac29503ae1"
        },
        {
            "associated_pull_request": [
                "https://github.com/surge-synthesizer/surge/pull/2265"
            ],
            "date": "2020-07-01 20:55:14",
            "diff": "surge-synthesizer_surge/issue_1659/commit_cd0043364e4b67eaafd6f7c44204f3823e4eca65.diff",
            "diff_additions": 11,
            "diff_deletions": 4,
            "diff_file_size": 0,
            "diff_url": "https://github.com/surge-synthesizer/surge/commit/cd0043364e4b67eaafd6f7c44204f3823e4eca65.diff",
            "exists": true,
            "files": [
                {
                    "file_additions": 11,
                    "file_deletions": 4,
                    "file_exists": false,
                    "file_name": "src/common/gui/CLFOGui.cpp",
                    "file_size": 0
                }
            ],
            "interesting": {
                "reopen": false,
                "status": true
            },
            "is_parent": false,
            "sha": "cd0043364e4b67eaafd6f7c44204f3823e4eca65"
        },
        {
            "associated_pull_request": [
                "https://github.com/surge-synthesizer/surge/pull/2265"
            ],
            "date": "2020-07-01 20:55:52",
            "diff": "surge-synthesizer_surge/issue_1659/commit_2f695845da2c61841d0cd9a9834fa55714b7b041.diff",
            "diff_additions": 11,
            "diff_deletions": 4,
            "diff_file_size": 0,
            "diff_url": "https://github.com/surge-synthesizer/surge/commit/2f695845da2c61841d0cd9a9834fa55714b7b041.diff",
            "exists": true,
            "files": [
                {
                    "file_additions": 11,
                    "file_deletions": 4,
                    "file_exists": false,
                    "file_name": "src/common/gui/CLFOGui.cpp",
                    "file_size": 0
                }
            ],
            "interesting": {
                "reopen": false,
                "status": false
            },
            "is_parent": false,
            "sha": "2f695845da2c61841d0cd9a9834fa55714b7b041"
        },
        {
            "associated_pull_request": [
                "https://github.com/surge-synthesizer/surge/pull/2267"
            ],
            "date": "2020-07-01 21:46:42",
            "diff": "surge-synthesizer_surge/issue_1659/commit_76009a89a5f044ca00a790f2bd7b728c43b167f8.diff",
            "diff_additions": 31,
            "diff_deletions": 30,
            "diff_file_size": 0,
            "diff_url": "https://github.com/surge-synthesizer/surge/commit/76009a89a5f044ca00a790f2bd7b728c43b167f8.diff",
            "exists": true,
            "files": [
                {
                    "file_additions": 31,
                    "file_deletions": 30,
                    "file_exists": false,
                    "file_name": "src/common/gui/CLFOGui.cpp",
                    "file_size": 0
                }
            ],
            "interesting": {
                "reopen": false,
                "status": false
            },
            "is_parent": false,
            "sha": "76009a89a5f044ca00a790f2bd7b728c43b167f8"
        },
        {
            "associated_pull_request": [
                "https://github.com/surge-synthesizer/surge/pull/2267"
            ],
            "date": "2020-07-01 22:13:59",
            "diff": "surge-synthesizer_surge/issue_1659/commit_837361550da30e00b1d8d80aaddfab6e8ffa2c20.diff",
            "diff_additions": 37,
            "diff_deletions": 31,
            "diff_file_size": 0,
            "diff_url": "https://github.com/surge-synthesizer/surge/commit/837361550da30e00b1d8d80aaddfab6e8ffa2c20.diff",
            "exists": true,
            "files": [
                {
                    "file_additions": 37,
                    "file_deletions": 31,
                    "file_exists": false,
                    "file_name": "src/common/gui/CLFOGui.cpp",
                    "file_size": 0
                }
            ],
            "interesting": {
                "reopen": false,
                "status": false
            },
            "is_parent": false,
            "sha": "837361550da30e00b1d8d80aaddfab6e8ffa2c20"
        }
    ],
    "first_commit": "2020-05-29 14:16:43",
    "last_commit": "2020-07-01 22:13:59",
    "number": 1659,
    "pull_request": "None",
    "score": {
        "accidental_reopen_likely": false,
        "all_labels": [
            "UX"
        ],
        "contains_keywords": [
            "issu",
            "warn",
            "confirm",
            "fix",
            "test"
        ],
        "fix_size": 91,
        "has_labels": [],
        "intersecting": {
            "computed_score": 0.7931034482758621,
            "final_commit_size": 58,
            "intersection_size": 46,
            "previous_commits_size": 79
        },
        "is_makefile_based": true,
        "no_new_files": [],
        "no_other_files": false,
        "num_prohibited_files": 79237,
        "prohibited_files": [
            "tools/building.py",
            "tools/building.py",
            "tools/building.py",
            "emcc.py",
            "src/library_emmalloc.js",
            "src/shell.js",
            "tests/test_core.py",
            "src/shell.js",
            "tests/test_core.py",
            "src/library.js"
        ],
        "reopen": true,
        "reopen_events": [
            [
                "2020-05-29 15:49:14",
                "commit"
            ],
            [
                "2020-05-29 16:40:54",
                "commit"
            ],
            [
                "2020-05-29 18:01:53",
                "closed"
            ],
            [
                "2020-05-29 18:01:55",
                "commit"
            ],
            [
                "2020-06-03 04:04:45",
                "reopened"
            ],
            [
                "2020-07-01 20:55:36",
                "commit"
            ],
            [
                "2020-07-01 20:55:53",
                "closed"
            ],
            [
                "2020-07-01 20:55:54",
                "commit"
            ],
            [
                "2020-07-01 21:47:00",
                "commit"
            ],
            [
                "2020-07-01 22:14:01",
                "commit"
            ]
        ],
        "status": true,
        "strategy": true,
        "total_changes": 343
    }
}