{
    "commits": [
        {
            "associated_pull_request": [],
            "date": "2017-08-27 21:56:18+00:00",
            "diff": "",
            "diff_additions": 0,
            "diff_deletions": 0,
            "diff_file_size": 0,
            "diff_url": "https://github.com/dresden-elektronik/deconz-rest-plugin/commit/14eb0319fa5ec6cbfe050c87d28646bfffc7a73f.diff",
            "exists": true,
            "files": [],
            "interesting": {
                "reopen": false,
                "status": false
            },
            "is_parent": true,
            "sha": "14eb0319fa5ec6cbfe050c87d28646bfffc7a73f"
        },
        {
            "associated_pull_request": [],
            "date": "2017-08-28 20:36:33+00:00",
            "diff": "dresden-elektronik_deconz-rest-plugin/issue_98/commit_4c6916525b07c424ff3d1dd67c5bd0270baa8b7c.diff",
            "diff_additions": 27,
            "diff_deletions": 5,
            "diff_file_size": 48830,
            "diff_url": "https://github.com/dresden-elektronik/deconz-rest-plugin/commit/4c6916525b07c424ff3d1dd67c5bd0270baa8b7c.diff",
            "exists": true,
            "files": [
                {
                    "file_additions": 27,
                    "file_deletions": 5,
                    "file_exists": true,
                    "file_name": "rest_rules.cpp",
                    "file_size": 48830
                }
            ],
            "interesting": {
                "reopen": false,
                "status": false
            },
            "is_parent": false,
            "sha": "4c6916525b07c424ff3d1dd67c5bd0270baa8b7c"
        },
        {
            "associated_pull_request": [],
            "date": "2017-08-29 19:20:22+00:00",
            "diff": "dresden-elektronik_deconz-rest-plugin/issue_98/commit_a3a473aa0e85d8494c2da577d6b75cc6145c7076.diff",
            "diff_additions": 27,
            "diff_deletions": 14,
            "diff_file_size": 48830,
            "diff_url": "https://github.com/dresden-elektronik/deconz-rest-plugin/commit/a3a473aa0e85d8494c2da577d6b75cc6145c7076.diff",
            "exists": true,
            "files": [
                {
                    "file_additions": 27,
                    "file_deletions": 14,
                    "file_exists": true,
                    "file_name": "rest_rules.cpp",
                    "file_size": 48830
                }
            ],
            "interesting": {
                "reopen": true,
                "status": false
            },
            "is_parent": false,
            "sha": "a3a473aa0e85d8494c2da577d6b75cc6145c7076"
        },
        {
            "associated_pull_request": [],
            "date": "2017-09-02 18:46:16+00:00",
            "diff": "dresden-elektronik_deconz-rest-plugin/issue_98/commit_c91c3ca5f2304bfd4fd83b88f272130c0197502e.diff",
            "diff_additions": 386,
            "diff_deletions": 204,
            "diff_file_size": 1475705,
            "diff_url": "https://github.com/dresden-elektronik/deconz-rest-plugin/commit/c91c3ca5f2304bfd4fd83b88f272130c0197502e.diff",
            "exists": true,
            "files": [
                {
                    "file_additions": 1,
                    "file_deletions": 1,
                    "file_exists": true,
                    "file_name": "bindings.cpp",
                    "file_size": 166717
                },
                {
                    "file_additions": 78,
                    "file_deletions": 75,
                    "file_exists": true,
                    "file_name": "de_web_plugin.cpp",
                    "file_size": 683199
                },
                {
                    "file_additions": 23,
                    "file_deletions": 3,
                    "file_exists": true,
                    "file_name": "event.cpp",
                    "file_size": 3286
                },
                {
                    "file_additions": 2,
                    "file_deletions": 0,
                    "file_exists": true,
                    "file_name": "event_queue.cpp",
                    "file_size": 1339
                },
                {
                    "file_additions": 3,
                    "file_deletions": 2,
                    "file_exists": true,
                    "file_name": "ias_zone.cpp",
                    "file_size": 28500
                },
                {
                    "file_additions": 34,
                    "file_deletions": 20,
                    "file_exists": true,
                    "file_name": "resource.cpp",
                    "file_size": 73301
                },
                {
                    "file_additions": 14,
                    "file_deletions": 14,
                    "file_exists": true,
                    "file_name": "rest_groups.cpp",
                    "file_size": 125895
                },
                {
                    "file_additions": 4,
                    "file_deletions": 4,
                    "file_exists": true,
                    "file_name": "rest_lights.cpp",
                    "file_size": 168856
                },
                {
                    "file_additions": 217,
                    "file_deletions": 74,
                    "file_exists": true,
                    "file_name": "rest_rules.cpp",
                    "file_size": 48830
                },
                {
                    "file_additions": 10,
                    "file_deletions": 11,
                    "file_exists": true,
                    "file_name": "rest_sensors.cpp",
                    "file_size": 175782
                }
            ],
            "interesting": {
                "reopen": false,
                "status": false
            },
            "is_parent": false,
            "sha": "c91c3ca5f2304bfd4fd83b88f272130c0197502e"
        },
        {
            "associated_pull_request": [],
            "date": "2017-09-08 11:30:44+00:00",
            "diff": "dresden-elektronik_deconz-rest-plugin/issue_98/commit_a0daf8840df5234d3c6c768d5dc3e682b1f6f914.diff",
            "diff_additions": 27,
            "diff_deletions": 7,
            "diff_file_size": 175782,
            "diff_url": "https://github.com/dresden-elektronik/deconz-rest-plugin/commit/a0daf8840df5234d3c6c768d5dc3e682b1f6f914.diff",
            "exists": true,
            "files": [
                {
                    "file_additions": 27,
                    "file_deletions": 7,
                    "file_exists": true,
                    "file_name": "rest_sensors.cpp",
                    "file_size": 175782
                }
            ],
            "interesting": {
                "reopen": false,
                "status": false
            },
            "is_parent": false,
            "sha": "a0daf8840df5234d3c6c768d5dc3e682b1f6f914"
        },
        {
            "associated_pull_request": [
                "https://github.com/dresden-elektronik/deconz-rest-plugin/pull/5500"
            ],
            "date": "2021-10-28 15:51:30+00:00",
            "diff": "dresden-elektronik_deconz-rest-plugin/issue_98/commit_34cf3751ff509ee2df4999b36f07bc607eb2aaea.diff",
            "diff_additions": 17477,
            "diff_deletions": 1222,
            "diff_file_size": 2719501,
            "diff_url": "https://github.com/dresden-elektronik/deconz-rest-plugin/commit/34cf3751ff509ee2df4999b36f07bc607eb2aaea.diff",
            "exists": true,
            "files": [
                {
                    "file_additions": 765,
                    "file_deletions": 0,
                    "file_exists": true,
                    "file_name": "alarm_system.cpp",
                    "file_size": 21373
                },
                {
                    "file_additions": 196,
                    "file_deletions": 0,
                    "file_exists": true,
                    "file_name": "alarm_system_device_table.cpp",
                    "file_size": 5235
                },
                {
                    "file_additions": 218,
                    "file_deletions": 0,
                    "file_exists": true,
                    "file_name": "alarm_system_event_handler.cpp",
                    "file_size": 6271
                },
                {
                    "file_additions": 6,
                    "file_deletions": 1,
                    "file_exists": true,
                    "file_name": "aps_controller_wrapper.cpp",
                    "file_size": 6251
                },
                {
                    "file_additions": 199,
                    "file_deletions": 9,
                    "file_exists": true,
                    "file_name": "bindings.cpp",
                    "file_size": 166717
                },
                {
                    "file_additions": 109,
                    "file_deletions": 0,
                    "file_exists": true,
                    "file_name": "crypto/random.cpp",
                    "file_size": 2062
                },
                {
                    "file_additions": 248,
                    "file_deletions": 0,
                    "file_exists": true,
                    "file_name": "crypto/scrypt.cpp",
                    "file_size": 9843
                },
                {
                    "file_additions": 1028,
                    "file_deletions": 35,
                    "file_exists": true,
                    "file_name": "database.cpp",
                    "file_size": 225844
                },
                {
                    "file_additions": 3,
                    "file_deletions": 129,
                    "file_exists": true,
                    "file_name": "de_otau.cpp",
                    "file_size": 6252
                },
                {
                    "file_additions": 967,
                    "file_deletions": 444,
                    "file_exists": true,
                    "file_name": "de_web_plugin.cpp",
                    "file_size": 683199
                },
                {
                    "file_additions": 1861,
                    "file_deletions": 0,
                    "file_exists": true,
                    "file_name": "device.cpp",
                    "file_size": 73867
                },
                {
                    "file_additions": 876,
                    "file_deletions": 0,
                    "file_exists": true,
                    "file_name": "device_access_fn.cpp",
                    "file_size": 66452
                },
                {
                    "file_additions": 185,
                    "file_deletions": 0,
                    "file_exists": true,
                    "file_name": "device_compat.cpp",
                    "file_size": 9012
                },
                {
                    "file_additions": 328,
                    "file_deletions": 0,
                    "file_exists": true,
                    "file_name": "device_ddf_init.cpp",
                    "file_size": 15049
                },
                {
                    "file_additions": 1737,
                    "file_deletions": 0,
                    "file_exists": true,
                    "file_name": "device_descriptions.cpp",
                    "file_size": 64420
                },
                {
                    "file_additions": 122,
                    "file_deletions": 0,
                    "file_exists": true,
                    "file_name": "device_js/device_js.cpp",
                    "file_size": 4831
                },
                {
                    "file_additions": 232,
                    "file_deletions": 0,
                    "file_exists": true,
                    "file_name": "device_js/device_js_wrappers.cpp",
                    "file_size": 7070
                },
                {
                    "file_additions": 246,
                    "file_deletions": 0,
                    "file_exists": true,
                    "file_name": "device_tick.cpp",
                    "file_size": 7329
                },
                {
                    "file_additions": 32,
                    "file_deletions": 0,
                    "file_exists": true,
                    "file_name": "electrical_measurement.cpp",
                    "file_size": 15144
                },
                {
                    "file_additions": 91,
                    "file_deletions": 12,
                    "file_exists": true,
                    "file_name": "event.cpp",
                    "file_size": 3286
                },
                {
                    "file_additions": 32,
                    "file_deletions": 1,
                    "file_exists": true,
                    "file_name": "event_emitter.cpp",
                    "file_size": 3923
                },
                {
                    "file_additions": 27,
                    "file_deletions": 0,
                    "file_exists": true,
                    "file_name": "event_queue.cpp",
                    "file_size": 1339
                },
                {
                    "file_additions": 2,
                    "file_deletions": 2,
                    "file_exists": true,
                    "file_name": "firmware_update.cpp",
                    "file_size": 20358
                },
                {
                    "file_additions": 165,
                    "file_deletions": 15,
                    "file_exists": true,
                    "file_name": "green_power.cpp",
                    "file_size": 12848
                },
                {
                    "file_additions": 9,
                    "file_deletions": 0,
                    "file_exists": true,
                    "file_name": "group.cpp",
                    "file_size": 6726
                },
                {
                    "file_additions": 300,
                    "file_deletions": 82,
                    "file_exists": true,
                    "file_name": "ias_ace.cpp",
                    "file_size": 12390
                },
                {
                    "file_additions": 95,
                    "file_deletions": 73,
                    "file_exists": true,
                    "file_name": "ias_zone.cpp",
                    "file_size": 28500
                },
                {
                    "file_additions": 5,
                    "file_deletions": 82,
                    "file_exists": true,
                    "file_name": "light_node.cpp",
                    "file_size": 28642
                },
                {
                    "file_additions": 21,
                    "file_deletions": 12,
                    "file_exists": true,
                    "file_name": "occupancy_sensing.cpp",
                    "file_size": 7834
                },
                {
                    "file_additions": 52,
                    "file_deletions": 76,
                    "file_exists": true,
                    "file_name": "permitJoin.cpp",
                    "file_size": 5927
                },
                {
                    "file_additions": 2,
                    "file_deletions": 2,
                    "file_exists": true,
                    "file_name": "poll_manager.cpp",
                    "file_size": 18817
                },
                {
                    "file_additions": 331,
                    "file_deletions": 0,
                    "file_exists": true,
                    "file_name": "power_configuration.cpp",
                    "file_size": 18050
                },
                {
                    "file_additions": 3,
                    "file_deletions": 0,
                    "file_exists": true,
                    "file_name": "product_match.cpp",
                    "file_size": 11197
                },
                {
                    "file_additions": 407,
                    "file_deletions": 18,
                    "file_exists": true,
                    "file_name": "resource.cpp",
                    "file_size": 73301
                },
                {
                    "file_additions": 747,
                    "file_deletions": 0,
                    "file_exists": true,
                    "file_name": "rest_alarmsystems.cpp",
                    "file_size": 22632
                },
                {
                    "file_additions": 20,
                    "file_deletions": 9,
                    "file_exists": true,
                    "file_name": "rest_configuration.cpp",
                    "file_size": 132131
                },
                {
                    "file_additions": 0,
                    "file_deletions": 0,
                    "file_exists": true,
                    "file_name": "rest_devices.cpp",
                    "file_size": 32709
                },
                {
                    "file_additions": 0,
                    "file_deletions": 16,
                    "file_exists": true,
                    "file_name": "rest_gateways.cpp",
                    "file_size": 14217
                },
                {
                    "file_additions": 10,
                    "file_deletions": 9,
                    "file_exists": true,
                    "file_name": "rest_groups.cpp",
                    "file_size": 125895
                },
                {
                    "file_additions": 83,
                    "file_deletions": 37,
                    "file_exists": true,
                    "file_name": "rest_lights.cpp",
                    "file_size": 168856
                },
                {
                    "file_additions": 62,
                    "file_deletions": 53,
                    "file_exists": true,
                    "file_name": "rest_rules.cpp",
                    "file_size": 48830
                },
                {
                    "file_additions": 93,
                    "file_deletions": 58,
                    "file_exists": true,
                    "file_name": "rest_sensors.cpp",
                    "file_size": 175782
                },
                {
                    "file_additions": 41,
                    "file_deletions": 21,
                    "file_exists": true,
                    "file_name": "rule.cpp",
                    "file_size": 19615
                },
                {
                    "file_additions": 75,
                    "file_deletions": 7,
                    "file_exists": true,
                    "file_name": "sensor.cpp",
                    "file_size": 14564
                },
                {
                    "file_additions": 16,
                    "file_deletions": 0,
                    "file_exists": true,
                    "file_name": "simple_metering.cpp",
                    "file_size": 11740
                },
                {
                    "file_additions": 330,
                    "file_deletions": 0,
                    "file_exists": true,
                    "file_name": "state_change.cpp",
                    "file_size": 9801
                },
                {
                    "file_additions": 2,
                    "file_deletions": 0,
                    "file_exists": true,
                    "file_name": "tests/000-catch2-main.cpp",
                    "file_size": 54
                },
                {
                    "file_additions": 583,
                    "file_deletions": 0,
                    "file_exists": true,
                    "file_name": "tests/001-device-1.cpp",
                    "file_size": 21651
                },
                {
                    "file_additions": 161,
                    "file_deletions": 0,
                    "file_exists": true,
                    "file_name": "tests/101-resourceitem-dt-time.cpp",
                    "file_size": 5128
                },
                {
                    "file_additions": 24,
                    "file_deletions": 0,
                    "file_exists": true,
                    "file_name": "tests/201-device-js.cpp",
                    "file_size": 469
                },
                {
                    "file_additions": 131,
                    "file_deletions": 0,
                    "file_exists": true,
                    "file_name": "tests/301-utils-mappedval.cpp",
                    "file_size": 3110
                },
                {
                    "file_additions": 79,
                    "file_deletions": 0,
                    "file_exists": true,
                    "file_name": "tests/302-http-header.cpp",
                    "file_size": 2655
                },
                {
                    "file_additions": 68,
                    "file_deletions": 0,
                    "file_exists": true,
                    "file_name": "tests/303-timeref.cpp",
                    "file_size": 1664
                },
                {
                    "file_additions": 51,
                    "file_deletions": 12,
                    "file_exists": true,
                    "file_name": "tuya.cpp",
                    "file_size": 69494
                },
                {
                    "file_additions": 591,
                    "file_deletions": 0,
                    "file_exists": true,
                    "file_name": "ui/ddf_bindingeditor.cpp",
                    "file_size": 16186
                },
                {
                    "file_additions": 612,
                    "file_deletions": 0,
                    "file_exists": true,
                    "file_name": "ui/ddf_editor.cpp",
                    "file_size": 16156
                },
                {
                    "file_additions": 929,
                    "file_deletions": 0,
                    "file_exists": true,
                    "file_name": "ui/ddf_itemeditor.cpp",
                    "file_size": 26468
                },
                {
                    "file_additions": 191,
                    "file_deletions": 0,
                    "file_exists": true,
                    "file_name": "ui/ddf_itemlist.cpp",
                    "file_size": 5245
                },
                {
                    "file_additions": 399,
                    "file_deletions": 0,
                    "file_exists": true,
                    "file_name": "ui/ddf_treeview.cpp",
                    "file_size": 11848
                },
                {
                    "file_additions": 427,
                    "file_deletions": 0,
                    "file_exists": true,
                    "file_name": "ui/device_widget.cpp",
                    "file_size": 14024
                },
                {
                    "file_additions": 47,
                    "file_deletions": 0,
                    "file_exists": true,
                    "file_name": "ui/text_lineedit.cpp",
                    "file_size": 851
                },
                {
                    "file_additions": 2,
                    "file_deletions": 0,
                    "file_exists": true,
                    "file_name": "utils/bufstring.cpp",
                    "file_size": 24
                },
                {
                    "file_additions": 47,
                    "file_deletions": 0,
                    "file_exists": true,
                    "file_name": "utils/stringcache.cpp",
                    "file_size": 1123
                },
                {
                    "file_additions": 79,
                    "file_deletions": 0,
                    "file_exists": true,
                    "file_name": "utils/utils.cpp",
                    "file_size": 10913
                },
                {
                    "file_additions": 17,
                    "file_deletions": 4,
                    "file_exists": true,
                    "file_name": "websocket_server.cpp",
                    "file_size": 5316
                },
                {
                    "file_additions": 104,
                    "file_deletions": 0,
                    "file_exists": true,
                    "file_name": "xiaomi.cpp",
                    "file_size": 36824
                },
                {
                    "file_additions": 348,
                    "file_deletions": 0,
                    "file_exists": true,
                    "file_name": "zcl/zcl.cpp",
                    "file_size": 16074
                },
                {
                    "file_additions": 183,
                    "file_deletions": 0,
                    "file_exists": true,
                    "file_name": "zdp/zdp.cpp",
                    "file_size": 7758
                },
                {
                    "file_additions": 25,
                    "file_deletions": 3,
                    "file_exists": true,
                    "file_name": "zdp/zdp_handlers.cpp",
                    "file_size": 20335
                }
            ],
            "interesting": {
                "reopen": false,
                "status": false
            },
            "is_parent": false,
            "sha": "34cf3751ff509ee2df4999b36f07bc607eb2aaea"
        }
    ],
    "first_commit": "2017-08-27 21:56:18+00:00",
    "last_commit": "2021-10-28 15:51:30+00:00",
    "number": 98,
    "pull_request": "None",
    "score": {
        "accidental_reopen_likely": false,
        "all_labels": [],
        "contains_keywords": [
            "confirm",
            "work",
            "fail",
            "chang",
            "fix",
            "issu",
            "reason",
            "test",
            "fault",
            "warn",
            "bug",
            "error",
            "problem",
            "report",
            "workaround"
        ],
        "fix_size": 6277,
        "has_labels": [],
        "intersecting": {
            "computed_score": 0.008886565603763722,
            "final_commit_size": 5739,
            "intersection_size": 51,
            "previous_commits_size": 589
        },
        "is_makefile_based": true,
        "no_new_files": [
            "aps_controller_wrapper.cpp",
            "database.cpp",
            "de_otau.cpp",
            "electrical_measurement.cpp",
            "event_emitter.cpp",
            "firmware_update.cpp",
            "green_power.cpp",
            "group.cpp",
            "ias_ace.cpp",
            "light_node.cpp",
            "occupancy_sensing.cpp",
            "permitJoin.cpp",
            "poll_manager.cpp",
            "product_match.cpp",
            "rest_configuration.cpp",
            "rest_devices.cpp",
            "rest_gateways.cpp",
            "rule.cpp",
            "sensor.cpp",
            "simple_metering.cpp",
            "tuya.cpp",
            "utils/utils.cpp",
            "websocket_server.cpp",
            "xiaomi.cpp",
            "zdp/zdp_handlers.cpp"
        ],
        "no_other_files": false,
        "num_prohibited_files": 219006,
        "prohibited_files": [
            "server/src/main/java/com/genymobile/scrcpy/Device.java",
            "server/src/main/java/com/genymobile/scrcpy/wrappers/SurfaceControl.java",
            "server/src/main/java/com/genymobile/scrcpy/Device.java",
            "server/src/main/java/com/genymobile/scrcpy/wrappers/SurfaceControl.java",
            "app/meson.build",
            "app/scrcpy.1",
            "app/src/common.h",
            "app/src/scrcpy.h",
            "app/src/server.h",
            "server/src/main/java/com/genymobile/scrcpy/Workarounds.java"
        ],
        "reopen": true,
        "reopen_events": [
            [
                "2017-08-28 20:36:48+00:00",
                "commit"
            ],
            [
                "2017-08-29 19:21:09+00:00",
                "commit"
            ],
            [
                "2017-09-01 13:21:06+00:00",
                "closed"
            ],
            [
                "2017-09-01 13:21:10+00:00",
                "reopened"
            ],
            [
                "2017-09-02 18:46:31+00:00",
                "commit"
            ],
            [
                "2017-09-08 11:31:11+00:00",
                "commit"
            ],
            [
                "2017-09-10 20:54:23+00:00",
                "closed"
            ],
            [
                "2021-11-26 14:35:09+00:00",
                "commit"
            ]
        ],
        "status": false,
        "strategy": true,
        "total_changes": 19396
    }
}