{
    "category": [
        "network/protocols",
        "control flow"
    ],
    "commits": [
        {
            "associated_pull_request": [],
            "date": "2016-02-15 07:34:44",
            "diff": "glfw_glfw/issue_706/commit_c2efe87cffcb6509363a8b9d540a8958367a9c29.diff",
            "diff_additions": 11,
            "diff_deletions": 7,
            "diff_file_size": 35933,
            "diff_url": "https://github.com/glfw/glfw/commit/c2efe87cffcb6509363a8b9d540a8958367a9c29.diff",
            "exists": true,
            "files": [
                {
                    "file_additions": 11,
                    "file_deletions": 7,
                    "file_exists": true,
                    "file_name": "tests/glfwinfo.c",
                    "file_size": 35933
                }
            ],
            "interesting": {
                "reopen": false,
                "status": false
            },
            "is_parent": true,
            "sha": "c2efe87cffcb6509363a8b9d540a8958367a9c29"
        },
        {
            "associated_pull_request": [],
            "date": "2016-02-15 14:34:33",
            "diff": "glfw_glfw/issue_706/commit_0268fa113d32adf3d8ac3fe278aa361276e48952.diff",
            "diff_additions": 54,
            "diff_deletions": 15,
            "diff_file_size": 76576,
            "diff_url": "https://github.com/glfw/glfw/commit/0268fa113d32adf3d8ac3fe278aa361276e48952.diff",
            "exists": true,
            "files": [
                {
                    "file_additions": 20,
                    "file_deletions": 8,
                    "file_exists": true,
                    "file_name": "src/egl_context.c",
                    "file_size": 27141
                },
                {
                    "file_additions": 16,
                    "file_deletions": 4,
                    "file_exists": true,
                    "file_name": "src/glx_context.c",
                    "file_size": 22488
                },
                {
                    "file_additions": 18,
                    "file_deletions": 3,
                    "file_exists": true,
                    "file_name": "src/wgl_context.c",
                    "file_size": 26947
                }
            ],
            "interesting": {
                "reopen": false,
                "status": true
            },
            "is_parent": false,
            "sha": "0268fa113d32adf3d8ac3fe278aa361276e48952"
        },
        {
            "associated_pull_request": [],
            "date": "2016-02-15 14:34:33",
            "diff": "glfw_glfw/issue_706/commit_2826f3d42fc9d12b4336145ff647730e9e692945.diff",
            "diff_additions": 54,
            "diff_deletions": 15,
            "diff_file_size": 76576,
            "diff_url": "https://github.com/glfw/glfw/commit/2826f3d42fc9d12b4336145ff647730e9e692945.diff",
            "exists": true,
            "files": [
                {
                    "file_additions": 20,
                    "file_deletions": 8,
                    "file_exists": true,
                    "file_name": "src/egl_context.c",
                    "file_size": 27141
                },
                {
                    "file_additions": 16,
                    "file_deletions": 4,
                    "file_exists": true,
                    "file_name": "src/glx_context.c",
                    "file_size": 22488
                },
                {
                    "file_additions": 18,
                    "file_deletions": 3,
                    "file_exists": true,
                    "file_name": "src/wgl_context.c",
                    "file_size": 26947
                }
            ],
            "interesting": {
                "reopen": false,
                "status": false
            },
            "is_parent": false,
            "sha": "2826f3d42fc9d12b4336145ff647730e9e692945"
        }
    ],
    "first_commit": "2016-02-15 07:34:44",
    "last_commit": "2016-02-18 08:37:19",
    "number": 706,
    "pull_request": "None",
    "score": {
        "accidental_reopen_likely": false,
        "all_labels": [
            "Mir",
            "Wayland",
            "Windows",
            "X11",
            "bug",
            "verified"
        ],
        "contains_keywords": [],
        "fix_size": 75,
        "has_labels": [
            "bug"
        ],
        "intersecting": {
            "computed_score": 0.7068965517241379,
            "final_commit_size": 58,
            "intersection_size": 41,
            "previous_commits_size": 58
        },
        "is_makefile_based": true,
        "no_new_files": [],
        "no_other_files": false,
        "num_prohibited_files": 60541,
        "prohibited_files": [
            "hal/inc/pinmap_hal.h",
            "Debug/marvin.bin",
            "Debug/marvin.elf",
            "Debug/marvin.hex",
            "Debug/marvin.bin",
            "Debug/marvin.elf",
            "Debug/marvin.hex",
            "inc/spark_utilities.h",
            "Debug/marvin.bin",
            "Debug/marvin.elf"
        ],
        "reopen": false,
        "reopen_events": [
            [
                "2016-02-15 14:39:15",
                "commit"
            ],
            [
                "2016-02-15 14:44:52",
                "commit"
            ],
            [
                "2016-02-18 10:01:06",
                "closed"
            ],
            [
                "2016-02-18 10:01:06",
                "commit"
            ]
        ],
        "status": true,
        "strategy": true,
        "total_changes": 156
    }
}