{
    "category": [
        "memory",
        "network/protocols"
    ],
    "commits": [
        {
            "associated_pull_request": [],
            "date": "2018-05-02 04:24:20",
            "diff": "openssl_openssl/issue_4929/commit_6ebb49f3f9c9333611192561979bb799fa1eb76d.diff",
            "diff_additions": 26,
            "diff_deletions": 23,
            "diff_file_size": 23119,
            "diff_url": "https://github.com/openssl/openssl/commit/6ebb49f3f9c9333611192561979bb799fa1eb76d.diff",
            "exists": true,
            "files": [
                {
                    "file_additions": 10,
                    "file_deletions": 10,
                    "file_exists": true,
                    "file_name": "crypto/rand/rand_lib.c",
                    "file_size": 23119
                },
                {
                    "file_additions": 5,
                    "file_deletions": 5,
                    "file_exists": false,
                    "file_name": "crypto/rand/rand_unix.c",
                    "file_size": 0
                },
                {
                    "file_additions": 8,
                    "file_deletions": 5,
                    "file_exists": false,
                    "file_name": "crypto/rand/rand_vms.c",
                    "file_size": 0
                },
                {
                    "file_additions": 3,
                    "file_deletions": 3,
                    "file_exists": false,
                    "file_name": "crypto/rand/rand_win.c",
                    "file_size": 0
                }
            ],
            "interesting": {
                "reopen": false,
                "status": true
            },
            "is_parent": true,
            "sha": "6ebb49f3f9c9333611192561979bb799fa1eb76d"
        },
        {
            "associated_pull_request": [],
            "date": "2018-05-03 11:07:47",
            "diff": "openssl_openssl/issue_4929/commit_8a197b533d387c522f9c75ef162364783caca25a.diff",
            "diff_additions": 29,
            "diff_deletions": 3,
            "diff_file_size": 287439,
            "diff_url": "https://github.com/openssl/openssl/commit/8a197b533d387c522f9c75ef162364783caca25a.diff",
            "exists": true,
            "files": [
                {
                    "file_additions": 1,
                    "file_deletions": 3,
                    "file_exists": true,
                    "file_name": "ssl/statem/statem.c",
                    "file_size": 30609
                },
                {
                    "file_additions": 14,
                    "file_deletions": 0,
                    "file_exists": true,
                    "file_name": "ssl/statem/statem_clnt.c",
                    "file_size": 121677
                },
                {
                    "file_additions": 14,
                    "file_deletions": 0,
                    "file_exists": true,
                    "file_name": "ssl/statem/statem_srvr.c",
                    "file_size": 135153
                }
            ],
            "interesting": {
                "reopen": false,
                "status": false
            },
            "is_parent": false,
            "sha": "8a197b533d387c522f9c75ef162364783caca25a"
        },
        {
            "associated_pull_request": [],
            "date": "2018-05-03 11:07:47",
            "diff": "openssl_openssl/issue_4929/commit_f20404fce90919b614b737d07cc75d9e1c019fb8.diff",
            "diff_additions": 29,
            "diff_deletions": 3,
            "diff_file_size": 287439,
            "diff_url": "https://github.com/openssl/openssl/commit/f20404fce90919b614b737d07cc75d9e1c019fb8.diff",
            "exists": true,
            "files": [
                {
                    "file_additions": 1,
                    "file_deletions": 3,
                    "file_exists": true,
                    "file_name": "ssl/statem/statem.c",
                    "file_size": 30609
                },
                {
                    "file_additions": 14,
                    "file_deletions": 0,
                    "file_exists": true,
                    "file_name": "ssl/statem/statem_clnt.c",
                    "file_size": 121677
                },
                {
                    "file_additions": 14,
                    "file_deletions": 0,
                    "file_exists": true,
                    "file_name": "ssl/statem/statem_srvr.c",
                    "file_size": 135153
                }
            ],
            "interesting": {
                "reopen": true,
                "status": false
            },
            "is_parent": false,
            "sha": "f20404fce90919b614b737d07cc75d9e1c019fb8"
        },
        {
            "associated_pull_request": [
                "https://github.com/EktapopaT/openssl/pull/1"
            ],
            "date": "2018-05-03 11:07:47",
            "diff": "openssl_openssl/issue_4929/commit_4771f23e28eb5d11460d72dc35c6ac2fd30f9093.diff",
            "diff_additions": 31,
            "diff_deletions": 3,
            "diff_file_size": 287439,
            "diff_url": "https://github.com/openssl/openssl/commit/4771f23e28eb5d11460d72dc35c6ac2fd30f9093.diff",
            "exists": true,
            "files": [
                {
                    "file_additions": 1,
                    "file_deletions": 3,
                    "file_exists": true,
                    "file_name": "ssl/statem/statem.c",
                    "file_size": 30609
                },
                {
                    "file_additions": 15,
                    "file_deletions": 0,
                    "file_exists": true,
                    "file_name": "ssl/statem/statem_clnt.c",
                    "file_size": 121677
                },
                {
                    "file_additions": 15,
                    "file_deletions": 0,
                    "file_exists": true,
                    "file_name": "ssl/statem/statem_srvr.c",
                    "file_size": 135153
                }
            ],
            "interesting": {
                "reopen": false,
                "status": false
            },
            "is_parent": false,
            "sha": "4771f23e28eb5d11460d72dc35c6ac2fd30f9093"
        }
    ],
    "first_commit": "2018-05-02 08:18:29",
    "last_commit": "2018-05-11 12:54:56",
    "number": 4929,
    "pull_request": "None",
    "score": {
        "accidental_reopen_likely": false,
        "all_labels": [],
        "contains_keywords": [
            "fail",
            "chang",
            "test",
            "fix"
        ],
        "fix_size": 67,
        "has_labels": [],
        "intersecting": {
            "computed_score": 0.08333333333333333,
            "final_commit_size": 36,
            "intersection_size": 3,
            "previous_commits_size": 34
        },
        "is_makefile_based": false,
        "no_new_files": [],
        "no_other_files": false,
        "num_prohibited_files": 127995,
        "prohibited_files": [
            "hal/inc/pinmap_hal.h",
            "Debug/marvin.bin",
            "Debug/marvin.elf",
            "Debug/marvin.hex",
            "Debug/marvin.bin",
            "Debug/marvin.elf",
            "Debug/marvin.hex",
            "inc/spark_utilities.h",
            "Debug/marvin.bin",
            "Debug/marvin.elf"
        ],
        "reopen": true,
        "reopen_events": [
            [
                "2018-05-03 17:10:32",
                "commit"
            ],
            [
                "2018-05-08 08:35:29",
                "commit"
            ],
            [
                "2018-05-08 08:45:13",
                "closed"
            ],
            [
                "2018-05-08 08:45:13",
                "commit"
            ],
            [
                "2018-05-08 08:49:22",
                "reopened"
            ],
            [
                "2018-05-11 12:57:58",
                "commit"
            ],
            [
                "2018-07-13 09:03:56",
                "closed"
            ]
        ],
        "status": false,
        "strategy": true,
        "total_changes": 147
    }
}