{
    "covered_issues": [
        521,
        517,
        516,
        515,
        513,
        508,
        507,
        505,
        503,
        501,
        500,
        493,
        491,
        479,
        474,
        473,
        471,
        468,
        465,
        462,
        461,
        459,
        458,
        457,
        456,
        455,
        454,
        453,
        451,
        449,
        448,
        446,
        444,
        443,
        442,
        441,
        440,
        435,
        433,
        432,
        430,
        429,
        428,
        427,
        426,
        425,
        419,
        418,
        413,
        410,
        408,
        402,
        397,
        395,
        391,
        390,
        389,
        388,
        385,
        384,
        381,
        380,
        379,
        378,
        376,
        375,
        373,
        370,
        369,
        368,
        367,
        366,
        365,
        363,
        362,
        361,
        360,
        358,
        357,
        356,
        355,
        354,
        353,
        351,
        347,
        345,
        344,
        342,
        337,
        335,
        334,
        330,
        329,
        328,
        324,
        320,
        319,
        314,
        313,
        312,
        309,
        305,
        304,
        302,
        301,
        300,
        299,
        292,
        289,
        287,
        286,
        285,
        284,
        283,
        280,
        279,
        275,
        272,
        269,
        262,
        260,
        257,
        248,
        243,
        242,
        241,
        240,
        239,
        237,
        235,
        234,
        233,
        232,
        231,
        230,
        229,
        227,
        225,
        221,
        220,
        218,
        213,
        212,
        211,
        210,
        209,
        205,
        204,
        202,
        201,
        200,
        199,
        198,
        197,
        196,
        195,
        194,
        192,
        191,
        190,
        189,
        187,
        186,
        185,
        184,
        183,
        182,
        180,
        178,
        177,
        176,
        175,
        174,
        173,
        170,
        169,
        168,
        167,
        166,
        165,
        164,
        163,
        162,
        161,
        160,
        159,
        158,
        157,
        154,
        153,
        152,
        151,
        150,
        149,
        148,
        147,
        146,
        145,
        143,
        141,
        140,
        139,
        138,
        137,
        136,
        135,
        134,
        133,
        130,
        129,
        128,
        127,
        126,
        124,
        123,
        122,
        121,
        120,
        119,
        118,
        116,
        115,
        113,
        112,
        111,
        110,
        109,
        108,
        107,
        106,
        105,
        104,
        103,
        102,
        101,
        100,
        98,
        97,
        96,
        95,
        94,
        93,
        92,
        91,
        90,
        88,
        87,
        86,
        85,
        84,
        82,
        81,
        79,
        78,
        77,
        75,
        74,
        73,
        71,
        70,
        69,
        68,
        67,
        66,
        65,
        64,
        63,
        62,
        61,
        59,
        58,
        57,
        56,
        54,
        53,
        52,
        50,
        48,
        46,
        45,
        44,
        43,
        41,
        40,
        39,
        38,
        36,
        34,
        33,
        32,
        29,
        28,
        27,
        26,
        25,
        24,
        23,
        21,
        20,
        19,
        18,
        17,
        16,
        15,
        14,
        13,
        12,
        11,
        10,
        9,
        7,
        6,
        3,
        2,
        1
    ],
    "finished": true
}