{
    "commits": [
        {
            "associated_pull_request": [],
            "date": "2020-06-10 08:28:39+00:00",
            "diff": "mgba-emu_mgba/issue_1635/commit_0216557477ad2606a4e094ad53cefaae3185dd96.diff",
            "diff_additions": 7,
            "diff_deletions": 13,
            "diff_file_size": 58245,
            "diff_url": "https://github.com/mgba-emu/mgba/commit/0216557477ad2606a4e094ad53cefaae3185dd96.diff",
            "exists": true,
            "files": [
                {
                    "file_additions": 0,
                    "file_deletions": 10,
                    "file_exists": true,
                    "file_name": "src/gba/renderers/software-obj.c",
                    "file_size": 15918
                },
                {
                    "file_additions": 7,
                    "file_deletions": 3,
                    "file_exists": true,
                    "file_name": "src/gba/renderers/video-software.c",
                    "file_size": 42327
                }
            ],
            "interesting": {
                "reopen": false,
                "status": false
            },
            "is_parent": true,
            "sha": "0216557477ad2606a4e094ad53cefaae3185dd96"
        },
        {
            "associated_pull_request": [],
            "date": "2020-06-10 09:19:41+00:00",
            "diff": "mgba-emu_mgba/issue_1635/commit_a87cde8e93f7ccf5bcd671f1c94accaa328407e1.diff",
            "diff_additions": 11,
            "diff_deletions": 0,
            "diff_file_size": 74211,
            "diff_url": "https://github.com/mgba-emu/mgba/commit/a87cde8e93f7ccf5bcd671f1c94accaa328407e1.diff",
            "exists": true,
            "files": [
                {
                    "file_additions": 11,
                    "file_deletions": 0,
                    "file_exists": true,
                    "file_name": "src/gba/renderers/gl.c",
                    "file_size": 74211
                }
            ],
            "interesting": {
                "reopen": false,
                "status": false
            },
            "is_parent": false,
            "sha": "a87cde8e93f7ccf5bcd671f1c94accaa328407e1"
        },
        {
            "associated_pull_request": [],
            "date": "2020-06-10 09:19:41+00:00",
            "diff": "mgba-emu_mgba/issue_1635/commit_318a96bcb78da0f178fb87aacd78ef86521e4bb2.diff",
            "diff_additions": 5,
            "diff_deletions": 0,
            "diff_file_size": 74211,
            "diff_url": "https://github.com/mgba-emu/mgba/commit/318a96bcb78da0f178fb87aacd78ef86521e4bb2.diff",
            "exists": true,
            "files": [
                {
                    "file_additions": 5,
                    "file_deletions": 0,
                    "file_exists": true,
                    "file_name": "src/gba/renderers/gl.c",
                    "file_size": 74211
                }
            ],
            "interesting": {
                "reopen": false,
                "status": false
            },
            "is_parent": false,
            "sha": "318a96bcb78da0f178fb87aacd78ef86521e4bb2"
        },
        {
            "associated_pull_request": [],
            "date": "2020-06-15 02:45:09+00:00",
            "diff": "mgba-emu_mgba/issue_1635/commit_7f975f56f7ed33c3c1aef122fd52bc0c5bc8e31c.diff",
            "diff_additions": 0,
            "diff_deletions": 11,
            "diff_file_size": 74211,
            "diff_url": "https://github.com/mgba-emu/mgba/commit/7f975f56f7ed33c3c1aef122fd52bc0c5bc8e31c.diff",
            "exists": true,
            "files": [
                {
                    "file_additions": 0,
                    "file_deletions": 11,
                    "file_exists": true,
                    "file_name": "src/gba/renderers/gl.c",
                    "file_size": 74211
                }
            ],
            "interesting": {
                "reopen": false,
                "status": false
            },
            "is_parent": false,
            "sha": "7f975f56f7ed33c3c1aef122fd52bc0c5bc8e31c"
        },
        {
            "associated_pull_request": [],
            "date": "2020-06-15 02:46:59+00:00",
            "diff": "mgba-emu_mgba/issue_1635/commit_f0b03d7c901a8687db97ae88f2911e117e623f3c.diff",
            "diff_additions": 0,
            "diff_deletions": 5,
            "diff_file_size": 74211,
            "diff_url": "https://github.com/mgba-emu/mgba/commit/f0b03d7c901a8687db97ae88f2911e117e623f3c.diff",
            "exists": true,
            "files": [
                {
                    "file_additions": 0,
                    "file_deletions": 5,
                    "file_exists": true,
                    "file_name": "src/gba/renderers/gl.c",
                    "file_size": 74211
                }
            ],
            "interesting": {
                "reopen": true,
                "status": false
            },
            "is_parent": false,
            "sha": "f0b03d7c901a8687db97ae88f2911e117e623f3c"
        },
        {
            "associated_pull_request": [],
            "date": "2020-09-26 09:30:54+00:00",
            "diff": "mgba-emu_mgba/issue_1635/commit_e11dc3fad05bd655228c078147d5af2ec5733c1e.diff",
            "diff_additions": 30,
            "diff_deletions": 1,
            "diff_file_size": 74211,
            "diff_url": "https://github.com/mgba-emu/mgba/commit/e11dc3fad05bd655228c078147d5af2ec5733c1e.diff",
            "exists": true,
            "files": [
                {
                    "file_additions": 30,
                    "file_deletions": 1,
                    "file_exists": true,
                    "file_name": "src/gba/renderers/gl.c",
                    "file_size": 74211
                }
            ],
            "interesting": {
                "reopen": false,
                "status": false
            },
            "is_parent": false,
            "sha": "e11dc3fad05bd655228c078147d5af2ec5733c1e"
        }
    ],
    "first_commit": "2020-06-10 08:32:05+00:00",
    "last_commit": "2020-09-26 09:32:26+00:00",
    "number": 1635,
    "pull_request": "None",
    "score": {
        "accidental_reopen_likely": false,
        "all_labels": [
            "platform:GBA",
            "hardware:2D"
        ],
        "contains_keywords": [
            "fix"
        ],
        "fix_size": 38,
        "has_labels": [],
        "intersecting": {
            "computed_score": 0.34375,
            "final_commit_size": 32,
            "intersection_size": 11,
            "previous_commits_size": 17
        },
        "is_makefile_based": true,
        "no_new_files": [],
        "no_other_files": false,
        "num_prohibited_files": 158482,
        "prohibited_files": [
            "server/src/main/java/com/genymobile/scrcpy/Device.java",
            "server/src/main/java/com/genymobile/scrcpy/wrappers/SurfaceControl.java",
            "server/src/main/java/com/genymobile/scrcpy/Device.java",
            "server/src/main/java/com/genymobile/scrcpy/wrappers/SurfaceControl.java",
            "app/meson.build",
            "app/scrcpy.1",
            "app/src/common.h",
            "app/src/scrcpy.h",
            "app/src/server.h",
            "server/src/main/java/com/genymobile/scrcpy/Workarounds.java"
        ],
        "reopen": true,
        "reopen_events": [
            [
                "2020-06-10 09:21:39+00:00",
                "commit"
            ],
            [
                "2020-06-10 09:21:40+00:00",
                "closed"
            ],
            [
                "2020-06-10 09:21:40+00:00",
                "commit"
            ],
            [
                "2020-06-15 02:51:09+00:00",
                "commit"
            ],
            [
                "2020-06-15 02:51:10+00:00",
                "commit"
            ],
            [
                "2020-06-15 02:52:22+00:00",
                "reopened"
            ],
            [
                "2020-09-27 07:18:46+00:00",
                "closed"
            ],
            [
                "2020-09-27 07:18:46+00:00",
                "commit"
            ]
        ],
        "status": false,
        "strategy": true,
        "total_changes": 83
    }
}