{
    "category": [
        "build/refactor/preprocessing",
        "GUI"
    ],
    "commits": [
        {
            "associated_pull_request": [],
            "date": "2014-04-24 10:37:11",
            "diff": "hexchat_hexchat/issue_958/commit_b0497573028c9ce6f04de72ef2c57002217dfeef.diff",
            "diff_additions": 80,
            "diff_deletions": 65,
            "diff_file_size": 33750,
            "diff_url": "https://github.com/hexchat/hexchat/commit/b0497573028c9ce6f04de72ef2c57002217dfeef.diff",
            "exists": true,
            "files": [
                {
                    "file_additions": 80,
                    "file_deletions": 65,
                    "file_exists": true,
                    "file_name": "src/common/util.c",
                    "file_size": 33750
                }
            ],
            "interesting": {
                "reopen": false,
                "status": false
            },
            "is_parent": true,
            "sha": "b0497573028c9ce6f04de72ef2c57002217dfeef"
        },
        {
            "associated_pull_request": [],
            "date": "2014-04-25 17:41:38",
            "diff": "hexchat_hexchat/issue_958/commit_9e1e86b804da1bdba51f7f1e3c1fdfad320ed094.diff",
            "diff_additions": 21,
            "diff_deletions": 120,
            "diff_file_size": 205501,
            "diff_url": "https://github.com/hexchat/hexchat/commit/9e1e86b804da1bdba51f7f1e3c1fdfad320ed094.diff",
            "exists": true,
            "files": [
                {
                    "file_additions": 3,
                    "file_deletions": 1,
                    "file_exists": true,
                    "file_name": "src/common/outbound.c",
                    "file_size": 107697
                },
                {
                    "file_additions": 5,
                    "file_deletions": 109,
                    "file_exists": true,
                    "file_name": "src/common/util.c",
                    "file_size": 33750
                },
                {
                    "file_additions": 13,
                    "file_deletions": 10,
                    "file_exists": true,
                    "file_name": "src/fe-gtk/menu.c",
                    "file_size": 64054
                }
            ],
            "interesting": {
                "reopen": false,
                "status": true
            },
            "is_parent": false,
            "sha": "9e1e86b804da1bdba51f7f1e3c1fdfad320ed094"
        },
        {
            "associated_pull_request": [],
            "date": "2014-04-25 17:41:38",
            "diff": "hexchat_hexchat/issue_958/commit_55b3e4f167677c23a6f3785bb0f14a9ecfe59827.diff",
            "diff_additions": 21,
            "diff_deletions": 120,
            "diff_file_size": 205501,
            "diff_url": "https://github.com/hexchat/hexchat/commit/55b3e4f167677c23a6f3785bb0f14a9ecfe59827.diff",
            "exists": true,
            "files": [
                {
                    "file_additions": 3,
                    "file_deletions": 1,
                    "file_exists": true,
                    "file_name": "src/common/outbound.c",
                    "file_size": 107697
                },
                {
                    "file_additions": 5,
                    "file_deletions": 109,
                    "file_exists": true,
                    "file_name": "src/common/util.c",
                    "file_size": 33750
                },
                {
                    "file_additions": 13,
                    "file_deletions": 10,
                    "file_exists": true,
                    "file_name": "src/fe-gtk/menu.c",
                    "file_size": 64054
                }
            ],
            "interesting": {
                "reopen": true,
                "status": false
            },
            "is_parent": false,
            "sha": "55b3e4f167677c23a6f3785bb0f14a9ecfe59827"
        },
        {
            "associated_pull_request": [],
            "date": "2014-04-25 17:41:38",
            "diff": "hexchat_hexchat/issue_958/commit_4e2bfdad9e9a4d79d137817148ac078bb0a54ecd.diff",
            "diff_additions": 18,
            "diff_deletions": 209,
            "diff_file_size": 231544,
            "diff_url": "https://github.com/hexchat/hexchat/commit/4e2bfdad9e9a4d79d137817148ac078bb0a54ecd.diff",
            "exists": true,
            "files": [
                {
                    "file_additions": 0,
                    "file_deletions": 35,
                    "file_exists": true,
                    "file_name": "src/common/hexchat.c",
                    "file_size": 26043
                },
                {
                    "file_additions": 3,
                    "file_deletions": 1,
                    "file_exists": true,
                    "file_name": "src/common/outbound.c",
                    "file_size": 107697
                },
                {
                    "file_additions": 2,
                    "file_deletions": 163,
                    "file_exists": true,
                    "file_name": "src/common/util.c",
                    "file_size": 33750
                },
                {
                    "file_additions": 13,
                    "file_deletions": 10,
                    "file_exists": true,
                    "file_name": "src/fe-gtk/menu.c",
                    "file_size": 64054
                }
            ],
            "interesting": {
                "reopen": false,
                "status": false
            },
            "is_parent": false,
            "sha": "4e2bfdad9e9a4d79d137817148ac078bb0a54ecd"
        },
        {
            "associated_pull_request": [],
            "date": "2014-04-25 17:41:38",
            "diff": "hexchat_hexchat/issue_958/commit_5849a0588e7b12003f8b9afcfcdc31f46c6b2329.diff",
            "diff_additions": 18,
            "diff_deletions": 209,
            "diff_file_size": 231544,
            "diff_url": "https://github.com/hexchat/hexchat/commit/5849a0588e7b12003f8b9afcfcdc31f46c6b2329.diff",
            "exists": true,
            "files": [
                {
                    "file_additions": 0,
                    "file_deletions": 35,
                    "file_exists": true,
                    "file_name": "src/common/hexchat.c",
                    "file_size": 26043
                },
                {
                    "file_additions": 3,
                    "file_deletions": 1,
                    "file_exists": true,
                    "file_name": "src/common/outbound.c",
                    "file_size": 107697
                },
                {
                    "file_additions": 2,
                    "file_deletions": 163,
                    "file_exists": true,
                    "file_name": "src/common/util.c",
                    "file_size": 33750
                },
                {
                    "file_additions": 13,
                    "file_deletions": 10,
                    "file_exists": true,
                    "file_name": "src/fe-gtk/menu.c",
                    "file_size": 64054
                }
            ],
            "interesting": {
                "reopen": false,
                "status": false
            },
            "is_parent": false,
            "sha": "5849a0588e7b12003f8b9afcfcdc31f46c6b2329"
        }
    ],
    "first_commit": "2014-04-24 10:55:16",
    "last_commit": "2014-06-04 14:38:23",
    "number": 958,
    "pull_request": "None",
    "score": {
        "accidental_reopen_likely": false,
        "all_labels": [],
        "contains_keywords": [
            "fix",
            "fault",
            "test",
            "issu",
            "fail"
        ],
        "fix_size": 224,
        "has_labels": [],
        "intersecting": {
            "computed_score": 0.9909502262443439,
            "final_commit_size": 221,
            "intersection_size": 219,
            "previous_commits_size": 222
        },
        "is_makefile_based": false,
        "no_new_files": [],
        "no_other_files": false,
        "num_prohibited_files": 25803,
        "prohibited_files": [
            "kill.h",
            "meminfo.h",
            "kill.h",
            "meminfo.h",
            "kill.h",
            "meminfo.h",
            "testsuite_cli_test.go",
            "testsuite_cli_test.go",
            "common.mk",
            "i3bar/include/draw_util.h"
        ],
        "reopen": true,
        "reopen_events": [
            [
                "2014-04-25 15:30:29",
                "closed"
            ],
            [
                "2014-04-25 17:42:26",
                "commit"
            ],
            [
                "2014-04-25 17:49:15",
                "commit"
            ],
            [
                "2014-06-02 22:48:04",
                "reopened"
            ],
            [
                "2014-06-03 13:16:50",
                "commit"
            ],
            [
                "2014-06-04 14:38:41",
                "closed"
            ],
            [
                "2014-06-04 14:38:41",
                "commit"
            ]
        ],
        "status": true,
        "strategy": true,
        "total_changes": 881
    }
}