{
    "covered_issues": [
        104,
        100,
        99,
        98,
        94,
        93,
        92,
        91,
        89,
        88,
        87,
        86,
        85,
        84,
        83,
        82,
        81,
        74,
        73,
        72,
        71,
        58,
        57,
        49,
        48,
        47,
        46,
        43,
        42,
        41,
        40,
        39,
        35,
        33,
        30,
        29,
        28,
        27,
        26,
        24,
        22,
        21,
        20,
        19,
        18,
        17,
        16,
        15,
        14,
        13,
        12,
        11,
        10,
        9,
        8,
        7,
        6,
        5,
        4,
        3,
        2,
        1
    ],
    "finished": true
}