{
    "commits": [
        {
            "diff": "spring-projects_spring-boot/issue_9880/commit_edee342d80d1ab252d56ce9157714a3108618c6c.diff",
            "diff_additions": 22,
            "diff_deletions": 3,
            "diff_file_size": 0,
            "files": [
                {
                    "file_additions": 5,
                    "file_deletions": 0,
                    "file_exists": false,
                    "file_name": "spring-boot-actuator/src/main/java/org/springframework/boot/actuate/endpoint/LiquibaseEndpoint.java",
                    "file_size": 0
                },
                {
                    "file_additions": 17,
                    "file_deletions": 3,
                    "file_exists": false,
                    "file_name": "spring-boot-actuator/src/test/java/org/springframework/boot/actuate/endpoint/LiquibaseEndpointTests.java",
                    "file_size": 0
                }
            ],
            "interesting": {
                "reopened": false,
                "status": false
            },
            "sha": "edee342d80d1ab252d56ce9157714a3108618c6c"
        },
        {
            "diff": "spring-projects_spring-boot/issue_9880/commit_49d249bdf4414ba132dfa93af2daa43410425950.diff",
            "diff_additions": 2,
            "diff_deletions": 1,
            "diff_file_size": 0,
            "files": [
                {
                    "file_additions": 2,
                    "file_deletions": 1,
                    "file_exists": false,
                    "file_name": "spring-boot-autoconfigure/src/main/java/org/springframework/boot/autoconfigure/aop/AopAutoConfiguration.java",
                    "file_size": 0
                }
            ],
            "interesting": {
                "reopened": true,
                "status": true
            },
            "sha": "49d249bdf4414ba132dfa93af2daa43410425950"
        },
        {
            "diff": "spring-projects_spring-boot/issue_9880/commit_92e48f6ee2a4d7ce9475e1438e44e8b73370fc12.diff",
            "diff_additions": 1,
            "diff_deletions": 2,
            "diff_file_size": 0,
            "files": [
                {
                    "file_additions": 1,
                    "file_deletions": 2,
                    "file_exists": false,
                    "file_name": "spring-boot-actuator/src/test/java/org/springframework/boot/actuate/autoconfigure/MetricRepositoryAutoConfigurationTests.java",
                    "file_size": 0
                }
            ],
            "interesting": {
                "reopened": false,
                "status": false
            },
            "sha": "92e48f6ee2a4d7ce9475e1438e44e8b73370fc12"
        }
    ],
    "first_commit": "2017-07-28 08:24:11",
    "last_commit": "2017-07-28 11:43:58",
    "number": 9880,
    "score": 400.1290322580645
}