{
    "commits": [
        {
            "associated_pull_request": [],
            "date": "2018-09-29 19:32:59+00:00",
            "diff": "libvnc_libvncserver/issue_250/commit_c3115350eb8bb635d0fdb4dbbb0d0541f38ed19c.diff",
            "diff_additions": 1,
            "diff_deletions": 1,
            "diff_file_size": 0,
            "diff_url": "https://github.com/LibVNC/libvncserver/commit/c3115350eb8bb635d0fdb4dbbb0d0541f38ed19c.diff",
            "exists": true,
            "files": [
                {
                    "file_additions": 1,
                    "file_deletions": 1,
                    "file_exists": false,
                    "file_name": "libvncclient/rfbproto.c",
                    "file_size": 0
                }
            ],
            "interesting": {
                "reopen": false,
                "status": false
            },
            "is_parent": true,
            "sha": "c3115350eb8bb635d0fdb4dbbb0d0541f38ed19c"
        },
        {
            "associated_pull_request": [],
            "date": "2018-09-29 20:07:27+00:00",
            "diff": "libvnc_libvncserver/issue_250/commit_09f2f3fb6a5a163e453e5c2979054670c39694bc.diff",
            "diff_additions": 1,
            "diff_deletions": 1,
            "diff_file_size": 0,
            "diff_url": "https://github.com/LibVNC/libvncserver/commit/09f2f3fb6a5a163e453e5c2979054670c39694bc.diff",
            "exists": true,
            "files": [
                {
                    "file_additions": 1,
                    "file_deletions": 1,
                    "file_exists": false,
                    "file_name": "libvncclient/corre.c",
                    "file_size": 0
                }
            ],
            "interesting": {
                "reopen": true,
                "status": false
            },
            "is_parent": false,
            "sha": "09f2f3fb6a5a163e453e5c2979054670c39694bc"
        },
        {
            "associated_pull_request": [],
            "date": "2018-10-04 20:27:39+00:00",
            "diff": "libvnc_libvncserver/issue_250/commit_7b1ef0ffc4815cab9a96c7278394152bdc89dc4d.diff",
            "diff_additions": 1,
            "diff_deletions": 1,
            "diff_file_size": 0,
            "diff_url": "https://github.com/LibVNC/libvncserver/commit/7b1ef0ffc4815cab9a96c7278394152bdc89dc4d.diff",
            "exists": true,
            "files": [
                {
                    "file_additions": 1,
                    "file_deletions": 1,
                    "file_exists": false,
                    "file_name": "libvncclient/corre.c",
                    "file_size": 0
                }
            ],
            "interesting": {
                "reopen": false,
                "status": false
            },
            "is_parent": false,
            "sha": "7b1ef0ffc4815cab9a96c7278394152bdc89dc4d"
        }
    ],
    "first_commit": "2018-09-29 19:32:59+00:00",
    "last_commit": "2018-10-04 20:27:39+00:00",
    "number": 250,
    "pull_request": "None",
    "score": {
        "accidental_reopen_likely": false,
        "all_labels": [],
        "contains_keywords": [
            "fix"
        ],
        "fix_size": 2,
        "has_labels": [],
        "intersecting": {
            "computed_score": 1.0,
            "final_commit_size": 2,
            "intersection_size": 2,
            "previous_commits_size": 2
        },
        "is_makefile_based": true,
        "no_new_files": [],
        "no_other_files": true,
        "num_prohibited_files": 172818,
        "prohibited_files": [
            "server/src/main/java/com/genymobile/scrcpy/Device.java",
            "server/src/main/java/com/genymobile/scrcpy/wrappers/SurfaceControl.java",
            "server/src/main/java/com/genymobile/scrcpy/Device.java",
            "server/src/main/java/com/genymobile/scrcpy/wrappers/SurfaceControl.java",
            "app/meson.build",
            "app/scrcpy.1",
            "app/src/common.h",
            "app/src/scrcpy.h",
            "app/src/server.h",
            "server/src/main/java/com/genymobile/scrcpy/Workarounds.java"
        ],
        "reopen": true,
        "reopen_events": [
            [
                "2018-09-29 20:07:42+00:00",
                "closed"
            ],
            [
                "2018-09-29 20:07:42+00:00",
                "commit"
            ],
            [
                "2018-10-01 13:37:32+00:00",
                "reopened"
            ],
            [
                "2018-10-04 20:27:48+00:00",
                "closed"
            ],
            [
                "2018-10-04 20:27:48+00:00",
                "commit"
            ]
        ],
        "status": false,
        "strategy": true,
        "total_changes": 6
    }
}