{
    "commits": [
        {
            "associated_pull_request": [
                "https://github.com/DynamoRIO/dynamorio/pull/3350"
            ],
            "date": "2019-01-18 05:47:53+00:00",
            "diff": "dynamorio_dynamorio/issue_3351/commit_700367783917c17e23af40361d7ea91fb9219c99.diff",
            "diff_additions": 9,
            "diff_deletions": 5,
            "diff_file_size": 524807,
            "diff_url": "https://github.com/DynamoRIO/dynamorio/commit/700367783917c17e23af40361d7ea91fb9219c99.diff",
            "exists": true,
            "files": [
                {
                    "file_additions": 9,
                    "file_deletions": 5,
                    "file_exists": true,
                    "file_name": "core/vmareas.c",
                    "file_size": 524807
                }
            ],
            "interesting": {
                "reopen": false,
                "status": false
            },
            "is_parent": true,
            "sha": "700367783917c17e23af40361d7ea91fb9219c99"
        },
        {
            "associated_pull_request": [
                "https://github.com/DynamoRIO/dynamorio/pull/3379"
            ],
            "date": "2019-02-14 22:52:00+00:00",
            "diff": "dynamorio_dynamorio/issue_3351/commit_dd339d32b1ef8367273c82421e3c71274bc03ba1.diff",
            "diff_additions": 347,
            "diff_deletions": 8,
            "diff_file_size": 43615,
            "diff_url": "https://github.com/DynamoRIO/dynamorio/commit/dd339d32b1ef8367273c82421e3c71274bc03ba1.diff",
            "exists": true,
            "files": [
                {
                    "file_additions": 35,
                    "file_deletions": 8,
                    "file_exists": true,
                    "file_name": "clients/drcachesim/analyzer.cpp",
                    "file_size": 35593
                },
                {
                    "file_additions": 312,
                    "file_deletions": 0,
                    "file_exists": true,
                    "file_name": "clients/drcachesim/reader/snappy_file_reader.cpp",
                    "file_size": 8022
                }
            ],
            "interesting": {
                "reopen": false,
                "status": false
            },
            "is_parent": false,
            "sha": "dd339d32b1ef8367273c82421e3c71274bc03ba1"
        },
        {
            "associated_pull_request": [
                "https://github.com/DynamoRIO/dynamorio/pull/3379"
            ],
            "date": "2019-02-26 14:38:20+00:00",
            "diff": "dynamorio_dynamorio/issue_3351/commit_ffd611238c41356cf0fcab9d5bcd47c514701f25.diff",
            "diff_additions": 362,
            "diff_deletions": 7,
            "diff_file_size": 43615,
            "diff_url": "https://github.com/DynamoRIO/dynamorio/commit/ffd611238c41356cf0fcab9d5bcd47c514701f25.diff",
            "exists": true,
            "files": [
                {
                    "file_additions": 35,
                    "file_deletions": 7,
                    "file_exists": true,
                    "file_name": "clients/drcachesim/analyzer.cpp",
                    "file_size": 35593
                },
                {
                    "file_additions": 72,
                    "file_deletions": 0,
                    "file_exists": false,
                    "file_name": "clients/drcachesim/reader/crc32c.cpp",
                    "file_size": 0
                },
                {
                    "file_additions": 255,
                    "file_deletions": 0,
                    "file_exists": true,
                    "file_name": "clients/drcachesim/reader/snappy_file_reader.cpp",
                    "file_size": 8022
                }
            ],
            "interesting": {
                "reopen": true,
                "status": false
            },
            "is_parent": false,
            "sha": "ffd611238c41356cf0fcab9d5bcd47c514701f25"
        },
        {
            "associated_pull_request": [
                "https://github.com/DynamoRIO/dynamorio/pull/3550"
            ],
            "date": "2019-04-17 18:10:27+00:00",
            "diff": "dynamorio_dynamorio/issue_3351/commit_4e99e74bd62839b8f8ccc97c3afe01b99df3b3a2.diff",
            "diff_additions": 29,
            "diff_deletions": 6,
            "diff_file_size": 43615,
            "diff_url": "https://github.com/DynamoRIO/dynamorio/commit/4e99e74bd62839b8f8ccc97c3afe01b99df3b3a2.diff",
            "exists": true,
            "files": [
                {
                    "file_additions": 28,
                    "file_deletions": 6,
                    "file_exists": true,
                    "file_name": "clients/drcachesim/analyzer.cpp",
                    "file_size": 35593
                },
                {
                    "file_additions": 1,
                    "file_deletions": 0,
                    "file_exists": true,
                    "file_name": "clients/drcachesim/reader/snappy_file_reader.cpp",
                    "file_size": 8022
                }
            ],
            "interesting": {
                "reopen": false,
                "status": false
            },
            "is_parent": false,
            "sha": "4e99e74bd62839b8f8ccc97c3afe01b99df3b3a2"
        },
        {
            "associated_pull_request": [
                "https://github.com/DynamoRIO/dynamorio/pull/3550"
            ],
            "date": "2019-04-17 21:42:35+00:00",
            "diff": "dynamorio_dynamorio/issue_3351/commit_39fc7048b79088eebf6b81c9f9fc5511c2eaa357.diff",
            "diff_additions": 29,
            "diff_deletions": 6,
            "diff_file_size": 43615,
            "diff_url": "https://github.com/DynamoRIO/dynamorio/commit/39fc7048b79088eebf6b81c9f9fc5511c2eaa357.diff",
            "exists": true,
            "files": [
                {
                    "file_additions": 28,
                    "file_deletions": 6,
                    "file_exists": true,
                    "file_name": "clients/drcachesim/analyzer.cpp",
                    "file_size": 35593
                },
                {
                    "file_additions": 1,
                    "file_deletions": 0,
                    "file_exists": true,
                    "file_name": "clients/drcachesim/reader/snappy_file_reader.cpp",
                    "file_size": 8022
                }
            ],
            "interesting": {
                "reopen": false,
                "status": false
            },
            "is_parent": false,
            "sha": "39fc7048b79088eebf6b81c9f9fc5511c2eaa357"
        },
        {
            "associated_pull_request": [],
            "date": "2019-04-17 21:42:35+00:00",
            "diff": "dynamorio_dynamorio/issue_3351/commit_4629e3f6b95dd94c40ebb9be8682c0b048f117ee.diff",
            "diff_additions": 29,
            "diff_deletions": 6,
            "diff_file_size": 43615,
            "diff_url": "https://github.com/DynamoRIO/dynamorio/commit/4629e3f6b95dd94c40ebb9be8682c0b048f117ee.diff",
            "exists": true,
            "files": [
                {
                    "file_additions": 28,
                    "file_deletions": 6,
                    "file_exists": true,
                    "file_name": "clients/drcachesim/analyzer.cpp",
                    "file_size": 35593
                },
                {
                    "file_additions": 1,
                    "file_deletions": 0,
                    "file_exists": true,
                    "file_name": "clients/drcachesim/reader/snappy_file_reader.cpp",
                    "file_size": 8022
                }
            ],
            "interesting": {
                "reopen": false,
                "status": false
            },
            "is_parent": false,
            "sha": "4629e3f6b95dd94c40ebb9be8682c0b048f117ee"
        }
    ],
    "first_commit": "2019-01-18 05:47:53+00:00",
    "last_commit": "2019-04-22 17:26:57+00:00",
    "number": 3351,
    "pull_request": "None",
    "score": {
        "accidental_reopen_likely": false,
        "all_labels": [],
        "contains_keywords": [
            "fail",
            "issu",
            "test",
            "fault"
        ],
        "fix_size": 66,
        "has_labels": [],
        "intersecting": {
            "computed_score": 1.0,
            "final_commit_size": 33,
            "intersection_size": 33,
            "previous_commits_size": 66
        },
        "is_makefile_based": true,
        "no_new_files": [],
        "no_other_files": false,
        "num_prohibited_files": 248045,
        "prohibited_files": [
            "server/src/main/java/com/genymobile/scrcpy/Device.java",
            "server/src/main/java/com/genymobile/scrcpy/wrappers/SurfaceControl.java",
            "server/src/main/java/com/genymobile/scrcpy/Device.java",
            "server/src/main/java/com/genymobile/scrcpy/wrappers/SurfaceControl.java",
            "app/meson.build",
            "app/scrcpy.1",
            "app/src/common.h",
            "app/src/scrcpy.h",
            "app/src/server.h",
            "server/src/main/java/com/genymobile/scrcpy/Workarounds.java"
        ],
        "reopen": true,
        "reopen_events": [
            [
                "2019-02-14 22:54:34+00:00",
                "commit"
            ],
            [
                "2019-02-26 14:38:26+00:00",
                "closed"
            ],
            [
                "2019-02-26 14:38:26+00:00",
                "commit"
            ],
            [
                "2019-04-17 16:20:43+00:00",
                "reopened"
            ],
            [
                "2019-04-17 18:16:25+00:00",
                "commit"
            ],
            [
                "2019-04-17 21:42:36+00:00",
                "closed"
            ],
            [
                "2019-04-17 21:42:40+00:00",
                "commit"
            ],
            [
                "2019-04-22 17:27:12+00:00",
                "commit"
            ]
        ],
        "status": false,
        "strategy": true,
        "total_changes": 843
    }
}