{
    "covered_issues": [
        118,
        114,
        97,
        95,
        94,
        93,
        92,
        90,
        89,
        88,
        86,
        84,
        82,
        80,
        79,
        77,
        75,
        74,
        70,
        67,
        66,
        65,
        63,
        62,
        61,
        59,
        58,
        57,
        52,
        49,
        45,
        43,
        42,
        41,
        39,
        35,
        32,
        27,
        24,
        23,
        21,
        17,
        16,
        15,
        14,
        13,
        12,
        10,
        9,
        8,
        7,
        6,
        1
    ],
    "finished": true
}