{
    "category": [
        "GUI",
        "control flow"
    ],
    "commits": [
        {
            "associated_pull_request": [],
            "date": "2019-04-04 09:05:12",
            "diff": "fontforge_fontforge/issue_3620/commit_da01d370cbfbf1824b730d269b01dc953124b729.diff",
            "diff_additions": 27,
            "diff_deletions": 69,
            "diff_file_size": 440710,
            "diff_url": "https://github.com/fontforge/fontforge/commit/da01d370cbfbf1824b730d269b01dc953124b729.diff",
            "exists": true,
            "files": [
                {
                    "file_additions": 4,
                    "file_deletions": 9,
                    "file_exists": true,
                    "file_name": "gdraw/gbuttons.c",
                    "file_size": 35844
                },
                {
                    "file_additions": 1,
                    "file_deletions": 1,
                    "file_exists": false,
                    "file_name": "gdraw/gchardlg.c",
                    "file_size": 0
                },
                {
                    "file_additions": 2,
                    "file_deletions": 5,
                    "file_exists": true,
                    "file_name": "gdraw/ggroupbox.c",
                    "file_size": 7465
                },
                {
                    "file_additions": 2,
                    "file_deletions": 5,
                    "file_exists": true,
                    "file_name": "gdraw/ghvbox.c",
                    "file_size": 23391
                },
                {
                    "file_additions": 1,
                    "file_deletions": 3,
                    "file_exists": true,
                    "file_name": "gdraw/gimageclut.c",
                    "file_size": 16407
                },
                {
                    "file_additions": 0,
                    "file_deletions": 5,
                    "file_exists": true,
                    "file_name": "gdraw/gimagecvt.c",
                    "file_size": 2050
                },
                {
                    "file_additions": 1,
                    "file_deletions": 3,
                    "file_exists": true,
                    "file_name": "gdraw/gmatrixedit.c",
                    "file_size": 81441
                },
                {
                    "file_additions": 1,
                    "file_deletions": 4,
                    "file_exists": true,
                    "file_name": "gdraw/gmenu.c",
                    "file_size": 75778
                },
                {
                    "file_additions": 0,
                    "file_deletions": 1,
                    "file_exists": false,
                    "file_name": "gdraw/gpstxtinit.c",
                    "file_size": 0
                },
                {
                    "file_additions": 6,
                    "file_deletions": 13,
                    "file_exists": true,
                    "file_name": "gdraw/gradio.c",
                    "file_size": 30045
                },
                {
                    "file_additions": 2,
                    "file_deletions": 5,
                    "file_exists": true,
                    "file_name": "gdraw/gscrollbar.c",
                    "file_size": 21746
                },
                {
                    "file_additions": 1,
                    "file_deletions": 3,
                    "file_exists": true,
                    "file_name": "gdraw/gtabset.c",
                    "file_size": 34298
                },
                {
                    "file_additions": 4,
                    "file_deletions": 9,
                    "file_exists": true,
                    "file_name": "gdraw/gtextfield.c",
                    "file_size": 100964
                },
                {
                    "file_additions": 0,
                    "file_deletions": 1,
                    "file_exists": true,
                    "file_name": "gutils/gimagereadrgb.c",
                    "file_size": 11281
                },
                {
                    "file_additions": 2,
                    "file_deletions": 2,
                    "file_exists": false,
                    "file_name": "gutils/gioftp.c",
                    "file_size": 0
                }
            ],
            "interesting": {
                "reopen": false,
                "status": false
            },
            "is_parent": true,
            "sha": "da01d370cbfbf1824b730d269b01dc953124b729"
        },
        {
            "associated_pull_request": [],
            "date": "2019-04-05 06:35:07",
            "diff": "fontforge_fontforge/issue_3620/commit_64a84dd9b666d92f70d10a07a11cddbe047efaaa.diff",
            "diff_additions": 17,
            "diff_deletions": 11,
            "diff_file_size": 100964,
            "diff_url": "https://github.com/fontforge/fontforge/commit/64a84dd9b666d92f70d10a07a11cddbe047efaaa.diff",
            "exists": true,
            "files": [
                {
                    "file_additions": 17,
                    "file_deletions": 11,
                    "file_exists": true,
                    "file_name": "gdraw/gtextfield.c",
                    "file_size": 100964
                }
            ],
            "interesting": {
                "reopen": false,
                "status": true
            },
            "is_parent": false,
            "sha": "64a84dd9b666d92f70d10a07a11cddbe047efaaa"
        },
        {
            "associated_pull_request": [],
            "date": "2019-04-05 06:35:07",
            "diff": "fontforge_fontforge/issue_3620/commit_cd16fd0b7189f237882fec1728cb36e8f8acc0ec.diff",
            "diff_additions": 17,
            "diff_deletions": 11,
            "diff_file_size": 100964,
            "diff_url": "https://github.com/fontforge/fontforge/commit/cd16fd0b7189f237882fec1728cb36e8f8acc0ec.diff",
            "exists": true,
            "files": [
                {
                    "file_additions": 17,
                    "file_deletions": 11,
                    "file_exists": true,
                    "file_name": "gdraw/gtextfield.c",
                    "file_size": 100964
                }
            ],
            "interesting": {
                "reopen": false,
                "status": false
            },
            "is_parent": false,
            "sha": "cd16fd0b7189f237882fec1728cb36e8f8acc0ec"
        }
    ],
    "first_commit": "2019-04-04 09:05:12",
    "last_commit": "2019-04-05 07:57:44",
    "number": 3620,
    "pull_request": "None",
    "score": {
        "accidental_reopen_likely": false,
        "all_labels": [],
        "contains_keywords": [
            "report",
            "fix",
            "remov",
            "issu",
            "crash"
        ],
        "fix_size": 21,
        "has_labels": [],
        "intersecting": {
            "computed_score": 1.0,
            "final_commit_size": 21,
            "intersection_size": 21,
            "previous_commits_size": 21
        },
        "is_makefile_based": true,
        "no_new_files": [],
        "no_other_files": true,
        "num_prohibited_files": 10683,
        "prohibited_files": [
            "kill.h",
            "meminfo.h",
            "kill.h",
            "meminfo.h",
            "kill.h",
            "meminfo.h",
            "testsuite_cli_test.go",
            "testsuite_cli_test.go",
            "common.mk",
            "i3bar/include/draw_util.h"
        ],
        "reopen": false,
        "reopen_events": [
            [
                "2019-04-05 06:39:12",
                "commit"
            ],
            [
                "2019-04-05 07:57:17",
                "commit"
            ],
            [
                "2019-07-18 08:45:27",
                "closed"
            ]
        ],
        "status": true,
        "strategy": true,
        "total_changes": 152
    }
}