{
    "category": [
        "hardware/OS",
        "multithreading"
    ],
    "commits": [
        {
            "associated_pull_request": [
                "https://github.com/zeromq/czmq/pull/1633"
            ],
            "date": "2017-03-06 16:03:45",
            "diff": "zeromq_czmq/issue_1634/commit_2f8273ea855e31c094ff5e89695dee92ecc2cf0b.diff",
            "diff_additions": 22,
            "diff_deletions": 3,
            "diff_file_size": 16593,
            "diff_url": "https://github.com/zeromq/czmq/commit/2f8273ea855e31c094ff5e89695dee92ecc2cf0b.diff",
            "exists": true,
            "files": [
                {
                    "file_additions": 22,
                    "file_deletions": 3,
                    "file_exists": true,
                    "file_name": "src/ziflist.c",
                    "file_size": 16593
                }
            ],
            "interesting": {
                "reopen": false,
                "status": false
            },
            "is_parent": true,
            "sha": "2f8273ea855e31c094ff5e89695dee92ecc2cf0b"
        },
        {
            "associated_pull_request": [],
            "date": "2017-03-07 14:30:21",
            "diff": "zeromq_czmq/issue_1634/commit_a56e712ba351dd9d0d6ef6cfdb1b2edd328f5b4e.diff",
            "diff_additions": 44,
            "diff_deletions": 0,
            "diff_file_size": 32931,
            "diff_url": "https://github.com/zeromq/czmq/commit/a56e712ba351dd9d0d6ef6cfdb1b2edd328f5b4e.diff",
            "exists": true,
            "files": [
                {
                    "file_additions": 44,
                    "file_deletions": 0,
                    "file_exists": true,
                    "file_name": "src/zloop.c",
                    "file_size": 32931
                }
            ],
            "interesting": {
                "reopen": false,
                "status": true
            },
            "is_parent": false,
            "sha": "a56e712ba351dd9d0d6ef6cfdb1b2edd328f5b4e"
        },
        {
            "associated_pull_request": [
                "https://github.com/zeromq/czmq/pull/1635"
            ],
            "date": "2017-03-07 14:30:21",
            "diff": "zeromq_czmq/issue_1634/commit_70db96f98adcda3ef0501aba39eb59e1e7be58b9.diff",
            "diff_additions": 44,
            "diff_deletions": 0,
            "diff_file_size": 32931,
            "diff_url": "https://github.com/zeromq/czmq/commit/70db96f98adcda3ef0501aba39eb59e1e7be58b9.diff",
            "exists": true,
            "files": [
                {
                    "file_additions": 44,
                    "file_deletions": 0,
                    "file_exists": true,
                    "file_name": "src/zloop.c",
                    "file_size": 32931
                }
            ],
            "interesting": {
                "reopen": false,
                "status": true
            },
            "is_parent": false,
            "sha": "70db96f98adcda3ef0501aba39eb59e1e7be58b9"
        },
        {
            "associated_pull_request": [
                "https://github.com/zeromq/czmq/pull/1635"
            ],
            "date": "2017-03-08 12:55:35",
            "diff": "zeromq_czmq/issue_1634/commit_52460b5ed92ce3a012db18eb1ae1dc6c85e6beeb.diff",
            "diff_additions": 44,
            "diff_deletions": 0,
            "diff_file_size": 32931,
            "diff_url": "https://github.com/zeromq/czmq/commit/52460b5ed92ce3a012db18eb1ae1dc6c85e6beeb.diff",
            "exists": true,
            "files": [
                {
                    "file_additions": 44,
                    "file_deletions": 0,
                    "file_exists": true,
                    "file_name": "src/zloop.c",
                    "file_size": 32931
                }
            ],
            "interesting": {
                "reopen": false,
                "status": false
            },
            "is_parent": false,
            "sha": "52460b5ed92ce3a012db18eb1ae1dc6c85e6beeb"
        }
    ],
    "first_commit": "2017-03-06 16:03:45",
    "last_commit": "2017-03-08 12:55:35",
    "number": 1634,
    "pull_request": "None",
    "score": {
        "accidental_reopen_likely": false,
        "all_labels": [],
        "contains_keywords": [
            "work",
            "fix",
            "test",
            "issu"
        ],
        "fix_size": 45,
        "has_labels": [],
        "intersecting": {
            "computed_score": 1.0,
            "final_commit_size": 45,
            "intersection_size": 45,
            "previous_commits_size": 45
        },
        "is_makefile_based": true,
        "no_new_files": [],
        "no_other_files": true,
        "num_prohibited_files": 54244,
        "prohibited_files": [
            "kill.h",
            "meminfo.h",
            "kill.h",
            "meminfo.h",
            "kill.h",
            "meminfo.h",
            "testsuite_cli_test.go",
            "testsuite_cli_test.go",
            "common.mk",
            "i3bar/include/draw_util.h"
        ],
        "reopen": false,
        "reopen_events": [
            [
                "2017-03-07 14:33:14",
                "commit"
            ],
            [
                "2017-03-07 14:49:25",
                "commit"
            ],
            [
                "2017-03-08 12:55:37",
                "commit"
            ],
            [
                "2017-03-08 12:56:19",
                "closed"
            ]
        ],
        "status": true,
        "strategy": true,
        "total_changes": 157
    }
}