{
    "commits": [
        {
            "associated_pull_request": [],
            "date": "2021-04-16 16:36:45+00:00",
            "diff": "gbdev_rgbds/issue_837/commit_d2f6def2eb6da8b16b90f0bba95ace24b45d255b.diff",
            "diff_additions": 0,
            "diff_deletions": 12,
            "diff_file_size": 2726,
            "diff_url": "https://github.com/gbdev/rgbds/commit/d2f6def2eb6da8b16b90f0bba95ace24b45d255b.diff",
            "exists": true,
            "files": [
                {
                    "file_additions": 0,
                    "file_deletions": 12,
                    "file_exists": true,
                    "file_name": "src/hashmap.c",
                    "file_size": 2726
                }
            ],
            "interesting": {
                "reopen": false,
                "status": false
            },
            "is_parent": true,
            "sha": "d2f6def2eb6da8b16b90f0bba95ace24b45d255b"
        },
        {
            "associated_pull_request": [],
            "date": "2021-04-16 20:10:46+00:00",
            "diff": "gbdev_rgbds/issue_837/commit_e78a1d5bfd2840fa94c6a4c75a4e3aabeb904b70.diff",
            "diff_additions": 9,
            "diff_deletions": 6,
            "diff_file_size": 62246,
            "diff_url": "https://github.com/gbdev/rgbds/commit/e78a1d5bfd2840fa94c6a4c75a4e3aabeb904b70.diff",
            "exists": true,
            "files": [
                {
                    "file_additions": 9,
                    "file_deletions": 6,
                    "file_exists": true,
                    "file_name": "src/asm/lexer.c",
                    "file_size": 62246
                }
            ],
            "interesting": {
                "reopen": true,
                "status": false
            },
            "is_parent": false,
            "sha": "e78a1d5bfd2840fa94c6a4c75a4e3aabeb904b70"
        },
        {
            "associated_pull_request": [],
            "date": "2021-04-20 13:37:18+00:00",
            "diff": "gbdev_rgbds/issue_837/commit_be2572edca1eb97f5ca801d4e4380e757b04f314.diff",
            "diff_additions": 11,
            "diff_deletions": 0,
            "diff_file_size": 62246,
            "diff_url": "https://github.com/gbdev/rgbds/commit/be2572edca1eb97f5ca801d4e4380e757b04f314.diff",
            "exists": true,
            "files": [
                {
                    "file_additions": 11,
                    "file_deletions": 0,
                    "file_exists": true,
                    "file_name": "src/asm/lexer.c",
                    "file_size": 62246
                }
            ],
            "interesting": {
                "reopen": false,
                "status": false
            },
            "is_parent": false,
            "sha": "be2572edca1eb97f5ca801d4e4380e757b04f314"
        },
        {
            "associated_pull_request": [],
            "date": "2021-04-20 13:37:18+00:00",
            "diff": "gbdev_rgbds/issue_837/commit_be2572edca1eb97f5ca801d4e4380e757b04f314.diff",
            "diff_additions": 11,
            "diff_deletions": 0,
            "diff_file_size": 62246,
            "diff_url": "https://github.com/gbdev/rgbds/commit/be2572edca1eb97f5ca801d4e4380e757b04f314.diff",
            "exists": true,
            "files": [
                {
                    "file_additions": 11,
                    "file_deletions": 0,
                    "file_exists": true,
                    "file_name": "src/asm/lexer.c",
                    "file_size": 62246
                }
            ],
            "interesting": {
                "reopen": false,
                "status": false
            },
            "is_parent": false,
            "sha": "be2572edca1eb97f5ca801d4e4380e757b04f314"
        }
    ],
    "first_commit": "2021-04-16 16:36:45+00:00",
    "last_commit": "2021-04-20 13:37:29+00:00",
    "number": 837,
    "pull_request": "None",
    "score": {
        "accidental_reopen_likely": false,
        "all_labels": [
            "bug",
            "rgbasm"
        ],
        "contains_keywords": [
            "fix",
            "CI",
            "report"
        ],
        "fix_size": 24,
        "has_labels": [
            "bug"
        ],
        "intersecting": {
            "computed_score": 1.0,
            "final_commit_size": 12,
            "intersection_size": 12,
            "previous_commits_size": 24
        },
        "is_makefile_based": true,
        "no_new_files": [],
        "no_other_files": false,
        "num_prohibited_files": 258758,
        "prohibited_files": [
            "server/src/main/java/com/genymobile/scrcpy/Device.java",
            "server/src/main/java/com/genymobile/scrcpy/wrappers/SurfaceControl.java",
            "server/src/main/java/com/genymobile/scrcpy/Device.java",
            "server/src/main/java/com/genymobile/scrcpy/wrappers/SurfaceControl.java",
            "app/meson.build",
            "app/scrcpy.1",
            "app/src/common.h",
            "app/src/scrcpy.h",
            "app/src/server.h",
            "server/src/main/java/com/genymobile/scrcpy/Workarounds.java"
        ],
        "reopen": true,
        "reopen_events": [
            [
                "2021-04-16 20:10:52+00:00",
                "commit"
            ],
            [
                "2021-04-16 20:11:14+00:00",
                "closed"
            ],
            [
                "2021-04-16 20:11:14+00:00",
                "commit"
            ],
            [
                "2021-04-20 13:27:48+00:00",
                "reopened"
            ],
            [
                "2021-04-20 13:37:57+00:00",
                "commit"
            ],
            [
                "2021-04-20 13:42:44+00:00",
                "closed"
            ],
            [
                "2021-04-20 13:42:44+00:00",
                "commit"
            ]
        ],
        "status": false,
        "strategy": true,
        "total_changes": 49
    }
}