{
    "covered_issues": [
        1573,
        1558,
        1547,
        1537,
        1529,
        1524,
        1514,
        1512,
        1506,
        1491,
        1485,
        1479,
        1478,
        1477,
        1459,
        1458,
        1455,
        1451,
        1449,
        1446,
        1444,
        1442,
        1419,
        1413,
        1412,
        1405,
        1404,
        1384,
        1367,
        1365,
        1362,
        1360,
        1328,
        1327,
        1322,
        1320,
        1319,
        1318,
        1314,
        1313,
        1308,
        1282,
        1278,
        1275,
        1266,
        1265,
        1255,
        1252,
        1236,
        1234,
        1233,
        1231,
        1215,
        1212,
        1210,
        1207,
        1197,
        1188,
        1179,
        1177,
        1170,
        1162,
        1144,
        1137,
        1135,
        1121,
        1114,
        1113,
        1110,
        1107,
        1105,
        1101,
        1094,
        1081,
        1075,
        1059,
        1039,
        1033,
        1031,
        1021,
        1006,
        999,
        985,
        970,
        947,
        935,
        934,
        933,
        922,
        891,
        888,
        884,
        883,
        882,
        881,
        879,
        866,
        856,
        855,
        833,
        821,
        814,
        813,
        789,
        781,
        767,
        765,
        754,
        753,
        752,
        744,
        741,
        740,
        739,
        728,
        725,
        724,
        723,
        722,
        721,
        720,
        719,
        715,
        713,
        710,
        706,
        689,
        688,
        687,
        686,
        684,
        679,
        678,
        677,
        674,
        671,
        668,
        665,
        664,
        663,
        654,
        652,
        651,
        648,
        646,
        633,
        632,
        630,
        628,
        625,
        623,
        621,
        617,
        611,
        610,
        607,
        604,
        595,
        594,
        593,
        584,
        583,
        581,
        579,
        573,
        572,
        571,
        570,
        567,
        566,
        565,
        564,
        563,
        555,
        552,
        544,
        529,
        521,
        511,
        506,
        504,
        496,
        494,
        493,
        492,
        491,
        488,
        462,
        461,
        457,
        455,
        454,
        453,
        452,
        449,
        424,
        421,
        419,
        400,
        398,
        396,
        395,
        394,
        393,
        392,
        390,
        389,
        388,
        387,
        386,
        385,
        381,
        380,
        379,
        377,
        374,
        365,
        364,
        363,
        362,
        360,
        359,
        358,
        357,
        355,
        353,
        352,
        351,
        350,
        349,
        348,
        347,
        346,
        344,
        343,
        342,
        340,
        338,
        336,
        335,
        334,
        333,
        304,
        302,
        301,
        300,
        294,
        291,
        290,
        289,
        288,
        282,
        281,
        279,
        277,
        276,
        274,
        271,
        270,
        268,
        267,
        266,
        265,
        264,
        263,
        262,
        261,
        260,
        259,
        258,
        257,
        256,
        255,
        254,
        253,
        252,
        250,
        248,
        246,
        245,
        244,
        240,
        239,
        238,
        237,
        235,
        234,
        232,
        231,
        230,
        226,
        224,
        220,
        219,
        217,
        214,
        213,
        212,
        210,
        208,
        205,
        203,
        202,
        200,
        199,
        194,
        193,
        191,
        189,
        188,
        186,
        182,
        177,
        176,
        169,
        166,
        165,
        164,
        163,
        162,
        161,
        160,
        158,
        156,
        152,
        150,
        148,
        144,
        140,
        139,
        136,
        134,
        132,
        130,
        129,
        125,
        124,
        123,
        122,
        116,
        115,
        105,
        100,
        98,
        97,
        95,
        94,
        92,
        89,
        88,
        86,
        82,
        81,
        79,
        77,
        75,
        68,
        67,
        66,
        64,
        61,
        60,
        59,
        58,
        56,
        50,
        49,
        48,
        47,
        46,
        45,
        43,
        41,
        39,
        38,
        35,
        34,
        32,
        29,
        27,
        21,
        15,
        14,
        12,
        11,
        3
    ],
    "finished": true
}