{
    "commits": [
        {
            "associated_pull_request": [],
            "date": "2022-01-23 18:17:35+00:00",
            "diff": "",
            "diff_additions": 0,
            "diff_deletions": 0,
            "diff_file_size": 0,
            "diff_url": "https://github.com/vergoh/vnstat/commit/1c1f6c80e62ed53fe9f8332a45ed0e686f8aee0e.diff",
            "exists": true,
            "files": [],
            "interesting": {
                "reopen": false,
                "status": false
            },
            "is_parent": true,
            "sha": "1c1f6c80e62ed53fe9f8332a45ed0e686f8aee0e"
        },
        {
            "associated_pull_request": [],
            "date": "2022-02-18 21:32:49+00:00",
            "diff": "vergoh_vnstat/issue_225/commit_3d44fb093e3967f9cdeef10bcb1b87a983768fd0.diff",
            "diff_additions": 233,
            "diff_deletions": 56,
            "diff_file_size": 295771,
            "diff_url": "https://github.com/vergoh/vnstat/commit/3d44fb093e3967f9cdeef10bcb1b87a983768fd0.diff",
            "exists": true,
            "files": [
                {
                    "file_additions": 2,
                    "file_deletions": 2,
                    "file_exists": true,
                    "file_name": "src/cfg.c",
                    "file_size": 19976
                },
                {
                    "file_additions": 11,
                    "file_deletions": 11,
                    "file_exists": true,
                    "file_name": "src/dbsql.c",
                    "file_size": 38046
                },
                {
                    "file_additions": 2,
                    "file_deletions": 2,
                    "file_exists": true,
                    "file_name": "src/ibw.c",
                    "file_size": 5167
                },
                {
                    "file_additions": 11,
                    "file_deletions": 11,
                    "file_exists": true,
                    "file_name": "src/ifinfo.c",
                    "file_size": 11134
                },
                {
                    "file_additions": 1,
                    "file_deletions": 1,
                    "file_exists": true,
                    "file_name": "src/iflist.c",
                    "file_size": 926
                },
                {
                    "file_additions": 3,
                    "file_deletions": 3,
                    "file_exists": true,
                    "file_name": "src/vnstat.c",
                    "file_size": 4551
                },
                {
                    "file_additions": 34,
                    "file_deletions": 16,
                    "file_exists": true,
                    "file_name": "src/vnstat_func.c",
                    "file_size": 42926
                },
                {
                    "file_additions": 24,
                    "file_deletions": 10,
                    "file_exists": true,
                    "file_name": "src/vnstati.c",
                    "file_size": 28496
                },
                {
                    "file_additions": 87,
                    "file_deletions": 0,
                    "file_exists": true,
                    "file_name": "tests/dbsql_tests.c",
                    "file_size": 119163
                },
                {
                    "file_additions": 58,
                    "file_deletions": 0,
                    "file_exists": true,
                    "file_name": "tests/parseargs_tests.c",
                    "file_size": 25386
                }
            ],
            "interesting": {
                "reopen": true,
                "status": false
            },
            "is_parent": false,
            "sha": "3d44fb093e3967f9cdeef10bcb1b87a983768fd0"
        },
        {
            "associated_pull_request": [],
            "date": "2022-02-19 12:01:52+00:00",
            "diff": "vergoh_vnstat/issue_225/commit_912869199e015b7e9ef38e86d0478b56c79f6c8f.diff",
            "diff_additions": 64,
            "diff_deletions": 4,
            "diff_file_size": 157209,
            "diff_url": "https://github.com/vergoh/vnstat/commit/912869199e015b7e9ef38e86d0478b56c79f6c8f.diff",
            "exists": true,
            "files": [
                {
                    "file_additions": 4,
                    "file_deletions": 4,
                    "file_exists": true,
                    "file_name": "src/dbsql.c",
                    "file_size": 38046
                },
                {
                    "file_additions": 60,
                    "file_deletions": 0,
                    "file_exists": true,
                    "file_name": "tests/dbsql_tests.c",
                    "file_size": 119163
                }
            ],
            "interesting": {
                "reopen": false,
                "status": false
            },
            "is_parent": false,
            "sha": "912869199e015b7e9ef38e86d0478b56c79f6c8f"
        }
    ],
    "first_commit": "2022-01-23 18:17:35+00:00",
    "last_commit": "2022-02-19 12:01:52+00:00",
    "number": 225,
    "pull_request": "None",
    "score": {
        "accidental_reopen_likely": false,
        "all_labels": [
            "feature request"
        ],
        "contains_keywords": [
            "chang",
            "fix",
            "issu",
            "test",
            "remov",
            "error",
            "problem"
        ],
        "fix_size": 321,
        "has_labels": [],
        "intersecting": {
            "computed_score": 0.045454545454545456,
            "final_commit_size": 66,
            "intersection_size": 3,
            "previous_commits_size": 258
        },
        "is_makefile_based": true,
        "no_new_files": [],
        "no_other_files": false,
        "num_prohibited_files": 101825,
        "prohibited_files": [
            "server/src/main/java/com/genymobile/scrcpy/Device.java",
            "server/src/main/java/com/genymobile/scrcpy/wrappers/SurfaceControl.java",
            "server/src/main/java/com/genymobile/scrcpy/Device.java",
            "server/src/main/java/com/genymobile/scrcpy/wrappers/SurfaceControl.java",
            "app/meson.build",
            "app/scrcpy.1",
            "app/src/common.h",
            "app/src/scrcpy.h",
            "app/src/server.h",
            "server/src/main/java/com/genymobile/scrcpy/Workarounds.java"
        ],
        "reopen": true,
        "reopen_events": [
            [
                "2022-02-18 21:33:08+00:00",
                "closed"
            ],
            [
                "2022-02-18 21:33:08+00:00",
                "commit"
            ],
            [
                "2022-02-19 10:39:20+00:00",
                "reopened"
            ],
            [
                "2022-02-19 12:02:04+00:00",
                "closed"
            ],
            [
                "2022-02-19 12:02:04+00:00",
                "commit"
            ]
        ],
        "status": false,
        "strategy": true,
        "total_changes": 357
    }
}