{
    "covered_issues": [
        212,
        209,
        206,
        205,
        202,
        200,
        194,
        187,
        186,
        185,
        180,
        176,
        173,
        164,
        163,
        162,
        161,
        151,
        146,
        140,
        139,
        137,
        132,
        129,
        127,
        125,
        122,
        108,
        102,
        97,
        95,
        89,
        86,
        85,
        84,
        82,
        81,
        78,
        74,
        72,
        71,
        69,
        66,
        64,
        60,
        54,
        49,
        48,
        47,
        45,
        43,
        42,
        40,
        39,
        38,
        37,
        34,
        33,
        32,
        26,
        25,
        24,
        23,
        19,
        18,
        15,
        14,
        13,
        10,
        9,
        3
    ],
    "finished": true
}