{
    "commits": [
        {
            "associated_pull_request": [],
            "date": "2022-07-10 13:48:58+00:00",
            "diff": "ptitseb_box64/issue_347/commit_b4c389c374f2b952a021e940f5570c6d353624d6.diff",
            "diff_additions": 2,
            "diff_deletions": 1,
            "diff_file_size": 12241,
            "diff_url": "https://github.com/ptitSeb/box64/commit/b4c389c374f2b952a021e940f5570c6d353624d6.diff",
            "exists": true,
            "files": [
                {
                    "file_additions": 2,
                    "file_deletions": 1,
                    "file_exists": true,
                    "file_name": "src/emu/x64tls.c",
                    "file_size": 12241
                }
            ],
            "interesting": {
                "reopen": false,
                "status": false
            },
            "is_parent": true,
            "sha": "b4c389c374f2b952a021e940f5570c6d353624d6"
        },
        {
            "associated_pull_request": [],
            "date": "2022-07-11 11:51:05+00:00",
            "diff": "ptitseb_box64/issue_347/commit_15411c7c9e685a4664fdcc96200c8b3be381cd45.diff",
            "diff_additions": 35,
            "diff_deletions": 0,
            "diff_file_size": 69726,
            "diff_url": "https://github.com/ptitSeb/box64/commit/15411c7c9e685a4664fdcc96200c8b3be381cd45.diff",
            "exists": true,
            "files": [
                {
                    "file_additions": 35,
                    "file_deletions": 0,
                    "file_exists": true,
                    "file_name": "src/main.c",
                    "file_size": 69726
                }
            ],
            "interesting": {
                "reopen": true,
                "status": false
            },
            "is_parent": false,
            "sha": "15411c7c9e685a4664fdcc96200c8b3be381cd45"
        },
        {
            "associated_pull_request": [],
            "date": "2022-07-14 06:52:45+00:00",
            "diff": "ptitseb_box64/issue_347/commit_0cb4fa67f11505ea28a7624ca6165a0089c952f6.diff",
            "diff_additions": 1,
            "diff_deletions": 1,
            "diff_file_size": 69726,
            "diff_url": "https://github.com/ptitSeb/box64/commit/0cb4fa67f11505ea28a7624ca6165a0089c952f6.diff",
            "exists": true,
            "files": [
                {
                    "file_additions": 1,
                    "file_deletions": 1,
                    "file_exists": true,
                    "file_name": "src/main.c",
                    "file_size": 69726
                }
            ],
            "interesting": {
                "reopen": false,
                "status": false
            },
            "is_parent": false,
            "sha": "0cb4fa67f11505ea28a7624ca6165a0089c952f6"
        }
    ],
    "first_commit": "2022-07-10 13:48:58+00:00",
    "last_commit": "2022-07-14 06:52:45+00:00",
    "number": 347,
    "pull_request": "None",
    "score": {
        "accidental_reopen_likely": false,
        "all_labels": [],
        "contains_keywords": [
            "work",
            "fix",
            "workaround"
        ],
        "fix_size": 36,
        "has_labels": [],
        "intersecting": {
            "computed_score": 1.0,
            "final_commit_size": 2,
            "intersection_size": 2,
            "previous_commits_size": 36
        },
        "is_makefile_based": true,
        "no_new_files": [],
        "no_other_files": true,
        "num_prohibited_files": 121596,
        "prohibited_files": [
            "server/src/main/java/com/genymobile/scrcpy/Device.java",
            "server/src/main/java/com/genymobile/scrcpy/wrappers/SurfaceControl.java",
            "server/src/main/java/com/genymobile/scrcpy/Device.java",
            "server/src/main/java/com/genymobile/scrcpy/wrappers/SurfaceControl.java",
            "app/meson.build",
            "app/scrcpy.1",
            "app/src/common.h",
            "app/src/scrcpy.h",
            "app/src/server.h",
            "server/src/main/java/com/genymobile/scrcpy/Workarounds.java"
        ],
        "reopen": true,
        "reopen_events": [
            [
                "2022-07-11 11:51:10+00:00",
                "commit"
            ],
            [
                "2022-07-12 02:57:19+00:00",
                "closed"
            ],
            [
                "2022-07-14 05:51:27+00:00",
                "reopened"
            ],
            [
                "2022-07-14 06:52:48+00:00",
                "commit"
            ],
            [
                "2022-08-12 19:44:43+00:00",
                "closed"
            ]
        ],
        "status": false,
        "strategy": true,
        "total_changes": 40
    }
}