{
    "commits": [
        {
            "associated_pull_request": [],
            "date": "2016-01-03 16:16:52+00:00",
            "diff": "",
            "diff_additions": 0,
            "diff_deletions": 0,
            "diff_file_size": 0,
            "diff_url": "https://github.com/esnet/iperf/commit/3cf50d9856182a5e89abbe899be915382c165137.diff",
            "exists": true,
            "files": [],
            "interesting": {
                "reopen": false,
                "status": false
            },
            "is_parent": true,
            "sha": "3cf50d9856182a5e89abbe899be915382c165137"
        },
        {
            "associated_pull_request": [],
            "date": "2016-01-29 00:04:33+00:00",
            "diff": "esnet_iperf/issue_278/commit_ecd0521820551a7ba43b390855782e0b489cd04c.diff",
            "diff_additions": 21,
            "diff_deletions": 6,
            "diff_file_size": 169127,
            "diff_url": "https://github.com/esnet/iperf/commit/ecd0521820551a7ba43b390855782e0b489cd04c.diff",
            "exists": true,
            "files": [
                {
                    "file_additions": 21,
                    "file_deletions": 6,
                    "file_exists": true,
                    "file_name": "src/iperf_api.c",
                    "file_size": 169127
                }
            ],
            "interesting": {
                "reopen": true,
                "status": false
            },
            "is_parent": false,
            "sha": "ecd0521820551a7ba43b390855782e0b489cd04c"
        },
        {
            "associated_pull_request": [
                "https://github.com/esnet/iperf/pull/592"
            ],
            "date": "2017-06-02 21:49:50+00:00",
            "diff": "esnet_iperf/issue_278/commit_d19c8562270c45177aa8e7a8ac8b15e8d0f978e4.diff",
            "diff_additions": 44,
            "diff_deletions": 0,
            "diff_file_size": 169127,
            "diff_url": "https://github.com/esnet/iperf/commit/d19c8562270c45177aa8e7a8ac8b15e8d0f978e4.diff",
            "exists": true,
            "files": [
                {
                    "file_additions": 44,
                    "file_deletions": 0,
                    "file_exists": true,
                    "file_name": "src/iperf_api.c",
                    "file_size": 169127
                }
            ],
            "interesting": {
                "reopen": false,
                "status": false
            },
            "is_parent": false,
            "sha": "d19c8562270c45177aa8e7a8ac8b15e8d0f978e4"
        },
        {
            "associated_pull_request": [
                "https://github.com/esnet/iperf/pull/592"
            ],
            "date": "2017-06-05 17:38:36+00:00",
            "diff": "esnet_iperf/issue_278/commit_b5597278b5355f628b82b0bb2bb4decb8a8e687b.diff",
            "diff_additions": 44,
            "diff_deletions": 0,
            "diff_file_size": 169127,
            "diff_url": "https://github.com/esnet/iperf/commit/b5597278b5355f628b82b0bb2bb4decb8a8e687b.diff",
            "exists": true,
            "files": [
                {
                    "file_additions": 44,
                    "file_deletions": 0,
                    "file_exists": true,
                    "file_name": "src/iperf_api.c",
                    "file_size": 169127
                }
            ],
            "interesting": {
                "reopen": false,
                "status": false
            },
            "is_parent": false,
            "sha": "b5597278b5355f628b82b0bb2bb4decb8a8e687b"
        }
    ],
    "first_commit": "2016-01-03 16:16:52+00:00",
    "last_commit": "2017-06-05 17:38:36+00:00",
    "number": 278,
    "pull_request": "None",
    "score": {
        "accidental_reopen_likely": false,
        "all_labels": [
            "enhancement"
        ],
        "contains_keywords": [
            "fix",
            "issu",
            "debug",
            "reason",
            "test",
            "warn",
            "bug",
            "problem",
            "report"
        ],
        "fix_size": 70,
        "has_labels": [],
        "intersecting": {
            "computed_score": 1.0,
            "final_commit_size": 45,
            "intersection_size": 45,
            "previous_commits_size": 70
        },
        "is_makefile_based": true,
        "no_new_files": [],
        "no_other_files": true,
        "num_prohibited_files": 86596,
        "prohibited_files": [
            "server/src/main/java/com/genymobile/scrcpy/Device.java",
            "server/src/main/java/com/genymobile/scrcpy/wrappers/SurfaceControl.java",
            "server/src/main/java/com/genymobile/scrcpy/Device.java",
            "server/src/main/java/com/genymobile/scrcpy/wrappers/SurfaceControl.java",
            "app/meson.build",
            "app/scrcpy.1",
            "app/src/common.h",
            "app/src/scrcpy.h",
            "app/src/server.h",
            "server/src/main/java/com/genymobile/scrcpy/Workarounds.java"
        ],
        "reopen": true,
        "reopen_events": [
            [
                "2016-01-29 00:07:26+00:00",
                "closed"
            ],
            [
                "2016-01-29 00:07:26+00:00",
                "commit"
            ],
            [
                "2016-01-29 17:09:09+00:00",
                "commit"
            ],
            [
                "2017-05-01 22:01:40+00:00",
                "reopened"
            ],
            [
                "2017-06-02 21:52:53+00:00",
                "commit"
            ],
            [
                "2017-06-05 17:38:40+00:00",
                "commit"
            ],
            [
                "2017-06-05 17:39:28+00:00",
                "closed"
            ]
        ],
        "status": false,
        "strategy": true,
        "total_changes": 115
    }
}