{
    "commits": [
        {
            "associated_pull_request": [],
            "date": "2021-07-28 18:37:33+00:00",
            "diff": "libsdl-org_sdl/issue_4533/commit_cc4ab10195a58a1a7ac4274750abaf46247299e6.diff",
            "diff_additions": 4,
            "diff_deletions": 3,
            "diff_file_size": 5443,
            "diff_url": "https://github.com/libsdl-org/SDL/commit/cc4ab10195a58a1a7ac4274750abaf46247299e6.diff",
            "exists": true,
            "files": [
                {
                    "file_additions": 4,
                    "file_deletions": 3,
                    "file_exists": true,
                    "file_name": "src/video/windows/SDL_windowsopengles.c",
                    "file_size": 5443
                }
            ],
            "interesting": {
                "reopen": false,
                "status": false
            },
            "is_parent": true,
            "sha": "cc4ab10195a58a1a7ac4274750abaf46247299e6"
        },
        {
            "associated_pull_request": [],
            "date": "2021-07-28 19:55:10+00:00",
            "diff": "libsdl-org_sdl/issue_4533/commit_cf85710cf84707797bde8c7da1307014e0b335eb.diff",
            "diff_additions": 9,
            "diff_deletions": 0,
            "diff_file_size": 43024,
            "diff_url": "https://github.com/libsdl-org/SDL/commit/cf85710cf84707797bde8c7da1307014e0b335eb.diff",
            "exists": true,
            "files": [
                {
                    "file_additions": 9,
                    "file_deletions": 0,
                    "file_exists": true,
                    "file_name": "src/audio/SDL_audiocvt.c",
                    "file_size": 43024
                }
            ],
            "interesting": {
                "reopen": true,
                "status": false
            },
            "is_parent": false,
            "sha": "cf85710cf84707797bde8c7da1307014e0b335eb"
        },
        {
            "associated_pull_request": [],
            "date": "2021-08-06 19:01:24+00:00",
            "diff": "libsdl-org_sdl/issue_4533/commit_cae7bd9b65a3dc16e4d575a6f4cb9443c7dac7dd.diff",
            "diff_additions": 1,
            "diff_deletions": 1,
            "diff_file_size": 43024,
            "diff_url": "https://github.com/libsdl-org/SDL/commit/cae7bd9b65a3dc16e4d575a6f4cb9443c7dac7dd.diff",
            "exists": true,
            "files": [
                {
                    "file_additions": 1,
                    "file_deletions": 1,
                    "file_exists": true,
                    "file_name": "src/audio/SDL_audiocvt.c",
                    "file_size": 43024
                }
            ],
            "interesting": {
                "reopen": false,
                "status": false
            },
            "is_parent": false,
            "sha": "cae7bd9b65a3dc16e4d575a6f4cb9443c7dac7dd"
        },
        {
            "associated_pull_request": [],
            "date": "2021-08-06 21:20:55+00:00",
            "diff": "libsdl-org_sdl/issue_4533/commit_bec783571b1e8ed0f272c3fa6327d4f88efb49b4.diff",
            "diff_additions": 1,
            "diff_deletions": 1,
            "diff_file_size": 43024,
            "diff_url": "https://github.com/libsdl-org/SDL/commit/bec783571b1e8ed0f272c3fa6327d4f88efb49b4.diff",
            "exists": true,
            "files": [
                {
                    "file_additions": 1,
                    "file_deletions": 1,
                    "file_exists": true,
                    "file_name": "src/audio/SDL_audiocvt.c",
                    "file_size": 43024
                }
            ],
            "interesting": {
                "reopen": false,
                "status": false
            },
            "is_parent": false,
            "sha": "bec783571b1e8ed0f272c3fa6327d4f88efb49b4"
        },
        {
            "associated_pull_request": [
                "https://github.com/libsdl-org/SDL/pull/4626"
            ],
            "date": "2021-08-11 09:55:50+00:00",
            "diff": "libsdl-org_sdl/issue_4533/commit_44a76710d1a4f2bbcee47b14d4bdd8d75263d094.diff",
            "diff_additions": 4,
            "diff_deletions": 1,
            "diff_file_size": 43024,
            "diff_url": "https://github.com/libsdl-org/SDL/commit/44a76710d1a4f2bbcee47b14d4bdd8d75263d094.diff",
            "exists": true,
            "files": [
                {
                    "file_additions": 4,
                    "file_deletions": 1,
                    "file_exists": true,
                    "file_name": "src/audio/SDL_audiocvt.c",
                    "file_size": 43024
                }
            ],
            "interesting": {
                "reopen": false,
                "status": false
            },
            "is_parent": false,
            "sha": "44a76710d1a4f2bbcee47b14d4bdd8d75263d094"
        }
    ],
    "first_commit": "2021-07-28 18:37:33+00:00",
    "last_commit": "2021-08-11 15:47:52+00:00",
    "number": 4533,
    "pull_request": "None",
    "score": {
        "accidental_reopen_likely": false,
        "all_labels": [],
        "contains_keywords": [
            "confirm",
            "work",
            "fail",
            "fix",
            "issu",
            "patch",
            "reason",
            "test",
            "fault",
            "warn",
            "error",
            "problem"
        ],
        "fix_size": 10,
        "has_labels": [],
        "intersecting": {
            "computed_score": 1.0,
            "final_commit_size": 5,
            "intersection_size": 5,
            "previous_commits_size": 10
        },
        "is_makefile_based": true,
        "no_new_files": [],
        "no_other_files": true,
        "num_prohibited_files": 101830,
        "prohibited_files": [
            "server/src/main/java/com/genymobile/scrcpy/Device.java",
            "server/src/main/java/com/genymobile/scrcpy/wrappers/SurfaceControl.java",
            "server/src/main/java/com/genymobile/scrcpy/Device.java",
            "server/src/main/java/com/genymobile/scrcpy/wrappers/SurfaceControl.java",
            "app/meson.build",
            "app/scrcpy.1",
            "app/src/common.h",
            "app/src/scrcpy.h",
            "app/src/server.h",
            "server/src/main/java/com/genymobile/scrcpy/Workarounds.java"
        ],
        "reopen": true,
        "reopen_events": [
            [
                "2021-07-28 19:55:18+00:00",
                "commit"
            ],
            [
                "2021-07-28 20:51:50+00:00",
                "closed"
            ],
            [
                "2021-08-06 06:28:46+00:00",
                "reopened"
            ],
            [
                "2021-08-06 19:01:51+00:00",
                "closed"
            ],
            [
                "2021-08-06 19:01:51+00:00",
                "commit"
            ],
            [
                "2021-08-06 21:21:54+00:00",
                "commit"
            ],
            [
                "2021-08-11 15:47:53+00:00",
                "commit"
            ]
        ],
        "status": false,
        "strategy": true,
        "total_changes": 25
    }
}