{
    "commits": [
        {
            "associated_pull_request": [
                "https://github.com/syslog-ng/syslog-ng/pull/4231"
            ],
            "date": "2022-12-22 13:43:45+00:00",
            "diff": "",
            "diff_additions": 0,
            "diff_deletions": 0,
            "diff_file_size": 0,
            "diff_url": "https://github.com/syslog-ng/syslog-ng/commit/0e7c762c704efbda0ae10b61c35700ef0bdbb9c1.diff",
            "exists": true,
            "files": [],
            "interesting": {
                "reopen": false,
                "status": false
            },
            "is_parent": true,
            "sha": "0e7c762c704efbda0ae10b61c35700ef0bdbb9c1"
        },
        {
            "associated_pull_request": [
                "https://github.com/syslog-ng/syslog-ng/pull/4262"
            ],
            "date": "2022-12-28 21:04:15+00:00",
            "diff": "syslog-ng_syslog-ng/issue_4258/commit_12c535fe668c4c1b7599c71b30bc9c940ad80604.diff",
            "diff_additions": 13,
            "diff_deletions": 5,
            "diff_file_size": 4847,
            "diff_url": "https://github.com/syslog-ng/syslog-ng/commit/12c535fe668c4c1b7599c71b30bc9c940ad80604.diff",
            "exists": true,
            "files": [
                {
                    "file_additions": 13,
                    "file_deletions": 5,
                    "file_exists": true,
                    "file_name": "lib/mainloop-call.c",
                    "file_size": 4847
                }
            ],
            "interesting": {
                "reopen": false,
                "status": false
            },
            "is_parent": false,
            "sha": "12c535fe668c4c1b7599c71b30bc9c940ad80604"
        },
        {
            "associated_pull_request": [],
            "date": "2022-12-28 21:14:10+00:00",
            "diff": "syslog-ng_syslog-ng/issue_4258/commit_7fce9b8f73a6f0d87c532bbd4d15d993caea381b.diff",
            "diff_additions": 2,
            "diff_deletions": 0,
            "diff_file_size": 4847,
            "diff_url": "https://github.com/syslog-ng/syslog-ng/commit/7fce9b8f73a6f0d87c532bbd4d15d993caea381b.diff",
            "exists": true,
            "files": [
                {
                    "file_additions": 2,
                    "file_deletions": 0,
                    "file_exists": true,
                    "file_name": "lib/mainloop-call.c",
                    "file_size": 4847
                }
            ],
            "interesting": {
                "reopen": false,
                "status": false
            },
            "is_parent": false,
            "sha": "7fce9b8f73a6f0d87c532bbd4d15d993caea381b"
        },
        {
            "associated_pull_request": [
                "https://github.com/syslog-ng/syslog-ng/pull/4262"
            ],
            "date": "2022-12-28 21:14:10+00:00",
            "diff": "syslog-ng_syslog-ng/issue_4258/commit_e415a87e1fe71c76a651f85412cbc89a4434efff.diff",
            "diff_additions": 2,
            "diff_deletions": 0,
            "diff_file_size": 4847,
            "diff_url": "https://github.com/syslog-ng/syslog-ng/commit/e415a87e1fe71c76a651f85412cbc89a4434efff.diff",
            "exists": true,
            "files": [
                {
                    "file_additions": 2,
                    "file_deletions": 0,
                    "file_exists": true,
                    "file_name": "lib/mainloop-call.c",
                    "file_size": 4847
                }
            ],
            "interesting": {
                "reopen": true,
                "status": true
            },
            "is_parent": false,
            "sha": "e415a87e1fe71c76a651f85412cbc89a4434efff"
        },
        {
            "associated_pull_request": [],
            "date": "2022-12-28 21:14:10+00:00",
            "diff": "syslog-ng_syslog-ng/issue_4258/commit_5e45a9135bd66c631d8de7873f7cfa396b9fd2f0.diff",
            "diff_additions": 2,
            "diff_deletions": 0,
            "diff_file_size": 4847,
            "diff_url": "https://github.com/syslog-ng/syslog-ng/commit/5e45a9135bd66c631d8de7873f7cfa396b9fd2f0.diff",
            "exists": true,
            "files": [
                {
                    "file_additions": 2,
                    "file_deletions": 0,
                    "file_exists": true,
                    "file_name": "lib/mainloop-call.c",
                    "file_size": 4847
                }
            ],
            "interesting": {
                "reopen": false,
                "status": false
            },
            "is_parent": false,
            "sha": "5e45a9135bd66c631d8de7873f7cfa396b9fd2f0"
        }
    ],
    "first_commit": "2022-12-22 13:43:45+00:00",
    "last_commit": "2023-06-14 13:53:31+00:00",
    "number": 4258,
    "pull_request": "None",
    "score": {
        "accidental_reopen_likely": true,
        "all_labels": [
            "bug"
        ],
        "contains_keywords": [
            "work",
            "fail",
            "fix",
            "issu",
            "CI",
            "patch",
            "perform",
            "reason",
            "warn",
            "problem",
            "crash"
        ],
        "fix_size": 19,
        "has_labels": [
            "bug"
        ],
        "intersecting": {
            "computed_score": 1.0,
            "final_commit_size": 3,
            "intersection_size": 3,
            "previous_commits_size": 19
        },
        "is_makefile_based": true,
        "no_new_files": [],
        "no_other_files": true,
        "num_prohibited_files": 218395,
        "prohibited_files": [
            "server/src/main/java/com/genymobile/scrcpy/Device.java",
            "server/src/main/java/com/genymobile/scrcpy/wrappers/SurfaceControl.java",
            "server/src/main/java/com/genymobile/scrcpy/Device.java",
            "server/src/main/java/com/genymobile/scrcpy/wrappers/SurfaceControl.java",
            "app/meson.build",
            "app/scrcpy.1",
            "app/src/common.h",
            "app/src/scrcpy.h",
            "app/src/server.h",
            "server/src/main/java/com/genymobile/scrcpy/Workarounds.java"
        ],
        "reopen": true,
        "reopen_events": [
            [
                "2022-12-28 21:15:02+00:00",
                "commit"
            ],
            [
                "2022-12-28 21:15:02+00:00",
                "commit"
            ],
            [
                "2022-12-28 21:18:42+00:00",
                "commit"
            ],
            [
                "2022-12-29 12:57:58+00:00",
                "closed"
            ],
            [
                "2023-01-04 21:23:42+00:00",
                "reopened"
            ],
            [
                "2023-01-04 21:23:46+00:00",
                "closed"
            ],
            [
                "2023-06-14 13:55:59+00:00",
                "commit"
            ],
            [
                "2023-06-14 13:55:59+00:00",
                "commit"
            ]
        ],
        "status": false,
        "strategy": true,
        "total_changes": 24
    }
}