{
    "covered_issues": [
        207,
        206,
        204,
        202,
        201,
        199,
        198,
        197,
        196,
        195,
        194,
        193,
        190,
        189,
        187,
        186,
        185,
        183,
        182,
        180,
        179,
        178,
        177,
        176,
        175,
        173,
        170,
        169,
        167,
        166,
        165,
        164,
        163,
        159,
        153,
        151,
        149,
        146,
        145,
        144,
        143,
        142,
        140,
        139,
        136,
        134,
        132,
        130,
        129,
        125,
        123,
        122,
        120,
        119,
        118,
        116,
        115,
        114,
        111,
        110,
        109,
        107,
        104,
        103,
        102,
        101,
        100,
        98,
        95,
        94,
        93,
        92,
        90,
        89,
        87,
        86,
        85,
        79,
        78,
        77,
        76,
        75,
        74,
        73,
        72,
        71,
        70,
        69,
        68,
        67,
        66,
        65,
        61,
        58,
        57,
        56,
        54,
        53,
        52,
        51,
        49,
        47,
        46,
        45,
        44,
        43,
        41,
        39,
        38,
        37,
        36,
        35,
        34,
        33,
        32,
        31,
        30,
        29,
        27,
        21,
        19,
        18,
        17,
        16,
        15,
        14,
        13,
        12,
        11,
        9,
        8,
        6,
        4,
        3,
        2,
        1
    ],
    "finished": true
}