{
    "category": [
        "memory"
    ],
    "commits": [
        {
            "associated_pull_request": [
                "https://github.com/jerryscript-project/jerryscript/pull/4426"
            ],
            "date": "2021-01-08 13:08:55",
            "diff": "jerryscript-project_jerryscript/issue_4195/commit_b56fa43aa3d258edce2077e42adb0de350f02697.diff",
            "diff_additions": 7,
            "diff_deletions": 0,
            "diff_file_size": 91321,
            "diff_url": "https://github.com/jerryscript-project/jerryscript/commit/b56fa43aa3d258edce2077e42adb0de350f02697.diff",
            "exists": true,
            "files": [
                {
                    "file_additions": 7,
                    "file_deletions": 0,
                    "file_exists": true,
                    "file_name": "jerry-core/parser/js/js-parser.c",
                    "file_size": 91321
                }
            ],
            "interesting": {
                "reopen": false,
                "status": false
            },
            "is_parent": true,
            "sha": "b56fa43aa3d258edce2077e42adb0de350f02697"
        },
        {
            "associated_pull_request": [],
            "date": "2021-01-08 13:09:45",
            "diff": "jerryscript-project_jerryscript/issue_4195/commit_62588f3e163840021c2c96b2fc3df282321a8c98.diff",
            "diff_additions": 5,
            "diff_deletions": 0,
            "diff_file_size": 115792,
            "diff_url": "https://github.com/jerryscript-project/jerryscript/commit/62588f3e163840021c2c96b2fc3df282321a8c98.diff",
            "exists": true,
            "files": [
                {
                    "file_additions": 5,
                    "file_deletions": 0,
                    "file_exists": true,
                    "file_name": "jerry-core/parser/js/js-parser-statm.c",
                    "file_size": 115792
                }
            ],
            "interesting": {
                "reopen": false,
                "status": false
            },
            "is_parent": false,
            "sha": "62588f3e163840021c2c96b2fc3df282321a8c98"
        },
        {
            "associated_pull_request": [],
            "date": "2021-01-08 13:09:45",
            "diff": "jerryscript-project_jerryscript/issue_4195/commit_dde499668d219709de7cab76cae921fef2db93f7.diff",
            "diff_additions": 11,
            "diff_deletions": 0,
            "diff_file_size": 115792,
            "diff_url": "https://github.com/jerryscript-project/jerryscript/commit/dde499668d219709de7cab76cae921fef2db93f7.diff",
            "exists": true,
            "files": [
                {
                    "file_additions": 11,
                    "file_deletions": 0,
                    "file_exists": true,
                    "file_name": "jerry-core/parser/js/js-parser-statm.c",
                    "file_size": 115792
                }
            ],
            "interesting": {
                "reopen": false,
                "status": true
            },
            "is_parent": false,
            "sha": "dde499668d219709de7cab76cae921fef2db93f7"
        },
        {
            "associated_pull_request": [],
            "date": "2021-01-08 13:09:45",
            "diff": "jerryscript-project_jerryscript/issue_4195/commit_650cefe7892a4caa2804c89dda36ccc38e61724b.diff",
            "diff_additions": 12,
            "diff_deletions": 0,
            "diff_file_size": 115792,
            "diff_url": "https://github.com/jerryscript-project/jerryscript/commit/650cefe7892a4caa2804c89dda36ccc38e61724b.diff",
            "exists": true,
            "files": [
                {
                    "file_additions": 12,
                    "file_deletions": 0,
                    "file_exists": true,
                    "file_name": "jerry-core/parser/js/js-parser-statm.c",
                    "file_size": 115792
                }
            ],
            "interesting": {
                "reopen": false,
                "status": false
            },
            "is_parent": false,
            "sha": "650cefe7892a4caa2804c89dda36ccc38e61724b"
        },
        {
            "associated_pull_request": [],
            "date": "2021-01-08 13:09:45",
            "diff": "jerryscript-project_jerryscript/issue_4195/commit_442c183b5b7345b018aa620831e99c801fd63760.diff",
            "diff_additions": 12,
            "diff_deletions": 0,
            "diff_file_size": 115792,
            "diff_url": "https://github.com/jerryscript-project/jerryscript/commit/442c183b5b7345b018aa620831e99c801fd63760.diff",
            "exists": true,
            "files": [
                {
                    "file_additions": 12,
                    "file_deletions": 0,
                    "file_exists": true,
                    "file_name": "jerry-core/parser/js/js-parser-statm.c",
                    "file_size": 115792
                }
            ],
            "interesting": {
                "reopen": false,
                "status": false
            },
            "is_parent": false,
            "sha": "442c183b5b7345b018aa620831e99c801fd63760"
        }
    ],
    "first_commit": "2021-01-08 13:08:55",
    "last_commit": "2021-01-08 15:40:19",
    "number": 4195,
    "pull_request": "None",
    "score": {
        "accidental_reopen_likely": false,
        "all_labels": [
            "bug"
        ],
        "contains_keywords": [
            "report",
            "fix",
            "patch",
            "fault",
            "bug",
            "test",
            "issu",
            "fail"
        ],
        "fix_size": 18,
        "has_labels": [
            "bug"
        ],
        "intersecting": {
            "computed_score": 1.0,
            "final_commit_size": 13,
            "intersection_size": 13,
            "previous_commits_size": 18
        },
        "is_makefile_based": true,
        "no_new_files": [],
        "no_other_files": false,
        "num_prohibited_files": 124887,
        "prohibited_files": [
            "kill.h",
            "meminfo.h",
            "kill.h",
            "meminfo.h",
            "kill.h",
            "meminfo.h",
            "testsuite_cli_test.go",
            "testsuite_cli_test.go",
            "common.mk",
            "i3bar/include/draw_util.h"
        ],
        "reopen": false,
        "reopen_events": [
            [
                "2021-01-08 13:16:33",
                "commit"
            ],
            [
                "2021-01-08 14:24:26",
                "commit"
            ],
            [
                "2021-01-08 14:30:54",
                "commit"
            ],
            [
                "2021-01-08 14:31:51",
                "commit"
            ],
            [
                "2021-01-08 15:40:37",
                "commit"
            ],
            [
                "2021-01-18 14:35:33",
                "closed"
            ]
        ],
        "status": true,
        "strategy": true,
        "total_changes": 47
    }
}