{
    "category": [
        "memory",
        "build/refactor/preprocessing"
    ],
    "commits": [
        {
            "associated_pull_request": [],
            "date": "2015-03-07 10:10:30",
            "diff": "curl_curl/issue_149/commit_00ea0e7db0a0a958309d35e28718949d10d537c9.diff",
            "diff_additions": 13,
            "diff_deletions": 13,
            "diff_file_size": 405048,
            "diff_url": "https://github.com/curl/curl/commit/00ea0e7db0a0a958309d35e28718949d10d537c9.diff",
            "exists": true,
            "files": [
                {
                    "file_additions": 2,
                    "file_deletions": 2,
                    "file_exists": true,
                    "file_name": "lib/http.c",
                    "file_size": 139433
                },
                {
                    "file_additions": 2,
                    "file_deletions": 2,
                    "file_exists": true,
                    "file_name": "lib/vtls/gtls.c",
                    "file_size": 51572
                },
                {
                    "file_additions": 2,
                    "file_deletions": 2,
                    "file_exists": true,
                    "file_name": "lib/vtls/nss.c",
                    "file_size": 75545
                },
                {
                    "file_additions": 5,
                    "file_deletions": 5,
                    "file_exists": true,
                    "file_name": "lib/vtls/openssl.c",
                    "file_size": 138498
                },
                {
                    "file_additions": 2,
                    "file_deletions": 2,
                    "file_exists": false,
                    "file_name": "lib/vtls/polarssl.c",
                    "file_size": 0
                }
            ],
            "interesting": {
                "reopen": false,
                "status": false
            },
            "is_parent": true,
            "sha": "00ea0e7db0a0a958309d35e28718949d10d537c9"
        },
        {
            "associated_pull_request": [],
            "date": "2015-03-07 18:16:03",
            "diff": "curl_curl/issue_149/commit_ea41e7db2461d0fbe6ef7ce990b8a096de5b38bd.diff",
            "diff_additions": 151,
            "diff_deletions": 338,
            "diff_file_size": 1251308,
            "diff_url": "https://github.com/curl/curl/commit/ea41e7db2461d0fbe6ef7ce990b8a096de5b38bd.diff",
            "exists": true,
            "files": [
                {
                    "file_additions": 3,
                    "file_deletions": 9,
                    "file_exists": true,
                    "file_name": "docs/examples/fopen.c",
                    "file_size": 14206
                },
                {
                    "file_additions": 1,
                    "file_deletions": 2,
                    "file_exists": true,
                    "file_name": "docs/examples/getinmemory.c",
                    "file_size": 3316
                },
                {
                    "file_additions": 1,
                    "file_deletions": 2,
                    "file_exists": true,
                    "file_name": "docs/examples/postinmemory.c",
                    "file_size": 3441
                },
                {
                    "file_additions": 1,
                    "file_deletions": 2,
                    "file_exists": true,
                    "file_name": "lib/asyn-ares.c",
                    "file_size": 25472
                },
                {
                    "file_additions": 2,
                    "file_deletions": 5,
                    "file_exists": true,
                    "file_name": "lib/asyn-thread.c",
                    "file_size": 19403
                },
                {
                    "file_additions": 1,
                    "file_deletions": 2,
                    "file_exists": true,
                    "file_name": "lib/base64.c",
                    "file_size": 8802
                },
                {
                    "file_additions": 17,
                    "file_deletions": 36,
                    "file_exists": true,
                    "file_name": "lib/cookie.c",
                    "file_size": 48440
                },
                {
                    "file_additions": 2,
                    "file_deletions": 7,
                    "file_exists": true,
                    "file_name": "lib/curl_addrinfo.c",
                    "file_size": 16335
                },
                {
                    "file_additions": 2,
                    "file_deletions": 4,
                    "file_exists": true,
                    "file_name": "lib/curl_ntlm_wb.c",
                    "file_size": 14332
                },
                {
                    "file_additions": 1,
                    "file_deletions": 2,
                    "file_exists": true,
                    "file_name": "lib/escape.c",
                    "file_size": 7048
                },
                {
                    "file_additions": 5,
                    "file_deletions": 7,
                    "file_exists": true,
                    "file_name": "lib/formdata.c",
                    "file_size": 29934
                },
                {
                    "file_additions": 9,
                    "file_deletions": 19,
                    "file_exists": true,
                    "file_name": "lib/ftp.c",
                    "file_size": 134210
                },
                {
                    "file_additions": 1,
                    "file_deletions": 2,
                    "file_exists": true,
                    "file_name": "lib/ftplistparser.c",
                    "file_size": 31137
                },
                {
                    "file_additions": 1,
                    "file_deletions": 2,
                    "file_exists": true,
                    "file_name": "lib/getinfo.c",
                    "file_size": 16927
                },
                {
                    "file_additions": 7,
                    "file_deletions": 14,
                    "file_exists": true,
                    "file_name": "lib/http.c",
                    "file_size": 139433
                },
                {
                    "file_additions": 4,
                    "file_deletions": 9,
                    "file_exists": true,
                    "file_name": "lib/http_proxy.c",
                    "file_size": 31101
                },
                {
                    "file_additions": 2,
                    "file_deletions": 5,
                    "file_exists": true,
                    "file_name": "lib/ldap.c",
                    "file_size": 28898
                },
                {
                    "file_additions": 4,
                    "file_deletions": 8,
                    "file_exists": true,
                    "file_name": "lib/multi.c",
                    "file_size": 107956
                },
                {
                    "file_additions": 2,
                    "file_deletions": 6,
                    "file_exists": true,
                    "file_name": "lib/nwlib.c",
                    "file_size": 9707
                },
                {
                    "file_additions": 2,
                    "file_deletions": 4,
                    "file_exists": true,
                    "file_name": "lib/pingpong.c",
                    "file_size": 15799
                },
                {
                    "file_additions": 2,
                    "file_deletions": 4,
                    "file_exists": false,
                    "file_name": "lib/security.c",
                    "file_size": 0
                },
                {
                    "file_additions": 16,
                    "file_deletions": 30,
                    "file_exists": true,
                    "file_name": "lib/url.c",
                    "file_size": 130879
                },
                {
                    "file_additions": 2,
                    "file_deletions": 4,
                    "file_exists": true,
                    "file_name": "lib/vtls/nss.c",
                    "file_size": 75545
                },
                {
                    "file_additions": 1,
                    "file_deletions": 2,
                    "file_exists": true,
                    "file_name": "lib/vtls/vtls.c",
                    "file_size": 38326
                },
                {
                    "file_additions": 4,
                    "file_deletions": 9,
                    "file_exists": true,
                    "file_name": "lib/wildcard.c",
                    "file_size": 1942
                },
                {
                    "file_additions": 1,
                    "file_deletions": 2,
                    "file_exists": true,
                    "file_name": "lib/x509asn1.c",
                    "file_size": 36098
                },
                {
                    "file_additions": 1,
                    "file_deletions": 4,
                    "file_exists": true,
                    "file_name": "packages/OS400/ccsidcurl.c",
                    "file_size": 33354
                },
                {
                    "file_additions": 14,
                    "file_deletions": 44,
                    "file_exists": true,
                    "file_name": "packages/OS400/os400sys.c",
                    "file_size": 32446
                },
                {
                    "file_additions": 1,
                    "file_deletions": 2,
                    "file_exists": true,
                    "file_name": "tests/libtest/lib539.c",
                    "file_size": 2855
                },
                {
                    "file_additions": 1,
                    "file_deletions": 2,
                    "file_exists": true,
                    "file_name": "tests/libtest/lib568.c",
                    "file_size": 4697
                },
                {
                    "file_additions": 1,
                    "file_deletions": 3,
                    "file_exists": true,
                    "file_name": "tests/libtest/lib569.c",
                    "file_size": 3594
                },
                {
                    "file_additions": 1,
                    "file_deletions": 3,
                    "file_exists": true,
                    "file_name": "tests/libtest/lib570.c",
                    "file_size": 3292
                },
                {
                    "file_additions": 1,
                    "file_deletions": 3,
                    "file_exists": true,
                    "file_name": "tests/libtest/lib571.c",
                    "file_size": 5762
                },
                {
                    "file_additions": 1,
                    "file_deletions": 2,
                    "file_exists": true,
                    "file_name": "tests/libtest/lib572.c",
                    "file_size": 4733
                },
                {
                    "file_additions": 2,
                    "file_deletions": 4,
                    "file_exists": true,
                    "file_name": "tests/libtest/lib582.c",
                    "file_size": 9357
                },
                {
                    "file_additions": 3,
                    "file_deletions": 6,
                    "file_exists": true,
                    "file_name": "tests/server/getpart.c",
                    "file_size": 13182
                },
                {
                    "file_additions": 14,
                    "file_deletions": 30,
                    "file_exists": true,
                    "file_name": "tests/server/rtspd.c",
                    "file_size": 40142
                },
                {
                    "file_additions": 14,
                    "file_deletions": 30,
                    "file_exists": true,
                    "file_name": "tests/server/sws.c",
                    "file_size": 70588
                },
                {
                    "file_additions": 2,
                    "file_deletions": 4,
                    "file_exists": true,
                    "file_name": "tests/server/tftpd.c",
                    "file_size": 35090
                },
                {
                    "file_additions": 1,
                    "file_deletions": 3,
                    "file_exists": true,
                    "file_name": "tests/unit/unit1305.c",
                    "file_size": 3529
                }
            ],
            "interesting": {
                "reopen": false,
                "status": false
            },
            "is_parent": false,
            "sha": "ea41e7db2461d0fbe6ef7ce990b8a096de5b38bd"
        },
        {
            "associated_pull_request": [],
            "date": "2015-03-07 19:21:23",
            "diff": "curl_curl/issue_149/commit_cdc4e3c69be06095a4cffdde400907cd6161fbee.diff",
            "diff_additions": 3,
            "diff_deletions": 6,
            "diff_file_size": 167223,
            "diff_url": "https://github.com/curl/curl/commit/cdc4e3c69be06095a4cffdde400907cd6161fbee.diff",
            "exists": true,
            "files": [
                {
                    "file_additions": 1,
                    "file_deletions": 2,
                    "file_exists": true,
                    "file_name": "lib/formdata.c",
                    "file_size": 29934
                },
                {
                    "file_additions": 1,
                    "file_deletions": 2,
                    "file_exists": true,
                    "file_name": "lib/share.c",
                    "file_size": 6410
                },
                {
                    "file_additions": 1,
                    "file_deletions": 2,
                    "file_exists": true,
                    "file_name": "lib/url.c",
                    "file_size": 130879
                }
            ],
            "interesting": {
                "reopen": true,
                "status": false
            },
            "is_parent": false,
            "sha": "cdc4e3c69be06095a4cffdde400907cd6161fbee"
        },
        {
            "associated_pull_request": [],
            "date": "2015-03-11 16:41:01",
            "diff": "curl_curl/issue_149/commit_32b202f7175c57b270cf52855f4dacbf8a32c5c0.diff",
            "diff_additions": 152,
            "diff_deletions": 339,
            "diff_file_size": 1251308,
            "diff_url": "https://github.com/curl/curl/commit/32b202f7175c57b270cf52855f4dacbf8a32c5c0.diff",
            "exists": true,
            "files": [
                {
                    "file_additions": 3,
                    "file_deletions": 9,
                    "file_exists": true,
                    "file_name": "docs/examples/fopen.c",
                    "file_size": 14206
                },
                {
                    "file_additions": 1,
                    "file_deletions": 2,
                    "file_exists": true,
                    "file_name": "docs/examples/getinmemory.c",
                    "file_size": 3316
                },
                {
                    "file_additions": 1,
                    "file_deletions": 2,
                    "file_exists": true,
                    "file_name": "docs/examples/postinmemory.c",
                    "file_size": 3441
                },
                {
                    "file_additions": 1,
                    "file_deletions": 2,
                    "file_exists": true,
                    "file_name": "lib/asyn-ares.c",
                    "file_size": 25472
                },
                {
                    "file_additions": 2,
                    "file_deletions": 5,
                    "file_exists": true,
                    "file_name": "lib/asyn-thread.c",
                    "file_size": 19403
                },
                {
                    "file_additions": 1,
                    "file_deletions": 2,
                    "file_exists": true,
                    "file_name": "lib/base64.c",
                    "file_size": 8802
                },
                {
                    "file_additions": 17,
                    "file_deletions": 36,
                    "file_exists": true,
                    "file_name": "lib/cookie.c",
                    "file_size": 48440
                },
                {
                    "file_additions": 2,
                    "file_deletions": 7,
                    "file_exists": true,
                    "file_name": "lib/curl_addrinfo.c",
                    "file_size": 16335
                },
                {
                    "file_additions": 2,
                    "file_deletions": 4,
                    "file_exists": true,
                    "file_name": "lib/curl_ntlm_wb.c",
                    "file_size": 14332
                },
                {
                    "file_additions": 1,
                    "file_deletions": 2,
                    "file_exists": true,
                    "file_name": "lib/escape.c",
                    "file_size": 7048
                },
                {
                    "file_additions": 5,
                    "file_deletions": 7,
                    "file_exists": true,
                    "file_name": "lib/formdata.c",
                    "file_size": 29934
                },
                {
                    "file_additions": 9,
                    "file_deletions": 19,
                    "file_exists": true,
                    "file_name": "lib/ftp.c",
                    "file_size": 134210
                },
                {
                    "file_additions": 1,
                    "file_deletions": 2,
                    "file_exists": true,
                    "file_name": "lib/ftplistparser.c",
                    "file_size": 31137
                },
                {
                    "file_additions": 1,
                    "file_deletions": 2,
                    "file_exists": true,
                    "file_name": "lib/getinfo.c",
                    "file_size": 16927
                },
                {
                    "file_additions": 8,
                    "file_deletions": 15,
                    "file_exists": true,
                    "file_name": "lib/http.c",
                    "file_size": 139433
                },
                {
                    "file_additions": 4,
                    "file_deletions": 9,
                    "file_exists": true,
                    "file_name": "lib/http_proxy.c",
                    "file_size": 31101
                },
                {
                    "file_additions": 2,
                    "file_deletions": 5,
                    "file_exists": true,
                    "file_name": "lib/ldap.c",
                    "file_size": 28898
                },
                {
                    "file_additions": 4,
                    "file_deletions": 8,
                    "file_exists": true,
                    "file_name": "lib/multi.c",
                    "file_size": 107956
                },
                {
                    "file_additions": 2,
                    "file_deletions": 6,
                    "file_exists": true,
                    "file_name": "lib/nwlib.c",
                    "file_size": 9707
                },
                {
                    "file_additions": 2,
                    "file_deletions": 4,
                    "file_exists": true,
                    "file_name": "lib/pingpong.c",
                    "file_size": 15799
                },
                {
                    "file_additions": 2,
                    "file_deletions": 4,
                    "file_exists": false,
                    "file_name": "lib/security.c",
                    "file_size": 0
                },
                {
                    "file_additions": 16,
                    "file_deletions": 30,
                    "file_exists": true,
                    "file_name": "lib/url.c",
                    "file_size": 130879
                },
                {
                    "file_additions": 2,
                    "file_deletions": 4,
                    "file_exists": true,
                    "file_name": "lib/vtls/nss.c",
                    "file_size": 75545
                },
                {
                    "file_additions": 1,
                    "file_deletions": 2,
                    "file_exists": true,
                    "file_name": "lib/vtls/vtls.c",
                    "file_size": 38326
                },
                {
                    "file_additions": 4,
                    "file_deletions": 9,
                    "file_exists": true,
                    "file_name": "lib/wildcard.c",
                    "file_size": 1942
                },
                {
                    "file_additions": 1,
                    "file_deletions": 2,
                    "file_exists": true,
                    "file_name": "lib/x509asn1.c",
                    "file_size": 36098
                },
                {
                    "file_additions": 1,
                    "file_deletions": 4,
                    "file_exists": true,
                    "file_name": "packages/OS400/ccsidcurl.c",
                    "file_size": 33354
                },
                {
                    "file_additions": 14,
                    "file_deletions": 44,
                    "file_exists": true,
                    "file_name": "packages/OS400/os400sys.c",
                    "file_size": 32446
                },
                {
                    "file_additions": 1,
                    "file_deletions": 2,
                    "file_exists": true,
                    "file_name": "tests/libtest/lib539.c",
                    "file_size": 2855
                },
                {
                    "file_additions": 1,
                    "file_deletions": 2,
                    "file_exists": true,
                    "file_name": "tests/libtest/lib568.c",
                    "file_size": 4697
                },
                {
                    "file_additions": 1,
                    "file_deletions": 3,
                    "file_exists": true,
                    "file_name": "tests/libtest/lib569.c",
                    "file_size": 3594
                },
                {
                    "file_additions": 1,
                    "file_deletions": 3,
                    "file_exists": true,
                    "file_name": "tests/libtest/lib570.c",
                    "file_size": 3292
                },
                {
                    "file_additions": 1,
                    "file_deletions": 3,
                    "file_exists": true,
                    "file_name": "tests/libtest/lib571.c",
                    "file_size": 5762
                },
                {
                    "file_additions": 1,
                    "file_deletions": 2,
                    "file_exists": true,
                    "file_name": "tests/libtest/lib572.c",
                    "file_size": 4733
                },
                {
                    "file_additions": 2,
                    "file_deletions": 4,
                    "file_exists": true,
                    "file_name": "tests/libtest/lib582.c",
                    "file_size": 9357
                },
                {
                    "file_additions": 3,
                    "file_deletions": 6,
                    "file_exists": true,
                    "file_name": "tests/server/getpart.c",
                    "file_size": 13182
                },
                {
                    "file_additions": 14,
                    "file_deletions": 30,
                    "file_exists": true,
                    "file_name": "tests/server/rtspd.c",
                    "file_size": 40142
                },
                {
                    "file_additions": 14,
                    "file_deletions": 30,
                    "file_exists": true,
                    "file_name": "tests/server/sws.c",
                    "file_size": 70588
                },
                {
                    "file_additions": 2,
                    "file_deletions": 4,
                    "file_exists": true,
                    "file_name": "tests/server/tftpd.c",
                    "file_size": 35090
                },
                {
                    "file_additions": 1,
                    "file_deletions": 3,
                    "file_exists": true,
                    "file_name": "tests/unit/unit1305.c",
                    "file_size": 3529
                }
            ],
            "interesting": {
                "reopen": false,
                "status": false
            },
            "is_parent": false,
            "sha": "32b202f7175c57b270cf52855f4dacbf8a32c5c0"
        },
        {
            "associated_pull_request": [],
            "date": "2015-03-11 17:15:33",
            "diff": "curl_curl/issue_149/commit_b216b8893c2a1ab64f696f1f505e04095b1bd968.diff",
            "diff_additions": 3,
            "diff_deletions": 6,
            "diff_file_size": 167223,
            "diff_url": "https://github.com/curl/curl/commit/b216b8893c2a1ab64f696f1f505e04095b1bd968.diff",
            "exists": true,
            "files": [
                {
                    "file_additions": 1,
                    "file_deletions": 2,
                    "file_exists": true,
                    "file_name": "lib/formdata.c",
                    "file_size": 29934
                },
                {
                    "file_additions": 1,
                    "file_deletions": 2,
                    "file_exists": true,
                    "file_name": "lib/share.c",
                    "file_size": 6410
                },
                {
                    "file_additions": 1,
                    "file_deletions": 2,
                    "file_exists": true,
                    "file_name": "lib/url.c",
                    "file_size": 130879
                }
            ],
            "interesting": {
                "reopen": false,
                "status": false
            },
            "is_parent": false,
            "sha": "b216b8893c2a1ab64f696f1f505e04095b1bd968"
        },
        {
            "associated_pull_request": [],
            "date": "2015-03-11 16:41:01",
            "diff": "curl_curl/issue_149/commit_29c655c0a6affc0359e499162e8308663eb4d04f.diff",
            "diff_additions": 152,
            "diff_deletions": 339,
            "diff_file_size": 1251308,
            "diff_url": "https://github.com/curl/curl/commit/29c655c0a6affc0359e499162e8308663eb4d04f.diff",
            "exists": true,
            "files": [
                {
                    "file_additions": 3,
                    "file_deletions": 9,
                    "file_exists": true,
                    "file_name": "docs/examples/fopen.c",
                    "file_size": 14206
                },
                {
                    "file_additions": 1,
                    "file_deletions": 2,
                    "file_exists": true,
                    "file_name": "docs/examples/getinmemory.c",
                    "file_size": 3316
                },
                {
                    "file_additions": 1,
                    "file_deletions": 2,
                    "file_exists": true,
                    "file_name": "docs/examples/postinmemory.c",
                    "file_size": 3441
                },
                {
                    "file_additions": 1,
                    "file_deletions": 2,
                    "file_exists": true,
                    "file_name": "lib/asyn-ares.c",
                    "file_size": 25472
                },
                {
                    "file_additions": 2,
                    "file_deletions": 5,
                    "file_exists": true,
                    "file_name": "lib/asyn-thread.c",
                    "file_size": 19403
                },
                {
                    "file_additions": 1,
                    "file_deletions": 2,
                    "file_exists": true,
                    "file_name": "lib/base64.c",
                    "file_size": 8802
                },
                {
                    "file_additions": 17,
                    "file_deletions": 36,
                    "file_exists": true,
                    "file_name": "lib/cookie.c",
                    "file_size": 48440
                },
                {
                    "file_additions": 2,
                    "file_deletions": 7,
                    "file_exists": true,
                    "file_name": "lib/curl_addrinfo.c",
                    "file_size": 16335
                },
                {
                    "file_additions": 2,
                    "file_deletions": 4,
                    "file_exists": true,
                    "file_name": "lib/curl_ntlm_wb.c",
                    "file_size": 14332
                },
                {
                    "file_additions": 1,
                    "file_deletions": 2,
                    "file_exists": true,
                    "file_name": "lib/escape.c",
                    "file_size": 7048
                },
                {
                    "file_additions": 5,
                    "file_deletions": 7,
                    "file_exists": true,
                    "file_name": "lib/formdata.c",
                    "file_size": 29934
                },
                {
                    "file_additions": 9,
                    "file_deletions": 19,
                    "file_exists": true,
                    "file_name": "lib/ftp.c",
                    "file_size": 134210
                },
                {
                    "file_additions": 1,
                    "file_deletions": 2,
                    "file_exists": true,
                    "file_name": "lib/ftplistparser.c",
                    "file_size": 31137
                },
                {
                    "file_additions": 1,
                    "file_deletions": 2,
                    "file_exists": true,
                    "file_name": "lib/getinfo.c",
                    "file_size": 16927
                },
                {
                    "file_additions": 8,
                    "file_deletions": 15,
                    "file_exists": true,
                    "file_name": "lib/http.c",
                    "file_size": 139433
                },
                {
                    "file_additions": 4,
                    "file_deletions": 9,
                    "file_exists": true,
                    "file_name": "lib/http_proxy.c",
                    "file_size": 31101
                },
                {
                    "file_additions": 2,
                    "file_deletions": 5,
                    "file_exists": true,
                    "file_name": "lib/ldap.c",
                    "file_size": 28898
                },
                {
                    "file_additions": 4,
                    "file_deletions": 8,
                    "file_exists": true,
                    "file_name": "lib/multi.c",
                    "file_size": 107956
                },
                {
                    "file_additions": 2,
                    "file_deletions": 6,
                    "file_exists": true,
                    "file_name": "lib/nwlib.c",
                    "file_size": 9707
                },
                {
                    "file_additions": 2,
                    "file_deletions": 4,
                    "file_exists": true,
                    "file_name": "lib/pingpong.c",
                    "file_size": 15799
                },
                {
                    "file_additions": 2,
                    "file_deletions": 4,
                    "file_exists": false,
                    "file_name": "lib/security.c",
                    "file_size": 0
                },
                {
                    "file_additions": 16,
                    "file_deletions": 30,
                    "file_exists": true,
                    "file_name": "lib/url.c",
                    "file_size": 130879
                },
                {
                    "file_additions": 2,
                    "file_deletions": 4,
                    "file_exists": true,
                    "file_name": "lib/vtls/nss.c",
                    "file_size": 75545
                },
                {
                    "file_additions": 1,
                    "file_deletions": 2,
                    "file_exists": true,
                    "file_name": "lib/vtls/vtls.c",
                    "file_size": 38326
                },
                {
                    "file_additions": 4,
                    "file_deletions": 9,
                    "file_exists": true,
                    "file_name": "lib/wildcard.c",
                    "file_size": 1942
                },
                {
                    "file_additions": 1,
                    "file_deletions": 2,
                    "file_exists": true,
                    "file_name": "lib/x509asn1.c",
                    "file_size": 36098
                },
                {
                    "file_additions": 1,
                    "file_deletions": 4,
                    "file_exists": true,
                    "file_name": "packages/OS400/ccsidcurl.c",
                    "file_size": 33354
                },
                {
                    "file_additions": 14,
                    "file_deletions": 44,
                    "file_exists": true,
                    "file_name": "packages/OS400/os400sys.c",
                    "file_size": 32446
                },
                {
                    "file_additions": 1,
                    "file_deletions": 2,
                    "file_exists": true,
                    "file_name": "tests/libtest/lib539.c",
                    "file_size": 2855
                },
                {
                    "file_additions": 1,
                    "file_deletions": 2,
                    "file_exists": true,
                    "file_name": "tests/libtest/lib568.c",
                    "file_size": 4697
                },
                {
                    "file_additions": 1,
                    "file_deletions": 3,
                    "file_exists": true,
                    "file_name": "tests/libtest/lib569.c",
                    "file_size": 3594
                },
                {
                    "file_additions": 1,
                    "file_deletions": 3,
                    "file_exists": true,
                    "file_name": "tests/libtest/lib570.c",
                    "file_size": 3292
                },
                {
                    "file_additions": 1,
                    "file_deletions": 3,
                    "file_exists": true,
                    "file_name": "tests/libtest/lib571.c",
                    "file_size": 5762
                },
                {
                    "file_additions": 1,
                    "file_deletions": 2,
                    "file_exists": true,
                    "file_name": "tests/libtest/lib572.c",
                    "file_size": 4733
                },
                {
                    "file_additions": 2,
                    "file_deletions": 4,
                    "file_exists": true,
                    "file_name": "tests/libtest/lib582.c",
                    "file_size": 9357
                },
                {
                    "file_additions": 3,
                    "file_deletions": 6,
                    "file_exists": true,
                    "file_name": "tests/server/getpart.c",
                    "file_size": 13182
                },
                {
                    "file_additions": 14,
                    "file_deletions": 30,
                    "file_exists": true,
                    "file_name": "tests/server/rtspd.c",
                    "file_size": 40142
                },
                {
                    "file_additions": 14,
                    "file_deletions": 30,
                    "file_exists": true,
                    "file_name": "tests/server/sws.c",
                    "file_size": 70588
                },
                {
                    "file_additions": 2,
                    "file_deletions": 4,
                    "file_exists": true,
                    "file_name": "tests/server/tftpd.c",
                    "file_size": 35090
                },
                {
                    "file_additions": 1,
                    "file_deletions": 3,
                    "file_exists": true,
                    "file_name": "tests/unit/unit1305.c",
                    "file_size": 3529
                }
            ],
            "interesting": {
                "reopen": false,
                "status": false
            },
            "is_parent": false,
            "sha": "29c655c0a6affc0359e499162e8308663eb4d04f"
        },
        {
            "associated_pull_request": [],
            "date": "2015-03-11 17:15:33",
            "diff": "curl_curl/issue_149/commit_9e661601feba03d1158ac466a457d5a6ce7f3f11.diff",
            "diff_additions": 3,
            "diff_deletions": 6,
            "diff_file_size": 167223,
            "diff_url": "https://github.com/curl/curl/commit/9e661601feba03d1158ac466a457d5a6ce7f3f11.diff",
            "exists": true,
            "files": [
                {
                    "file_additions": 1,
                    "file_deletions": 2,
                    "file_exists": true,
                    "file_name": "lib/formdata.c",
                    "file_size": 29934
                },
                {
                    "file_additions": 1,
                    "file_deletions": 2,
                    "file_exists": true,
                    "file_name": "lib/share.c",
                    "file_size": 6410
                },
                {
                    "file_additions": 1,
                    "file_deletions": 2,
                    "file_exists": true,
                    "file_name": "lib/url.c",
                    "file_size": 130879
                }
            ],
            "interesting": {
                "reopen": false,
                "status": false
            },
            "is_parent": false,
            "sha": "9e661601feba03d1158ac466a457d5a6ce7f3f11"
        }
    ],
    "first_commit": "2015-03-07 10:10:30",
    "last_commit": "2015-03-16 11:13:56",
    "number": 149,
    "pull_request": "None",
    "score": {
        "accidental_reopen_likely": false,
        "all_labels": [
            "known-issue"
        ],
        "contains_keywords": [
            "fix",
            "patch",
            "remov",
            "issu"
        ],
        "fix_size": 495,
        "has_labels": [],
        "intersecting": {
            "computed_score": 1.0,
            "final_commit_size": 9,
            "intersection_size": 9,
            "previous_commits_size": 495
        },
        "is_makefile_based": true,
        "no_new_files": [],
        "no_other_files": false,
        "num_prohibited_files": 50617,
        "prohibited_files": [
            "kill.h",
            "meminfo.h",
            "kill.h",
            "meminfo.h",
            "kill.h",
            "meminfo.h",
            "testsuite_cli_test.go",
            "testsuite_cli_test.go",
            "common.mk",
            "i3bar/include/draw_util.h"
        ],
        "reopen": true,
        "reopen_events": [
            [
                "2015-03-07 10:16:10",
                "closed"
            ],
            [
                "2015-03-07 19:25:25",
                "commit"
            ],
            [
                "2015-03-07 19:25:25",
                "commit"
            ],
            [
                "2015-03-09 22:41:22",
                "reopened"
            ],
            [
                "2015-03-11 17:18:16",
                "commit"
            ],
            [
                "2015-03-11 17:18:16",
                "commit"
            ],
            [
                "2015-03-16 12:32:56",
                "commit"
            ],
            [
                "2015-03-16 12:32:56",
                "commit"
            ],
            [
                "2015-03-16 12:34:08",
                "closed"
            ]
        ],
        "status": false,
        "strategy": true,
        "total_changes": 1524
    }
}