{
    "covered_issues": [
        364,
        355,
        340,
        337,
        336,
        331,
        330,
        324,
        320,
        317,
        316,
        314,
        313,
        307,
        293,
        289,
        288,
        285,
        284,
        283,
        278,
        277,
        275,
        274,
        271,
        269,
        268,
        267,
        265,
        263,
        261,
        260,
        254,
        253,
        251,
        250,
        248,
        246,
        245,
        243,
        242,
        240,
        237,
        236,
        235,
        234,
        233,
        231,
        230,
        229,
        228,
        227,
        225,
        223,
        215,
        210,
        209,
        203,
        202,
        201,
        200,
        196,
        193,
        192,
        191,
        190,
        181,
        175,
        174,
        172,
        170,
        169,
        162,
        158,
        157,
        156,
        155,
        154,
        151,
        150,
        149,
        148,
        143,
        142,
        140,
        139,
        138,
        126,
        118,
        117,
        115,
        113,
        106,
        103,
        101,
        97,
        95,
        92,
        85,
        84,
        75,
        74,
        73,
        65,
        58,
        54,
        53,
        52,
        51,
        47,
        46,
        44,
        40,
        31,
        29,
        27,
        23,
        15,
        11,
        10,
        6,
        3,
        1
    ],
    "finished": true
}