{
    "category": [
        "memory",
        "feature request"
    ],
    "commits": [
        {
            "associated_pull_request": [],
            "date": "2019-10-25 14:54:54",
            "diff": "citusdata_citus/issue_2582/commit_2f4db74390a15f85a5ec10ba776f7b4737d50cf5.diff",
            "diff_additions": 3,
            "diff_deletions": 7,
            "diff_file_size": 43103,
            "diff_url": "https://github.com/citusdata/citus/commit/2f4db74390a15f85a5ec10ba776f7b4737d50cf5.diff",
            "exists": true,
            "files": [
                {
                    "file_additions": 3,
                    "file_deletions": 7,
                    "file_exists": true,
                    "file_name": "src/backend/distributed/planner/multi_join_order.c",
                    "file_size": 43103
                }
            ],
            "interesting": {
                "reopen": false,
                "status": false
            },
            "is_parent": true,
            "sha": "2f4db74390a15f85a5ec10ba776f7b4737d50cf5"
        },
        {
            "associated_pull_request": [],
            "date": "2019-10-31 12:12:53",
            "diff": "citusdata_citus/issue_2582/commit_4513a0aadc10af27e5ba00fd9ac8d34f327b9c77.diff",
            "diff_additions": 74,
            "diff_deletions": 24,
            "diff_file_size": 198474,
            "diff_url": "https://github.com/citusdata/citus/commit/4513a0aadc10af27e5ba00fd9ac8d34f327b9c77.diff",
            "exists": true,
            "files": [
                {
                    "file_additions": 3,
                    "file_deletions": 0,
                    "file_exists": true,
                    "file_name": "src/backend/distributed/planner/distributed_planner.c",
                    "file_size": 71239
                },
                {
                    "file_additions": 12,
                    "file_deletions": 4,
                    "file_exists": true,
                    "file_name": "src/backend/distributed/planner/multi_logical_planner.c",
                    "file_size": 69896
                },
                {
                    "file_additions": 59,
                    "file_deletions": 20,
                    "file_exists": true,
                    "file_name": "src/backend/distributed/planner/query_pushdown_planning.c",
                    "file_size": 57339
                }
            ],
            "interesting": {
                "reopen": false,
                "status": true
            },
            "is_parent": false,
            "sha": "4513a0aadc10af27e5ba00fd9ac8d34f327b9c77"
        },
        {
            "associated_pull_request": [],
            "date": "2019-10-31 12:12:53",
            "diff": "citusdata_citus/issue_2582/commit_51d001af6a59f6840de50d723336b127183eb288.diff",
            "diff_additions": 55,
            "diff_deletions": 33,
            "diff_file_size": 198474,
            "diff_url": "https://github.com/citusdata/citus/commit/51d001af6a59f6840de50d723336b127183eb288.diff",
            "exists": true,
            "files": [
                {
                    "file_additions": 8,
                    "file_deletions": 0,
                    "file_exists": true,
                    "file_name": "src/backend/distributed/planner/distributed_planner.c",
                    "file_size": 71239
                },
                {
                    "file_additions": 12,
                    "file_deletions": 4,
                    "file_exists": true,
                    "file_name": "src/backend/distributed/planner/multi_logical_planner.c",
                    "file_size": 69896
                },
                {
                    "file_additions": 35,
                    "file_deletions": 29,
                    "file_exists": true,
                    "file_name": "src/backend/distributed/planner/query_pushdown_planning.c",
                    "file_size": 57339
                }
            ],
            "interesting": {
                "reopen": false,
                "status": true
            },
            "is_parent": false,
            "sha": "51d001af6a59f6840de50d723336b127183eb288"
        },
        {
            "associated_pull_request": [],
            "date": "2019-11-08 13:27:50",
            "diff": "citusdata_citus/issue_2582/commit_e362ab469df5139990560f239311a345f02cad7f.diff",
            "diff_additions": 55,
            "diff_deletions": 33,
            "diff_file_size": 198474,
            "diff_url": "https://github.com/citusdata/citus/commit/e362ab469df5139990560f239311a345f02cad7f.diff",
            "exists": true,
            "files": [
                {
                    "file_additions": 8,
                    "file_deletions": 0,
                    "file_exists": true,
                    "file_name": "src/backend/distributed/planner/distributed_planner.c",
                    "file_size": 71239
                },
                {
                    "file_additions": 12,
                    "file_deletions": 4,
                    "file_exists": true,
                    "file_name": "src/backend/distributed/planner/multi_logical_planner.c",
                    "file_size": 69896
                },
                {
                    "file_additions": 35,
                    "file_deletions": 29,
                    "file_exists": true,
                    "file_name": "src/backend/distributed/planner/query_pushdown_planning.c",
                    "file_size": 57339
                }
            ],
            "interesting": {
                "reopen": false,
                "status": true
            },
            "is_parent": false,
            "sha": "e362ab469df5139990560f239311a345f02cad7f"
        },
        {
            "associated_pull_request": [],
            "date": "2019-11-08 13:27:50",
            "diff": "citusdata_citus/issue_2582/commit_ff643eb561371110d1630f84cfdeb89c2dd95447.diff",
            "diff_additions": 55,
            "diff_deletions": 33,
            "diff_file_size": 198474,
            "diff_url": "https://github.com/citusdata/citus/commit/ff643eb561371110d1630f84cfdeb89c2dd95447.diff",
            "exists": true,
            "files": [
                {
                    "file_additions": 8,
                    "file_deletions": 0,
                    "file_exists": true,
                    "file_name": "src/backend/distributed/planner/distributed_planner.c",
                    "file_size": 71239
                },
                {
                    "file_additions": 12,
                    "file_deletions": 4,
                    "file_exists": true,
                    "file_name": "src/backend/distributed/planner/multi_logical_planner.c",
                    "file_size": 69896
                },
                {
                    "file_additions": 35,
                    "file_deletions": 29,
                    "file_exists": true,
                    "file_name": "src/backend/distributed/planner/query_pushdown_planning.c",
                    "file_size": 57339
                }
            ],
            "interesting": {
                "reopen": false,
                "status": true
            },
            "is_parent": false,
            "sha": "ff643eb561371110d1630f84cfdeb89c2dd95447"
        },
        {
            "associated_pull_request": [],
            "date": "2019-11-08 13:27:50",
            "diff": "citusdata_citus/issue_2582/commit_55833fa7fb0e9e71d141d672ebc7d2f4328ed96f.diff",
            "diff_additions": 55,
            "diff_deletions": 33,
            "diff_file_size": 198474,
            "diff_url": "https://github.com/citusdata/citus/commit/55833fa7fb0e9e71d141d672ebc7d2f4328ed96f.diff",
            "exists": true,
            "files": [
                {
                    "file_additions": 8,
                    "file_deletions": 0,
                    "file_exists": true,
                    "file_name": "src/backend/distributed/planner/distributed_planner.c",
                    "file_size": 71239
                },
                {
                    "file_additions": 12,
                    "file_deletions": 4,
                    "file_exists": true,
                    "file_name": "src/backend/distributed/planner/multi_logical_planner.c",
                    "file_size": 69896
                },
                {
                    "file_additions": 35,
                    "file_deletions": 29,
                    "file_exists": true,
                    "file_name": "src/backend/distributed/planner/query_pushdown_planning.c",
                    "file_size": 57339
                }
            ],
            "interesting": {
                "reopen": false,
                "status": true
            },
            "is_parent": false,
            "sha": "55833fa7fb0e9e71d141d672ebc7d2f4328ed96f"
        },
        {
            "associated_pull_request": [],
            "date": "2019-11-08 13:27:50",
            "diff": "citusdata_citus/issue_2582/commit_964a2b7729df36b07a1319a339aa14ee187da210.diff",
            "diff_additions": 55,
            "diff_deletions": 33,
            "diff_file_size": 198474,
            "diff_url": "https://github.com/citusdata/citus/commit/964a2b7729df36b07a1319a339aa14ee187da210.diff",
            "exists": true,
            "files": [
                {
                    "file_additions": 8,
                    "file_deletions": 0,
                    "file_exists": true,
                    "file_name": "src/backend/distributed/planner/distributed_planner.c",
                    "file_size": 71239
                },
                {
                    "file_additions": 12,
                    "file_deletions": 4,
                    "file_exists": true,
                    "file_name": "src/backend/distributed/planner/multi_logical_planner.c",
                    "file_size": 69896
                },
                {
                    "file_additions": 35,
                    "file_deletions": 29,
                    "file_exists": true,
                    "file_name": "src/backend/distributed/planner/query_pushdown_planning.c",
                    "file_size": 57339
                }
            ],
            "interesting": {
                "reopen": false,
                "status": true
            },
            "is_parent": false,
            "sha": "964a2b7729df36b07a1319a339aa14ee187da210"
        },
        {
            "associated_pull_request": [],
            "date": "2019-11-08 13:27:50",
            "diff": "citusdata_citus/issue_2582/commit_b87a7870084d01e27a02d08a4b055d60846a9cca.diff",
            "diff_additions": 55,
            "diff_deletions": 33,
            "diff_file_size": 198474,
            "diff_url": "https://github.com/citusdata/citus/commit/b87a7870084d01e27a02d08a4b055d60846a9cca.diff",
            "exists": true,
            "files": [
                {
                    "file_additions": 8,
                    "file_deletions": 0,
                    "file_exists": true,
                    "file_name": "src/backend/distributed/planner/distributed_planner.c",
                    "file_size": 71239
                },
                {
                    "file_additions": 12,
                    "file_deletions": 4,
                    "file_exists": true,
                    "file_name": "src/backend/distributed/planner/multi_logical_planner.c",
                    "file_size": 69896
                },
                {
                    "file_additions": 35,
                    "file_deletions": 29,
                    "file_exists": true,
                    "file_name": "src/backend/distributed/planner/query_pushdown_planning.c",
                    "file_size": 57339
                }
            ],
            "interesting": {
                "reopen": false,
                "status": true
            },
            "is_parent": false,
            "sha": "b87a7870084d01e27a02d08a4b055d60846a9cca"
        },
        {
            "associated_pull_request": [],
            "date": "2019-11-08 13:27:50",
            "diff": "citusdata_citus/issue_2582/commit_b29acfcd924e933d4214d5e746158fb5422f1477.diff",
            "diff_additions": 46,
            "diff_deletions": 33,
            "diff_file_size": 198474,
            "diff_url": "https://github.com/citusdata/citus/commit/b29acfcd924e933d4214d5e746158fb5422f1477.diff",
            "exists": true,
            "files": [
                {
                    "file_additions": 8,
                    "file_deletions": 0,
                    "file_exists": true,
                    "file_name": "src/backend/distributed/planner/distributed_planner.c",
                    "file_size": 71239
                },
                {
                    "file_additions": 4,
                    "file_deletions": 3,
                    "file_exists": true,
                    "file_name": "src/backend/distributed/planner/multi_logical_planner.c",
                    "file_size": 69896
                },
                {
                    "file_additions": 34,
                    "file_deletions": 30,
                    "file_exists": true,
                    "file_name": "src/backend/distributed/planner/query_pushdown_planning.c",
                    "file_size": 57339
                }
            ],
            "interesting": {
                "reopen": false,
                "status": true
            },
            "is_parent": false,
            "sha": "b29acfcd924e933d4214d5e746158fb5422f1477"
        },
        {
            "associated_pull_request": [],
            "date": "2019-11-08 13:27:50",
            "diff": "citusdata_citus/issue_2582/commit_a3d6fb986dc44e0cebe451ff32605372d8cb177e.diff",
            "diff_additions": 46,
            "diff_deletions": 33,
            "diff_file_size": 198474,
            "diff_url": "https://github.com/citusdata/citus/commit/a3d6fb986dc44e0cebe451ff32605372d8cb177e.diff",
            "exists": true,
            "files": [
                {
                    "file_additions": 8,
                    "file_deletions": 0,
                    "file_exists": true,
                    "file_name": "src/backend/distributed/planner/distributed_planner.c",
                    "file_size": 71239
                },
                {
                    "file_additions": 4,
                    "file_deletions": 3,
                    "file_exists": true,
                    "file_name": "src/backend/distributed/planner/multi_logical_planner.c",
                    "file_size": 69896
                },
                {
                    "file_additions": 34,
                    "file_deletions": 30,
                    "file_exists": true,
                    "file_name": "src/backend/distributed/planner/query_pushdown_planning.c",
                    "file_size": 57339
                }
            ],
            "interesting": {
                "reopen": false,
                "status": true
            },
            "is_parent": false,
            "sha": "a3d6fb986dc44e0cebe451ff32605372d8cb177e"
        },
        {
            "associated_pull_request": [],
            "date": "2019-11-08 13:27:50",
            "diff": "citusdata_citus/issue_2582/commit_9fd4b726e6110dcd4c553fba4868e6122736c93e.diff",
            "diff_additions": 46,
            "diff_deletions": 33,
            "diff_file_size": 198474,
            "diff_url": "https://github.com/citusdata/citus/commit/9fd4b726e6110dcd4c553fba4868e6122736c93e.diff",
            "exists": true,
            "files": [
                {
                    "file_additions": 8,
                    "file_deletions": 0,
                    "file_exists": true,
                    "file_name": "src/backend/distributed/planner/distributed_planner.c",
                    "file_size": 71239
                },
                {
                    "file_additions": 4,
                    "file_deletions": 3,
                    "file_exists": true,
                    "file_name": "src/backend/distributed/planner/multi_logical_planner.c",
                    "file_size": 69896
                },
                {
                    "file_additions": 34,
                    "file_deletions": 30,
                    "file_exists": true,
                    "file_name": "src/backend/distributed/planner/query_pushdown_planning.c",
                    "file_size": 57339
                }
            ],
            "interesting": {
                "reopen": false,
                "status": false
            },
            "is_parent": false,
            "sha": "9fd4b726e6110dcd4c553fba4868e6122736c93e"
        },
        {
            "associated_pull_request": [],
            "date": "2019-11-08 13:27:50",
            "diff": "citusdata_citus/issue_2582/commit_8d2ea36d123ebf3321caaf8451345e03965f3ef4.diff",
            "diff_additions": 46,
            "diff_deletions": 33,
            "diff_file_size": 198474,
            "diff_url": "https://github.com/citusdata/citus/commit/8d2ea36d123ebf3321caaf8451345e03965f3ef4.diff",
            "exists": true,
            "files": [
                {
                    "file_additions": 8,
                    "file_deletions": 0,
                    "file_exists": true,
                    "file_name": "src/backend/distributed/planner/distributed_planner.c",
                    "file_size": 71239
                },
                {
                    "file_additions": 4,
                    "file_deletions": 3,
                    "file_exists": true,
                    "file_name": "src/backend/distributed/planner/multi_logical_planner.c",
                    "file_size": 69896
                },
                {
                    "file_additions": 34,
                    "file_deletions": 30,
                    "file_exists": true,
                    "file_name": "src/backend/distributed/planner/query_pushdown_planning.c",
                    "file_size": 57339
                }
            ],
            "interesting": {
                "reopen": false,
                "status": true
            },
            "is_parent": false,
            "sha": "8d2ea36d123ebf3321caaf8451345e03965f3ef4"
        },
        {
            "associated_pull_request": [
                "https://github.com/citusdata/citus/pull/3171"
            ],
            "date": "2019-11-08 13:27:50",
            "diff": "citusdata_citus/issue_2582/commit_0e78ab8ae465ef2109748b3ca67ea9f3c9b28ba6.diff",
            "diff_additions": 46,
            "diff_deletions": 33,
            "diff_file_size": 198474,
            "diff_url": "https://github.com/citusdata/citus/commit/0e78ab8ae465ef2109748b3ca67ea9f3c9b28ba6.diff",
            "exists": true,
            "files": [
                {
                    "file_additions": 8,
                    "file_deletions": 0,
                    "file_exists": true,
                    "file_name": "src/backend/distributed/planner/distributed_planner.c",
                    "file_size": 71239
                },
                {
                    "file_additions": 4,
                    "file_deletions": 3,
                    "file_exists": true,
                    "file_name": "src/backend/distributed/planner/multi_logical_planner.c",
                    "file_size": 69896
                },
                {
                    "file_additions": 34,
                    "file_deletions": 30,
                    "file_exists": true,
                    "file_name": "src/backend/distributed/planner/query_pushdown_planning.c",
                    "file_size": 57339
                }
            ],
            "interesting": {
                "reopen": false,
                "status": false
            },
            "is_parent": false,
            "sha": "0e78ab8ae465ef2109748b3ca67ea9f3c9b28ba6"
        },
        {
            "associated_pull_request": [
                "https://github.com/citusdata/citus/pull/3171"
            ],
            "date": "2019-11-11 12:44:28",
            "diff": "citusdata_citus/issue_2582/commit_adc6ca6100d7659cd5c08d538477070f6fb5bc51.diff",
            "diff_additions": 46,
            "diff_deletions": 33,
            "diff_file_size": 198474,
            "diff_url": "https://github.com/citusdata/citus/commit/adc6ca6100d7659cd5c08d538477070f6fb5bc51.diff",
            "exists": true,
            "files": [
                {
                    "file_additions": 8,
                    "file_deletions": 0,
                    "file_exists": true,
                    "file_name": "src/backend/distributed/planner/distributed_planner.c",
                    "file_size": 71239
                },
                {
                    "file_additions": 4,
                    "file_deletions": 3,
                    "file_exists": true,
                    "file_name": "src/backend/distributed/planner/multi_logical_planner.c",
                    "file_size": 69896
                },
                {
                    "file_additions": 34,
                    "file_deletions": 30,
                    "file_exists": true,
                    "file_name": "src/backend/distributed/planner/query_pushdown_planning.c",
                    "file_size": 57339
                }
            ],
            "interesting": {
                "reopen": false,
                "status": false
            },
            "is_parent": false,
            "sha": "adc6ca6100d7659cd5c08d538477070f6fb5bc51"
        },
        {
            "associated_pull_request": [
                "https://github.com/citusdata/citus/pull/3180"
            ],
            "date": "2019-11-18 15:25:46",
            "diff": "citusdata_citus/issue_2582/commit_217890af5f687e2a804b00c36f069025fe8fc769.diff",
            "diff_additions": 235,
            "diff_deletions": 145,
            "diff_file_size": 295274,
            "diff_url": "https://github.com/citusdata/citus/commit/217890af5f687e2a804b00c36f069025fe8fc769.diff",
            "exists": true,
            "files": [
                {
                    "file_additions": 181,
                    "file_deletions": 101,
                    "file_exists": true,
                    "file_name": "src/backend/distributed/planner/multi_join_order.c",
                    "file_size": 43103
                },
                {
                    "file_additions": 47,
                    "file_deletions": 42,
                    "file_exists": true,
                    "file_name": "src/backend/distributed/planner/multi_logical_planner.c",
                    "file_size": 69896
                },
                {
                    "file_additions": 7,
                    "file_deletions": 2,
                    "file_exists": true,
                    "file_name": "src/backend/distributed/planner/multi_physical_planner.c",
                    "file_size": 182275
                }
            ],
            "interesting": {
                "reopen": false,
                "status": false
            },
            "is_parent": false,
            "sha": "217890af5f687e2a804b00c36f069025fe8fc769"
        }
    ],
    "first_commit": "2019-11-05 14:02:16",
    "last_commit": "2019-11-18 15:25:46",
    "number": 2582,
    "pull_request": "None",
    "score": {
        "accidental_reopen_likely": false,
        "all_labels": [
            "feature",
            "sql"
        ],
        "contains_keywords": [
            "chang",
            "crash",
            "fix",
            "patch",
            "issu",
            "work"
        ],
        "fix_size": 459,
        "has_labels": [],
        "intersecting": {
            "computed_score": 0.003215434083601286,
            "final_commit_size": 311,
            "intersection_size": 1,
            "previous_commits_size": 149
        },
        "is_makefile_based": true,
        "no_new_files": [
            "src/backend/distributed/planner/multi_join_order.c",
            "src/backend/distributed/planner/multi_physical_planner.c"
        ],
        "no_other_files": false,
        "num_prohibited_files": 205884,
        "prohibited_files": [
            "hal/inc/pinmap_hal.h",
            "Debug/marvin.bin",
            "Debug/marvin.elf",
            "Debug/marvin.hex",
            "Debug/marvin.bin",
            "Debug/marvin.elf",
            "Debug/marvin.hex",
            "inc/spark_utilities.h",
            "Debug/marvin.bin",
            "Debug/marvin.elf"
        ],
        "reopen": false,
        "reopen_events": [
            [
                "2019-11-07 15:52:01",
                "commit"
            ],
            [
                "2019-11-08 11:58:34",
                "commit"
            ],
            [
                "2019-11-08 13:28:02",
                "commit"
            ],
            [
                "2019-11-08 13:28:48",
                "commit"
            ],
            [
                "2019-11-08 14:50:37",
                "commit"
            ],
            [
                "2019-11-08 15:44:15",
                "commit"
            ],
            [
                "2019-11-08 15:47:50",
                "commit"
            ],
            [
                "2019-11-11 10:29:36",
                "commit"
            ],
            [
                "2019-11-11 10:31:15",
                "commit"
            ],
            [
                "2019-11-11 10:48:37",
                "commit"
            ],
            [
                "2019-11-11 12:02:10",
                "commit"
            ],
            [
                "2019-11-11 12:02:30",
                "commit"
            ],
            [
                "2019-11-11 12:44:30",
                "commit"
            ],
            [
                "2019-11-18 15:25:47",
                "closed"
            ],
            [
                "2019-11-18 15:25:49",
                "commit"
            ]
        ],
        "status": true,
        "strategy": true,
        "total_changes": 1490
    }
}