        -:    0:Source:replace_cov.c
        -:    0:Graph:replace_cov.gcno
        -:    0:Data:replace_cov.gcda
        -:    0:Runs:59
        -:    0:Programs:1
        -:    1:/*  -*- Last-Edit:  Mon Dec  7 10:31:51 1992 by Tarak S. Goradia; -*- */
        -:    2:
        -:    3:#include <ctype.h>
        -:    4:#include <stdio.h>
        -:    5:#include <stdlib.h>
        -:    6:
        -:    7:#include <crest.h>
        -:    8:
        -:    9:void	Caseerror();
        -:   10:
        -:   11:typedef char	bool;
        -:   12:# define false 0
        -:   13:# define true  1
        -:   14:
        -:   15:# define MYMAX 10
        -:   16:# define MYLINEMAX 20
        -:   17:
        -:   18:# define MAXSTR 100
        -:   19:# define MAXPAT MAXSTR
        -:   20:
        -:   21:# define ENDSTR  '\0'
        -:   22:# define ESCAPE  '@'
        -:   23:# define CLOSURE '*'
        -:   24:# define BOL     '%'
        -:   25:# define EOL     '$'
        -:   26:# define ANY     '?'
        -:   27:# define CCL     '['
        -:   28:# define CCLEND  ']'
        -:   29:# define NEGATE  '^'
        -:   30:# define NCCL    '!'
        -:   31:# define LITCHAR 'c'
        -:   32:# define DITTO   -1
        -:   33:# define DASH    '-'
        -:   34:
        -:   35:# define TAB     9
        -:   36:# define NEWLINE 10
        -:   37:
        -:   38:# define CLOSIZE 1
        -:   39:
        -:   40:typedef char	character;
        -:   41:typedef char string[MAXSTR];
        -:   42:
        -:   43:char ** pubargv;
        -:   44:
        -:   45:bool
function getline2 called 0 returned 0% blocks executed 0%
    #####:   46:getline2(s, maxsize)
        -:   47:char	*s;
        -:   48:int	maxsize;
        -:   49:{
        -:   50:    int i;
    #####:   51:    for (i = 0; i < MYLINEMAX-1; i++) {
branch  0 never executed
branch  1 never executed
        -:   52:		//CREST_char(s[i]);
        -:   53:		int tmp;
    #####:   54:		sscanf(pubargv[i + MYMAX + MYMAX + 1], "%d", &tmp);
    #####:   55:		s[i] = tmp;
        -:   56:    }
    #####:   57:    s[i] = '\0';
    #####:   58:    return true;
        -:   59:}
        -:   60:
        -:   61:int
function addstr called 813 returned 100% blocks executed 80%
      813:   62:addstr(c, outset, j, maxset)
        -:   63:char	c;
        -:   64:char	*outset;
        -:   65:int	*j;
        -:   66:int	maxset;
        -:   67:{
        -:   68:    bool	result;
      813:   69:    if (*j >= maxset)
branch  0 taken 0% (fallthrough)
branch  1 taken 100%
    #####:   70:	result = false;
        -:   71:    else {
      813:   72:	outset[*j] = c;
      813:   73:	*j = *j + 1;
      813:   74:	result = true;
        -:   75:    }
      813:   76:    return result;
        -:   77:}
        -:   78:
        -:   79:char
function esc called 200 returned 100% blocks executed 73%
      200:   80:esc(s, i)
        -:   81:char 	*s;
        -:   82:int	*i;
        -:   83:{
        -:   84:    char	result;
      200:   85:    if (s[*i] != ESCAPE)
branch  0 taken 99% (fallthrough)
branch  1 taken 1%
      199:   86:	result = s[*i];
        -:   87:    else
        1:   88:	if (s[*i + 1] == ENDSTR)
branch  0 taken 0% (fallthrough)
branch  1 taken 100%
    #####:   89:	    result = ESCAPE;
        -:   90:	else
        -:   91:	{
        1:   92:	    *i = *i + 1;
        1:   93:	    if (s[*i] == 'n')
branch  0 taken 0% (fallthrough)
branch  1 taken 100%
    #####:   94:		result = NEWLINE;
        -:   95:	    else
        1:   96:		if (s[*i] == 't')
branch  0 taken 0% (fallthrough)
branch  1 taken 100%
    #####:   97:		    result = TAB;
        -:   98:		else
        1:   99:		    result = s[*i];
        -:  100:	}
      200:  101:    return result;
        -:  102:}
        -:  103:
        -:  104:void change();
        -:  105:
        -:  106:void
function dodash called 52 returned 100% blocks executed 32%
       52:  107:dodash(delim, src, i, dest, j, maxset)
        -:  108:char	delim;
        -:  109:char	*src;
        -:  110:int	*i;
        -:  111:char	*dest;
        -:  112:int	*j;
        -:  113:int	maxset;
        -:  114:{
        -:  115:    int	k;
        -:  116:    bool	junk;
        -:  117:    char	escjunk;
        -:  118:
      344:  119:    while ((src[*i] != delim) && (src[*i] != ENDSTR))
branch  0 taken 100% (fallthrough)
branch  1 taken 0%
branch  2 taken 82%
branch  3 taken 18% (fallthrough)
        -:  120:    {
      240:  121:	if (src[*i - 1] == ESCAPE) {
branch  0 taken 0% (fallthrough)
branch  1 taken 100%
    #####:  122:	    escjunk = esc(src, i);
call    0 never executed
    #####:  123:	    junk = addstr(escjunk, dest, j, maxset);
call    0 never executed
        -:  124:	} else
      240:  125:	    if (src[*i] != DASH)
branch  0 taken 100% (fallthrough)
branch  1 taken 0%
      240:  126:		junk = addstr(src[*i], dest, j, maxset);
call    0 returned 100%
    #####:  127:	    else if (*j <= 1 || src[*i + 1] == ENDSTR)
branch  0 never executed
branch  1 never executed
branch  2 never executed
branch  3 never executed
    #####:  128:		junk = addstr(DASH, dest, j, maxset);
call    0 never executed
    #####:  129:	    else if ((isalnum(src[*i - 1])) && (isalnum(src[*i + 1]))
call    0 never executed
branch  1 never executed
branch  2 never executed
call    3 never executed
branch  4 never executed
branch  5 never executed
    #####:  130:		&& (src[*i - 1] <= src[*i + 1]))
branch  0 never executed
branch  1 never executed
        -:  131:		{
    #####:  132:		    for (k = src[*i-1]+1; k<=src[*i+1]; k++)
branch  0 never executed
branch  1 never executed
        -:  133:		    {
    #####:  134:			junk = addstr(k, dest, j, maxset);
call    0 never executed
        -:  135:		    }
    #####:  136:		    *i = *i + 1;
        -:  137:		}
        -:  138:	    else
    #####:  139:		junk = addstr(DASH, dest, j, maxset);
call    0 never executed
      240:  140:	(*i) = (*i) + 1;
        -:  141:    }
       52:  142:}
        -:  143:
        -:  144:bool
function getccl called 52 returned 100% blocks executed 78%
       52:  145:getccl(arg, i, pat, j)
        -:  146:char	*arg;
        -:  147:int	*i;
        -:  148:char	*pat;
        -:  149:int	*j;
        -:  150:{
        -:  151:    int	jstart;
        -:  152:    bool	junk;
        -:  153:
       52:  154:    *i = *i + 1;
       52:  155:    if (arg[*i] == NEGATE) {
branch  0 taken 0% (fallthrough)
branch  1 taken 100%
    #####:  156:	junk = addstr(NCCL, pat, j, MAXPAT);
call    0 never executed
    #####:  157:	*i = *i + 1;
        -:  158:    } else
       52:  159:	junk = addstr(CCL, pat, j, MAXPAT);
call    0 returned 100%
       52:  160:    jstart = *j;
       52:  161:    junk = addstr(0, pat, j, MAXPAT);
call    0 returned 100%
       52:  162:    dodash(CCLEND, arg, i, pat, j, MAXPAT);
call    0 returned 100%
       52:  163:    pat[jstart] = *j - jstart - 1;
       52:  164:    return (arg[*i] == CCLEND);
        -:  165:}
        -:  166:
        -:  167:void
function stclose called 1 returned 100% blocks executed 100%
        1:  168:stclose(pat, j, lastj)
        -:  169:char	*pat;
        -:  170:int	*j;
        -:  171:int	lastj;
        -:  172:{
        -:  173:    int	jt;
        -:  174:    int	jp;
        -:  175:    bool	junk;
        -:  176:
        -:  177:
        3:  178:    for (jp = *j - 1; jp >= lastj ; jp--)
branch  0 taken 67%
branch  1 taken 33% (fallthrough)
        -:  179:    {
        2:  180:	jt = jp + CLOSIZE;
        2:  181:	junk = addstr(pat[jp], pat, &jt, MAXPAT);
call    0 returned 100%
        -:  182:    }
        1:  183:    *j = *j + CLOSIZE;
        1:  184:    pat[lastj] = CLOSURE;
        1:  185:}
        -:  186:
function in_set_2 called 2 returned 100% blocks executed 100%
        2:  187:bool in_set_2(c)
        -:  188:char c;
        -:  189:{
        2:  190:  return (c == BOL || c == EOL || c == CLOSURE);
branch  0 taken 100% (fallthrough)
branch  1 taken 0%
branch  2 taken 100% (fallthrough)
branch  3 taken 0%
branch  4 taken 50% (fallthrough)
branch  5 taken 50%
        -:  191:}
        -:  192:
function in_pat_set called 0 returned 0% blocks executed 0%
    #####:  193:bool in_pat_set(c)
        -:  194:char c;
        -:  195:{
    #####:  196:  return (   c == LITCHAR || c == BOL  || c == EOL || c == ANY
branch  0 never executed
branch  1 never executed
branch  2 never executed
branch  3 never executed
branch  4 never executed
branch  5 never executed
    #####:  197:          || c == CCL     || c == NCCL || c == CLOSURE);
branch  0 never executed
branch  1 never executed
branch  2 never executed
branch  3 never executed
branch  4 never executed
branch  5 never executed
branch  6 never executed
branch  7 never executed
        -:  198:}
        -:  199:
        -:  200:int
function makepat called 59 returned 100% blocks executed 93%
       59:  201:makepat(arg, start, delim, pat)
        -:  202:char	*arg;
        -:  203:int	start;
        -:  204:char	delim;
        -:  205:char	*pat;
        -:  206:{
        -:  207:    int	result;
        -:  208:    int	i, j, lastj, lj;
        -:  209:    bool	done, junk;
        -:  210:    bool	getres;
        -:  211:    char	escjunk;
        -:  212:
       59:  213:    j = 0;
       59:  214:    i = start;
       59:  215:    lastj = 0;
       59:  216:    done = false;
      377:  217:    while ((!done) && (arg[i] != delim) && (arg[i] != ENDSTR)) {
branch  0 taken 83% (fallthrough)
branch  1 taken 17%
branch  2 taken 98% (fallthrough)
branch  3 taken 2%
branch  4 taken 100%
branch  5 taken 0% (fallthrough)
      259:  218:	lj = j;
      259:  219:	if ((arg[i] == ANY))
branch  0 taken 2% (fallthrough)
branch  1 taken 98%
        4:  220:	    junk = addstr(ANY, pat, &j, MAXPAT);
call    0 returned 100%
      255:  221:	else if ((arg[i] == BOL) && (i == start))
branch  0 taken 1% (fallthrough)
branch  1 taken 99%
branch  2 taken 50% (fallthrough)
branch  3 taken 50%
        1:  222:	    junk = addstr(BOL, pat, &j, MAXPAT);
call    0 returned 100%
      254:  223:	else if ((arg[i] == EOL) && (arg[i+1] == delim))
branch  0 taken 1% (fallthrough)
branch  1 taken 99%
branch  2 taken 0% (fallthrough)
branch  3 taken 100%
    #####:  224:	    junk = addstr(EOL, pat, &j, MAXPAT);
call    0 never executed
      254:  225:	else if ((arg[i] == CCL))
branch  0 taken 20% (fallthrough)
branch  1 taken 80%
        -:  226:	{
       52:  227:	    getres = getccl(arg, &i, pat, &j);
call    0 returned 100%
       52:  228:	    done = (bool)(getres == false);
        -:  229:	}
      202:  230:	else if ((arg[i] == CLOSURE) && (i > start))
branch  0 taken 1% (fallthrough)
branch  1 taken 99%
branch  2 taken 100% (fallthrough)
branch  3 taken 0%
        -:  231:	{
        2:  232:	    lj = lastj;
        4:  233:	    if (in_set_2(pat[lj]))
call    0 returned 100%
branch  1 taken 50% (fallthrough)
branch  2 taken 50%
        1:  234:		done = true;
        -:  235:	    else
        1:  236:		stclose(pat, &j, lastj);
call    0 returned 100%
        -:  237:	}
        -:  238:	else
        -:  239:	{
      200:  240:	    junk = addstr(LITCHAR, pat, &j, MAXPAT);
call    0 returned 100%
      200:  241:	    escjunk = esc(arg, &i);
call    0 returned 100%
      200:  242:	    junk = addstr(escjunk, pat, &j, MAXPAT);
call    0 returned 100%
        -:  243:	}
      259:  244:	lastj = lj;
      259:  245:	if ((!done))
branch  0 taken 80% (fallthrough)
branch  1 taken 20%
      206:  246:	    i = i + 1;
        -:  247:    }
       59:  248:    junk = addstr(ENDSTR, pat, &j, MAXPAT);
call    0 returned 100%
       59:  249:    if ((done) || (arg[i] != delim))
branch  0 taken 10% (fallthrough)
branch  1 taken 90%
branch  2 taken 0% (fallthrough)
branch  3 taken 100%
       53:  250:	result = 0;
        -:  251:    else
        6:  252:	if ((!junk))
branch  0 taken 0% (fallthrough)
branch  1 taken 100%
    #####:  253:	    result = 0;
        -:  254:	else
        6:  255:	    result = i;
       59:  256:    return result;
        -:  257:}
        -:  258:
        -:  259:int
function getpat called 59 returned 100% blocks executed 100%
       59:  260:getpat(arg, pat)
        -:  261:char*	arg;
        -:  262:char*	pat;
        -:  263:{
        -:  264:    int	makeres;
        -:  265:
       59:  266:    makeres = makepat(arg, 0, ENDSTR, pat);
call    0 returned 100%
       59:  267:    return (makeres > 0);
        -:  268:}
        -:  269:
        -:  270:int
function makesub called 3 returned 100% blocks executed 44%
        3:  271:makesub(arg, from, delim, sub)
        -:  272:	char*	arg;
        -:  273:	int	from;
        -:  274:	character	delim;
        -:  275:	char*	sub;
        -:  276:{
        -:  277:    int  result;
        -:  278:    int	i, j;
        -:  279:    bool	junk;
        -:  280:    character	escjunk;
        -:  281:
        3:  282:    j = 0;
        3:  283:    i = from;
        6:  284:    while ((arg[i] != delim) && (arg[i] != ENDSTR)) {
branch  0 taken 0% (fallthrough)
branch  1 taken 100%
branch  2 never executed
branch  3 never executed
    #####:  285:	if ((arg[i] == (unsigned)('&')))
branch  0 never executed
branch  1 never executed
    #####:  286:	    junk = addstr(DITTO, sub, &j, MAXPAT);
call    0 never executed
        -:  287:	else {
    #####:  288:	    escjunk = esc(arg, &i);
call    0 never executed
    #####:  289:	    junk = addstr(escjunk, sub, &j, MAXPAT);
call    0 never executed
        -:  290:	}
    #####:  291:	i = i + 1;
        -:  292:    }
        3:  293:    if (arg[i] != delim)
branch  0 taken 0% (fallthrough)
branch  1 taken 100%
    #####:  294:	result = 0;
        -:  295:    else {
        3:  296:	junk = addstr(ENDSTR, &(*sub), &j, MAXPAT);
call    0 returned 100%
        3:  297:	if ((!junk))
branch  0 taken 0% (fallthrough)
branch  1 taken 100%
    #####:  298:	    result = 0;
        -:  299:	else
        3:  300:	    result = i;
        -:  301:    }
        3:  302:    return result;
        -:  303:}
        -:  304:
        -:  305:bool
function getsub called 3 returned 100% blocks executed 100%
        3:  306:getsub(arg, sub)
        -:  307:	char*	arg;
        -:  308:	char*	sub;
        -:  309:{
        -:  310:    int	makeres;
        -:  311:
        3:  312:    makeres = makesub(arg, 0, ENDSTR, sub);
call    0 returned 100%
        3:  313:    return (makeres > 0);
        -:  314:}
        -:  315:
        -:  316:void subline();
        -:  317:
        -:  318:bool
function locate called 0 returned 0% blocks executed 0%
    #####:  319:locate(c, pat, offset)
        -:  320:	character	c;
        -:  321:	char *	pat;
        -:  322:	int	offset;
        -:  323:{
        -:  324:    int	i;
        -:  325:    bool flag;
        -:  326:
    #####:  327:    flag = false;
    #####:  328:    i = offset + pat[offset];
    #####:  329:    while ((i > offset))
branch  0 never executed
branch  1 never executed
        -:  330:    {
    #####:  331:	if (c == pat[i]) {
branch  0 never executed
branch  1 never executed
    #####:  332:	    flag = true;
    #####:  333:	    i = offset;
        -:  334:	} else
    #####:  335:	    i = i - 1;
        -:  336:    }
    #####:  337:    return flag;
        -:  338:}
        -:  339:
        -:  340:bool
function omatch called 0 returned 0% blocks executed 0%
    #####:  341:omatch(lin, i, pat, j)
        -:  342:	char*	lin;
        -:  343:	int	*i;
        -:  344:	char*	pat;
        -:  345:	int	j;
        -:  346:{
        -:  347:    char	advance;
        -:  348:    bool result;
        -:  349:
    #####:  350:    advance = -1;
    #####:  351:    if ((lin[*i] == ENDSTR))
branch  0 never executed
branch  1 never executed
    #####:  352:	result = false;
        -:  353:    else
        -:  354:    {
    #####:  355:	if (!in_pat_set(pat[j]))
call    0 never executed
branch  1 never executed
branch  2 never executed
        -:  356:	{
    #####:  357:	    (void)fprintf(stdout, "in omatch: can't happen\n");
call    0 never executed
    #####:  358:	    abort();
call    0 never executed
        -:  359:	} else
        -:  360:	{
    #####:  361:	     switch (pat[j])
branch  0 never executed
branch  1 never executed
branch  2 never executed
branch  3 never executed
branch  4 never executed
branch  5 never executed
branch  6 never executed
        -:  362:	     {
        -:  363:	     case LITCHAR:
    #####:  364:		 if (lin[*i] == pat[j + 1])
branch  0 never executed
branch  1 never executed
    #####:  365:		     advance = 1;
    #####:  366:		 break ;
        -:  367:	     case BOL:
    #####:  368:		 if (*i == 0)
branch  0 never executed
branch  1 never executed
    #####:  369:		     advance = 0;
    #####:  370:		 break ;
        -:  371:	     case ANY:
    #####:  372:		 if (lin[*i] != NEWLINE)
branch  0 never executed
branch  1 never executed
    #####:  373:		     advance = 1;
    #####:  374:		 break ;
        -:  375:	     case EOL:
    #####:  376:		 if (lin[*i] == NEWLINE)
branch  0 never executed
branch  1 never executed
    #####:  377:		     advance = 0;
    #####:  378:		 break ;
        -:  379:	     case CCL:
    #####:  380:		 if (locate(lin[*i], pat, j + 1))
call    0 never executed
branch  1 never executed
branch  2 never executed
    #####:  381:		     advance = 1;
    #####:  382:		 break ;
        -:  383:	     case NCCL:
    #####:  384:		 if ((lin[*i] != NEWLINE) && (!locate(lin[*i], pat, j+1)))
branch  0 never executed
branch  1 never executed
call    2 never executed
branch  3 never executed
branch  4 never executed
    #####:  385:		     advance = 1;
    #####:  386:		 break ;
        -:  387:	     default:
    #####:  388:		 Caseerror(pat[j]);
call    0 never executed
        -:  389:	     };
        -:  390:	 }
        -:  391:    }
    #####:  392:    if ((advance >= 0))
branch  0 never executed
branch  1 never executed
        -:  393:    {
    #####:  394:	*i = *i + advance;
    #####:  395:	result = true;
        -:  396:    } else
    #####:  397:	result = false;
    #####:  398:    return result;
        -:  399:}
        -:  400:
        -:  401:int
function patsize called 0 returned 0% blocks executed 0%
    #####:  402:patsize(pat, n)
        -:  403:	char*	pat;
        -:  404:	int	n;
        -:  405:{
        -:  406:    int size;
    #####:  407:    if (!in_pat_set(pat[n])) {
call    0 never executed
branch  1 never executed
branch  2 never executed
    #####:  408:	(void)fprintf(stdout, "in patsize: can't happen\n");
call    0 never executed
    #####:  409:	abort();
call    0 never executed
        -:  410:    } else
    #####:  411:	switch (pat[n])
branch  0 never executed
branch  1 never executed
branch  2 never executed
branch  3 never executed
branch  4 never executed
        -:  412:	{
    #####:  413:	case LITCHAR: size = 2; break;
        -:  414:
        -:  415:	case BOL:  case EOL:  case ANY:
    #####:  416:	    size = 1;
    #####:  417:	    break;
        -:  418:	case CCL:  case NCCL:
    #####:  419:	    size = pat[n + 1] + 2;
    #####:  420:	    break ;
        -:  421:	case CLOSURE:
    #####:  422:	    size = CLOSIZE;
    #####:  423:	    break ;
        -:  424:	default:
    #####:  425:	    Caseerror(pat[n]);
call    0 never executed
        -:  426:	}
    #####:  427:    return size;
        -:  428:}
        -:  429:
        -:  430:int
function amatch called 0 returned 0% blocks executed 0%
    #####:  431:amatch(lin, offset, pat, j)
        -:  432:	char*	lin;
        -:  433:	int	offset;
        -:  434:	char*	pat;
        -:  435:	int	j;
        -:  436:{
        -:  437:    int	i, k;
        -:  438:    bool	result, done;
        -:  439:
    #####:  440:    done = false;
    #####:  441:    while ((!done) && (pat[j] != ENDSTR))
branch  0 never executed
branch  1 never executed
branch  2 never executed
branch  3 never executed
    #####:  442:	if ((pat[j] == CLOSURE)) {
branch  0 never executed
branch  1 never executed
    #####:  443:	    j = j + patsize(pat, j);
call    0 never executed
    #####:  444:	    i = offset;
    #####:  445:	    while ((!done) && (lin[i] != ENDSTR)) {
branch  0 never executed
branch  1 never executed
branch  2 never executed
branch  3 never executed
    #####:  446:		result = omatch(lin, &i, pat, j);
call    0 never executed
    #####:  447:		if (!result)
branch  0 never executed
branch  1 never executed
    #####:  448:		    done = true;
        -:  449:	    }
    #####:  450:	    done = false;
    #####:  451:	    while ((!done) && (i >= offset)) {
branch  0 never executed
branch  1 never executed
branch  2 never executed
branch  3 never executed
    #####:  452:		k = amatch(lin, i, pat, j + patsize(pat, j));
call    0 never executed
call    1 never executed
    #####:  453:		if ((k >= 0))
branch  0 never executed
branch  1 never executed
    #####:  454:		    done = true;
        -:  455:		else
    #####:  456:		    i = i - 1;
        -:  457:	    }
    #####:  458:	    offset = k;
    #####:  459:	    done = true;
        -:  460:	} else {
    #####:  461:	    result = omatch(lin, &offset, pat, j);
call    0 never executed
    #####:  462:	    if ((!result)) {
branch  0 never executed
branch  1 never executed
    #####:  463:		offset = -1;
    #####:  464:		done = true;
        -:  465:	    } else
    #####:  466:		j = j + patsize(pat, j);
call    0 never executed
        -:  467:	}
    #####:  468:     return offset;
        -:  469:}
        -:  470:
        -:  471:void
function putsub called 0 returned 0% blocks executed 0%
    #####:  472:putsub(lin, s1, s2, sub)
        -:  473:  char *	lin;
        -:  474:  int	s1, s2;
        -:  475:  char *	sub;
        -:  476:{
        -:  477:    int	i;
        -:  478:    int		j;
        -:  479:
    #####:  480:    i = 0;
    #####:  481:    while ((sub[i] != ENDSTR)) {
branch  0 never executed
branch  1 never executed
    #####:  482:	if ((sub[i] == DITTO))
branch  0 never executed
branch  1 never executed
    #####:  483:	    for (j = s1; j < s2; j++)
branch  0 never executed
branch  1 never executed
        -:  484:	    {
    #####:  485:		fputc(lin[j],stdout);
call    0 never executed
        -:  486:	    }
        -:  487:	else
        -:  488:	{
    #####:  489:	    fputc(sub[i],stdout);
call    0 never executed
        -:  490:	}
    #####:  491:	i = i + 1;
        -:  492:    }
    #####:  493:}
        -:  494:
        -:  495:void
function subline called 0 returned 0% blocks executed 0%
    #####:  496:subline(lin, pat, sub)
        -:  497: char	*lin;
        -:  498: char   *pat;
        -:  499: char   *sub;
        -:  500:{
        -:  501:	int	i, lastm, m;
        -:  502:
    #####:  503:	lastm = -1;
    #####:  504:	i = 0;
    #####:  505:	while ((lin[i] != ENDSTR))
branch  0 never executed
branch  1 never executed
        -:  506:	{
    #####:  507:	    m = amatch(lin, i, pat, 0);
call    0 never executed
    #####:  508:	    if ((m >= 0) && (lastm != m)) {
branch  0 never executed
branch  1 never executed
branch  2 never executed
branch  3 never executed
    #####:  509:		putsub(lin, i, m, sub);
call    0 never executed
    #####:  510:		lastm = m;
        -:  511:	    }
    #####:  512:	    if ((m == -1) || (m == i)) {
branch  0 never executed
branch  1 never executed
branch  2 never executed
branch  3 never executed
    #####:  513:		fputc(lin[i],stdout);
call    0 never executed
    #####:  514:		i = i + 1;
        -:  515:	    } else
    #####:  516:		i = m;
        -:  517:	}
    #####:  518:}
        -:  519:
        -:  520:void
function change called 0 returned 0% blocks executed 0%
    #####:  521:change(pat, sub)
        -:  522:char *pat, *sub;
        -:  523:{
        -:  524:    string  line;
        -:  525:    bool result;
        -:  526:
    #####:  527:    result = getline2(line, MAXSTR);
call    0 never executed
    #####:  528:    if (result) {
branch  0 never executed
branch  1 never executed
    #####:  529:      subline(line, pat, sub);
call    0 never executed
        -:  530:    }
    #####:  531:}
        -:  532:
        -:  533:int
function main called 59 returned 0% blocks executed 88%
       59:  534:main(int argc, char *argv[])
        -:  535:{
       59:  536:	pubargv = argv;
        -:  537:   string pat, sub;
        -:  538:   bool result;
        -:  539:
        -:  540:   string input1;
        -:  541:   string input2;
        -:  542:
        -:  543:   int i;
      590:  544:   for (i = 0; i < MYMAX-1; i++) {
branch  0 taken 90%
branch  1 taken 10% (fallthrough)
        -:  545:	 int tmp;
      531:  546:     sscanf(argv[i+1], "%d", &tmp);
      531:  547:     input1[i] = tmp;
        -:  548:   }
       59:  549:   input1[i] = 0;
        -:  550:
       59:  551:   result = getpat(input1, pat);
call    0 returned 100%
       59:  552:   if (!result)
branch  0 taken 95% (fallthrough)
branch  1 taken 5%
        -:  553:   {
       56:  554:       (void)fprintf(stdout, "change: illegal \"from\" pattern\n");
call    0 returned 100%
       56:  555:       exit(2);
call    0 returned 0%
        -:  556:   }
        -:  557:
       30:  558:   for (i = 0; i < MYMAX-1; i++) {
branch  0 taken 90%
branch  1 taken 10% (fallthrough)
        -:  559:	 int tmp;
       27:  560:     sscanf(argv[i+MYMAX+1], "%d", &tmp);
       27:  561:     input2[i] = tmp;
        -:  562:   }
        3:  563:   input2[i] = 0;
        -:  564:
        3:  565:   result = getsub(input2, sub);
call    0 returned 100%
        3:  566:   if (!result)
branch  0 taken 100% (fallthrough)
branch  1 taken 0%
        -:  567:   {
        3:  568:       (void)fprintf(stdout, "change: illegal \"to\" string\n");
call    0 returned 100%
        3:  569:       exit(3);
call    0 returned 0%
        -:  570:   }
        -:  571:
    #####:  572:   change(pat, sub);
call    0 never executed
    #####:  573:   return 0;
        -:  574:}
        -:  575:
        -:  576:void
function Caseerror called 0 returned 0% blocks executed 0%
    #####:  577:Caseerror(n)
        -:  578:	int	n;
        -:  579:{
    #####:  580:	(void)fprintf(stdout, "Missing case limb: line %d\n", n);
call    0 never executed
    #####:  581:	exit(4);
        -:  582:}
