# 1 "./triangle_wException.cil.c"
# 1 "/home/yavuz/crest-ppc3/test//"
# 1 "<command-line>"
# 1 "/usr/include/stdc-predef.h" 1 3 4
# 1 "<command-line>" 2
# 1 "./triangle_wException.cil.c"
# 19 "triangle_wException.c"
void __globinit_triangle_wException(void) ;
extern void __CrestInit(void) __attribute__((__crest_skip__)) ;
extern void __CrestHandleReturn(int id , long long val ) __attribute__((__crest_skip__)) ;
extern void __CrestReturn(int id ) __attribute__((__crest_skip__)) ;
extern void __CrestCall(int id , unsigned int fid ) __attribute__((__crest_skip__)) ;
extern void __CrestBranch(int id , int bid , unsigned char b ) __attribute__((__crest_skip__)) ;
extern void __CrestApply2(int id , int op , long long val ) __attribute__((__crest_skip__)) ;
extern void __CrestApply1(int id , int op , long long val ) __attribute__((__crest_skip__)) ;
extern void __CrestClearStack(int id ) __attribute__((__crest_skip__)) ;
extern void __CrestStore(int id , unsigned long addr ) __attribute__((__crest_skip__)) ;
extern void __CrestLoad(int id , unsigned long addr , long long val ) __attribute__((__crest_skip__)) ;
# 212 "/usr/lib/gcc/x86_64-linux-gnu/4.8/include/stddef.h"
typedef unsigned long size_t;
# 131 "/usr/include/x86_64-linux-gnu/bits/types.h"
typedef long __off_t;
# 132 "/usr/include/x86_64-linux-gnu/bits/types.h"
typedef long __off64_t;
# 44 "/usr/include/stdio.h"
struct _IO_FILE;
# 44 "/usr/include/stdio.h"
struct _IO_FILE;
# 48 "/usr/include/stdio.h"
typedef struct _IO_FILE FILE;
# 144 "/usr/include/libio.h"
struct _IO_FILE;
# 154 "/usr/include/libio.h"
typedef void _IO_lock_t;
# 160 "/usr/include/libio.h"
struct _IO_marker {
   struct _IO_marker *_next ;
   struct _IO_FILE *_sbuf ;
   int _pos ;
};
# 245 "/usr/include/libio.h"
struct _IO_FILE {
   int _flags ;
   char *_IO_read_ptr ;
   char *_IO_read_end ;
   char *_IO_read_base ;
   char *_IO_write_base ;
   char *_IO_write_ptr ;
   char *_IO_write_end ;
   char *_IO_buf_base ;
   char *_IO_buf_end ;
   char *_IO_save_base ;
   char *_IO_backup_base ;
   char *_IO_save_end ;
   struct _IO_marker *_markers ;
   struct _IO_FILE *_chain ;
   int _fileno ;
   int _flags2 ;
   __off_t _old_offset ;
   unsigned short _cur_column ;
   signed char _vtable_offset ;
   char _shortbuf[1] ;
   _IO_lock_t *_lock ;
   __off64_t _offset ;
   void *__pad1 ;
   void *__pad2 ;
   void *__pad3 ;
   void *__pad4 ;
   size_t __pad5 ;
   int _mode ;
   char _unused2[(15UL * sizeof(int ) - 4UL * sizeof(void *)) - sizeof(size_t )] ;
};
# 202 "../bin/../include/crest.h"
extern void __CrestInt(int *x ) __attribute__((__crest_skip__)) ;
# 170 "/usr/include/stdio.h"
extern struct _IO_FILE *stderr ;
# 356 "/usr/include/stdio.h"
extern int fprintf(FILE * __restrict __stream , char const * __restrict __format
                   , ...) ;
# 69 "/usr/include/assert.h"
extern __attribute__((__nothrow__, __noreturn__)) void ( __attribute__((__leaf__)) __assert_fail)(char const *__assertion ,
                                                                                                   char const *__file ,
                                                                                                   unsigned int __line ,
                                                                                                   char const *__function ) ;
# 19 "triangle_wException.c"
int main(void)
{
  int a ;
  int b ;
  int c ;
  int __retres4 ;

  {
  __globinit_triangle_wException();
  __CrestCall(1, 1);
# 21 "triangle_wException.c"
  __CrestInt(& a);
# 22 "triangle_wException.c"
  __CrestInt(& b);
# 23 "triangle_wException.c"
  __CrestInt(& c);
  __CrestLoad(4, (unsigned long )(& a), (long long )a);
  __CrestLoad(3, (unsigned long )0, (long long )0);
  __CrestApply2(2, 15, (long long )(a <= 0));
# 25 "triangle_wException.c"
  if (a <= 0) {
    __CrestBranch(5, 3, 1);
    __CrestLoad(7, (unsigned long )0, (long long )26U);
# 26 "triangle_wException.c"
    __assert_fail("0", "triangle_wException.c", 26U, "main");
    __CrestClearStack(8);
  } else {
    __CrestBranch(6, 4, 0);
    {
    __CrestLoad(11, (unsigned long )(& b), (long long )b);
    __CrestLoad(10, (unsigned long )0, (long long )0);
    __CrestApply2(9, 15, (long long )(b <= 0));
# 27 "triangle_wException.c"
    if (b <= 0) {
      __CrestBranch(12, 5, 1);
      __CrestLoad(14, (unsigned long )0, (long long )28U);
# 28 "triangle_wException.c"
      __assert_fail("0", "triangle_wException.c", 28U, "main");
      __CrestClearStack(15);
    } else {
      __CrestBranch(13, 6, 0);
      {
      __CrestLoad(18, (unsigned long )(& c), (long long )c);
      __CrestLoad(17, (unsigned long )0, (long long )0);
      __CrestApply2(16, 15, (long long )(c <= 0));
# 29 "triangle_wException.c"
      if (c <= 0) {
        __CrestBranch(19, 7, 1);
        __CrestLoad(21, (unsigned long )0, (long long )30U);
# 30 "triangle_wException.c"
        __assert_fail("0", "triangle_wException.c", 30U, "main");
        __CrestClearStack(22);
      } else {
        __CrestBranch(20, 8, 0);
        {
        __CrestLoad(27, (unsigned long )(& a), (long long )a);
        __CrestLoad(26, (unsigned long )(& b), (long long )b);
        __CrestApply2(25, 0, (long long )(a + b));
        __CrestLoad(24, (unsigned long )(& c), (long long )c);
        __CrestApply2(23, 15, (long long )(a + b <= c));
# 31 "triangle_wException.c"
        if (a + b <= c) {
          __CrestBranch(28, 9, 1);
          __CrestLoad(30, (unsigned long )0, (long long )32U);
# 32 "triangle_wException.c"
          __assert_fail("0", "triangle_wException.c", 32U, "main");
          __CrestClearStack(31);
        } else {
          __CrestBranch(29, 10, 0);
          {
          __CrestLoad(36, (unsigned long )(& a), (long long )a);
          __CrestLoad(35, (unsigned long )(& c), (long long )c);
          __CrestApply2(34, 0, (long long )(a + c));
          __CrestLoad(33, (unsigned long )(& b), (long long )b);
          __CrestApply2(32, 15, (long long )(a + c <= b));
# 33 "triangle_wException.c"
          if (a + c <= b) {
            __CrestBranch(37, 11, 1);
            __CrestLoad(39, (unsigned long )0, (long long )34U);
# 34 "triangle_wException.c"
            __assert_fail("0", "triangle_wException.c", 34U, "main");
            __CrestClearStack(40);
          } else {
            __CrestBranch(38, 12, 0);
            {
            __CrestLoad(45, (unsigned long )(& b), (long long )b);
            __CrestLoad(44, (unsigned long )(& c), (long long )c);
            __CrestApply2(43, 0, (long long )(b + c));
            __CrestLoad(42, (unsigned long )(& a), (long long )a);
            __CrestApply2(41, 15, (long long )(b + c <= a));
# 35 "triangle_wException.c"
            if (b + c <= a) {
              __CrestBranch(46, 13, 1);
              __CrestLoad(48, (unsigned long )0, (long long )36U);
# 36 "triangle_wException.c"
              __assert_fail("0", "triangle_wException.c", 36U, "main");
              __CrestClearStack(49);
            } else {
              __CrestBranch(47, 14, 0);

            }
            }
          }
          }
        }
        }
      }
      }
    }
    }
  }
  __CrestLoad(52, (unsigned long )(& a), (long long )a);
  __CrestLoad(51, (unsigned long )(& b), (long long )b);
  __CrestApply2(50, 12, (long long )(a == b));
# 39 "triangle_wException.c"
  if (a == b) {
    __CrestBranch(53, 16, 1);
    {
    __CrestLoad(57, (unsigned long )(& b), (long long )b);
    __CrestLoad(56, (unsigned long )(& c), (long long )c);
    __CrestApply2(55, 12, (long long )(b == c));
# 40 "triangle_wException.c"
    if (b == c) {
      __CrestBranch(58, 17, 1);
# 41 "triangle_wException.c"
      fprintf((FILE * __restrict )stderr, (char const * __restrict )"EQUILATERAL\n");
      __CrestClearStack(60);
      __CrestLoad(61, (unsigned long )0, (long long )0);
      __CrestStore(62, (unsigned long )(& __retres4));
# 42 "triangle_wException.c"
      __retres4 = 0;
# 42 "triangle_wException.c"
      goto return_label;
    } else {
      __CrestBranch(59, 20, 0);
# 44 "triangle_wException.c"
      fprintf((FILE * __restrict )stderr, (char const * __restrict )"ISOSCELES\n");
      __CrestClearStack(63);
      __CrestLoad(64, (unsigned long )0, (long long )0);
      __CrestStore(65, (unsigned long )(& __retres4));
# 45 "triangle_wException.c"
      __retres4 = 0;
# 45 "triangle_wException.c"
      goto return_label;
    }
    }
  } else {
    __CrestBranch(54, 23, 0);
    {
    __CrestLoad(68, (unsigned long )(& a), (long long )a);
    __CrestLoad(67, (unsigned long )(& c), (long long )c);
    __CrestApply2(66, 12, (long long )(a == c));
# 47 "triangle_wException.c"
    if (a == c) {
      __CrestBranch(69, 24, 1);
# 48 "triangle_wException.c"
      fprintf((FILE * __restrict )stderr, (char const * __restrict )"ISOSCELES\n");
      __CrestClearStack(71);
      __CrestLoad(72, (unsigned long )0, (long long )0);
      __CrestStore(73, (unsigned long )(& __retres4));
# 49 "triangle_wException.c"
      __retres4 = 0;
# 49 "triangle_wException.c"
      goto return_label;
    } else {
      __CrestBranch(70, 27, 0);
      {
      __CrestLoad(76, (unsigned long )(& b), (long long )b);
      __CrestLoad(75, (unsigned long )(& c), (long long )c);
      __CrestApply2(74, 12, (long long )(b == c));
# 51 "triangle_wException.c"
      if (b == c) {
        __CrestBranch(77, 28, 1);
# 52 "triangle_wException.c"
        fprintf((FILE * __restrict )stderr, (char const * __restrict )"ISOSCELES\n");
        __CrestClearStack(79);
        __CrestLoad(80, (unsigned long )0, (long long )0);
        __CrestStore(81, (unsigned long )(& __retres4));
# 53 "triangle_wException.c"
        __retres4 = 0;
# 53 "triangle_wException.c"
        goto return_label;
      } else {
        __CrestBranch(78, 31, 0);
# 55 "triangle_wException.c"
        fprintf((FILE * __restrict )stderr, (char const * __restrict )"SCALENE\n");
        __CrestClearStack(82);
        __CrestLoad(83, (unsigned long )0, (long long )0);
        __CrestStore(84, (unsigned long )(& __retres4));
# 56 "triangle_wException.c"
        __retres4 = 0;
# 56 "triangle_wException.c"
        goto return_label;
      }
      }
    }
    }
  }
  return_label:
  {
  __CrestLoad(85, (unsigned long )(& __retres4), (long long )__retres4);
  __CrestReturn(86);
# 19 "triangle_wException.c"
  return (__retres4);
  }
}
}
void __globinit_triangle_wException(void)
{


  {
  __CrestInit();
}
}
