<?xml version="1.0" encoding="UTF-8" standalone="no"?>
<graphml xmlns="http://graphml.graphdrawing.org/xmlns" xmlns:xsi="http://www.w3.org/2001/XMLSchema-instance">
 <key attr.name="isEntryNode" attr.type="boolean" for="node" id="entry">
  <default>false</default>
 </key>
 <key attr.name="enterLoopHead" attr.type="boolean" for="edge" id="enterLoopHead">
  <default>false</default>
 </key>
 <key attr.name="sourcecodeLanguage" attr.type="string" for="graph" id="sourcecodelang"/>
 <key attr.name="programFile" attr.type="string" for="graph" id="programfile"/>
 <key attr.name="programHash" attr.type="string" for="graph" id="programhash"/>
 <key attr.name="specification" attr.type="string" for="graph" id="specification"/>
 <key attr.name="architecture" attr.type="string" for="graph" id="architecture"/>
 <key attr.name="producer" attr.type="string" for="graph" id="producer"/>
 <key attr.name="creationTime" attr.type="string" for="graph" id="creationtime"/>
 <key attr.name="startline" attr.type="int" for="edge" id="startline"/>
 <key attr.name="endline" attr.type="int" for="edge" id="endline"/>
 <key attr.name="startoffset" attr.type="int" for="edge" id="startoffset"/>
 <key attr.name="endoffset" attr.type="int" for="edge" id="endoffset"/>
 <key attr.name="originFileName" attr.type="string" for="edge" id="originfile">
  <default>./even.c</default>
 </key>
 <key attr.name="control" attr.type="string" for="edge" id="control"/>
 <key attr.name="enterFunction" attr.type="string" for="edge" id="enterFunction"/>
 <key attr.name="returnFromFunction" attr.type="string" for="edge" id="returnFrom"/>
 <key attr.name="witness-type" attr.type="string" for="graph" id="witness-type"/>
 <key attr.name="inputWitnessHash" attr.type="string" for="graph" id="inputwitnesshash"/>
 <graph edgedefault="directed">
  <data key="witness-type">correctness_witness</data>
  <data key="sourcecodelang">C</data>
  <data key="producer">CPAchecker 1.7-svn</data>
  <data key="specification">CHECK( init(main()), LTL(G ! call(__VERIFIER_error())) )</data>
  <data key="programfile">./even.c</data>
  <data key="programhash">245c11197ee96da57af87be6f9f234f58566fdf22aca653e7f6f281456131efc</data>
  <data key="architecture">32bit</data>
  <data key="creationtime">2018-05-19T20:45:08+02:00</data>
  <node id="N9">
   <data key="entry">true</data>
  </node>
  <node id="N10"/>
  <edge source="N9" target="N10">
   <data key="startline">10</data>
   <data key="endline">10</data>
   <data key="startoffset">199</data>
   <data key="endoffset">209</data>
   <data key="enterFunction">main</data>
  </edge>
  <node id="N17"/>
  <edge source="N10" target="N17">
   <data key="enterLoopHead">true</data>
   <data key="startline">11</data>
   <data key="endline">11</data>
   <data key="startoffset">218</data>
   <data key="endoffset">235</data>
  </edge>
  <node id="N14"/>
  <edge source="N17" target="N14">
   <data key="startline">12</data>
   <data key="endline">12</data>
   <data key="startoffset">247</data>
   <data key="endoffset">269</data>
   <data key="control">condition-false</data>
  </edge>
  <node id="N13"/>
  <edge source="N17" target="N13">
   <data key="startline">12</data>
   <data key="endline">12</data>
   <data key="startoffset">247</data>
   <data key="endoffset">269</data>
   <data key="control">condition-true</data>
  </edge>
  <edge source="N13" target="N17">
   <data key="enterLoopHead">true</data>
   <data key="startline">13</data>
   <data key="endline">13</data>
   <data key="startoffset">278</data>
   <data key="endoffset">283</data>
  </edge>
  <node id="N1"/>
  <edge source="N14" target="N1">
   <data key="startline">15</data>
   <data key="endline">15</data>
   <data key="startoffset">292</data>
   <data key="endoffset">314</data>
   <data key="enterFunction">__VERIFIER_assert</data>
  </edge>
  <node id="N4"/>
  <edge source="N1" target="N4">
   <data key="startline">3</data>
   <data key="endline">3</data>
   <data key="startoffset">106</data>
   <data key="endoffset">109</data>
   <data key="control">condition-true</data>
  </edge>
  <edge source="N1" target="N4">
   <data key="startline">3</data>
   <data key="endline">3</data>
   <data key="startoffset">106</data>
   <data key="endoffset">109</data>
   <data key="control">condition-false</data>
  </edge>
  <node id="N0"/>
  <edge source="N4" target="N0">
   <data key="startline">6</data>
   <data key="endline">6</data>
   <data key="startoffset">152</data>
   <data key="endoffset">158</data>
   <data key="returnFrom">__VERIFIER_assert</data>
  </edge>
  <node id="N18"/>
  <edge source="N0" target="N18">
   <data key="startline">15</data>
   <data key="endline">15</data>
   <data key="startoffset">292</data>
   <data key="endoffset">317</data>
  </edge>
  <node id="N8"/>
  <edge source="N18" target="N8">
   <data key="startline">16</data>
   <data key="endline">16</data>
   <data key="startoffset">321</data>
   <data key="endoffset">328</data>
   <data key="returnFrom">main</data>
  </edge>
 </graph>
</graphml>
