<?xml version="1.0" encoding="UTF-8" standalone="no"?>
<graphml xmlns="http://graphml.graphdrawing.org/xmlns" xmlns:xsi="http://www.w3.org/2001/XMLSchema-instance">
 <key attr.name="invariant" attr.type="string" for="node" id="invariant"/>
 <key attr.name="invariant.scope" attr.type="string" for="node" id="invariant.scope"/>
 <key attr.name="isEntryNode" attr.type="boolean" for="node" id="entry">
  <default>false</default>
 </key>
 <key attr.name="enterLoopHead" attr.type="boolean" for="edge" id="enterLoopHead">
  <default>false</default>
 </key>
 <key attr.name="sourcecodeLanguage" attr.type="string" for="graph" id="sourcecodelang"/>
 <key attr.name="programFile" attr.type="string" for="graph" id="programfile"/>
 <key attr.name="programHash" attr.type="string" for="graph" id="programhash"/>
 <key attr.name="specification" attr.type="string" for="graph" id="specification"/>
 <key attr.name="architecture" attr.type="string" for="graph" id="architecture"/>
 <key attr.name="producer" attr.type="string" for="graph" id="producer"/>
 <key attr.name="creationTime" attr.type="string" for="graph" id="creationtime"/>
 <key attr.name="startline" attr.type="int" for="edge" id="startline"/>
 <key attr.name="endline" attr.type="int" for="edge" id="endline"/>
 <key attr.name="startoffset" attr.type="int" for="edge" id="startoffset"/>
 <key attr.name="endoffset" attr.type="int" for="edge" id="endoffset"/>
 <key attr.name="originFileName" attr.type="string" for="edge" id="originfile">
  <default>./multivar_true-unreach-call1_true-termination.c</default>
 </key>
 <key attr.name="control" attr.type="string" for="edge" id="control"/>
 <key attr.name="enterFunction" attr.type="string" for="edge" id="enterFunction"/>
 <key attr.name="returnFromFunction" attr.type="string" for="edge" id="returnFrom"/>
 <key attr.name="witness-type" attr.type="string" for="graph" id="witness-type"/>
 <key attr.name="inputWitnessHash" attr.type="string" for="graph" id="inputwitnesshash"/>
 <graph edgedefault="directed">
  <data key="witness-type">correctness_witness</data>
  <data key="sourcecodelang">C</data>
  <data key="producer">CPAchecker 1.7-svn</data>
  <data key="specification">CHECK( init(main()), LTL(G ! call(__VERIFIER_error())) )</data>
  <data key="programfile">./multivar_true-unreach-call1_true-termination.c</data>
  <data key="programhash">98a1455f610b94f01c09605e0c1a50a6f39aca93119e73b64ba0daa366bb152d</data>
  <data key="architecture">32bit</data>
  <data key="creationtime">2018-05-19T18:21:43+02:00</data>
  <node id="N9">
   <data key="entry">true</data>
  </node>
  <node id="N10"/>
  <edge source="N9" target="N10">
   <data key="startline">11</data>
   <data key="endline">11</data>
   <data key="startoffset">214</data>
   <data key="endoffset">224</data>
   <data key="enterFunction">main</data>
  </edge>
  <node id="N21">
   <data key="invariant">( y == x )</data>
   <data key="invariant.scope">main</data>
  </node>
  <edge source="N10" target="N21">
   <data key="enterLoopHead">true</data>
   <data key="startline">13</data>
   <data key="endline">13</data>
   <data key="startoffset">278</data>
   <data key="endoffset">295</data>
  </edge>
  <node id="N15"/>
  <edge source="N21" target="N15">
   <data key="startline">15</data>
   <data key="endline">15</data>
   <data key="startoffset">308</data>
   <data key="endoffset">315</data>
   <data key="control">condition-true</data>
  </edge>
  <node id="N16"/>
  <edge source="N21" target="N16">
   <data key="startline">15</data>
   <data key="endline">15</data>
   <data key="startoffset">308</data>
   <data key="endoffset">315</data>
   <data key="control">condition-false</data>
  </edge>
  <node id="N1"/>
  <edge source="N16" target="N1">
   <data key="startline">20</data>
   <data key="endline">20</data>
   <data key="startoffset">345</data>
   <data key="endoffset">368</data>
   <data key="enterFunction">__VERIFIER_assert</data>
  </edge>
  <node id="N4"/>
  <edge source="N1" target="N4">
   <data key="startline">5</data>
   <data key="endline">5</data>
   <data key="startoffset">157</data>
   <data key="endoffset">160</data>
   <data key="control">condition-true</data>
  </edge>
  <edge source="N1" target="N4">
   <data key="startline">5</data>
   <data key="endline">5</data>
   <data key="startoffset">157</data>
   <data key="endoffset">160</data>
   <data key="control">condition-false</data>
  </edge>
  <node id="N0"/>
  <edge source="N4" target="N0">
   <data key="startline">8</data>
   <data key="endline">8</data>
   <data key="startoffset">203</data>
   <data key="endoffset">209</data>
   <data key="returnFrom">__VERIFIER_assert</data>
  </edge>
  <node id="N23"/>
  <edge source="N0" target="N23">
   <data key="startline">20</data>
   <data key="endline">20</data>
   <data key="startoffset">345</data>
   <data key="endoffset">370</data>
  </edge>
  <edge source="N15" target="N21">
   <data key="enterLoopHead">true</data>
   <data key="startline">17</data>
   <data key="endline">17</data>
   <data key="startoffset">333</data>
   <data key="endoffset">335</data>
  </edge>
 </graph>
</graphml>
