extern void abort(void);
extern int __VERIFIER_nondet_int();
extern _Bool __VERIFIER_nondet_bool();
extern char __VERIFIER_nondet_char();
extern double __VERIFIER_nondet_double();
extern float __VERIFIER_nondet_float();
extern unsigned long __VERIFIER_nondet_ulong();
extern unsigned long long __VERIFIER_nondet_ulonglong();
extern unsigned int __VERIFIER_nondet_uint();
extern int __VERIFIER_nondet_int();

extern void __assert_fail (const char *__assertion, const char *__file,
      unsigned int __line, const char *__function)
     __attribute__ ((__nothrow__ , __leaf__)) __attribute__ ((__noreturn__));
extern void __assert_perror_fail (int __errnum, const char *__file,
      unsigned int __line, const char *__function)
     __attribute__ ((__nothrow__ , __leaf__)) __attribute__ ((__noreturn__));
extern void __assert (const char *__assertion, const char *__file, int __line)
     __attribute__ ((__nothrow__ , __leaf__)) __attribute__ ((__noreturn__));

void reach_error(void) {((void) sizeof ((0) ? 1 : 0), __extension__ ({ if (0) ; else __assert_fail ("0", "benchmark14_linear.c", 2, __extension__ __PRETTY_FUNCTION__); }));}
extern int __VERIFIER_nondet_int(void);
extern _Bool __VERIFIER_nondet_bool(void);
void __VERIFIER_assert(int cond) {
  if (!cond) {
    reach_error();
  }
}
int main() {
  int i = __VERIFIER_nondet_int();
  if (!(i>=0 && i<=200)) return 0;
  // START LOOPCONSTANTEXTRAPOLATION
  if (i > (0)) {
    long long int i__VERIFIER_LA_tmp0;
    i__VERIFIER_LA_tmp0 = i;
    long long int __VERIFIER_LA_iterations0;
    __VERIFIER_LA_iterations0 = ((i__VERIFIER_LA_tmp0 - 0) / 1L) + 1L;
    int i__VERIFIER_LA_old_tmp0;
    i__VERIFIER_LA_old_tmp0 = i;
    i = (__VERIFIER_LA_iterations0 * -1L) + i__VERIFIER_LA_old_tmp0;
  }
  // END LOOPCONSTANTEXTRAPOLATION
  __VERIFIER_assert(i>=0);
  return 0;
}
