<?xml version="1.0" encoding="UTF-8"?>
<graphml xmlns="http://graphml.graphdrawing.org/xmlns" xmlns:xsi="http://www.w3.org/2001/XMLSchema-instance" xsi:schemaLocation="http://graphml.graphdrawing.org/xmlns http://graphml.graphdrawing.org/xmlns/1.0/graphml.xsd">
  <key id="witness-type" attr.name="witness-type" attr.type="string" for="graph" />
  <key id="sourcecodelang" attr.name="sourcecodelang" attr.type="string" for="graph" />
  <key id="producer" attr.name="producer" attr.type="string" for="graph" />
  <key id="specification" attr.name="specification" attr.type="string" for="graph" />
  <key id="programfile" attr.name="programfile" attr.type="string" for="graph" />
  <key id="programhash" attr.name="programhash" attr.type="string" for="graph" />
  <key id="architecture" attr.name="architecture" attr.type="string" for="graph" />
  <key id="creationtime" attr.name="creationtime" attr.type="string" for="graph" />
  <key id="entry" attr.name="entry" attr.type="boolean" for="node">
    <default>false</default>
  </key>
  <key id="sink" attr.name="sink" attr.type="boolean" for="node">
    <default>false</default>
  </key>
  <key id="violation" attr.name="violation" attr.type="boolean" for="node">
    <default>false</default>
  </key>
  <key id="invariant" attr.name="invariant" attr.type="string" for="node" />
  <key id="invariant.scope" attr.name="invariant.scope" attr.type="string" for="node" />
  <key id="assumption" attr.name="assumption" attr.type="string" for="edge" />
  <key id="assumption.scope" attr.name="assumption.scope" attr.type="string" for="edge" />
  <key id="assumption.resultfunction" attr.name="assumption.resultfunction" attr.type="string" for="edge" />
  <key id="control" attr.name="control" attr.type="string" for="edge" />
  <key id="startline" attr.name="startline" attr.type="int" for="edge" />
  <key id="endline" attr.name="endline" attr.type="int" for="edge" />
  <key id="startoffset" attr.name="startoffset" attr.type="int" for="edge" />
  <key id="endoffset" attr.name="endoffset" attr.type="int" for="edge" />
  <key id="enterLoopHead" attr.name="enterLoopHead" attr.type="boolean" for="edge">
    <default>false</default>
  </key>
  <key id="enterFunction" attr.name="enterFunction" attr.type="string" for="edge" />
  <key id="returnFromFunction" attr.name="returnFromFunction" attr.type="string" for="edge" />
  <key id="threadId" attr.name="threadId" attr.type="string" for="edge" />
  <key id="createThread" attr.name="createThread" attr.type="string" for="edge" />
  <key id="startcolumn" attr.name="startcolumn" attr.type="int" for="edge" />
  <graph edgedefault="directed">
    <data key="witness-type">correctness_witness</data>
    <data key="sourcecodelang">C</data>
    <data key="producer">crux-llvm-0.5.0.99</data>
    <data key="specification">CHECK( init(main()), LTL(G ! call(reach_error())) )</data>
    <data key="programfile">../../sv-benchmarks/c/loop-zilu/benchmark10_conjunctive.i</data>
    <data key="programhash">5a9444e5380fed44b00432b26b7edd9414dfa93ba2d2f76306ea753732eae2b3</data>
    <data key="architecture">32bit</data>
    <data key="creationtime">2021-12-07T06:30:03+01:00</data>
    <node id="N0">
      <data key="entry">true</data>
    </node>
  </graph>
</graphml>
