<?xml version="1.0" encoding="UTF-8" standalone="no"?>
<graphml xmlns="http://graphml.graphdrawing.org/xmlns" xmlns:xsi="http://www.w3.org/2001/XMLSchema-instance">
  <key attr.name="originFileName" attr.type="string" for="edge" id="originfile">
    <default>../../sv-benchmarks/c/loop-zilu/benchmark14_linear.i</default>
  </key>
  <key attr.name="invariant" attr.type="string" for="node" id="invariant"/>
  <key attr.name="invariant.scope" attr.type="string" for="node" id="invariant.scope"/>
  <key attr.name="isViolationNode" attr.type="boolean" for="node" id="violation">
    <default>false</default>
  </key>
  <key attr.name="creationTime" attr.type="string" for="graph" id="creationtime"/>
  <key attr.name="isEntryNode" attr.type="boolean" for="node" id="entry">
    <default>false</default>
  </key>
  <key attr.name="isSinkNode" attr.type="boolean" for="node" id="sink">
    <default>false</default>
  </key>
  <key attr.name="enterLoopHead" attr.type="boolean" for="edge" id="enterLoopHead">
    <default>false</default>
  </key>
  <key attr.name="cyclehead" attr.type="boolean" for="node" id="cyclehead">
    <default>false</default>
  </key>
  <key attr.name="threadId" attr.type="int" for="edge" id="threadId">
    <default>0</default>
  </key>
  <key attr.name="createThread" attr.type="int" for="edge" id="createThread">
    <default>0</default>
  </key>
  <key attr.name="sourcecodeLanguage" attr.type="string" for="graph" id="sourcecodelang"/>
  <key attr.name="programFile" attr.type="string" for="graph" id="programfile"/>
  <key attr.name="programHash" attr.type="string" for="graph" id="programhash"/>
  <key attr.name="specification" attr.type="string" for="graph" id="specification"/>
  <key attr.name="architecture" attr.type="string" for="graph" id="architecture"/>
  <key attr.name="producer" attr.type="string" for="graph" id="producer"/>
  <key attr.name="startline" attr.type="int" for="edge" id="startline"/>
  <key attr.name="control" attr.type="string" for="edge" id="control"/>
  <key attr.name="assumption" attr.type="string" for="edge" id="assumption"/>
  <key attr.name="assumption.resultfunction" attr.type="string" for="edge" id="assumption.resultfunction"/>
  <key attr.name="assumption.scope" attr.type="string" for="edge" id="assumption.scope"/>
  <key attr.name="enterFunction" attr.type="string" for="edge" id="enterFunction"/>
  <key attr.name="returnFromFunction" attr.type="string" for="edge" id="returnFrom"/>
  <key attr.name="witness-type" attr.type="string" for="graph" id="witness-type"/>
  <graph edgedefault="directed">
    <data key="architecture">32bit</data>
    <data key="creationtime">2021-12-09T07:42:56</data>
    <data key="producer">Pinaka</data>
    <data key="programfile">../../sv-benchmarks/c/loop-zilu/benchmark14_linear.i</data>
    <data key="programhash">d546657c333a76554ea79d12c15ed9a706336c0cf585eae27f1d478651e7f852</data>
    <data key="sourcecodelang">C</data>
    <data key="specification">CHECK( init(main()), LTL(G ! call(__VERIFIER_error())) )</data>
    <data key="witness-type">correctness_witness</data>
    <node id="8.18">
      <data key="entry">true</data>
    </node>
  </graph>
</graphml>
