<?xml version="1.0" encoding="UTF-8" standalone="no"?>
<graphml xmlns="http://graphml.graphdrawing.org/xmlns" xmlns:xsi="http://www.w3.org/2001/XMLSchema-instance">
 <key attr.name="originFileName" attr.type="string" for="edge" id="originfile">
  <default>../../sv-benchmarks/c/loop-zilu/benchmark32_linear.i</default>
 </key>
 <key attr.name="invariant" attr.type="string" for="node" id="invariant"/>
 <key attr.name="invariant.scope" attr.type="string" for="node" id="invariant.scope"/>
 <key attr.name="namedValue" attr.type="string" for="node" id="named"/>
 <key attr.name="nodeType" attr.type="string" for="node" id="nodetype">
  <default>path</default>
 </key>
 <key attr.name="isFrontierNode" attr.type="boolean" for="node" id="frontier">
  <default>false</default>
 </key>
 <key attr.name="isViolationNode" attr.type="boolean" for="node" id="violation">
  <default>false</default>
 </key>
 <key attr.name="isEntryNode" attr.type="boolean" for="node" id="entry">
  <default>false</default>
 </key>
 <key attr.name="isSinkNode" attr.type="boolean" for="node" id="sink">
  <default>false</default>
 </key>
 <key attr.name="enterLoopHead" attr.type="boolean" for="edge" id="enterLoopHead">
  <default>false</default>
 </key>
 <key attr.name="violatedProperty" attr.type="string" for="node" id="violatedProperty"/>
 <key attr.name="threadId" attr.type="string" for="edge" id="threadId"/>
 <key attr.name="sourcecodeLanguage" attr.type="string" for="graph" id="sourcecodelang"/>
 <key attr.name="programFile" attr.type="string" for="graph" id="programfile"/>
 <key attr.name="programHash" attr.type="string" for="graph" id="programhash"/>
 <key attr.name="specification" attr.type="string" for="graph" id="specification"/>
 <key attr.name="architecture" attr.type="string" for="graph" id="architecture"/>
 <key attr.name="producer" attr.type="string" for="graph" id="producer"/>
 <key attr.name="sourcecode" attr.type="string" for="edge" id="sourcecode"/>
 <key attr.name="startline" attr.type="int" for="edge" id="startline"/>
 <key attr.name="startoffset" attr.type="int" for="edge" id="startoffset"/>
 <key attr.name="lineColSet" attr.type="string" for="edge" id="lineCols"/>
 <key attr.name="control" attr.type="string" for="edge" id="control"/>
 <key attr.name="assumption" attr.type="string" for="edge" id="assumption"/>
 <key attr.name="assumption.resultfunction" attr.type="string" for="edge" id="assumption.resultfunction"/>
 <key attr.name="assumption.scope" attr.type="string" for="edge" id="assumption.scope"/>
 <key attr.name="enterFunction" attr.type="string" for="edge" id="enterFunction"/>
 <key attr.name="returnFromFunction" attr.type="string" for="edge" id="returnFrom"/>
 <key attr.name="predecessor" attr.type="string" for="edge" id="predecessor"/>
 <key attr.name="successor" attr.type="string" for="edge" id="successor"/>
 <key attr.name="witness-type" attr.type="string" for="graph" id="witness-type"/>
 <key attr.name="creationtime" attr.type="string" for="graph" id="creationtime"/>

 <graph edgedefault="directed">
  <data key="witness-type">correctness_witness</data>
  <data key="creationtime">2021-12-09T04:51:10+01:00</data>
  <data key="sourcecodelang">C</data>
  <data key="producer">Korn 0.3</data>
  <data key="specification">CHECK( init(main()), LTL(G ! call(reach_error())) )</data>
  <data key="programfile">../../sv-benchmarks/c/loop-zilu/benchmark32_linear.i</data>
  <data key="programhash">8731c7b889cdaf4eec07de8973e6494ef97dd5e8bf9fb9fde3d7808725d4f0de</data>
  <data key="architecture">32bit</data>

  <node id="N0">
   <data key="entry">true</data>
  </node>

  <edge source="N0" target="N-22-3">
   <data key="enterLoopHead">true</data>
   <data key="startline">22</data>
  </edge>

  <node id="N-22-3">
   <data key="invariant">((x &lt;= 2) &amp;&amp; (x &gt;= 1))</data>
  </node>

  <edge source="N-22-3" target="N0">
  </edge>

 </graph>

</graphml>

