<?xml version="1.0" encoding="UTF-8" standalone="no"?>
<graphml xmlns="http://graphml.graphdrawing.org/xmlns" xmlns:xsi="http://www.w3.org/2001/XMLSchema-instance">
 <key attr.name="isEntryNode" attr.type="boolean" for="node" id="entry">
  <default>false</default>
 </key>
 <key attr.name="enterLoopHead" attr.type="boolean" for="edge" id="enterLoopHead">
  <default>false</default>
 </key>
 <key attr.name="sourcecodeLanguage" attr.type="string" for="graph" id="sourcecodelang"/>
 <key attr.name="programFile" attr.type="string" for="graph" id="programfile"/>
 <key attr.name="programHash" attr.type="string" for="graph" id="programhash"/>
 <key attr.name="specification" attr.type="string" for="graph" id="specification"/>
 <key attr.name="architecture" attr.type="string" for="graph" id="architecture"/>
 <key attr.name="producer" attr.type="string" for="graph" id="producer"/>
 <key attr.name="creationTime" attr.type="string" for="graph" id="creationtime"/>
 <key attr.name="startline" attr.type="int" for="edge" id="startline"/>
 <key attr.name="endline" attr.type="int" for="edge" id="endline"/>
 <key attr.name="startoffset" attr.type="int" for="edge" id="startoffset"/>
 <key attr.name="endoffset" attr.type="int" for="edge" id="endoffset"/>
 <key attr.name="originFileName" attr.type="string" for="edge" id="originfile">
  <default>../../sv-benchmarks/c/loop-zilu/benchmark33_linear.i</default>
 </key>
 <key attr.name="control" attr.type="string" for="edge" id="control"/>
 <key attr.name="enterFunction" attr.type="string" for="edge" id="enterFunction"/>
 <key attr.name="returnFromFunction" attr.type="string" for="edge" id="returnFrom"/>
 <key attr.name="witness-type" attr.type="string" for="graph" id="witness-type"/>
 <key attr.name="inputWitnessHash" attr.type="string" for="graph" id="inputwitnesshash"/>
 <graph edgedefault="directed">
  <data key="witness-type">correctness_witness</data>
  <data key="sourcecodelang">C</data>
  <data key="producer">CPAchecker 2.1 / svcomp22</data>
  <data key="specification">CHECK( init(main()), LTL(G ! call(reach_error())) )</data>
  <data key="programfile">../../sv-benchmarks/c/loop-zilu/benchmark33_linear.i</data>
  <data key="programhash">0401d70d4c8ea9c434a0d70dc3e862e9d9144b8f78274b8265998d58d02bfd69</data>
  <data key="architecture">32bit</data>
  <data key="creationtime">2021-12-05T16:59:59+01:00</data>
  <node id="N15">
   <data key="entry">true</data>
  </node>
  <node id="N16"/>
  <edge source="N15" target="N16">
   <data key="startline">19</data>
   <data key="endline">19</data>
   <data key="startoffset">889</data>
   <data key="endoffset">899</data>
   <data key="enterFunction">main</data>
  </edge>
  <node id="N20"/>
  <edge source="N16" target="N20">
   <data key="startline">21</data>
   <data key="endline">21</data>
   <data key="startoffset">945</data>
   <data key="endoffset">948</data>
   <data key="control">condition-true</data>
  </edge>
  <node id="N27"/>
  <edge source="N16" target="N27">
   <data key="enterLoopHead">true</data>
   <data key="startline">21</data>
   <data key="endline">21</data>
   <data key="startoffset">945</data>
   <data key="endoffset">948</data>
   <data key="control">condition-false</data>
  </edge>
  <node id="N24"/>
  <edge source="N27" target="N24">
   <data key="startline">22</data>
   <data key="endline">22</data>
   <data key="startoffset">971</data>
   <data key="endoffset">975</data>
   <data key="control">condition-false</data>
  </edge>
  <node id="N23"/>
  <edge source="N27" target="N23">
   <data key="startline">22</data>
   <data key="endline">22</data>
   <data key="startoffset">980</data>
   <data key="endoffset">983</data>
   <data key="control">condition-true</data>
  </edge>
  <edge source="N27" target="N24">
   <data key="startline">22</data>
   <data key="endline">22</data>
   <data key="startoffset">980</data>
   <data key="endoffset">983</data>
   <data key="control">condition-false</data>
  </edge>
  <edge source="N23" target="N27">
   <data key="enterLoopHead">true</data>
   <data key="startline">23</data>
   <data key="endline">23</data>
   <data key="startoffset">992</data>
   <data key="endoffset">994</data>
  </edge>
  <node id="N9"/>
  <edge source="N24" target="N9">
   <data key="startline">25</data>
   <data key="endline">25</data>
   <data key="startoffset">1003</data>
   <data key="endoffset">1026</data>
   <data key="enterFunction">__VERIFIER_assert</data>
  </edge>
  <node id="N12"/>
  <edge source="N9" target="N12">
   <data key="startline">15</data>
   <data key="endline">15</data>
   <data key="startoffset">856</data>
   <data key="endoffset">859</data>
   <data key="control">condition-true</data>
  </edge>
  <node id="N13"/>
  <edge source="N9" target="N13">
   <data key="startline">15</data>
   <data key="endline">15</data>
   <data key="startoffset">856</data>
   <data key="endoffset">859</data>
   <data key="control">condition-false</data>
  </edge>
  <node id="N29"/>
  <edge source="N13" target="N29">
   <data key="startline">25</data>
   <data key="endline">25</data>
   <data key="startoffset">1003</data>
   <data key="endoffset">1028</data>
   <data key="returnFrom">__VERIFIER_assert</data>
  </edge>
  <node id="N14"/>
  <edge source="N29" target="N14">
   <data key="startline">26</data>
   <data key="endline">26</data>
   <data key="startoffset">1032</data>
   <data key="endoffset">1039</data>
   <data key="returnFrom">main</data>
  </edge>
  <node id="N1"/>
  <edge source="N12" target="N1">
   <data key="startline">16</data>
   <data key="endline">16</data>
   <data key="startoffset">868</data>
   <data key="endoffset">880</data>
   <data key="enterFunction">reach_error</data>
  </edge>
  <edge source="N1" target="N13">
   <data key="startline">16</data>
   <data key="endline">16</data>
   <data key="startoffset">868</data>
   <data key="endoffset">881</data>
   <data key="returnFrom">reach_error</data>
  </edge>
  <edge source="N20" target="N14">
   <data key="startline">21</data>
   <data key="endline">21</data>
   <data key="startoffset">952</data>
   <data key="endoffset">959</data>
   <data key="returnFrom">main</data>
  </edge>
 </graph>
</graphml>
