<?xml version="1.0" encoding="UTF-8" standalone="no"?>
<graphml xmlns="http://graphml.graphdrawing.org/xmlns" xmlns:xsi="http://www.w3.org/2001/XMLSchema-instance">
 <key attr.name="invariant" attr.type="string" for="node" id="invariant"/>
 <key attr.name="invariant.scope" attr.type="string" for="node" id="invariant.scope"/>
 <key attr.name="isEntryNode" attr.type="boolean" for="node" id="entry">
  <default>false</default>
 </key>
 <key attr.name="enterLoopHead" attr.type="boolean" for="edge" id="enterLoopHead">
  <default>false</default>
 </key>
 <key attr.name="sourcecodeLanguage" attr.type="string" for="graph" id="sourcecodelang"/>
 <key attr.name="programFile" attr.type="string" for="graph" id="programfile"/>
 <key attr.name="programHash" attr.type="string" for="graph" id="programhash"/>
 <key attr.name="specification" attr.type="string" for="graph" id="specification"/>
 <key attr.name="architecture" attr.type="string" for="graph" id="architecture"/>
 <key attr.name="producer" attr.type="string" for="graph" id="producer"/>
 <key attr.name="creationTime" attr.type="string" for="graph" id="creationtime"/>
 <key attr.name="startline" attr.type="int" for="edge" id="startline"/>
 <key attr.name="endline" attr.type="int" for="edge" id="endline"/>
 <key attr.name="startoffset" attr.type="int" for="edge" id="startoffset"/>
 <key attr.name="endoffset" attr.type="int" for="edge" id="endoffset"/>
 <key attr.name="originFileName" attr.type="string" for="edge" id="originfile">
  <default>../../../../../sv-benchmarks/c/loop-zilu/benchmark26_linear.i</default>
 </key>
 <key attr.name="control" attr.type="string" for="edge" id="control"/>
 <key attr.name="enterFunction" attr.type="string" for="edge" id="enterFunction"/>
 <key attr.name="returnFromFunction" attr.type="string" for="edge" id="returnFrom"/>
 <key attr.name="witness-type" attr.type="string" for="graph" id="witness-type"/>
 <key attr.name="inputWitnessHash" attr.type="string" for="graph" id="inputwitnesshash"/>
 <graph edgedefault="directed">
  <data key="witness-type">correctness_witness</data>
  <data key="sourcecodelang">C</data>
  <data key="producer">CPAchecker 2.0 / svcomp21</data>
  <data key="specification">CHECK( init(main()), LTL(G ! call(reach_error())) )</data>
  <data key="programfile">../../../../../sv-benchmarks/c/loop-zilu/benchmark26_linear.i</data>
  <data key="programhash">8e9d1a7d7f6e24fd57d73c4a5500d4641bd0405ce39a4f7870d35144d3da8b5e</data>
  <data key="architecture">32bit</data>
  <data key="creationtime">2021-12-10T18:19:05+01:00</data>
  <node id="N15">
   <data key="entry">true</data>
  </node>
  <node id="N16"/>
  <edge source="N15" target="N16">
   <data key="startline">19</data>
   <data key="endline">19</data>
   <data key="startoffset">889</data>
   <data key="endoffset">899</data>
   <data key="enterFunction">main</data>
  </edge>
  <node id="N22"/>
  <edge source="N16" target="N22">
   <data key="startline">22</data>
   <data key="endline">22</data>
   <data key="startoffset">980</data>
   <data key="endoffset">982</data>
   <data key="control">condition-true</data>
  </edge>
  <node id="N27">
   <data key="invariant">( ( ( ! ( y == x ) ) || ( ! ( x &lt; y ) ) ) &amp;&amp; ( ( x &lt; y ) || ( y == x ) ) ) || ( ( x &lt; y ) &amp;&amp; ( ! ( y == x ) ) )</data>
   <data key="invariant.scope">main</data>
  </node>
  <edge source="N16" target="N27">
   <data key="enterLoopHead">true</data>
   <data key="startline">22</data>
   <data key="endline">22</data>
   <data key="startoffset">980</data>
   <data key="endoffset">982</data>
   <data key="control">condition-false</data>
  </edge>
  <node id="N25"/>
  <edge source="N27" target="N25">
   <data key="startline">23</data>
   <data key="endline">23</data>
   <data key="startoffset">1005</data>
   <data key="endoffset">1007</data>
   <data key="control">condition-true</data>
  </edge>
  <node id="N26"/>
  <edge source="N27" target="N26">
   <data key="startline">23</data>
   <data key="endline">23</data>
   <data key="startoffset">1005</data>
   <data key="endoffset">1007</data>
   <data key="control">condition-false</data>
  </edge>
  <node id="N9"/>
  <edge source="N26" target="N9">
   <data key="startline">26</data>
   <data key="endline">26</data>
   <data key="startoffset">1029</data>
   <data key="endoffset">1050</data>
   <data key="enterFunction">__VERIFIER_assert</data>
  </edge>
  <node id="N12"/>
  <edge source="N9" target="N12">
   <data key="startline">15</data>
   <data key="endline">15</data>
   <data key="startoffset">856</data>
   <data key="endoffset">859</data>
   <data key="control">condition-true</data>
  </edge>
  <node id="N13"/>
  <edge source="N9" target="N13">
   <data key="startline">15</data>
   <data key="endline">15</data>
   <data key="startoffset">856</data>
   <data key="endoffset">859</data>
   <data key="control">condition-false</data>
  </edge>
  <node id="N28"/>
  <edge source="N13" target="N28">
   <data key="startline">26</data>
   <data key="endline">26</data>
   <data key="startoffset">1029</data>
   <data key="endoffset">1052</data>
   <data key="returnFrom">__VERIFIER_assert</data>
  </edge>
  <node id="N14"/>
  <edge source="N28" target="N14">
   <data key="startline">27</data>
   <data key="endline">27</data>
   <data key="startoffset">1056</data>
   <data key="endoffset">1063</data>
   <data key="returnFrom">main</data>
  </edge>
  <node id="N1"/>
  <edge source="N12" target="N1">
   <data key="startline">16</data>
   <data key="endline">16</data>
   <data key="startoffset">868</data>
   <data key="endoffset">881</data>
   <data key="enterFunction">reach_error</data>
  </edge>
  <edge source="N1" target="N13">
   <data key="startline">16</data>
   <data key="endline">16</data>
   <data key="startoffset">868</data>
   <data key="endoffset">881</data>
   <data key="returnFrom">reach_error</data>
  </edge>
  <edge source="N25" target="N27">
   <data key="enterLoopHead">true</data>
   <data key="startline">24</data>
   <data key="endline">24</data>
   <data key="startoffset">1016</data>
   <data key="endoffset">1020</data>
  </edge>
  <edge source="N22" target="N14">
   <data key="startline">22</data>
   <data key="endline">22</data>
   <data key="startoffset">986</data>
   <data key="endoffset">993</data>
   <data key="returnFrom">main</data>
  </edge>
 </graph>
</graphml>
