<?xml version="1.0" encoding="UTF-8" standalone="no"?>
<graphml xmlns="http://graphml.graphdrawing.org/xmlns" xmlns:xsi="http://www.w3.org/2001/XMLSchema-instance">
 <key attr.name="originFileName" attr.type="string" for="edge" id="originfile">
  <default>/home/u1392220/svcomp18/CPAchecker-1.6.12-svcomp17-unix/dummyWitnessLog/program.c</default>
 </key>
 <key attr.name="invariant" attr.type="string" for="node" id="invariant"/>
 <key attr.name="invariant.scope" attr.type="string" for="node" id="invariant.scope"/>
 <key attr.name="namedValue" attr.type="string" for="node" id="named"/>
 <key attr.name="nodeType" attr.type="string" for="node" id="nodetype">
  <default>path</default>
 </key>
 <key attr.name="isFrontierNode" attr.type="boolean" for="node" id="frontier">
  <default>false</default>
 </key>
 <key attr.name="isViolationNode" attr.type="boolean" for="node" id="violation">
  <default>false</default>
 </key>
 <key attr.name="isEntryNode" attr.type="boolean" for="node" id="entry">
  <default>false</default>
 </key>
 <key attr.name="isSinkNode" attr.type="boolean" for="node" id="sink">
  <default>false</default>
 </key>
 <key attr.name="enterLoopHead" attr.type="boolean" for="edge" id="enterLoopHead">
  <default>false</default>
 </key>
 <key attr.name="violatedProperty" attr.type="string" for="node" id="violatedProperty"/>
 <key attr.name="threadId" attr.type="string" for="edge" id="threadId"/>
 <key attr.name="sourcecodeLanguage" attr.type="string" for="graph" id="sourcecodelang"/>
 <key attr.name="programFile" attr.type="string" for="graph" id="programfile"/>
 <key attr.name="programHash" attr.type="string" for="graph" id="programhash"/>
 <key attr.name="specification" attr.type="string" for="graph" id="specification"/>
 <key attr.name="architecture" attr.type="string" for="graph" id="architecture"/>
 <key attr.name="producer" attr.type="string" for="graph" id="producer"/>
 <key attr.name="creationTime" attr.type="string" for="graph" id="creationtime"/>
 <key attr.name="sourcecode" attr.type="string" for="edge" id="sourcecode"/>
 <key attr.name="startline" attr.type="int" for="edge" id="startline"/>
 <key attr.name="startoffset" attr.type="int" for="edge" id="startoffset"/>
 <key attr.name="lineColSet" attr.type="string" for="edge" id="lineCols"/>
 <key attr.name="control" attr.type="string" for="edge" id="control"/>
 <key attr.name="assumption" attr.type="string" for="edge" id="assumption"/>
 <key attr.name="assumption.resultfunction" attr.type="string" for="edge" id="assumption.resultfunction"/>
 <key attr.name="assumption.scope" attr.type="string" for="edge" id="assumption.scope"/>
 <key attr.name="enterFunction" attr.type="string" for="edge" id="enterFunction"/>
 <key attr.name="returnFromFunction" attr.type="string" for="edge" id="returnFrom"/>
 <key attr.name="predecessor" attr.type="string" for="edge" id="predecessor"/>
 <key attr.name="successor" attr.type="string" for="edge" id="successor"/>
 <key attr.name="witness-type" attr.type="string" for="graph" id="witness-type"/>
 <key attr.name="inputWitnessHash" attr.type="string" for="graph" id="inputwitnesshash"/>
 <graph edgedefault="directed">
  <data key="witness-type">correctness_witness</data>
  <data key="sourcecodelang">C</data>
  <data key="producer">VeriAbs</data>
  <data key="specification">CHECK( init(main()), LTL(G ! call(reach_error())) )</data>
  <data key="programfile">/home/benchexec/ar_abs_temp/benchmark09_conjunctive.c</data>
  <data key="programhash">64cd7ac5eb0a9d67f170f7116fe70bfc33ede6496f7f1decfe8a4115f59f37aa</data>
  <data key="architecture">32bit</data>
  <data key="creationtime">2017-11-02T13:16:17+05:30</data>
  <node id="N1">
   <data key="entry">true</data>
  </node>
 </graph>
</graphml>
