<?xml version="1.0" encoding="UTF-8"?>
<graphml xmlns="http://graphml.graphdrawing.org/xmlns" xmlns:xsi="http://www.w3.org/2001/XMLSchema-instance" xsi:schemaLocation="http://graphml.graphdrawing.org/xmlns http://graphml.graphdrawing.org/xmlns/1.0/graphml.xsd">
<key id="programfile" attr.name="programfile" for="graph"/>
<key id="programhash" attr.name="programhash" for="graph"/>
<key id="sourcecodelang" attr.name="sourcecodelang" for="graph"/>
<key id="producer" attr.name="producer" for="graph"/>
<key id="specification" attr.name="specification" for="graph"/>
<key id="creationtime" attr.name="creationtime" for="graph"/>
<key id="witness-type" attr.name="witness-type" for="graph"/>
<key id="architecture" attr.name="architecture" for="graph"/>
<key id="entry" attr.name="entry" for="node">
<default>false</default>
</key>
<key id="nodetype" attr.name="nodetype" for="node">
<default>path</default>
</key>
<key id="violation" attr.name="violation" for="node">
<default>false</default>
</key>
<key id="invariant" attr.name="invariant" for="node">
<default>true</default>
</key>
<key id="endline" attr.name="endline" for="edge"/>
<key id="enterLoopHead" attr.name="enterLoopHead" for="edge">
<default>false</default>
</key>
<key id="enterFunction" attr.name="enterFunction" for="edge"/>
<key id="startline" attr.name="startline" for="edge"/>
<key id="returnFrom" attr.name="returnFrom" for="edge"/>
<key id="assumption" attr.name="assumption" for="edge"/>
<key id="tokens" attr.name="tokens" for="edge"/>
<key id="originfile" attr.name="originfile" for="edge">
<default>/tmp/vcloud_worker_vcloud-master_on_vcloud-master/run_dir_41016880-92a2-49cc-9858-428dee029c42/sv-benchmarks/c/loop-zilu/benchmark51_polynomial.i</default>
</key>
<key id="sourcecode" attr.name="sourcecode" for="edge"/>
<graph edgedefault="directed">
<data key="programfile">/tmp/vcloud_worker_vcloud-master_on_vcloud-master/run_dir_41016880-92a2-49cc-9858-428dee029c42/sv-benchmarks/c/loop-zilu/benchmark51_polynomial.i</data>
<data key="programhash">aa85058e2265737f535eb1fe2c40b3792241244c90bfe02ec1cb86f59e478fdf</data>
<data key="sourcecodelang">C</data>
<data key="producer">Kojak</data>
<data key="specification">CHECK( init(main()), LTL(G ! call(reach_error())) )

</data>
<data key="creationtime">2021-12-10T13:31:46Z</data>
<data key="witness-type">correctness_witness</data>
<data key="architecture">32bit</data>
<node id="N0">
<data key="entry">true</data>
</node>
<node id="N1"/>
<node id="N2"/>
<node id="N3"/>
<node id="N4"/>
<node id="N5">
<data key="invariant">x &lt;= 50 &amp;&amp; 0 &lt; x + 1</data>
</node>
<node id="N6"/>
<node id="N7"/>
<node id="N8"/>
<node id="N9"/>
<node id="N10"/>
<node id="N11"/>
<node id="N12"/>
<node id="N13"/>
<node id="N14"/>
<node id="N15"/>
<node id="N16"/>
<node id="N17"/>
<node id="N18"/>
<node id="N19"/>
<node id="N20"/>
<node id="N21"/>
<node id="N22"/>
<node id="N23"/>
<node id="N24"/>
<node id="N25"/>
<node id="N26"/>
<node id="N27"/>
<node id="N28"/>
<node id="N29"/>
<node id="N30"/>
<node id="N31"/>
<node id="N32"/>
<edge id="E0" source="N0" target="N1">
<data key="endline">20</data>
<data key="startline">20</data>
<data key="sourcecode">__VERIFIER_nondet_int()</data>
</edge>
<edge id="E1" source="N1" target="N2">
<data key="endline">20</data>
<data key="startline">20</data>
<data key="sourcecode">int x = __VERIFIER_nondet_int();</data>
</edge>
<edge id="E2" source="N2" target="N3">
<data key="endline">20</data>
<data key="startline">20</data>
<data key="sourcecode">__VERIFIER_nondet_int()</data>
</edge>
<edge id="E3" source="N3" target="N4">
<data key="endline">21</data>
<data key="startline">21</data>
<data key="sourcecode">[!((x&gt;=0) &amp;&amp; (x&lt;=50))]</data>
</edge>
<edge id="E4" source="N3" target="N5">
<data key="endline">21</data>
<data key="enterLoopHead">true</data>
<data key="startline">21</data>
<data key="sourcecode">[!(!((x&gt;=0) &amp;&amp; (x&lt;=50)))]</data>
</edge>
<edge id="E5" source="N4" target="N6">
<data key="endline">21</data>
<data key="startline">21</data>
<data key="sourcecode">return 0;</data>
</edge>
<edge id="E6" source="N5" target="N7">
<data key="endline">22</data>
<data key="startline">22</data>
<data key="sourcecode">[!(__VERIFIER_nondet_bool())]</data>
</edge>
<edge id="E7" source="N5" target="N8">
<data key="endline">22</data>
<data key="startline">22</data>
<data key="sourcecode">[__VERIFIER_nondet_bool()]</data>
</edge>
<edge id="E8" source="N7" target="N9">
<data key="endline">22</data>
<data key="startline">22</data>
<data key="sourcecode">__VERIFIER_nondet_bool()</data>
</edge>
<edge id="E9" source="N8" target="N10">
<data key="endline">22</data>
<data key="startline">22</data>
<data key="sourcecode">__VERIFIER_nondet_bool()</data>
</edge>
<edge id="E10" source="N9" target="N11">
<data key="endline">23</data>
<data key="startline">23</data>
<data key="sourcecode">[!(x&gt;50)]</data>
</edge>
<edge id="E11" source="N9" target="N12">
<data key="endline">23</data>
<data key="startline">23</data>
<data key="sourcecode">[x&gt;50]</data>
</edge>
<edge id="E12" source="N10" target="N13">
<data key="endline">27</data>
<data key="startline">27</data>
<data key="sourcecode">__VERIFIER_assert((x&gt;=0) &amp;&amp; (x&lt;=50))</data>
</edge>
<edge id="E13" source="N11" target="N14"/>
<edge id="E14" source="N12" target="N15">
<data key="endline">23</data>
<data key="startline">23</data>
<data key="sourcecode">x++</data>
</edge>
<edge id="E15" source="N13" target="N16">
<data key="endline">27</data>
<data key="startline">27</data>
<data key="sourcecode">__VERIFIER_assert((x&gt;=0) &amp;&amp; (x&lt;=50))</data>
</edge>
<edge id="E16" source="N14" target="N17">
<data key="endline">24</data>
<data key="startline">24</data>
<data key="sourcecode">[x == 0]</data>
</edge>
<edge id="E17" source="N14" target="N18">
<data key="endline">24</data>
<data key="startline">24</data>
<data key="sourcecode">[!(x == 0)]</data>
</edge>
<edge id="E18" source="N15" target="N19">
<data key="endline">23</data>
<data key="startline">23</data>
<data key="sourcecode">x++</data>
</edge>
<edge id="E19" source="N16" target="N20">
<data key="endline">27</data>
<data key="startline">27</data>
<data key="sourcecode">__VERIFIER_assert((x&gt;=0) &amp;&amp; (x&lt;=50))</data>
</edge>
<edge id="E20" source="N17" target="N21">
<data key="endline">24</data>
<data key="startline">24</data>
<data key="sourcecode">x ++</data>
</edge>
<edge id="E21" source="N18" target="N22">
<data key="endline">25</data>
<data key="startline">25</data>
<data key="sourcecode">x--</data>
</edge>
<edge id="E22" source="N19" target="N23">
<data key="endline">23</data>
<data key="startline">23</data>
<data key="sourcecode">x++</data>
</edge>
<edge id="E23" source="N20" target="N24">
<data key="endline">15</data>
<data key="startline">15</data>
<data key="sourcecode">[!cond]</data>
</edge>
<edge id="E24" source="N20" target="N25">
<data key="endline">15</data>
<data key="startline">15</data>
<data key="sourcecode">[!(!cond)]</data>
</edge>
<edge id="E25" source="N21" target="N26">
<data key="endline">24</data>
<data key="startline">24</data>
<data key="sourcecode">x ++</data>
</edge>
<edge id="E26" source="N22" target="N27">
<data key="endline">25</data>
<data key="startline">25</data>
<data key="sourcecode">x--</data>
</edge>
<edge id="E27" source="N23" target="N14"/>
<edge id="E28" source="N24" target="N28">
<data key="endline">16</data>
<data key="startline">16</data>
<data key="sourcecode">reach_error()</data>
</edge>
<edge id="E29" source="N24" target="N25">
<data key="endline">16</data>
<data key="startline">16</data>
<data key="sourcecode">reach_error()</data>
</edge>
<edge id="E30" source="N25" target="N29">
<data key="endline">27</data>
<data key="startline">27</data>
<data key="sourcecode">__VERIFIER_assert((x&gt;=0) &amp;&amp; (x&lt;=50))</data>
</edge>
<edge id="E31" source="N26" target="N30">
<data key="endline">24</data>
<data key="startline">24</data>
<data key="sourcecode">x ++</data>
</edge>
<edge id="E32" source="N27" target="N31">
<data key="endline">25</data>
<data key="startline">25</data>
<data key="sourcecode">x--</data>
</edge>
<edge id="E33" source="N29" target="N6">
<data key="endline">28</data>
<data key="startline">28</data>
<data key="sourcecode">return 0;</data>
</edge>
<edge id="E34" source="N30" target="N32"/>
<edge id="E35" source="N31" target="N32"/>
<edge id="E36" source="N32" target="N5"/>
</graph>
</graphml>
