<?xml version="1.0" encoding="UTF-8"?>
<graphml xmlns="http://graphml.graphdrawing.org/xmlns" xmlns:xsi="http://www.w3.org/2001/XMLSchema-instance" xsi:schemaLocation="http://graphml.graphdrawing.org/xmlns http://graphml.graphdrawing.org/xmlns/1.0/graphml.xsd">
<key id="programfile" attr.name="programfile" for="graph"/>
<key id="programhash" attr.name="programhash" for="graph"/>
<key id="sourcecodelang" attr.name="sourcecodelang" for="graph"/>
<key id="producer" attr.name="producer" for="graph"/>
<key id="specification" attr.name="specification" for="graph"/>
<key id="creationtime" attr.name="creationtime" for="graph"/>
<key id="witness-type" attr.name="witness-type" for="graph"/>
<key id="architecture" attr.name="architecture" for="graph"/>
<key id="entry" attr.name="entry" for="node">
<default>false</default>
</key>
<key id="nodetype" attr.name="nodetype" for="node">
<default>path</default>
</key>
<key id="violation" attr.name="violation" for="node">
<default>false</default>
</key>
<key id="invariant" attr.name="invariant" for="node">
<default>true</default>
</key>
<key id="endline" attr.name="endline" for="edge"/>
<key id="enterLoopHead" attr.name="enterLoopHead" for="edge">
<default>false</default>
</key>
<key id="enterFunction" attr.name="enterFunction" for="edge"/>
<key id="startline" attr.name="startline" for="edge"/>
<key id="returnFrom" attr.name="returnFrom" for="edge"/>
<key id="assumption" attr.name="assumption" for="edge"/>
<key id="tokens" attr.name="tokens" for="edge"/>
<key id="originfile" attr.name="originfile" for="edge">
<default>/tmp/vcloud_worker_vcloud-master_on_vcloud-master/run_dir_d1a841f9-f828-4be8-90b7-19518d47f56b/sv-benchmarks/c/loop-zilu/benchmark43_conjunctive.i</default>
</key>
<key id="sourcecode" attr.name="sourcecode" for="edge"/>
<graph edgedefault="directed">
<data key="programfile">/tmp/vcloud_worker_vcloud-master_on_vcloud-master/run_dir_d1a841f9-f828-4be8-90b7-19518d47f56b/sv-benchmarks/c/loop-zilu/benchmark43_conjunctive.i</data>
<data key="programhash">56797e61f5ee281c00742e683df6d32e4d423773c50b7f1c748881e4f8402597</data>
<data key="sourcecodelang">C</data>
<data key="producer">Taipan</data>
<data key="specification">CHECK( init(main()), LTL(G ! call(reach_error())) )

</data>
<data key="creationtime">2021-12-10T04:08:07Z</data>
<data key="witness-type">correctness_witness</data>
<data key="architecture">32bit</data>
<node id="N0">
<data key="entry">true</data>
</node>
<node id="N1"/>
<node id="N2"/>
<node id="N3"/>
<node id="N4"/>
<node id="N5"/>
<node id="N6"/>
<node id="N7"/>
<node id="N8">
<data key="invariant">((((((((((((((((26 == unknown-#length-unknown[2] &amp;&amp; 2 == unknown-#length-unknown[1]) &amp;&amp; 0 &lt;= 2147483647 + y) &amp;&amp; 0 &lt;= 2147483647 + x) &amp;&amp; \valid[1] == 1) &amp;&amp; \valid[0] == 0) &amp;&amp; \valid[2] == 1) &amp;&amp; unknown-#memory_int-unknown[1][0] == 48) &amp;&amp; x &lt; 101) &amp;&amp; unknown-#memory_int-unknown[1][1] == 0) &amp;&amp; 0 &lt; unknown-#StackHeapBarrier-unknown) &amp;&amp; y &lt; 101) &amp;&amp; #NULL == 0) || ((((((((((26 == unknown-#length-unknown[2] &amp;&amp; 2 == unknown-#length-unknown[1]) &amp;&amp; y &lt; 100) &amp;&amp; \valid[1] == 1) &amp;&amp; \valid[0] == 0) &amp;&amp; x &lt; 100) &amp;&amp; \valid[2] == 1) &amp;&amp; unknown-#memory_int-unknown[1][0] == 48) &amp;&amp; unknown-#memory_int-unknown[1][1] == 0) &amp;&amp; 0 &lt; unknown-#StackHeapBarrier-unknown) &amp;&amp; #NULL == 0)) &amp;&amp; #NULL &lt;= 0) &amp;&amp; 0 &lt;= x + 2147483648) &amp;&amp; 0 &lt;= y + 2147483648) &amp;&amp; 0 &lt;= #NULL</data>
</node>
<node id="N9"/>
<node id="N10"/>
<node id="N11"/>
<node id="N12"/>
<node id="N13"/>
<node id="N14"/>
<node id="N15"/>
<node id="N16"/>
<node id="N17"/>
<node id="N18"/>
<node id="N19"/>
<edge id="E0" source="N0" target="N1">
<data key="endline">20</data>
<data key="startline">20</data>
<data key="sourcecode">__VERIFIER_nondet_int()</data>
</edge>
<edge id="E1" source="N1" target="N2">
<data key="endline">20</data>
<data key="startline">20</data>
<data key="sourcecode">int x = __VERIFIER_nondet_int();</data>
</edge>
<edge id="E2" source="N2" target="N3">
<data key="endline">20</data>
<data key="startline">20</data>
<data key="sourcecode">__VERIFIER_nondet_int()</data>
</edge>
<edge id="E3" source="N3" target="N4">
<data key="endline">21</data>
<data key="startline">21</data>
<data key="sourcecode">__VERIFIER_nondet_int()</data>
</edge>
<edge id="E4" source="N4" target="N5">
<data key="endline">21</data>
<data key="startline">21</data>
<data key="sourcecode">int y = __VERIFIER_nondet_int();</data>
</edge>
<edge id="E5" source="N5" target="N6">
<data key="endline">21</data>
<data key="startline">21</data>
<data key="sourcecode">__VERIFIER_nondet_int()</data>
</edge>
<edge id="E6" source="N6" target="N7">
<data key="endline">22</data>
<data key="startline">22</data>
<data key="sourcecode">[!(x &lt; 100 &amp;&amp; y &lt; 100)]</data>
</edge>
<edge id="E7" source="N6" target="N8">
<data key="endline">22</data>
<data key="enterLoopHead">true</data>
<data key="startline">22</data>
<data key="sourcecode">[!(!(x &lt; 100 &amp;&amp; y &lt; 100))]</data>
</edge>
<edge id="E8" source="N7" target="N9">
<data key="endline">22</data>
<data key="startline">22</data>
<data key="sourcecode">return 0;</data>
</edge>
<edge id="E9" source="N8" target="N10">
<data key="endline">23</data>
<data key="startline">23</data>
<data key="sourcecode">[!(x &lt; 100 &amp;&amp; y &lt; 100)]</data>
</edge>
<edge id="E10" source="N8" target="N11">
<data key="endline">23</data>
<data key="startline">23</data>
<data key="sourcecode">[x &lt; 100 &amp;&amp; y &lt; 100]</data>
</edge>
<edge id="E11" source="N10" target="N12">
<data key="endline">24</data>
<data key="startline">24</data>
<data key="sourcecode">x=x+1</data>
</edge>
<edge id="E12" source="N11" target="N13">
<data key="endline">27</data>
<data key="startline">27</data>
<data key="sourcecode">__VERIFIER_assert(x == 100 || y == 100)</data>
</edge>
<edge id="E13" source="N12" target="N8">
<data key="endline">25</data>
<data key="enterLoopHead">true</data>
<data key="startline">25</data>
<data key="sourcecode">y=y+1</data>
</edge>
<edge id="E14" source="N13" target="N14">
<data key="endline">27</data>
<data key="startline">27</data>
<data key="sourcecode">__VERIFIER_assert(x == 100 || y == 100)</data>
</edge>
<edge id="E15" source="N14" target="N15">
<data key="endline">27</data>
<data key="startline">27</data>
<data key="sourcecode">__VERIFIER_assert(x == 100 || y == 100)</data>
</edge>
<edge id="E16" source="N15" target="N16">
<data key="endline">15</data>
<data key="startline">15</data>
<data key="sourcecode">[!cond]</data>
</edge>
<edge id="E17" source="N15" target="N17">
<data key="endline">15</data>
<data key="startline">15</data>
<data key="sourcecode">[!(!cond)]</data>
</edge>
<edge id="E18" source="N16" target="N18">
<data key="endline">16</data>
<data key="startline">16</data>
<data key="sourcecode">reach_error()</data>
</edge>
<edge id="E19" source="N16" target="N17">
<data key="endline">16</data>
<data key="startline">16</data>
<data key="sourcecode">reach_error()</data>
</edge>
<edge id="E20" source="N17" target="N19">
<data key="endline">27</data>
<data key="startline">27</data>
<data key="sourcecode">__VERIFIER_assert(x == 100 || y == 100)</data>
</edge>
<edge id="E21" source="N19" target="N9">
<data key="endline">28</data>
<data key="startline">28</data>
<data key="sourcecode">return 0;</data>
</edge>
</graph>
</graphml>
