<?xml version="1.0" encoding="UTF-8" standalone="no"?>
<graphml xmlns="http://graphml.graphdrawing.org/xmlns" xmlns:xsi="http://www.w3.org/2001/XMLSchema-instance">
 <key attr.name="invariant" attr.type="string" for="node" id="invariant"/>
 <key attr.name="invariant.scope" attr.type="string" for="node" id="invariant.scope"/>
 <key attr.name="isEntryNode" attr.type="boolean" for="node" id="entry">
  <default>false</default>
 </key>
 <key attr.name="enterLoopHead" attr.type="boolean" for="edge" id="enterLoopHead">
  <default>false</default>
 </key>
 <key attr.name="sourcecodeLanguage" attr.type="string" for="graph" id="sourcecodelang"/>
 <key attr.name="programFile" attr.type="string" for="graph" id="programfile"/>
 <key attr.name="programHash" attr.type="string" for="graph" id="programhash"/>
 <key attr.name="specification" attr.type="string" for="graph" id="specification"/>
 <key attr.name="architecture" attr.type="string" for="graph" id="architecture"/>
 <key attr.name="producer" attr.type="string" for="graph" id="producer"/>
 <key attr.name="creationTime" attr.type="string" for="graph" id="creationtime"/>
 <key attr.name="startline" attr.type="int" for="edge" id="startline"/>
 <key attr.name="endline" attr.type="int" for="edge" id="endline"/>
 <key attr.name="startoffset" attr.type="int" for="edge" id="startoffset"/>
 <key attr.name="endoffset" attr.type="int" for="edge" id="endoffset"/>
 <key attr.name="originFileName" attr.type="string" for="edge" id="originfile">
  <default>../../../../../sv-benchmarks/c/loop-zilu/benchmark11_linear.i</default>
 </key>
 <key attr.name="control" attr.type="string" for="edge" id="control"/>
 <key attr.name="enterFunction" attr.type="string" for="edge" id="enterFunction"/>
 <key attr.name="returnFromFunction" attr.type="string" for="edge" id="returnFrom"/>
 <key attr.name="witness-type" attr.type="string" for="graph" id="witness-type"/>
 <key attr.name="inputWitnessHash" attr.type="string" for="graph" id="inputwitnesshash"/>
 <graph edgedefault="directed">
  <data key="witness-type">correctness_witness</data>
  <data key="sourcecodelang">C</data>
  <data key="producer">CPAchecker 2.0 / svcomp21</data>
  <data key="specification">CHECK( init(main()), LTL(G ! call(reach_error())) )</data>
  <data key="programfile">../../../../../sv-benchmarks/c/loop-zilu/benchmark11_linear.i</data>
  <data key="programhash">1b6c3c4a08a6fb295c1c4fab8bc900d28d2fcc27918ce3a2796a972590d147fe</data>
  <data key="architecture">32bit</data>
  <data key="creationtime">2021-12-10T19:16:49+01:00</data>
  <node id="N15">
   <data key="entry">true</data>
  </node>
  <node id="N16"/>
  <edge source="N15" target="N16">
   <data key="startline">19</data>
   <data key="endline">19</data>
   <data key="startoffset">889</data>
   <data key="endoffset">899</data>
   <data key="enterFunction">main</data>
  </edge>
  <node id="N22"/>
  <edge source="N16" target="N22">
   <data key="startline">22</data>
   <data key="endline">22</data>
   <data key="startoffset">980</data>
   <data key="endoffset">983</data>
   <data key="control">condition-true</data>
  </edge>
  <edge source="N16" target="N22">
   <data key="startline">22</data>
   <data key="endline">22</data>
   <data key="startoffset">988</data>
   <data key="endoffset">990</data>
   <data key="control">condition-true</data>
  </edge>
  <node id="N29">
   <data key="invariant">( ( 0 &lt; n ) &amp;&amp; ( ( ! ( x == 0 ) ) &amp;&amp; ( ( ! ( x == 1 ) ) &amp;&amp; ( ( ( ! ( n == x ) ) || ( ! ( x &lt; n ) ) ) &amp;&amp; ( ( n == x ) || ( x &lt; n ) ) ) ) ) ) || ( ( 0 &lt; n ) &amp;&amp; ( ( ! ( x == 0 ) ) &amp;&amp; ( ( x == 1 ) &amp;&amp; ( ( ( ! ( n == x ) ) || ( ! ( x &lt; n ) ) ) &amp;&amp; ( ( n == x ) || ( x &lt; n ) ) ) ) ) ) || ( ( 0 &lt; n ) &amp;&amp; ( ( ( ! ( x == 0 ) ) || ( ( ! ( x == 1 ) ) &amp;&amp; ( ( x &lt; n ) &amp;&amp; ( ! ( n == x ) ) ) ) ) &amp;&amp; ( ( x == 0 ) || ( ( ( ! ( n == x ) ) || ( ! ( x &lt; n ) ) ) &amp;&amp; ( ( n == x ) || ( x &lt; n ) ) ) ) ) ) || ( ( 0 &lt; n ) &amp;&amp; ( ( x == 0 ) &amp;&amp; ( ( ! ( x == 1 ) ) &amp;&amp; ( ( x &lt; n ) &amp;&amp; ( ! ( n == x ) ) ) ) ) ) || ( ( 0 &lt; n ) &amp;&amp; ( ( ( ! ( x == 0 ) ) || ( ( ! ( x == 1 ) ) &amp;&amp; ( ( x &lt; n ) &amp;&amp; ( ! ( n == x ) ) ) ) ) &amp;&amp; ( ( x == 0 ) || ( ( ! ( x == 1 ) ) &amp;&amp; ( ( ( ! ( n == x ) ) || ( ! ( x &lt; n ) ) ) &amp;&amp; ( ( n == x ) || ( x &lt; n ) ) ) ) ) ) )</data>
   <data key="invariant.scope">main</data>
  </node>
  <edge source="N16" target="N29">
   <data key="enterLoopHead">true</data>
   <data key="startline">22</data>
   <data key="endline">22</data>
   <data key="startoffset">988</data>
   <data key="endoffset">990</data>
   <data key="control">condition-false</data>
  </edge>
  <node id="N26"/>
  <edge source="N29" target="N26">
   <data key="startline">23</data>
   <data key="endline">23</data>
   <data key="startoffset">1013</data>
   <data key="endoffset">1015</data>
   <data key="control">condition-true</data>
  </edge>
  <node id="N27"/>
  <edge source="N29" target="N27">
   <data key="startline">23</data>
   <data key="endline">23</data>
   <data key="startoffset">1013</data>
   <data key="endoffset">1015</data>
   <data key="control">condition-false</data>
  </edge>
  <node id="N9"/>
  <edge source="N27" target="N9">
   <data key="startline">26</data>
   <data key="endline">26</data>
   <data key="startoffset">1035</data>
   <data key="endoffset">1056</data>
   <data key="enterFunction">__VERIFIER_assert</data>
  </edge>
  <node id="N12"/>
  <edge source="N9" target="N12">
   <data key="startline">15</data>
   <data key="endline">15</data>
   <data key="startoffset">856</data>
   <data key="endoffset">859</data>
   <data key="control">condition-true</data>
  </edge>
  <node id="N13"/>
  <edge source="N9" target="N13">
   <data key="startline">15</data>
   <data key="endline">15</data>
   <data key="startoffset">856</data>
   <data key="endoffset">859</data>
   <data key="control">condition-false</data>
  </edge>
  <node id="N31"/>
  <edge source="N13" target="N31">
   <data key="startline">26</data>
   <data key="endline">26</data>
   <data key="startoffset">1035</data>
   <data key="endoffset">1058</data>
   <data key="returnFrom">__VERIFIER_assert</data>
  </edge>
  <node id="N14"/>
  <edge source="N31" target="N14">
   <data key="startline">27</data>
   <data key="endline">27</data>
   <data key="startoffset">1062</data>
   <data key="endoffset">1069</data>
   <data key="returnFrom">main</data>
  </edge>
  <node id="N1"/>
  <edge source="N12" target="N1">
   <data key="startline">16</data>
   <data key="endline">16</data>
   <data key="startoffset">868</data>
   <data key="endoffset">881</data>
   <data key="enterFunction">reach_error</data>
  </edge>
  <edge source="N1" target="N13">
   <data key="startline">16</data>
   <data key="endline">16</data>
   <data key="startoffset">868</data>
   <data key="endoffset">881</data>
   <data key="returnFrom">reach_error</data>
  </edge>
  <edge source="N26" target="N29">
   <data key="enterLoopHead">true</data>
   <data key="startline">24</data>
   <data key="endline">24</data>
   <data key="startoffset">1024</data>
   <data key="endoffset">1026</data>
  </edge>
  <edge source="N22" target="N14">
   <data key="startline">22</data>
   <data key="endline">22</data>
   <data key="startoffset">994</data>
   <data key="endoffset">1001</data>
   <data key="returnFrom">main</data>
  </edge>
 </graph>
</graphml>
