<?xml version="1.0" encoding="UTF-8" standalone="no"?>
<graphml xmlns="http://graphml.graphdrawing.org/xmlns" xmlns:xsi="http://www.w3.org/2001/XMLSchema-instance">
<key attr.name="architecture" attr.type="string" for="graph" id="architecture"/>
<key attr.name="creationtime" attr.type="string" for="graph" id="creationtime"/>
<key attr.name="producer" attr.type="string" for="graph" id="producer"/>
<key attr.name="programfile" attr.type="string" for="graph" id="programfile"/>
<key attr.name="programhash" attr.type="string" for="graph" id="programhash"/>
<key attr.name="sourcecodelang" attr.type="string" for="graph" id="sourcecodelang"/>
<key attr.name="specification" attr.type="string" for="graph" id="specification"/>
<key attr.name="witness-type" attr.type="string" for="graph" id="witness-type"/>
<key attr.name="unroll-bound" attr.type="string" for="graph" id="unroll-bound"/>
<key attr.name="entry" attr.type="boolean" for="node" id="entry"/>
<key attr.name="violation" attr.type="boolean" for="node" id="violation"/>
<key attr.name="createThread" attr.type="string" for="edge" id="createThread"/>
<key attr.name="threadId" attr.type="string" for="edge" id="threadId"/>
<key attr.name="enterFunction" attr.type="string" for="edge" id="enterFunction"/>
<key attr.name="startline" attr.type="string" for="edge" id="startline"/>
<key attr.name="event-id" attr.type="string" for="edge" id="event-id"/>
<key attr.name="loaded-value" attr.type="string" for="edge" id="loaded-value"/>
<key attr.name="stored-value" attr.type="string" for="edge" id="stored-value"/>
<graph edgedefault="directed">
  <data key="architecture">32bit</data>
  <data key="creationtime">2021-12-06T15:15:30Z</data>
  <data key="producer">Dartagnan</data>
  <data key="programfile">../../sv-benchmarks/c/loop-zilu/benchmark02_linear.i</data>
  <data key="programhash">a49557d960d757ebc59691c53a34969948d685fd24f146c763d0c70a84ed86eb</data>
  <data key="sourcecodelang">C</data>
  <data key="specification">CHECK( init(main()), LTL(G ! call(reach_error())))</data>
  <data key="unroll-bound">1</data>
  <data key="witness-type">correctness_witness</data>
  <node id="N0">
    <data key="entry">true</data>
  </node>
  <node id="N1">
  </node>
  <node id="N2">
  </node>
  <edge source="N0" target="N1">
    <data key="createThread">0</data>
  </edge>
  <edge source="N1" target="N2">
    <data key="enterFunction">main</data>
    <data key="threadId">0</data>
  </edge>
</graph></graphml>
