<?xml version="1.0" encoding="UTF-8" standalone="no"?>
<graphml xmlns="http://graphml.graphdrawing.org/xmlns" xmlns:xsi="http://www.w3.org/2001/XMLSchema-instance">
 <key attr.name="invariant" attr.type="string" for="node" id="invariant"/>
 <key attr.name="invariant.scope" attr.type="string" for="node" id="invariant.scope"/>
 <key attr.name="isEntryNode" attr.type="boolean" for="node" id="entry">
  <default>false</default>
 </key>
 <key attr.name="enterLoopHead" attr.type="boolean" for="edge" id="enterLoopHead">
  <default>false</default>
 </key>
 <key attr.name="sourcecodeLanguage" attr.type="string" for="graph" id="sourcecodelang"/>
 <key attr.name="programFile" attr.type="string" for="graph" id="programfile"/>
 <key attr.name="programHash" attr.type="string" for="graph" id="programhash"/>
 <key attr.name="specification" attr.type="string" for="graph" id="specification"/>
 <key attr.name="architecture" attr.type="string" for="graph" id="architecture"/>
 <key attr.name="producer" attr.type="string" for="graph" id="producer"/>
 <key attr.name="creationTime" attr.type="string" for="graph" id="creationtime"/>
 <key attr.name="startline" attr.type="int" for="edge" id="startline"/>
 <key attr.name="endline" attr.type="int" for="edge" id="endline"/>
 <key attr.name="startoffset" attr.type="int" for="edge" id="startoffset"/>
 <key attr.name="endoffset" attr.type="int" for="edge" id="endoffset"/>
 <key attr.name="originFileName" attr.type="string" for="edge" id="originfile">
  <default>../../sv-benchmarks/c/loop-zilu/benchmark09_conjunctive.i</default>
 </key>
 <key attr.name="control" attr.type="string" for="edge" id="control"/>
 <key attr.name="enterFunction" attr.type="string" for="edge" id="enterFunction"/>
 <key attr.name="returnFromFunction" attr.type="string" for="edge" id="returnFrom"/>
 <key attr.name="witness-type" attr.type="string" for="graph" id="witness-type"/>
 <key attr.name="inputWitnessHash" attr.type="string" for="graph" id="inputwitnesshash"/>
 <graph edgedefault="directed">
  <data key="witness-type">correctness_witness</data>
  <data key="sourcecodelang">C</data>
  <data key="producer">CPAchecker 2.0.1-svn-eda176372c+ / svcomp21-pesco</data>
  <data key="specification">CHECK( init(main()), LTL(G ! call(reach_error())) )</data>
  <data key="programfile">../../sv-benchmarks/c/loop-zilu/benchmark09_conjunctive.i</data>
  <data key="programhash">64cd7ac5eb0a9d67f170f7116fe70bfc33ede6496f7f1decfe8a4115f59f37aa</data>
  <data key="architecture">32bit</data>
  <data key="creationtime">2021-12-09T12:14:53+01:00</data>
  <node id="N15">
   <data key="entry">true</data>
  </node>
  <node id="N16"/>
  <edge source="N15" target="N16">
   <data key="startline">19</data>
   <data key="endline">19</data>
   <data key="startoffset">894</data>
   <data key="endoffset">904</data>
   <data key="enterFunction">main</data>
  </edge>
  <node id="N22"/>
  <edge source="N16" target="N22">
   <data key="startline">22</data>
   <data key="endline">22</data>
   <data key="startoffset">985</data>
   <data key="endoffset">990</data>
   <data key="control">condition-true</data>
  </edge>
  <edge source="N16" target="N22">
   <data key="startline">22</data>
   <data key="endline">22</data>
   <data key="startoffset">995</data>
   <data key="endoffset">999</data>
   <data key="control">condition-true</data>
  </edge>
  <node id="N34">
   <data key="invariant">(y &gt;= 0) &amp;&amp; (((x == y) &amp;&amp; (y &lt;= 2147483647)) || (((x + 1) &gt;= 1) &amp;&amp; ((x + 1) &lt;= 2147483647) &amp;&amp; ((y + 1) &gt;= 1) &amp;&amp; ((y + 1) &lt;= 2147483647) &amp;&amp; (x &gt;= 0) &amp;&amp; (x &lt;= 2147483646) &amp;&amp; (y &lt;= 2147483646)))</data>
   <data key="invariant.scope">main</data>
  </node>
  <edge source="N16" target="N34">
   <data key="enterLoopHead">true</data>
   <data key="startline">22</data>
   <data key="endline">22</data>
   <data key="startoffset">995</data>
   <data key="endoffset">999</data>
   <data key="control">condition-false</data>
  </edge>
  <node id="N26">
   <data key="invariant">((x &gt;= 1) &amp;&amp; (((x &lt;= 2147483647) &amp;&amp; (y &gt;= 1) &amp;&amp; (y &lt;= 2147483647)) || (((x + 1) &gt;= 2) &amp;&amp; ((x + 1) &lt;= 2147483647) &amp;&amp; ((y + 1) &gt;= 1) &amp;&amp; ((y + 1) &lt;= 2147483647) &amp;&amp; (x &lt;= 2147483646) &amp;&amp; (y &gt;= 0) &amp;&amp; (y &lt;= 2147483646)) || ((x &lt;= 2147483646) &amp;&amp; ((y + 1) &gt;= 1) &amp;&amp; ((y + 1) &lt;= 2147483647) &amp;&amp; (y &gt;= 0) &amp;&amp; (y &lt;= 2147483646)))) || ((x &gt;= 0) &amp;&amp; ((x + 1) &gt;= 1) &amp;&amp; ((((x + 1) &lt;= 2147483647) &amp;&amp; (x &lt;= 2147483646) &amp;&amp; (y &gt;= 1) &amp;&amp; (y &lt;= 2147483647)) || (((x + 1) &lt;= 2147483646) &amp;&amp; ((y + 1) &gt;= 1) &amp;&amp; ((y + 1) &lt;= 2147483647) &amp;&amp; (x &lt;= 2147483645) &amp;&amp; (y &gt;= 0) &amp;&amp; (y &lt;= 2147483646)))) || ((x &gt;= 0) &amp;&amp; ((x + 1) &gt;= 1) &amp;&amp; ((((x + 1) &lt;= 2147483646) &amp;&amp; (y &gt;= 0) &amp;&amp; (y &lt;= 2147483646) &amp;&amp; (x &lt;= 2147483645)) || (((x + 1) &lt;= 2147483647) &amp;&amp; (x &lt;= 2147483646) &amp;&amp; (y &gt;= 1) &amp;&amp; (y &lt;= 2147483647)))) || ((x &gt;= 0) &amp;&amp; ((x + 1) &gt;= 1) &amp;&amp; ((((x + 1) &lt;= 2147483646) &amp;&amp; ((y + 1) &gt;= 0) &amp;&amp; ((y + 1) &lt;= 2147483646) &amp;&amp; (x &lt;= 2147483645) &amp;&amp; (y &gt;= -1) &amp;&amp; (y &lt;= 2147483645)) || (((x + 1) &lt;= 2147483647) &amp;&amp; ((y + 1) &gt;= 1) &amp;&amp; ((y + 1) &lt;= 2147483647) &amp;&amp; (x &lt;= 2147483646) &amp;&amp; (y &gt;= 0) &amp;&amp; (y &lt;= 2147483646))))</data>
   <data key="invariant.scope">main</data>
  </node>
  <edge source="N34" target="N26">
   <data key="startline">23</data>
   <data key="endline">23</data>
   <data key="startoffset">1022</data>
   <data key="endoffset">1025</data>
   <data key="control">condition-true</data>
  </edge>
  <node id="N35"/>
  <edge source="N34" target="N35">
   <data key="startline">23</data>
   <data key="endline">23</data>
   <data key="startoffset">1022</data>
   <data key="endoffset">1025</data>
   <data key="control">condition-false</data>
  </edge>
  <node id="N9"/>
  <edge source="N35" target="N9">
   <data key="startline">28</data>
   <data key="endline">28</data>
   <data key="startoffset">1081</data>
   <data key="endoffset">1102</data>
   <data key="enterFunction">__VERIFIER_assert</data>
  </edge>
  <node id="N12"/>
  <edge source="N9" target="N12">
   <data key="startline">15</data>
   <data key="endline">15</data>
   <data key="startoffset">861</data>
   <data key="endoffset">864</data>
   <data key="control">condition-true</data>
  </edge>
  <node id="N13"/>
  <edge source="N9" target="N13">
   <data key="startline">15</data>
   <data key="endline">15</data>
   <data key="startoffset">861</data>
   <data key="endoffset">864</data>
   <data key="control">condition-false</data>
  </edge>
  <node id="N38"/>
  <edge source="N13" target="N38">
   <data key="startline">28</data>
   <data key="endline">28</data>
   <data key="startoffset">1081</data>
   <data key="endoffset">1104</data>
   <data key="returnFrom">__VERIFIER_assert</data>
  </edge>
  <node id="N14"/>
  <edge source="N38" target="N14">
   <data key="startline">29</data>
   <data key="endline">29</data>
   <data key="startoffset">1108</data>
   <data key="endoffset">1115</data>
   <data key="returnFrom">main</data>
  </edge>
  <node id="N1"/>
  <edge source="N12" target="N1">
   <data key="startline">16</data>
   <data key="endline">16</data>
   <data key="startoffset">873</data>
   <data key="endoffset">883</data>
   <data key="enterFunction">reach_error</data>
  </edge>
  <edge source="N1" target="N13">
   <data key="startline">16</data>
   <data key="endline">16</data>
   <data key="startoffset">873</data>
   <data key="endoffset">886</data>
   <data key="returnFrom">reach_error</data>
  </edge>
  <edge source="N26" target="N35">
   <data key="startline">26</data>
   <data key="endline">26</data>
   <data key="startoffset">1056</data>
   <data key="endoffset">1058</data>
   <data key="control">condition-true</data>
  </edge>
  <edge source="N26" target="N34">
   <data key="enterLoopHead">true</data>
   <data key="startline">26</data>
   <data key="endline">26</data>
   <data key="startoffset">1063</data>
   <data key="endoffset">1065</data>
   <data key="control">condition-false</data>
  </edge>
  <edge source="N26" target="N35">
   <data key="startline">26</data>
   <data key="endline">26</data>
   <data key="startoffset">1063</data>
   <data key="endoffset">1065</data>
   <data key="control">condition-true</data>
  </edge>
  <edge source="N22" target="N14">
   <data key="startline">22</data>
   <data key="endline">22</data>
   <data key="startoffset">1003</data>
   <data key="endoffset">1010</data>
   <data key="returnFrom">main</data>
  </edge>
 </graph>
</graphml>
