<?xml version="1.0" encoding="UTF-8" standalone="no"?>
<graphml xmlns="http://graphml.graphdrawing.org/xmlns" xmlns:xsi="http://www.w3.org/2001/XMLSchema-instance">

<key id="sourcecodelang" attr.name="sourcecodelang" for="graph"/>
<key id="witness-type" attr.name="witness-type" for="graph"/>
<key id="entry" attr.name="entry" for="node">
<default>false</default>
</key>
<key id="invariant" attr.name="invariant" for="node">
<default>false</default>
</key>
<key attr.name="specification" attr.type="string" for="graph" id="specification"/>
<key attr.name="producer" attr.type="string" for="graph" id="producer"/>
<key attr.name="programFile" attr.type="string" for="graph" id="programfile"/>
<key attr.name="programHash" attr.type="string" for="graph" id="programhash"/>
<key attr.name="architecture" attr.type="string" for="graph" id="architecture"/>
<key attr.name="creationtime" attr.type="string" for="graph" id="creationtime"/>
<graph edgedefault="directed">
<data key="witness-type">correctness_witness</data>
<data key="producer">gazer-theta</data>
<data key="specification">CHECK( init(main()), LTL(G ! call(reach_error())) )</data>
<data key="sourcecodelang">C</data>
<data key="architecture">32bit</data>
<data key="programhash">0414607cdfaf86248673acc731020b311087823754eb03e229e19e48245fa120</data><data key="creationtime">2021-12-08T15:26:07</data>
<data key="programfile">benchmark34_conjunctive.i</data>
<node id="N0">
<data key="entry">true</data>
</node>
</graph></graphml>