<?xml version='1.0' encoding='UTF-8'?>
<graphml xmlns="http://graphml.graphdrawing.org/xmlns" xmlns:xsi="http://www.w3.org/2001/XMLSchema-instance">
  <graph edgedefault="directed">
    <node id="entry">
      <data key="entry">true</data>
    </node>
    <data key="witness-type">correctness_witness</data>
    <data key="sourcecodelang">C</data>
    <data key="producer">DIVINE 4</data>
    <data key="programfile">../../sv-benchmarks/c/loop-zilu/benchmark43_conjunctive.i</data>
    <data key="programhash">56797e61f5ee281c00742e683df6d32e4d423773c50b7f1c748881e4f8402597</data>
    <data key="architecture">32bit</data>
    <data key="creationtime">2021-12-07T08:05:59+01:00</data>
    <data key="specification">unreach-call</data>
  </graph>
  <key id="witness-type" for="graph" attr.type="string" attr.name="witness-type"/>
  <key id="sourcecodelang" for="graph" attr.type="string" attr.name="sourcecodelang"/>
  <key id="producer" for="graph" attr.type="string" attr.name="producer"/>
  <key id="programfile" for="graph" attr.type="string" attr.name="programfile"/>
  <key id="programhash" for="graph" attr.type="string" attr.name="programhash"/>
  <key id="architecture" for="graph" attr.type="string" attr.name="architecture"/>
  <key id="creationtime" for="graph" attr.type="string" attr.name="creationtime"/>
  <key id="specification" for="graph" attr.type="string" attr.name="specification"/>
  <key id="entry" for="node" attr.type="string" attr.name="entry"/>
  <key id="violation" for="node" attr.type="string" attr.name="violation"/>
  <key id="assumption" for="edge" attr.type="string" attr.name="assumption"/>
  <key id="assumption.resultfunction" for="edge" attr.type="string" attr.name="assumption.resultfunction"/>
  <key id="startline" for="edge" attr.type="string" attr.name="startline"/>
</graphml>
