<?xml version="1.0" encoding="UTF-8" standalone="no"?>
<graphml xmlns="http://graphml.graphdrawing.org/xmlns" xmlns:xsi="http://www.w3.org/2001/XMLSchema-instance">
 <key attr.name="invariant" attr.type="string" for="node" id="invariant"/>
 <key attr.name="invariant.scope" attr.type="string" for="node" id="invariant.scope"/>
 <key attr.name="isEntryNode" attr.type="boolean" for="node" id="entry">
  <default>false</default>
 </key>
 <key attr.name="enterLoopHead" attr.type="boolean" for="edge" id="enterLoopHead">
  <default>false</default>
 </key>
 <key attr.name="sourcecodeLanguage" attr.type="string" for="graph" id="sourcecodelang"/>
 <key attr.name="programFile" attr.type="string" for="graph" id="programfile"/>
 <key attr.name="programHash" attr.type="string" for="graph" id="programhash"/>
 <key attr.name="specification" attr.type="string" for="graph" id="specification"/>
 <key attr.name="architecture" attr.type="string" for="graph" id="architecture"/>
 <key attr.name="producer" attr.type="string" for="graph" id="producer"/>
 <key attr.name="creationTime" attr.type="string" for="graph" id="creationtime"/>
 <key attr.name="startline" attr.type="int" for="edge" id="startline"/>
 <key attr.name="endline" attr.type="int" for="edge" id="endline"/>
 <key attr.name="startoffset" attr.type="int" for="edge" id="startoffset"/>
 <key attr.name="endoffset" attr.type="int" for="edge" id="endoffset"/>
 <key attr.name="originFileName" attr.type="string" for="edge" id="originfile">
  <default>../../sv-benchmarks/c/loop-zilu/benchmark02_linear.i</default>
 </key>
 <key attr.name="control" attr.type="string" for="edge" id="control"/>
 <key attr.name="enterFunction" attr.type="string" for="edge" id="enterFunction"/>
 <key attr.name="returnFromFunction" attr.type="string" for="edge" id="returnFrom"/>
 <key attr.name="witness-type" attr.type="string" for="graph" id="witness-type"/>
 <key attr.name="inputWitnessHash" attr.type="string" for="graph" id="inputwitnesshash"/>
 <graph edgedefault="directed">
  <data key="witness-type">correctness_witness</data>
  <data key="sourcecodelang">C</data>
  <data key="producer">CPAchecker 2.0.1-svn-eda176372c+ / svcomp21-pesco</data>
  <data key="specification">CHECK( init(main()), LTL(G ! call(reach_error())) )</data>
  <data key="programfile">../../sv-benchmarks/c/loop-zilu/benchmark02_linear.i</data>
  <data key="programhash">a49557d960d757ebc59691c53a34969948d685fd24f146c763d0c70a84ed86eb</data>
  <data key="architecture">32bit</data>
  <data key="creationtime">2021-12-09T11:35:54+01:00</data>
  <node id="N15">
   <data key="entry">true</data>
  </node>
  <node id="N16"/>
  <edge source="N15" target="N16">
   <data key="startline">19</data>
   <data key="endline">19</data>
   <data key="startoffset">889</data>
   <data key="endoffset">899</data>
   <data key="enterFunction">main</data>
  </edge>
  <node id="N25"/>
  <edge source="N16" target="N25">
   <data key="startline">24</data>
   <data key="endline">24</data>
   <data key="startoffset">1024</data>
   <data key="endoffset">1026</data>
   <data key="control">condition-true</data>
  </edge>
  <node id="N31">
   <data key="invariant">(l &gt;= 1) &amp;&amp; (l &lt;= 2147483647) &amp;&amp; ((((i + -1) &gt;= 1) &amp;&amp; ((i + -1) &lt;= 2147483646) &amp;&amp; (i &gt;= 2) &amp;&amp; (i &lt;= 2147483647) &amp;&amp; (n &gt;= 2) &amp;&amp; (n &lt;= 2147483647)) || (i == l) || ((i &gt;= 1) &amp;&amp; (i &lt;= 2147483647)))</data>
   <data key="invariant.scope">main</data>
  </node>
  <edge source="N16" target="N31">
   <data key="enterLoopHead">true</data>
   <data key="startline">24</data>
   <data key="endline">24</data>
   <data key="startoffset">1024</data>
   <data key="endoffset">1026</data>
   <data key="control">condition-false</data>
  </edge>
  <node id="N28">
   <data key="invariant">(i &gt;= 1) &amp;&amp; (i &lt;= 2147483646) &amp;&amp; (l &gt;= 1) &amp;&amp; (l &lt;= 2147483647) &amp;&amp; (n &gt;= 2) &amp;&amp; (n &lt;= 2147483647)</data>
   <data key="invariant.scope">main</data>
  </node>
  <edge source="N31" target="N28">
   <data key="startline">25</data>
   <data key="endline">25</data>
   <data key="startoffset">1049</data>
   <data key="endoffset">1053</data>
   <data key="control">condition-true</data>
  </edge>
  <node id="N29">
   <data key="invariant">(i &gt;= 1) &amp;&amp; (i &lt;= 2147483647) &amp;&amp; (l &gt;= 1) &amp;&amp; (l &lt;= 2147483647)</data>
   <data key="invariant.scope">main</data>
  </node>
  <edge source="N31" target="N29">
   <data key="startline">25</data>
   <data key="endline">25</data>
   <data key="startoffset">1049</data>
   <data key="endoffset">1053</data>
   <data key="control">condition-false</data>
  </edge>
  <node id="N9"/>
  <edge source="N29" target="N9">
   <data key="startline">28</data>
   <data key="endline">28</data>
   <data key="startoffset">1073</data>
   <data key="endoffset">1094</data>
   <data key="enterFunction">__VERIFIER_assert</data>
  </edge>
  <node id="N12"/>
  <edge source="N9" target="N12">
   <data key="startline">15</data>
   <data key="endline">15</data>
   <data key="startoffset">856</data>
   <data key="endoffset">859</data>
   <data key="control">condition-true</data>
  </edge>
  <node id="N13"/>
  <edge source="N9" target="N13">
   <data key="startline">15</data>
   <data key="endline">15</data>
   <data key="startoffset">856</data>
   <data key="endoffset">859</data>
   <data key="control">condition-false</data>
  </edge>
  <node id="N33"/>
  <edge source="N13" target="N33">
   <data key="startline">28</data>
   <data key="endline">28</data>
   <data key="startoffset">1073</data>
   <data key="endoffset">1096</data>
   <data key="returnFrom">__VERIFIER_assert</data>
  </edge>
  <node id="N14"/>
  <edge source="N33" target="N14">
   <data key="startline">29</data>
   <data key="endline">29</data>
   <data key="startoffset">1100</data>
   <data key="endoffset">1107</data>
   <data key="returnFrom">main</data>
  </edge>
  <node id="N1"/>
  <edge source="N12" target="N1">
   <data key="startline">16</data>
   <data key="endline">16</data>
   <data key="startoffset">868</data>
   <data key="endoffset">878</data>
   <data key="enterFunction">reach_error</data>
  </edge>
  <edge source="N1" target="N13">
   <data key="startline">16</data>
   <data key="endline">16</data>
   <data key="startoffset">868</data>
   <data key="endoffset">881</data>
   <data key="returnFrom">reach_error</data>
  </edge>
  <edge source="N28" target="N31">
   <data key="enterLoopHead">true</data>
   <data key="startline">26</data>
   <data key="endline">26</data>
   <data key="startoffset">1062</data>
   <data key="endoffset">1064</data>
  </edge>
  <edge source="N25" target="N14">
   <data key="startline">24</data>
   <data key="endline">24</data>
   <data key="startoffset">1030</data>
   <data key="endoffset">1037</data>
   <data key="returnFrom">main</data>
  </edge>
 </graph>
</graphml>
