<?xml version="1.0" encoding="UTF-8"?>
<graphml xmlns="http://graphml.graphdrawing.org/xmlns" xmlns:xsi="http://www.w3.org/2001/XMLSchema-instance">
  <key id="witness-type" for="graph" attr.name="witness-type" attr.type="string"/>
  <key id="sourcecodelang" for="graph" attr.name="sourcecodelang" attr.type="string"/>
  <key id="producer" for="graph" attr.name="producer" attr.type="string"/>
  <key id="specification" for="graph" attr.name="specification" attr.type="string"/>
  <key id="programfile" for="graph" attr.name="programfile" attr.type="string"/>
  <key id="programhash" for="graph" attr.name="programhash" attr.type="string"/>
  <key id="architecture" for="graph" attr.name="architecture" attr.type="string"/>
  <key id="creationtime" for="graph" attr.name="creationtime" attr.type="string"/>
  <key id="entry" for="node" attr.name="entry" attr.type="boolean">
    <default>false</default>
  </key>
  <key id="sink" for="node" attr.name="sink" attr.type="boolean">
    <default>false</default>
  </key>
  <key id="violation" for="node" attr.name="violation" attr.type="boolean">
    <default>false</default>
  </key>
  <key id="invariant" for="node" attr.name="invariant" attr.type="string"/>
  <key id="invariant.scope" for="node" attr.name="invariant.scope" attr.type="string"/>
  <key id="assumption" for="edge" attr.name="assumption" attr.type="string"/>
  <key id="assumption.scope" for="edge" attr.name="assumption.scope" attr.type="string"/>
  <key id="assumption.resultfunction" for="edge" attr.name="assumption.resultfunction" attr.type="string"/>
  <key id="control" for="edge" attr.name="control" attr.type="string"/>
  <key id="startline" for="edge" attr.name="startline" attr.type="int"/>
  <key id="endline" for="edge" attr.name="endline" attr.type="int"/>
  <key id="startoffset" for="edge" attr.name="startoffset" attr.type="int"/>
  <key id="endoffset" for="edge" attr.name="endoffset" attr.type="int"/>
  <key id="enterLoopHead" for="edge" attr.name="enterLoopHead" attr.type="boolean">
    <default>false</default>
  </key>
  <key id="enterFunction" for="edge" attr.name="enterFunction" attr.type="string"/>
  <key id="returnFromFunction" for="edge" attr.name="returnFromFunction" attr.type="string"/>
  <key id="threadId" for="edge" attr.name="threadId" attr.type="string"/>
  <key id="createThread" for="edge" attr.name="createThread" attr.type="string"/>
  <key id="goblintEdge" for="edge" attr.name="goblintEdge" attr.type="string"/>
  <key id="goblintLine" for="edge" attr.name="goblintLine" attr.type="string"/>
  <graph edgedefault="directed">
    <data key="witness-type">correctness_witness</data>
    <data key="sourcecodelang">C</data>
    <data key="producer">Goblint (tags/svcomp22-0-ge852ac510)</data>
    <data key="specification">CHECK( init(main()), LTL(G ! call(reach_error())) )</data>
    <data key="programfile">../../sv-benchmarks/c/loop-zilu/benchmark35_linear.i</data>
    <data key="programhash">85c19f871ad5ac1548d47246e44639a9c86d865b8cdbaf9d1178a047385625ae</data>
    <data key="architecture">32bit</data>
    <data key="creationtime">2021-12-07T20:26:08Z</data>
    <node id="N0">
      <data key="entry">true</data>
    </node>
    <node id="N1"/>
    <edge source="N0" target="N1">
      <data key="goblintLine">19</data>
      <data key="goblintEdge">Entry main</data>
    </edge>
    <node id="N2"/>
    <edge source="N1" target="N2">
      <data key="goblintLine">20</data>
      <data key="enterFunction">__VERIFIER_nondet_int</data>
      <data key="goblintEdge">InlineEntry &apos;()&apos;</data>
    </edge>
    <node id="N3"/>
    <edge source="N2" target="N3">
      <data key="goblintEdge">Entry __VERIFIER_nondet_int</data>
    </edge>
    <node id="N4"/>
    <edge source="N3" target="N4">
      <data key="goblintEdge">Ret (Some val, __VERIFIER_nondet_int)</data>
    </edge>
    <node id="N5"/>
    <edge source="N4" target="N5">
      <data key="returnFromFunction">__VERIFIER_nondet_int</data>
      <data key="goblintEdge">InlineReturn &apos;tmp&apos;</data>
    </edge>
    <node id="N6"/>
    <edge source="N5" target="N6">
      <data key="goblintLine">20</data>
      <data key="goblintEdge">Assign &apos;x = tmp&apos; </data>
    </edge>
    <node id="N7">
      <data key="invariant">x != 0 &amp;&amp; x &lt;= -1</data>
      <data key="invariant.scope">main</data>
    </node>
    <edge source="N6" target="N7">
      <data key="goblintLine">21</data>
      <data key="control">condition-true</data>
      <data key="goblintEdge">Test (! (x &gt;= 0),true)</data>
    </edge>
    <node id="N8">
      <data key="invariant">0 &lt;= x</data>
      <data key="invariant.scope">main</data>
    </node>
    <edge source="N6" target="N8">
      <data key="goblintLine">21</data>
      <data key="enterLoopHead">true</data>
      <data key="control">condition-false</data>
      <data key="goblintEdge">Test (! (x &gt;= 0),false)</data>
    </edge>
    <node id="N9"/>
    <edge source="N7" target="N9">
      <data key="goblintLine">21</data>
      <data key="goblintEdge">Ret (Some 0, main)</data>
    </edge>
    <node id="N10">
      <data key="invariant">0 &lt;= x</data>
      <data key="invariant.scope">main</data>
    </node>
    <edge source="N8" target="N10">
      <data key="goblintLine">22</data>
      <data key="control">condition-true</data>
      <data key="goblintEdge">Test (x &gt;= 0,true)</data>
    </edge>
    <node id="N11">
      <data key="invariant">x != 0 &amp;&amp; 10 &lt;= x</data>
      <data key="invariant.scope">main</data>
    </node>
    <edge source="N10" target="N11">
      <data key="goblintLine">22</data>
      <data key="control">condition-false</data>
      <data key="goblintEdge">Test (x &lt; 10,false)</data>
    </edge>
    <node id="N12">
      <data key="invariant">0 &lt;= x &amp;&amp; x &lt;= 9</data>
      <data key="invariant.scope">main</data>
    </node>
    <edge source="N10" target="N12">
      <data key="goblintLine">22</data>
      <data key="control">condition-true</data>
      <data key="goblintEdge">Test (x &lt; 10,true)</data>
    </edge>
    <node id="N13"/>
    <edge source="N11" target="N13">
      <data key="goblintLine">25</data>
      <data key="enterFunction">__VERIFIER_assert</data>
      <data key="goblintEdge">InlineEntry &apos;(x &gt;= 10)&apos;</data>
    </edge>
    <node id="N14">
      <data key="invariant">cond == 1</data>
      <data key="invariant.scope">__VERIFIER_assert</data>
    </node>
    <edge source="N13" target="N14">
      <data key="goblintLine">14</data>
      <data key="goblintEdge">Entry __VERIFIER_assert</data>
    </edge>
    <node id="N15">
      <data key="invariant">cond == 1</data>
      <data key="invariant.scope">__VERIFIER_assert</data>
    </node>
    <edge source="N14" target="N15">
      <data key="goblintLine">15</data>
      <data key="control">condition-false</data>
      <data key="goblintEdge">Test (! cond,false)</data>
    </edge>
    <node id="N16"/>
    <edge source="N15" target="N16">
      <data key="goblintLine">18</data>
      <data key="goblintEdge">Ret (None, __VERIFIER_assert)</data>
    </edge>
    <node id="N17">
      <data key="invariant">x != 0 &amp;&amp; 10 &lt;= x</data>
      <data key="invariant.scope">main</data>
    </node>
    <edge source="N16" target="N17">
      <data key="goblintLine">14</data>
      <data key="returnFromFunction">__VERIFIER_assert</data>
      <data key="goblintEdge">InlineReturn</data>
    </edge>
    <edge source="N17" target="N9">
      <data key="goblintLine">26</data>
      <data key="goblintEdge">Ret (Some 0, main)</data>
    </edge>
    <edge source="N12" target="N8">
      <data key="goblintLine">23</data>
      <data key="enterLoopHead">true</data>
      <data key="goblintEdge">Assign &apos;x = x + 1&apos; </data>
    </edge>
  </graph>
</graphml>
