(set-info :source |printed by MathSAT|)
(declare-fun a20 () (_ BitVec 32))
(declare-fun a9 () (_ BitVec 32))
(declare-fun a25 () (_ BitVec 32))
(declare-fun a12 () (_ BitVec 32))
(declare-fun a15 () (_ BitVec 32))
(declare-fun a16 () (_ BitVec 32))
(declare-fun a2 () (_ BitVec 32))
(declare-fun a27 () (_ BitVec 32))

*:
(assert (let ((.def_106072 (= a20 (_ bv5 32)))).def_106072))

calculate_output8 N29679:
(assert false)
(assert (let ((.def_106072 (= a20 (_ bv5 32)))).def_106072))

main1 N30136:
(assert (let ((.def_152960 (= a9 (_ bv18 32)))).def_152960))
(assert (let ((.def_106072 (= a20 (_ bv5 32)))).def_106072))
(assert (let ((.def_339563 (= a25 (_ bv1 32)))).def_339563))
(assert (let ((.def_339566 (= a12 (_ bv4 32)))).def_339566))
(assert (let ((.def_339569 (= a15 (_ bv1 32)))).def_339569))
(assert (let ((.def_339572 (= a16 (_ bv1 32)))).def_339572))
(assert (let ((.def_339575 (= a2 (_ bv10 32)))).def_339575))
(assert (let ((.def_339578 (= a27 (_ bv1 32)))).def_339578))
(assert (let ((.def_339580 (= a2 (_ bv13 32)))).def_339580))
(assert (let ((.def_339582 (= a9 (_ bv17 32)))).def_339582))
(assert (let ((.def_339584 (= a2 (_ bv9 32)))).def_339584))
(assert (let ((.def_339586 (= a2 (_ bv11 32)))).def_339586))
(assert (let ((.def_339588 (= a9 (_ bv16 32)))).def_339588))
(assert (let ((.def_339590 (= a2 (_ bv12 32)))).def_339590))
(assert (let ((.def_870976 (= a20 (_ bv6 32)))).def_870976))
(assert (let ((.def_870978 (= a20 (_ bv7 32)))).def_870978))
(assert (let ((.def_870980 (= a12 (_ bv6 32)))).def_870980))
(assert (let ((.def_870982 (= a12 (_ bv3 32)))).def_870982))
(assert (let ((.def_870984 (= a12 (_ bv2 32)))).def_870984))
(assert (let ((.def_870986 (= a12 (_ bv5 32)))).def_870986))

