(set-info :source |printed by MathSAT|)
(declare-fun c_num_read () (_ BitVec 32))
(declare-fun p_num_write () (_ BitVec 32))
(declare-fun c_last_read () (_ BitVec 32))
(declare-fun p_last_write () (_ BitVec 32))
(declare-fun c_dr_pc () (_ BitVec 32))
(declare-fun q_free () (_ BitVec 32))
(declare-fun q_buf_0 () (_ BitVec 32))
(declare-fun c_dr_st () (_ BitVec 32))
(declare-fun q_req_up () (_ BitVec 32))
(declare-fun q_write_ev () (_ BitVec 32))
(declare-fun q_read_ev () (_ BitVec 32))
(declare-fun p_dw_pc () (_ BitVec 32))
(declare-fun p_dw_st () (_ BitVec 32))
(declare-fun m_pc () (_ BitVec 32))
(declare-fun t1_pc () (_ BitVec 32))
(declare-fun t2_pc () (_ BitVec 32))
(declare-fun t3_pc () (_ BitVec 32))
(declare-fun t4_pc () (_ BitVec 32))
(declare-fun t5_pc () (_ BitVec 32))
(declare-fun t6_pc () (_ BitVec 32))
(declare-fun m_st () (_ BitVec 32))
(declare-fun E_4 () (_ BitVec 32))
(declare-fun E_3 () (_ BitVec 32))
(declare-fun E_2 () (_ BitVec 32))
(declare-fun E_5 () (_ BitVec 32))
(declare-fun t6_st () (_ BitVec 32))
(declare-fun t3_st () (_ BitVec 32))
(declare-fun E_6 () (_ BitVec 32))
(declare-fun E_M () (_ BitVec 32))
(declare-fun t1_st () (_ BitVec 32))
(declare-fun t2_st () (_ BitVec 32))
(declare-fun t4_st () (_ BitVec 32))
(declare-fun t5_st () (_ BitVec 32))
(declare-fun E_1 () (_ BitVec 32))
(declare-fun local () (_ BitVec 32))
(declare-fun token () (_ BitVec 32))
(declare-fun T6_E () (_ BitVec 32))
(declare-fun T5_E () (_ BitVec 32))
(declare-fun T4_E () (_ BitVec 32))
(declare-fun T3_E () (_ BitVec 32))
(declare-fun T2_E () (_ BitVec 32))
(declare-fun T1_E () (_ BitVec 32))
(declare-fun M_E () (_ BitVec 32))

*:
(assert (let ((.def_574 (= c_num_read p_num_write))).def_574))
(assert (let ((.def_583 (= c_last_read p_last_write))).def_583))

error1 N4:
(assert false)
(assert (let ((.def_574 (= c_num_read p_num_write))).def_574))
(assert (let ((.def_583 (= c_last_read p_last_write))).def_583))

do_write_p N78:
(assert (let ((.def_770 (= c_dr_pc (_ bv0 32)))).def_770))
(assert (let ((.def_574 (= c_num_read p_num_write))).def_574))
(assert (let ((.def_583 (= c_last_read p_last_write))).def_583))
(assert (let ((.def_838 (= q_free (_ bv1 32)))).def_838))
(assert false)
(assert (let ((.def_1022 (= p_last_write q_buf_0))).def_1022))
(assert (let ((.def_1162 (= c_dr_pc (_ bv1 32)))).def_1162))
(assert (let ((.def_1164 (= q_free (_ bv0 32)))).def_1164))
(assert (let ((.def_1168 (bvadd (_ bv1 32) c_num_read)))(let ((.def_1169 (= p_num_write .def_1168))).def_1169)))
(assert (let ((.def_1850 (= c_dr_st (_ bv0 32)))).def_1850))
(assert (let ((.def_4250 (= q_req_up (_ bv1 32)))).def_4250))
(assert (let ((.def_5883 (= q_write_ev (_ bv1 32)))).def_5883))
(assert (let ((.def_5885 (= q_write_ev (_ bv0 32)))).def_5885))
(assert (let ((.def_8220 (= q_read_ev (_ bv1 32)))).def_8220))
(assert (let ((.def_8222 (= q_read_ev (_ bv0 32)))).def_8222))

do_read_c N112:
(assert (let ((.def_838 (= q_free (_ bv1 32)))).def_838))
(assert (let ((.def_574 (= c_num_read p_num_write))).def_574))
(assert (let ((.def_583 (= c_last_read p_last_write))).def_583))
(assert (let ((.def_1022 (= p_last_write q_buf_0))).def_1022))
(assert (let ((.def_1168 (bvadd (_ bv1 32) c_num_read)))(let ((.def_1169 (= p_num_write .def_1168))).def_1169)))
(assert false)
(assert (let ((.def_1164 (= q_free (_ bv0 32)))).def_1164))
(assert (let ((.def_5883 (= q_write_ev (_ bv1 32)))).def_5883))
(assert (let ((.def_5885 (= q_write_ev (_ bv0 32)))).def_5885))
(assert (let ((.def_1166 (= p_dw_pc (_ bv1 32)))).def_1166))
(assert (let ((.def_4250 (= q_req_up (_ bv1 32)))).def_4250))
(assert (let ((.def_2324 (= p_dw_st (_ bv0 32)))).def_2324))
(assert (let ((.def_8220 (= q_read_ev (_ bv1 32)))).def_8220))
(assert (let ((.def_8222 (= q_read_ev (_ bv0 32)))).def_8222))

eval1 N228:
(assert (let ((.def_770 (= c_dr_pc (_ bv0 32)))).def_770))
(assert (let ((.def_574 (= c_num_read p_num_write))).def_574))
(assert (let ((.def_583 (= c_last_read p_last_write))).def_583))
(assert (let ((.def_838 (= q_free (_ bv1 32)))).def_838))
(assert (let ((.def_980 (= p_dw_pc (_ bv0 32)))).def_980))
(assert (let ((.def_1162 (= c_dr_pc (_ bv1 32)))).def_1162))
(assert (let ((.def_1164 (= q_free (_ bv0 32)))).def_1164))
(assert (let ((.def_1166 (= p_dw_pc (_ bv1 32)))).def_1166))
(assert (let ((.def_2324 (= p_dw_st (_ bv0 32)))).def_2324))
(assert (let ((.def_1022 (= p_last_write q_buf_0))).def_1022))
(assert (let ((.def_1168 (bvadd (_ bv1 32) c_num_read)))(let ((.def_1169 (= p_num_write .def_1168))).def_1169)))
(assert (let ((.def_1850 (= c_dr_st (_ bv0 32)))).def_1850))
(assert (let ((.def_4250 (= q_req_up (_ bv1 32)))).def_4250))
(assert (let ((.def_5883 (= q_write_ev (_ bv1 32)))).def_5883))
(assert (let ((.def_5885 (= q_write_ev (_ bv0 32)))).def_5885))
(assert (let ((.def_8220 (= q_read_ev (_ bv1 32)))).def_8220))
(assert (let ((.def_8222 (= q_read_ev (_ bv0 32)))).def_8222))

start_simulation1 N283:
(assert (let ((.def_770 (= c_dr_pc (_ bv0 32)))).def_770))
(assert (let ((.def_574 (= c_num_read p_num_write))).def_574))
(assert (let ((.def_583 (= c_last_read p_last_write))).def_583))
(assert (let ((.def_838 (= q_free (_ bv1 32)))).def_838))
(assert (let ((.def_980 (= p_dw_pc (_ bv0 32)))).def_980))
(assert (let ((.def_1162 (= c_dr_pc (_ bv1 32)))).def_1162))
(assert (let ((.def_1164 (= q_free (_ bv0 32)))).def_1164))
(assert (let ((.def_1166 (= p_dw_pc (_ bv1 32)))).def_1166))
(assert (let ((.def_1850 (= c_dr_st (_ bv0 32)))).def_1850))
(assert (let ((.def_2324 (= p_dw_st (_ bv0 32)))).def_2324))
(assert (let ((.def_1022 (= p_last_write q_buf_0))).def_1022))
(assert (let ((.def_5883 (= q_write_ev (_ bv1 32)))).def_5883))
(assert (let ((.def_5885 (= q_write_ev (_ bv0 32)))).def_5885))
(assert (let ((.def_8220 (= q_read_ev (_ bv1 32)))).def_8220))
(assert (let ((.def_8222 (= q_read_ev (_ bv0 32)))).def_8222))
(assert (let ((.def_1168 (bvadd (_ bv1 32) c_num_read)))(let ((.def_1169 (= p_num_write .def_1168))).def_1169)))

error2 N328:
(assert false)
(assert (let ((.def_574 (= c_num_read p_num_write))).def_574))
(assert (let ((.def_583 (= c_last_read p_last_write))).def_583))

eval2 N732:
(assert (let ((.def_10946 (= m_pc (_ bv0 32)))).def_10946))
(assert (let ((.def_574 (= c_num_read p_num_write))).def_574))
(assert (let ((.def_583 (= c_last_read p_last_write))).def_583))
(assert (let ((.def_15043 (= t1_pc (_ bv0 32)))).def_15043))
(assert (let ((.def_15046 (= t2_pc (_ bv0 32)))).def_15046))
(assert (let ((.def_15049 (= t3_pc (_ bv0 32)))).def_15049))
(assert (let ((.def_15052 (= t4_pc (_ bv0 32)))).def_15052))
(assert (let ((.def_15055 (= t5_pc (_ bv0 32)))).def_15055))
(assert (let ((.def_15058 (= t6_pc (_ bv0 32)))).def_15058))
(assert (let ((.def_15060 (= m_pc (_ bv1 32)))).def_15060))
(assert (let ((.def_15062 (= t1_pc (_ bv1 32)))).def_15062))
(assert (let ((.def_15064 (= t2_pc (_ bv1 32)))).def_15064))
(assert (let ((.def_15066 (= t3_pc (_ bv1 32)))).def_15066))
(assert (let ((.def_15068 (= t4_pc (_ bv1 32)))).def_15068))
(assert (let ((.def_15070 (= t5_pc (_ bv1 32)))).def_15070))
(assert (let ((.def_15072 (= t6_pc (_ bv1 32)))).def_15072))
(assert (let ((.def_15075 (= m_st (_ bv0 32)))).def_15075))
(assert (let ((.def_22136 (= E_4 (_ bv1 32)))).def_22136))
(assert (let ((.def_22139 (= E_3 (_ bv1 32)))).def_22139))
(assert (let ((.def_22142 (= E_2 (_ bv1 32)))).def_22142))
(assert (let ((.def_22145 (= E_5 (_ bv1 32)))).def_22145))
(assert (let ((.def_22148 (= t6_st (_ bv0 32)))).def_22148))
(assert (let ((.def_22151 (= t3_st (_ bv0 32)))).def_22151))
(assert (let ((.def_22154 (= E_6 (_ bv1 32)))).def_22154))
(assert (let ((.def_22157 (= E_M (_ bv1 32)))).def_22157))
(assert (let ((.def_22160 (= t1_st (_ bv0 32)))).def_22160))
(assert (let ((.def_22163 (= t2_st (_ bv0 32)))).def_22163))
(assert (let ((.def_22166 (= t4_st (_ bv0 32)))).def_22166))
(assert (let ((.def_22169 (= t5_st (_ bv0 32)))).def_22169))
(assert (let ((.def_22172 (= E_1 (_ bv1 32)))).def_22172))
(assert (let ((.def_22175 (bvadd (_ bv6 32) local)))(let ((.def_22177 (= .def_22175 token))).def_22177)))
(assert (let ((.def_42973 (= local (_ bv0 32)))).def_42973))
(assert (let ((.def_42975 (= token (_ bv0 32)))).def_42975))
(assert (let ((.def_42977 (= E_3 (_ bv2 32)))).def_42977))
(assert (let ((.def_42979 (= E_2 (_ bv2 32)))).def_42979))
(assert (let ((.def_42981 (= t4_st (_ bv2 32)))).def_42981))
(assert (let ((.def_42983 (= t5_st (_ bv2 32)))).def_42983))
(assert (let ((.def_42985 (= m_st (_ bv2 32)))).def_42985))
(assert (let ((.def_42987 (bvadd (_ bv3 32) local)))(let ((.def_42988 (= token .def_42987))).def_42988)))
(assert (let ((.def_42990 (bvadd (_ bv4 32) local)))(let ((.def_42991 (= token .def_42990))).def_42991)))
(assert (let ((.def_42993 (bvadd (_ bv2 32) local)))(let ((.def_42994 (= token .def_42993))).def_42994)))
(assert (let ((.def_42996 (bvadd (_ bv1 32) local)))(let ((.def_42997 (= token .def_42996))).def_42997)))
(assert (let ((.def_42999 (= local token))).def_42999))
(assert (let ((.def_43001 (bvadd (_ bv5 32) local)))(let ((.def_43002 (= token .def_43001))).def_43002)))
(assert (let ((.def_62556 (= E_M (_ bv0 32)))).def_62556))
(assert (let ((.def_62558 (= E_1 (_ bv0 32)))).def_62558))
(assert (let ((.def_83133 (= E_4 (_ bv0 32)))).def_83133))
(assert (let ((.def_83135 (= E_5 (_ bv0 32)))).def_83135))
(assert (let ((.def_83137 (= E_3 (_ bv0 32)))).def_83137))
(assert (let ((.def_83140 (= T6_E (_ bv0 32)))).def_83140))
(assert (let ((.def_83143 (= T5_E (_ bv0 32)))).def_83143))
(assert (let ((.def_83146 (= T4_E (_ bv0 32)))).def_83146))
(assert (let ((.def_83149 (= T3_E (_ bv0 32)))).def_83149))
(assert (let ((.def_83152 (= T2_E (_ bv0 32)))).def_83152))
(assert (let ((.def_83155 (= T1_E (_ bv0 32)))).def_83155))
(assert (let ((.def_83157 (= E_2 (_ bv0 32)))).def_83157))
(assert (let ((.def_83159 (= E_6 (_ bv0 32)))).def_83159))
(assert (let ((.def_83162 (= M_E (_ bv0 32)))).def_83162))
(assert false)

start_simulation2 N1087:
(assert (let ((.def_10946 (= m_pc (_ bv0 32)))).def_10946))
(assert (let ((.def_574 (= c_num_read p_num_write))).def_574))
(assert (let ((.def_583 (= c_last_read p_last_write))).def_583))
(assert (let ((.def_15043 (= t1_pc (_ bv0 32)))).def_15043))
(assert (let ((.def_15046 (= t2_pc (_ bv0 32)))).def_15046))
(assert (let ((.def_15049 (= t3_pc (_ bv0 32)))).def_15049))
(assert (let ((.def_15052 (= t4_pc (_ bv0 32)))).def_15052))
(assert (let ((.def_15055 (= t5_pc (_ bv0 32)))).def_15055))
(assert (let ((.def_15058 (= t6_pc (_ bv0 32)))).def_15058))
(assert (let ((.def_15060 (= m_pc (_ bv1 32)))).def_15060))
(assert (let ((.def_15062 (= t1_pc (_ bv1 32)))).def_15062))
(assert (let ((.def_15064 (= t2_pc (_ bv1 32)))).def_15064))
(assert (let ((.def_15066 (= t3_pc (_ bv1 32)))).def_15066))
(assert (let ((.def_15068 (= t4_pc (_ bv1 32)))).def_15068))
(assert (let ((.def_15070 (= t5_pc (_ bv1 32)))).def_15070))
(assert (let ((.def_15072 (= t6_pc (_ bv1 32)))).def_15072))
(assert (let ((.def_22136 (= E_4 (_ bv1 32)))).def_22136))
(assert (let ((.def_22139 (= E_3 (_ bv1 32)))).def_22139))
(assert (let ((.def_22142 (= E_2 (_ bv1 32)))).def_22142))
(assert (let ((.def_22145 (= E_5 (_ bv1 32)))).def_22145))
(assert (let ((.def_22148 (= t6_st (_ bv0 32)))).def_22148))
(assert (let ((.def_22151 (= t3_st (_ bv0 32)))).def_22151))
(assert (let ((.def_22154 (= E_6 (_ bv1 32)))).def_22154))
(assert (let ((.def_22157 (= E_M (_ bv1 32)))).def_22157))
(assert (let ((.def_22160 (= t1_st (_ bv0 32)))).def_22160))
(assert (let ((.def_22163 (= t2_st (_ bv0 32)))).def_22163))
(assert (let ((.def_15075 (= m_st (_ bv0 32)))).def_15075))
(assert (let ((.def_42973 (= local (_ bv0 32)))).def_42973))
(assert (let ((.def_42975 (= token (_ bv0 32)))).def_42975))
(assert (let ((.def_42977 (= E_3 (_ bv2 32)))).def_42977))
(assert (let ((.def_42979 (= E_2 (_ bv2 32)))).def_42979))
(assert (let ((.def_22172 (= E_1 (_ bv1 32)))).def_22172))
(assert (let ((.def_62556 (= E_M (_ bv0 32)))).def_62556))
(assert (let ((.def_22166 (= t4_st (_ bv0 32)))).def_22166))
(assert (let ((.def_22169 (= t5_st (_ bv0 32)))).def_22169))
(assert (let ((.def_83133 (= E_4 (_ bv0 32)))).def_83133))
(assert (let ((.def_83135 (= E_5 (_ bv0 32)))).def_83135))
(assert (let ((.def_83137 (= E_3 (_ bv0 32)))).def_83137))
(assert (let ((.def_83140 (= T6_E (_ bv0 32)))).def_83140))
(assert (let ((.def_83143 (= T5_E (_ bv0 32)))).def_83143))
(assert (let ((.def_83146 (= T4_E (_ bv0 32)))).def_83146))
(assert (let ((.def_83149 (= T3_E (_ bv0 32)))).def_83149))
(assert (let ((.def_83152 (= T2_E (_ bv0 32)))).def_83152))
(assert (let ((.def_83155 (= T1_E (_ bv0 32)))).def_83155))
(assert (let ((.def_83157 (= E_2 (_ bv0 32)))).def_83157))
(assert (let ((.def_83159 (= E_6 (_ bv0 32)))).def_83159))
(assert (let ((.def_62558 (= E_1 (_ bv0 32)))).def_62558))
(assert (let ((.def_83162 (= M_E (_ bv0 32)))).def_83162))

