(set-info :source |printed by MathSAT|)
(declare-fun a20 () (_ BitVec 32))
(declare-fun a25 () (_ BitVec 32))
(declare-fun a12 () (_ BitVec 32))
(declare-fun a15 () (_ BitVec 32))
(declare-fun a16 () (_ BitVec 32))
(declare-fun a2 () (_ BitVec 32))
(declare-fun a27 () (_ BitVec 32))
(declare-fun a9 () (_ BitVec 32))
(declare-fun m_pc () (_ BitVec 32))
(declare-fun t1_pc () (_ BitVec 32))
(declare-fun t2_pc () (_ BitVec 32))
(declare-fun t3_pc () (_ BitVec 32))
(declare-fun t4_pc () (_ BitVec 32))
(declare-fun t5_pc () (_ BitVec 32))
(declare-fun t6_pc () (_ BitVec 32))
(declare-fun t7_pc () (_ BitVec 32))
(declare-fun t8_pc () (_ BitVec 32))
(declare-fun t9_pc () (_ BitVec 32))
(declare-fun t10_pc () (_ BitVec 32))
(declare-fun m_st () (_ BitVec 32))

*:
(assert (let ((.def_107688 (= a20 (_ bv5 32)))).def_107688))

calculate_output8 N30053:
(assert false)
(assert (let ((.def_107688 (= a20 (_ bv5 32)))).def_107688))

main1 N30136:
(assert (let ((.def_107688 (= a20 (_ bv5 32)))).def_107688))
(assert (let ((.def_155285 (= a25 (_ bv1 32)))).def_155285))
(assert (let ((.def_155288 (= a12 (_ bv4 32)))).def_155288))
(assert (let ((.def_155291 (= a15 (_ bv1 32)))).def_155291))
(assert (let ((.def_155294 (= a16 (_ bv1 32)))).def_155294))
(assert (let ((.def_155297 (= a2 (_ bv10 32)))).def_155297))
(assert (let ((.def_155300 (= a27 (_ bv1 32)))).def_155300))
(assert (let ((.def_155303 (= a9 (_ bv18 32)))).def_155303))
(assert (let ((.def_321468 (= a20 (_ bv6 32)))).def_321468))
(assert (let ((.def_321470 (= a12 (_ bv3 32)))).def_321470))
(assert (let ((.def_321472 (= a12 (_ bv6 32)))).def_321472))
(assert (let ((.def_321474 (= a2 (_ bv9 32)))).def_321474))
(assert (let ((.def_321476 (= a9 (_ bv16 32)))).def_321476))
(assert (let ((.def_321478 (= a2 (_ bv12 32)))).def_321478))
(assert (let ((.def_321480 (= a2 (_ bv11 32)))).def_321480))
(assert (let ((.def_321482 (= a9 (_ bv17 32)))).def_321482))
(assert (let ((.def_321484 (= a12 (_ bv2 32)))).def_321484))
(assert (let ((.def_321486 (= a2 (_ bv13 32)))).def_321486))

error N30154:
(assert false)
(assert (let ((.def_107688 (= a20 (_ bv5 32)))).def_107688))

eval N30787:
(assert (let ((.def_747542 (= m_pc (_ bv0 32)))).def_747542))
(assert (let ((.def_107688 (= a20 (_ bv5 32)))).def_107688))
(assert (let ((.def_756807 (= t1_pc (_ bv0 32)))).def_756807))
(assert (let ((.def_756810 (= t2_pc (_ bv0 32)))).def_756810))
(assert (let ((.def_756813 (= t3_pc (_ bv0 32)))).def_756813))
(assert (let ((.def_756816 (= t4_pc (_ bv0 32)))).def_756816))
(assert (let ((.def_756819 (= t5_pc (_ bv0 32)))).def_756819))
(assert (let ((.def_756822 (= t6_pc (_ bv0 32)))).def_756822))
(assert (let ((.def_756825 (= t7_pc (_ bv0 32)))).def_756825))
(assert (let ((.def_756828 (= t8_pc (_ bv0 32)))).def_756828))
(assert (let ((.def_756831 (= t9_pc (_ bv0 32)))).def_756831))
(assert (let ((.def_756834 (= t10_pc (_ bv0 32)))).def_756834))
(assert (let ((.def_756836 (= m_pc (_ bv1 32)))).def_756836))
(assert (let ((.def_756838 (= t1_pc (_ bv1 32)))).def_756838))
(assert (let ((.def_756840 (= t2_pc (_ bv1 32)))).def_756840))
(assert (let ((.def_756842 (= t3_pc (_ bv1 32)))).def_756842))
(assert (let ((.def_756844 (= t4_pc (_ bv1 32)))).def_756844))
(assert (let ((.def_756846 (= t5_pc (_ bv1 32)))).def_756846))
(assert (let ((.def_756848 (= t6_pc (_ bv1 32)))).def_756848))
(assert (let ((.def_756850 (= t7_pc (_ bv1 32)))).def_756850))
(assert (let ((.def_756852 (= t8_pc (_ bv1 32)))).def_756852))
(assert (let ((.def_756854 (= t9_pc (_ bv1 32)))).def_756854))
(assert (let ((.def_756856 (= t10_pc (_ bv1 32)))).def_756856))
(assert (let ((.def_756859 (= m_st (_ bv0 32)))).def_756859))

start_simulation N31306:
(assert (let ((.def_747542 (= m_pc (_ bv0 32)))).def_747542))
(assert (let ((.def_107688 (= a20 (_ bv5 32)))).def_107688))
(assert (let ((.def_756807 (= t1_pc (_ bv0 32)))).def_756807))
(assert (let ((.def_756810 (= t2_pc (_ bv0 32)))).def_756810))
(assert (let ((.def_756813 (= t3_pc (_ bv0 32)))).def_756813))
(assert (let ((.def_756816 (= t4_pc (_ bv0 32)))).def_756816))
(assert (let ((.def_756819 (= t5_pc (_ bv0 32)))).def_756819))
(assert (let ((.def_756822 (= t6_pc (_ bv0 32)))).def_756822))
(assert (let ((.def_756825 (= t7_pc (_ bv0 32)))).def_756825))
(assert (let ((.def_756828 (= t8_pc (_ bv0 32)))).def_756828))
(assert (let ((.def_756831 (= t9_pc (_ bv0 32)))).def_756831))
(assert (let ((.def_756834 (= t10_pc (_ bv0 32)))).def_756834))
(assert (let ((.def_756836 (= m_pc (_ bv1 32)))).def_756836))
(assert (let ((.def_756838 (= t1_pc (_ bv1 32)))).def_756838))
(assert (let ((.def_756840 (= t2_pc (_ bv1 32)))).def_756840))
(assert (let ((.def_756842 (= t3_pc (_ bv1 32)))).def_756842))
(assert (let ((.def_756844 (= t4_pc (_ bv1 32)))).def_756844))
(assert (let ((.def_756846 (= t5_pc (_ bv1 32)))).def_756846))
(assert (let ((.def_756848 (= t6_pc (_ bv1 32)))).def_756848))
(assert (let ((.def_756850 (= t7_pc (_ bv1 32)))).def_756850))
(assert (let ((.def_756852 (= t8_pc (_ bv1 32)))).def_756852))
(assert (let ((.def_756854 (= t9_pc (_ bv1 32)))).def_756854))
(assert (let ((.def_756856 (= t10_pc (_ bv1 32)))).def_756856))

