(set-info :source |printed by MathSAT|)
(declare-fun a20 () (_ BitVec 32))
(declare-fun a9 () (_ BitVec 32))
(declare-fun a25 () (_ BitVec 32))
(declare-fun a12 () (_ BitVec 32))
(declare-fun a15 () (_ BitVec 32))
(declare-fun a16 () (_ BitVec 32))
(declare-fun a2 () (_ BitVec 32))
(declare-fun a27 () (_ BitVec 32))

*:
(assert (let ((.def_106102 (= a20 (_ bv5 32)))).def_106102))

calculate_output8 N29679:
(assert false)
(assert (let ((.def_106102 (= a20 (_ bv5 32)))).def_106102))

main1 N30136:
(assert (let ((.def_153000 (= a9 (_ bv18 32)))).def_153000))
(assert (let ((.def_106102 (= a20 (_ bv5 32)))).def_106102))
(assert (let ((.def_339603 (= a25 (_ bv1 32)))).def_339603))
(assert (let ((.def_339606 (= a12 (_ bv4 32)))).def_339606))
(assert (let ((.def_339609 (= a15 (_ bv1 32)))).def_339609))
(assert (let ((.def_339612 (= a16 (_ bv1 32)))).def_339612))
(assert (let ((.def_339615 (= a2 (_ bv10 32)))).def_339615))
(assert (let ((.def_339618 (= a27 (_ bv1 32)))).def_339618))
(assert (let ((.def_339620 (= a2 (_ bv13 32)))).def_339620))
(assert (let ((.def_339622 (= a9 (_ bv17 32)))).def_339622))
(assert (let ((.def_339624 (= a2 (_ bv9 32)))).def_339624))
(assert (let ((.def_339626 (= a2 (_ bv11 32)))).def_339626))
(assert (let ((.def_339628 (= a9 (_ bv16 32)))).def_339628))
(assert (let ((.def_339630 (= a2 (_ bv12 32)))).def_339630))
(assert (let ((.def_884905 (= a20 (_ bv7 32)))).def_884905))
(assert (let ((.def_884907 (= a20 (_ bv6 32)))).def_884907))
(assert (let ((.def_884909 (= a12 (_ bv2 32)))).def_884909))
(assert (let ((.def_884911 (= a12 (_ bv3 32)))).def_884911))
(assert (let ((.def_884913 (= a12 (_ bv6 32)))).def_884913))
(assert (let ((.def_884915 (= a12 (_ bv5 32)))).def_884915))

