(set-info :source |printed by MathSAT|)
(declare-fun |ssl3_connect::blastFlag| () (_ BitVec 32))
(declare-fun |ssl3_connect::s__state| () (_ BitVec 32))
(declare-fun |ssl3_connect::s__hit| () (_ BitVec 32))
(declare-fun |ssl3_connect::s__s3__tmp__next_state___0| () (_ BitVec 32))
(declare-fun |ssl3_connect::s__s3__tmp__new_cipher__algorithms| () (_ BitVec 32))
(declare-fun |ssl3_connect::cb| () (_ BitVec 32))
(declare-fun |ssl3_accept::blastFlag| () (_ BitVec 32))
(declare-fun |ssl3_accept::s__state| () (_ BitVec 32))
(declare-fun |ssl3_accept::s__s3__tmp__reuse_message| () (_ BitVec 32))
(declare-fun |ssl3_accept::s__hit| () (_ BitVec 32))
(declare-fun |ssl3_accept::s__s3__tmp__next_state___0| () (_ BitVec 32))
(declare-fun |ssl3_accept::s__init_buf___0| () (_ BitVec 32))
(declare-fun |ssl3_accept::skip| () (_ BitVec 32))
(declare-fun |ssl3_accept::cb| () (_ BitVec 32))
(declare-fun |ssl3_accept::s__verify_mode| () (_ BitVec 32))
(declare-fun |ssl3_accept::s__session__peer| () (_ BitVec 32))

ssl3_connect:
(assert (let ((.def_678 (= |ssl3_connect::blastFlag| (_ bv5 32)))).def_678))

ssl3_connect N117:
(assert (let ((.def_1600 (= |ssl3_connect::s__state| (_ bv12292 32)))).def_1600))
(assert (let ((.def_1602 (= |ssl3_connect::blastFlag| (_ bv0 32)))).def_1602))
(assert (let ((.def_678 (= |ssl3_connect::blastFlag| (_ bv5 32)))).def_678))
(assert (let ((.def_3687 (= |ssl3_connect::s__state| (_ bv4368 32)))).def_3687))
(assert (let ((.def_3689 (= |ssl3_connect::s__state| (_ bv4384 32)))).def_3689))
(assert (let ((.def_3691 (= |ssl3_connect::blastFlag| (_ bv1 32)))).def_3691))
(assert (let ((.def_5298 (= |ssl3_connect::blastFlag| (_ bv3 32)))).def_5298))
(assert (let ((.def_5300 (= |ssl3_connect::blastFlag| (_ bv4 32)))).def_5300))
(assert (let ((.def_5302 (= |ssl3_connect::blastFlag| (_ bv2 32)))).def_5302))
(assert (let ((.def_5304 (= |ssl3_connect::s__state| (_ bv4416 32)))).def_5304))
(assert (let ((.def_5306 (= |ssl3_connect::s__state| (_ bv4433 32)))).def_5306))
(assert (let ((.def_5308 (= |ssl3_connect::s__state| (_ bv4432 32)))).def_5308))
(assert (let ((.def_10863 (= |ssl3_connect::s__state| (_ bv4099 32)))).def_10863))
(assert (let ((.def_10865 (= |ssl3_connect::s__state| (_ bv20480 32)))).def_10865))
(assert (let ((.def_10867 (= |ssl3_connect::s__state| (_ bv4096 32)))).def_10867))
(assert (let ((.def_10869 (= |ssl3_connect::s__state| (_ bv16384 32)))).def_10869))
(assert (let ((.def_10871 (= |ssl3_connect::s__state| (_ bv4369 32)))).def_10871))
(assert (let ((.def_10873 (= |ssl3_connect::s__state| (_ bv4401 32)))).def_10873))
(assert (let ((.def_10875 (= |ssl3_connect::s__state| (_ bv4400 32)))).def_10875))
(assert (let ((.def_10877 (= |ssl3_connect::s__state| (_ bv4385 32)))).def_10877))
(assert (let ((.def_10879 (= |ssl3_connect::s__state| (_ bv4352 32)))).def_10879))
(assert (let ((.def_16608 (= |ssl3_connect::s__state| (_ bv4560 32)))).def_16608))
(assert (let ((.def_16610 (= |ssl3_connect::s__state| (_ bv4512 32)))).def_16610))
(assert (let ((.def_16612 (= |ssl3_connect::s__state| (_ bv4513 32)))).def_16612))
(assert (let ((.def_16614 (= |ssl3_connect::s__state| (_ bv4481 32)))).def_16614))
(assert (let ((.def_16616 (= |ssl3_connect::s__state| (_ bv4480 32)))).def_16616))
(assert (let ((.def_16618 (= |ssl3_connect::s__state| (_ bv4467 32)))).def_16618))
(assert (let ((.def_16620 (= |ssl3_connect::s__state| (_ bv4466 32)))).def_16620))
(assert (let ((.def_16622 (= |ssl3_connect::s__state| (_ bv4465 32)))).def_16622))
(assert (let ((.def_16624 (= |ssl3_connect::s__state| (_ bv4464 32)))).def_16624))
(assert (let ((.def_16626 (= |ssl3_connect::s__state| (_ bv4449 32)))).def_16626))
(assert (let ((.def_16628 (= |ssl3_connect::s__state| (_ bv4448 32)))).def_16628))
(assert (let ((.def_16631 (= |ssl3_connect::s__hit| (_ bv0 32)))).def_16631))
(assert (let ((.def_16633 (= |ssl3_connect::s__state| (_ bv4417 32)))).def_16633))
(assert (let ((.def_16635 (= |ssl3_connect::s__state| (_ bv4496 32)))).def_16635))
(assert (let ((.def_16637 (= |ssl3_connect::s__state| (_ bv4497 32)))).def_16637))
(assert (let ((.def_16639 (= |ssl3_connect::s__state| (_ bv4528 32)))).def_16639))
(assert (let ((.def_16641 (= |ssl3_connect::s__state| (_ bv4529 32)))).def_16641))
(assert (let ((.def_16643 (= |ssl3_connect::s__state| (_ bv4561 32)))).def_16643))
(assert (let ((.def_16646 (= |ssl3_connect::s__state| |ssl3_connect::s__s3__tmp__next_state___0|))).def_16646))
(assert (let ((.def_16648 (= |ssl3_connect::s__s3__tmp__next_state___0| (_ bv4401 32)))).def_16648))
(assert (let ((.def_16651 (= |ssl3_connect::s__s3__tmp__new_cipher__algorithms| (_ bv4294967040 32)))).def_16651))
(assert (let ((.def_16654 (= |ssl3_connect::cb| (_ bv0 32)))).def_16654))
(assert (let ((.def_29108 (= |ssl3_connect::s__s3__tmp__next_state___0| (_ bv4099 32)))).def_29108))
(assert (let ((.def_29110 (= |ssl3_connect::s__s3__tmp__next_state___0| (_ bv4096 32)))).def_29110))
(assert (let ((.def_29112 (= |ssl3_connect::s__s3__tmp__next_state___0| (_ bv20480 32)))).def_29112))
(assert (let ((.def_29114 (= |ssl3_connect::s__s3__tmp__next_state___0| (_ bv16384 32)))).def_29114))
(assert (let ((.def_29116 (= |ssl3_connect::s__s3__tmp__next_state___0| (_ bv12292 32)))).def_29116))
(assert (let ((.def_29118 (= |ssl3_connect::s__s3__tmp__next_state___0| (_ bv4369 32)))).def_29118))
(assert (let ((.def_29120 (= |ssl3_connect::s__s3__tmp__next_state___0| (_ bv4368 32)))).def_29120))
(assert (let ((.def_29122 (= |ssl3_connect::s__s3__tmp__next_state___0| (_ bv4384 32)))).def_29122))
(assert (let ((.def_29124 (= |ssl3_connect::s__s3__tmp__next_state___0| (_ bv4385 32)))).def_29124))
(assert (let ((.def_29126 (= |ssl3_connect::s__s3__tmp__next_state___0| (_ bv4400 32)))).def_29126))
(assert (let ((.def_29128 (= |ssl3_connect::s__s3__tmp__next_state___0| (_ bv4416 32)))).def_29128))
(assert (let ((.def_29130 (= |ssl3_connect::s__s3__tmp__next_state___0| (_ bv4417 32)))).def_29130))
(assert (let ((.def_29132 (= |ssl3_connect::s__s3__tmp__next_state___0| (_ bv4432 32)))).def_29132))
(assert (let ((.def_29134 (= |ssl3_connect::s__s3__tmp__next_state___0| (_ bv4433 32)))).def_29134))

ssl3_connect N576:
(assert false)
(assert (let ((.def_678 (= |ssl3_connect::blastFlag| (_ bv5 32)))).def_678))

ssl3_accept N699:
(assert (let ((.def_41607 (= |ssl3_accept::blastFlag| (_ bv10 32)))).def_41607))
(assert (let ((.def_42815 (= |ssl3_accept::s__state| (_ bv8464 32)))).def_42815))
(assert (let ((.def_42817 (= |ssl3_accept::blastFlag| (_ bv0 32)))).def_42817))
(assert (let ((.def_42819 (= |ssl3_accept::blastFlag| (_ bv4 32)))).def_42819))
(assert (let ((.def_42821 (= |ssl3_accept::blastFlag| (_ bv7 32)))).def_42821))
(assert (let ((.def_44320 (= |ssl3_accept::s__state| (_ bv8481 32)))).def_44320))
(assert (let ((.def_44322 (= |ssl3_accept::s__state| (_ bv8480 32)))).def_44322))
(assert (let ((.def_44324 (= |ssl3_accept::s__state| (_ bv12292 32)))).def_44324))
(assert (let ((.def_44326 (= |ssl3_accept::s__state| (_ bv16384 32)))).def_44326))
(assert (let ((.def_44328 (= |ssl3_accept::s__state| (_ bv8192 32)))).def_44328))
(assert (let ((.def_44330 (= |ssl3_accept::s__state| (_ bv24576 32)))).def_44330))
(assert (let ((.def_44332 (= |ssl3_accept::s__state| (_ bv8195 32)))).def_44332))
(assert (let ((.def_44334 (= |ssl3_accept::s__state| (_ bv8482 32)))).def_44334))
(assert (let ((.def_44336 (= |ssl3_accept::s__state| (_ bv8496 32)))).def_44336))
(assert (let ((.def_44338 (= |ssl3_accept::blastFlag| (_ bv1 32)))).def_44338))
(assert (let ((.def_46335 (= |ssl3_accept::s__s3__tmp__reuse_message| (_ bv0 32)))).def_46335))
(assert (let ((.def_46337 (= |ssl3_accept::blastFlag| (_ bv2 32)))).def_46337))
(assert (let ((.def_46339 (= |ssl3_accept::s__state| (_ bv8448 32)))).def_46339))
(assert (let ((.def_46341 (= |ssl3_accept::s__state| (_ bv8641 32)))).def_46341))
(assert (let ((.def_46343 (= |ssl3_accept::s__state| (_ bv8640 32)))).def_46343))
(assert (let ((.def_50564 (= |ssl3_accept::s__state| (_ bv8465 32)))).def_50564))
(assert (let ((.def_50566 (= |ssl3_accept::s__state| (_ bv8466 32)))).def_50566))
(assert (let ((.def_50568 (= |ssl3_accept::s__state| (_ bv8656 32)))).def_50568))
(assert (let ((.def_50571 (= |ssl3_accept::s__hit| (_ bv0 32)))).def_50571))
(assert (let ((.def_50573 (= |ssl3_accept::s__state| (_ bv8512 32)))).def_50573))
(assert (let ((.def_50575 (= |ssl3_accept::blastFlag| (_ bv9 32)))).def_50575))
(assert (let ((.def_50577 (= |ssl3_accept::blastFlag| (_ bv3 32)))).def_50577))
(assert (let ((.def_50579 (= |ssl3_accept::blastFlag| (_ bv8 32)))).def_50579))
(assert (let ((.def_50581 (= |ssl3_accept::blastFlag| (_ bv6 32)))).def_50581))
(assert (let ((.def_50583 (= |ssl3_accept::blastFlag| (_ bv5 32)))).def_50583))
(assert (let ((.def_50585 (= |ssl3_accept::s__state| (_ bv8609 32)))).def_50585))
(assert (let ((.def_50587 (= |ssl3_accept::s__state| (_ bv8608 32)))).def_50587))
(assert (let ((.def_50589 (= |ssl3_accept::s__state| (_ bv8528 32)))).def_50589))
(assert (let ((.def_50591 (= |ssl3_accept::s__state| (_ bv8544 32)))).def_50591))
(assert (let ((.def_50593 (= |ssl3_accept::s__state| (_ bv8560 32)))).def_50593))
(assert (let ((.def_50596 (= |ssl3_accept::s__state| |ssl3_accept::s__s3__tmp__next_state___0|))).def_50596))
(assert (let ((.def_50598 (= |ssl3_accept::s__s3__tmp__next_state___0| (_ bv8482 32)))).def_50598))
(assert (let ((.def_50600 (= |ssl3_accept::s__s3__tmp__next_state___0| (_ bv3 32)))).def_50600))
(assert (let ((.def_50602 (= |ssl3_accept::s__s3__tmp__next_state___0| (_ bv8576 32)))).def_50602))
(assert (let ((.def_50604 (= |ssl3_accept::s__state| (_ bv8576 32)))).def_50604))
(assert (let ((.def_50606 (= |ssl3_accept::s__state| (_ bv8592 32)))).def_50606))
(assert (let ((.def_77028 (= |ssl3_accept::s__init_buf___0| (_ bv0 32)))).def_77028))
(assert (let ((.def_77031 (= |ssl3_accept::skip| (_ bv0 32)))).def_77031))
(assert (let ((.def_77034 (= |ssl3_accept::cb| (_ bv0 32)))).def_77034))
(assert (let ((.def_77036 (= |ssl3_accept::s__state| (_ bv8497 32)))).def_77036))
(assert (let ((.def_77038 (= |ssl3_accept::s__state| (_ bv8577 32)))).def_77038))
(assert (let ((.def_77040 (= |ssl3_accept::s__state| (_ bv8529 32)))).def_77040))
(assert (let ((.def_77042 (= |ssl3_accept::s__state| (_ bv8593 32)))).def_77042))
(assert (let ((.def_77044 (= |ssl3_accept::s__state| (_ bv8545 32)))).def_77044))
(assert (let ((.def_77046 (= |ssl3_accept::s__state| (_ bv8561 32)))).def_77046))
(assert (let ((.def_77048 (= |ssl3_accept::s__state| (_ bv8513 32)))).def_77048))
(assert (let ((.def_77050 (= |ssl3_accept::s__state| (_ bv8657 32)))).def_77050))
(assert (let ((.def_77052 (= |ssl3_accept::s__s3__tmp__next_state___0| (_ bv8656 32)))).def_77052))
(assert (let ((.def_77054 (= |ssl3_accept::s__s3__tmp__next_state___0| (_ bv8609 32)))).def_77054))
(assert (let ((.def_77056 (= |ssl3_accept::s__s3__tmp__next_state___0| (_ bv8608 32)))).def_77056))
(assert (let ((.def_77058 (= |ssl3_accept::s__s3__tmp__next_state___0| (_ bv8593 32)))).def_77058))
(assert (let ((.def_77060 (= |ssl3_accept::s__s3__tmp__next_state___0| (_ bv8592 32)))).def_77060))
(assert (let ((.def_77062 (= |ssl3_accept::s__s3__tmp__next_state___0| (_ bv8577 32)))).def_77062))
(assert (let ((.def_77064 (= |ssl3_accept::s__s3__tmp__next_state___0| (_ bv8529 32)))).def_77064))
(assert (let ((.def_77066 (= |ssl3_accept::s__s3__tmp__next_state___0| (_ bv8528 32)))).def_77066))
(assert (let ((.def_77068 (= |ssl3_accept::s__s3__tmp__next_state___0| (_ bv8513 32)))).def_77068))
(assert (let ((.def_77070 (= |ssl3_accept::s__s3__tmp__next_state___0| (_ bv8512 32)))).def_77070))
(assert (let ((.def_77072 (= |ssl3_accept::s__s3__tmp__next_state___0| (_ bv8481 32)))).def_77072))
(assert (let ((.def_77074 (= |ssl3_accept::s__s3__tmp__next_state___0| (_ bv8480 32)))).def_77074))
(assert (let ((.def_77076 (= |ssl3_accept::s__s3__tmp__next_state___0| (_ bv8195 32)))).def_77076))
(assert (let ((.def_77078 (= |ssl3_accept::s__s3__tmp__next_state___0| (_ bv24576 32)))).def_77078))
(assert (let ((.def_77080 (= |ssl3_accept::s__s3__tmp__next_state___0| (_ bv8192 32)))).def_77080))
(assert (let ((.def_77082 (= |ssl3_accept::s__s3__tmp__next_state___0| (_ bv16384 32)))).def_77082))
(assert (let ((.def_77084 (= |ssl3_accept::s__s3__tmp__next_state___0| (_ bv12292 32)))).def_77084))
(assert (let ((.def_77086 (= |ssl3_accept::s__s3__tmp__next_state___0| (_ bv8466 32)))).def_77086))
(assert (let ((.def_77088 (= |ssl3_accept::s__s3__tmp__next_state___0| (_ bv8496 32)))).def_77088))
(assert (let ((.def_77090 (= |ssl3_accept::s__s3__tmp__next_state___0| (_ bv8497 32)))).def_77090))
(assert (let ((.def_77092 (= |ssl3_accept::s__s3__tmp__next_state___0| (_ bv8640 32)))).def_77092))
(assert (let ((.def_77094 (= |ssl3_accept::s__state| (_ bv8672 32)))).def_77094))
(assert (let ((.def_77096 (= |ssl3_accept::s__s3__tmp__next_state___0| (_ bv8464 32)))).def_77096))
(assert (let ((.def_77098 (= |ssl3_accept::s__s3__tmp__next_state___0| (_ bv8465 32)))).def_77098))
(assert (let ((.def_77100 (= |ssl3_accept::s__s3__tmp__next_state___0| (_ bv8544 32)))).def_77100))
(assert (let ((.def_77102 (= |ssl3_accept::s__s3__tmp__next_state___0| (_ bv8545 32)))).def_77102))
(assert (let ((.def_77104 (= |ssl3_accept::s__s3__tmp__next_state___0| (_ bv8560 32)))).def_77104))
(assert (let ((.def_77106 (= |ssl3_accept::s__s3__tmp__next_state___0| (_ bv8561 32)))).def_77106))
(assert (let ((.def_77108 (= |ssl3_accept::s__s3__tmp__next_state___0| (_ bv8448 32)))).def_77108))
(assert (let ((.def_77111 (= |ssl3_accept::s__verify_mode| (_ bv4294967295 32)))).def_77111))
(assert (let ((.def_77113 (= |ssl3_accept::skip| (_ bv1 32)))).def_77113))
(assert (let ((.def_77116 (= |ssl3_accept::s__session__peer| (_ bv0 32)))).def_77116))
(assert (let ((.def_77118 (= |ssl3_accept::s__verify_mode| (_ bv4294967294 32)))).def_77118))
(assert (let ((.def_77120 (= |ssl3_accept::s__verify_mode| (_ bv4294967292 32)))).def_77120))
(assert (let ((.def_77122 (= |ssl3_accept::s__s3__tmp__next_state___0| (_ bv8657 32)))).def_77122))
(assert (let ((.def_77124 (= |ssl3_accept::s__state| (_ bv8673 32)))).def_77124))
(assert (let ((.def_77126 (= |ssl3_accept::s__s3__tmp__next_state___0| (_ bv8641 32)))).def_77126))

ssl3_accept N1243:
(assert false)

