(set-info :source |printed by MathSAT|)
(declare-fun c_last_read () (_ BitVec 32))
(declare-fun p_last_write () (_ BitVec 32))
(declare-fun c_num_read () (_ BitVec 32))
(declare-fun p_num_write () (_ BitVec 32))
(declare-fun c_dr_pc () (_ BitVec 32))
(declare-fun q_free () (_ BitVec 32))
(declare-fun q_buf_0 () (_ BitVec 32))
(declare-fun p_dw_pc () (_ BitVec 32))
(declare-fun q_read_ev () (_ BitVec 32))
(declare-fun c_dr_st () (_ BitVec 32))
(declare-fun p_dw_st () (_ BitVec 32))
(declare-fun m_pc () (_ BitVec 32))
(declare-fun t1_pc () (_ BitVec 32))
(declare-fun t2_pc () (_ BitVec 32))
(declare-fun t3_pc () (_ BitVec 32))
(declare-fun t4_pc () (_ BitVec 32))
(declare-fun t5_pc () (_ BitVec 32))
(declare-fun t6_pc () (_ BitVec 32))
(declare-fun t7_pc () (_ BitVec 32))
(declare-fun t8_pc () (_ BitVec 32))
(declare-fun t9_pc () (_ BitVec 32))
(declare-fun t10_pc () (_ BitVec 32))
(declare-fun m_st () (_ BitVec 32))

*:
(assert (let ((.def_645 (= c_last_read p_last_write))).def_645))
(assert (let ((.def_654 (= c_num_read p_num_write))).def_654))

error1 N4:
(assert false)
(assert (let ((.def_645 (= c_last_read p_last_write))).def_645))
(assert (let ((.def_654 (= c_num_read p_num_write))).def_654))

do_write_p N64:
(assert (let ((.def_989 (= c_dr_pc (_ bv0 32)))).def_989))
(assert (let ((.def_645 (= c_last_read p_last_write))).def_645))
(assert (let ((.def_654 (= c_num_read p_num_write))).def_654))
(assert (let ((.def_1092 (= q_free (_ bv1 32)))).def_1092))
(assert false)
(assert (let ((.def_1435 (= p_last_write q_buf_0))).def_1435))
(assert (let ((.def_1095 (= p_dw_pc (_ bv1 32)))).def_1095))
(assert (let ((.def_1624 (bvadd (_ bv1 32) c_num_read)))(let ((.def_1625 (= p_num_write .def_1624))).def_1625)))
(assert (let ((.def_2516 (= q_free (_ bv0 32)))).def_2516))
(assert (let ((.def_1627 (= c_dr_pc (_ bv1 32)))).def_1627))
(assert (let ((.def_5317 (= q_read_ev (_ bv1 32)))).def_5317))

do_read_c N100:
(assert (let ((.def_1095 (= p_dw_pc (_ bv1 32)))).def_1095))
(assert (let ((.def_1092 (= q_free (_ bv1 32)))).def_1092))
(assert (let ((.def_645 (= c_last_read p_last_write))).def_645))
(assert (let ((.def_654 (= c_num_read p_num_write))).def_654))
(assert (let ((.def_1435 (= p_last_write q_buf_0))).def_1435))
(assert (let ((.def_1624 (bvadd (_ bv1 32) c_num_read)))(let ((.def_1625 (= p_num_write .def_1624))).def_1625)))
(assert (let ((.def_1627 (= c_dr_pc (_ bv1 32)))).def_1627))
(assert false)

eval1 N170:
(assert (let ((.def_989 (= c_dr_pc (_ bv0 32)))).def_989))
(assert (let ((.def_645 (= c_last_read p_last_write))).def_645))
(assert (let ((.def_654 (= c_num_read p_num_write))).def_654))
(assert (let ((.def_1092 (= q_free (_ bv1 32)))).def_1092))
(assert (let ((.def_1365 (= p_dw_pc (_ bv0 32)))).def_1365))
(assert (let ((.def_1627 (= c_dr_pc (_ bv1 32)))).def_1627))
(assert (let ((.def_3939 (= c_dr_st (_ bv0 32)))).def_3939))
(assert (let ((.def_1095 (= p_dw_pc (_ bv1 32)))).def_1095))
(assert (let ((.def_5317 (= q_read_ev (_ bv1 32)))).def_5317))
(assert (let ((.def_5320 (= p_dw_st (_ bv0 32)))).def_5320))
(assert (let ((.def_1435 (= p_last_write q_buf_0))).def_1435))
(assert (let ((.def_1624 (bvadd (_ bv1 32) c_num_read)))(let ((.def_1625 (= p_num_write .def_1624))).def_1625)))

start_simulation1 N221:
(assert (let ((.def_989 (= c_dr_pc (_ bv0 32)))).def_989))
(assert (let ((.def_645 (= c_last_read p_last_write))).def_645))
(assert (let ((.def_654 (= c_num_read p_num_write))).def_654))
(assert (let ((.def_1092 (= q_free (_ bv1 32)))).def_1092))
(assert (let ((.def_1365 (= p_dw_pc (_ bv0 32)))).def_1365))
(assert (let ((.def_5317 (= q_read_ev (_ bv1 32)))).def_5317))

error2 N260:
(assert false)
(assert (let ((.def_645 (= c_last_read p_last_write))).def_645))
(assert (let ((.def_654 (= c_num_read p_num_write))).def_654))

eval2 N893:
(assert (let ((.def_8128 (= m_pc (_ bv0 32)))).def_8128))
(assert (let ((.def_645 (= c_last_read p_last_write))).def_645))
(assert (let ((.def_654 (= c_num_read p_num_write))).def_654))
(assert (let ((.def_17394 (= t1_pc (_ bv0 32)))).def_17394))
(assert (let ((.def_17397 (= t2_pc (_ bv0 32)))).def_17397))
(assert (let ((.def_17400 (= t3_pc (_ bv0 32)))).def_17400))
(assert (let ((.def_17403 (= t4_pc (_ bv0 32)))).def_17403))
(assert (let ((.def_17406 (= t5_pc (_ bv0 32)))).def_17406))
(assert (let ((.def_17409 (= t6_pc (_ bv0 32)))).def_17409))
(assert (let ((.def_17412 (= t7_pc (_ bv0 32)))).def_17412))
(assert (let ((.def_17415 (= t8_pc (_ bv0 32)))).def_17415))
(assert (let ((.def_17418 (= t9_pc (_ bv0 32)))).def_17418))
(assert (let ((.def_17421 (= t10_pc (_ bv0 32)))).def_17421))
(assert (let ((.def_17423 (= m_pc (_ bv1 32)))).def_17423))
(assert (let ((.def_17425 (= t1_pc (_ bv1 32)))).def_17425))
(assert (let ((.def_17427 (= t2_pc (_ bv1 32)))).def_17427))
(assert (let ((.def_17429 (= t3_pc (_ bv1 32)))).def_17429))
(assert (let ((.def_17431 (= t4_pc (_ bv1 32)))).def_17431))
(assert (let ((.def_17433 (= t5_pc (_ bv1 32)))).def_17433))
(assert (let ((.def_17435 (= t6_pc (_ bv1 32)))).def_17435))
(assert (let ((.def_17437 (= t7_pc (_ bv1 32)))).def_17437))
(assert (let ((.def_17439 (= t8_pc (_ bv1 32)))).def_17439))
(assert (let ((.def_17441 (= t9_pc (_ bv1 32)))).def_17441))
(assert (let ((.def_17443 (= t10_pc (_ bv1 32)))).def_17443))
(assert (let ((.def_17446 (= m_st (_ bv0 32)))).def_17446))

start_simulation2 N1412:
(assert (let ((.def_8128 (= m_pc (_ bv0 32)))).def_8128))
(assert (let ((.def_645 (= c_last_read p_last_write))).def_645))
(assert (let ((.def_654 (= c_num_read p_num_write))).def_654))
(assert (let ((.def_17394 (= t1_pc (_ bv0 32)))).def_17394))
(assert (let ((.def_17397 (= t2_pc (_ bv0 32)))).def_17397))
(assert (let ((.def_17400 (= t3_pc (_ bv0 32)))).def_17400))
(assert (let ((.def_17403 (= t4_pc (_ bv0 32)))).def_17403))
(assert (let ((.def_17406 (= t5_pc (_ bv0 32)))).def_17406))
(assert (let ((.def_17409 (= t6_pc (_ bv0 32)))).def_17409))
(assert (let ((.def_17412 (= t7_pc (_ bv0 32)))).def_17412))
(assert (let ((.def_17415 (= t8_pc (_ bv0 32)))).def_17415))
(assert (let ((.def_17418 (= t9_pc (_ bv0 32)))).def_17418))
(assert (let ((.def_17421 (= t10_pc (_ bv0 32)))).def_17421))
(assert (let ((.def_17423 (= m_pc (_ bv1 32)))).def_17423))
(assert (let ((.def_17425 (= t1_pc (_ bv1 32)))).def_17425))
(assert (let ((.def_17427 (= t2_pc (_ bv1 32)))).def_17427))
(assert (let ((.def_17429 (= t3_pc (_ bv1 32)))).def_17429))
(assert (let ((.def_17431 (= t4_pc (_ bv1 32)))).def_17431))
(assert (let ((.def_17433 (= t5_pc (_ bv1 32)))).def_17433))
(assert (let ((.def_17435 (= t6_pc (_ bv1 32)))).def_17435))
(assert (let ((.def_17437 (= t7_pc (_ bv1 32)))).def_17437))
(assert (let ((.def_17439 (= t8_pc (_ bv1 32)))).def_17439))
(assert (let ((.def_17441 (= t9_pc (_ bv1 32)))).def_17441))
(assert (let ((.def_17443 (= t10_pc (_ bv1 32)))).def_17443))

