(set-info :source |printed by MathSAT|)
(declare-fun a20 () (_ BitVec 32))
(declare-fun a25 () (_ BitVec 32))
(declare-fun a12 () (_ BitVec 32))
(declare-fun a15 () (_ BitVec 32))
(declare-fun a16 () (_ BitVec 32))
(declare-fun a2 () (_ BitVec 32))
(declare-fun a27 () (_ BitVec 32))
(declare-fun a9 () (_ BitVec 32))
(declare-fun m_pc () (_ BitVec 32))
(declare-fun t1_pc () (_ BitVec 32))
(declare-fun t2_pc () (_ BitVec 32))
(declare-fun t3_pc () (_ BitVec 32))
(declare-fun m_st () (_ BitVec 32))

*:
(assert (let ((.def_107231 (= a20 (_ bv5 32)))).def_107231))

calculate_output8 N29965:
(assert false)
(assert (let ((.def_107231 (= a20 (_ bv5 32)))).def_107231))

main1 N30136:
(assert (let ((.def_107231 (= a20 (_ bv5 32)))).def_107231))
(assert (let ((.def_154622 (= a25 (_ bv1 32)))).def_154622))
(assert (let ((.def_154625 (= a12 (_ bv4 32)))).def_154625))
(assert (let ((.def_154628 (= a15 (_ bv1 32)))).def_154628))
(assert (let ((.def_154631 (= a16 (_ bv1 32)))).def_154631))
(assert (let ((.def_154634 (= a2 (_ bv10 32)))).def_154634))
(assert (let ((.def_154637 (= a27 (_ bv1 32)))).def_154637))
(assert (let ((.def_154640 (= a9 (_ bv18 32)))).def_154640))
(assert (let ((.def_320587 (= a9 (_ bv17 32)))).def_320587))
(assert (let ((.def_320589 (= a2 (_ bv12 32)))).def_320589))
(assert (let ((.def_320591 (= a2 (_ bv11 32)))).def_320591))
(assert (let ((.def_320593 (= a2 (_ bv9 32)))).def_320593))
(assert (let ((.def_320595 (= a12 (_ bv3 32)))).def_320595))
(assert (let ((.def_320597 (= a20 (_ bv6 32)))).def_320597))
(assert (let ((.def_320599 (= a2 (_ bv13 32)))).def_320599))
(assert (let ((.def_320601 (= a9 (_ bv16 32)))).def_320601))
(assert (let ((.def_1073015 (= a12 (_ bv5 32)))).def_1073015))
(assert (let ((.def_1073017 (= a12 (_ bv2 32)))).def_1073017))
(assert (let ((.def_1073019 (= a12 (_ bv6 32)))).def_1073019))
(assert (let ((.def_1073021 (= a20 (_ bv7 32)))).def_1073021))

error N30154:
(assert false)
(assert (let ((.def_107231 (= a20 (_ bv5 32)))).def_107231))

eval N30409:
(assert (let ((.def_1214043 (= m_pc (_ bv0 32)))).def_1214043))
(assert (let ((.def_107231 (= a20 (_ bv5 32)))).def_107231))
(assert (let ((.def_1215671 (= t1_pc (_ bv0 32)))).def_1215671))
(assert (let ((.def_1215674 (= t2_pc (_ bv0 32)))).def_1215674))
(assert (let ((.def_1215677 (= t3_pc (_ bv0 32)))).def_1215677))
(assert (let ((.def_1215679 (= m_pc (_ bv1 32)))).def_1215679))
(assert (let ((.def_1215681 (= t1_pc (_ bv1 32)))).def_1215681))
(assert (let ((.def_1215683 (= t2_pc (_ bv1 32)))).def_1215683))
(assert (let ((.def_1215685 (= t3_pc (_ bv1 32)))).def_1215685))
(assert (let ((.def_1215688 (= m_st (_ bv0 32)))).def_1215688))

start_simulation N30641:
(assert (let ((.def_1214043 (= m_pc (_ bv0 32)))).def_1214043))
(assert (let ((.def_107231 (= a20 (_ bv5 32)))).def_107231))
(assert (let ((.def_1215671 (= t1_pc (_ bv0 32)))).def_1215671))
(assert (let ((.def_1215674 (= t2_pc (_ bv0 32)))).def_1215674))
(assert (let ((.def_1215677 (= t3_pc (_ bv0 32)))).def_1215677))
(assert (let ((.def_1215679 (= m_pc (_ bv1 32)))).def_1215679))
(assert (let ((.def_1215681 (= t1_pc (_ bv1 32)))).def_1215681))
(assert (let ((.def_1215683 (= t2_pc (_ bv1 32)))).def_1215683))
(assert (let ((.def_1215685 (= t3_pc (_ bv1 32)))).def_1215685))

