(set-info :source |printed by MathSAT|)
(declare-fun a20 () (_ BitVec 32))
(declare-fun a25 () (_ BitVec 32))
(declare-fun a12 () (_ BitVec 32))
(declare-fun a15 () (_ BitVec 32))
(declare-fun a16 () (_ BitVec 32))
(declare-fun a2 () (_ BitVec 32))
(declare-fun a27 () (_ BitVec 32))
(declare-fun a9 () (_ BitVec 32))
(declare-fun m_pc () (_ BitVec 32))
(declare-fun t1_pc () (_ BitVec 32))
(declare-fun t2_pc () (_ BitVec 32))
(declare-fun t3_pc () (_ BitVec 32))
(declare-fun t4_pc () (_ BitVec 32))
(declare-fun t5_pc () (_ BitVec 32))
(declare-fun t6_pc () (_ BitVec 32))
(declare-fun m_st () (_ BitVec 32))

*:
(assert (let ((.def_107628 (= a20 (_ bv5 32)))).def_107628))

calculate_output8 N30053:
(assert false)
(assert (let ((.def_107628 (= a20 (_ bv5 32)))).def_107628))

main1 N30136:
(assert (let ((.def_107628 (= a20 (_ bv5 32)))).def_107628))
(assert (let ((.def_155205 (= a25 (_ bv1 32)))).def_155205))
(assert (let ((.def_155208 (= a12 (_ bv4 32)))).def_155208))
(assert (let ((.def_155211 (= a15 (_ bv1 32)))).def_155211))
(assert (let ((.def_155214 (= a16 (_ bv1 32)))).def_155214))
(assert (let ((.def_155217 (= a2 (_ bv10 32)))).def_155217))
(assert (let ((.def_155220 (= a27 (_ bv1 32)))).def_155220))
(assert (let ((.def_155223 (= a9 (_ bv18 32)))).def_155223))
(assert (let ((.def_321388 (= a20 (_ bv6 32)))).def_321388))
(assert (let ((.def_321390 (= a12 (_ bv3 32)))).def_321390))
(assert (let ((.def_321392 (= a12 (_ bv6 32)))).def_321392))
(assert (let ((.def_321394 (= a2 (_ bv9 32)))).def_321394))
(assert (let ((.def_321396 (= a9 (_ bv16 32)))).def_321396))
(assert (let ((.def_321398 (= a2 (_ bv12 32)))).def_321398))
(assert (let ((.def_321400 (= a2 (_ bv11 32)))).def_321400))
(assert (let ((.def_321402 (= a9 (_ bv17 32)))).def_321402))
(assert (let ((.def_321404 (= a12 (_ bv2 32)))).def_321404))
(assert (let ((.def_321406 (= a2 (_ bv13 32)))).def_321406))

error N30154:
(assert false)
(assert (let ((.def_107628 (= a20 (_ bv5 32)))).def_107628))

eval N30571:
(assert (let ((.def_746986 (= m_pc (_ bv0 32)))).def_746986))
(assert (let ((.def_107628 (= a20 (_ bv5 32)))).def_107628))
(assert (let ((.def_751125 (= t1_pc (_ bv0 32)))).def_751125))
(assert (let ((.def_751128 (= t2_pc (_ bv0 32)))).def_751128))
(assert (let ((.def_751131 (= t3_pc (_ bv0 32)))).def_751131))
(assert (let ((.def_751134 (= t4_pc (_ bv0 32)))).def_751134))
(assert (let ((.def_751137 (= t5_pc (_ bv0 32)))).def_751137))
(assert (let ((.def_751140 (= t6_pc (_ bv0 32)))).def_751140))
(assert (let ((.def_751142 (= m_pc (_ bv1 32)))).def_751142))
(assert (let ((.def_751144 (= t1_pc (_ bv1 32)))).def_751144))
(assert (let ((.def_751146 (= t2_pc (_ bv1 32)))).def_751146))
(assert (let ((.def_751148 (= t3_pc (_ bv1 32)))).def_751148))
(assert (let ((.def_751150 (= t4_pc (_ bv1 32)))).def_751150))
(assert (let ((.def_751152 (= t5_pc (_ bv1 32)))).def_751152))
(assert (let ((.def_751154 (= t6_pc (_ bv1 32)))).def_751154))
(assert (let ((.def_751157 (= m_st (_ bv0 32)))).def_751157))

start_simulation N30926:
(assert (let ((.def_746986 (= m_pc (_ bv0 32)))).def_746986))
(assert (let ((.def_107628 (= a20 (_ bv5 32)))).def_107628))
(assert (let ((.def_751125 (= t1_pc (_ bv0 32)))).def_751125))
(assert (let ((.def_751128 (= t2_pc (_ bv0 32)))).def_751128))
(assert (let ((.def_751131 (= t3_pc (_ bv0 32)))).def_751131))
(assert (let ((.def_751134 (= t4_pc (_ bv0 32)))).def_751134))
(assert (let ((.def_751137 (= t5_pc (_ bv0 32)))).def_751137))
(assert (let ((.def_751140 (= t6_pc (_ bv0 32)))).def_751140))
(assert (let ((.def_751142 (= m_pc (_ bv1 32)))).def_751142))
(assert (let ((.def_751144 (= t1_pc (_ bv1 32)))).def_751144))
(assert (let ((.def_751146 (= t2_pc (_ bv1 32)))).def_751146))
(assert (let ((.def_751148 (= t3_pc (_ bv1 32)))).def_751148))
(assert (let ((.def_751150 (= t4_pc (_ bv1 32)))).def_751150))
(assert (let ((.def_751152 (= t5_pc (_ bv1 32)))).def_751152))
(assert (let ((.def_751154 (= t6_pc (_ bv1 32)))).def_751154))

