(set-info :source |printed by MathSAT|)
(declare-fun |main1::result| () (_ FloatingPoint 8 24))
(declare-fun |base2flt::m| () (_ BitVec 32))
(declare-fun |base2flt::e| () (_ BitVec 32))
(declare-fun |main2::zero| () (_ BitVec 32))

main1:
(assert (let ((.def_96 (fp.leq (fp #b0 #b00000000 #b00000000000000000000000) |main1::result|))).def_96))
(assert (let ((.def_101 (fp.lt |main1::result| (fp #b0 #b01111111 #b01100110011001100110011)))).def_101))

__VERIFIER_assert N24:
(assert false)

base2flt N39:
(assert false)
(assert (let ((.def_5061 (= |base2flt::m| (_ bv1 32)))).def_5061))
(assert (let ((.def_5064 (= |base2flt::e| (_ bv0 32)))).def_5064))
(assert (let ((.def_6979 (= |main2::zero| (_ bv0 32)))).def_6979))
(assert (let ((.def_7206 (= |base2flt::e| (_ bv4294967295 32)))).def_7206))
(assert (let ((.def_7208 (= |base2flt::m| (_ bv2 32)))).def_7208))
(assert (let ((.def_9474 (= |base2flt::e| (_ bv4294967294 32)))).def_9474))
(assert (let ((.def_9476 (= |base2flt::m| (_ bv4 32)))).def_9476))
(assert (let ((.def_12206 (= |base2flt::e| (_ bv4294967293 32)))).def_12206))
(assert (let ((.def_12208 (= |base2flt::m| (_ bv8 32)))).def_12208))
(assert (let ((.def_15496 (= |base2flt::e| (_ bv4294967292 32)))).def_15496))
(assert (let ((.def_15498 (= |base2flt::m| (_ bv16 32)))).def_15498))
(assert (let ((.def_19453 (= |base2flt::e| (_ bv4294967291 32)))).def_19453))
(assert (let ((.def_19455 (= |base2flt::m| (_ bv32 32)))).def_19455))
(assert (let ((.def_24178 (= |base2flt::e| (_ bv4294967290 32)))).def_24178))
(assert (let ((.def_24180 (= |base2flt::m| (_ bv64 32)))).def_24180))
(assert (let ((.def_29771 (= |base2flt::e| (_ bv4294967289 32)))).def_29771))
(assert (let ((.def_29773 (= |base2flt::m| (_ bv128 32)))).def_29773))
(assert (let ((.def_36333 (= |base2flt::e| (_ bv4294967288 32)))).def_36333))
(assert (let ((.def_36335 (= |base2flt::m| (_ bv256 32)))).def_36335))
(assert (let ((.def_43962 (= |base2flt::e| (_ bv4294967287 32)))).def_43962))
(assert (let ((.def_43964 (= |base2flt::m| (_ bv512 32)))).def_43964))
(assert (let ((.def_52760 (= |base2flt::e| (_ bv4294967286 32)))).def_52760))
(assert (let ((.def_52762 (= |base2flt::m| (_ bv1024 32)))).def_52762))
(assert (let ((.def_62825 (= |base2flt::e| (_ bv4294967285 32)))).def_62825))
(assert (let ((.def_62827 (= |base2flt::m| (_ bv2048 32)))).def_62827))
(assert (let ((.def_74259 (= |base2flt::e| (_ bv4294967284 32)))).def_74259))
(assert (let ((.def_74261 (= |base2flt::m| (_ bv4096 32)))).def_74261))
(assert (let ((.def_87160 (= |base2flt::e| (_ bv4294967283 32)))).def_87160))
(assert (let ((.def_87162 (= |base2flt::m| (_ bv8192 32)))).def_87162))
(assert (let ((.def_101630 (= |base2flt::e| (_ bv4294967282 32)))).def_101630))
(assert (let ((.def_101632 (= |base2flt::m| (_ bv16384 32)))).def_101632))
(assert (let ((.def_117767 (= |base2flt::e| (_ bv4294967281 32)))).def_117767))
(assert (let ((.def_117769 (= |base2flt::m| (_ bv32768 32)))).def_117769))
(assert (let ((.def_135673 (= |base2flt::e| (_ bv4294967280 32)))).def_135673))
(assert (let ((.def_135675 (= |base2flt::m| (_ bv65536 32)))).def_135675))

base2flt N56:
(assert false)

