(set-info :source |printed by MathSAT|)
(declare-fun |ssl3_connect::blastFlag| () (_ BitVec 32))
(declare-fun |ssl3_connect::s__state| () (_ BitVec 32))

ssl3_connect:
(assert (let ((.def_695 (= |ssl3_connect::blastFlag| (_ bv4 32)))).def_695))

ssl3_connect N116:
(assert (let ((.def_1599 (= |ssl3_connect::s__state| (_ bv12292 32)))).def_1599))
(assert (let ((.def_1601 (= |ssl3_connect::blastFlag| (_ bv0 32)))).def_1601))
(assert (let ((.def_695 (= |ssl3_connect::blastFlag| (_ bv4 32)))).def_695))
(assert (let ((.def_3650 (= |ssl3_connect::s__state| (_ bv4099 32)))).def_3650))
(assert (let ((.def_3652 (= |ssl3_connect::s__state| (_ bv20480 32)))).def_3652))
(assert (let ((.def_3654 (= |ssl3_connect::s__state| (_ bv4096 32)))).def_3654))
(assert (let ((.def_3656 (= |ssl3_connect::s__state| (_ bv16384 32)))).def_3656))
(assert (let ((.def_3658 (= |ssl3_connect::s__state| (_ bv4368 32)))).def_3658))
(assert (let ((.def_3660 (= |ssl3_connect::blastFlag| (_ bv1 32)))).def_3660))
(assert (let ((.def_5397 (= |ssl3_connect::s__state| (_ bv4369 32)))).def_5397))
(assert (let ((.def_5399 (= |ssl3_connect::s__state| (_ bv4384 32)))).def_5399))
(assert (let ((.def_5401 (= |ssl3_connect::blastFlag| (_ bv2 32)))).def_5401))

ssl3_connect N573:
(assert false)
(assert (let ((.def_695 (= |ssl3_connect::blastFlag| (_ bv4 32)))).def_695))

