(set-info :source |printed by MathSAT|)
(declare-fun |assert::arg| () (_ BitVec 8))
(declare-fun st1 () (_ BitVec 8))
(declare-fun st2 () (_ BitVec 8))
(declare-fun st3 () (_ BitVec 8))
(declare-fun st4 () (_ BitVec 8))
(declare-fun st5 () (_ BitVec 8))
(declare-fun st6 () (_ BitVec 8))
(declare-fun st7 () (_ BitVec 8))
(declare-fun st8 () (_ BitVec 8))
(declare-fun r1 () (_ BitVec 8))
(declare-fun p6_new () (_ BitVec 8))
(declare-fun nomsg () (_ BitVec 8))
(declare-fun p5_new () (_ BitVec 8))
(declare-fun p4_new () (_ BitVec 8))
(declare-fun p3_new () (_ BitVec 8))
(declare-fun p2_new () (_ BitVec 8))
(declare-fun p7_new () (_ BitVec 8))
(declare-fun mode1 () (_ BitVec 8))
(declare-fun mode2 () (_ BitVec 8))
(declare-fun mode3 () (_ BitVec 8))
(declare-fun mode4 () (_ BitVec 8))
(declare-fun mode5 () (_ BitVec 8))
(declare-fun mode6 () (_ BitVec 8))
(declare-fun mode7 () (_ BitVec 8))
(declare-fun mode8 () (_ BitVec 8))
(declare-fun id8 () (_ BitVec 8))
(declare-fun send7 () (_ BitVec 8))
(declare-fun send8 () (_ BitVec 8))
(declare-fun id1 () (_ BitVec 8))
(declare-fun id2 () (_ BitVec 8))
(declare-fun send1 () (_ BitVec 8))
(declare-fun id3 () (_ BitVec 8))
(declare-fun send2 () (_ BitVec 8))
(declare-fun id4 () (_ BitVec 8))
(declare-fun send3 () (_ BitVec 8))
(declare-fun id5 () (_ BitVec 8))
(declare-fun send4 () (_ BitVec 8))
(declare-fun id6 () (_ BitVec 8))
(declare-fun send5 () (_ BitVec 8))
(declare-fun id7 () (_ BitVec 8))
(declare-fun send6 () (_ BitVec 8))
(declare-fun p8_new () (_ BitVec 8))
(declare-fun p1_new () (_ BitVec 8))
(declare-fun p7_old () (_ BitVec 8))
(declare-fun p8_old () (_ BitVec 8))
(declare-fun p1_old () (_ BitVec 8))
(declare-fun p2_old () (_ BitVec 8))
(declare-fun p3_old () (_ BitVec 8))
(declare-fun p4_old () (_ BitVec 8))
(declare-fun p5_old () (_ BitVec 8))
(declare-fun p6_old () (_ BitVec 8))
(declare-fun |node5::__CPAchecker_TMP_0| () (_ BitVec 32))
(declare-fun |node3::__CPAchecker_TMP_0| () (_ BitVec 32))
(declare-fun |node4::__CPAchecker_TMP_0| () (_ BitVec 32))
(declare-fun |node7::__CPAchecker_TMP_0| () (_ BitVec 32))
(declare-fun |node6::__CPAchecker_TMP_0| () (_ BitVec 32))
(declare-fun |node8::__CPAchecker_TMP_0| () (_ BitVec 32))
(declare-fun |node1::__CPAchecker_TMP_0| () (_ BitVec 32))
(declare-fun |node2::__CPAchecker_TMP_0| () (_ BitVec 32))

assert:
(assert (let ((.def_3512 (= |assert::arg| (_ bv0 8)))).def_3512))

main1 N560:
(assert (let ((.def_3951 (= st1 (_ bv0 8)))).def_3951))
(assert (let ((.def_3954 (= st2 (_ bv0 8)))).def_3954))
(assert (let ((.def_3957 (= st3 (_ bv0 8)))).def_3957))
(assert (let ((.def_3960 (= st4 (_ bv0 8)))).def_3960))
(assert (let ((.def_3963 (= st5 (_ bv0 8)))).def_3963))
(assert (let ((.def_3966 (= st6 (_ bv0 8)))).def_3966))
(assert (let ((.def_3969 (= st7 (_ bv0 8)))).def_3969))
(assert (let ((.def_3972 (= st8 (_ bv0 8)))).def_3972))
(assert (let ((.def_3975 (= r1 (_ bv0 8)))).def_3975))
(assert (let ((.def_3979 (= p6_new nomsg))).def_3979))
(assert (let ((.def_3982 (= nomsg p5_new))).def_3982))
(assert (let ((.def_3985 (= nomsg p4_new))).def_3985))
(assert (let ((.def_3988 (= nomsg p3_new))).def_3988))
(assert (let ((.def_3991 (= nomsg p2_new))).def_3991))
(assert (let ((.def_3994 (= nomsg p7_new))).def_3994))
(assert (let ((.def_3997 (= mode1 (_ bv0 8)))).def_3997))
(assert (let ((.def_4000 (= mode2 (_ bv0 8)))).def_4000))
(assert (let ((.def_4003 (= mode3 (_ bv0 8)))).def_4003))
(assert (let ((.def_4006 (= mode4 (_ bv0 8)))).def_4006))
(assert (let ((.def_4009 (= mode5 (_ bv0 8)))).def_4009))
(assert (let ((.def_4012 (= mode6 (_ bv0 8)))).def_4012))
(assert (let ((.def_4015 (= mode7 (_ bv0 8)))).def_4015))
(assert (let ((.def_4018 (= mode8 (_ bv0 8)))).def_4018))
(assert (let ((.def_6909 (= st1 st8))).def_6909))
(assert (let ((.def_6911 (= st2 st8))).def_6911))
(assert (let ((.def_6913 (= st3 st8))).def_6913))
(assert (let ((.def_6915 (= st4 st8))).def_6915))
(assert (let ((.def_6917 (= st5 st8))).def_6917))
(assert (let ((.def_6919 (= st6 st8))).def_6919))
(assert (let ((.def_6921 (= st7 st8))).def_6921))
(assert (let ((.def_6926 ((_ sign_extend 24) send7)))(let ((.def_6924 ((_ sign_extend 24) id8)))(let ((.def_6927 (= .def_6924 .def_6926))).def_6927))))
(assert (let ((.def_6932 ((_ sign_extend 24) id1)))(let ((.def_6930 ((_ sign_extend 24) send8)))(let ((.def_6933 (= .def_6930 .def_6932))).def_6933))))
(assert (let ((.def_6938 ((_ sign_extend 24) send1)))(let ((.def_6936 ((_ sign_extend 24) id2)))(let ((.def_6939 (= .def_6936 .def_6938))).def_6939))))
(assert (let ((.def_6944 ((_ sign_extend 24) send2)))(let ((.def_6942 ((_ sign_extend 24) id3)))(let ((.def_6945 (= .def_6942 .def_6944))).def_6945))))
(assert (let ((.def_6949 (= id4 send3))).def_6949))
(assert (let ((.def_6952 ((_ sign_extend 24) send3)))(let ((.def_6951 ((_ sign_extend 24) id4)))(let ((.def_6953 (= .def_6951 .def_6952))).def_6953))))
(assert (let ((.def_6957 (= id5 send4))).def_6957))
(assert (let ((.def_6960 ((_ sign_extend 24) send4)))(let ((.def_6959 ((_ sign_extend 24) id5)))(let ((.def_6961 (= .def_6959 .def_6960))).def_6961))))
(assert (let ((.def_6966 ((_ sign_extend 24) send5)))(let ((.def_6964 ((_ sign_extend 24) id6)))(let ((.def_6967 (= .def_6964 .def_6966))).def_6967))))
(assert (let ((.def_6971 (= id7 send6))).def_6971))
(assert (let ((.def_6974 ((_ sign_extend 24) send6)))(let ((.def_6973 ((_ sign_extend 24) id7)))(let ((.def_6975 (= .def_6973 .def_6974))).def_6975))))
(assert (let ((.def_6977 ((_ sign_extend 24) nomsg)))(let ((.def_6960 ((_ sign_extend 24) send4)))(let ((.def_6978 (= .def_6960 .def_6977))).def_6978))))
(assert (let ((.def_6977 ((_ sign_extend 24) nomsg)))(let ((.def_6966 ((_ sign_extend 24) send5)))(let ((.def_6980 (= .def_6966 .def_6977))).def_6980))))
(assert (let ((.def_6977 ((_ sign_extend 24) nomsg)))(let ((.def_6974 ((_ sign_extend 24) send6)))(let ((.def_6982 (= .def_6974 .def_6977))).def_6982))))
(assert (let ((.def_6977 ((_ sign_extend 24) nomsg)))(let ((.def_6926 ((_ sign_extend 24) send7)))(let ((.def_6984 (= .def_6926 .def_6977))).def_6984))))
(assert (let ((.def_6987 (= nomsg p8_new))).def_6987))
(assert (let ((.def_6990 (= nomsg p1_new))).def_6990))
(assert (let ((.def_7000 ((_ sign_extend 24) st1)))(let ((.def_6999 ((_ sign_extend 24) st2)))(let ((.def_7002 (bvadd .def_6999 .def_7000)))(let ((.def_6998 ((_ sign_extend 24) st3)))(let ((.def_7004 (bvadd .def_6998 .def_7002)))(let ((.def_6997 ((_ sign_extend 24) st4)))(let ((.def_7006 (bvadd .def_6997 .def_7004)))(let ((.def_6996 ((_ sign_extend 24) st5)))(let ((.def_7008 (bvadd .def_6996 .def_7006)))(let ((.def_6995 ((_ sign_extend 24) st6)))(let ((.def_7010 (bvadd .def_6995 .def_7008)))(let ((.def_6994 ((_ sign_extend 24) st7)))(let ((.def_7012 (bvadd .def_6994 .def_7010)))(let ((.def_6992 ((_ sign_extend 24) st8)))(let ((.def_6993 (bvneg .def_6992)))(let ((.def_7013 (= .def_6993 .def_7012))).def_7013)))))))))))))))))
(assert (let ((.def_7016 ((_ sign_extend 24) p7_old)))(let ((.def_6924 ((_ sign_extend 24) id8)))(let ((.def_7017 (= .def_6924 .def_7016))).def_7017))))
(assert (let ((.def_7020 ((_ sign_extend 24) p8_old)))(let ((.def_6932 ((_ sign_extend 24) id1)))(let ((.def_7021 (= .def_6932 .def_7020))).def_7021))))
(assert (let ((.def_7024 ((_ sign_extend 24) p1_old)))(let ((.def_6936 ((_ sign_extend 24) id2)))(let ((.def_7025 (= .def_6936 .def_7024))).def_7025))))
(assert (let ((.def_7028 ((_ sign_extend 24) p2_old)))(let ((.def_6942 ((_ sign_extend 24) id3)))(let ((.def_7029 (= .def_6942 .def_7028))).def_7029))))
(assert (let ((.def_7032 ((_ sign_extend 24) p3_old)))(let ((.def_6951 ((_ sign_extend 24) id4)))(let ((.def_7033 (= .def_6951 .def_7032))).def_7033))))
(assert (let ((.def_7036 ((_ sign_extend 24) p4_old)))(let ((.def_6959 ((_ sign_extend 24) id5)))(let ((.def_7037 (= .def_6959 .def_7036))).def_7037))))
(assert (let ((.def_7040 ((_ sign_extend 24) p5_old)))(let ((.def_6964 ((_ sign_extend 24) id6)))(let ((.def_7041 (= .def_6964 .def_7040))).def_7041))))
(assert (let ((.def_7044 ((_ sign_extend 24) p6_old)))(let ((.def_6973 ((_ sign_extend 24) id7)))(let ((.def_7045 (= .def_6973 .def_7044))).def_7045))))
(assert (let ((.def_6998 ((_ sign_extend 24) st3)))(let ((.def_6997 ((_ sign_extend 24) st4)))(let ((.def_27504 (= .def_6997 .def_6998))).def_27504))))
(assert (let ((.def_7000 ((_ sign_extend 24) st1)))(let ((.def_6997 ((_ sign_extend 24) st4)))(let ((.def_27506 (= .def_6997 .def_7000))).def_27506))))
(assert (let ((.def_6995 ((_ sign_extend 24) st6)))(let ((.def_6994 ((_ sign_extend 24) st7)))(let ((.def_27508 (= .def_6994 .def_6995))).def_27508))))
(assert (let ((.def_6999 ((_ sign_extend 24) st2)))(let ((.def_6994 ((_ sign_extend 24) st7)))(let ((.def_27510 (= .def_6994 .def_6999))).def_27510))))
(assert (let ((.def_6996 ((_ sign_extend 24) st5)))(let ((.def_6994 ((_ sign_extend 24) st7)))(let ((.def_27512 (= .def_6994 .def_6996))).def_27512))))
(assert (let ((.def_27514 (= st4 (_ bv1 8)))).def_27514))
(assert (let ((.def_27516 (= st3 (_ bv1 8)))).def_27516))
(assert (let ((.def_27518 (= st1 (_ bv1 8)))).def_27518))
(assert (let ((.def_7000 ((_ sign_extend 24) st1)))(let ((.def_6998 ((_ sign_extend 24) st3)))(let ((.def_27520 (= .def_6998 .def_7000))).def_27520))))
(assert (let ((.def_6997 ((_ sign_extend 24) st4)))(let ((.def_6994 ((_ sign_extend 24) st7)))(let ((.def_27522 (= .def_6994 .def_6997))).def_27522))))
(assert (let ((.def_6998 ((_ sign_extend 24) st3)))(let ((.def_6994 ((_ sign_extend 24) st7)))(let ((.def_27524 (= .def_6994 .def_6998))).def_27524))))
(assert (let ((.def_6999 ((_ sign_extend 24) st2)))(let ((.def_6995 ((_ sign_extend 24) st6)))(let ((.def_27526 (= .def_6995 .def_6999))).def_27526))))
(assert (let ((.def_6999 ((_ sign_extend 24) st2)))(let ((.def_6998 ((_ sign_extend 24) st3)))(let ((.def_27528 (= .def_6998 .def_6999))).def_27528))))
(assert (let ((.def_6999 ((_ sign_extend 24) st2)))(let ((.def_6996 ((_ sign_extend 24) st5)))(let ((.def_27530 (= .def_6996 .def_6999))).def_27530))))
(assert (let ((.def_27532 (= st7 (_ bv1 8)))).def_27532))
(assert (let ((.def_6999 ((_ sign_extend 24) st2)))(let ((.def_6997 ((_ sign_extend 24) st4)))(let ((.def_27534 (= .def_6997 .def_6999))).def_27534))))
(assert (let ((.def_7000 ((_ sign_extend 24) st1)))(let ((.def_6994 ((_ sign_extend 24) st7)))(let ((.def_27536 (= .def_6994 .def_7000))).def_27536))))
(assert (let ((.def_7000 ((_ sign_extend 24) st1)))(let ((.def_6996 ((_ sign_extend 24) st5)))(let ((.def_27538 (= .def_6996 .def_7000))).def_27538))))
(assert (let ((.def_27540 (= st5 (_ bv1 8)))).def_27540))
(assert (let ((.def_6998 ((_ sign_extend 24) st3)))(let ((.def_6995 ((_ sign_extend 24) st6)))(let ((.def_27542 (= .def_6995 .def_6998))).def_27542))))
(assert (let ((.def_6997 ((_ sign_extend 24) st4)))(let ((.def_6995 ((_ sign_extend 24) st6)))(let ((.def_27544 (= .def_6995 .def_6997))).def_27544))))
(assert (let ((.def_7000 ((_ sign_extend 24) st1)))(let ((.def_6995 ((_ sign_extend 24) st6)))(let ((.def_27546 (= .def_6995 .def_7000))).def_27546))))
(assert (let ((.def_27548 (= st6 (_ bv1 8)))).def_27548))
(assert (let ((.def_7000 ((_ sign_extend 24) st1)))(let ((.def_6999 ((_ sign_extend 24) st2)))(let ((.def_27550 (= .def_6999 .def_7000))).def_27550))))
(assert (let ((.def_27552 (= st2 (_ bv1 8)))).def_27552))
(assert (let ((.def_6996 ((_ sign_extend 24) st5)))(let ((.def_6995 ((_ sign_extend 24) st6)))(let ((.def_27554 (= .def_6995 .def_6996))).def_27554))))
(assert (let ((.def_6997 ((_ sign_extend 24) st4)))(let ((.def_6996 ((_ sign_extend 24) st5)))(let ((.def_27556 (= .def_6996 .def_6997))).def_27556))))
(assert (let ((.def_6998 ((_ sign_extend 24) st3)))(let ((.def_6996 ((_ sign_extend 24) st5)))(let ((.def_27558 (= .def_6996 .def_6998))).def_27558))))
(assert (let ((.def_27560 ((_ zero_extend 24) r1)))(let ((.def_27561 (bvslt .def_27560 (_ bv8 32)))).def_27561)))
(assert (let ((.def_6926 ((_ sign_extend 24) send7)))(let ((.def_6924 ((_ sign_extend 24) id8)))(let ((.def_59157 (bvslt .def_6924 .def_6926))).def_59157))))
(assert (let ((.def_6974 ((_ sign_extend 24) send6)))(let ((.def_6924 ((_ sign_extend 24) id8)))(let ((.def_59159 (= .def_6924 .def_6974))).def_59159))))
(assert (let ((.def_6966 ((_ sign_extend 24) send5)))(let ((.def_6964 ((_ sign_extend 24) id6)))(let ((.def_59161 (bvslt .def_6964 .def_6966))).def_59161))))
(assert (let ((.def_6964 ((_ sign_extend 24) id6)))(let ((.def_6960 ((_ sign_extend 24) send4)))(let ((.def_59163 (= .def_6960 .def_6964))).def_59163))))
(assert (let ((.def_6951 ((_ sign_extend 24) id4)))(let ((.def_6944 ((_ sign_extend 24) send2)))(let ((.def_59165 (= .def_6944 .def_6951))).def_59165))))
(assert (let ((.def_6977 ((_ sign_extend 24) nomsg)))(let ((.def_6952 ((_ sign_extend 24) send3)))(let ((.def_59167 (= .def_6952 .def_6977))).def_59167))))
(assert (let ((.def_6952 ((_ sign_extend 24) send3)))(let ((.def_6951 ((_ sign_extend 24) id4)))(let ((.def_59169 (bvslt .def_6951 .def_6952))).def_59169))))
(assert (let ((.def_6959 ((_ sign_extend 24) id5)))(let ((.def_6952 ((_ sign_extend 24) send3)))(let ((.def_59171 (= .def_6952 .def_6959))).def_59171))))
(assert (let ((.def_6960 ((_ sign_extend 24) send4)))(let ((.def_6959 ((_ sign_extend 24) id5)))(let ((.def_59173 (bvslt .def_6959 .def_6960))).def_59173))))
(assert (let ((.def_59175 (= nomsg send3))).def_59175))
(assert (let ((.def_59177 (= nomsg send4))).def_59177))
(assert (let ((.def_6974 ((_ sign_extend 24) send6)))(let ((.def_6973 ((_ sign_extend 24) id7)))(let ((.def_59179 (bvslt .def_6973 .def_6974))).def_59179))))
(assert (let ((.def_6973 ((_ sign_extend 24) id7)))(let ((.def_6926 ((_ sign_extend 24) send7)))(let ((.def_59181 (= .def_6926 .def_6973))).def_59181))))
(assert (let ((.def_6973 ((_ sign_extend 24) id7)))(let ((.def_6966 ((_ sign_extend 24) send5)))(let ((.def_59183 (= .def_6966 .def_6973))).def_59183))))
(assert (let ((.def_6930 ((_ sign_extend 24) send8)))(let ((.def_6932 ((_ sign_extend 24) id1)))(let ((.def_59185 (bvslt .def_6932 .def_6930))).def_59185))))
(assert (let ((.def_6977 ((_ sign_extend 24) nomsg)))(let ((.def_6930 ((_ sign_extend 24) send8)))(let ((.def_59187 (= .def_6930 .def_6977))).def_59187))))
(assert (let ((.def_6932 ((_ sign_extend 24) id1)))(let ((.def_6926 ((_ sign_extend 24) send7)))(let ((.def_59189 (= .def_6926 .def_6932))).def_59189))))
(assert (let ((.def_6938 ((_ sign_extend 24) send1)))(let ((.def_6936 ((_ sign_extend 24) id2)))(let ((.def_59191 (bvslt .def_6936 .def_6938))).def_59191))))
(assert (let ((.def_6936 ((_ sign_extend 24) id2)))(let ((.def_6930 ((_ sign_extend 24) send8)))(let ((.def_59193 (= .def_6930 .def_6936))).def_59193))))
(assert (let ((.def_6944 ((_ sign_extend 24) send2)))(let ((.def_6942 ((_ sign_extend 24) id3)))(let ((.def_59195 (bvslt .def_6942 .def_6944))).def_59195))))
(assert (let ((.def_6942 ((_ sign_extend 24) id3)))(let ((.def_6938 ((_ sign_extend 24) send1)))(let ((.def_59197 (= .def_6938 .def_6942))).def_59197))))
(assert (let ((.def_59199 (= nomsg send1))).def_59199))
(assert (let ((.def_6977 ((_ sign_extend 24) nomsg)))(let ((.def_6938 ((_ sign_extend 24) send1)))(let ((.def_59201 (= .def_6938 .def_6977))).def_59201))))
(assert (let ((.def_6977 ((_ sign_extend 24) nomsg)))(let ((.def_6944 ((_ sign_extend 24) send2)))(let ((.def_59203 (= .def_6944 .def_6977))).def_59203))))
(assert (let ((.def_7040 ((_ sign_extend 24) p5_old)))(let ((.def_6964 ((_ sign_extend 24) id6)))(let ((.def_59205 (bvslt .def_6964 .def_7040))).def_59205))))
(assert (let ((.def_6966 ((_ sign_extend 24) send5)))(let ((.def_59208 (= .def_6966 |node5::__CPAchecker_TMP_0|))).def_59208)))
(assert (let ((.def_59210 ((_ extract 7 0) |node5::__CPAchecker_TMP_0|)))(let ((.def_59211 (= p5_old .def_59210))).def_59211)))
(assert (let ((.def_7036 ((_ sign_extend 24) p4_old)))(let ((.def_6964 ((_ sign_extend 24) id6)))(let ((.def_59213 (= .def_6964 .def_7036))).def_59213))))
(assert (let ((.def_6952 ((_ sign_extend 24) send3)))(let ((.def_59216 (= .def_6952 |node3::__CPAchecker_TMP_0|))).def_59216)))
(assert (let ((.def_59218 ((_ extract 7 0) |node3::__CPAchecker_TMP_0|)))(let ((.def_59219 (= p3_old .def_59218))).def_59219)))
(assert (let ((.def_7028 ((_ sign_extend 24) p2_old)))(let ((.def_6951 ((_ sign_extend 24) id4)))(let ((.def_59221 (= .def_6951 .def_7028))).def_59221))))
(assert (let ((.def_7032 ((_ sign_extend 24) p3_old)))(let ((.def_6951 ((_ sign_extend 24) id4)))(let ((.def_59223 (bvslt .def_6951 .def_7032))).def_59223))))
(assert (let ((.def_7032 ((_ sign_extend 24) p3_old)))(let ((.def_6959 ((_ sign_extend 24) id5)))(let ((.def_59225 (= .def_6959 .def_7032))).def_59225))))
(assert (let ((.def_6960 ((_ sign_extend 24) send4)))(let ((.def_59228 (= .def_6960 |node4::__CPAchecker_TMP_0|))).def_59228)))
(assert (let ((.def_59230 ((_ extract 7 0) |node4::__CPAchecker_TMP_0|)))(let ((.def_59231 (= p4_old .def_59230))).def_59231)))
(assert (let ((.def_7036 ((_ sign_extend 24) p4_old)))(let ((.def_6959 ((_ sign_extend 24) id5)))(let ((.def_59233 (bvslt .def_6959 .def_7036))).def_59233))))
(assert (let ((.def_7032 ((_ sign_extend 24) p3_old)))(let ((.def_6977 ((_ sign_extend 24) nomsg)))(let ((.def_59235 (= .def_6977 .def_7032))).def_59235))))
(assert (let ((.def_7040 ((_ sign_extend 24) p5_old)))(let ((.def_6977 ((_ sign_extend 24) nomsg)))(let ((.def_59237 (= .def_6977 .def_7040))).def_59237))))
(assert (let ((.def_7036 ((_ sign_extend 24) p4_old)))(let ((.def_6977 ((_ sign_extend 24) nomsg)))(let ((.def_59239 (= .def_6977 .def_7036))).def_59239))))
(assert (let ((.def_7016 ((_ sign_extend 24) p7_old)))(let ((.def_6924 ((_ sign_extend 24) id8)))(let ((.def_59241 (bvslt .def_6924 .def_7016))).def_59241))))
(assert (let ((.def_7044 ((_ sign_extend 24) p6_old)))(let ((.def_6924 ((_ sign_extend 24) id8)))(let ((.def_59243 (= .def_6924 .def_7044))).def_59243))))
(assert (let ((.def_6926 ((_ sign_extend 24) send7)))(let ((.def_59246 (= .def_6926 |node7::__CPAchecker_TMP_0|))).def_59246)))
(assert (let ((.def_59248 ((_ extract 7 0) |node7::__CPAchecker_TMP_0|)))(let ((.def_59249 (= p7_old .def_59248))).def_59249)))
(assert (let ((.def_6974 ((_ sign_extend 24) send6)))(let ((.def_59252 (= .def_6974 |node6::__CPAchecker_TMP_0|))).def_59252)))
(assert (let ((.def_59254 ((_ extract 7 0) |node6::__CPAchecker_TMP_0|)))(let ((.def_59255 (= p6_old .def_59254))).def_59255)))
(assert (let ((.def_7040 ((_ sign_extend 24) p5_old)))(let ((.def_6973 ((_ sign_extend 24) id7)))(let ((.def_59257 (= .def_6973 .def_7040))).def_59257))))
(assert (let ((.def_7044 ((_ sign_extend 24) p6_old)))(let ((.def_6973 ((_ sign_extend 24) id7)))(let ((.def_59259 (bvslt .def_6973 .def_7044))).def_59259))))
(assert (let ((.def_6977 ((_ sign_extend 24) nomsg)))(let ((.def_6973 ((_ sign_extend 24) id7)))(let ((.def_59261 (= .def_6973 .def_6977))).def_59261))))
(assert (let ((.def_6930 ((_ sign_extend 24) send8)))(let ((.def_59264 (= .def_6930 |node8::__CPAchecker_TMP_0|))).def_59264)))
(assert (let ((.def_59266 ((_ extract 7 0) |node8::__CPAchecker_TMP_0|)))(let ((.def_59267 (= p8_old .def_59266))).def_59267)))
(assert (let ((.def_7020 ((_ sign_extend 24) p8_old)))(let ((.def_6977 ((_ sign_extend 24) nomsg)))(let ((.def_59269 (= .def_6977 .def_7020))).def_59269))))
(assert (let ((.def_7016 ((_ sign_extend 24) p7_old)))(let ((.def_6932 ((_ sign_extend 24) id1)))(let ((.def_59271 (= .def_6932 .def_7016))).def_59271))))
(assert (let ((.def_7024 ((_ sign_extend 24) p1_old)))(let ((.def_6936 ((_ sign_extend 24) id2)))(let ((.def_59273 (bvslt .def_6936 .def_7024))).def_59273))))
(assert (let ((.def_7020 ((_ sign_extend 24) p8_old)))(let ((.def_6936 ((_ sign_extend 24) id2)))(let ((.def_59275 (= .def_6936 .def_7020))).def_59275))))
(assert (let ((.def_6938 ((_ sign_extend 24) send1)))(let ((.def_59278 (= .def_6938 |node1::__CPAchecker_TMP_0|))).def_59278)))
(assert (let ((.def_59280 ((_ extract 7 0) |node1::__CPAchecker_TMP_0|)))(let ((.def_59281 (= p1_old .def_59280))).def_59281)))
(assert (let ((.def_7028 ((_ sign_extend 24) p2_old)))(let ((.def_6942 ((_ sign_extend 24) id3)))(let ((.def_59283 (bvslt .def_6942 .def_7028))).def_59283))))
(assert (let ((.def_6944 ((_ sign_extend 24) send2)))(let ((.def_59286 (= .def_6944 |node2::__CPAchecker_TMP_0|))).def_59286)))
(assert (let ((.def_59288 ((_ extract 7 0) |node2::__CPAchecker_TMP_0|)))(let ((.def_59289 (= p2_old .def_59288))).def_59289)))
(assert (let ((.def_7024 ((_ sign_extend 24) p1_old)))(let ((.def_6942 ((_ sign_extend 24) id3)))(let ((.def_59291 (= .def_6942 .def_7024))).def_59291))))
(assert (let ((.def_7024 ((_ sign_extend 24) p1_old)))(let ((.def_6977 ((_ sign_extend 24) nomsg)))(let ((.def_59293 (= .def_6977 .def_7024))).def_59293))))
(assert (let ((.def_7028 ((_ sign_extend 24) p2_old)))(let ((.def_6977 ((_ sign_extend 24) nomsg)))(let ((.def_59295 (= .def_6977 .def_7028))).def_59295))))
(assert (let ((.def_7016 ((_ sign_extend 24) p7_old)))(let ((.def_6977 ((_ sign_extend 24) nomsg)))(let ((.def_59297 (= .def_6977 .def_7016))).def_59297))))
(assert (let ((.def_59299 (= st8 (_ bv1 8)))).def_59299))
(assert (let ((.def_59301 (= id8 send7))).def_59301))
(assert (let ((.def_6938 ((_ sign_extend 24) send1)))(let ((.def_6932 ((_ sign_extend 24) id1)))(let ((.def_59303 (bvslt .def_6932 .def_6938))).def_59303))))
(assert (let ((.def_59305 (= send8 send1))).def_59305))
(assert (let ((.def_59307 (= id2 send1))).def_59307))
(assert (let ((.def_59309 (= id3 send2))).def_59309))
(assert (let ((.def_59311 (= r1 (_ bv1 8)))).def_59311))
(assert (let ((.def_59313 (= send1 p8_old))).def_59313))
(assert (let ((.def_7020 ((_ sign_extend 24) p8_old)))(let ((.def_6932 ((_ sign_extend 24) id1)))(let ((.def_59315 (bvslt .def_6932 .def_7020))).def_59315))))

assert N596:
(assert false)
(assert (let ((.def_3512 (= |assert::arg| (_ bv0 8)))).def_3512))

