(set-info :source |printed by MathSAT|)
(declare-fun a20 () (_ BitVec 32))
(declare-fun a25 () (_ BitVec 32))
(declare-fun a12 () (_ BitVec 32))
(declare-fun a15 () (_ BitVec 32))
(declare-fun a16 () (_ BitVec 32))
(declare-fun a2 () (_ BitVec 32))
(declare-fun a27 () (_ BitVec 32))
(declare-fun a9 () (_ BitVec 32))
(declare-fun m_pc () (_ BitVec 32))
(declare-fun t1_pc () (_ BitVec 32))
(declare-fun t2_pc () (_ BitVec 32))
(declare-fun t3_pc () (_ BitVec 32))
(declare-fun t4_pc () (_ BitVec 32))
(declare-fun t5_pc () (_ BitVec 32))
(declare-fun t6_pc () (_ BitVec 32))
(declare-fun t7_pc () (_ BitVec 32))
(declare-fun t8_pc () (_ BitVec 32))
(declare-fun m_st () (_ BitVec 32))

*:
(assert (let ((.def_106646 (= a20 (_ bv5 32)))).def_106646))

calculate_output8 N29800:
(assert false)
(assert (let ((.def_106646 (= a20 (_ bv5 32)))).def_106646))

main1 N30136:
(assert (let ((.def_106646 (= a20 (_ bv5 32)))).def_106646))
(assert (let ((.def_153834 (= a25 (_ bv1 32)))).def_153834))
(assert (let ((.def_153837 (= a12 (_ bv4 32)))).def_153837))
(assert (let ((.def_153840 (= a15 (_ bv1 32)))).def_153840))
(assert (let ((.def_153843 (= a16 (_ bv1 32)))).def_153843))
(assert (let ((.def_153846 (= a2 (_ bv10 32)))).def_153846))
(assert (let ((.def_153849 (= a27 (_ bv1 32)))).def_153849))
(assert (let ((.def_153852 (= a9 (_ bv18 32)))).def_153852))
(assert (let ((.def_319714 (= a2 (_ bv11 32)))).def_319714))
(assert (let ((.def_319716 (= a12 (_ bv2 32)))).def_319716))
(assert (let ((.def_319718 (= a9 (_ bv17 32)))).def_319718))
(assert (let ((.def_319720 (= a2 (_ bv13 32)))).def_319720))
(assert (let ((.def_319722 (= a20 (_ bv6 32)))).def_319722))
(assert (let ((.def_319724 (= a12 (_ bv6 32)))).def_319724))
(assert (let ((.def_319726 (= a2 (_ bv9 32)))).def_319726))
(assert (let ((.def_319728 (= a9 (_ bv16 32)))).def_319728))
(assert (let ((.def_1062671 (= a20 (_ bv7 32)))).def_1062671))
(assert (let ((.def_1062673 (= a12 (_ bv3 32)))).def_1062673))
(assert (let ((.def_1062675 (= a12 (_ bv5 32)))).def_1062675))
(assert (let ((.def_1062677 (= a2 (_ bv12 32)))).def_1062677))

error N30154:
(assert false)
(assert (let ((.def_106646 (= a20 (_ bv5 32)))).def_106646))

eval N30679:
(assert (let ((.def_1204884 (= m_pc (_ bv0 32)))).def_1204884))
(assert (let ((.def_106646 (= a20 (_ bv5 32)))).def_106646))
(assert (let ((.def_1211331 (= t1_pc (_ bv0 32)))).def_1211331))
(assert (let ((.def_1211334 (= t2_pc (_ bv0 32)))).def_1211334))
(assert (let ((.def_1211337 (= t3_pc (_ bv0 32)))).def_1211337))
(assert (let ((.def_1211340 (= t4_pc (_ bv0 32)))).def_1211340))
(assert (let ((.def_1211343 (= t5_pc (_ bv0 32)))).def_1211343))
(assert (let ((.def_1211346 (= t6_pc (_ bv0 32)))).def_1211346))
(assert (let ((.def_1211349 (= t7_pc (_ bv0 32)))).def_1211349))
(assert (let ((.def_1211352 (= t8_pc (_ bv0 32)))).def_1211352))
(assert (let ((.def_1211354 (= m_pc (_ bv1 32)))).def_1211354))
(assert (let ((.def_1211356 (= t1_pc (_ bv1 32)))).def_1211356))
(assert (let ((.def_1211358 (= t2_pc (_ bv1 32)))).def_1211358))
(assert (let ((.def_1211360 (= t3_pc (_ bv1 32)))).def_1211360))
(assert (let ((.def_1211362 (= t4_pc (_ bv1 32)))).def_1211362))
(assert (let ((.def_1211364 (= t5_pc (_ bv1 32)))).def_1211364))
(assert (let ((.def_1211366 (= t6_pc (_ bv1 32)))).def_1211366))
(assert (let ((.def_1211368 (= t7_pc (_ bv1 32)))).def_1211368))
(assert (let ((.def_1211370 (= t8_pc (_ bv1 32)))).def_1211370))
(assert (let ((.def_1211373 (= m_st (_ bv0 32)))).def_1211373))

start_simulation N31116:
(assert (let ((.def_1204884 (= m_pc (_ bv0 32)))).def_1204884))
(assert (let ((.def_106646 (= a20 (_ bv5 32)))).def_106646))
(assert (let ((.def_1211331 (= t1_pc (_ bv0 32)))).def_1211331))
(assert (let ((.def_1211334 (= t2_pc (_ bv0 32)))).def_1211334))
(assert (let ((.def_1211337 (= t3_pc (_ bv0 32)))).def_1211337))
(assert (let ((.def_1211340 (= t4_pc (_ bv0 32)))).def_1211340))
(assert (let ((.def_1211343 (= t5_pc (_ bv0 32)))).def_1211343))
(assert (let ((.def_1211346 (= t6_pc (_ bv0 32)))).def_1211346))
(assert (let ((.def_1211349 (= t7_pc (_ bv0 32)))).def_1211349))
(assert (let ((.def_1211352 (= t8_pc (_ bv0 32)))).def_1211352))
(assert (let ((.def_1211354 (= m_pc (_ bv1 32)))).def_1211354))
(assert (let ((.def_1211356 (= t1_pc (_ bv1 32)))).def_1211356))
(assert (let ((.def_1211358 (= t2_pc (_ bv1 32)))).def_1211358))
(assert (let ((.def_1211360 (= t3_pc (_ bv1 32)))).def_1211360))
(assert (let ((.def_1211362 (= t4_pc (_ bv1 32)))).def_1211362))
(assert (let ((.def_1211364 (= t5_pc (_ bv1 32)))).def_1211364))
(assert (let ((.def_1211366 (= t6_pc (_ bv1 32)))).def_1211366))
(assert (let ((.def_1211368 (= t7_pc (_ bv1 32)))).def_1211368))
(assert (let ((.def_1211370 (= t8_pc (_ bv1 32)))).def_1211370))

