(set-info :source |printed by MathSAT|)
(declare-fun a20 () (_ BitVec 32))
(declare-fun a2 () (_ BitVec 32))
(declare-fun a27 () (_ BitVec 32))
(declare-fun a16 () (_ BitVec 32))
(declare-fun a15 () (_ BitVec 32))
(declare-fun a12 () (_ BitVec 32))
(declare-fun a25 () (_ BitVec 32))
(declare-fun a9 () (_ BitVec 32))

*:
(assert (let ((.def_106248 (= a20 (_ bv5 32)))).def_106248))

calculate_output8 N29723:
(assert false)
(assert (let ((.def_106248 (= a20 (_ bv5 32)))).def_106248))

main1 N30136:
(assert (let ((.def_153205 (= a2 (_ bv10 32)))).def_153205))
(assert (let ((.def_153208 (= a27 (_ bv1 32)))).def_153208))
(assert (let ((.def_153211 (= a16 (_ bv1 32)))).def_153211))
(assert (let ((.def_153214 (= a15 (_ bv1 32)))).def_153214))
(assert (let ((.def_153217 (= a12 (_ bv4 32)))).def_153217))
(assert (let ((.def_153220 (= a25 (_ bv1 32)))).def_153220))
(assert (let ((.def_106248 (= a20 (_ bv5 32)))).def_106248))
(assert (let ((.def_321196 (= a9 (_ bv18 32)))).def_321196))
(assert (let ((.def_321198 (= a20 (_ bv6 32)))).def_321198))
(assert (let ((.def_321200 (= a12 (_ bv3 32)))).def_321200))
(assert (let ((.def_321202 (= a2 (_ bv13 32)))).def_321202))
(assert (let ((.def_321204 (= a2 (_ bv9 32)))).def_321204))
(assert (let ((.def_321206 (= a12 (_ bv2 32)))).def_321206))
(assert (let ((.def_321208 (= a2 (_ bv11 32)))).def_321208))
(assert (let ((.def_321210 (= a9 (_ bv16 32)))).def_321210))
(assert (let ((.def_321212 (= a9 (_ bv17 32)))).def_321212))

