(set-info :source |printed by MathSAT|)
(declare-fun |ssl3_connect::blastFlag| () (_ BitVec 32))
(declare-fun |ssl3_connect::s__state| () (_ BitVec 32))
(declare-fun |ssl3_connect::skip| () (_ BitVec 32))
(declare-fun |ssl3_connect::cb| () (_ BitVec 32))
(declare-fun |ssl3_connect::s__s3__tmp__reuse_message| () (_ BitVec 32))
(declare-fun |ssl3_connect::s__s3__tmp__next_state___0| () (_ BitVec 32))
(declare-fun |ssl3_connect::s__hit| () (_ BitVec 32))
(declare-fun |ssl3_accept::blastFlag| () (_ BitVec 32))
(declare-fun |ssl3_accept::s__state| () (_ BitVec 32))
(declare-fun |ssl3_accept::s__hit| () (_ BitVec 32))
(declare-fun |ssl3_accept::s__s3__tmp__reuse_message| () (_ BitVec 32))
(declare-fun |ssl3_accept::s__s3__tmp__next_state___0| () (_ BitVec 32))
(declare-fun |ssl3_accept::s__init_buf___0| () (_ BitVec 32))
(declare-fun |ssl3_accept::s__verify_mode| () (_ BitVec 32))
(declare-fun |ssl3_accept::skip| () (_ BitVec 32))
(declare-fun |ssl3_accept::s__session__peer| () (_ BitVec 32))
(declare-fun |ssl3_accept::s__s3__tmp__new_cipher__algorithms| () (_ BitVec 32))
(declare-fun |ssl3_accept::cb| () (_ BitVec 32))

ssl3_connect:
(assert (let ((.def_686 (= |ssl3_connect::blastFlag| (_ bv5 32)))).def_686))

ssl3_connect N126:
(assert (let ((.def_1687 (= |ssl3_connect::s__state| (_ bv12292 32)))).def_1687))
(assert (let ((.def_1689 (= |ssl3_connect::blastFlag| (_ bv0 32)))).def_1689))
(assert (let ((.def_686 (= |ssl3_connect::blastFlag| (_ bv5 32)))).def_686))
(assert (let ((.def_3955 (= |ssl3_connect::skip| (_ bv0 32)))).def_3955))
(assert (let ((.def_3957 (= |ssl3_connect::s__state| (_ bv4368 32)))).def_3957))
(assert (let ((.def_3959 (= |ssl3_connect::blastFlag| (_ bv4 32)))).def_3959))
(assert (let ((.def_3961 (= |ssl3_connect::s__state| (_ bv4384 32)))).def_3961))
(assert (let ((.def_3963 (= |ssl3_connect::blastFlag| (_ bv1 32)))).def_3963))
(assert (let ((.def_3965 (= |ssl3_connect::blastFlag| (_ bv2 32)))).def_3965))
(assert (let ((.def_3967 (= |ssl3_connect::blastFlag| (_ bv3 32)))).def_3967))
(assert (let ((.def_8197 (= |ssl3_connect::s__state| (_ bv4385 32)))).def_8197))
(assert (let ((.def_8199 (= |ssl3_connect::s__state| (_ bv4400 32)))).def_8199))
(assert (let ((.def_8201 (= |ssl3_connect::s__state| (_ bv4433 32)))).def_8201))
(assert (let ((.def_8203 (= |ssl3_connect::s__state| (_ bv4432 32)))).def_8203))
(assert (let ((.def_8205 (= |ssl3_connect::s__state| (_ bv4416 32)))).def_8205))
(assert (let ((.def_15129 (= |ssl3_connect::s__state| (_ bv4099 32)))).def_15129))
(assert (let ((.def_15131 (= |ssl3_connect::s__state| (_ bv20480 32)))).def_15131))
(assert (let ((.def_15133 (= |ssl3_connect::s__state| (_ bv4096 32)))).def_15133))
(assert (let ((.def_15135 (= |ssl3_connect::s__state| (_ bv16384 32)))).def_15135))
(assert (let ((.def_15138 (= |ssl3_connect::cb| (_ bv0 32)))).def_15138))
(assert (let ((.def_15141 (= |ssl3_connect::s__s3__tmp__reuse_message| (_ bv0 32)))).def_15141))
(assert (let ((.def_15143 (= |ssl3_connect::s__state| (_ bv4512 32)))).def_15143))
(assert (let ((.def_15145 (= |ssl3_connect::s__state| (_ bv4369 32)))).def_15145))
(assert (let ((.def_15147 (= |ssl3_connect::s__state| (_ bv4352 32)))).def_15147))
(assert (let ((.def_15150 (= |ssl3_connect::s__s3__tmp__next_state___0| (_ bv4560 32)))).def_15150))
(assert (let ((.def_15153 (= |ssl3_connect::s__hit| (_ bv0 32)))).def_15153))
(assert (let ((.def_15155 (= |ssl3_connect::s__state| (_ bv4480 32)))).def_15155))
(assert (let ((.def_15157 (= |ssl3_connect::s__s3__tmp__next_state___0| (_ bv4496 32)))).def_15157))
(assert (let ((.def_15159 (= |ssl3_connect::s__s3__tmp__next_state___0| (_ bv4480 32)))).def_15159))
(assert (let ((.def_15161 (= |ssl3_connect::s__s3__tmp__next_state___0| (_ bv4464 32)))).def_15161))
(assert (let ((.def_15163 (= |ssl3_connect::s__s3__tmp__next_state___0| (_ bv4448 32)))).def_15163))
(assert (let ((.def_15165 (= |ssl3_connect::s__s3__tmp__next_state___0| (_ bv4432 32)))).def_15165))
(assert (let ((.def_15167 (= |ssl3_connect::s__s3__tmp__next_state___0| (_ bv4400 32)))).def_15167))
(assert (let ((.def_15169 (= |ssl3_connect::s__s3__tmp__next_state___0| (_ bv4384 32)))).def_15169))
(assert (let ((.def_15171 (= |ssl3_connect::s__s3__tmp__next_state___0| (_ bv4368 32)))).def_15171))
(assert (let ((.def_15173 (= |ssl3_connect::s__s3__tmp__next_state___0| (_ bv4512 32)))).def_15173))
(assert (let ((.def_15175 (= |ssl3_connect::s__state| |ssl3_connect::s__s3__tmp__next_state___0|))).def_15175))
(assert (let ((.def_15177 (= |ssl3_connect::s__state| (_ bv4560 32)))).def_15177))
(assert (let ((.def_15179 (= |ssl3_connect::s__state| (_ bv4561 32)))).def_15179))
(assert (let ((.def_15181 (= |ssl3_connect::s__s3__tmp__next_state___0| (_ bv4416 32)))).def_15181))
(assert (let ((.def_15183 (= |ssl3_connect::s__s3__tmp__next_state___0| (_ bv3 32)))).def_15183))
(assert (let ((.def_15185 (= |ssl3_connect::s__state| (_ bv4448 32)))).def_15185))
(assert (let ((.def_15187 (= |ssl3_connect::s__state| (_ bv4464 32)))).def_15187))
(assert (let ((.def_15189 (= |ssl3_connect::s__state| (_ bv4496 32)))).def_15189))
(assert (let ((.def_15191 (= |ssl3_connect::s__state| (_ bv4528 32)))).def_15191))
(assert (let ((.def_15193 (= |ssl3_connect::s__s3__tmp__next_state___0| (_ bv4369 32)))).def_15193))
(assert (let ((.def_15195 (= |ssl3_connect::s__state| (_ bv4513 32)))).def_15195))
(assert (let ((.def_15197 (= |ssl3_connect::s__state| (_ bv4497 32)))).def_15197))
(assert (let ((.def_15199 (= |ssl3_connect::s__state| (_ bv4481 32)))).def_15199))
(assert (let ((.def_15201 (= |ssl3_connect::s__state| (_ bv4467 32)))).def_15201))
(assert (let ((.def_15203 (= |ssl3_connect::s__state| (_ bv4466 32)))).def_15203))
(assert (let ((.def_15205 (= |ssl3_connect::s__state| (_ bv4465 32)))).def_15205))
(assert (let ((.def_15207 (= |ssl3_connect::s__state| (_ bv4449 32)))).def_15207))
(assert (let ((.def_15209 (= |ssl3_connect::s__s3__tmp__next_state___0| (_ bv4385 32)))).def_15209))
(assert (let ((.def_15211 (= |ssl3_connect::s__state| (_ bv4401 32)))).def_15211))
(assert (let ((.def_15213 (= |ssl3_connect::s__s3__tmp__next_state___0| (_ bv4417 32)))).def_15213))
(assert (let ((.def_15215 (= |ssl3_connect::s__s3__tmp__next_state___0| (_ bv4352 32)))).def_15215))
(assert (let ((.def_15217 (= |ssl3_connect::s__s3__tmp__next_state___0| (_ bv4401 32)))).def_15217))
(assert (let ((.def_15219 (= |ssl3_connect::s__state| (_ bv4529 32)))).def_15219))
(assert (let ((.def_15221 (= |ssl3_connect::s__state| (_ bv4417 32)))).def_15221))
(assert (let ((.def_15223 (= |ssl3_connect::s__s3__tmp__next_state___0| (_ bv4433 32)))).def_15223))

ssl3_connect N594:
(assert false)
(assert (let ((.def_686 (= |ssl3_connect::blastFlag| (_ bv5 32)))).def_686))

ssl3_accept N717:
(assert (let ((.def_25915 (= |ssl3_accept::blastFlag| (_ bv4 32)))).def_25915))
(assert (let ((.def_27064 (= |ssl3_accept::s__state| (_ bv8464 32)))).def_27064))
(assert (let ((.def_27066 (= |ssl3_accept::blastFlag| (_ bv0 32)))).def_27066))
(assert (let ((.def_28442 (= |ssl3_accept::s__state| (_ bv8481 32)))).def_28442))
(assert (let ((.def_28444 (= |ssl3_accept::s__state| (_ bv8480 32)))).def_28444))
(assert (let ((.def_28446 (= |ssl3_accept::s__state| (_ bv12292 32)))).def_28446))
(assert (let ((.def_28448 (= |ssl3_accept::s__state| (_ bv16384 32)))).def_28448))
(assert (let ((.def_28450 (= |ssl3_accept::s__state| (_ bv8192 32)))).def_28450))
(assert (let ((.def_28452 (= |ssl3_accept::s__state| (_ bv24576 32)))).def_28452))
(assert (let ((.def_28454 (= |ssl3_accept::s__state| (_ bv8195 32)))).def_28454))
(assert (let ((.def_28456 (= |ssl3_accept::s__state| (_ bv8482 32)))).def_28456))
(assert (let ((.def_28458 (= |ssl3_accept::blastFlag| (_ bv1 32)))).def_28458))
(assert (let ((.def_30404 (= |ssl3_accept::blastFlag| (_ bv3 32)))).def_30404))
(assert (let ((.def_30406 (= |ssl3_accept::blastFlag| (_ bv2 32)))).def_30406))
(assert (let ((.def_30408 (= |ssl3_accept::s__state| (_ bv8496 32)))).def_30408))
(assert (let ((.def_32713 (= |ssl3_accept::s__state| (_ bv8465 32)))).def_32713))
(assert (let ((.def_32715 (= |ssl3_accept::s__state| (_ bv8466 32)))).def_32715))
(assert (let ((.def_32718 (= |ssl3_accept::s__hit| (_ bv0 32)))).def_32718))
(assert (let ((.def_32720 (= |ssl3_accept::s__state| (_ bv8512 32)))).def_32720))
(assert (let ((.def_32722 (= |ssl3_accept::s__state| (_ bv8497 32)))).def_32722))
(assert (let ((.def_32724 (= |ssl3_accept::s__state| (_ bv8641 32)))).def_32724))
(assert (let ((.def_32726 (= |ssl3_accept::s__state| (_ bv8448 32)))).def_32726))
(assert (let ((.def_32728 (= |ssl3_accept::s__state| (_ bv8640 32)))).def_32728))
(assert (let ((.def_35853 (= |ssl3_accept::s__s3__tmp__reuse_message| (_ bv0 32)))).def_35853))
(assert (let ((.def_35855 (= |ssl3_accept::s__state| (_ bv8528 32)))).def_35855))
(assert (let ((.def_35857 (= |ssl3_accept::s__state| (_ bv8544 32)))).def_35857))
(assert (let ((.def_35859 (= |ssl3_accept::s__state| (_ bv8560 32)))).def_35859))
(assert (let ((.def_35861 (= |ssl3_accept::s__state| (_ bv8608 32)))).def_35861))
(assert (let ((.def_35863 (= |ssl3_accept::s__state| (_ bv8609 32)))).def_35863))
(assert (let ((.def_35866 (= |ssl3_accept::s__s3__tmp__next_state___0| (_ bv8482 32)))).def_35866))
(assert (let ((.def_35868 (= |ssl3_accept::s__state| (_ bv8657 32)))).def_35868))
(assert (let ((.def_35870 (= |ssl3_accept::s__state| (_ bv8656 32)))).def_35870))
(assert (let ((.def_35872 (= |ssl3_accept::s__state| (_ bv8592 32)))).def_35872))
(assert (let ((.def_35874 (= |ssl3_accept::s__state| |ssl3_accept::s__s3__tmp__next_state___0|))).def_35874))
(assert (let ((.def_35876 (= |ssl3_accept::s__s3__tmp__next_state___0| (_ bv8576 32)))).def_35876))
(assert (let ((.def_35878 (= |ssl3_accept::s__s3__tmp__next_state___0| (_ bv8640 32)))).def_35878))
(assert (let ((.def_35880 (= |ssl3_accept::s__state| (_ bv8576 32)))).def_35880))
(assert (let ((.def_39746 (= |ssl3_accept::s__state| (_ bv8672 32)))).def_39746))
(assert (let ((.def_39748 (= |ssl3_accept::s__state| (_ bv8593 32)))).def_39748))
(assert (let ((.def_39750 (= |ssl3_accept::s__state| (_ bv8577 32)))).def_39750))
(assert (let ((.def_39752 (= |ssl3_accept::s__state| (_ bv8561 32)))).def_39752))
(assert (let ((.def_39754 (= |ssl3_accept::s__state| (_ bv8545 32)))).def_39754))
(assert (let ((.def_39756 (= |ssl3_accept::s__state| (_ bv8529 32)))).def_39756))
(assert (let ((.def_39758 (= |ssl3_accept::s__state| (_ bv8513 32)))).def_39758))
(assert (let ((.def_39760 (= |ssl3_accept::s__s3__tmp__next_state___0| (_ bv8448 32)))).def_39760))
(assert (let ((.def_39762 (= |ssl3_accept::s__state| (_ bv8673 32)))).def_39762))
(assert (let ((.def_77249 (= |ssl3_accept::s__init_buf___0| (_ bv0 32)))).def_77249))
(assert (let ((.def_77252 (= |ssl3_accept::s__verify_mode| (_ bv4294967295 32)))).def_77252))
(assert (let ((.def_77255 (= |ssl3_accept::skip| (_ bv1 32)))).def_77255))
(assert (let ((.def_77257 (= |ssl3_accept::s__verify_mode| (_ bv4294967294 32)))).def_77257))
(assert (let ((.def_77260 (= |ssl3_accept::s__session__peer| (_ bv0 32)))).def_77260))
(assert (let ((.def_77262 (= |ssl3_accept::s__verify_mode| (_ bv4294967292 32)))).def_77262))
(assert (let ((.def_77264 (= |ssl3_accept::s__s3__tmp__next_state___0| (_ bv8593 32)))).def_77264))
(assert (let ((.def_77266 (= |ssl3_accept::s__s3__tmp__next_state___0| (_ bv8592 32)))).def_77266))
(assert (let ((.def_77268 (= |ssl3_accept::s__s3__tmp__next_state___0| (_ bv8577 32)))).def_77268))
(assert (let ((.def_77270 (= |ssl3_accept::s__s3__tmp__next_state___0| (_ bv8545 32)))).def_77270))
(assert (let ((.def_77272 (= |ssl3_accept::s__s3__tmp__next_state___0| (_ bv8544 32)))).def_77272))
(assert (let ((.def_77274 (= |ssl3_accept::s__s3__tmp__next_state___0| (_ bv8529 32)))).def_77274))
(assert (let ((.def_77276 (= |ssl3_accept::s__s3__tmp__next_state___0| (_ bv8528 32)))).def_77276))
(assert (let ((.def_77278 (= |ssl3_accept::s__s3__tmp__next_state___0| (_ bv8497 32)))).def_77278))
(assert (let ((.def_77280 (= |ssl3_accept::s__s3__tmp__next_state___0| (_ bv8496 32)))).def_77280))
(assert (let ((.def_77282 (= |ssl3_accept::s__s3__tmp__next_state___0| (_ bv8609 32)))).def_77282))
(assert (let ((.def_77284 (= |ssl3_accept::s__s3__tmp__next_state___0| (_ bv8608 32)))).def_77284))
(assert (let ((.def_77286 (= |ssl3_accept::s__s3__tmp__next_state___0| (_ bv8512 32)))).def_77286))
(assert (let ((.def_77288 (= |ssl3_accept::s__s3__tmp__next_state___0| (_ bv8195 32)))).def_77288))
(assert (let ((.def_77290 (= |ssl3_accept::s__s3__tmp__next_state___0| (_ bv24576 32)))).def_77290))
(assert (let ((.def_77292 (= |ssl3_accept::s__s3__tmp__next_state___0| (_ bv8192 32)))).def_77292))
(assert (let ((.def_77294 (= |ssl3_accept::s__s3__tmp__next_state___0| (_ bv16384 32)))).def_77294))
(assert (let ((.def_77296 (= |ssl3_accept::s__s3__tmp__next_state___0| (_ bv12292 32)))).def_77296))
(assert (let ((.def_77298 (= |ssl3_accept::s__s3__tmp__next_state___0| (_ bv8561 32)))).def_77298))
(assert (let ((.def_77300 (= |ssl3_accept::s__s3__tmp__next_state___0| (_ bv8560 32)))).def_77300))
(assert (let ((.def_77303 (= |ssl3_accept::s__s3__tmp__new_cipher__algorithms| (_ bv4294967040 32)))).def_77303))
(assert (let ((.def_77305 (= |ssl3_accept::s__s3__tmp__next_state___0| (_ bv8513 32)))).def_77305))
(assert (let ((.def_77307 (= |ssl3_accept::s__s3__tmp__next_state___0| (_ bv3 32)))).def_77307))
(assert (let ((.def_77309 (= |ssl3_accept::s__s3__tmp__next_state___0| (_ bv8480 32)))).def_77309))
(assert (let ((.def_77311 (= |ssl3_accept::s__s3__tmp__next_state___0| (_ bv8481 32)))).def_77311))
(assert (let ((.def_77313 (= |ssl3_accept::s__s3__tmp__next_state___0| (_ bv8464 32)))).def_77313))
(assert (let ((.def_77315 (= |ssl3_accept::s__s3__tmp__next_state___0| (_ bv8465 32)))).def_77315))
(assert (let ((.def_77317 (= |ssl3_accept::s__s3__tmp__next_state___0| (_ bv8466 32)))).def_77317))
(assert (let ((.def_77319 (= |ssl3_accept::s__s3__tmp__next_state___0| (_ bv8657 32)))).def_77319))
(assert (let ((.def_77321 (= |ssl3_accept::s__s3__tmp__next_state___0| (_ bv8656 32)))).def_77321))
(assert (let ((.def_77324 (= |ssl3_accept::cb| (_ bv0 32)))).def_77324))

ssl3_accept N1237:
(assert false)

