(set-info :source |printed by MathSAT|)
(declare-fun c_last_read () (_ BitVec 32))
(declare-fun p_last_write () (_ BitVec 32))
(declare-fun c_num_read () (_ BitVec 32))
(declare-fun p_num_write () (_ BitVec 32))
(declare-fun c_dr_pc () (_ BitVec 32))
(declare-fun q_free () (_ BitVec 32))
(declare-fun q_buf_0 () (_ BitVec 32))
(declare-fun p_dw_pc () (_ BitVec 32))
(declare-fun q_read_ev () (_ BitVec 32))
(declare-fun c_dr_st () (_ BitVec 32))
(declare-fun p_dw_st () (_ BitVec 32))
(declare-fun m_pc () (_ BitVec 32))
(declare-fun t1_pc () (_ BitVec 32))
(declare-fun t2_pc () (_ BitVec 32))
(declare-fun t3_pc () (_ BitVec 32))
(declare-fun t4_pc () (_ BitVec 32))
(declare-fun m_st () (_ BitVec 32))

*:
(assert (let ((.def_555 (= c_last_read p_last_write))).def_555))
(assert (let ((.def_564 (= c_num_read p_num_write))).def_564))

error1 N4:
(assert false)
(assert (let ((.def_555 (= c_last_read p_last_write))).def_555))
(assert (let ((.def_564 (= c_num_read p_num_write))).def_564))

do_write_p N64:
(assert (let ((.def_899 (= c_dr_pc (_ bv0 32)))).def_899))
(assert (let ((.def_555 (= c_last_read p_last_write))).def_555))
(assert (let ((.def_564 (= c_num_read p_num_write))).def_564))
(assert (let ((.def_1002 (= q_free (_ bv1 32)))).def_1002))
(assert false)
(assert (let ((.def_1345 (= p_last_write q_buf_0))).def_1345))
(assert (let ((.def_1005 (= p_dw_pc (_ bv1 32)))).def_1005))
(assert (let ((.def_1534 (bvadd (_ bv1 32) c_num_read)))(let ((.def_1535 (= p_num_write .def_1534))).def_1535)))
(assert (let ((.def_2426 (= q_free (_ bv0 32)))).def_2426))
(assert (let ((.def_1537 (= c_dr_pc (_ bv1 32)))).def_1537))
(assert (let ((.def_5227 (= q_read_ev (_ bv1 32)))).def_5227))

do_read_c N100:
(assert (let ((.def_1005 (= p_dw_pc (_ bv1 32)))).def_1005))
(assert (let ((.def_1002 (= q_free (_ bv1 32)))).def_1002))
(assert (let ((.def_555 (= c_last_read p_last_write))).def_555))
(assert (let ((.def_564 (= c_num_read p_num_write))).def_564))
(assert (let ((.def_1345 (= p_last_write q_buf_0))).def_1345))
(assert (let ((.def_1534 (bvadd (_ bv1 32) c_num_read)))(let ((.def_1535 (= p_num_write .def_1534))).def_1535)))
(assert (let ((.def_1537 (= c_dr_pc (_ bv1 32)))).def_1537))
(assert false)

eval1 N170:
(assert (let ((.def_899 (= c_dr_pc (_ bv0 32)))).def_899))
(assert (let ((.def_555 (= c_last_read p_last_write))).def_555))
(assert (let ((.def_564 (= c_num_read p_num_write))).def_564))
(assert (let ((.def_1002 (= q_free (_ bv1 32)))).def_1002))
(assert (let ((.def_1275 (= p_dw_pc (_ bv0 32)))).def_1275))
(assert (let ((.def_1537 (= c_dr_pc (_ bv1 32)))).def_1537))
(assert (let ((.def_3849 (= c_dr_st (_ bv0 32)))).def_3849))
(assert (let ((.def_1005 (= p_dw_pc (_ bv1 32)))).def_1005))
(assert (let ((.def_5227 (= q_read_ev (_ bv1 32)))).def_5227))
(assert (let ((.def_5230 (= p_dw_st (_ bv0 32)))).def_5230))
(assert (let ((.def_1345 (= p_last_write q_buf_0))).def_1345))
(assert (let ((.def_1534 (bvadd (_ bv1 32) c_num_read)))(let ((.def_1535 (= p_num_write .def_1534))).def_1535)))

start_simulation1 N221:
(assert (let ((.def_899 (= c_dr_pc (_ bv0 32)))).def_899))
(assert (let ((.def_555 (= c_last_read p_last_write))).def_555))
(assert (let ((.def_564 (= c_num_read p_num_write))).def_564))
(assert (let ((.def_1002 (= q_free (_ bv1 32)))).def_1002))
(assert (let ((.def_1275 (= p_dw_pc (_ bv0 32)))).def_1275))
(assert (let ((.def_5227 (= q_read_ev (_ bv1 32)))).def_5227))

error2 N260:
(assert false)
(assert (let ((.def_555 (= c_last_read p_last_write))).def_555))
(assert (let ((.def_564 (= c_num_read p_num_write))).def_564))

eval2 N569:
(assert (let ((.def_7323 (= m_pc (_ bv0 32)))).def_7323))
(assert (let ((.def_555 (= c_last_read p_last_write))).def_555))
(assert (let ((.def_564 (= c_num_read p_num_write))).def_564))
(assert (let ((.def_9663 (= t1_pc (_ bv0 32)))).def_9663))
(assert (let ((.def_9666 (= t2_pc (_ bv0 32)))).def_9666))
(assert (let ((.def_9669 (= t3_pc (_ bv0 32)))).def_9669))
(assert (let ((.def_9672 (= t4_pc (_ bv0 32)))).def_9672))
(assert (let ((.def_9674 (= m_pc (_ bv1 32)))).def_9674))
(assert (let ((.def_9676 (= t1_pc (_ bv1 32)))).def_9676))
(assert (let ((.def_9678 (= t2_pc (_ bv1 32)))).def_9678))
(assert (let ((.def_9680 (= t3_pc (_ bv1 32)))).def_9680))
(assert (let ((.def_9682 (= t4_pc (_ bv1 32)))).def_9682))
(assert (let ((.def_9685 (= m_st (_ bv0 32)))).def_9685))

start_simulation2 N842:
(assert (let ((.def_7323 (= m_pc (_ bv0 32)))).def_7323))
(assert (let ((.def_555 (= c_last_read p_last_write))).def_555))
(assert (let ((.def_564 (= c_num_read p_num_write))).def_564))
(assert (let ((.def_9663 (= t1_pc (_ bv0 32)))).def_9663))
(assert (let ((.def_9666 (= t2_pc (_ bv0 32)))).def_9666))
(assert (let ((.def_9669 (= t3_pc (_ bv0 32)))).def_9669))
(assert (let ((.def_9672 (= t4_pc (_ bv0 32)))).def_9672))
(assert (let ((.def_9674 (= m_pc (_ bv1 32)))).def_9674))
(assert (let ((.def_9676 (= t1_pc (_ bv1 32)))).def_9676))
(assert (let ((.def_9678 (= t2_pc (_ bv1 32)))).def_9678))
(assert (let ((.def_9680 (= t3_pc (_ bv1 32)))).def_9680))
(assert (let ((.def_9682 (= t4_pc (_ bv1 32)))).def_9682))

