(set-info :source |printed by MathSAT|)
(declare-fun a20 () (_ BitVec 32))
(declare-fun a25 () (_ BitVec 32))
(declare-fun a12 () (_ BitVec 32))
(declare-fun a15 () (_ BitVec 32))
(declare-fun a16 () (_ BitVec 32))
(declare-fun a2 () (_ BitVec 32))
(declare-fun a27 () (_ BitVec 32))
(declare-fun a9 () (_ BitVec 32))
(declare-fun m_pc () (_ BitVec 32))
(declare-fun t1_pc () (_ BitVec 32))
(declare-fun t2_pc () (_ BitVec 32))
(declare-fun t3_pc () (_ BitVec 32))
(declare-fun t4_pc () (_ BitVec 32))
(declare-fun t5_pc () (_ BitVec 32))
(declare-fun t6_pc () (_ BitVec 32))
(declare-fun t7_pc () (_ BitVec 32))
(declare-fun t8_pc () (_ BitVec 32))
(declare-fun t9_pc () (_ BitVec 32))
(declare-fun t10_pc () (_ BitVec 32))
(declare-fun m_st () (_ BitVec 32))
(declare-fun E_8 () (_ BitVec 32))
(declare-fun E_7 () (_ BitVec 32))
(declare-fun E_6 () (_ BitVec 32))
(declare-fun E_5 () (_ BitVec 32))
(declare-fun E_4 () (_ BitVec 32))
(declare-fun E_3 () (_ BitVec 32))
(declare-fun E_2 () (_ BitVec 32))
(declare-fun E_M () (_ BitVec 32))
(declare-fun E_10 () (_ BitVec 32))
(declare-fun E_9 () (_ BitVec 32))
(declare-fun t2_st () (_ BitVec 32))
(declare-fun t3_st () (_ BitVec 32))
(declare-fun t6_st () (_ BitVec 32))
(declare-fun t4_st () (_ BitVec 32))
(declare-fun t7_st () (_ BitVec 32))
(declare-fun t5_st () (_ BitVec 32))
(declare-fun t1_st () (_ BitVec 32))
(declare-fun t8_st () (_ BitVec 32))
(declare-fun t9_st () (_ BitVec 32))
(declare-fun t10_st () (_ BitVec 32))
(declare-fun E_1 () (_ BitVec 32))
(declare-fun local () (_ BitVec 32))
(declare-fun token () (_ BitVec 32))

*:
(assert (let ((.def_107908 (= a20 (_ bv5 32)))).def_107908))

calculate_output8 N30108:
(assert false)
(assert (let ((.def_107908 (= a20 (_ bv5 32)))).def_107908))

main1 N30136:
(assert (let ((.def_107908 (= a20 (_ bv5 32)))).def_107908))
(assert (let ((.def_155646 (= a25 (_ bv1 32)))).def_155646))
(assert (let ((.def_155649 (= a12 (_ bv4 32)))).def_155649))
(assert (let ((.def_155652 (= a15 (_ bv1 32)))).def_155652))
(assert (let ((.def_155655 (= a16 (_ bv1 32)))).def_155655))
(assert (let ((.def_155658 (= a2 (_ bv10 32)))).def_155658))
(assert (let ((.def_155661 (= a27 (_ bv1 32)))).def_155661))
(assert (let ((.def_155664 (= a9 (_ bv18 32)))).def_155664))
(assert (let ((.def_321836 (= a12 (_ bv5 32)))).def_321836))
(assert (let ((.def_321838 (= a2 (_ bv13 32)))).def_321838))
(assert (let ((.def_321840 (= a12 (_ bv2 32)))).def_321840))
(assert (let ((.def_321842 (= a2 (_ bv12 32)))).def_321842))
(assert (let ((.def_321844 (= a12 (_ bv3 32)))).def_321844))
(assert (let ((.def_321846 (= a9 (_ bv16 32)))).def_321846))
(assert (let ((.def_321848 (= a20 (_ bv7 32)))).def_321848))
(assert (let ((.def_321850 (= a2 (_ bv9 32)))).def_321850))
(assert (let ((.def_321852 (= a9 (_ bv17 32)))).def_321852))

error N30154:
(assert false)
(assert (let ((.def_107908 (= a20 (_ bv5 32)))).def_107908))

eval N30774:
(assert (let ((.def_747578 (= m_pc (_ bv0 32)))).def_747578))
(assert (let ((.def_107908 (= a20 (_ bv5 32)))).def_107908))
(assert (let ((.def_756803 (= t1_pc (_ bv0 32)))).def_756803))
(assert (let ((.def_756806 (= t2_pc (_ bv0 32)))).def_756806))
(assert (let ((.def_756809 (= t3_pc (_ bv0 32)))).def_756809))
(assert (let ((.def_756812 (= t4_pc (_ bv0 32)))).def_756812))
(assert (let ((.def_756815 (= t5_pc (_ bv0 32)))).def_756815))
(assert (let ((.def_756818 (= t6_pc (_ bv0 32)))).def_756818))
(assert (let ((.def_756821 (= t7_pc (_ bv0 32)))).def_756821))
(assert (let ((.def_756824 (= t8_pc (_ bv0 32)))).def_756824))
(assert (let ((.def_756827 (= t9_pc (_ bv0 32)))).def_756827))
(assert (let ((.def_756830 (= t10_pc (_ bv0 32)))).def_756830))
(assert (let ((.def_756832 (= m_pc (_ bv1 32)))).def_756832))
(assert (let ((.def_756834 (= t1_pc (_ bv1 32)))).def_756834))
(assert (let ((.def_756836 (= t2_pc (_ bv1 32)))).def_756836))
(assert (let ((.def_756838 (= t3_pc (_ bv1 32)))).def_756838))
(assert (let ((.def_756840 (= t4_pc (_ bv1 32)))).def_756840))
(assert (let ((.def_756842 (= t5_pc (_ bv1 32)))).def_756842))
(assert (let ((.def_756844 (= t6_pc (_ bv1 32)))).def_756844))
(assert (let ((.def_756846 (= t7_pc (_ bv1 32)))).def_756846))
(assert (let ((.def_756848 (= t8_pc (_ bv1 32)))).def_756848))
(assert (let ((.def_756850 (= t9_pc (_ bv1 32)))).def_756850))
(assert (let ((.def_756852 (= t10_pc (_ bv1 32)))).def_756852))
(assert (let ((.def_756855 (= m_st (_ bv0 32)))).def_756855))
(assert (let ((.def_808335 (= E_8 (_ bv1 32)))).def_808335))
(assert (let ((.def_808338 (= E_7 (_ bv1 32)))).def_808338))
(assert (let ((.def_808341 (= E_6 (_ bv1 32)))).def_808341))
(assert (let ((.def_808344 (= E_5 (_ bv1 32)))).def_808344))
(assert (let ((.def_808347 (= E_4 (_ bv1 32)))).def_808347))
(assert (let ((.def_808350 (= E_3 (_ bv1 32)))).def_808350))
(assert (let ((.def_808353 (= E_2 (_ bv1 32)))).def_808353))
(assert (let ((.def_808356 (= E_M (_ bv1 32)))).def_808356))
(assert (let ((.def_808359 (= E_10 (_ bv1 32)))).def_808359))
(assert (let ((.def_808362 (= E_9 (_ bv1 32)))).def_808362))
(assert (let ((.def_808365 (= t2_st (_ bv0 32)))).def_808365))
(assert (let ((.def_808368 (= t3_st (_ bv0 32)))).def_808368))
(assert (let ((.def_808371 (= t6_st (_ bv0 32)))).def_808371))
(assert (let ((.def_808374 (= t4_st (_ bv0 32)))).def_808374))
(assert (let ((.def_808377 (= t7_st (_ bv0 32)))).def_808377))
(assert (let ((.def_808380 (= t5_st (_ bv0 32)))).def_808380))
(assert (let ((.def_808383 (= t1_st (_ bv0 32)))).def_808383))
(assert (let ((.def_808386 (= t8_st (_ bv0 32)))).def_808386))
(assert (let ((.def_808389 (= t9_st (_ bv0 32)))).def_808389))
(assert (let ((.def_808392 (= t10_st (_ bv0 32)))).def_808392))
(assert (let ((.def_808395 (= E_1 (_ bv1 32)))).def_808395))
(assert (let ((.def_808398 (bvadd (_ bv10 32) local)))(let ((.def_808400 (= .def_808398 token))).def_808400)))

start_simulation N31293:
(assert (let ((.def_747578 (= m_pc (_ bv0 32)))).def_747578))
(assert (let ((.def_107908 (= a20 (_ bv5 32)))).def_107908))
(assert (let ((.def_756803 (= t1_pc (_ bv0 32)))).def_756803))
(assert (let ((.def_756806 (= t2_pc (_ bv0 32)))).def_756806))
(assert (let ((.def_756809 (= t3_pc (_ bv0 32)))).def_756809))
(assert (let ((.def_756812 (= t4_pc (_ bv0 32)))).def_756812))
(assert (let ((.def_756815 (= t5_pc (_ bv0 32)))).def_756815))
(assert (let ((.def_756818 (= t6_pc (_ bv0 32)))).def_756818))
(assert (let ((.def_756821 (= t7_pc (_ bv0 32)))).def_756821))
(assert (let ((.def_756824 (= t8_pc (_ bv0 32)))).def_756824))
(assert (let ((.def_756827 (= t9_pc (_ bv0 32)))).def_756827))
(assert (let ((.def_756830 (= t10_pc (_ bv0 32)))).def_756830))
(assert (let ((.def_756832 (= m_pc (_ bv1 32)))).def_756832))
(assert (let ((.def_756834 (= t1_pc (_ bv1 32)))).def_756834))
(assert (let ((.def_756836 (= t2_pc (_ bv1 32)))).def_756836))
(assert (let ((.def_756838 (= t3_pc (_ bv1 32)))).def_756838))
(assert (let ((.def_756840 (= t4_pc (_ bv1 32)))).def_756840))
(assert (let ((.def_756842 (= t5_pc (_ bv1 32)))).def_756842))
(assert (let ((.def_756844 (= t6_pc (_ bv1 32)))).def_756844))
(assert (let ((.def_756846 (= t7_pc (_ bv1 32)))).def_756846))
(assert (let ((.def_756848 (= t8_pc (_ bv1 32)))).def_756848))
(assert (let ((.def_756850 (= t9_pc (_ bv1 32)))).def_756850))
(assert (let ((.def_756852 (= t10_pc (_ bv1 32)))).def_756852))
(assert (let ((.def_808335 (= E_8 (_ bv1 32)))).def_808335))
(assert (let ((.def_808338 (= E_7 (_ bv1 32)))).def_808338))
(assert (let ((.def_808341 (= E_6 (_ bv1 32)))).def_808341))
(assert (let ((.def_808344 (= E_5 (_ bv1 32)))).def_808344))
(assert (let ((.def_808347 (= E_4 (_ bv1 32)))).def_808347))
(assert (let ((.def_808350 (= E_3 (_ bv1 32)))).def_808350))
(assert (let ((.def_808353 (= E_2 (_ bv1 32)))).def_808353))
(assert (let ((.def_808356 (= E_M (_ bv1 32)))).def_808356))
(assert (let ((.def_808359 (= E_10 (_ bv1 32)))).def_808359))
(assert (let ((.def_808362 (= E_9 (_ bv1 32)))).def_808362))
(assert (let ((.def_756855 (= m_st (_ bv0 32)))).def_756855))

