(set-info :source |printed by MathSAT|)
(declare-fun |ssl3_connect::blastFlag| () (_ BitVec 32))
(declare-fun |ssl3_connect::s__state| () (_ BitVec 32))
(declare-fun |ssl3_connect::s__hit| () (_ BitVec 32))
(declare-fun |ssl3_connect::s__s3__tmp__next_state___0| () (_ BitVec 32))
(declare-fun |ssl3_connect::s__s3__tmp__new_cipher__algorithms| () (_ BitVec 32))
(declare-fun |ssl3_connect::cb| () (_ BitVec 32))
(declare-fun |ssl3_accept::blastFlag| () (_ BitVec 32))
(declare-fun |ssl3_accept::s__state| () (_ BitVec 32))
(declare-fun |ssl3_accept::s__s3__tmp__reuse_message| () (_ BitVec 32))
(declare-fun |ssl3_accept::cb| () (_ BitVec 32))
(declare-fun |ssl3_accept::s__hit| () (_ BitVec 32))
(declare-fun |ssl3_accept::s__s3__tmp__next_state___0| () (_ BitVec 32))

ssl3_connect:
(assert (let ((.def_678 (= |ssl3_connect::blastFlag| (_ bv5 32)))).def_678))

ssl3_connect N117:
(assert (let ((.def_1600 (= |ssl3_connect::s__state| (_ bv12292 32)))).def_1600))
(assert (let ((.def_1602 (= |ssl3_connect::blastFlag| (_ bv0 32)))).def_1602))
(assert (let ((.def_678 (= |ssl3_connect::blastFlag| (_ bv5 32)))).def_678))
(assert (let ((.def_3687 (= |ssl3_connect::s__state| (_ bv4368 32)))).def_3687))
(assert (let ((.def_3689 (= |ssl3_connect::s__state| (_ bv4384 32)))).def_3689))
(assert (let ((.def_3691 (= |ssl3_connect::blastFlag| (_ bv1 32)))).def_3691))
(assert (let ((.def_5298 (= |ssl3_connect::blastFlag| (_ bv3 32)))).def_5298))
(assert (let ((.def_5300 (= |ssl3_connect::blastFlag| (_ bv4 32)))).def_5300))
(assert (let ((.def_5302 (= |ssl3_connect::blastFlag| (_ bv2 32)))).def_5302))
(assert (let ((.def_5304 (= |ssl3_connect::s__state| (_ bv4416 32)))).def_5304))
(assert (let ((.def_5306 (= |ssl3_connect::s__state| (_ bv4433 32)))).def_5306))
(assert (let ((.def_5308 (= |ssl3_connect::s__state| (_ bv4432 32)))).def_5308))
(assert (let ((.def_10863 (= |ssl3_connect::s__state| (_ bv4099 32)))).def_10863))
(assert (let ((.def_10865 (= |ssl3_connect::s__state| (_ bv20480 32)))).def_10865))
(assert (let ((.def_10867 (= |ssl3_connect::s__state| (_ bv4096 32)))).def_10867))
(assert (let ((.def_10869 (= |ssl3_connect::s__state| (_ bv16384 32)))).def_10869))
(assert (let ((.def_10871 (= |ssl3_connect::s__state| (_ bv4369 32)))).def_10871))
(assert (let ((.def_10873 (= |ssl3_connect::s__state| (_ bv4401 32)))).def_10873))
(assert (let ((.def_10875 (= |ssl3_connect::s__state| (_ bv4400 32)))).def_10875))
(assert (let ((.def_10877 (= |ssl3_connect::s__state| (_ bv4385 32)))).def_10877))
(assert (let ((.def_10879 (= |ssl3_connect::s__state| (_ bv4352 32)))).def_10879))
(assert (let ((.def_16608 (= |ssl3_connect::s__state| (_ bv4560 32)))).def_16608))
(assert (let ((.def_16610 (= |ssl3_connect::s__state| (_ bv4512 32)))).def_16610))
(assert (let ((.def_16612 (= |ssl3_connect::s__state| (_ bv4513 32)))).def_16612))
(assert (let ((.def_16614 (= |ssl3_connect::s__state| (_ bv4481 32)))).def_16614))
(assert (let ((.def_16616 (= |ssl3_connect::s__state| (_ bv4480 32)))).def_16616))
(assert (let ((.def_16618 (= |ssl3_connect::s__state| (_ bv4467 32)))).def_16618))
(assert (let ((.def_16620 (= |ssl3_connect::s__state| (_ bv4466 32)))).def_16620))
(assert (let ((.def_16622 (= |ssl3_connect::s__state| (_ bv4465 32)))).def_16622))
(assert (let ((.def_16624 (= |ssl3_connect::s__state| (_ bv4464 32)))).def_16624))
(assert (let ((.def_16626 (= |ssl3_connect::s__state| (_ bv4449 32)))).def_16626))
(assert (let ((.def_16628 (= |ssl3_connect::s__state| (_ bv4448 32)))).def_16628))
(assert (let ((.def_16631 (= |ssl3_connect::s__hit| (_ bv0 32)))).def_16631))
(assert (let ((.def_16633 (= |ssl3_connect::s__state| (_ bv4417 32)))).def_16633))
(assert (let ((.def_16635 (= |ssl3_connect::s__state| (_ bv4496 32)))).def_16635))
(assert (let ((.def_16637 (= |ssl3_connect::s__state| (_ bv4497 32)))).def_16637))
(assert (let ((.def_16639 (= |ssl3_connect::s__state| (_ bv4528 32)))).def_16639))
(assert (let ((.def_16641 (= |ssl3_connect::s__state| (_ bv4529 32)))).def_16641))
(assert (let ((.def_16643 (= |ssl3_connect::s__state| (_ bv4561 32)))).def_16643))
(assert (let ((.def_16646 (= |ssl3_connect::s__state| |ssl3_connect::s__s3__tmp__next_state___0|))).def_16646))
(assert (let ((.def_16648 (= |ssl3_connect::s__s3__tmp__next_state___0| (_ bv4401 32)))).def_16648))
(assert (let ((.def_16651 (= |ssl3_connect::s__s3__tmp__new_cipher__algorithms| (_ bv4294967040 32)))).def_16651))
(assert (let ((.def_16654 (= |ssl3_connect::cb| (_ bv0 32)))).def_16654))
(assert (let ((.def_29108 (= |ssl3_connect::s__s3__tmp__next_state___0| (_ bv4099 32)))).def_29108))
(assert (let ((.def_29110 (= |ssl3_connect::s__s3__tmp__next_state___0| (_ bv4096 32)))).def_29110))
(assert (let ((.def_29112 (= |ssl3_connect::s__s3__tmp__next_state___0| (_ bv20480 32)))).def_29112))
(assert (let ((.def_29114 (= |ssl3_connect::s__s3__tmp__next_state___0| (_ bv16384 32)))).def_29114))
(assert (let ((.def_29116 (= |ssl3_connect::s__s3__tmp__next_state___0| (_ bv12292 32)))).def_29116))
(assert (let ((.def_29118 (= |ssl3_connect::s__s3__tmp__next_state___0| (_ bv4369 32)))).def_29118))
(assert (let ((.def_29120 (= |ssl3_connect::s__s3__tmp__next_state___0| (_ bv4368 32)))).def_29120))
(assert (let ((.def_29122 (= |ssl3_connect::s__s3__tmp__next_state___0| (_ bv4384 32)))).def_29122))
(assert (let ((.def_29124 (= |ssl3_connect::s__s3__tmp__next_state___0| (_ bv4385 32)))).def_29124))
(assert (let ((.def_29126 (= |ssl3_connect::s__s3__tmp__next_state___0| (_ bv4400 32)))).def_29126))
(assert (let ((.def_29128 (= |ssl3_connect::s__s3__tmp__next_state___0| (_ bv4416 32)))).def_29128))
(assert (let ((.def_29130 (= |ssl3_connect::s__s3__tmp__next_state___0| (_ bv4417 32)))).def_29130))
(assert (let ((.def_29132 (= |ssl3_connect::s__s3__tmp__next_state___0| (_ bv4432 32)))).def_29132))
(assert (let ((.def_29134 (= |ssl3_connect::s__s3__tmp__next_state___0| (_ bv4433 32)))).def_29134))

ssl3_connect N576:
(assert false)
(assert (let ((.def_678 (= |ssl3_connect::blastFlag| (_ bv5 32)))).def_678))

ssl3_accept N699:
(assert (let ((.def_41643 (= |ssl3_accept::blastFlag| (_ bv21 32)))).def_41643))
(assert (let ((.def_42993 (= |ssl3_accept::s__state| (_ bv8464 32)))).def_42993))
(assert (let ((.def_42995 (= |ssl3_accept::blastFlag| (_ bv0 32)))).def_42995))
(assert (let ((.def_44641 (= |ssl3_accept::s__state| (_ bv8481 32)))).def_44641))
(assert (let ((.def_44643 (= |ssl3_accept::s__state| (_ bv8480 32)))).def_44643))
(assert (let ((.def_44645 (= |ssl3_accept::s__state| (_ bv12292 32)))).def_44645))
(assert (let ((.def_44647 (= |ssl3_accept::s__state| (_ bv16384 32)))).def_44647))
(assert (let ((.def_44649 (= |ssl3_accept::s__state| (_ bv8192 32)))).def_44649))
(assert (let ((.def_44651 (= |ssl3_accept::s__state| (_ bv24576 32)))).def_44651))
(assert (let ((.def_44653 (= |ssl3_accept::s__state| (_ bv8195 32)))).def_44653))
(assert (let ((.def_44655 (= |ssl3_accept::s__state| (_ bv8482 32)))).def_44655))
(assert (let ((.def_44657 (= |ssl3_accept::s__state| (_ bv8496 32)))).def_44657))
(assert (let ((.def_44660 (= |ssl3_accept::s__s3__tmp__reuse_message| (_ bv0 32)))).def_44660))
(assert (let ((.def_44662 (= |ssl3_accept::blastFlag| (_ bv1 32)))).def_44662))
(assert (let ((.def_47219 (= |ssl3_accept::blastFlag| (_ bv20 32)))).def_47219))
(assert (let ((.def_47222 (= |ssl3_accept::cb| (_ bv0 32)))).def_47222))
(assert (let ((.def_47224 (= |ssl3_accept::s__state| (_ bv8466 32)))).def_47224))
(assert (let ((.def_47226 (= |ssl3_accept::s__state| (_ bv8448 32)))).def_47226))
(assert (let ((.def_47229 (= |ssl3_accept::s__hit| (_ bv0 32)))).def_47229))
(assert (let ((.def_47231 (= |ssl3_accept::s__state| (_ bv8592 32)))).def_47231))
(assert (let ((.def_47233 (= |ssl3_accept::s__state| (_ bv8512 32)))).def_47233))
(assert (let ((.def_47235 (= |ssl3_accept::s__state| (_ bv8528 32)))).def_47235))
(assert (let ((.def_47237 (= |ssl3_accept::s__state| (_ bv8544 32)))).def_47237))
(assert (let ((.def_47239 (= |ssl3_accept::s__state| (_ bv8560 32)))).def_47239))
(assert (let ((.def_47241 (= |ssl3_accept::s__state| (_ bv8497 32)))).def_47241))
(assert (let ((.def_47244 (= |ssl3_accept::s__s3__tmp__next_state___0| (_ bv8576 32)))).def_47244))
(assert (let ((.def_47246 (= |ssl3_accept::s__s3__tmp__next_state___0| (_ bv3 32)))).def_47246))
(assert (let ((.def_47248 (= |ssl3_accept::s__state| (_ bv8576 32)))).def_47248))
(assert (let ((.def_47250 (= |ssl3_accept::s__state| (_ bv8608 32)))).def_47250))
(assert (let ((.def_47252 (= |ssl3_accept::s__state| (_ bv8641 32)))).def_47252))
(assert (let ((.def_47254 (= |ssl3_accept::s__state| (_ bv8640 32)))).def_47254))
(assert (let ((.def_52390 (= |ssl3_accept::s__state| (_ bv8465 32)))).def_52390))
(assert (let ((.def_52392 (= |ssl3_accept::blastFlag| (_ bv6 32)))).def_52392))
(assert (let ((.def_52394 (= |ssl3_accept::blastFlag| (_ bv16 32)))).def_52394))
(assert (let ((.def_52396 (= |ssl3_accept::blastFlag| (_ bv13 32)))).def_52396))
(assert (let ((.def_52398 (= |ssl3_accept::blastFlag| (_ bv10 32)))).def_52398))
(assert (let ((.def_52400 (= |ssl3_accept::blastFlag| (_ bv19 32)))).def_52400))
(assert (let ((.def_52402 (= |ssl3_accept::s__state| (_ bv8656 32)))).def_52402))
(assert (let ((.def_52404 (= |ssl3_accept::s__state| (_ bv8561 32)))).def_52404))
(assert (let ((.def_52406 (= |ssl3_accept::s__state| (_ bv8593 32)))).def_52406))
(assert (let ((.def_52408 (= |ssl3_accept::s__state| (_ bv8577 32)))).def_52408))
(assert (let ((.def_52410 (= |ssl3_accept::s__state| (_ bv8609 32)))).def_52410))
(assert (let ((.def_52412 (= |ssl3_accept::s__state| (_ bv8513 32)))).def_52412))
(assert (let ((.def_52414 (= |ssl3_accept::s__state| (_ bv8529 32)))).def_52414))
(assert (let ((.def_52416 (= |ssl3_accept::s__state| (_ bv8545 32)))).def_52416))
(assert (let ((.def_52418 (= |ssl3_accept::blastFlag| (_ bv5 32)))).def_52418))
(assert (let ((.def_52420 (= |ssl3_accept::blastFlag| (_ bv8 32)))).def_52420))
(assert (let ((.def_52422 (= |ssl3_accept::blastFlag| (_ bv7 32)))).def_52422))
(assert (let ((.def_52424 (= |ssl3_accept::s__s3__tmp__next_state___0| (_ bv8482 32)))).def_52424))
(assert (let ((.def_52426 (= |ssl3_accept::blastFlag| (_ bv14 32)))).def_52426))
(assert (let ((.def_52428 (= |ssl3_accept::blastFlag| (_ bv11 32)))).def_52428))
(assert (let ((.def_52430 (= |ssl3_accept::blastFlag| (_ bv17 32)))).def_52430))
(assert (let ((.def_52432 (= |ssl3_accept::s__state| (_ bv8672 32)))).def_52432))
(assert (let ((.def_52434 (= |ssl3_accept::s__state| (_ bv8673 32)))).def_52434))
(assert (let ((.def_52436 (= |ssl3_accept::s__state| (_ bv8657 32)))).def_52436))

ssl3_accept N1280:
(assert false)

