(set-info :source |printed by MathSAT|)
(declare-fun a20 () (_ BitVec 32))
(declare-fun a9 () (_ BitVec 32))
(declare-fun a25 () (_ BitVec 32))
(declare-fun a12 () (_ BitVec 32))
(declare-fun a15 () (_ BitVec 32))
(declare-fun a16 () (_ BitVec 32))
(declare-fun a2 () (_ BitVec 32))
(declare-fun a27 () (_ BitVec 32))

*:
(assert (let ((.def_105913 (= a20 (_ bv5 32)))).def_105913))

calculate_output8 N29613:
(assert false)
(assert (let ((.def_105913 (= a20 (_ bv5 32)))).def_105913))

main1 N30136:
(assert (let ((.def_152749 (= a9 (_ bv18 32)))).def_152749))
(assert (let ((.def_105913 (= a20 (_ bv5 32)))).def_105913))
(assert (let ((.def_339379 (= a25 (_ bv1 32)))).def_339379))
(assert (let ((.def_339382 (= a12 (_ bv4 32)))).def_339382))
(assert (let ((.def_339385 (= a15 (_ bv1 32)))).def_339385))
(assert (let ((.def_339388 (= a16 (_ bv1 32)))).def_339388))
(assert (let ((.def_339391 (= a2 (_ bv10 32)))).def_339391))
(assert (let ((.def_339394 (= a27 (_ bv1 32)))).def_339394))
(assert (let ((.def_339396 (= a12 (_ bv6 32)))).def_339396))
(assert (let ((.def_339398 (= a20 (_ bv6 32)))).def_339398))
(assert (let ((.def_339400 (= a12 (_ bv3 32)))).def_339400))
(assert (let ((.def_339402 (= a2 (_ bv12 32)))).def_339402))
(assert (let ((.def_339404 (= a12 (_ bv2 32)))).def_339404))
(assert (let ((.def_339406 (= a9 (_ bv16 32)))).def_339406))
(assert (let ((.def_339408 (= a12 (_ bv5 32)))).def_339408))
(assert (let ((.def_339410 (= a9 (_ bv17 32)))).def_339410))
(assert (let ((.def_984424 (= a2 (_ bv11 32)))).def_984424))
(assert (let ((.def_984426 (= a2 (_ bv13 32)))).def_984426))
(assert (let ((.def_984428 (= a25 (_ bv0 32)))).def_984428))
(assert (let ((.def_984430 (= a2 (_ bv9 32)))).def_984430))
(assert (let ((.def_984432 (= a20 (_ bv7 32)))).def_984432))

