(set-info :source |printed by MathSAT|)
(declare-fun a20 () (_ BitVec 32))
(declare-fun a25 () (_ BitVec 32))
(declare-fun a12 () (_ BitVec 32))
(declare-fun a15 () (_ BitVec 32))
(declare-fun a16 () (_ BitVec 32))
(declare-fun a2 () (_ BitVec 32))
(declare-fun a27 () (_ BitVec 32))
(declare-fun a9 () (_ BitVec 32))
(declare-fun m_pc () (_ BitVec 32))
(declare-fun t1_pc () (_ BitVec 32))
(declare-fun t2_pc () (_ BitVec 32))
(declare-fun t3_pc () (_ BitVec 32))
(declare-fun t4_pc () (_ BitVec 32))
(declare-fun m_st () (_ BitVec 32))

*:
(assert (let ((.def_106586 (= a20 (_ bv5 32)))).def_106586))

calculate_output8 N29800:
(assert false)
(assert (let ((.def_106586 (= a20 (_ bv5 32)))).def_106586))

main1 N30136:
(assert (let ((.def_106586 (= a20 (_ bv5 32)))).def_106586))
(assert (let ((.def_153754 (= a25 (_ bv1 32)))).def_153754))
(assert (let ((.def_153757 (= a12 (_ bv4 32)))).def_153757))
(assert (let ((.def_153760 (= a15 (_ bv1 32)))).def_153760))
(assert (let ((.def_153763 (= a16 (_ bv1 32)))).def_153763))
(assert (let ((.def_153766 (= a2 (_ bv10 32)))).def_153766))
(assert (let ((.def_153769 (= a27 (_ bv1 32)))).def_153769))
(assert (let ((.def_153772 (= a9 (_ bv18 32)))).def_153772))
(assert (let ((.def_319634 (= a2 (_ bv11 32)))).def_319634))
(assert (let ((.def_319636 (= a12 (_ bv2 32)))).def_319636))
(assert (let ((.def_319638 (= a9 (_ bv17 32)))).def_319638))
(assert (let ((.def_319640 (= a2 (_ bv13 32)))).def_319640))
(assert (let ((.def_319642 (= a20 (_ bv6 32)))).def_319642))
(assert (let ((.def_319644 (= a12 (_ bv6 32)))).def_319644))
(assert (let ((.def_319646 (= a2 (_ bv9 32)))).def_319646))
(assert (let ((.def_319648 (= a9 (_ bv16 32)))).def_319648))
(assert (let ((.def_1116014 (= a12 (_ bv5 32)))).def_1116014))
(assert (let ((.def_1116016 (= a20 (_ bv7 32)))).def_1116016))
(assert (let ((.def_1116018 (= a2 (_ bv12 32)))).def_1116018))
(assert (let ((.def_1116020 (= a12 (_ bv3 32)))).def_1116020))

error N30154:
(assert false)
(assert (let ((.def_106586 (= a20 (_ bv5 32)))).def_106586))

eval N30463:
(assert (let ((.def_1257753 (= m_pc (_ bv0 32)))).def_1257753))
(assert (let ((.def_106586 (= a20 (_ bv5 32)))).def_106586))
(assert (let ((.def_1260090 (= t1_pc (_ bv0 32)))).def_1260090))
(assert (let ((.def_1260093 (= t2_pc (_ bv0 32)))).def_1260093))
(assert (let ((.def_1260096 (= t3_pc (_ bv0 32)))).def_1260096))
(assert (let ((.def_1260099 (= t4_pc (_ bv0 32)))).def_1260099))
(assert (let ((.def_1260101 (= m_pc (_ bv1 32)))).def_1260101))
(assert (let ((.def_1260103 (= t1_pc (_ bv1 32)))).def_1260103))
(assert (let ((.def_1260105 (= t2_pc (_ bv1 32)))).def_1260105))
(assert (let ((.def_1260107 (= t3_pc (_ bv1 32)))).def_1260107))
(assert (let ((.def_1260109 (= t4_pc (_ bv1 32)))).def_1260109))
(assert (let ((.def_1260112 (= m_st (_ bv0 32)))).def_1260112))

start_simulation N30736:
(assert (let ((.def_1257753 (= m_pc (_ bv0 32)))).def_1257753))
(assert (let ((.def_106586 (= a20 (_ bv5 32)))).def_106586))
(assert (let ((.def_1260090 (= t1_pc (_ bv0 32)))).def_1260090))
(assert (let ((.def_1260093 (= t2_pc (_ bv0 32)))).def_1260093))
(assert (let ((.def_1260096 (= t3_pc (_ bv0 32)))).def_1260096))
(assert (let ((.def_1260099 (= t4_pc (_ bv0 32)))).def_1260099))
(assert (let ((.def_1260101 (= m_pc (_ bv1 32)))).def_1260101))
(assert (let ((.def_1260103 (= t1_pc (_ bv1 32)))).def_1260103))
(assert (let ((.def_1260105 (= t2_pc (_ bv1 32)))).def_1260105))
(assert (let ((.def_1260107 (= t3_pc (_ bv1 32)))).def_1260107))
(assert (let ((.def_1260109 (= t4_pc (_ bv1 32)))).def_1260109))

