(set-info :source |printed by MathSAT|)
(declare-fun a20 () (_ BitVec 32))
(declare-fun a25 () (_ BitVec 32))
(declare-fun a12 () (_ BitVec 32))
(declare-fun a15 () (_ BitVec 32))
(declare-fun a16 () (_ BitVec 32))
(declare-fun a2 () (_ BitVec 32))
(declare-fun a27 () (_ BitVec 32))
(declare-fun a9 () (_ BitVec 32))
(declare-fun m_pc () (_ BitVec 32))
(declare-fun t1_pc () (_ BitVec 32))
(declare-fun t2_pc () (_ BitVec 32))
(declare-fun t3_pc () (_ BitVec 32))
(declare-fun t4_pc () (_ BitVec 32))
(declare-fun t5_pc () (_ BitVec 32))
(declare-fun t6_pc () (_ BitVec 32))
(declare-fun t7_pc () (_ BitVec 32))
(declare-fun t8_pc () (_ BitVec 32))
(declare-fun m_st () (_ BitVec 32))
(declare-fun t4_st () (_ BitVec 32))
(declare-fun t1_st () (_ BitVec 32))
(declare-fun E_5 () (_ BitVec 32))
(declare-fun E_3 () (_ BitVec 32))
(declare-fun E_6 () (_ BitVec 32))
(declare-fun E_4 () (_ BitVec 32))
(declare-fun E_2 () (_ BitVec 32))
(declare-fun E_M () (_ BitVec 32))
(declare-fun E_7 () (_ BitVec 32))
(declare-fun t6_st () (_ BitVec 32))
(declare-fun E_8 () (_ BitVec 32))
(declare-fun t2_st () (_ BitVec 32))
(declare-fun t5_st () (_ BitVec 32))
(declare-fun t3_st () (_ BitVec 32))
(declare-fun t7_st () (_ BitVec 32))
(declare-fun t8_st () (_ BitVec 32))
(declare-fun E_1 () (_ BitVec 32))
(declare-fun local () (_ BitVec 32))
(declare-fun token () (_ BitVec 32))

*:
(assert (let ((.def_107658 (= a20 (_ bv5 32)))).def_107658))

calculate_output8 N30053:
(assert false)
(assert (let ((.def_107658 (= a20 (_ bv5 32)))).def_107658))

main1 N30136:
(assert (let ((.def_107658 (= a20 (_ bv5 32)))).def_107658))
(assert (let ((.def_155245 (= a25 (_ bv1 32)))).def_155245))
(assert (let ((.def_155248 (= a12 (_ bv4 32)))).def_155248))
(assert (let ((.def_155251 (= a15 (_ bv1 32)))).def_155251))
(assert (let ((.def_155254 (= a16 (_ bv1 32)))).def_155254))
(assert (let ((.def_155257 (= a2 (_ bv10 32)))).def_155257))
(assert (let ((.def_155260 (= a27 (_ bv1 32)))).def_155260))
(assert (let ((.def_155263 (= a9 (_ bv18 32)))).def_155263))
(assert (let ((.def_321428 (= a20 (_ bv6 32)))).def_321428))
(assert (let ((.def_321430 (= a12 (_ bv3 32)))).def_321430))
(assert (let ((.def_321432 (= a12 (_ bv6 32)))).def_321432))
(assert (let ((.def_321434 (= a2 (_ bv9 32)))).def_321434))
(assert (let ((.def_321436 (= a9 (_ bv16 32)))).def_321436))
(assert (let ((.def_321438 (= a2 (_ bv12 32)))).def_321438))
(assert (let ((.def_321440 (= a2 (_ bv11 32)))).def_321440))
(assert (let ((.def_321442 (= a9 (_ bv17 32)))).def_321442))
(assert (let ((.def_321444 (= a12 (_ bv2 32)))).def_321444))
(assert (let ((.def_321446 (= a2 (_ bv13 32)))).def_321446))

error N30154:
(assert false)
(assert (let ((.def_107658 (= a20 (_ bv5 32)))).def_107658))

eval N30666:
(assert (let ((.def_747241 (= m_pc (_ bv0 32)))).def_747241))
(assert (let ((.def_107658 (= a20 (_ bv5 32)))).def_107658))
(assert (let ((.def_753649 (= t1_pc (_ bv0 32)))).def_753649))
(assert (let ((.def_753652 (= t2_pc (_ bv0 32)))).def_753652))
(assert (let ((.def_753655 (= t3_pc (_ bv0 32)))).def_753655))
(assert (let ((.def_753658 (= t4_pc (_ bv0 32)))).def_753658))
(assert (let ((.def_753661 (= t5_pc (_ bv0 32)))).def_753661))
(assert (let ((.def_753664 (= t6_pc (_ bv0 32)))).def_753664))
(assert (let ((.def_753667 (= t7_pc (_ bv0 32)))).def_753667))
(assert (let ((.def_753670 (= t8_pc (_ bv0 32)))).def_753670))
(assert (let ((.def_753672 (= m_pc (_ bv1 32)))).def_753672))
(assert (let ((.def_753674 (= t1_pc (_ bv1 32)))).def_753674))
(assert (let ((.def_753676 (= t2_pc (_ bv1 32)))).def_753676))
(assert (let ((.def_753678 (= t3_pc (_ bv1 32)))).def_753678))
(assert (let ((.def_753680 (= t4_pc (_ bv1 32)))).def_753680))
(assert (let ((.def_753682 (= t5_pc (_ bv1 32)))).def_753682))
(assert (let ((.def_753684 (= t6_pc (_ bv1 32)))).def_753684))
(assert (let ((.def_753686 (= t7_pc (_ bv1 32)))).def_753686))
(assert (let ((.def_753688 (= t8_pc (_ bv1 32)))).def_753688))
(assert (let ((.def_753691 (= m_st (_ bv0 32)))).def_753691))
(assert (let ((.def_771316 (= t4_st (_ bv0 32)))).def_771316))
(assert (let ((.def_771319 (= t1_st (_ bv0 32)))).def_771319))
(assert (let ((.def_771322 (= E_5 (_ bv2 32)))).def_771322))
(assert (let ((.def_771325 (= E_3 (_ bv1 32)))).def_771325))
(assert (let ((.def_771328 (= E_6 (_ bv1 32)))).def_771328))
(assert (let ((.def_771330 (= E_5 (_ bv1 32)))).def_771330))
(assert (let ((.def_771333 (= E_4 (_ bv1 32)))).def_771333))
(assert (let ((.def_771336 (= E_2 (_ bv1 32)))).def_771336))
(assert (let ((.def_771339 (= E_M (_ bv1 32)))).def_771339))
(assert (let ((.def_771342 (= E_7 (_ bv1 32)))).def_771342))
(assert (let ((.def_771345 (= t6_st (_ bv0 32)))).def_771345))
(assert (let ((.def_771348 (= E_8 (_ bv1 32)))).def_771348))
(assert (let ((.def_771351 (= t2_st (_ bv0 32)))).def_771351))
(assert (let ((.def_771354 (= t5_st (_ bv0 32)))).def_771354))
(assert (let ((.def_771357 (= t3_st (_ bv0 32)))).def_771357))
(assert (let ((.def_771360 (= t7_st (_ bv0 32)))).def_771360))
(assert (let ((.def_771363 (= t8_st (_ bv0 32)))).def_771363))
(assert (let ((.def_771365 (= m_st (_ bv2 32)))).def_771365))
(assert (let ((.def_771368 (= E_1 (_ bv1 32)))).def_771368))
(assert (let ((.def_771371 (bvadd (_ bv8 32) local)))(let ((.def_771373 (= .def_771371 token))).def_771373)))
(assert (let ((.def_833554 (= local (_ bv0 32)))).def_833554))
(assert (let ((.def_833556 (= token (_ bv0 32)))).def_833556))
(assert (let ((.def_833558 (= E_7 (_ bv2 32)))).def_833558))
(assert (let ((.def_833560 (= E_4 (_ bv2 32)))).def_833560))
(assert (let ((.def_833562 (= E_2 (_ bv2 32)))).def_833562))
(assert (let ((.def_833564 (= E_3 (_ bv2 32)))).def_833564))
(assert (let ((.def_833566 (= E_6 (_ bv2 32)))).def_833566))
(assert (let ((.def_833568 (= t8_st (_ bv2 32)))).def_833568))
(assert (let ((.def_833570 (= t5_st (_ bv2 32)))).def_833570))
(assert (let ((.def_833572 (= t3_st (_ bv2 32)))).def_833572))
(assert (let ((.def_833574 (bvadd (_ bv5 32) local)))(let ((.def_833575 (= token .def_833574))).def_833575)))
(assert (let ((.def_833577 (= local token))).def_833577))
(assert (let ((.def_833579 (bvadd (_ bv7 32) local)))(let ((.def_833580 (= token .def_833579))).def_833580)))
(assert (let ((.def_833582 (bvadd (_ bv3 32) local)))(let ((.def_833583 (= token .def_833582))).def_833583)))
(assert (let ((.def_833585 (bvadd (_ bv4 32) local)))(let ((.def_833586 (= token .def_833585))).def_833586)))
(assert (let ((.def_833588 (bvadd (_ bv6 32) local)))(let ((.def_833589 (= token .def_833588))).def_833589)))
(assert (let ((.def_833591 (bvadd (_ bv2 32) local)))(let ((.def_833592 (= token .def_833591))).def_833592)))
(assert false)
(assert (let ((.def_833596 (bvadd (_ bv1 32) local)))(let ((.def_833597 (= token .def_833596))).def_833597)))

start_simulation N31103:
(assert (let ((.def_747241 (= m_pc (_ bv0 32)))).def_747241))
(assert (let ((.def_107658 (= a20 (_ bv5 32)))).def_107658))
(assert (let ((.def_753649 (= t1_pc (_ bv0 32)))).def_753649))
(assert (let ((.def_753652 (= t2_pc (_ bv0 32)))).def_753652))
(assert (let ((.def_753655 (= t3_pc (_ bv0 32)))).def_753655))
(assert (let ((.def_753658 (= t4_pc (_ bv0 32)))).def_753658))
(assert (let ((.def_753661 (= t5_pc (_ bv0 32)))).def_753661))
(assert (let ((.def_753664 (= t6_pc (_ bv0 32)))).def_753664))
(assert (let ((.def_753667 (= t7_pc (_ bv0 32)))).def_753667))
(assert (let ((.def_753670 (= t8_pc (_ bv0 32)))).def_753670))
(assert (let ((.def_753672 (= m_pc (_ bv1 32)))).def_753672))
(assert (let ((.def_753674 (= t1_pc (_ bv1 32)))).def_753674))
(assert (let ((.def_753676 (= t2_pc (_ bv1 32)))).def_753676))
(assert (let ((.def_753678 (= t3_pc (_ bv1 32)))).def_753678))
(assert (let ((.def_753680 (= t4_pc (_ bv1 32)))).def_753680))
(assert (let ((.def_753682 (= t5_pc (_ bv1 32)))).def_753682))
(assert (let ((.def_753684 (= t6_pc (_ bv1 32)))).def_753684))
(assert (let ((.def_753686 (= t7_pc (_ bv1 32)))).def_753686))
(assert (let ((.def_753688 (= t8_pc (_ bv1 32)))).def_753688))
(assert (let ((.def_771316 (= t4_st (_ bv0 32)))).def_771316))
(assert (let ((.def_771319 (= t1_st (_ bv0 32)))).def_771319))
(assert (let ((.def_771322 (= E_5 (_ bv2 32)))).def_771322))
(assert (let ((.def_771325 (= E_3 (_ bv1 32)))).def_771325))
(assert (let ((.def_771328 (= E_6 (_ bv1 32)))).def_771328))
(assert (let ((.def_771330 (= E_5 (_ bv1 32)))).def_771330))
(assert (let ((.def_771333 (= E_4 (_ bv1 32)))).def_771333))
(assert (let ((.def_771336 (= E_2 (_ bv1 32)))).def_771336))
(assert (let ((.def_771339 (= E_M (_ bv1 32)))).def_771339))
(assert (let ((.def_771342 (= E_7 (_ bv1 32)))).def_771342))
(assert (let ((.def_771345 (= t6_st (_ bv0 32)))).def_771345))
(assert (let ((.def_771348 (= E_8 (_ bv1 32)))).def_771348))
(assert (let ((.def_771351 (= t2_st (_ bv0 32)))).def_771351))
(assert (let ((.def_753691 (= m_st (_ bv0 32)))).def_753691))
(assert (let ((.def_833554 (= local (_ bv0 32)))).def_833554))
(assert (let ((.def_833556 (= token (_ bv0 32)))).def_833556))
(assert (let ((.def_833558 (= E_7 (_ bv2 32)))).def_833558))
(assert (let ((.def_833560 (= E_4 (_ bv2 32)))).def_833560))
(assert (let ((.def_833562 (= E_2 (_ bv2 32)))).def_833562))
(assert (let ((.def_833564 (= E_3 (_ bv2 32)))).def_833564))
(assert (let ((.def_833566 (= E_6 (_ bv2 32)))).def_833566))

