(set-info :source |printed by MathSAT|)
(declare-fun |ssl3_connect::blastFlag| () (_ BitVec 32))
(declare-fun |ssl3_connect::s__state| () (_ BitVec 32))
(declare-fun |ssl3_connect::skip| () (_ BitVec 32))
(declare-fun |ssl3_connect::cb| () (_ BitVec 32))
(declare-fun |ssl3_connect::s__s3__tmp__reuse_message| () (_ BitVec 32))
(declare-fun |ssl3_connect::s__s3__tmp__next_state___0| () (_ BitVec 32))
(declare-fun |ssl3_connect::s__hit| () (_ BitVec 32))
(declare-fun |ssl3_accept::blastFlag| () (_ BitVec 32))
(declare-fun |ssl3_accept::s__state| () (_ BitVec 32))
(declare-fun |ssl3_accept::s__s3__tmp__reuse_message| () (_ BitVec 32))
(declare-fun |ssl3_accept::cb| () (_ BitVec 32))
(declare-fun |ssl3_accept::s__hit| () (_ BitVec 32))
(declare-fun |ssl3_accept::s__s3__tmp__next_state___0| () (_ BitVec 32))

ssl3_connect:
(assert (let ((.def_686 (= |ssl3_connect::blastFlag| (_ bv5 32)))).def_686))

ssl3_connect N126:
(assert (let ((.def_1687 (= |ssl3_connect::s__state| (_ bv12292 32)))).def_1687))
(assert (let ((.def_1689 (= |ssl3_connect::blastFlag| (_ bv0 32)))).def_1689))
(assert (let ((.def_686 (= |ssl3_connect::blastFlag| (_ bv5 32)))).def_686))
(assert (let ((.def_3955 (= |ssl3_connect::skip| (_ bv0 32)))).def_3955))
(assert (let ((.def_3957 (= |ssl3_connect::s__state| (_ bv4368 32)))).def_3957))
(assert (let ((.def_3959 (= |ssl3_connect::blastFlag| (_ bv4 32)))).def_3959))
(assert (let ((.def_3961 (= |ssl3_connect::s__state| (_ bv4384 32)))).def_3961))
(assert (let ((.def_3963 (= |ssl3_connect::blastFlag| (_ bv1 32)))).def_3963))
(assert (let ((.def_3965 (= |ssl3_connect::blastFlag| (_ bv2 32)))).def_3965))
(assert (let ((.def_3967 (= |ssl3_connect::blastFlag| (_ bv3 32)))).def_3967))
(assert (let ((.def_8197 (= |ssl3_connect::s__state| (_ bv4385 32)))).def_8197))
(assert (let ((.def_8199 (= |ssl3_connect::s__state| (_ bv4400 32)))).def_8199))
(assert (let ((.def_8201 (= |ssl3_connect::s__state| (_ bv4433 32)))).def_8201))
(assert (let ((.def_8203 (= |ssl3_connect::s__state| (_ bv4432 32)))).def_8203))
(assert (let ((.def_8205 (= |ssl3_connect::s__state| (_ bv4416 32)))).def_8205))
(assert (let ((.def_15129 (= |ssl3_connect::s__state| (_ bv4099 32)))).def_15129))
(assert (let ((.def_15131 (= |ssl3_connect::s__state| (_ bv20480 32)))).def_15131))
(assert (let ((.def_15133 (= |ssl3_connect::s__state| (_ bv4096 32)))).def_15133))
(assert (let ((.def_15135 (= |ssl3_connect::s__state| (_ bv16384 32)))).def_15135))
(assert (let ((.def_15138 (= |ssl3_connect::cb| (_ bv0 32)))).def_15138))
(assert (let ((.def_15141 (= |ssl3_connect::s__s3__tmp__reuse_message| (_ bv0 32)))).def_15141))
(assert (let ((.def_15143 (= |ssl3_connect::s__state| (_ bv4512 32)))).def_15143))
(assert (let ((.def_15145 (= |ssl3_connect::s__state| (_ bv4369 32)))).def_15145))
(assert (let ((.def_15147 (= |ssl3_connect::s__state| (_ bv4352 32)))).def_15147))
(assert (let ((.def_15150 (= |ssl3_connect::s__s3__tmp__next_state___0| (_ bv4560 32)))).def_15150))
(assert (let ((.def_15153 (= |ssl3_connect::s__hit| (_ bv0 32)))).def_15153))
(assert (let ((.def_15155 (= |ssl3_connect::s__state| (_ bv4480 32)))).def_15155))
(assert (let ((.def_15157 (= |ssl3_connect::s__s3__tmp__next_state___0| (_ bv4496 32)))).def_15157))
(assert (let ((.def_15159 (= |ssl3_connect::s__s3__tmp__next_state___0| (_ bv4480 32)))).def_15159))
(assert (let ((.def_15161 (= |ssl3_connect::s__s3__tmp__next_state___0| (_ bv4464 32)))).def_15161))
(assert (let ((.def_15163 (= |ssl3_connect::s__s3__tmp__next_state___0| (_ bv4448 32)))).def_15163))
(assert (let ((.def_15165 (= |ssl3_connect::s__s3__tmp__next_state___0| (_ bv4432 32)))).def_15165))
(assert (let ((.def_15167 (= |ssl3_connect::s__s3__tmp__next_state___0| (_ bv4400 32)))).def_15167))
(assert (let ((.def_15169 (= |ssl3_connect::s__s3__tmp__next_state___0| (_ bv4384 32)))).def_15169))
(assert (let ((.def_15171 (= |ssl3_connect::s__s3__tmp__next_state___0| (_ bv4368 32)))).def_15171))
(assert (let ((.def_15173 (= |ssl3_connect::s__s3__tmp__next_state___0| (_ bv4512 32)))).def_15173))
(assert (let ((.def_15175 (= |ssl3_connect::s__state| |ssl3_connect::s__s3__tmp__next_state___0|))).def_15175))
(assert (let ((.def_15177 (= |ssl3_connect::s__state| (_ bv4560 32)))).def_15177))
(assert (let ((.def_15179 (= |ssl3_connect::s__state| (_ bv4561 32)))).def_15179))
(assert (let ((.def_15181 (= |ssl3_connect::s__s3__tmp__next_state___0| (_ bv4416 32)))).def_15181))
(assert (let ((.def_15183 (= |ssl3_connect::s__s3__tmp__next_state___0| (_ bv3 32)))).def_15183))
(assert (let ((.def_15185 (= |ssl3_connect::s__state| (_ bv4448 32)))).def_15185))
(assert (let ((.def_15187 (= |ssl3_connect::s__state| (_ bv4464 32)))).def_15187))
(assert (let ((.def_15189 (= |ssl3_connect::s__state| (_ bv4496 32)))).def_15189))
(assert (let ((.def_15191 (= |ssl3_connect::s__state| (_ bv4528 32)))).def_15191))
(assert (let ((.def_15193 (= |ssl3_connect::s__s3__tmp__next_state___0| (_ bv4369 32)))).def_15193))
(assert (let ((.def_15195 (= |ssl3_connect::s__state| (_ bv4513 32)))).def_15195))
(assert (let ((.def_15197 (= |ssl3_connect::s__state| (_ bv4497 32)))).def_15197))
(assert (let ((.def_15199 (= |ssl3_connect::s__state| (_ bv4481 32)))).def_15199))
(assert (let ((.def_15201 (= |ssl3_connect::s__state| (_ bv4467 32)))).def_15201))
(assert (let ((.def_15203 (= |ssl3_connect::s__state| (_ bv4466 32)))).def_15203))
(assert (let ((.def_15205 (= |ssl3_connect::s__state| (_ bv4465 32)))).def_15205))
(assert (let ((.def_15207 (= |ssl3_connect::s__state| (_ bv4449 32)))).def_15207))
(assert (let ((.def_15209 (= |ssl3_connect::s__s3__tmp__next_state___0| (_ bv4385 32)))).def_15209))
(assert (let ((.def_15211 (= |ssl3_connect::s__state| (_ bv4401 32)))).def_15211))
(assert (let ((.def_15213 (= |ssl3_connect::s__s3__tmp__next_state___0| (_ bv4417 32)))).def_15213))
(assert (let ((.def_15215 (= |ssl3_connect::s__s3__tmp__next_state___0| (_ bv4352 32)))).def_15215))
(assert (let ((.def_15217 (= |ssl3_connect::s__s3__tmp__next_state___0| (_ bv4401 32)))).def_15217))
(assert (let ((.def_15219 (= |ssl3_connect::s__state| (_ bv4529 32)))).def_15219))
(assert (let ((.def_15221 (= |ssl3_connect::s__state| (_ bv4417 32)))).def_15221))
(assert (let ((.def_15223 (= |ssl3_connect::s__s3__tmp__next_state___0| (_ bv4433 32)))).def_15223))

ssl3_connect N594:
(assert false)
(assert (let ((.def_686 (= |ssl3_connect::blastFlag| (_ bv5 32)))).def_686))

ssl3_accept N717:
(assert (let ((.def_26062 (= |ssl3_accept::blastFlag| (_ bv21 32)))).def_26062))
(assert (let ((.def_27412 (= |ssl3_accept::s__state| (_ bv8464 32)))).def_27412))
(assert (let ((.def_27414 (= |ssl3_accept::blastFlag| (_ bv0 32)))).def_27414))
(assert (let ((.def_29060 (= |ssl3_accept::s__state| (_ bv8481 32)))).def_29060))
(assert (let ((.def_29062 (= |ssl3_accept::s__state| (_ bv8480 32)))).def_29062))
(assert (let ((.def_29064 (= |ssl3_accept::s__state| (_ bv12292 32)))).def_29064))
(assert (let ((.def_29066 (= |ssl3_accept::s__state| (_ bv16384 32)))).def_29066))
(assert (let ((.def_29068 (= |ssl3_accept::s__state| (_ bv8192 32)))).def_29068))
(assert (let ((.def_29070 (= |ssl3_accept::s__state| (_ bv24576 32)))).def_29070))
(assert (let ((.def_29072 (= |ssl3_accept::s__state| (_ bv8195 32)))).def_29072))
(assert (let ((.def_29074 (= |ssl3_accept::s__state| (_ bv8482 32)))).def_29074))
(assert (let ((.def_29076 (= |ssl3_accept::s__state| (_ bv8496 32)))).def_29076))
(assert (let ((.def_29079 (= |ssl3_accept::s__s3__tmp__reuse_message| (_ bv0 32)))).def_29079))
(assert (let ((.def_29081 (= |ssl3_accept::blastFlag| (_ bv1 32)))).def_29081))
(assert (let ((.def_31638 (= |ssl3_accept::blastFlag| (_ bv20 32)))).def_31638))
(assert (let ((.def_31641 (= |ssl3_accept::cb| (_ bv0 32)))).def_31641))
(assert (let ((.def_31643 (= |ssl3_accept::s__state| (_ bv8466 32)))).def_31643))
(assert (let ((.def_31645 (= |ssl3_accept::s__state| (_ bv8448 32)))).def_31645))
(assert (let ((.def_31648 (= |ssl3_accept::s__hit| (_ bv0 32)))).def_31648))
(assert (let ((.def_31650 (= |ssl3_accept::s__state| (_ bv8592 32)))).def_31650))
(assert (let ((.def_31652 (= |ssl3_accept::s__state| (_ bv8512 32)))).def_31652))
(assert (let ((.def_31654 (= |ssl3_accept::s__state| (_ bv8528 32)))).def_31654))
(assert (let ((.def_31656 (= |ssl3_accept::s__state| (_ bv8544 32)))).def_31656))
(assert (let ((.def_31658 (= |ssl3_accept::s__state| (_ bv8560 32)))).def_31658))
(assert (let ((.def_31660 (= |ssl3_accept::s__state| (_ bv8497 32)))).def_31660))
(assert (let ((.def_31663 (= |ssl3_accept::s__s3__tmp__next_state___0| (_ bv8576 32)))).def_31663))
(assert (let ((.def_31665 (= |ssl3_accept::s__s3__tmp__next_state___0| (_ bv3 32)))).def_31665))
(assert (let ((.def_31667 (= |ssl3_accept::s__state| (_ bv8576 32)))).def_31667))
(assert (let ((.def_31669 (= |ssl3_accept::s__state| (_ bv8608 32)))).def_31669))
(assert (let ((.def_31671 (= |ssl3_accept::s__state| (_ bv8641 32)))).def_31671))
(assert (let ((.def_31673 (= |ssl3_accept::s__state| (_ bv8640 32)))).def_31673))
(assert (let ((.def_36809 (= |ssl3_accept::s__state| (_ bv8465 32)))).def_36809))
(assert (let ((.def_36811 (= |ssl3_accept::blastFlag| (_ bv6 32)))).def_36811))
(assert (let ((.def_36813 (= |ssl3_accept::blastFlag| (_ bv16 32)))).def_36813))
(assert (let ((.def_36815 (= |ssl3_accept::blastFlag| (_ bv13 32)))).def_36815))
(assert (let ((.def_36817 (= |ssl3_accept::blastFlag| (_ bv10 32)))).def_36817))
(assert (let ((.def_36819 (= |ssl3_accept::blastFlag| (_ bv19 32)))).def_36819))
(assert (let ((.def_36821 (= |ssl3_accept::s__state| (_ bv8656 32)))).def_36821))
(assert (let ((.def_36823 (= |ssl3_accept::s__state| (_ bv8561 32)))).def_36823))
(assert (let ((.def_36825 (= |ssl3_accept::s__state| (_ bv8593 32)))).def_36825))
(assert (let ((.def_36827 (= |ssl3_accept::s__state| (_ bv8577 32)))).def_36827))
(assert (let ((.def_36829 (= |ssl3_accept::s__state| (_ bv8609 32)))).def_36829))
(assert (let ((.def_36831 (= |ssl3_accept::s__state| (_ bv8513 32)))).def_36831))
(assert (let ((.def_36833 (= |ssl3_accept::s__state| (_ bv8529 32)))).def_36833))
(assert (let ((.def_36835 (= |ssl3_accept::s__state| (_ bv8545 32)))).def_36835))
(assert (let ((.def_36837 (= |ssl3_accept::blastFlag| (_ bv5 32)))).def_36837))
(assert (let ((.def_36839 (= |ssl3_accept::blastFlag| (_ bv8 32)))).def_36839))
(assert (let ((.def_36841 (= |ssl3_accept::blastFlag| (_ bv7 32)))).def_36841))
(assert (let ((.def_36843 (= |ssl3_accept::s__s3__tmp__next_state___0| (_ bv8482 32)))).def_36843))
(assert (let ((.def_36845 (= |ssl3_accept::blastFlag| (_ bv14 32)))).def_36845))
(assert (let ((.def_36847 (= |ssl3_accept::blastFlag| (_ bv11 32)))).def_36847))
(assert (let ((.def_36849 (= |ssl3_accept::blastFlag| (_ bv17 32)))).def_36849))
(assert (let ((.def_36851 (= |ssl3_accept::s__state| (_ bv8672 32)))).def_36851))
(assert (let ((.def_36853 (= |ssl3_accept::s__state| (_ bv8673 32)))).def_36853))
(assert (let ((.def_36855 (= |ssl3_accept::s__state| (_ bv8657 32)))).def_36855))

ssl3_accept N1298:
(assert false)

