(set-info :source |printed by MathSAT|)
(declare-fun c_num_read () (_ BitVec 32))
(declare-fun p_num_write () (_ BitVec 32))
(declare-fun c_last_read () (_ BitVec 32))
(declare-fun p_last_write () (_ BitVec 32))
(declare-fun c_dr_pc () (_ BitVec 32))
(declare-fun c_dr_st () (_ BitVec 32))
(declare-fun m_pc () (_ BitVec 32))
(declare-fun t1_pc () (_ BitVec 32))
(declare-fun t2_pc () (_ BitVec 32))
(declare-fun t3_pc () (_ BitVec 32))
(declare-fun m_st () (_ BitVec 32))
(declare-fun E_3 () (_ BitVec 32))
(declare-fun E_M () (_ BitVec 32))
(declare-fun E_2 () (_ BitVec 32))
(declare-fun t3_st () (_ BitVec 32))
(declare-fun t1_st () (_ BitVec 32))
(declare-fun t2_st () (_ BitVec 32))
(declare-fun local () (_ BitVec 32))
(declare-fun token () (_ BitVec 32))
(declare-fun E_1 () (_ BitVec 32))

*:
(assert (let ((.def_662 (= c_num_read p_num_write))).def_662))
(assert (let ((.def_671 (= c_last_read p_last_write))).def_671))

error1 N4:
(assert false)
(assert (let ((.def_662 (= c_num_read p_num_write))).def_662))
(assert (let ((.def_671 (= c_last_read p_last_write))).def_671))

eval1 N282:
(assert (let ((.def_822 (= c_dr_pc (_ bv0 32)))).def_822))
(assert (let ((.def_662 (= c_num_read p_num_write))).def_662))
(assert (let ((.def_671 (= c_last_read p_last_write))).def_671))
(assert (let ((.def_1313 (= c_dr_pc (_ bv2 32)))).def_1313))
(assert (let ((.def_1316 (= c_dr_st (_ bv0 32)))).def_1316))

start_simulation1 N338:
(assert (let ((.def_822 (= c_dr_pc (_ bv0 32)))).def_822))
(assert (let ((.def_662 (= c_num_read p_num_write))).def_662))
(assert (let ((.def_671 (= c_last_read p_last_write))).def_671))
(assert (let ((.def_1313 (= c_dr_pc (_ bv2 32)))).def_1313))

error2 N393:
(assert false)
(assert (let ((.def_662 (= c_num_read p_num_write))).def_662))
(assert (let ((.def_671 (= c_last_read p_last_write))).def_671))

eval2 N635:
(assert (let ((.def_4197 (= m_pc (_ bv0 32)))).def_4197))
(assert (let ((.def_662 (= c_num_read p_num_write))).def_662))
(assert (let ((.def_671 (= c_last_read p_last_write))).def_671))
(assert (let ((.def_5789 (= t1_pc (_ bv0 32)))).def_5789))
(assert (let ((.def_5792 (= t2_pc (_ bv0 32)))).def_5792))
(assert (let ((.def_5795 (= t3_pc (_ bv0 32)))).def_5795))
(assert (let ((.def_5797 (= m_pc (_ bv1 32)))).def_5797))
(assert (let ((.def_5799 (= t1_pc (_ bv1 32)))).def_5799))
(assert (let ((.def_5801 (= t2_pc (_ bv1 32)))).def_5801))
(assert (let ((.def_5803 (= t3_pc (_ bv1 32)))).def_5803))
(assert (let ((.def_5806 (= m_st (_ bv0 32)))).def_5806))
(assert (let ((.def_7867 (= E_3 (_ bv1 32)))).def_7867))
(assert (let ((.def_7870 (= E_M (_ bv1 32)))).def_7870))
(assert (let ((.def_7873 (= E_2 (_ bv1 32)))).def_7873))
(assert (let ((.def_7876 (= t3_st (_ bv0 32)))).def_7876))
(assert (let ((.def_7879 (= t1_st (_ bv0 32)))).def_7879))
(assert (let ((.def_7882 (= t2_st (_ bv0 32)))).def_7882))
(assert (let ((.def_7885 (bvadd (_ bv3 32) local)))(let ((.def_7887 (= .def_7885 token))).def_7887)))
(assert (let ((.def_12630 (= E_2 (_ bv2 32)))).def_12630))
(assert (let ((.def_12633 (= E_1 (_ bv1 32)))).def_12633))
(assert (let ((.def_12635 (= t2_st (_ bv2 32)))).def_12635))
(assert (let ((.def_12637 (= local token))).def_12637))
(assert (let ((.def_12639 (bvadd (_ bv1 32) local)))(let ((.def_12640 (= token .def_12639))).def_12640)))
(assert (let ((.def_12642 (bvadd (_ bv2 32) local)))(let ((.def_12643 (= token .def_12642))).def_12643)))
(assert (let ((.def_16249 (= E_M (_ bv0 32)))).def_16249))
(assert (let ((.def_16251 (= E_3 (_ bv0 32)))).def_16251))
(assert (let ((.def_16253 (= E_2 (_ bv0 32)))).def_16253))
(assert (let ((.def_16255 (= E_1 (_ bv0 32)))).def_16255))

start_simulation2 N867:
(assert (let ((.def_4197 (= m_pc (_ bv0 32)))).def_4197))
(assert (let ((.def_662 (= c_num_read p_num_write))).def_662))
(assert (let ((.def_671 (= c_last_read p_last_write))).def_671))
(assert (let ((.def_5789 (= t1_pc (_ bv0 32)))).def_5789))
(assert (let ((.def_5792 (= t2_pc (_ bv0 32)))).def_5792))
(assert (let ((.def_5795 (= t3_pc (_ bv0 32)))).def_5795))
(assert (let ((.def_5797 (= m_pc (_ bv1 32)))).def_5797))
(assert (let ((.def_5799 (= t1_pc (_ bv1 32)))).def_5799))
(assert (let ((.def_5801 (= t2_pc (_ bv1 32)))).def_5801))
(assert (let ((.def_5803 (= t3_pc (_ bv1 32)))).def_5803))
(assert (let ((.def_7867 (= E_3 (_ bv1 32)))).def_7867))
(assert (let ((.def_7870 (= E_M (_ bv1 32)))).def_7870))
(assert (let ((.def_7873 (= E_2 (_ bv1 32)))).def_7873))
(assert (let ((.def_7876 (= t3_st (_ bv0 32)))).def_7876))
(assert (let ((.def_5806 (= m_st (_ bv0 32)))).def_5806))
(assert (let ((.def_12630 (= E_2 (_ bv2 32)))).def_12630))
(assert (let ((.def_12633 (= E_1 (_ bv1 32)))).def_12633))
(assert (let ((.def_7882 (= t2_st (_ bv0 32)))).def_7882))
(assert (let ((.def_7879 (= t1_st (_ bv0 32)))).def_7879))
(assert (let ((.def_12635 (= t2_st (_ bv2 32)))).def_12635))
(assert (let ((.def_16249 (= E_M (_ bv0 32)))).def_16249))
(assert (let ((.def_16251 (= E_3 (_ bv0 32)))).def_16251))
(assert (let ((.def_16253 (= E_2 (_ bv0 32)))).def_16253))

