(set-info :source |printed by MathSAT|)
(declare-fun c_num_read () (_ BitVec 32))
(declare-fun p_num_write () (_ BitVec 32))
(declare-fun c_last_read () (_ BitVec 32))
(declare-fun p_last_write () (_ BitVec 32))
(declare-fun c_dr_pc () (_ BitVec 32))
(declare-fun c_dr_st () (_ BitVec 32))
(declare-fun m_pc () (_ BitVec 32))
(declare-fun t1_pc () (_ BitVec 32))
(declare-fun t2_pc () (_ BitVec 32))
(declare-fun t3_pc () (_ BitVec 32))
(declare-fun t4_pc () (_ BitVec 32))
(declare-fun t5_pc () (_ BitVec 32))
(declare-fun t6_pc () (_ BitVec 32))
(declare-fun t7_pc () (_ BitVec 32))
(declare-fun t8_pc () (_ BitVec 32))
(declare-fun t9_pc () (_ BitVec 32))
(declare-fun t10_pc () (_ BitVec 32))
(declare-fun t11_pc () (_ BitVec 32))
(declare-fun t12_pc () (_ BitVec 32))
(declare-fun m_st () (_ BitVec 32))

*:
(assert (let ((.def_797 (= c_num_read p_num_write))).def_797))
(assert (let ((.def_806 (= c_last_read p_last_write))).def_806))

error1 N4:
(assert false)
(assert (let ((.def_797 (= c_num_read p_num_write))).def_797))
(assert (let ((.def_806 (= c_last_read p_last_write))).def_806))

eval1 N282:
(assert (let ((.def_957 (= c_dr_pc (_ bv0 32)))).def_957))
(assert (let ((.def_797 (= c_num_read p_num_write))).def_797))
(assert (let ((.def_806 (= c_last_read p_last_write))).def_806))
(assert (let ((.def_1448 (= c_dr_pc (_ bv2 32)))).def_1448))
(assert (let ((.def_1451 (= c_dr_st (_ bv0 32)))).def_1451))

start_simulation1 N338:
(assert (let ((.def_957 (= c_dr_pc (_ bv0 32)))).def_957))
(assert (let ((.def_797 (= c_num_read p_num_write))).def_797))
(assert (let ((.def_806 (= c_last_read p_last_write))).def_806))
(assert (let ((.def_1448 (= c_dr_pc (_ bv2 32)))).def_1448))

error2 N393:
(assert false)
(assert (let ((.def_797 (= c_num_read p_num_write))).def_797))
(assert (let ((.def_806 (= c_last_read p_last_write))).def_806))

eval2 N1121:
(assert (let ((.def_5403 (= m_pc (_ bv0 32)))).def_5403))
(assert (let ((.def_797 (= c_num_read p_num_write))).def_797))
(assert (let ((.def_806 (= c_last_read p_last_write))).def_806))
(assert (let ((.def_17951 (= t1_pc (_ bv0 32)))).def_17951))
(assert (let ((.def_17954 (= t2_pc (_ bv0 32)))).def_17954))
(assert (let ((.def_17957 (= t3_pc (_ bv0 32)))).def_17957))
(assert (let ((.def_17960 (= t4_pc (_ bv0 32)))).def_17960))
(assert (let ((.def_17963 (= t5_pc (_ bv0 32)))).def_17963))
(assert (let ((.def_17966 (= t6_pc (_ bv0 32)))).def_17966))
(assert (let ((.def_17969 (= t7_pc (_ bv0 32)))).def_17969))
(assert (let ((.def_17972 (= t8_pc (_ bv0 32)))).def_17972))
(assert (let ((.def_17975 (= t9_pc (_ bv0 32)))).def_17975))
(assert (let ((.def_17978 (= t10_pc (_ bv0 32)))).def_17978))
(assert (let ((.def_17981 (= t11_pc (_ bv0 32)))).def_17981))
(assert (let ((.def_17984 (= t12_pc (_ bv0 32)))).def_17984))
(assert (let ((.def_17986 (= m_pc (_ bv1 32)))).def_17986))
(assert (let ((.def_17988 (= t1_pc (_ bv1 32)))).def_17988))
(assert (let ((.def_17990 (= t2_pc (_ bv1 32)))).def_17990))
(assert (let ((.def_17992 (= t3_pc (_ bv1 32)))).def_17992))
(assert (let ((.def_17994 (= t4_pc (_ bv1 32)))).def_17994))
(assert (let ((.def_17996 (= t5_pc (_ bv1 32)))).def_17996))
(assert (let ((.def_17998 (= t6_pc (_ bv1 32)))).def_17998))
(assert (let ((.def_18000 (= t7_pc (_ bv1 32)))).def_18000))
(assert (let ((.def_18002 (= t8_pc (_ bv1 32)))).def_18002))
(assert (let ((.def_18004 (= t9_pc (_ bv1 32)))).def_18004))
(assert (let ((.def_18006 (= t10_pc (_ bv1 32)))).def_18006))
(assert (let ((.def_18008 (= t11_pc (_ bv1 32)))).def_18008))
(assert (let ((.def_18010 (= t12_pc (_ bv1 32)))).def_18010))
(assert (let ((.def_18013 (= m_st (_ bv0 32)))).def_18013))

start_simulation2 N1722:
(assert (let ((.def_5403 (= m_pc (_ bv0 32)))).def_5403))
(assert (let ((.def_797 (= c_num_read p_num_write))).def_797))
(assert (let ((.def_806 (= c_last_read p_last_write))).def_806))
(assert (let ((.def_17951 (= t1_pc (_ bv0 32)))).def_17951))
(assert (let ((.def_17954 (= t2_pc (_ bv0 32)))).def_17954))
(assert (let ((.def_17957 (= t3_pc (_ bv0 32)))).def_17957))
(assert (let ((.def_17960 (= t4_pc (_ bv0 32)))).def_17960))
(assert (let ((.def_17963 (= t5_pc (_ bv0 32)))).def_17963))
(assert (let ((.def_17966 (= t6_pc (_ bv0 32)))).def_17966))
(assert (let ((.def_17969 (= t7_pc (_ bv0 32)))).def_17969))
(assert (let ((.def_17972 (= t8_pc (_ bv0 32)))).def_17972))
(assert (let ((.def_17975 (= t9_pc (_ bv0 32)))).def_17975))
(assert (let ((.def_17978 (= t10_pc (_ bv0 32)))).def_17978))
(assert (let ((.def_17981 (= t11_pc (_ bv0 32)))).def_17981))
(assert (let ((.def_17984 (= t12_pc (_ bv0 32)))).def_17984))
(assert (let ((.def_17986 (= m_pc (_ bv1 32)))).def_17986))
(assert (let ((.def_17988 (= t1_pc (_ bv1 32)))).def_17988))
(assert (let ((.def_17990 (= t2_pc (_ bv1 32)))).def_17990))
(assert (let ((.def_17992 (= t3_pc (_ bv1 32)))).def_17992))
(assert (let ((.def_17994 (= t4_pc (_ bv1 32)))).def_17994))
(assert (let ((.def_17996 (= t5_pc (_ bv1 32)))).def_17996))
(assert (let ((.def_17998 (= t6_pc (_ bv1 32)))).def_17998))
(assert (let ((.def_18000 (= t7_pc (_ bv1 32)))).def_18000))
(assert (let ((.def_18002 (= t8_pc (_ bv1 32)))).def_18002))
(assert (let ((.def_18004 (= t9_pc (_ bv1 32)))).def_18004))
(assert (let ((.def_18006 (= t10_pc (_ bv1 32)))).def_18006))
(assert (let ((.def_18008 (= t11_pc (_ bv1 32)))).def_18008))
(assert (let ((.def_18010 (= t12_pc (_ bv1 32)))).def_18010))

