(set-info :source |printed by MathSAT|)
(declare-fun a20 () (_ BitVec 32))
(declare-fun a2 () (_ BitVec 32))
(declare-fun a27 () (_ BitVec 32))
(declare-fun a16 () (_ BitVec 32))
(declare-fun a15 () (_ BitVec 32))
(declare-fun a12 () (_ BitVec 32))
(declare-fun a25 () (_ BitVec 32))
(declare-fun a9 () (_ BitVec 32))

*:
(assert (let ((.def_106323 (= a20 (_ bv5 32)))).def_106323))

calculate_output8 N29723:
(assert false)
(assert (let ((.def_106323 (= a20 (_ bv5 32)))).def_106323))

main1 N30136:
(assert (let ((.def_153305 (= a2 (_ bv10 32)))).def_153305))
(assert (let ((.def_153308 (= a27 (_ bv1 32)))).def_153308))
(assert (let ((.def_153311 (= a16 (_ bv1 32)))).def_153311))
(assert (let ((.def_153314 (= a15 (_ bv1 32)))).def_153314))
(assert (let ((.def_153317 (= a12 (_ bv4 32)))).def_153317))
(assert (let ((.def_153320 (= a25 (_ bv1 32)))).def_153320))
(assert (let ((.def_106323 (= a20 (_ bv5 32)))).def_106323))
(assert (let ((.def_321296 (= a9 (_ bv18 32)))).def_321296))
(assert (let ((.def_321298 (= a20 (_ bv6 32)))).def_321298))
(assert (let ((.def_321300 (= a12 (_ bv3 32)))).def_321300))
(assert (let ((.def_321302 (= a2 (_ bv13 32)))).def_321302))
(assert (let ((.def_321304 (= a2 (_ bv9 32)))).def_321304))
(assert (let ((.def_321306 (= a12 (_ bv2 32)))).def_321306))
(assert (let ((.def_321308 (= a2 (_ bv11 32)))).def_321308))
(assert (let ((.def_321310 (= a9 (_ bv16 32)))).def_321310))
(assert (let ((.def_321312 (= a9 (_ bv17 32)))).def_321312))

