(set-info :source |printed by MathSAT|)
(declare-fun a20 () (_ BitVec 32))
(declare-fun a2 () (_ BitVec 32))
(declare-fun a27 () (_ BitVec 32))
(declare-fun a16 () (_ BitVec 32))
(declare-fun a15 () (_ BitVec 32))
(declare-fun a12 () (_ BitVec 32))
(declare-fun a25 () (_ BitVec 32))
(declare-fun a9 () (_ BitVec 32))

*:
(assert (let ((.def_106233 (= a20 (_ bv5 32)))).def_106233))

calculate_output8 N29723:
(assert false)
(assert (let ((.def_106233 (= a20 (_ bv5 32)))).def_106233))

main1 N30136:
(assert (let ((.def_153185 (= a2 (_ bv10 32)))).def_153185))
(assert (let ((.def_153188 (= a27 (_ bv1 32)))).def_153188))
(assert (let ((.def_153191 (= a16 (_ bv1 32)))).def_153191))
(assert (let ((.def_153194 (= a15 (_ bv1 32)))).def_153194))
(assert (let ((.def_153197 (= a12 (_ bv4 32)))).def_153197))
(assert (let ((.def_153200 (= a25 (_ bv1 32)))).def_153200))
(assert (let ((.def_106233 (= a20 (_ bv5 32)))).def_106233))
(assert (let ((.def_321176 (= a9 (_ bv18 32)))).def_321176))
(assert (let ((.def_321178 (= a20 (_ bv6 32)))).def_321178))
(assert (let ((.def_321180 (= a12 (_ bv3 32)))).def_321180))
(assert (let ((.def_321182 (= a2 (_ bv13 32)))).def_321182))
(assert (let ((.def_321184 (= a2 (_ bv9 32)))).def_321184))
(assert (let ((.def_321186 (= a12 (_ bv2 32)))).def_321186))
(assert (let ((.def_321188 (= a2 (_ bv11 32)))).def_321188))
(assert (let ((.def_321190 (= a9 (_ bv16 32)))).def_321190))
(assert (let ((.def_321192 (= a9 (_ bv17 32)))).def_321192))

