(set-info :source |printed by MathSAT|)
(declare-fun c_last_read () (_ BitVec 32))
(declare-fun p_last_write () (_ BitVec 32))
(declare-fun c_num_read () (_ BitVec 32))
(declare-fun p_num_write () (_ BitVec 32))
(declare-fun c_dr_pc () (_ BitVec 32))
(declare-fun q_free () (_ BitVec 32))
(declare-fun q_buf_0 () (_ BitVec 32))
(declare-fun c_dr_st () (_ BitVec 32))
(declare-fun q_req_up () (_ BitVec 32))
(declare-fun q_write_ev () (_ BitVec 32))
(declare-fun q_read_ev () (_ BitVec 32))
(declare-fun p_dw_pc () (_ BitVec 32))
(declare-fun p_dw_st () (_ BitVec 32))
(declare-fun m_pc () (_ BitVec 32))
(declare-fun t1_pc () (_ BitVec 32))
(declare-fun t2_pc () (_ BitVec 32))
(declare-fun t3_pc () (_ BitVec 32))
(declare-fun t4_pc () (_ BitVec 32))
(declare-fun t5_pc () (_ BitVec 32))
(declare-fun t6_pc () (_ BitVec 32))
(declare-fun t7_pc () (_ BitVec 32))
(declare-fun t8_pc () (_ BitVec 32))
(declare-fun t9_pc () (_ BitVec 32))
(declare-fun t10_pc () (_ BitVec 32))
(declare-fun t11_pc () (_ BitVec 32))
(declare-fun t12_pc () (_ BitVec 32))
(declare-fun t13_pc () (_ BitVec 32))
(declare-fun m_st () (_ BitVec 32))

*:
(assert (let ((.def_679 (= c_last_read p_last_write))).def_679))
(assert (let ((.def_688 (= c_num_read p_num_write))).def_688))

error1 N4:
(assert false)
(assert (let ((.def_679 (= c_last_read p_last_write))).def_679))
(assert (let ((.def_688 (= c_num_read p_num_write))).def_688))

do_write_p N78:
(assert (let ((.def_875 (= c_dr_pc (_ bv0 32)))).def_875))
(assert (let ((.def_679 (= c_last_read p_last_write))).def_679))
(assert (let ((.def_688 (= c_num_read p_num_write))).def_688))
(assert (let ((.def_943 (= q_free (_ bv1 32)))).def_943))
(assert false)
(assert (let ((.def_1127 (= p_last_write q_buf_0))).def_1127))
(assert (let ((.def_1269 (= c_dr_pc (_ bv1 32)))).def_1269))
(assert (let ((.def_1271 (= q_free (_ bv0 32)))).def_1271))
(assert (let ((.def_1275 (bvadd (_ bv1 32) c_num_read)))(let ((.def_1276 (= p_num_write .def_1275))).def_1276)))
(assert (let ((.def_1956 (= c_dr_st (_ bv0 32)))).def_1956))
(assert (let ((.def_4362 (= q_req_up (_ bv1 32)))).def_4362))
(assert (let ((.def_5995 (= q_write_ev (_ bv1 32)))).def_5995))
(assert (let ((.def_5997 (= q_write_ev (_ bv0 32)))).def_5997))
(assert (let ((.def_8330 (= q_read_ev (_ bv1 32)))).def_8330))
(assert (let ((.def_8332 (= q_read_ev (_ bv0 32)))).def_8332))

do_read_c N112:
(assert (let ((.def_943 (= q_free (_ bv1 32)))).def_943))
(assert (let ((.def_679 (= c_last_read p_last_write))).def_679))
(assert (let ((.def_688 (= c_num_read p_num_write))).def_688))
(assert (let ((.def_1127 (= p_last_write q_buf_0))).def_1127))
(assert (let ((.def_1275 (bvadd (_ bv1 32) c_num_read)))(let ((.def_1276 (= p_num_write .def_1275))).def_1276)))
(assert false)
(assert (let ((.def_1271 (= q_free (_ bv0 32)))).def_1271))
(assert (let ((.def_5995 (= q_write_ev (_ bv1 32)))).def_5995))
(assert (let ((.def_5997 (= q_write_ev (_ bv0 32)))).def_5997))
(assert (let ((.def_1273 (= p_dw_pc (_ bv1 32)))).def_1273))
(assert (let ((.def_4362 (= q_req_up (_ bv1 32)))).def_4362))
(assert (let ((.def_2433 (= p_dw_st (_ bv0 32)))).def_2433))
(assert (let ((.def_8330 (= q_read_ev (_ bv1 32)))).def_8330))
(assert (let ((.def_8332 (= q_read_ev (_ bv0 32)))).def_8332))

eval1 N228:
(assert (let ((.def_875 (= c_dr_pc (_ bv0 32)))).def_875))
(assert (let ((.def_679 (= c_last_read p_last_write))).def_679))
(assert (let ((.def_688 (= c_num_read p_num_write))).def_688))
(assert (let ((.def_943 (= q_free (_ bv1 32)))).def_943))
(assert (let ((.def_1085 (= p_dw_pc (_ bv0 32)))).def_1085))
(assert (let ((.def_1269 (= c_dr_pc (_ bv1 32)))).def_1269))
(assert (let ((.def_1271 (= q_free (_ bv0 32)))).def_1271))
(assert (let ((.def_1273 (= p_dw_pc (_ bv1 32)))).def_1273))
(assert (let ((.def_2433 (= p_dw_st (_ bv0 32)))).def_2433))
(assert (let ((.def_1127 (= p_last_write q_buf_0))).def_1127))
(assert (let ((.def_1275 (bvadd (_ bv1 32) c_num_read)))(let ((.def_1276 (= p_num_write .def_1275))).def_1276)))
(assert (let ((.def_1956 (= c_dr_st (_ bv0 32)))).def_1956))
(assert (let ((.def_4362 (= q_req_up (_ bv1 32)))).def_4362))
(assert (let ((.def_5995 (= q_write_ev (_ bv1 32)))).def_5995))
(assert (let ((.def_5997 (= q_write_ev (_ bv0 32)))).def_5997))
(assert (let ((.def_8330 (= q_read_ev (_ bv1 32)))).def_8330))
(assert (let ((.def_8332 (= q_read_ev (_ bv0 32)))).def_8332))

start_simulation1 N283:
(assert (let ((.def_875 (= c_dr_pc (_ bv0 32)))).def_875))
(assert (let ((.def_679 (= c_last_read p_last_write))).def_679))
(assert (let ((.def_688 (= c_num_read p_num_write))).def_688))
(assert (let ((.def_943 (= q_free (_ bv1 32)))).def_943))
(assert (let ((.def_1085 (= p_dw_pc (_ bv0 32)))).def_1085))
(assert (let ((.def_1269 (= c_dr_pc (_ bv1 32)))).def_1269))
(assert (let ((.def_1271 (= q_free (_ bv0 32)))).def_1271))
(assert (let ((.def_1273 (= p_dw_pc (_ bv1 32)))).def_1273))
(assert (let ((.def_1956 (= c_dr_st (_ bv0 32)))).def_1956))
(assert (let ((.def_2433 (= p_dw_st (_ bv0 32)))).def_2433))
(assert (let ((.def_1127 (= p_last_write q_buf_0))).def_1127))
(assert (let ((.def_5995 (= q_write_ev (_ bv1 32)))).def_5995))
(assert (let ((.def_5997 (= q_write_ev (_ bv0 32)))).def_5997))
(assert (let ((.def_8330 (= q_read_ev (_ bv1 32)))).def_8330))
(assert (let ((.def_8332 (= q_read_ev (_ bv0 32)))).def_8332))
(assert (let ((.def_1275 (bvadd (_ bv1 32) c_num_read)))(let ((.def_1276 (= p_num_write .def_1275))).def_1276)))

error2 N328:
(assert false)
(assert (let ((.def_679 (= c_last_read p_last_write))).def_679))
(assert (let ((.def_688 (= c_num_read p_num_write))).def_688))

eval2 N1110:
(assert (let ((.def_11889 (= m_pc (_ bv0 32)))).def_11889))
(assert (let ((.def_679 (= c_last_read p_last_write))).def_679))
(assert (let ((.def_688 (= c_num_read p_num_write))).def_688))
(assert (let ((.def_26289 (= t1_pc (_ bv0 32)))).def_26289))
(assert (let ((.def_26292 (= t2_pc (_ bv0 32)))).def_26292))
(assert (let ((.def_26295 (= t3_pc (_ bv0 32)))).def_26295))
(assert (let ((.def_26298 (= t4_pc (_ bv0 32)))).def_26298))
(assert (let ((.def_26301 (= t5_pc (_ bv0 32)))).def_26301))
(assert (let ((.def_26304 (= t6_pc (_ bv0 32)))).def_26304))
(assert (let ((.def_26307 (= t7_pc (_ bv0 32)))).def_26307))
(assert (let ((.def_26310 (= t8_pc (_ bv0 32)))).def_26310))
(assert (let ((.def_26313 (= t9_pc (_ bv0 32)))).def_26313))
(assert (let ((.def_26316 (= t10_pc (_ bv0 32)))).def_26316))
(assert (let ((.def_26319 (= t11_pc (_ bv0 32)))).def_26319))
(assert (let ((.def_26322 (= t12_pc (_ bv0 32)))).def_26322))
(assert (let ((.def_26325 (= t13_pc (_ bv0 32)))).def_26325))
(assert (let ((.def_26327 (= m_pc (_ bv1 32)))).def_26327))
(assert (let ((.def_26329 (= t1_pc (_ bv1 32)))).def_26329))
(assert (let ((.def_26331 (= t2_pc (_ bv1 32)))).def_26331))
(assert (let ((.def_26333 (= t3_pc (_ bv1 32)))).def_26333))
(assert (let ((.def_26335 (= t4_pc (_ bv1 32)))).def_26335))
(assert (let ((.def_26337 (= t5_pc (_ bv1 32)))).def_26337))
(assert (let ((.def_26339 (= t6_pc (_ bv1 32)))).def_26339))
(assert (let ((.def_26341 (= t7_pc (_ bv1 32)))).def_26341))
(assert (let ((.def_26343 (= t8_pc (_ bv1 32)))).def_26343))
(assert (let ((.def_26345 (= t9_pc (_ bv1 32)))).def_26345))
(assert (let ((.def_26347 (= t10_pc (_ bv1 32)))).def_26347))
(assert (let ((.def_26349 (= t11_pc (_ bv1 32)))).def_26349))
(assert (let ((.def_26351 (= t12_pc (_ bv1 32)))).def_26351))
(assert (let ((.def_26353 (= t13_pc (_ bv1 32)))).def_26353))
(assert (let ((.def_26356 (= m_st (_ bv0 32)))).def_26356))

start_simulation2 N1752:
(assert (let ((.def_11889 (= m_pc (_ bv0 32)))).def_11889))
(assert (let ((.def_679 (= c_last_read p_last_write))).def_679))
(assert (let ((.def_688 (= c_num_read p_num_write))).def_688))
(assert (let ((.def_26289 (= t1_pc (_ bv0 32)))).def_26289))
(assert (let ((.def_26292 (= t2_pc (_ bv0 32)))).def_26292))
(assert (let ((.def_26295 (= t3_pc (_ bv0 32)))).def_26295))
(assert (let ((.def_26298 (= t4_pc (_ bv0 32)))).def_26298))
(assert (let ((.def_26301 (= t5_pc (_ bv0 32)))).def_26301))
(assert (let ((.def_26304 (= t6_pc (_ bv0 32)))).def_26304))
(assert (let ((.def_26307 (= t7_pc (_ bv0 32)))).def_26307))
(assert (let ((.def_26310 (= t8_pc (_ bv0 32)))).def_26310))
(assert (let ((.def_26313 (= t9_pc (_ bv0 32)))).def_26313))
(assert (let ((.def_26316 (= t10_pc (_ bv0 32)))).def_26316))
(assert (let ((.def_26319 (= t11_pc (_ bv0 32)))).def_26319))
(assert (let ((.def_26322 (= t12_pc (_ bv0 32)))).def_26322))
(assert (let ((.def_26325 (= t13_pc (_ bv0 32)))).def_26325))
(assert (let ((.def_26327 (= m_pc (_ bv1 32)))).def_26327))
(assert (let ((.def_26329 (= t1_pc (_ bv1 32)))).def_26329))
(assert (let ((.def_26331 (= t2_pc (_ bv1 32)))).def_26331))
(assert (let ((.def_26333 (= t3_pc (_ bv1 32)))).def_26333))
(assert (let ((.def_26335 (= t4_pc (_ bv1 32)))).def_26335))
(assert (let ((.def_26337 (= t5_pc (_ bv1 32)))).def_26337))
(assert (let ((.def_26339 (= t6_pc (_ bv1 32)))).def_26339))
(assert (let ((.def_26341 (= t7_pc (_ bv1 32)))).def_26341))
(assert (let ((.def_26343 (= t8_pc (_ bv1 32)))).def_26343))
(assert (let ((.def_26345 (= t9_pc (_ bv1 32)))).def_26345))
(assert (let ((.def_26347 (= t10_pc (_ bv1 32)))).def_26347))
(assert (let ((.def_26349 (= t11_pc (_ bv1 32)))).def_26349))
(assert (let ((.def_26351 (= t12_pc (_ bv1 32)))).def_26351))
(assert (let ((.def_26353 (= t13_pc (_ bv1 32)))).def_26353))

