(set-info :source |printed by MathSAT|)
(declare-fun a20 () (_ BitVec 32))
(declare-fun a9 () (_ BitVec 32))
(declare-fun a25 () (_ BitVec 32))
(declare-fun a12 () (_ BitVec 32))
(declare-fun a15 () (_ BitVec 32))
(declare-fun a16 () (_ BitVec 32))
(declare-fun a2 () (_ BitVec 32))
(declare-fun a27 () (_ BitVec 32))

*:
(assert (let ((.def_105898 (= a20 (_ bv5 32)))).def_105898))

calculate_output8 N29613:
(assert false)
(assert (let ((.def_105898 (= a20 (_ bv5 32)))).def_105898))

main1 N30136:
(assert (let ((.def_152729 (= a9 (_ bv18 32)))).def_152729))
(assert (let ((.def_105898 (= a20 (_ bv5 32)))).def_105898))
(assert (let ((.def_339359 (= a25 (_ bv1 32)))).def_339359))
(assert (let ((.def_339362 (= a12 (_ bv4 32)))).def_339362))
(assert (let ((.def_339365 (= a15 (_ bv1 32)))).def_339365))
(assert (let ((.def_339368 (= a16 (_ bv1 32)))).def_339368))
(assert (let ((.def_339371 (= a2 (_ bv10 32)))).def_339371))
(assert (let ((.def_339374 (= a27 (_ bv1 32)))).def_339374))
(assert (let ((.def_339376 (= a12 (_ bv6 32)))).def_339376))
(assert (let ((.def_339378 (= a20 (_ bv6 32)))).def_339378))
(assert (let ((.def_339380 (= a12 (_ bv3 32)))).def_339380))
(assert (let ((.def_339382 (= a2 (_ bv12 32)))).def_339382))
(assert (let ((.def_339384 (= a12 (_ bv2 32)))).def_339384))
(assert (let ((.def_339386 (= a9 (_ bv16 32)))).def_339386))
(assert (let ((.def_339388 (= a12 (_ bv5 32)))).def_339388))
(assert (let ((.def_339390 (= a9 (_ bv17 32)))).def_339390))
(assert (let ((.def_1036200 (= a2 (_ bv9 32)))).def_1036200))
(assert (let ((.def_1036202 (= a2 (_ bv11 32)))).def_1036202))
(assert (let ((.def_1036204 (= a2 (_ bv13 32)))).def_1036204))
(assert (let ((.def_1036206 (= a20 (_ bv7 32)))).def_1036206))

