(set-info :source |printed by MathSAT|)
(declare-fun a20 () (_ BitVec 32))
(declare-fun a25 () (_ BitVec 32))
(declare-fun a12 () (_ BitVec 32))
(declare-fun a15 () (_ BitVec 32))
(declare-fun a16 () (_ BitVec 32))
(declare-fun a2 () (_ BitVec 32))
(declare-fun a27 () (_ BitVec 32))
(declare-fun a9 () (_ BitVec 32))
(declare-fun |calculate_output3::input| () (_ BitVec 32))
(declare-fun |calculate_output4::input| () (_ BitVec 32))
(declare-fun |calculate_output5::input| () (_ BitVec 32))
(declare-fun |calculate_output6::input| () (_ BitVec 32))
(declare-fun |calculate_output7::input| () (_ BitVec 32))

*:
(assert (let ((.def_106706 (= a20 (_ bv5 32)))).def_106706))

calculate_output8 N29800:
(assert false)
(assert (let ((.def_106706 (= a20 (_ bv5 32)))).def_106706))

main1 N30136:
(assert (let ((.def_106706 (= a20 (_ bv5 32)))).def_106706))
(assert (let ((.def_153914 (= a25 (_ bv1 32)))).def_153914))
(assert (let ((.def_153917 (= a12 (_ bv4 32)))).def_153917))
(assert (let ((.def_153920 (= a15 (_ bv1 32)))).def_153920))
(assert (let ((.def_153923 (= a16 (_ bv1 32)))).def_153923))
(assert (let ((.def_153926 (= a2 (_ bv10 32)))).def_153926))
(assert (let ((.def_153929 (= a27 (_ bv1 32)))).def_153929))
(assert (let ((.def_153932 (= a9 (_ bv18 32)))).def_153932))
(assert (let ((.def_319794 (= a2 (_ bv11 32)))).def_319794))
(assert (let ((.def_319796 (= a12 (_ bv2 32)))).def_319796))
(assert (let ((.def_319798 (= a9 (_ bv17 32)))).def_319798))
(assert (let ((.def_319800 (= a2 (_ bv13 32)))).def_319800))
(assert (let ((.def_319802 (= a20 (_ bv6 32)))).def_319802))
(assert (let ((.def_319804 (= a12 (_ bv6 32)))).def_319804))
(assert (let ((.def_319806 (= a2 (_ bv9 32)))).def_319806))
(assert (let ((.def_319808 (= a9 (_ bv16 32)))).def_319808))
(assert (let ((.def_1243079 (= a20 (_ bv7 32)))).def_1243079))
(assert (let ((.def_1243081 (= a12 (_ bv3 32)))).def_1243081))
(assert (let ((.def_1243083 (= a12 (_ bv5 32)))).def_1243083))
(assert (let ((.def_1243085 (= a2 (_ bv12 32)))).def_1243085))
(assert (let ((.def_1243088 (= |calculate_output3::input| (_ bv2 32)))).def_1243088))
(assert (let ((.def_1243090 (= |calculate_output3::input| (_ bv5 32)))).def_1243090))
(assert (let ((.def_1243092 (= |calculate_output3::input| (_ bv3 32)))).def_1243092))
(assert (let ((.def_1243095 (= |calculate_output4::input| (_ bv4 32)))).def_1243095))
(assert (let ((.def_1243098 (= |calculate_output5::input| (_ bv3 32)))).def_1243098))
(assert (let ((.def_1243100 (= |calculate_output3::input| |calculate_output5::input|))).def_1243100))
(assert (let ((.def_1243102 (= |calculate_output5::input| (_ bv2 32)))).def_1243102))
(assert (let ((.def_1243104 (= |calculate_output5::input| (_ bv4 32)))).def_1243104))
(assert (let ((.def_1243106 (= |calculate_output4::input| |calculate_output5::input|))).def_1243106))
(assert (let ((.def_1243108 (= |calculate_output5::input| (_ bv5 32)))).def_1243108))
(assert (let ((.def_1243111 (= |calculate_output6::input| (_ bv5 32)))).def_1243111))
(assert (let ((.def_1243113 (= |calculate_output5::input| |calculate_output6::input|))).def_1243113))
(assert (let ((.def_1243115 (= |calculate_output6::input| (_ bv6 32)))).def_1243115))
(assert (let ((.def_1243117 (= |calculate_output6::input| (_ bv2 32)))).def_1243117))
(assert (let ((.def_1243119 (= |calculate_output6::input| (_ bv4 32)))).def_1243119))
(assert (let ((.def_1243121 (= |calculate_output3::input| (_ bv1 32)))).def_1243121))
(assert (let ((.def_1243123 (= |calculate_output6::input| (_ bv1 32)))).def_1243123))
(assert (let ((.def_1243126 (= |calculate_output7::input| (_ bv6 32)))).def_1243126))
(assert (let ((.def_1243128 (= |calculate_output7::input| (_ bv1 32)))).def_1243128))
(assert (let ((.def_1243130 (= |calculate_output6::input| |calculate_output7::input|))).def_1243130))
(assert (let ((.def_1243132 (= |calculate_output7::input| (_ bv2 32)))).def_1243132))
(assert (let ((.def_1243134 (= |calculate_output7::input| (_ bv5 32)))).def_1243134))
(assert (let ((.def_1243136 (= |calculate_output5::input| (_ bv1 32)))).def_1243136))

