(set-info :source |printed by MathSAT|)
(declare-fun a20 () (_ BitVec 32))
(declare-fun a9 () (_ BitVec 32))
(declare-fun a25 () (_ BitVec 32))
(declare-fun a12 () (_ BitVec 32))
(declare-fun a15 () (_ BitVec 32))
(declare-fun a16 () (_ BitVec 32))
(declare-fun a2 () (_ BitVec 32))
(declare-fun a27 () (_ BitVec 32))

*:
(assert (let ((.def_106222 (= a20 (_ bv5 32)))).def_106222))

calculate_output8 N29679:
(assert false)
(assert (let ((.def_106222 (= a20 (_ bv5 32)))).def_106222))

main1 N30136:
(assert (let ((.def_153160 (= a9 (_ bv18 32)))).def_153160))
(assert (let ((.def_106222 (= a20 (_ bv5 32)))).def_106222))
(assert (let ((.def_339763 (= a25 (_ bv1 32)))).def_339763))
(assert (let ((.def_339766 (= a12 (_ bv4 32)))).def_339766))
(assert (let ((.def_339769 (= a15 (_ bv1 32)))).def_339769))
(assert (let ((.def_339772 (= a16 (_ bv1 32)))).def_339772))
(assert (let ((.def_339775 (= a2 (_ bv10 32)))).def_339775))
(assert (let ((.def_339778 (= a27 (_ bv1 32)))).def_339778))
(assert (let ((.def_339780 (= a2 (_ bv13 32)))).def_339780))
(assert (let ((.def_339782 (= a9 (_ bv17 32)))).def_339782))
(assert (let ((.def_339784 (= a2 (_ bv9 32)))).def_339784))
(assert (let ((.def_339786 (= a2 (_ bv11 32)))).def_339786))
(assert (let ((.def_339788 (= a9 (_ bv16 32)))).def_339788))
(assert (let ((.def_339790 (= a2 (_ bv12 32)))).def_339790))
(assert (let ((.def_873573 (= a20 (_ bv6 32)))).def_873573))
(assert (let ((.def_873575 (= a20 (_ bv7 32)))).def_873575))
(assert (let ((.def_873577 (= a12 (_ bv2 32)))).def_873577))
(assert (let ((.def_873579 (= a12 (_ bv6 32)))).def_873579))
(assert (let ((.def_873581 (= a12 (_ bv3 32)))).def_873581))
(assert (let ((.def_873583 (= a12 (_ bv5 32)))).def_873583))

