(set-info :source |printed by MathSAT|)
(declare-fun c_num_read () (_ BitVec 32))
(declare-fun p_num_write () (_ BitVec 32))
(declare-fun c_last_read () (_ BitVec 32))
(declare-fun p_last_write () (_ BitVec 32))
(declare-fun c_dr_pc () (_ BitVec 32))
(declare-fun c_dr_st () (_ BitVec 32))
(declare-fun m_pc () (_ BitVec 32))
(declare-fun t1_pc () (_ BitVec 32))
(declare-fun t2_pc () (_ BitVec 32))
(declare-fun t3_pc () (_ BitVec 32))
(declare-fun t4_pc () (_ BitVec 32))
(declare-fun t5_pc () (_ BitVec 32))
(declare-fun t6_pc () (_ BitVec 32))
(declare-fun m_st () (_ BitVec 32))
(declare-fun E_4 () (_ BitVec 32))
(declare-fun E_3 () (_ BitVec 32))
(declare-fun E_2 () (_ BitVec 32))
(declare-fun E_5 () (_ BitVec 32))
(declare-fun t6_st () (_ BitVec 32))
(declare-fun t3_st () (_ BitVec 32))
(declare-fun E_6 () (_ BitVec 32))
(declare-fun E_M () (_ BitVec 32))
(declare-fun t1_st () (_ BitVec 32))
(declare-fun t2_st () (_ BitVec 32))
(declare-fun t4_st () (_ BitVec 32))
(declare-fun t5_st () (_ BitVec 32))
(declare-fun E_1 () (_ BitVec 32))
(declare-fun local () (_ BitVec 32))
(declare-fun token () (_ BitVec 32))
(declare-fun T6_E () (_ BitVec 32))
(declare-fun T5_E () (_ BitVec 32))
(declare-fun T4_E () (_ BitVec 32))
(declare-fun T3_E () (_ BitVec 32))
(declare-fun T2_E () (_ BitVec 32))
(declare-fun T1_E () (_ BitVec 32))
(declare-fun M_E () (_ BitVec 32))

*:
(assert (let ((.def_707 (= c_num_read p_num_write))).def_707))
(assert (let ((.def_716 (= c_last_read p_last_write))).def_716))

error1 N4:
(assert false)
(assert (let ((.def_707 (= c_num_read p_num_write))).def_707))
(assert (let ((.def_716 (= c_last_read p_last_write))).def_716))

eval1 N282:
(assert (let ((.def_867 (= c_dr_pc (_ bv0 32)))).def_867))
(assert (let ((.def_707 (= c_num_read p_num_write))).def_707))
(assert (let ((.def_716 (= c_last_read p_last_write))).def_716))
(assert (let ((.def_1358 (= c_dr_pc (_ bv2 32)))).def_1358))
(assert (let ((.def_1361 (= c_dr_st (_ bv0 32)))).def_1361))

start_simulation1 N338:
(assert (let ((.def_867 (= c_dr_pc (_ bv0 32)))).def_867))
(assert (let ((.def_707 (= c_num_read p_num_write))).def_707))
(assert (let ((.def_716 (= c_last_read p_last_write))).def_716))
(assert (let ((.def_1358 (= c_dr_pc (_ bv2 32)))).def_1358))

error2 N393:
(assert false)
(assert (let ((.def_707 (= c_num_read p_num_write))).def_707))
(assert (let ((.def_716 (= c_last_read p_last_write))).def_716))

eval2 N797:
(assert (let ((.def_4599 (= m_pc (_ bv0 32)))).def_4599))
(assert (let ((.def_707 (= c_num_read p_num_write))).def_707))
(assert (let ((.def_716 (= c_last_read p_last_write))).def_716))
(assert (let ((.def_8697 (= t1_pc (_ bv0 32)))).def_8697))
(assert (let ((.def_8700 (= t2_pc (_ bv0 32)))).def_8700))
(assert (let ((.def_8703 (= t3_pc (_ bv0 32)))).def_8703))
(assert (let ((.def_8706 (= t4_pc (_ bv0 32)))).def_8706))
(assert (let ((.def_8709 (= t5_pc (_ bv0 32)))).def_8709))
(assert (let ((.def_8712 (= t6_pc (_ bv0 32)))).def_8712))
(assert (let ((.def_8714 (= m_pc (_ bv1 32)))).def_8714))
(assert (let ((.def_8716 (= t1_pc (_ bv1 32)))).def_8716))
(assert (let ((.def_8718 (= t2_pc (_ bv1 32)))).def_8718))
(assert (let ((.def_8720 (= t3_pc (_ bv1 32)))).def_8720))
(assert (let ((.def_8722 (= t4_pc (_ bv1 32)))).def_8722))
(assert (let ((.def_8724 (= t5_pc (_ bv1 32)))).def_8724))
(assert (let ((.def_8726 (= t6_pc (_ bv1 32)))).def_8726))
(assert (let ((.def_8729 (= m_st (_ bv0 32)))).def_8729))
(assert (let ((.def_15790 (= E_4 (_ bv1 32)))).def_15790))
(assert (let ((.def_15793 (= E_3 (_ bv1 32)))).def_15793))
(assert (let ((.def_15796 (= E_2 (_ bv1 32)))).def_15796))
(assert (let ((.def_15799 (= E_5 (_ bv1 32)))).def_15799))
(assert (let ((.def_15802 (= t6_st (_ bv0 32)))).def_15802))
(assert (let ((.def_15805 (= t3_st (_ bv0 32)))).def_15805))
(assert (let ((.def_15808 (= E_6 (_ bv1 32)))).def_15808))
(assert (let ((.def_15811 (= E_M (_ bv1 32)))).def_15811))
(assert (let ((.def_15814 (= t1_st (_ bv0 32)))).def_15814))
(assert (let ((.def_15817 (= t2_st (_ bv0 32)))).def_15817))
(assert (let ((.def_15820 (= t4_st (_ bv0 32)))).def_15820))
(assert (let ((.def_15823 (= t5_st (_ bv0 32)))).def_15823))
(assert (let ((.def_15826 (= E_1 (_ bv1 32)))).def_15826))
(assert (let ((.def_15829 (bvadd (_ bv6 32) local)))(let ((.def_15831 (= .def_15829 token))).def_15831)))
(assert (let ((.def_36973 (= E_5 (_ bv2 32)))).def_36973))
(assert (let ((.def_36975 (= local (_ bv0 32)))).def_36975))
(assert (let ((.def_36977 (= token (_ bv0 32)))).def_36977))
(assert (let ((.def_36979 (= E_2 (_ bv2 32)))).def_36979))
(assert (let ((.def_36981 (= t4_st (_ bv2 32)))).def_36981))
(assert (let ((.def_36983 (= t5_st (_ bv2 32)))).def_36983))
(assert (let ((.def_36985 (= t6_st (_ bv2 32)))).def_36985))
(assert (let ((.def_36987 (bvadd (_ bv5 32) local)))(let ((.def_36988 (= token .def_36987))).def_36988)))
(assert (let ((.def_36990 (= local token))).def_36990))
(assert (let ((.def_36992 (bvadd (_ bv4 32) local)))(let ((.def_36993 (= token .def_36992))).def_36993)))
(assert (let ((.def_36995 (bvadd (_ bv3 32) local)))(let ((.def_36996 (= token .def_36995))).def_36996)))
(assert (let ((.def_36998 (bvadd (_ bv2 32) local)))(let ((.def_36999 (= token .def_36998))).def_36999)))
(assert (let ((.def_37001 (bvadd (_ bv1 32) local)))(let ((.def_37002 (= token .def_37001))).def_37002)))
(assert (let ((.def_59076 (= T6_E (_ bv0 32)))).def_59076))
(assert (let ((.def_59079 (= T5_E (_ bv0 32)))).def_59079))
(assert (let ((.def_59082 (= T4_E (_ bv0 32)))).def_59082))
(assert (let ((.def_59085 (= T3_E (_ bv0 32)))).def_59085))
(assert (let ((.def_59088 (= T2_E (_ bv0 32)))).def_59088))
(assert (let ((.def_59091 (= T1_E (_ bv0 32)))).def_59091))
(assert (let ((.def_59093 (= E_M (_ bv0 32)))).def_59093))
(assert (let ((.def_59096 (= M_E (_ bv0 32)))).def_59096))
(assert (let ((.def_59098 (= E_1 (_ bv0 32)))).def_59098))
(assert (let ((.def_86142 (= E_4 (_ bv0 32)))).def_86142))
(assert (let ((.def_86144 (= E_5 (_ bv0 32)))).def_86144))
(assert (let ((.def_86146 (= E_3 (_ bv0 32)))).def_86146))
(assert (let ((.def_86148 (= E_2 (_ bv0 32)))).def_86148))
(assert (let ((.def_86150 (= E_6 (_ bv0 32)))).def_86150))
(assert false)

start_simulation2 N1152:
(assert (let ((.def_4599 (= m_pc (_ bv0 32)))).def_4599))
(assert (let ((.def_707 (= c_num_read p_num_write))).def_707))
(assert (let ((.def_716 (= c_last_read p_last_write))).def_716))
(assert (let ((.def_8697 (= t1_pc (_ bv0 32)))).def_8697))
(assert (let ((.def_8700 (= t2_pc (_ bv0 32)))).def_8700))
(assert (let ((.def_8703 (= t3_pc (_ bv0 32)))).def_8703))
(assert (let ((.def_8706 (= t4_pc (_ bv0 32)))).def_8706))
(assert (let ((.def_8709 (= t5_pc (_ bv0 32)))).def_8709))
(assert (let ((.def_8712 (= t6_pc (_ bv0 32)))).def_8712))
(assert (let ((.def_8714 (= m_pc (_ bv1 32)))).def_8714))
(assert (let ((.def_8716 (= t1_pc (_ bv1 32)))).def_8716))
(assert (let ((.def_8718 (= t2_pc (_ bv1 32)))).def_8718))
(assert (let ((.def_8720 (= t3_pc (_ bv1 32)))).def_8720))
(assert (let ((.def_8722 (= t4_pc (_ bv1 32)))).def_8722))
(assert (let ((.def_8724 (= t5_pc (_ bv1 32)))).def_8724))
(assert (let ((.def_8726 (= t6_pc (_ bv1 32)))).def_8726))
(assert (let ((.def_15790 (= E_4 (_ bv1 32)))).def_15790))
(assert (let ((.def_15793 (= E_3 (_ bv1 32)))).def_15793))
(assert (let ((.def_15796 (= E_2 (_ bv1 32)))).def_15796))
(assert (let ((.def_15799 (= E_5 (_ bv1 32)))).def_15799))
(assert (let ((.def_15802 (= t6_st (_ bv0 32)))).def_15802))
(assert (let ((.def_15805 (= t3_st (_ bv0 32)))).def_15805))
(assert (let ((.def_15808 (= E_6 (_ bv1 32)))).def_15808))
(assert (let ((.def_15811 (= E_M (_ bv1 32)))).def_15811))
(assert (let ((.def_15814 (= t1_st (_ bv0 32)))).def_15814))
(assert (let ((.def_15817 (= t2_st (_ bv0 32)))).def_15817))
(assert (let ((.def_8729 (= m_st (_ bv0 32)))).def_8729))
(assert (let ((.def_36973 (= E_5 (_ bv2 32)))).def_36973))
(assert (let ((.def_36975 (= local (_ bv0 32)))).def_36975))
(assert (let ((.def_36977 (= token (_ bv0 32)))).def_36977))
(assert (let ((.def_36979 (= E_2 (_ bv2 32)))).def_36979))
(assert (let ((.def_59076 (= T6_E (_ bv0 32)))).def_59076))
(assert (let ((.def_59079 (= T5_E (_ bv0 32)))).def_59079))
(assert (let ((.def_59082 (= T4_E (_ bv0 32)))).def_59082))
(assert (let ((.def_59085 (= T3_E (_ bv0 32)))).def_59085))
(assert (let ((.def_59088 (= T2_E (_ bv0 32)))).def_59088))
(assert (let ((.def_59091 (= T1_E (_ bv0 32)))).def_59091))
(assert (let ((.def_59093 (= E_M (_ bv0 32)))).def_59093))
(assert (let ((.def_59096 (= M_E (_ bv0 32)))).def_59096))
(assert (let ((.def_15820 (= t4_st (_ bv0 32)))).def_15820))
(assert (let ((.def_15823 (= t5_st (_ bv0 32)))).def_15823))
(assert (let ((.def_86142 (= E_4 (_ bv0 32)))).def_86142))
(assert (let ((.def_86144 (= E_5 (_ bv0 32)))).def_86144))
(assert (let ((.def_86146 (= E_3 (_ bv0 32)))).def_86146))
(assert (let ((.def_86148 (= E_2 (_ bv0 32)))).def_86148))
(assert (let ((.def_86150 (= E_6 (_ bv0 32)))).def_86150))
(assert (let ((.def_59098 (= E_1 (_ bv0 32)))).def_59098))

