(set-info :source |printed by MathSAT|)
(declare-fun a20 () (_ BitVec 32))
(declare-fun a25 () (_ BitVec 32))
(declare-fun a12 () (_ BitVec 32))
(declare-fun a15 () (_ BitVec 32))
(declare-fun a16 () (_ BitVec 32))
(declare-fun a2 () (_ BitVec 32))
(declare-fun a27 () (_ BitVec 32))
(declare-fun a9 () (_ BitVec 32))
(declare-fun |calculate_output2::input| () (_ BitVec 32))
(declare-fun |calculate_output3::input| () (_ BitVec 32))
(declare-fun |calculate_output4::input| () (_ BitVec 32))

*:
(assert (let ((.def_105797 (= a20 (_ bv5 32)))).def_105797))

calculate_output8 N29569:
(assert false)
(assert (let ((.def_105797 (= a20 (_ bv5 32)))).def_105797))

main1 N30136:
(assert (let ((.def_105797 (= a20 (_ bv5 32)))).def_105797))
(assert (let ((.def_152434 (= a25 (_ bv1 32)))).def_152434))
(assert (let ((.def_152437 (= a12 (_ bv4 32)))).def_152437))
(assert (let ((.def_152440 (= a15 (_ bv1 32)))).def_152440))
(assert (let ((.def_152443 (= a16 (_ bv1 32)))).def_152443))
(assert (let ((.def_152446 (= a2 (_ bv10 32)))).def_152446))
(assert (let ((.def_152449 (= a27 (_ bv1 32)))).def_152449))
(assert (let ((.def_152452 (= a9 (_ bv18 32)))).def_152452))
(assert (let ((.def_317508 (= a20 (_ bv6 32)))).def_317508))
(assert (let ((.def_317510 (= a2 (_ bv13 32)))).def_317510))
(assert (let ((.def_317512 (= a12 (_ bv3 32)))).def_317512))
(assert (let ((.def_317514 (= a12 (_ bv2 32)))).def_317514))
(assert (let ((.def_317516 (= a9 (_ bv16 32)))).def_317516))
(assert (let ((.def_317518 (= a9 (_ bv17 32)))).def_317518))
(assert (let ((.def_1028769 (= a2 (_ bv9 32)))).def_1028769))
(assert (let ((.def_1028771 (= a12 (_ bv5 32)))).def_1028771))
(assert (let ((.def_1028773 (= a12 (_ bv6 32)))).def_1028773))
(assert (let ((.def_1028775 (= a2 (_ bv11 32)))).def_1028775))
(assert (let ((.def_1028777 (= a2 (_ bv12 32)))).def_1028777))
(assert (let ((.def_1028779 (= a20 (_ bv7 32)))).def_1028779))
(assert (let ((.def_1028782 (= |calculate_output2::input| (_ bv3 32)))).def_1028782))
(assert (let ((.def_1028784 (= |calculate_output2::input| (_ bv6 32)))).def_1028784))
(assert (let ((.def_1028787 (= |calculate_output3::input| (_ bv1 32)))).def_1028787))
(assert (let ((.def_1028789 (= |calculate_output2::input| (_ bv2 32)))).def_1028789))
(assert (let ((.def_1028791 (= |calculate_output3::input| (_ bv2 32)))).def_1028791))
(assert (let ((.def_1028793 (= |calculate_output2::input| |calculate_output3::input|))).def_1028793))
(assert (let ((.def_1028796 (= |calculate_output3::input| |calculate_output4::input|))).def_1028796))
(assert (let ((.def_1028798 (= |calculate_output4::input| (_ bv2 32)))).def_1028798))

