(set-info :source |printed by MathSAT|)
(declare-fun a20 () (_ BitVec 32))
(declare-fun a25 () (_ BitVec 32))
(declare-fun a12 () (_ BitVec 32))
(declare-fun a15 () (_ BitVec 32))
(declare-fun a16 () (_ BitVec 32))
(declare-fun a2 () (_ BitVec 32))
(declare-fun a27 () (_ BitVec 32))
(declare-fun a9 () (_ BitVec 32))
(declare-fun m_pc () (_ BitVec 32))
(declare-fun t1_pc () (_ BitVec 32))
(declare-fun t2_pc () (_ BitVec 32))
(declare-fun t3_pc () (_ BitVec 32))
(declare-fun t4_pc () (_ BitVec 32))
(declare-fun t5_pc () (_ BitVec 32))
(declare-fun t6_pc () (_ BitVec 32))
(declare-fun t7_pc () (_ BitVec 32))
(declare-fun t8_pc () (_ BitVec 32))
(declare-fun t9_pc () (_ BitVec 32))
(declare-fun t10_pc () (_ BitVec 32))
(declare-fun t11_pc () (_ BitVec 32))
(declare-fun t12_pc () (_ BitVec 32))
(declare-fun t13_pc () (_ BitVec 32))
(declare-fun m_st () (_ BitVec 32))

*:
(assert (let ((.def_107381 (= a20 (_ bv5 32)))).def_107381))

calculate_output8 N29965:
(assert false)
(assert (let ((.def_107381 (= a20 (_ bv5 32)))).def_107381))

main1 N30136:
(assert (let ((.def_107381 (= a20 (_ bv5 32)))).def_107381))
(assert (let ((.def_154822 (= a25 (_ bv1 32)))).def_154822))
(assert (let ((.def_154825 (= a12 (_ bv4 32)))).def_154825))
(assert (let ((.def_154828 (= a15 (_ bv1 32)))).def_154828))
(assert (let ((.def_154831 (= a16 (_ bv1 32)))).def_154831))
(assert (let ((.def_154834 (= a2 (_ bv10 32)))).def_154834))
(assert (let ((.def_154837 (= a27 (_ bv1 32)))).def_154837))
(assert (let ((.def_154840 (= a9 (_ bv18 32)))).def_154840))
(assert (let ((.def_320787 (= a9 (_ bv17 32)))).def_320787))
(assert (let ((.def_320789 (= a2 (_ bv12 32)))).def_320789))
(assert (let ((.def_320791 (= a2 (_ bv11 32)))).def_320791))
(assert (let ((.def_320793 (= a2 (_ bv9 32)))).def_320793))
(assert (let ((.def_320795 (= a12 (_ bv3 32)))).def_320795))
(assert (let ((.def_320797 (= a20 (_ bv6 32)))).def_320797))
(assert (let ((.def_320799 (= a2 (_ bv13 32)))).def_320799))
(assert (let ((.def_320801 (= a9 (_ bv16 32)))).def_320801))
(assert (let ((.def_1060973 (= a12 (_ bv6 32)))).def_1060973))
(assert (let ((.def_1060975 (= a12 (_ bv2 32)))).def_1060975))
(assert (let ((.def_1060977 (= a20 (_ bv7 32)))).def_1060977))

error N30154:
(assert false)
(assert (let ((.def_107381 (= a20 (_ bv5 32)))).def_107381))

eval N30936:
(assert (let ((.def_1137785 (= m_pc (_ bv0 32)))).def_1137785))
(assert (let ((.def_107381 (= a20 (_ bv5 32)))).def_107381))
(assert (let ((.def_1152188 (= t1_pc (_ bv0 32)))).def_1152188))
(assert (let ((.def_1152191 (= t2_pc (_ bv0 32)))).def_1152191))
(assert (let ((.def_1152194 (= t3_pc (_ bv0 32)))).def_1152194))
(assert (let ((.def_1152197 (= t4_pc (_ bv0 32)))).def_1152197))
(assert (let ((.def_1152200 (= t5_pc (_ bv0 32)))).def_1152200))
(assert (let ((.def_1152203 (= t6_pc (_ bv0 32)))).def_1152203))
(assert (let ((.def_1152206 (= t7_pc (_ bv0 32)))).def_1152206))
(assert (let ((.def_1152209 (= t8_pc (_ bv0 32)))).def_1152209))
(assert (let ((.def_1152212 (= t9_pc (_ bv0 32)))).def_1152212))
(assert (let ((.def_1152215 (= t10_pc (_ bv0 32)))).def_1152215))
(assert (let ((.def_1152218 (= t11_pc (_ bv0 32)))).def_1152218))
(assert (let ((.def_1152221 (= t12_pc (_ bv0 32)))).def_1152221))
(assert (let ((.def_1152224 (= t13_pc (_ bv0 32)))).def_1152224))
(assert (let ((.def_1152226 (= m_pc (_ bv1 32)))).def_1152226))
(assert (let ((.def_1152228 (= t1_pc (_ bv1 32)))).def_1152228))
(assert (let ((.def_1152230 (= t2_pc (_ bv1 32)))).def_1152230))
(assert (let ((.def_1152232 (= t3_pc (_ bv1 32)))).def_1152232))
(assert (let ((.def_1152234 (= t4_pc (_ bv1 32)))).def_1152234))
(assert (let ((.def_1152236 (= t5_pc (_ bv1 32)))).def_1152236))
(assert (let ((.def_1152238 (= t6_pc (_ bv1 32)))).def_1152238))
(assert (let ((.def_1152240 (= t7_pc (_ bv1 32)))).def_1152240))
(assert (let ((.def_1152242 (= t8_pc (_ bv1 32)))).def_1152242))
(assert (let ((.def_1152244 (= t9_pc (_ bv1 32)))).def_1152244))
(assert (let ((.def_1152246 (= t10_pc (_ bv1 32)))).def_1152246))
(assert (let ((.def_1152248 (= t11_pc (_ bv1 32)))).def_1152248))
(assert (let ((.def_1152250 (= t12_pc (_ bv1 32)))).def_1152250))
(assert (let ((.def_1152252 (= t13_pc (_ bv1 32)))).def_1152252))
(assert (let ((.def_1152255 (= m_st (_ bv0 32)))).def_1152255))

start_simulation N31578:
(assert (let ((.def_1137785 (= m_pc (_ bv0 32)))).def_1137785))
(assert (let ((.def_107381 (= a20 (_ bv5 32)))).def_107381))
(assert (let ((.def_1152188 (= t1_pc (_ bv0 32)))).def_1152188))
(assert (let ((.def_1152191 (= t2_pc (_ bv0 32)))).def_1152191))
(assert (let ((.def_1152194 (= t3_pc (_ bv0 32)))).def_1152194))
(assert (let ((.def_1152197 (= t4_pc (_ bv0 32)))).def_1152197))
(assert (let ((.def_1152200 (= t5_pc (_ bv0 32)))).def_1152200))
(assert (let ((.def_1152203 (= t6_pc (_ bv0 32)))).def_1152203))
(assert (let ((.def_1152206 (= t7_pc (_ bv0 32)))).def_1152206))
(assert (let ((.def_1152209 (= t8_pc (_ bv0 32)))).def_1152209))
(assert (let ((.def_1152212 (= t9_pc (_ bv0 32)))).def_1152212))
(assert (let ((.def_1152215 (= t10_pc (_ bv0 32)))).def_1152215))
(assert (let ((.def_1152218 (= t11_pc (_ bv0 32)))).def_1152218))
(assert (let ((.def_1152221 (= t12_pc (_ bv0 32)))).def_1152221))
(assert (let ((.def_1152224 (= t13_pc (_ bv0 32)))).def_1152224))
(assert (let ((.def_1152226 (= m_pc (_ bv1 32)))).def_1152226))
(assert (let ((.def_1152228 (= t1_pc (_ bv1 32)))).def_1152228))
(assert (let ((.def_1152230 (= t2_pc (_ bv1 32)))).def_1152230))
(assert (let ((.def_1152232 (= t3_pc (_ bv1 32)))).def_1152232))
(assert (let ((.def_1152234 (= t4_pc (_ bv1 32)))).def_1152234))
(assert (let ((.def_1152236 (= t5_pc (_ bv1 32)))).def_1152236))
(assert (let ((.def_1152238 (= t6_pc (_ bv1 32)))).def_1152238))
(assert (let ((.def_1152240 (= t7_pc (_ bv1 32)))).def_1152240))
(assert (let ((.def_1152242 (= t8_pc (_ bv1 32)))).def_1152242))
(assert (let ((.def_1152244 (= t9_pc (_ bv1 32)))).def_1152244))
(assert (let ((.def_1152246 (= t10_pc (_ bv1 32)))).def_1152246))
(assert (let ((.def_1152248 (= t11_pc (_ bv1 32)))).def_1152248))
(assert (let ((.def_1152250 (= t12_pc (_ bv1 32)))).def_1152250))
(assert (let ((.def_1152252 (= t13_pc (_ bv1 32)))).def_1152252))

