(set-info :source |printed by MathSAT|)
(declare-fun a20 () (_ BitVec 32))
(declare-fun a25 () (_ BitVec 32))
(declare-fun a12 () (_ BitVec 32))
(declare-fun a15 () (_ BitVec 32))
(declare-fun a16 () (_ BitVec 32))
(declare-fun a2 () (_ BitVec 32))
(declare-fun a27 () (_ BitVec 32))
(declare-fun a9 () (_ BitVec 32))
(declare-fun |calculate_output2::input| () (_ BitVec 32))

*:
(assert (let ((.def_105662 (= a20 (_ bv5 32)))).def_105662))

calculate_output8 N29569:
(assert false)
(assert (let ((.def_105662 (= a20 (_ bv5 32)))).def_105662))

main1 N30136:
(assert (let ((.def_105662 (= a20 (_ bv5 32)))).def_105662))
(assert (let ((.def_152254 (= a25 (_ bv1 32)))).def_152254))
(assert (let ((.def_152257 (= a12 (_ bv4 32)))).def_152257))
(assert (let ((.def_152260 (= a15 (_ bv1 32)))).def_152260))
(assert (let ((.def_152263 (= a16 (_ bv1 32)))).def_152263))
(assert (let ((.def_152266 (= a2 (_ bv10 32)))).def_152266))
(assert (let ((.def_152269 (= a27 (_ bv1 32)))).def_152269))
(assert (let ((.def_152272 (= a9 (_ bv18 32)))).def_152272))
(assert (let ((.def_317328 (= a20 (_ bv6 32)))).def_317328))
(assert (let ((.def_317330 (= a2 (_ bv13 32)))).def_317330))
(assert (let ((.def_317332 (= a12 (_ bv3 32)))).def_317332))
(assert (let ((.def_317334 (= a12 (_ bv2 32)))).def_317334))
(assert (let ((.def_317336 (= a9 (_ bv16 32)))).def_317336))
(assert (let ((.def_317338 (= a9 (_ bv17 32)))).def_317338))
(assert (let ((.def_1096196 (= a2 (_ bv9 32)))).def_1096196))
(assert (let ((.def_1096198 (= a12 (_ bv5 32)))).def_1096198))
(assert (let ((.def_1096200 (= a20 (_ bv7 32)))).def_1096200))
(assert (let ((.def_1096202 (= a12 (_ bv6 32)))).def_1096202))
(assert (let ((.def_1096204 (= a2 (_ bv11 32)))).def_1096204))
(assert (let ((.def_1096206 (= a2 (_ bv12 32)))).def_1096206))
(assert (let ((.def_1096209 (= |calculate_output2::input| (_ bv3 32)))).def_1096209))
(assert (let ((.def_1096211 (= |calculate_output2::input| (_ bv2 32)))).def_1096211))
(assert (let ((.def_1096213 (= |calculate_output2::input| (_ bv6 32)))).def_1096213))

