(set-info :source |printed by MathSAT|)
(declare-fun a20 () (_ BitVec 32))
(declare-fun a25 () (_ BitVec 32))
(declare-fun a12 () (_ BitVec 32))
(declare-fun a15 () (_ BitVec 32))
(declare-fun a16 () (_ BitVec 32))
(declare-fun a2 () (_ BitVec 32))
(declare-fun a27 () (_ BitVec 32))
(declare-fun a9 () (_ BitVec 32))
(declare-fun m_pc () (_ BitVec 32))
(declare-fun t1_pc () (_ BitVec 32))
(declare-fun t2_pc () (_ BitVec 32))
(declare-fun t3_pc () (_ BitVec 32))
(declare-fun t4_pc () (_ BitVec 32))
(declare-fun t5_pc () (_ BitVec 32))
(declare-fun t6_pc () (_ BitVec 32))
(declare-fun t7_pc () (_ BitVec 32))
(declare-fun m_st () (_ BitVec 32))

*:
(assert (let ((.def_107291 (= a20 (_ bv5 32)))).def_107291))

calculate_output8 N29965:
(assert false)
(assert (let ((.def_107291 (= a20 (_ bv5 32)))).def_107291))

main1 N30136:
(assert (let ((.def_107291 (= a20 (_ bv5 32)))).def_107291))
(assert (let ((.def_154702 (= a25 (_ bv1 32)))).def_154702))
(assert (let ((.def_154705 (= a12 (_ bv4 32)))).def_154705))
(assert (let ((.def_154708 (= a15 (_ bv1 32)))).def_154708))
(assert (let ((.def_154711 (= a16 (_ bv1 32)))).def_154711))
(assert (let ((.def_154714 (= a2 (_ bv10 32)))).def_154714))
(assert (let ((.def_154717 (= a27 (_ bv1 32)))).def_154717))
(assert (let ((.def_154720 (= a9 (_ bv18 32)))).def_154720))
(assert (let ((.def_320667 (= a9 (_ bv17 32)))).def_320667))
(assert (let ((.def_320669 (= a2 (_ bv12 32)))).def_320669))
(assert (let ((.def_320671 (= a2 (_ bv11 32)))).def_320671))
(assert (let ((.def_320673 (= a2 (_ bv9 32)))).def_320673))
(assert (let ((.def_320675 (= a12 (_ bv3 32)))).def_320675))
(assert (let ((.def_320677 (= a20 (_ bv6 32)))).def_320677))
(assert (let ((.def_320679 (= a2 (_ bv13 32)))).def_320679))
(assert (let ((.def_320681 (= a9 (_ bv16 32)))).def_320681))
(assert (let ((.def_1081072 (= a20 (_ bv7 32)))).def_1081072))
(assert (let ((.def_1081074 (= a12 (_ bv2 32)))).def_1081074))
(assert (let ((.def_1081076 (= a12 (_ bv5 32)))).def_1081076))
(assert (let ((.def_1081078 (= a12 (_ bv6 32)))).def_1081078))

error N30154:
(assert false)
(assert (let ((.def_107291 (= a20 (_ bv5 32)))).def_107291))

eval N30625:
(assert (let ((.def_1222545 (= m_pc (_ bv0 32)))).def_1222545))
(assert (let ((.def_107291 (= a20 (_ bv5 32)))).def_107291))
(assert (let ((.def_1227774 (= t1_pc (_ bv0 32)))).def_1227774))
(assert (let ((.def_1227777 (= t2_pc (_ bv0 32)))).def_1227777))
(assert (let ((.def_1227780 (= t3_pc (_ bv0 32)))).def_1227780))
(assert (let ((.def_1227783 (= t4_pc (_ bv0 32)))).def_1227783))
(assert (let ((.def_1227786 (= t5_pc (_ bv0 32)))).def_1227786))
(assert (let ((.def_1227789 (= t6_pc (_ bv0 32)))).def_1227789))
(assert (let ((.def_1227792 (= t7_pc (_ bv0 32)))).def_1227792))
(assert (let ((.def_1227794 (= m_pc (_ bv1 32)))).def_1227794))
(assert (let ((.def_1227796 (= t1_pc (_ bv1 32)))).def_1227796))
(assert (let ((.def_1227798 (= t2_pc (_ bv1 32)))).def_1227798))
(assert (let ((.def_1227800 (= t3_pc (_ bv1 32)))).def_1227800))
(assert (let ((.def_1227802 (= t4_pc (_ bv1 32)))).def_1227802))
(assert (let ((.def_1227804 (= t5_pc (_ bv1 32)))).def_1227804))
(assert (let ((.def_1227806 (= t6_pc (_ bv1 32)))).def_1227806))
(assert (let ((.def_1227808 (= t7_pc (_ bv1 32)))).def_1227808))
(assert (let ((.def_1227811 (= m_st (_ bv0 32)))).def_1227811))

start_simulation N31021:
(assert (let ((.def_1222545 (= m_pc (_ bv0 32)))).def_1222545))
(assert (let ((.def_107291 (= a20 (_ bv5 32)))).def_107291))
(assert (let ((.def_1227774 (= t1_pc (_ bv0 32)))).def_1227774))
(assert (let ((.def_1227777 (= t2_pc (_ bv0 32)))).def_1227777))
(assert (let ((.def_1227780 (= t3_pc (_ bv0 32)))).def_1227780))
(assert (let ((.def_1227783 (= t4_pc (_ bv0 32)))).def_1227783))
(assert (let ((.def_1227786 (= t5_pc (_ bv0 32)))).def_1227786))
(assert (let ((.def_1227789 (= t6_pc (_ bv0 32)))).def_1227789))
(assert (let ((.def_1227792 (= t7_pc (_ bv0 32)))).def_1227792))
(assert (let ((.def_1227794 (= m_pc (_ bv1 32)))).def_1227794))
(assert (let ((.def_1227796 (= t1_pc (_ bv1 32)))).def_1227796))
(assert (let ((.def_1227798 (= t2_pc (_ bv1 32)))).def_1227798))
(assert (let ((.def_1227800 (= t3_pc (_ bv1 32)))).def_1227800))
(assert (let ((.def_1227802 (= t4_pc (_ bv1 32)))).def_1227802))
(assert (let ((.def_1227804 (= t5_pc (_ bv1 32)))).def_1227804))
(assert (let ((.def_1227806 (= t6_pc (_ bv1 32)))).def_1227806))
(assert (let ((.def_1227808 (= t7_pc (_ bv1 32)))).def_1227808))

