(set-info :source |printed by MathSAT|)
(declare-fun a20 () (_ BitVec 32))
(declare-fun a25 () (_ BitVec 32))
(declare-fun a12 () (_ BitVec 32))
(declare-fun a15 () (_ BitVec 32))
(declare-fun a16 () (_ BitVec 32))
(declare-fun a2 () (_ BitVec 32))
(declare-fun a27 () (_ BitVec 32))
(declare-fun a9 () (_ BitVec 32))
(declare-fun m_pc () (_ BitVec 32))
(declare-fun t1_pc () (_ BitVec 32))
(declare-fun t2_pc () (_ BitVec 32))
(declare-fun t3_pc () (_ BitVec 32))
(declare-fun t4_pc () (_ BitVec 32))
(declare-fun t5_pc () (_ BitVec 32))
(declare-fun t6_pc () (_ BitVec 32))
(declare-fun t7_pc () (_ BitVec 32))
(declare-fun t8_pc () (_ BitVec 32))
(declare-fun t9_pc () (_ BitVec 32))
(declare-fun t10_pc () (_ BitVec 32))
(declare-fun m_st () (_ BitVec 32))

*:
(assert (let ((.def_107336 (= a20 (_ bv5 32)))).def_107336))

calculate_output8 N29965:
(assert false)
(assert (let ((.def_107336 (= a20 (_ bv5 32)))).def_107336))

main1 N30136:
(assert (let ((.def_107336 (= a20 (_ bv5 32)))).def_107336))
(assert (let ((.def_154762 (= a25 (_ bv1 32)))).def_154762))
(assert (let ((.def_154765 (= a12 (_ bv4 32)))).def_154765))
(assert (let ((.def_154768 (= a15 (_ bv1 32)))).def_154768))
(assert (let ((.def_154771 (= a16 (_ bv1 32)))).def_154771))
(assert (let ((.def_154774 (= a2 (_ bv10 32)))).def_154774))
(assert (let ((.def_154777 (= a27 (_ bv1 32)))).def_154777))
(assert (let ((.def_154780 (= a9 (_ bv18 32)))).def_154780))
(assert (let ((.def_320727 (= a9 (_ bv17 32)))).def_320727))
(assert (let ((.def_320729 (= a2 (_ bv12 32)))).def_320729))
(assert (let ((.def_320731 (= a2 (_ bv11 32)))).def_320731))
(assert (let ((.def_320733 (= a2 (_ bv9 32)))).def_320733))
(assert (let ((.def_320735 (= a12 (_ bv3 32)))).def_320735))
(assert (let ((.def_320737 (= a20 (_ bv6 32)))).def_320737))
(assert (let ((.def_320739 (= a2 (_ bv13 32)))).def_320739))
(assert (let ((.def_320741 (= a9 (_ bv16 32)))).def_320741))
(assert (let ((.def_1060467 (= a12 (_ bv5 32)))).def_1060467))
(assert (let ((.def_1060469 (= a12 (_ bv6 32)))).def_1060469))
(assert (let ((.def_1060471 (= a12 (_ bv2 32)))).def_1060471))
(assert (let ((.def_1060473 (= a20 (_ bv7 32)))).def_1060473))

error N30154:
(assert false)
(assert (let ((.def_107336 (= a20 (_ bv5 32)))).def_107336))

eval N30787:
(assert (let ((.def_1202327 (= m_pc (_ bv0 32)))).def_1202327))
(assert (let ((.def_107336 (= a20 (_ bv5 32)))).def_107336))
(assert (let ((.def_1211591 (= t1_pc (_ bv0 32)))).def_1211591))
(assert (let ((.def_1211594 (= t2_pc (_ bv0 32)))).def_1211594))
(assert (let ((.def_1211597 (= t3_pc (_ bv0 32)))).def_1211597))
(assert (let ((.def_1211600 (= t4_pc (_ bv0 32)))).def_1211600))
(assert (let ((.def_1211603 (= t5_pc (_ bv0 32)))).def_1211603))
(assert (let ((.def_1211606 (= t6_pc (_ bv0 32)))).def_1211606))
(assert (let ((.def_1211609 (= t7_pc (_ bv0 32)))).def_1211609))
(assert (let ((.def_1211612 (= t8_pc (_ bv0 32)))).def_1211612))
(assert (let ((.def_1211615 (= t9_pc (_ bv0 32)))).def_1211615))
(assert (let ((.def_1211618 (= t10_pc (_ bv0 32)))).def_1211618))
(assert (let ((.def_1211620 (= m_pc (_ bv1 32)))).def_1211620))
(assert (let ((.def_1211622 (= t1_pc (_ bv1 32)))).def_1211622))
(assert (let ((.def_1211624 (= t2_pc (_ bv1 32)))).def_1211624))
(assert (let ((.def_1211626 (= t3_pc (_ bv1 32)))).def_1211626))
(assert (let ((.def_1211628 (= t4_pc (_ bv1 32)))).def_1211628))
(assert (let ((.def_1211630 (= t5_pc (_ bv1 32)))).def_1211630))
(assert (let ((.def_1211632 (= t6_pc (_ bv1 32)))).def_1211632))
(assert (let ((.def_1211634 (= t7_pc (_ bv1 32)))).def_1211634))
(assert (let ((.def_1211636 (= t8_pc (_ bv1 32)))).def_1211636))
(assert (let ((.def_1211638 (= t9_pc (_ bv1 32)))).def_1211638))
(assert (let ((.def_1211640 (= t10_pc (_ bv1 32)))).def_1211640))
(assert (let ((.def_1211643 (= m_st (_ bv0 32)))).def_1211643))

start_simulation N31306:
(assert (let ((.def_1202327 (= m_pc (_ bv0 32)))).def_1202327))
(assert (let ((.def_107336 (= a20 (_ bv5 32)))).def_107336))
(assert (let ((.def_1211591 (= t1_pc (_ bv0 32)))).def_1211591))
(assert (let ((.def_1211594 (= t2_pc (_ bv0 32)))).def_1211594))
(assert (let ((.def_1211597 (= t3_pc (_ bv0 32)))).def_1211597))
(assert (let ((.def_1211600 (= t4_pc (_ bv0 32)))).def_1211600))
(assert (let ((.def_1211603 (= t5_pc (_ bv0 32)))).def_1211603))
(assert (let ((.def_1211606 (= t6_pc (_ bv0 32)))).def_1211606))
(assert (let ((.def_1211609 (= t7_pc (_ bv0 32)))).def_1211609))
(assert (let ((.def_1211612 (= t8_pc (_ bv0 32)))).def_1211612))
(assert (let ((.def_1211615 (= t9_pc (_ bv0 32)))).def_1211615))
(assert (let ((.def_1211618 (= t10_pc (_ bv0 32)))).def_1211618))
(assert (let ((.def_1211620 (= m_pc (_ bv1 32)))).def_1211620))
(assert (let ((.def_1211622 (= t1_pc (_ bv1 32)))).def_1211622))
(assert (let ((.def_1211624 (= t2_pc (_ bv1 32)))).def_1211624))
(assert (let ((.def_1211626 (= t3_pc (_ bv1 32)))).def_1211626))
(assert (let ((.def_1211628 (= t4_pc (_ bv1 32)))).def_1211628))
(assert (let ((.def_1211630 (= t5_pc (_ bv1 32)))).def_1211630))
(assert (let ((.def_1211632 (= t6_pc (_ bv1 32)))).def_1211632))
(assert (let ((.def_1211634 (= t7_pc (_ bv1 32)))).def_1211634))
(assert (let ((.def_1211636 (= t8_pc (_ bv1 32)))).def_1211636))
(assert (let ((.def_1211638 (= t9_pc (_ bv1 32)))).def_1211638))
(assert (let ((.def_1211640 (= t10_pc (_ bv1 32)))).def_1211640))

