(set-info :source |printed by MathSAT|)
(declare-fun a20 () (_ BitVec 32))
(declare-fun a25 () (_ BitVec 32))
(declare-fun a12 () (_ BitVec 32))
(declare-fun a15 () (_ BitVec 32))
(declare-fun a16 () (_ BitVec 32))
(declare-fun a2 () (_ BitVec 32))
(declare-fun a27 () (_ BitVec 32))
(declare-fun a9 () (_ BitVec 32))
(declare-fun m_pc () (_ BitVec 32))
(declare-fun t1_pc () (_ BitVec 32))
(declare-fun t2_pc () (_ BitVec 32))
(declare-fun t3_pc () (_ BitVec 32))
(declare-fun t4_pc () (_ BitVec 32))
(declare-fun t5_pc () (_ BitVec 32))
(declare-fun t6_pc () (_ BitVec 32))
(declare-fun t7_pc () (_ BitVec 32))
(declare-fun t8_pc () (_ BitVec 32))
(declare-fun t9_pc () (_ BitVec 32))
(declare-fun t10_pc () (_ BitVec 32))
(declare-fun t11_pc () (_ BitVec 32))
(declare-fun t12_pc () (_ BitVec 32))
(declare-fun m_st () (_ BitVec 32))

*:
(assert (let ((.def_107366 (= a20 (_ bv5 32)))).def_107366))

calculate_output8 N29965:
(assert false)
(assert (let ((.def_107366 (= a20 (_ bv5 32)))).def_107366))

main1 N30136:
(assert (let ((.def_107366 (= a20 (_ bv5 32)))).def_107366))
(assert (let ((.def_154802 (= a25 (_ bv1 32)))).def_154802))
(assert (let ((.def_154805 (= a12 (_ bv4 32)))).def_154805))
(assert (let ((.def_154808 (= a15 (_ bv1 32)))).def_154808))
(assert (let ((.def_154811 (= a16 (_ bv1 32)))).def_154811))
(assert (let ((.def_154814 (= a2 (_ bv10 32)))).def_154814))
(assert (let ((.def_154817 (= a27 (_ bv1 32)))).def_154817))
(assert (let ((.def_154820 (= a9 (_ bv18 32)))).def_154820))
(assert (let ((.def_320767 (= a9 (_ bv17 32)))).def_320767))
(assert (let ((.def_320769 (= a2 (_ bv12 32)))).def_320769))
(assert (let ((.def_320771 (= a2 (_ bv11 32)))).def_320771))
(assert (let ((.def_320773 (= a2 (_ bv9 32)))).def_320773))
(assert (let ((.def_320775 (= a12 (_ bv3 32)))).def_320775))
(assert (let ((.def_320777 (= a20 (_ bv6 32)))).def_320777))
(assert (let ((.def_320779 (= a2 (_ bv13 32)))).def_320779))
(assert (let ((.def_320781 (= a9 (_ bv16 32)))).def_320781))
(assert (let ((.def_1062197 (= a12 (_ bv2 32)))).def_1062197))
(assert (let ((.def_1062199 (= a12 (_ bv5 32)))).def_1062199))
(assert (let ((.def_1062201 (= a12 (_ bv6 32)))).def_1062201))
(assert (let ((.def_1062203 (= a20 (_ bv7 32)))).def_1062203))

error N30154:
(assert false)
(assert (let ((.def_107366 (= a20 (_ bv5 32)))).def_107366))

eval N30891:
(assert (let ((.def_1204301 (= m_pc (_ bv0 32)))).def_1204301))
(assert (let ((.def_107366 (= a20 (_ bv5 32)))).def_107366))
(assert (let ((.def_1216890 (= t1_pc (_ bv0 32)))).def_1216890))
(assert (let ((.def_1216893 (= t2_pc (_ bv0 32)))).def_1216893))
(assert (let ((.def_1216896 (= t3_pc (_ bv0 32)))).def_1216896))
(assert (let ((.def_1216899 (= t4_pc (_ bv0 32)))).def_1216899))
(assert (let ((.def_1216902 (= t5_pc (_ bv0 32)))).def_1216902))
(assert (let ((.def_1216905 (= t6_pc (_ bv0 32)))).def_1216905))
(assert (let ((.def_1216908 (= t7_pc (_ bv0 32)))).def_1216908))
(assert (let ((.def_1216911 (= t8_pc (_ bv0 32)))).def_1216911))
(assert (let ((.def_1216914 (= t9_pc (_ bv0 32)))).def_1216914))
(assert (let ((.def_1216917 (= t10_pc (_ bv0 32)))).def_1216917))
(assert (let ((.def_1216920 (= t11_pc (_ bv0 32)))).def_1216920))
(assert (let ((.def_1216923 (= t12_pc (_ bv0 32)))).def_1216923))
(assert (let ((.def_1216925 (= m_pc (_ bv1 32)))).def_1216925))
(assert (let ((.def_1216927 (= t1_pc (_ bv1 32)))).def_1216927))
(assert (let ((.def_1216929 (= t2_pc (_ bv1 32)))).def_1216929))
(assert (let ((.def_1216931 (= t3_pc (_ bv1 32)))).def_1216931))
(assert (let ((.def_1216933 (= t4_pc (_ bv1 32)))).def_1216933))
(assert (let ((.def_1216935 (= t5_pc (_ bv1 32)))).def_1216935))
(assert (let ((.def_1216937 (= t6_pc (_ bv1 32)))).def_1216937))
(assert (let ((.def_1216939 (= t7_pc (_ bv1 32)))).def_1216939))
(assert (let ((.def_1216941 (= t8_pc (_ bv1 32)))).def_1216941))
(assert (let ((.def_1216943 (= t9_pc (_ bv1 32)))).def_1216943))
(assert (let ((.def_1216945 (= t10_pc (_ bv1 32)))).def_1216945))
(assert (let ((.def_1216947 (= t11_pc (_ bv1 32)))).def_1216947))
(assert (let ((.def_1216949 (= t12_pc (_ bv1 32)))).def_1216949))
(assert (let ((.def_1216952 (= m_st (_ bv0 32)))).def_1216952))

start_simulation N31492:
(assert (let ((.def_1204301 (= m_pc (_ bv0 32)))).def_1204301))
(assert (let ((.def_107366 (= a20 (_ bv5 32)))).def_107366))
(assert (let ((.def_1216890 (= t1_pc (_ bv0 32)))).def_1216890))
(assert (let ((.def_1216893 (= t2_pc (_ bv0 32)))).def_1216893))
(assert (let ((.def_1216896 (= t3_pc (_ bv0 32)))).def_1216896))
(assert (let ((.def_1216899 (= t4_pc (_ bv0 32)))).def_1216899))
(assert (let ((.def_1216902 (= t5_pc (_ bv0 32)))).def_1216902))
(assert (let ((.def_1216905 (= t6_pc (_ bv0 32)))).def_1216905))
(assert (let ((.def_1216908 (= t7_pc (_ bv0 32)))).def_1216908))
(assert (let ((.def_1216911 (= t8_pc (_ bv0 32)))).def_1216911))
(assert (let ((.def_1216914 (= t9_pc (_ bv0 32)))).def_1216914))
(assert (let ((.def_1216917 (= t10_pc (_ bv0 32)))).def_1216917))
(assert (let ((.def_1216920 (= t11_pc (_ bv0 32)))).def_1216920))
(assert (let ((.def_1216923 (= t12_pc (_ bv0 32)))).def_1216923))
(assert (let ((.def_1216925 (= m_pc (_ bv1 32)))).def_1216925))
(assert (let ((.def_1216927 (= t1_pc (_ bv1 32)))).def_1216927))
(assert (let ((.def_1216929 (= t2_pc (_ bv1 32)))).def_1216929))
(assert (let ((.def_1216931 (= t3_pc (_ bv1 32)))).def_1216931))
(assert (let ((.def_1216933 (= t4_pc (_ bv1 32)))).def_1216933))
(assert (let ((.def_1216935 (= t5_pc (_ bv1 32)))).def_1216935))
(assert (let ((.def_1216937 (= t6_pc (_ bv1 32)))).def_1216937))
(assert (let ((.def_1216939 (= t7_pc (_ bv1 32)))).def_1216939))
(assert (let ((.def_1216941 (= t8_pc (_ bv1 32)))).def_1216941))
(assert (let ((.def_1216943 (= t9_pc (_ bv1 32)))).def_1216943))
(assert (let ((.def_1216945 (= t10_pc (_ bv1 32)))).def_1216945))
(assert (let ((.def_1216947 (= t11_pc (_ bv1 32)))).def_1216947))
(assert (let ((.def_1216949 (= t12_pc (_ bv1 32)))).def_1216949))

