(set-info :source |printed by MathSAT|)
(declare-fun |ssl3_connect::blastFlag| () (_ BitVec 32))
(declare-fun |ssl3_connect::s__state| () (_ BitVec 32))
(declare-fun |ssl3_connect::s__s3__tmp__reuse_message| () (_ BitVec 32))
(declare-fun |ssl3_connect::s__hit| () (_ BitVec 32))
(declare-fun |ssl3_connect::s__s3__tmp__next_state___0| () (_ BitVec 32))
(declare-fun |ssl3_accept::blastFlag| () (_ BitVec 32))
(declare-fun |ssl3_accept::s__state| () (_ BitVec 32))
(declare-fun |ssl3_accept::s__s3__tmp__next_state___0| () (_ BitVec 32))
(declare-fun |ssl3_accept::s__hit| () (_ BitVec 32))

ssl3_connect:
(assert (let ((.def_678 (= |ssl3_connect::blastFlag| (_ bv5 32)))).def_678))

ssl3_connect N117:
(assert (let ((.def_1602 (= |ssl3_connect::s__state| (_ bv12292 32)))).def_1602))
(assert (let ((.def_1604 (= |ssl3_connect::blastFlag| (_ bv0 32)))).def_1604))
(assert (let ((.def_678 (= |ssl3_connect::blastFlag| (_ bv5 32)))).def_678))
(assert (let ((.def_3753 (= |ssl3_connect::s__s3__tmp__reuse_message| (_ bv0 32)))).def_3753))
(assert (let ((.def_3755 (= |ssl3_connect::s__state| (_ bv4368 32)))).def_3755))
(assert (let ((.def_3757 (= |ssl3_connect::blastFlag| (_ bv2 32)))).def_3757))
(assert (let ((.def_3759 (= |ssl3_connect::blastFlag| (_ bv3 32)))).def_3759))
(assert (let ((.def_3761 (= |ssl3_connect::blastFlag| (_ bv4 32)))).def_3761))
(assert (let ((.def_3763 (= |ssl3_connect::blastFlag| (_ bv1 32)))).def_3763))
(assert (let ((.def_3766 (= |ssl3_connect::s__hit| (_ bv0 32)))).def_3766))
(assert (let ((.def_3768 (= |ssl3_connect::s__state| (_ bv4433 32)))).def_3768))
(assert (let ((.def_3770 (= |ssl3_connect::s__state| (_ bv4432 32)))).def_3770))
(assert (let ((.def_9677 (= |ssl3_connect::s__state| (_ bv4099 32)))).def_9677))
(assert (let ((.def_9679 (= |ssl3_connect::s__state| (_ bv20480 32)))).def_9679))
(assert (let ((.def_9681 (= |ssl3_connect::s__state| (_ bv4096 32)))).def_9681))
(assert (let ((.def_9683 (= |ssl3_connect::s__state| (_ bv16384 32)))).def_9683))
(assert (let ((.def_9685 (= |ssl3_connect::s__state| (_ bv4369 32)))).def_9685))
(assert (let ((.def_9687 (= |ssl3_connect::s__state| (_ bv4384 32)))).def_9687))
(assert (let ((.def_15532 (= |ssl3_connect::s__s3__tmp__next_state___0| (_ bv12292 32)))).def_15532))
(assert (let ((.def_15534 (= |ssl3_connect::s__s3__tmp__next_state___0| (_ bv4099 32)))).def_15534))
(assert (let ((.def_15536 (= |ssl3_connect::s__s3__tmp__next_state___0| (_ bv20480 32)))).def_15536))
(assert (let ((.def_15538 (= |ssl3_connect::s__s3__tmp__next_state___0| (_ bv4096 32)))).def_15538))
(assert (let ((.def_15540 (= |ssl3_connect::s__state| |ssl3_connect::s__s3__tmp__next_state___0|))).def_15540))
(assert (let ((.def_15542 (= |ssl3_connect::s__state| (_ bv4352 32)))).def_15542))
(assert (let ((.def_15544 (= |ssl3_connect::s__s3__tmp__next_state___0| (_ bv3 32)))).def_15544))
(assert (let ((.def_15546 (= |ssl3_connect::s__s3__tmp__next_state___0| (_ bv16384 32)))).def_15546))
(assert (let ((.def_15548 (= |ssl3_connect::s__s3__tmp__next_state___0| (_ bv4369 32)))).def_15548))
(assert (let ((.def_15550 (= |ssl3_connect::s__s3__tmp__next_state___0| (_ bv4368 32)))).def_15550))
(assert (let ((.def_15552 (= |ssl3_connect::s__state| (_ bv4400 32)))).def_15552))
(assert (let ((.def_15554 (= |ssl3_connect::s__s3__tmp__next_state___0| (_ bv4384 32)))).def_15554))
(assert (let ((.def_15556 (= |ssl3_connect::s__s3__tmp__next_state___0| (_ bv4385 32)))).def_15556))
(assert (let ((.def_15558 (= |ssl3_connect::s__s3__tmp__next_state___0| (_ bv4400 32)))).def_15558))
(assert (let ((.def_15560 (= |ssl3_connect::s__state| (_ bv4528 32)))).def_15560))
(assert (let ((.def_15562 (= |ssl3_connect::s__state| (_ bv4561 32)))).def_15562))
(assert (let ((.def_15564 (= |ssl3_connect::s__state| (_ bv4560 32)))).def_15564))
(assert (let ((.def_15566 (= |ssl3_connect::s__state| (_ bv4416 32)))).def_15566))
(assert (let ((.def_15568 (= |ssl3_connect::s__state| (_ bv4448 32)))).def_15568))
(assert (let ((.def_15570 (= |ssl3_connect::s__state| (_ bv4464 32)))).def_15570))
(assert (let ((.def_15572 (= |ssl3_connect::s__state| (_ bv4480 32)))).def_15572))
(assert (let ((.def_15574 (= |ssl3_connect::s__state| (_ bv4496 32)))).def_15574))
(assert (let ((.def_15576 (= |ssl3_connect::s__state| (_ bv4512 32)))).def_15576))
(assert (let ((.def_15578 (= |ssl3_connect::s__s3__tmp__next_state___0| (_ bv4401 32)))).def_15578))
(assert (let ((.def_15580 (= |ssl3_connect::s__state| (_ bv4385 32)))).def_15580))
(assert (let ((.def_15582 (= |ssl3_connect::s__state| (_ bv4401 32)))).def_15582))
(assert (let ((.def_15584 (= |ssl3_connect::s__state| (_ bv4417 32)))).def_15584))
(assert (let ((.def_15586 (= |ssl3_connect::s__state| (_ bv4529 32)))).def_15586))
(assert (let ((.def_15588 (= |ssl3_connect::s__s3__tmp__next_state___0| (_ bv4417 32)))).def_15588))
(assert (let ((.def_15590 (= |ssl3_connect::s__s3__tmp__next_state___0| (_ bv4416 32)))).def_15590))
(assert (let ((.def_15592 (= |ssl3_connect::s__state| (_ bv4497 32)))).def_15592))
(assert (let ((.def_15594 (= |ssl3_connect::s__state| (_ bv4481 32)))).def_15594))
(assert (let ((.def_15596 (= |ssl3_connect::s__state| (_ bv4467 32)))).def_15596))
(assert (let ((.def_15598 (= |ssl3_connect::s__state| (_ bv4466 32)))).def_15598))
(assert (let ((.def_15600 (= |ssl3_connect::s__state| (_ bv4465 32)))).def_15600))
(assert (let ((.def_15602 (= |ssl3_connect::s__state| (_ bv4449 32)))).def_15602))
(assert (let ((.def_15604 (= |ssl3_connect::s__s3__tmp__next_state___0| (_ bv4433 32)))).def_15604))
(assert (let ((.def_15606 (= |ssl3_connect::s__s3__tmp__next_state___0| (_ bv4432 32)))).def_15606))

ssl3_connect N576:
(assert false)
(assert (let ((.def_678 (= |ssl3_connect::blastFlag| (_ bv5 32)))).def_678))

ssl3_accept N694:
(assert (let ((.def_27616 (= |ssl3_accept::blastFlag| (_ bv5 32)))).def_27616))
(assert (let ((.def_28883 (= |ssl3_accept::s__state| (_ bv8464 32)))).def_28883))
(assert (let ((.def_28885 (= |ssl3_accept::blastFlag| (_ bv0 32)))).def_28885))
(assert (let ((.def_28887 (= |ssl3_accept::blastFlag| (_ bv4 32)))).def_28887))
(assert (let ((.def_31646 (= |ssl3_accept::s__state| (_ bv8482 32)))).def_31646))
(assert (let ((.def_31648 (= |ssl3_accept::blastFlag| (_ bv1 32)))).def_31648))
(assert (let ((.def_31650 (= |ssl3_accept::blastFlag| (_ bv3 32)))).def_31650))
(assert (let ((.def_31652 (= |ssl3_accept::blastFlag| (_ bv2 32)))).def_31652))
(assert (let ((.def_31654 (= |ssl3_accept::s__state| (_ bv8448 32)))).def_31654))
(assert (let ((.def_36672 (= |ssl3_accept::s__state| (_ bv24576 32)))).def_36672))
(assert (let ((.def_36674 (= |ssl3_accept::s__state| (_ bv8192 32)))).def_36674))
(assert (let ((.def_36676 (= |ssl3_accept::s__state| (_ bv16384 32)))).def_36676))
(assert (let ((.def_36678 (= |ssl3_accept::s__state| (_ bv8195 32)))).def_36678))
(assert (let ((.def_36680 (= |ssl3_accept::s__state| (_ bv8481 32)))).def_36680))
(assert (let ((.def_36682 (= |ssl3_accept::s__state| (_ bv8480 32)))).def_36682))
(assert (let ((.def_36684 (= |ssl3_accept::s__state| (_ bv12292 32)))).def_36684))
(assert (let ((.def_36686 (= |ssl3_accept::s__state| (_ bv8496 32)))).def_36686))
(assert (let ((.def_36688 (= |ssl3_accept::s__state| (_ bv8512 32)))).def_36688))
(assert (let ((.def_36690 (= |ssl3_accept::s__state| (_ bv8656 32)))).def_36690))
(assert (let ((.def_36692 (= |ssl3_accept::s__state| (_ bv8466 32)))).def_36692))
(assert (let ((.def_36694 (= |ssl3_accept::s__state| (_ bv8592 32)))).def_36694))
(assert (let ((.def_36696 (= |ssl3_accept::s__state| (_ bv8608 32)))).def_36696))
(assert (let ((.def_36698 (= |ssl3_accept::s__state| (_ bv8640 32)))).def_36698))
(assert (let ((.def_36700 (= |ssl3_accept::s__state| (_ bv8544 32)))).def_36700))
(assert (let ((.def_36702 (= |ssl3_accept::s__state| (_ bv8560 32)))).def_36702))
(assert (let ((.def_36704 (= |ssl3_accept::s__state| (_ bv8657 32)))).def_36704))
(assert (let ((.def_36706 (= |ssl3_accept::s__state| (_ bv8528 32)))).def_36706))
(assert (let ((.def_36708 (= |ssl3_accept::s__state| (_ bv8529 32)))).def_36708))
(assert (let ((.def_36710 (= |ssl3_accept::s__state| (_ bv8513 32)))).def_36710))
(assert (let ((.def_36712 (= |ssl3_accept::s__state| (_ bv8673 32)))).def_36712))
(assert (let ((.def_36714 (= |ssl3_accept::s__state| (_ bv8672 32)))).def_36714))
(assert (let ((.def_36717 (= |ssl3_accept::s__s3__tmp__next_state___0| (_ bv3 32)))).def_36717))
(assert (let ((.def_36719 (= |ssl3_accept::s__s3__tmp__next_state___0| (_ bv8640 32)))).def_36719))
(assert (let ((.def_52327 (= |ssl3_accept::s__state| (_ bv8465 32)))).def_52327))
(assert (let ((.def_52329 (= |ssl3_accept::s__state| (_ bv8641 32)))).def_52329))
(assert (let ((.def_52331 (= |ssl3_accept::s__s3__tmp__next_state___0| (_ bv8593 32)))).def_52331))
(assert (let ((.def_52333 (= |ssl3_accept::s__state| (_ bv8497 32)))).def_52333))
(assert (let ((.def_52335 (= |ssl3_accept::s__state| (_ bv8545 32)))).def_52335))
(assert (let ((.def_52337 (= |ssl3_accept::s__state| (_ bv8561 32)))).def_52337))
(assert (let ((.def_52339 (= |ssl3_accept::s__state| (_ bv8576 32)))).def_52339))
(assert (let ((.def_52341 (= |ssl3_accept::s__state| (_ bv8577 32)))).def_52341))
(assert (let ((.def_52343 (= |ssl3_accept::s__state| (_ bv8593 32)))).def_52343))
(assert (let ((.def_52345 (= |ssl3_accept::s__state| (_ bv8609 32)))).def_52345))
(assert (let ((.def_52348 (= |ssl3_accept::s__hit| (_ bv0 32)))).def_52348))
(assert (let ((.def_52350 (= |ssl3_accept::s__s3__tmp__next_state___0| (_ bv8576 32)))).def_52350))
(assert (let ((.def_52352 (= |ssl3_accept::s__s3__tmp__next_state___0| (_ bv8609 32)))).def_52352))
(assert (let ((.def_52354 (= |ssl3_accept::s__s3__tmp__next_state___0| (_ bv8608 32)))).def_52354))
(assert (let ((.def_52356 (= |ssl3_accept::s__s3__tmp__next_state___0| (_ bv8592 32)))).def_52356))
(assert (let ((.def_52358 (= |ssl3_accept::s__s3__tmp__next_state___0| (_ bv8577 32)))).def_52358))
(assert (let ((.def_52360 (= |ssl3_accept::s__s3__tmp__next_state___0| (_ bv8448 32)))).def_52360))
(assert (let ((.def_52362 (= |ssl3_accept::s__s3__tmp__next_state___0| (_ bv8561 32)))).def_52362))
(assert (let ((.def_52364 (= |ssl3_accept::s__s3__tmp__next_state___0| (_ bv8560 32)))).def_52364))
(assert (let ((.def_52366 (= |ssl3_accept::s__s3__tmp__next_state___0| (_ bv8545 32)))).def_52366))
(assert (let ((.def_52368 (= |ssl3_accept::s__s3__tmp__next_state___0| (_ bv8544 32)))).def_52368))
(assert (let ((.def_52370 (= |ssl3_accept::s__s3__tmp__next_state___0| (_ bv8529 32)))).def_52370))
(assert (let ((.def_52372 (= |ssl3_accept::s__s3__tmp__next_state___0| (_ bv8528 32)))).def_52372))
(assert (let ((.def_52374 (= |ssl3_accept::s__s3__tmp__next_state___0| (_ bv8497 32)))).def_52374))
(assert (let ((.def_52376 (= |ssl3_accept::s__s3__tmp__next_state___0| (_ bv8496 32)))).def_52376))
(assert (let ((.def_52378 (= |ssl3_accept::s__s3__tmp__next_state___0| (_ bv8466 32)))).def_52378))
(assert (let ((.def_52380 (= |ssl3_accept::s__s3__tmp__next_state___0| (_ bv8465 32)))).def_52380))
(assert (let ((.def_52382 (= |ssl3_accept::s__s3__tmp__next_state___0| (_ bv8464 32)))).def_52382))
(assert (let ((.def_52384 (= |ssl3_accept::s__s3__tmp__next_state___0| (_ bv8482 32)))).def_52384))
(assert (let ((.def_52386 (= |ssl3_accept::s__s3__tmp__next_state___0| (_ bv8481 32)))).def_52386))
(assert (let ((.def_52388 (= |ssl3_accept::s__s3__tmp__next_state___0| (_ bv8480 32)))).def_52388))
(assert (let ((.def_52390 (= |ssl3_accept::s__s3__tmp__next_state___0| (_ bv8195 32)))).def_52390))
(assert (let ((.def_52392 (= |ssl3_accept::s__s3__tmp__next_state___0| (_ bv24576 32)))).def_52392))
(assert (let ((.def_52394 (= |ssl3_accept::s__s3__tmp__next_state___0| (_ bv8192 32)))).def_52394))
(assert (let ((.def_52396 (= |ssl3_accept::s__s3__tmp__next_state___0| (_ bv16384 32)))).def_52396))
(assert (let ((.def_52398 (= |ssl3_accept::s__s3__tmp__next_state___0| (_ bv12292 32)))).def_52398))
(assert (let ((.def_52400 (= |ssl3_accept::s__s3__tmp__next_state___0| (_ bv8672 32)))).def_52400))
(assert (let ((.def_52402 (= |ssl3_accept::s__s3__tmp__next_state___0| (_ bv8513 32)))).def_52402))
(assert (let ((.def_52404 (= |ssl3_accept::s__s3__tmp__next_state___0| (_ bv8512 32)))).def_52404))
(assert (let ((.def_52406 (= |ssl3_accept::s__state| |ssl3_accept::s__s3__tmp__next_state___0|))).def_52406))
(assert (let ((.def_52408 (= |ssl3_accept::s__s3__tmp__next_state___0| (_ bv8641 32)))).def_52408))
(assert (let ((.def_52410 (= |ssl3_accept::s__s3__tmp__next_state___0| (_ bv8656 32)))).def_52410))
(assert (let ((.def_52412 (= |ssl3_accept::s__s3__tmp__next_state___0| (_ bv8673 32)))).def_52412))

ERR N1222:
(assert false)

