(set-info :source |printed by MathSAT|)
(declare-fun a20 () (_ BitVec 32))
(declare-fun a2 () (_ BitVec 32))
(declare-fun a27 () (_ BitVec 32))
(declare-fun a16 () (_ BitVec 32))
(declare-fun a15 () (_ BitVec 32))
(declare-fun a12 () (_ BitVec 32))
(declare-fun a25 () (_ BitVec 32))
(declare-fun a9 () (_ BitVec 32))

*:
(assert (let ((.def_106338 (= a20 (_ bv5 32)))).def_106338))

calculate_output8 N29723:
(assert false)
(assert (let ((.def_106338 (= a20 (_ bv5 32)))).def_106338))

main1 N30136:
(assert (let ((.def_153325 (= a2 (_ bv10 32)))).def_153325))
(assert (let ((.def_153328 (= a27 (_ bv1 32)))).def_153328))
(assert (let ((.def_153331 (= a16 (_ bv1 32)))).def_153331))
(assert (let ((.def_153334 (= a15 (_ bv1 32)))).def_153334))
(assert (let ((.def_153337 (= a12 (_ bv4 32)))).def_153337))
(assert (let ((.def_153340 (= a25 (_ bv1 32)))).def_153340))
(assert (let ((.def_106338 (= a20 (_ bv5 32)))).def_106338))
(assert (let ((.def_321316 (= a9 (_ bv18 32)))).def_321316))
(assert (let ((.def_321318 (= a20 (_ bv6 32)))).def_321318))
(assert (let ((.def_321320 (= a12 (_ bv3 32)))).def_321320))
(assert (let ((.def_321322 (= a2 (_ bv13 32)))).def_321322))
(assert (let ((.def_321324 (= a2 (_ bv9 32)))).def_321324))
(assert (let ((.def_321326 (= a12 (_ bv2 32)))).def_321326))
(assert (let ((.def_321328 (= a2 (_ bv11 32)))).def_321328))
(assert (let ((.def_321330 (= a9 (_ bv16 32)))).def_321330))
(assert (let ((.def_321332 (= a9 (_ bv17 32)))).def_321332))

