(set-info :source |printed by MathSAT|)
(declare-fun a20 () (_ BitVec 32))
(declare-fun a25 () (_ BitVec 32))
(declare-fun a12 () (_ BitVec 32))
(declare-fun a15 () (_ BitVec 32))
(declare-fun a16 () (_ BitVec 32))
(declare-fun a2 () (_ BitVec 32))
(declare-fun a27 () (_ BitVec 32))
(declare-fun a9 () (_ BitVec 32))
(declare-fun m_pc () (_ BitVec 32))
(declare-fun t1_pc () (_ BitVec 32))
(declare-fun t2_pc () (_ BitVec 32))
(declare-fun t3_pc () (_ BitVec 32))
(declare-fun t4_pc () (_ BitVec 32))
(declare-fun t5_pc () (_ BitVec 32))
(declare-fun t6_pc () (_ BitVec 32))
(declare-fun t7_pc () (_ BitVec 32))
(declare-fun t8_pc () (_ BitVec 32))
(declare-fun m_st () (_ BitVec 32))

*:
(assert (let ((.def_107658 (= a20 (_ bv5 32)))).def_107658))

calculate_output8 N30053:
(assert false)
(assert (let ((.def_107658 (= a20 (_ bv5 32)))).def_107658))

main1 N30136:
(assert (let ((.def_107658 (= a20 (_ bv5 32)))).def_107658))
(assert (let ((.def_155245 (= a25 (_ bv1 32)))).def_155245))
(assert (let ((.def_155248 (= a12 (_ bv4 32)))).def_155248))
(assert (let ((.def_155251 (= a15 (_ bv1 32)))).def_155251))
(assert (let ((.def_155254 (= a16 (_ bv1 32)))).def_155254))
(assert (let ((.def_155257 (= a2 (_ bv10 32)))).def_155257))
(assert (let ((.def_155260 (= a27 (_ bv1 32)))).def_155260))
(assert (let ((.def_155263 (= a9 (_ bv18 32)))).def_155263))
(assert (let ((.def_321428 (= a20 (_ bv6 32)))).def_321428))
(assert (let ((.def_321430 (= a12 (_ bv3 32)))).def_321430))
(assert (let ((.def_321432 (= a12 (_ bv6 32)))).def_321432))
(assert (let ((.def_321434 (= a2 (_ bv9 32)))).def_321434))
(assert (let ((.def_321436 (= a9 (_ bv16 32)))).def_321436))
(assert (let ((.def_321438 (= a2 (_ bv12 32)))).def_321438))
(assert (let ((.def_321440 (= a2 (_ bv11 32)))).def_321440))
(assert (let ((.def_321442 (= a9 (_ bv17 32)))).def_321442))
(assert (let ((.def_321444 (= a12 (_ bv2 32)))).def_321444))
(assert (let ((.def_321446 (= a2 (_ bv13 32)))).def_321446))

error N30154:
(assert false)
(assert (let ((.def_107658 (= a20 (_ bv5 32)))).def_107658))

eval N30679:
(assert (let ((.def_747265 (= m_pc (_ bv0 32)))).def_747265))
(assert (let ((.def_107658 (= a20 (_ bv5 32)))).def_107658))
(assert (let ((.def_753713 (= t1_pc (_ bv0 32)))).def_753713))
(assert (let ((.def_753716 (= t2_pc (_ bv0 32)))).def_753716))
(assert (let ((.def_753719 (= t3_pc (_ bv0 32)))).def_753719))
(assert (let ((.def_753722 (= t4_pc (_ bv0 32)))).def_753722))
(assert (let ((.def_753725 (= t5_pc (_ bv0 32)))).def_753725))
(assert (let ((.def_753728 (= t6_pc (_ bv0 32)))).def_753728))
(assert (let ((.def_753731 (= t7_pc (_ bv0 32)))).def_753731))
(assert (let ((.def_753734 (= t8_pc (_ bv0 32)))).def_753734))
(assert (let ((.def_753736 (= m_pc (_ bv1 32)))).def_753736))
(assert (let ((.def_753738 (= t1_pc (_ bv1 32)))).def_753738))
(assert (let ((.def_753740 (= t2_pc (_ bv1 32)))).def_753740))
(assert (let ((.def_753742 (= t3_pc (_ bv1 32)))).def_753742))
(assert (let ((.def_753744 (= t4_pc (_ bv1 32)))).def_753744))
(assert (let ((.def_753746 (= t5_pc (_ bv1 32)))).def_753746))
(assert (let ((.def_753748 (= t6_pc (_ bv1 32)))).def_753748))
(assert (let ((.def_753750 (= t7_pc (_ bv1 32)))).def_753750))
(assert (let ((.def_753752 (= t8_pc (_ bv1 32)))).def_753752))
(assert (let ((.def_753755 (= m_st (_ bv0 32)))).def_753755))

start_simulation N31116:
(assert (let ((.def_747265 (= m_pc (_ bv0 32)))).def_747265))
(assert (let ((.def_107658 (= a20 (_ bv5 32)))).def_107658))
(assert (let ((.def_753713 (= t1_pc (_ bv0 32)))).def_753713))
(assert (let ((.def_753716 (= t2_pc (_ bv0 32)))).def_753716))
(assert (let ((.def_753719 (= t3_pc (_ bv0 32)))).def_753719))
(assert (let ((.def_753722 (= t4_pc (_ bv0 32)))).def_753722))
(assert (let ((.def_753725 (= t5_pc (_ bv0 32)))).def_753725))
(assert (let ((.def_753728 (= t6_pc (_ bv0 32)))).def_753728))
(assert (let ((.def_753731 (= t7_pc (_ bv0 32)))).def_753731))
(assert (let ((.def_753734 (= t8_pc (_ bv0 32)))).def_753734))
(assert (let ((.def_753736 (= m_pc (_ bv1 32)))).def_753736))
(assert (let ((.def_753738 (= t1_pc (_ bv1 32)))).def_753738))
(assert (let ((.def_753740 (= t2_pc (_ bv1 32)))).def_753740))
(assert (let ((.def_753742 (= t3_pc (_ bv1 32)))).def_753742))
(assert (let ((.def_753744 (= t4_pc (_ bv1 32)))).def_753744))
(assert (let ((.def_753746 (= t5_pc (_ bv1 32)))).def_753746))
(assert (let ((.def_753748 (= t6_pc (_ bv1 32)))).def_753748))
(assert (let ((.def_753750 (= t7_pc (_ bv1 32)))).def_753750))
(assert (let ((.def_753752 (= t8_pc (_ bv1 32)))).def_753752))

