(set-info :source |printed by MathSAT|)
(declare-fun a20 () (_ BitVec 32))
(declare-fun a9 () (_ BitVec 32))
(declare-fun a25 () (_ BitVec 32))
(declare-fun a12 () (_ BitVec 32))
(declare-fun a15 () (_ BitVec 32))
(declare-fun a16 () (_ BitVec 32))
(declare-fun a2 () (_ BitVec 32))
(declare-fun a27 () (_ BitVec 32))

*:
(assert (let ((.def_106162 (= a20 (_ bv5 32)))).def_106162))

calculate_output8 N29679:
(assert false)
(assert (let ((.def_106162 (= a20 (_ bv5 32)))).def_106162))

main1 N30136:
(assert (let ((.def_153080 (= a9 (_ bv18 32)))).def_153080))
(assert (let ((.def_106162 (= a20 (_ bv5 32)))).def_106162))
(assert (let ((.def_339683 (= a25 (_ bv1 32)))).def_339683))
(assert (let ((.def_339686 (= a12 (_ bv4 32)))).def_339686))
(assert (let ((.def_339689 (= a15 (_ bv1 32)))).def_339689))
(assert (let ((.def_339692 (= a16 (_ bv1 32)))).def_339692))
(assert (let ((.def_339695 (= a2 (_ bv10 32)))).def_339695))
(assert (let ((.def_339698 (= a27 (_ bv1 32)))).def_339698))
(assert (let ((.def_339700 (= a2 (_ bv13 32)))).def_339700))
(assert (let ((.def_339702 (= a9 (_ bv17 32)))).def_339702))
(assert (let ((.def_339704 (= a2 (_ bv9 32)))).def_339704))
(assert (let ((.def_339706 (= a2 (_ bv11 32)))).def_339706))
(assert (let ((.def_339708 (= a9 (_ bv16 32)))).def_339708))
(assert (let ((.def_339710 (= a2 (_ bv12 32)))).def_339710))
(assert (let ((.def_922248 (= a20 (_ bv7 32)))).def_922248))
(assert (let ((.def_922250 (= a20 (_ bv6 32)))).def_922250))
(assert (let ((.def_922252 (= a12 (_ bv6 32)))).def_922252))
(assert (let ((.def_922254 (= a12 (_ bv3 32)))).def_922254))
(assert (let ((.def_922256 (= a12 (_ bv2 32)))).def_922256))
(assert (let ((.def_922258 (= a12 (_ bv5 32)))).def_922258))

