(set-info :source |printed by MathSAT|)
(declare-fun |assert::arg| () (_ BitVec 8))
(declare-fun st1 () (_ BitVec 8))
(declare-fun st2 () (_ BitVec 8))
(declare-fun st3 () (_ BitVec 8))
(declare-fun st4 () (_ BitVec 8))
(declare-fun st5 () (_ BitVec 8))
(declare-fun st6 () (_ BitVec 8))
(declare-fun st7 () (_ BitVec 8))
(declare-fun st8 () (_ BitVec 8))
(declare-fun r1 () (_ BitVec 8))
(declare-fun p6_new () (_ BitVec 8))
(declare-fun nomsg () (_ BitVec 8))
(declare-fun p5_new () (_ BitVec 8))
(declare-fun p4_new () (_ BitVec 8))
(declare-fun p3_new () (_ BitVec 8))
(declare-fun p2_new () (_ BitVec 8))
(declare-fun p7_new () (_ BitVec 8))
(declare-fun mode1 () (_ BitVec 8))
(declare-fun mode2 () (_ BitVec 8))
(declare-fun mode3 () (_ BitVec 8))
(declare-fun mode4 () (_ BitVec 8))
(declare-fun mode5 () (_ BitVec 8))
(declare-fun mode6 () (_ BitVec 8))
(declare-fun mode7 () (_ BitVec 8))
(declare-fun mode8 () (_ BitVec 8))
(declare-fun id4 () (_ BitVec 8))
(declare-fun send3 () (_ BitVec 8))
(declare-fun send8 () (_ BitVec 8))
(declare-fun id1 () (_ BitVec 8))
(declare-fun id2 () (_ BitVec 8))
(declare-fun send1 () (_ BitVec 8))
(declare-fun id3 () (_ BitVec 8))
(declare-fun send2 () (_ BitVec 8))
(declare-fun id5 () (_ BitVec 8))
(declare-fun send4 () (_ BitVec 8))
(declare-fun id6 () (_ BitVec 8))
(declare-fun send5 () (_ BitVec 8))
(declare-fun id7 () (_ BitVec 8))
(declare-fun send6 () (_ BitVec 8))
(declare-fun p1_new () (_ BitVec 8))
(declare-fun id8 () (_ BitVec 8))
(declare-fun send7 () (_ BitVec 8))
(declare-fun p8_new () (_ BitVec 8))
(declare-fun p7_old () (_ BitVec 8))
(declare-fun p3_old () (_ BitVec 8))
(declare-fun p8_old () (_ BitVec 8))
(declare-fun p1_old () (_ BitVec 8))
(declare-fun p2_old () (_ BitVec 8))
(declare-fun p4_old () (_ BitVec 8))
(declare-fun p5_old () (_ BitVec 8))
(declare-fun p6_old () (_ BitVec 8))
(declare-fun |node3::__CPAchecker_TMP_0| () (_ BitVec 32))
(declare-fun |node7::__CPAchecker_TMP_0| () (_ BitVec 32))
(declare-fun |node6::__CPAchecker_TMP_0| () (_ BitVec 32))
(declare-fun |node4::__CPAchecker_TMP_0| () (_ BitVec 32))
(declare-fun |node1::__CPAchecker_TMP_0| () (_ BitVec 32))
(declare-fun |node8::__CPAchecker_TMP_0| () (_ BitVec 32))
(declare-fun |node5::__CPAchecker_TMP_0| () (_ BitVec 32))

assert:
(assert (let ((.def_3526 (= |assert::arg| (_ bv0 8)))).def_3526))

main1 N562:
(assert (let ((.def_3965 (= st1 (_ bv0 8)))).def_3965))
(assert (let ((.def_3968 (= st2 (_ bv0 8)))).def_3968))
(assert (let ((.def_3971 (= st3 (_ bv0 8)))).def_3971))
(assert (let ((.def_3974 (= st4 (_ bv0 8)))).def_3974))
(assert (let ((.def_3977 (= st5 (_ bv0 8)))).def_3977))
(assert (let ((.def_3980 (= st6 (_ bv0 8)))).def_3980))
(assert (let ((.def_3983 (= st7 (_ bv0 8)))).def_3983))
(assert (let ((.def_3986 (= st8 (_ bv0 8)))).def_3986))
(assert (let ((.def_3989 (= r1 (_ bv0 8)))).def_3989))
(assert (let ((.def_3993 (= p6_new nomsg))).def_3993))
(assert (let ((.def_3996 (= nomsg p5_new))).def_3996))
(assert (let ((.def_3999 (= nomsg p4_new))).def_3999))
(assert (let ((.def_4002 (= nomsg p3_new))).def_4002))
(assert (let ((.def_4005 (= nomsg p2_new))).def_4005))
(assert (let ((.def_4008 (= nomsg p7_new))).def_4008))
(assert (let ((.def_4011 (= mode1 (_ bv0 8)))).def_4011))
(assert (let ((.def_4014 (= mode2 (_ bv0 8)))).def_4014))
(assert (let ((.def_4017 (= mode3 (_ bv0 8)))).def_4017))
(assert (let ((.def_4020 (= mode4 (_ bv0 8)))).def_4020))
(assert (let ((.def_4023 (= mode5 (_ bv0 8)))).def_4023))
(assert (let ((.def_4026 (= mode6 (_ bv0 8)))).def_4026))
(assert (let ((.def_4029 (= mode7 (_ bv0 8)))).def_4029))
(assert (let ((.def_4032 (= mode8 (_ bv0 8)))).def_4032))
(assert (let ((.def_6922 (= st1 st8))).def_6922))
(assert (let ((.def_6924 (= st2 st8))).def_6924))
(assert (let ((.def_6926 (= st3 st8))).def_6926))
(assert (let ((.def_6928 (= st4 st8))).def_6928))
(assert (let ((.def_6930 (= st5 st8))).def_6930))
(assert (let ((.def_6932 (= st6 st8))).def_6932))
(assert (let ((.def_6934 (= st7 st8))).def_6934))
(assert (let ((.def_6938 (= id4 send3))).def_6938))
(assert (let ((.def_6941 ((_ sign_extend 24) send3)))(let ((.def_6940 ((_ sign_extend 24) id4)))(let ((.def_6942 (= .def_6940 .def_6941))).def_6942))))
(assert (let ((.def_6947 ((_ sign_extend 24) id1)))(let ((.def_6945 ((_ sign_extend 24) send8)))(let ((.def_6948 (= .def_6945 .def_6947))).def_6948))))
(assert (let ((.def_6953 ((_ sign_extend 24) send1)))(let ((.def_6951 ((_ sign_extend 24) id2)))(let ((.def_6954 (= .def_6951 .def_6953))).def_6954))))
(assert (let ((.def_6958 (= id3 send2))).def_6958))
(assert (let ((.def_6961 ((_ sign_extend 24) send2)))(let ((.def_6960 ((_ sign_extend 24) id3)))(let ((.def_6962 (= .def_6960 .def_6961))).def_6962))))
(assert (let ((.def_6967 ((_ sign_extend 24) send4)))(let ((.def_6965 ((_ sign_extend 24) id5)))(let ((.def_6968 (= .def_6965 .def_6967))).def_6968))))
(assert (let ((.def_6973 ((_ sign_extend 24) send5)))(let ((.def_6971 ((_ sign_extend 24) id6)))(let ((.def_6974 (= .def_6971 .def_6973))).def_6974))))
(assert (let ((.def_6978 (= id7 send6))).def_6978))
(assert (let ((.def_6981 ((_ sign_extend 24) send6)))(let ((.def_6980 ((_ sign_extend 24) id7)))(let ((.def_6982 (= .def_6980 .def_6981))).def_6982))))
(assert (let ((.def_6985 (= nomsg p1_new))).def_6985))
(assert (let ((.def_6990 ((_ sign_extend 24) send7)))(let ((.def_6988 ((_ sign_extend 24) id8)))(let ((.def_6991 (= .def_6988 .def_6990))).def_6991))))
(assert (let ((.def_6994 (= nomsg p8_new))).def_6994))
(assert (let ((.def_6996 ((_ sign_extend 24) nomsg)))(let ((.def_6967 ((_ sign_extend 24) send4)))(let ((.def_6997 (= .def_6967 .def_6996))).def_6997))))
(assert (let ((.def_6996 ((_ sign_extend 24) nomsg)))(let ((.def_6973 ((_ sign_extend 24) send5)))(let ((.def_6999 (= .def_6973 .def_6996))).def_6999))))
(assert (let ((.def_6996 ((_ sign_extend 24) nomsg)))(let ((.def_6981 ((_ sign_extend 24) send6)))(let ((.def_7001 (= .def_6981 .def_6996))).def_7001))))
(assert (let ((.def_6996 ((_ sign_extend 24) nomsg)))(let ((.def_6990 ((_ sign_extend 24) send7)))(let ((.def_7003 (= .def_6990 .def_6996))).def_7003))))
(assert (let ((.def_7006 ((_ sign_extend 24) p7_old)))(let ((.def_6988 ((_ sign_extend 24) id8)))(let ((.def_7007 (= .def_6988 .def_7006))).def_7007))))
(assert (let ((.def_7010 ((_ sign_extend 24) p3_old)))(let ((.def_6940 ((_ sign_extend 24) id4)))(let ((.def_7011 (= .def_6940 .def_7010))).def_7011))))
(assert (let ((.def_7021 ((_ sign_extend 24) st1)))(let ((.def_7020 ((_ sign_extend 24) st2)))(let ((.def_7023 (bvadd .def_7020 .def_7021)))(let ((.def_7019 ((_ sign_extend 24) st3)))(let ((.def_7025 (bvadd .def_7019 .def_7023)))(let ((.def_7018 ((_ sign_extend 24) st4)))(let ((.def_7027 (bvadd .def_7018 .def_7025)))(let ((.def_7017 ((_ sign_extend 24) st5)))(let ((.def_7029 (bvadd .def_7017 .def_7027)))(let ((.def_7016 ((_ sign_extend 24) st6)))(let ((.def_7031 (bvadd .def_7016 .def_7029)))(let ((.def_7015 ((_ sign_extend 24) st7)))(let ((.def_7033 (bvadd .def_7015 .def_7031)))(let ((.def_7013 ((_ sign_extend 24) st8)))(let ((.def_7014 (bvneg .def_7013)))(let ((.def_7034 (= .def_7014 .def_7033))).def_7034)))))))))))))))))
(assert (let ((.def_7037 ((_ sign_extend 24) p8_old)))(let ((.def_6947 ((_ sign_extend 24) id1)))(let ((.def_7038 (= .def_6947 .def_7037))).def_7038))))
(assert (let ((.def_7041 ((_ sign_extend 24) p1_old)))(let ((.def_6951 ((_ sign_extend 24) id2)))(let ((.def_7042 (= .def_6951 .def_7041))).def_7042))))
(assert (let ((.def_7045 ((_ sign_extend 24) p2_old)))(let ((.def_6960 ((_ sign_extend 24) id3)))(let ((.def_7046 (= .def_6960 .def_7045))).def_7046))))
(assert (let ((.def_7049 ((_ sign_extend 24) p4_old)))(let ((.def_6965 ((_ sign_extend 24) id5)))(let ((.def_7050 (= .def_6965 .def_7049))).def_7050))))
(assert (let ((.def_7053 ((_ sign_extend 24) p5_old)))(let ((.def_6971 ((_ sign_extend 24) id6)))(let ((.def_7054 (= .def_6971 .def_7053))).def_7054))))
(assert (let ((.def_7057 ((_ sign_extend 24) p6_old)))(let ((.def_6980 ((_ sign_extend 24) id7)))(let ((.def_7058 (= .def_6980 .def_7057))).def_7058))))
(assert (let ((.def_7021 ((_ sign_extend 24) st1)))(let ((.def_7016 ((_ sign_extend 24) st6)))(let ((.def_25923 (= .def_7016 .def_7021))).def_25923))))
(assert (let ((.def_7021 ((_ sign_extend 24) st1)))(let ((.def_7019 ((_ sign_extend 24) st3)))(let ((.def_25925 (= .def_7019 .def_7021))).def_25925))))
(assert (let ((.def_7021 ((_ sign_extend 24) st1)))(let ((.def_7015 ((_ sign_extend 24) st7)))(let ((.def_25927 (= .def_7015 .def_7021))).def_25927))))
(assert (let ((.def_7021 ((_ sign_extend 24) st1)))(let ((.def_7018 ((_ sign_extend 24) st4)))(let ((.def_25929 (= .def_7018 .def_7021))).def_25929))))
(assert (let ((.def_7021 ((_ sign_extend 24) st1)))(let ((.def_7017 ((_ sign_extend 24) st5)))(let ((.def_25931 (= .def_7017 .def_7021))).def_25931))))
(assert (let ((.def_25933 (= st4 (_ bv1 8)))).def_25933))
(assert (let ((.def_25935 (= st3 (_ bv1 8)))).def_25935))
(assert (let ((.def_25937 (= st6 (_ bv1 8)))).def_25937))
(assert (let ((.def_25939 (= st7 (_ bv1 8)))).def_25939))
(assert (let ((.def_25941 (= st5 (_ bv1 8)))).def_25941))
(assert (let ((.def_25943 (= st1 (_ bv1 8)))).def_25943))
(assert (let ((.def_7020 ((_ sign_extend 24) st2)))(let ((.def_7018 ((_ sign_extend 24) st4)))(let ((.def_25945 (= .def_7018 .def_7020))).def_25945))))
(assert (let ((.def_7019 ((_ sign_extend 24) st3)))(let ((.def_7018 ((_ sign_extend 24) st4)))(let ((.def_25947 (= .def_7018 .def_7019))).def_25947))))
(assert (let ((.def_7020 ((_ sign_extend 24) st2)))(let ((.def_7019 ((_ sign_extend 24) st3)))(let ((.def_25949 (= .def_7019 .def_7020))).def_25949))))
(assert (let ((.def_7019 ((_ sign_extend 24) st3)))(let ((.def_7016 ((_ sign_extend 24) st6)))(let ((.def_25951 (= .def_7016 .def_7019))).def_25951))))
(assert (let ((.def_7018 ((_ sign_extend 24) st4)))(let ((.def_7016 ((_ sign_extend 24) st6)))(let ((.def_25953 (= .def_7016 .def_7018))).def_25953))))
(assert (let ((.def_7020 ((_ sign_extend 24) st2)))(let ((.def_7016 ((_ sign_extend 24) st6)))(let ((.def_25955 (= .def_7016 .def_7020))).def_25955))))
(assert (let ((.def_7016 ((_ sign_extend 24) st6)))(let ((.def_7015 ((_ sign_extend 24) st7)))(let ((.def_25957 (= .def_7015 .def_7016))).def_25957))))
(assert (let ((.def_7020 ((_ sign_extend 24) st2)))(let ((.def_7015 ((_ sign_extend 24) st7)))(let ((.def_25959 (= .def_7015 .def_7020))).def_25959))))
(assert (let ((.def_7019 ((_ sign_extend 24) st3)))(let ((.def_7015 ((_ sign_extend 24) st7)))(let ((.def_25961 (= .def_7015 .def_7019))).def_25961))))
(assert (let ((.def_7018 ((_ sign_extend 24) st4)))(let ((.def_7015 ((_ sign_extend 24) st7)))(let ((.def_25963 (= .def_7015 .def_7018))).def_25963))))
(assert (let ((.def_7018 ((_ sign_extend 24) st4)))(let ((.def_7017 ((_ sign_extend 24) st5)))(let ((.def_25965 (= .def_7017 .def_7018))).def_25965))))
(assert (let ((.def_7017 ((_ sign_extend 24) st5)))(let ((.def_7016 ((_ sign_extend 24) st6)))(let ((.def_25967 (= .def_7016 .def_7017))).def_25967))))
(assert (let ((.def_7017 ((_ sign_extend 24) st5)))(let ((.def_7015 ((_ sign_extend 24) st7)))(let ((.def_25969 (= .def_7015 .def_7017))).def_25969))))
(assert (let ((.def_7019 ((_ sign_extend 24) st3)))(let ((.def_7017 ((_ sign_extend 24) st5)))(let ((.def_25971 (= .def_7017 .def_7019))).def_25971))))
(assert (let ((.def_7020 ((_ sign_extend 24) st2)))(let ((.def_7017 ((_ sign_extend 24) st5)))(let ((.def_25973 (= .def_7017 .def_7020))).def_25973))))
(assert (let ((.def_25975 (= st2 (_ bv1 8)))).def_25975))
(assert (let ((.def_7021 ((_ sign_extend 24) st1)))(let ((.def_7020 ((_ sign_extend 24) st2)))(let ((.def_25977 (= .def_7020 .def_7021))).def_25977))))
(assert (let ((.def_25979 ((_ sign_extend 24) r1)))(let ((.def_25980 (bvslt .def_25979 (_ bv8 32)))).def_25980)))
(assert (let ((.def_6941 ((_ sign_extend 24) send3)))(let ((.def_6940 ((_ sign_extend 24) id4)))(let ((.def_53826 (bvslt .def_6940 .def_6941))).def_53826))))
(assert (let ((.def_6961 ((_ sign_extend 24) send2)))(let ((.def_6960 ((_ sign_extend 24) id3)))(let ((.def_53828 (bvslt .def_6960 .def_6961))).def_53828))))
(assert (let ((.def_6953 ((_ sign_extend 24) send1)))(let ((.def_6960 ((_ sign_extend 24) id3)))(let ((.def_53830 (bvslt .def_6960 .def_6953))).def_53830))))
(assert (let ((.def_6953 ((_ sign_extend 24) send1)))(let ((.def_6951 ((_ sign_extend 24) id2)))(let ((.def_53832 (bvslt .def_6951 .def_6953))).def_53832))))
(assert (let ((.def_6961 ((_ sign_extend 24) send2)))(let ((.def_6940 ((_ sign_extend 24) id4)))(let ((.def_53834 (= .def_6940 .def_6961))).def_53834))))
(assert (let ((.def_6960 ((_ sign_extend 24) id3)))(let ((.def_6953 ((_ sign_extend 24) send1)))(let ((.def_53836 (= .def_6953 .def_6960))).def_53836))))
(assert (let ((.def_6990 ((_ sign_extend 24) send7)))(let ((.def_6988 ((_ sign_extend 24) id8)))(let ((.def_53838 (bvslt .def_6988 .def_6990))).def_53838))))
(assert (let ((.def_6980 ((_ sign_extend 24) id7)))(let ((.def_6973 ((_ sign_extend 24) send5)))(let ((.def_53840 (= .def_6973 .def_6980))).def_53840))))
(assert (let ((.def_6990 ((_ sign_extend 24) send7)))(let ((.def_6980 ((_ sign_extend 24) id7)))(let ((.def_53842 (= .def_6980 .def_6990))).def_53842))))
(assert (let ((.def_6988 ((_ sign_extend 24) id8)))(let ((.def_6981 ((_ sign_extend 24) send6)))(let ((.def_53844 (= .def_6981 .def_6988))).def_53844))))
(assert (let ((.def_6981 ((_ sign_extend 24) send6)))(let ((.def_6980 ((_ sign_extend 24) id7)))(let ((.def_53846 (bvslt .def_6980 .def_6981))).def_53846))))
(assert (let ((.def_6973 ((_ sign_extend 24) send5)))(let ((.def_6971 ((_ sign_extend 24) id6)))(let ((.def_53848 (bvslt .def_6971 .def_6973))).def_53848))))
(assert (let ((.def_6965 ((_ sign_extend 24) id5)))(let ((.def_6941 ((_ sign_extend 24) send3)))(let ((.def_53850 (= .def_6941 .def_6965))).def_53850))))
(assert (let ((.def_6951 ((_ sign_extend 24) id2)))(let ((.def_6945 ((_ sign_extend 24) send8)))(let ((.def_53852 (= .def_6945 .def_6951))).def_53852))))
(assert (let ((.def_6945 ((_ sign_extend 24) send8)))(let ((.def_6947 ((_ sign_extend 24) id1)))(let ((.def_53854 (bvslt .def_6947 .def_6945))).def_53854))))
(assert (let ((.def_6990 ((_ sign_extend 24) send7)))(let ((.def_6947 ((_ sign_extend 24) id1)))(let ((.def_53856 (= .def_6947 .def_6990))).def_53856))))
(assert (let ((.def_6971 ((_ sign_extend 24) id6)))(let ((.def_6967 ((_ sign_extend 24) send4)))(let ((.def_53858 (= .def_6967 .def_6971))).def_53858))))
(assert (let ((.def_6973 ((_ sign_extend 24) send5)))(let ((.def_6965 ((_ sign_extend 24) id5)))(let ((.def_53860 (= .def_6965 .def_6973))).def_53860))))
(assert (let ((.def_6996 ((_ sign_extend 24) nomsg)))(let ((.def_6945 ((_ sign_extend 24) send8)))(let ((.def_53862 (= .def_6945 .def_6996))).def_53862))))
(assert (let ((.def_6996 ((_ sign_extend 24) nomsg)))(let ((.def_6953 ((_ sign_extend 24) send1)))(let ((.def_53864 (= .def_6953 .def_6996))).def_53864))))
(assert (let ((.def_6960 ((_ sign_extend 24) id3)))(let ((.def_6941 ((_ sign_extend 24) send3)))(let ((.def_53866 (= .def_6941 .def_6960))).def_53866))))
(assert (let ((.def_6996 ((_ sign_extend 24) nomsg)))(let ((.def_6941 ((_ sign_extend 24) send3)))(let ((.def_53868 (= .def_6941 .def_6996))).def_53868))))
(assert (let ((.def_53870 (= nomsg send7))).def_53870))
(assert (let ((.def_6996 ((_ sign_extend 24) nomsg)))(let ((.def_6961 ((_ sign_extend 24) send2)))(let ((.def_53872 (= .def_6961 .def_6996))).def_53872))))
(assert (let ((.def_7041 ((_ sign_extend 24) p1_old)))(let ((.def_6960 ((_ sign_extend 24) id3)))(let ((.def_53874 (= .def_6960 .def_7041))).def_53874))))
(assert (let ((.def_53876 (= send2 p2_old))).def_53876))
(assert (let ((.def_6941 ((_ sign_extend 24) send3)))(let ((.def_53879 (= .def_6941 |node3::__CPAchecker_TMP_0|))).def_53879)))
(assert (let ((.def_53881 ((_ extract 7 0) |node3::__CPAchecker_TMP_0|)))(let ((.def_53882 (= p3_old .def_53881))).def_53882)))
(assert (let ((.def_7010 ((_ sign_extend 24) p3_old)))(let ((.def_6940 ((_ sign_extend 24) id4)))(let ((.def_53884 (bvslt .def_6940 .def_7010))).def_53884))))
(assert (let ((.def_7045 ((_ sign_extend 24) p2_old)))(let ((.def_6960 ((_ sign_extend 24) id3)))(let ((.def_53886 (bvslt .def_6960 .def_7045))).def_53886))))
(assert (let ((.def_7041 ((_ sign_extend 24) p1_old)))(let ((.def_6960 ((_ sign_extend 24) id3)))(let ((.def_53888 (bvslt .def_6960 .def_7041))).def_53888))))
(assert (let ((.def_7041 ((_ sign_extend 24) p1_old)))(let ((.def_6951 ((_ sign_extend 24) id2)))(let ((.def_53890 (bvslt .def_6951 .def_7041))).def_53890))))
(assert (let ((.def_53892 (= nomsg p1_old))).def_53892))
(assert (let ((.def_7041 ((_ sign_extend 24) p1_old)))(let ((.def_6996 ((_ sign_extend 24) nomsg)))(let ((.def_53894 (= .def_6996 .def_7041))).def_53894))))
(assert (let ((.def_7045 ((_ sign_extend 24) p2_old)))(let ((.def_6940 ((_ sign_extend 24) id4)))(let ((.def_53896 (= .def_6940 .def_7045))).def_53896))))
(assert (let ((.def_7006 ((_ sign_extend 24) p7_old)))(let ((.def_6988 ((_ sign_extend 24) id8)))(let ((.def_53898 (bvslt .def_6988 .def_7006))).def_53898))))
(assert (let ((.def_6990 ((_ sign_extend 24) send7)))(let ((.def_53901 (= .def_6990 |node7::__CPAchecker_TMP_0|))).def_53901)))
(assert (let ((.def_53903 ((_ extract 7 0) |node7::__CPAchecker_TMP_0|)))(let ((.def_53904 (= p7_old .def_53903))).def_53904)))
(assert (let ((.def_7053 ((_ sign_extend 24) p5_old)))(let ((.def_6980 ((_ sign_extend 24) id7)))(let ((.def_53906 (= .def_6980 .def_7053))).def_53906))))
(assert (let ((.def_53909 ((_ extract 7 0) |node6::__CPAchecker_TMP_0|)))(let ((.def_53910 (= p6_old .def_53909))).def_53910)))
(assert (let ((.def_6996 ((_ sign_extend 24) nomsg)))(let ((.def_6980 ((_ sign_extend 24) id7)))(let ((.def_53912 (= .def_6980 .def_6996))).def_53912))))
(assert (let ((.def_7057 ((_ sign_extend 24) p6_old)))(let ((.def_6988 ((_ sign_extend 24) id8)))(let ((.def_53914 (= .def_6988 .def_7057))).def_53914))))
(assert (let ((.def_7053 ((_ sign_extend 24) p5_old)))(let ((.def_6971 ((_ sign_extend 24) id6)))(let ((.def_53916 (bvslt .def_6971 .def_7053))).def_53916))))
(assert (let ((.def_7057 ((_ sign_extend 24) p6_old)))(let ((.def_6980 ((_ sign_extend 24) id7)))(let ((.def_53918 (bvslt .def_6980 .def_7057))).def_53918))))
(assert (let ((.def_7057 ((_ sign_extend 24) p6_old)))(let ((.def_6996 ((_ sign_extend 24) nomsg)))(let ((.def_53920 (= .def_6996 .def_7057))).def_53920))))
(assert (let ((.def_53922 (= send4 p4_old))).def_53922))
(assert (let ((.def_6967 ((_ sign_extend 24) send4)))(let ((.def_53925 (= .def_6967 |node4::__CPAchecker_TMP_0|))).def_53925)))
(assert (let ((.def_53927 ((_ extract 7 0) |node4::__CPAchecker_TMP_0|)))(let ((.def_53928 (= p4_old .def_53927))).def_53928)))
(assert (let ((.def_7010 ((_ sign_extend 24) p3_old)))(let ((.def_6965 ((_ sign_extend 24) id5)))(let ((.def_53930 (= .def_6965 .def_7010))).def_53930))))
(assert (let ((.def_6953 ((_ sign_extend 24) send1)))(let ((.def_53933 (= .def_6953 |node1::__CPAchecker_TMP_0|))).def_53933)))
(assert (let ((.def_53935 ((_ extract 7 0) |node1::__CPAchecker_TMP_0|)))(let ((.def_53936 (= p1_old .def_53935))).def_53936)))
(assert (let ((.def_7037 ((_ sign_extend 24) p8_old)))(let ((.def_6951 ((_ sign_extend 24) id2)))(let ((.def_53938 (= .def_6951 .def_7037))).def_53938))))
(assert (let ((.def_6945 ((_ sign_extend 24) send8)))(let ((.def_53941 (= .def_6945 |node8::__CPAchecker_TMP_0|))).def_53941)))
(assert (let ((.def_53943 ((_ extract 7 0) |node8::__CPAchecker_TMP_0|)))(let ((.def_53944 (= p8_old .def_53943))).def_53944)))
(assert (let ((.def_7037 ((_ sign_extend 24) p8_old)))(let ((.def_6947 ((_ sign_extend 24) id1)))(let ((.def_53946 (bvslt .def_6947 .def_7037))).def_53946))))
(assert (let ((.def_7006 ((_ sign_extend 24) p7_old)))(let ((.def_6947 ((_ sign_extend 24) id1)))(let ((.def_53948 (= .def_6947 .def_7006))).def_53948))))
(assert (let ((.def_7049 ((_ sign_extend 24) p4_old)))(let ((.def_6971 ((_ sign_extend 24) id6)))(let ((.def_53950 (= .def_6971 .def_7049))).def_53950))))
(assert (let ((.def_6973 ((_ sign_extend 24) send5)))(let ((.def_53953 (= .def_6973 |node5::__CPAchecker_TMP_0|))).def_53953)))
(assert (let ((.def_53955 ((_ extract 7 0) |node5::__CPAchecker_TMP_0|)))(let ((.def_53956 (= p5_old .def_53955))).def_53956)))
(assert (let ((.def_7037 ((_ sign_extend 24) p8_old)))(let ((.def_6996 ((_ sign_extend 24) nomsg)))(let ((.def_53958 (= .def_6996 .def_7037))).def_53958))))
(assert (let ((.def_7010 ((_ sign_extend 24) p3_old)))(let ((.def_6996 ((_ sign_extend 24) nomsg)))(let ((.def_53960 (= .def_6996 .def_7010))).def_53960))))
(assert (let ((.def_7049 ((_ sign_extend 24) p4_old)))(let ((.def_6996 ((_ sign_extend 24) nomsg)))(let ((.def_53962 (= .def_6996 .def_7049))).def_53962))))
(assert (let ((.def_53964 (= p4_old p5_old))).def_53964))
(assert (let ((.def_7053 ((_ sign_extend 24) p5_old)))(let ((.def_6996 ((_ sign_extend 24) nomsg)))(let ((.def_53966 (= .def_6996 .def_7053))).def_53966))))
(assert (let ((.def_6981 ((_ sign_extend 24) send6)))(let ((.def_53968 (= .def_6981 |node6::__CPAchecker_TMP_0|))).def_53968)))
(assert (let ((.def_7006 ((_ sign_extend 24) p7_old)))(let ((.def_6996 ((_ sign_extend 24) nomsg)))(let ((.def_53970 (= .def_6996 .def_7006))).def_53970))))
(assert (let ((.def_53972 (= send3 send2))).def_53972))
(assert (let ((.def_53974 (= st8 (_ bv1 8)))).def_53974))
(assert (let ((.def_53976 (= send4 send5))).def_53976))
(assert (let ((.def_6973 ((_ sign_extend 24) send5)))(let ((.def_6965 ((_ sign_extend 24) id5)))(let ((.def_53978 (bvslt .def_6965 .def_6973))).def_53978))))
(assert (let ((.def_53980 (= id5 send4))).def_53980))
(assert (let ((.def_53982 (= r1 (_ bv1 8)))).def_53982))
(assert (let ((.def_7045 ((_ sign_extend 24) p2_old)))(let ((.def_6996 ((_ sign_extend 24) nomsg)))(let ((.def_53984 (= .def_6996 .def_7045))).def_53984))))
(assert (let ((.def_53986 (= send3 p2_old))).def_53986))
(assert (let ((.def_53988 (= send5 p4_old))).def_53988))

assert N601:
(assert false)
(assert (let ((.def_3526 (= |assert::arg| (_ bv0 8)))).def_3526))

