(set-info :source |printed by MathSAT|)
(declare-fun a20 () (_ BitVec 32))
(declare-fun a2 () (_ BitVec 32))
(declare-fun a27 () (_ BitVec 32))
(declare-fun a16 () (_ BitVec 32))
(declare-fun a15 () (_ BitVec 32))
(declare-fun a12 () (_ BitVec 32))
(declare-fun a25 () (_ BitVec 32))
(declare-fun a9 () (_ BitVec 32))

*:
(assert (let ((.def_106308 (= a20 (_ bv5 32)))).def_106308))

calculate_output8 N29723:
(assert false)
(assert (let ((.def_106308 (= a20 (_ bv5 32)))).def_106308))

main1 N30136:
(assert (let ((.def_153285 (= a2 (_ bv10 32)))).def_153285))
(assert (let ((.def_153288 (= a27 (_ bv1 32)))).def_153288))
(assert (let ((.def_153291 (= a16 (_ bv1 32)))).def_153291))
(assert (let ((.def_153294 (= a15 (_ bv1 32)))).def_153294))
(assert (let ((.def_153297 (= a12 (_ bv4 32)))).def_153297))
(assert (let ((.def_153300 (= a25 (_ bv1 32)))).def_153300))
(assert (let ((.def_106308 (= a20 (_ bv5 32)))).def_106308))
(assert (let ((.def_321276 (= a9 (_ bv18 32)))).def_321276))
(assert (let ((.def_321278 (= a20 (_ bv6 32)))).def_321278))
(assert (let ((.def_321280 (= a12 (_ bv3 32)))).def_321280))
(assert (let ((.def_321282 (= a2 (_ bv13 32)))).def_321282))
(assert (let ((.def_321284 (= a2 (_ bv9 32)))).def_321284))
(assert (let ((.def_321286 (= a12 (_ bv2 32)))).def_321286))
(assert (let ((.def_321288 (= a2 (_ bv11 32)))).def_321288))
(assert (let ((.def_321290 (= a9 (_ bv16 32)))).def_321290))
(assert (let ((.def_321292 (= a9 (_ bv17 32)))).def_321292))

