(set-info :source |printed by MathSAT|)
(declare-fun a20 () (_ BitVec 32))
(declare-fun a25 () (_ BitVec 32))
(declare-fun a12 () (_ BitVec 32))
(declare-fun a15 () (_ BitVec 32))
(declare-fun a16 () (_ BitVec 32))
(declare-fun a2 () (_ BitVec 32))
(declare-fun a27 () (_ BitVec 32))
(declare-fun a9 () (_ BitVec 32))
(declare-fun m_pc () (_ BitVec 32))
(declare-fun t1_pc () (_ BitVec 32))
(declare-fun t2_pc () (_ BitVec 32))
(declare-fun t3_pc () (_ BitVec 32))
(declare-fun t4_pc () (_ BitVec 32))
(declare-fun t5_pc () (_ BitVec 32))
(declare-fun t6_pc () (_ BitVec 32))
(declare-fun m_st () (_ BitVec 32))
(declare-fun E_1 () (_ BitVec 32))
(declare-fun E_2 () (_ BitVec 32))
(declare-fun E_4 () (_ BitVec 32))
(declare-fun E_3 () (_ BitVec 32))
(declare-fun E_M () (_ BitVec 32))
(declare-fun E_5 () (_ BitVec 32))
(declare-fun E_6 () (_ BitVec 32))
(declare-fun t2_st () (_ BitVec 32))
(declare-fun t1_st () (_ BitVec 32))
(declare-fun t3_st () (_ BitVec 32))
(declare-fun t4_st () (_ BitVec 32))
(declare-fun t6_st () (_ BitVec 32))
(declare-fun t5_st () (_ BitVec 32))
(declare-fun local () (_ BitVec 32))
(declare-fun token () (_ BitVec 32))
(declare-fun T6_E () (_ BitVec 32))
(declare-fun T5_E () (_ BitVec 32))
(declare-fun T4_E () (_ BitVec 32))
(declare-fun T3_E () (_ BitVec 32))
(declare-fun T2_E () (_ BitVec 32))
(declare-fun T1_E () (_ BitVec 32))
(declare-fun M_E () (_ BitVec 32))

*:
(assert (let ((.def_107188 (= a20 (_ bv5 32)))).def_107188))

calculate_output8 N29943:
(assert false)
(assert (let ((.def_107188 (= a20 (_ bv5 32)))).def_107188))

main1 N30136:
(assert (let ((.def_107188 (= a20 (_ bv5 32)))).def_107188))
(assert (let ((.def_154555 (= a25 (_ bv1 32)))).def_154555))
(assert (let ((.def_154558 (= a12 (_ bv4 32)))).def_154558))
(assert (let ((.def_154561 (= a15 (_ bv1 32)))).def_154561))
(assert (let ((.def_154564 (= a16 (_ bv1 32)))).def_154564))
(assert (let ((.def_154567 (= a2 (_ bv10 32)))).def_154567))
(assert (let ((.def_154570 (= a27 (_ bv1 32)))).def_154570))
(assert (let ((.def_154573 (= a9 (_ bv18 32)))).def_154573))
(assert (let ((.def_586280 (= a2 (_ bv13 32)))).def_586280))
(assert (let ((.def_586282 (= a2 (_ bv9 32)))).def_586282))
(assert (let ((.def_586284 (= a2 (_ bv12 32)))).def_586284))
(assert (let ((.def_586286 (= a20 (_ bv7 32)))).def_586286))
(assert (let ((.def_586288 (= a20 (_ bv6 32)))).def_586288))
(assert (let ((.def_586290 (= a12 (_ bv3 32)))).def_586290))
(assert (let ((.def_586292 (= a12 (_ bv2 32)))).def_586292))
(assert (let ((.def_586294 (= a12 (_ bv5 32)))).def_586294))
(assert (let ((.def_586296 (= a2 (_ bv11 32)))).def_586296))
(assert (let ((.def_586298 (= a9 (_ bv16 32)))).def_586298))
(assert (let ((.def_586300 (= a12 (_ bv6 32)))).def_586300))
(assert (let ((.def_586302 (= a9 (_ bv17 32)))).def_586302))

error N30154:
(assert false)
(assert (let ((.def_107188 (= a20 (_ bv5 32)))).def_107188))

eval N30558:
(assert (let ((.def_923205 (= m_pc (_ bv0 32)))).def_923205))
(assert (let ((.def_107188 (= a20 (_ bv5 32)))).def_107188))
(assert (let ((.def_927303 (= t1_pc (_ bv0 32)))).def_927303))
(assert (let ((.def_927306 (= t2_pc (_ bv0 32)))).def_927306))
(assert (let ((.def_927309 (= t3_pc (_ bv0 32)))).def_927309))
(assert (let ((.def_927312 (= t4_pc (_ bv0 32)))).def_927312))
(assert (let ((.def_927315 (= t5_pc (_ bv0 32)))).def_927315))
(assert (let ((.def_927318 (= t6_pc (_ bv0 32)))).def_927318))
(assert (let ((.def_927320 (= m_pc (_ bv1 32)))).def_927320))
(assert (let ((.def_927322 (= t1_pc (_ bv1 32)))).def_927322))
(assert (let ((.def_927324 (= t2_pc (_ bv1 32)))).def_927324))
(assert (let ((.def_927326 (= t3_pc (_ bv1 32)))).def_927326))
(assert (let ((.def_927328 (= t4_pc (_ bv1 32)))).def_927328))
(assert (let ((.def_927330 (= t5_pc (_ bv1 32)))).def_927330))
(assert (let ((.def_927332 (= t6_pc (_ bv1 32)))).def_927332))
(assert (let ((.def_927335 (= m_st (_ bv0 32)))).def_927335))
(assert (let ((.def_934424 (= E_1 (_ bv1 32)))).def_934424))
(assert (let ((.def_934427 (= E_2 (_ bv1 32)))).def_934427))
(assert (let ((.def_934430 (= E_4 (_ bv2 32)))).def_934430))
(assert (let ((.def_934432 (= E_4 (_ bv1 32)))).def_934432))
(assert (let ((.def_934435 (= E_3 (_ bv1 32)))).def_934435))
(assert (let ((.def_934438 (= E_M (_ bv1 32)))).def_934438))
(assert (let ((.def_934441 (= E_5 (_ bv1 32)))).def_934441))
(assert (let ((.def_934444 (= E_6 (_ bv1 32)))).def_934444))
(assert (let ((.def_934447 (= t2_st (_ bv0 32)))).def_934447))
(assert (let ((.def_934450 (= t1_st (_ bv0 32)))).def_934450))
(assert (let ((.def_934453 (= t3_st (_ bv0 32)))).def_934453))
(assert (let ((.def_934456 (= t4_st (_ bv0 32)))).def_934456))
(assert (let ((.def_934459 (= t6_st (_ bv0 32)))).def_934459))
(assert (let ((.def_934462 (= t5_st (_ bv0 32)))).def_934462))
(assert (let ((.def_934464 (= m_st (_ bv2 32)))).def_934464))
(assert (let ((.def_934467 (bvadd (_ bv6 32) local)))(let ((.def_934469 (= .def_934467 token))).def_934469)))
(assert (let ((.def_959701 (= E_5 (_ bv2 32)))).def_959701))
(assert (let ((.def_959703 (= local (_ bv0 32)))).def_959703))
(assert (let ((.def_959705 (= token (_ bv0 32)))).def_959705))
(assert (let ((.def_959707 (= E_2 (_ bv2 32)))).def_959707))
(assert (let ((.def_959709 (= t4_st (_ bv2 32)))).def_959709))
(assert (let ((.def_959711 (= t5_st (_ bv2 32)))).def_959711))
(assert (let ((.def_959713 (= t6_st (_ bv2 32)))).def_959713))
(assert (let ((.def_959715 (bvadd (_ bv5 32) local)))(let ((.def_959716 (= token .def_959715))).def_959716)))
(assert (let ((.def_959718 (= local token))).def_959718))
(assert (let ((.def_959720 (bvadd (_ bv4 32) local)))(let ((.def_959721 (= token .def_959720))).def_959721)))
(assert (let ((.def_959723 (bvadd (_ bv3 32) local)))(let ((.def_959724 (= token .def_959723))).def_959724)))
(assert (let ((.def_959726 (bvadd (_ bv2 32) local)))(let ((.def_959727 (= token .def_959726))).def_959727)))
(assert (let ((.def_959729 (bvadd (_ bv1 32) local)))(let ((.def_959730 (= token .def_959729))).def_959730)))
(assert (let ((.def_984731 (= T6_E (_ bv0 32)))).def_984731))
(assert (let ((.def_984734 (= T5_E (_ bv0 32)))).def_984734))
(assert (let ((.def_984737 (= T4_E (_ bv0 32)))).def_984737))
(assert (let ((.def_984740 (= T3_E (_ bv0 32)))).def_984740))
(assert (let ((.def_984743 (= T2_E (_ bv0 32)))).def_984743))
(assert (let ((.def_984746 (= T1_E (_ bv0 32)))).def_984746))
(assert (let ((.def_984748 (= E_M (_ bv0 32)))).def_984748))
(assert (let ((.def_984751 (= M_E (_ bv0 32)))).def_984751))
(assert (let ((.def_984753 (= E_1 (_ bv0 32)))).def_984753))
(assert (let ((.def_1012568 (= E_4 (_ bv0 32)))).def_1012568))
(assert (let ((.def_1012570 (= E_5 (_ bv0 32)))).def_1012570))
(assert (let ((.def_1012572 (= E_3 (_ bv0 32)))).def_1012572))
(assert (let ((.def_1012574 (= E_2 (_ bv0 32)))).def_1012574))
(assert (let ((.def_1012576 (= E_6 (_ bv0 32)))).def_1012576))
(assert false)

start_simulation N30913:
(assert (let ((.def_923205 (= m_pc (_ bv0 32)))).def_923205))
(assert (let ((.def_107188 (= a20 (_ bv5 32)))).def_107188))
(assert (let ((.def_927303 (= t1_pc (_ bv0 32)))).def_927303))
(assert (let ((.def_927306 (= t2_pc (_ bv0 32)))).def_927306))
(assert (let ((.def_927309 (= t3_pc (_ bv0 32)))).def_927309))
(assert (let ((.def_927312 (= t4_pc (_ bv0 32)))).def_927312))
(assert (let ((.def_927315 (= t5_pc (_ bv0 32)))).def_927315))
(assert (let ((.def_927318 (= t6_pc (_ bv0 32)))).def_927318))
(assert (let ((.def_927320 (= m_pc (_ bv1 32)))).def_927320))
(assert (let ((.def_927322 (= t1_pc (_ bv1 32)))).def_927322))
(assert (let ((.def_927324 (= t2_pc (_ bv1 32)))).def_927324))
(assert (let ((.def_927326 (= t3_pc (_ bv1 32)))).def_927326))
(assert (let ((.def_927328 (= t4_pc (_ bv1 32)))).def_927328))
(assert (let ((.def_927330 (= t5_pc (_ bv1 32)))).def_927330))
(assert (let ((.def_927332 (= t6_pc (_ bv1 32)))).def_927332))
(assert (let ((.def_934424 (= E_1 (_ bv1 32)))).def_934424))
(assert (let ((.def_934427 (= E_2 (_ bv1 32)))).def_934427))
(assert (let ((.def_934430 (= E_4 (_ bv2 32)))).def_934430))
(assert (let ((.def_934432 (= E_4 (_ bv1 32)))).def_934432))
(assert (let ((.def_934435 (= E_3 (_ bv1 32)))).def_934435))
(assert (let ((.def_934438 (= E_M (_ bv1 32)))).def_934438))
(assert (let ((.def_934441 (= E_5 (_ bv1 32)))).def_934441))
(assert (let ((.def_934444 (= E_6 (_ bv1 32)))).def_934444))
(assert (let ((.def_934447 (= t2_st (_ bv0 32)))).def_934447))
(assert (let ((.def_934450 (= t1_st (_ bv0 32)))).def_934450))
(assert (let ((.def_927335 (= m_st (_ bv0 32)))).def_927335))
(assert (let ((.def_959701 (= E_5 (_ bv2 32)))).def_959701))
(assert (let ((.def_959703 (= local (_ bv0 32)))).def_959703))
(assert (let ((.def_959705 (= token (_ bv0 32)))).def_959705))
(assert (let ((.def_959707 (= E_2 (_ bv2 32)))).def_959707))
(assert (let ((.def_934459 (= t6_st (_ bv0 32)))).def_934459))
(assert (let ((.def_984731 (= T6_E (_ bv0 32)))).def_984731))
(assert (let ((.def_984734 (= T5_E (_ bv0 32)))).def_984734))
(assert (let ((.def_984737 (= T4_E (_ bv0 32)))).def_984737))
(assert (let ((.def_984740 (= T3_E (_ bv0 32)))).def_984740))
(assert (let ((.def_984743 (= T2_E (_ bv0 32)))).def_984743))
(assert (let ((.def_984746 (= T1_E (_ bv0 32)))).def_984746))
(assert (let ((.def_984748 (= E_M (_ bv0 32)))).def_984748))
(assert (let ((.def_984751 (= M_E (_ bv0 32)))).def_984751))
(assert (let ((.def_934456 (= t4_st (_ bv0 32)))).def_934456))
(assert (let ((.def_934462 (= t5_st (_ bv0 32)))).def_934462))
(assert (let ((.def_1012568 (= E_4 (_ bv0 32)))).def_1012568))
(assert (let ((.def_1012570 (= E_5 (_ bv0 32)))).def_1012570))
(assert (let ((.def_1012572 (= E_3 (_ bv0 32)))).def_1012572))
(assert (let ((.def_1012574 (= E_2 (_ bv0 32)))).def_1012574))
(assert (let ((.def_1012576 (= E_6 (_ bv0 32)))).def_1012576))
(assert (let ((.def_984753 (= E_1 (_ bv0 32)))).def_984753))
(assert (let ((.def_934453 (= t3_st (_ bv0 32)))).def_934453))

