(set-info :source |printed by MathSAT|)
(declare-fun c_num_read () (_ BitVec 32))
(declare-fun p_num_write () (_ BitVec 32))
(declare-fun c_last_read () (_ BitVec 32))
(declare-fun p_last_write () (_ BitVec 32))
(declare-fun c_dr_pc () (_ BitVec 32))
(declare-fun q_free () (_ BitVec 32))
(declare-fun q_buf_0 () (_ BitVec 32))
(declare-fun c_dr_st () (_ BitVec 32))
(declare-fun q_req_up () (_ BitVec 32))
(declare-fun q_write_ev () (_ BitVec 32))
(declare-fun q_read_ev () (_ BitVec 32))
(declare-fun p_dw_pc () (_ BitVec 32))
(declare-fun p_dw_st () (_ BitVec 32))
(declare-fun m_pc () (_ BitVec 32))
(declare-fun t1_pc () (_ BitVec 32))
(declare-fun t2_pc () (_ BitVec 32))
(declare-fun t3_pc () (_ BitVec 32))
(declare-fun t4_pc () (_ BitVec 32))
(declare-fun t5_pc () (_ BitVec 32))
(declare-fun t6_pc () (_ BitVec 32))
(declare-fun t7_pc () (_ BitVec 32))
(declare-fun t8_pc () (_ BitVec 32))
(declare-fun t9_pc () (_ BitVec 32))
(declare-fun t10_pc () (_ BitVec 32))
(declare-fun t11_pc () (_ BitVec 32))
(declare-fun m_st () (_ BitVec 32))

*:
(assert (let ((.def_649 (= c_num_read p_num_write))).def_649))
(assert (let ((.def_658 (= c_last_read p_last_write))).def_658))

error1 N4:
(assert false)
(assert (let ((.def_649 (= c_num_read p_num_write))).def_649))
(assert (let ((.def_658 (= c_last_read p_last_write))).def_658))

do_write_p N78:
(assert (let ((.def_845 (= c_dr_pc (_ bv0 32)))).def_845))
(assert (let ((.def_649 (= c_num_read p_num_write))).def_649))
(assert (let ((.def_658 (= c_last_read p_last_write))).def_658))
(assert (let ((.def_913 (= q_free (_ bv1 32)))).def_913))
(assert false)
(assert (let ((.def_1097 (= p_last_write q_buf_0))).def_1097))
(assert (let ((.def_1237 (= c_dr_pc (_ bv1 32)))).def_1237))
(assert (let ((.def_1239 (= q_free (_ bv0 32)))).def_1239))
(assert (let ((.def_1243 (bvadd (_ bv1 32) c_num_read)))(let ((.def_1244 (= p_num_write .def_1243))).def_1244)))
(assert (let ((.def_1925 (= c_dr_st (_ bv0 32)))).def_1925))
(assert (let ((.def_4325 (= q_req_up (_ bv1 32)))).def_4325))
(assert (let ((.def_5958 (= q_write_ev (_ bv1 32)))).def_5958))
(assert (let ((.def_5960 (= q_write_ev (_ bv0 32)))).def_5960))
(assert (let ((.def_8295 (= q_read_ev (_ bv1 32)))).def_8295))
(assert (let ((.def_8297 (= q_read_ev (_ bv0 32)))).def_8297))

do_read_c N112:
(assert (let ((.def_913 (= q_free (_ bv1 32)))).def_913))
(assert (let ((.def_649 (= c_num_read p_num_write))).def_649))
(assert (let ((.def_658 (= c_last_read p_last_write))).def_658))
(assert (let ((.def_1097 (= p_last_write q_buf_0))).def_1097))
(assert (let ((.def_1243 (bvadd (_ bv1 32) c_num_read)))(let ((.def_1244 (= p_num_write .def_1243))).def_1244)))
(assert false)
(assert (let ((.def_1239 (= q_free (_ bv0 32)))).def_1239))
(assert (let ((.def_5958 (= q_write_ev (_ bv1 32)))).def_5958))
(assert (let ((.def_5960 (= q_write_ev (_ bv0 32)))).def_5960))
(assert (let ((.def_1241 (= p_dw_pc (_ bv1 32)))).def_1241))
(assert (let ((.def_4325 (= q_req_up (_ bv1 32)))).def_4325))
(assert (let ((.def_2399 (= p_dw_st (_ bv0 32)))).def_2399))
(assert (let ((.def_8295 (= q_read_ev (_ bv1 32)))).def_8295))
(assert (let ((.def_8297 (= q_read_ev (_ bv0 32)))).def_8297))

eval1 N228:
(assert (let ((.def_845 (= c_dr_pc (_ bv0 32)))).def_845))
(assert (let ((.def_649 (= c_num_read p_num_write))).def_649))
(assert (let ((.def_658 (= c_last_read p_last_write))).def_658))
(assert (let ((.def_913 (= q_free (_ bv1 32)))).def_913))
(assert (let ((.def_1055 (= p_dw_pc (_ bv0 32)))).def_1055))
(assert (let ((.def_1237 (= c_dr_pc (_ bv1 32)))).def_1237))
(assert (let ((.def_1239 (= q_free (_ bv0 32)))).def_1239))
(assert (let ((.def_1241 (= p_dw_pc (_ bv1 32)))).def_1241))
(assert (let ((.def_2399 (= p_dw_st (_ bv0 32)))).def_2399))
(assert (let ((.def_1097 (= p_last_write q_buf_0))).def_1097))
(assert (let ((.def_1243 (bvadd (_ bv1 32) c_num_read)))(let ((.def_1244 (= p_num_write .def_1243))).def_1244)))
(assert (let ((.def_1925 (= c_dr_st (_ bv0 32)))).def_1925))
(assert (let ((.def_4325 (= q_req_up (_ bv1 32)))).def_4325))
(assert (let ((.def_5958 (= q_write_ev (_ bv1 32)))).def_5958))
(assert (let ((.def_5960 (= q_write_ev (_ bv0 32)))).def_5960))
(assert (let ((.def_8295 (= q_read_ev (_ bv1 32)))).def_8295))
(assert (let ((.def_8297 (= q_read_ev (_ bv0 32)))).def_8297))

start_simulation1 N283:
(assert (let ((.def_845 (= c_dr_pc (_ bv0 32)))).def_845))
(assert (let ((.def_649 (= c_num_read p_num_write))).def_649))
(assert (let ((.def_658 (= c_last_read p_last_write))).def_658))
(assert (let ((.def_913 (= q_free (_ bv1 32)))).def_913))
(assert (let ((.def_1055 (= p_dw_pc (_ bv0 32)))).def_1055))
(assert (let ((.def_1237 (= c_dr_pc (_ bv1 32)))).def_1237))
(assert (let ((.def_1239 (= q_free (_ bv0 32)))).def_1239))
(assert (let ((.def_1241 (= p_dw_pc (_ bv1 32)))).def_1241))
(assert (let ((.def_1925 (= c_dr_st (_ bv0 32)))).def_1925))
(assert (let ((.def_2399 (= p_dw_st (_ bv0 32)))).def_2399))
(assert (let ((.def_1097 (= p_last_write q_buf_0))).def_1097))
(assert (let ((.def_5958 (= q_write_ev (_ bv1 32)))).def_5958))
(assert (let ((.def_5960 (= q_write_ev (_ bv0 32)))).def_5960))
(assert (let ((.def_8295 (= q_read_ev (_ bv1 32)))).def_8295))
(assert (let ((.def_8297 (= q_read_ev (_ bv0 32)))).def_8297))
(assert (let ((.def_1243 (bvadd (_ bv1 32) c_num_read)))(let ((.def_1244 (= p_num_write .def_1243))).def_1244)))

error2 N328:
(assert false)
(assert (let ((.def_649 (= c_num_read p_num_write))).def_649))
(assert (let ((.def_658 (= c_last_read p_last_write))).def_658))

eval2 N1015:
(assert (let ((.def_11641 (= m_pc (_ bv0 32)))).def_11641))
(assert (let ((.def_649 (= c_num_read p_num_write))).def_649))
(assert (let ((.def_658 (= c_last_read p_last_write))).def_658))
(assert (let ((.def_22504 (= t1_pc (_ bv0 32)))).def_22504))
(assert (let ((.def_22507 (= t2_pc (_ bv0 32)))).def_22507))
(assert (let ((.def_22510 (= t3_pc (_ bv0 32)))).def_22510))
(assert (let ((.def_22513 (= t4_pc (_ bv0 32)))).def_22513))
(assert (let ((.def_22516 (= t5_pc (_ bv0 32)))).def_22516))
(assert (let ((.def_22519 (= t6_pc (_ bv0 32)))).def_22519))
(assert (let ((.def_22522 (= t7_pc (_ bv0 32)))).def_22522))
(assert (let ((.def_22525 (= t8_pc (_ bv0 32)))).def_22525))
(assert (let ((.def_22528 (= t9_pc (_ bv0 32)))).def_22528))
(assert (let ((.def_22531 (= t10_pc (_ bv0 32)))).def_22531))
(assert (let ((.def_22534 (= t11_pc (_ bv0 32)))).def_22534))
(assert (let ((.def_22536 (= m_pc (_ bv1 32)))).def_22536))
(assert (let ((.def_22538 (= t1_pc (_ bv1 32)))).def_22538))
(assert (let ((.def_22540 (= t2_pc (_ bv1 32)))).def_22540))
(assert (let ((.def_22542 (= t3_pc (_ bv1 32)))).def_22542))
(assert (let ((.def_22544 (= t4_pc (_ bv1 32)))).def_22544))
(assert (let ((.def_22546 (= t5_pc (_ bv1 32)))).def_22546))
(assert (let ((.def_22548 (= t6_pc (_ bv1 32)))).def_22548))
(assert (let ((.def_22550 (= t7_pc (_ bv1 32)))).def_22550))
(assert (let ((.def_22552 (= t8_pc (_ bv1 32)))).def_22552))
(assert (let ((.def_22554 (= t9_pc (_ bv1 32)))).def_22554))
(assert (let ((.def_22556 (= t10_pc (_ bv1 32)))).def_22556))
(assert (let ((.def_22558 (= t11_pc (_ bv1 32)))).def_22558))
(assert (let ((.def_22561 (= m_st (_ bv0 32)))).def_22561))

start_simulation2 N1575:
(assert (let ((.def_11641 (= m_pc (_ bv0 32)))).def_11641))
(assert (let ((.def_649 (= c_num_read p_num_write))).def_649))
(assert (let ((.def_658 (= c_last_read p_last_write))).def_658))
(assert (let ((.def_22504 (= t1_pc (_ bv0 32)))).def_22504))
(assert (let ((.def_22507 (= t2_pc (_ bv0 32)))).def_22507))
(assert (let ((.def_22510 (= t3_pc (_ bv0 32)))).def_22510))
(assert (let ((.def_22513 (= t4_pc (_ bv0 32)))).def_22513))
(assert (let ((.def_22516 (= t5_pc (_ bv0 32)))).def_22516))
(assert (let ((.def_22519 (= t6_pc (_ bv0 32)))).def_22519))
(assert (let ((.def_22522 (= t7_pc (_ bv0 32)))).def_22522))
(assert (let ((.def_22525 (= t8_pc (_ bv0 32)))).def_22525))
(assert (let ((.def_22528 (= t9_pc (_ bv0 32)))).def_22528))
(assert (let ((.def_22531 (= t10_pc (_ bv0 32)))).def_22531))
(assert (let ((.def_22534 (= t11_pc (_ bv0 32)))).def_22534))
(assert (let ((.def_22536 (= m_pc (_ bv1 32)))).def_22536))
(assert (let ((.def_22538 (= t1_pc (_ bv1 32)))).def_22538))
(assert (let ((.def_22540 (= t2_pc (_ bv1 32)))).def_22540))
(assert (let ((.def_22542 (= t3_pc (_ bv1 32)))).def_22542))
(assert (let ((.def_22544 (= t4_pc (_ bv1 32)))).def_22544))
(assert (let ((.def_22546 (= t5_pc (_ bv1 32)))).def_22546))
(assert (let ((.def_22548 (= t6_pc (_ bv1 32)))).def_22548))
(assert (let ((.def_22550 (= t7_pc (_ bv1 32)))).def_22550))
(assert (let ((.def_22552 (= t8_pc (_ bv1 32)))).def_22552))
(assert (let ((.def_22554 (= t9_pc (_ bv1 32)))).def_22554))
(assert (let ((.def_22556 (= t10_pc (_ bv1 32)))).def_22556))
(assert (let ((.def_22558 (= t11_pc (_ bv1 32)))).def_22558))

