(set-info :source |printed by MathSAT|)
(declare-fun a20 () (_ BitVec 32))
(declare-fun a25 () (_ BitVec 32))
(declare-fun a12 () (_ BitVec 32))
(declare-fun a15 () (_ BitVec 32))
(declare-fun a16 () (_ BitVec 32))
(declare-fun a2 () (_ BitVec 32))
(declare-fun a27 () (_ BitVec 32))
(declare-fun a9 () (_ BitVec 32))
(declare-fun m_pc () (_ BitVec 32))
(declare-fun t1_pc () (_ BitVec 32))
(declare-fun t2_pc () (_ BitVec 32))
(declare-fun t3_pc () (_ BitVec 32))
(declare-fun t4_pc () (_ BitVec 32))
(declare-fun t5_pc () (_ BitVec 32))
(declare-fun t6_pc () (_ BitVec 32))
(declare-fun t7_pc () (_ BitVec 32))
(declare-fun t8_pc () (_ BitVec 32))
(declare-fun m_st () (_ BitVec 32))
(declare-fun t4_st () (_ BitVec 32))
(declare-fun t1_st () (_ BitVec 32))
(declare-fun E_5 () (_ BitVec 32))
(declare-fun E_3 () (_ BitVec 32))
(declare-fun E_6 () (_ BitVec 32))
(declare-fun E_4 () (_ BitVec 32))
(declare-fun E_2 () (_ BitVec 32))
(declare-fun E_M () (_ BitVec 32))
(declare-fun E_7 () (_ BitVec 32))
(declare-fun t6_st () (_ BitVec 32))
(declare-fun E_8 () (_ BitVec 32))
(declare-fun t2_st () (_ BitVec 32))
(declare-fun t5_st () (_ BitVec 32))
(declare-fun t3_st () (_ BitVec 32))
(declare-fun t7_st () (_ BitVec 32))
(declare-fun t8_st () (_ BitVec 32))
(declare-fun E_1 () (_ BitVec 32))
(declare-fun local () (_ BitVec 32))
(declare-fun token () (_ BitVec 32))

*:
(assert (let ((.def_107878 (= a20 (_ bv5 32)))).def_107878))

calculate_output8 N30108:
(assert false)
(assert (let ((.def_107878 (= a20 (_ bv5 32)))).def_107878))

main1 N30136:
(assert (let ((.def_107878 (= a20 (_ bv5 32)))).def_107878))
(assert (let ((.def_155606 (= a25 (_ bv1 32)))).def_155606))
(assert (let ((.def_155609 (= a12 (_ bv4 32)))).def_155609))
(assert (let ((.def_155612 (= a15 (_ bv1 32)))).def_155612))
(assert (let ((.def_155615 (= a16 (_ bv1 32)))).def_155615))
(assert (let ((.def_155618 (= a2 (_ bv10 32)))).def_155618))
(assert (let ((.def_155621 (= a27 (_ bv1 32)))).def_155621))
(assert (let ((.def_155624 (= a9 (_ bv18 32)))).def_155624))
(assert (let ((.def_321796 (= a12 (_ bv5 32)))).def_321796))
(assert (let ((.def_321798 (= a2 (_ bv13 32)))).def_321798))
(assert (let ((.def_321800 (= a12 (_ bv2 32)))).def_321800))
(assert (let ((.def_321802 (= a2 (_ bv12 32)))).def_321802))
(assert (let ((.def_321804 (= a12 (_ bv3 32)))).def_321804))
(assert (let ((.def_321806 (= a9 (_ bv16 32)))).def_321806))
(assert (let ((.def_321808 (= a20 (_ bv7 32)))).def_321808))
(assert (let ((.def_321810 (= a2 (_ bv9 32)))).def_321810))
(assert (let ((.def_321812 (= a9 (_ bv17 32)))).def_321812))

error N30154:
(assert false)
(assert (let ((.def_107878 (= a20 (_ bv5 32)))).def_107878))

eval N30666:
(assert (let ((.def_747301 (= m_pc (_ bv0 32)))).def_747301))
(assert (let ((.def_107878 (= a20 (_ bv5 32)))).def_107878))
(assert (let ((.def_753709 (= t1_pc (_ bv0 32)))).def_753709))
(assert (let ((.def_753712 (= t2_pc (_ bv0 32)))).def_753712))
(assert (let ((.def_753715 (= t3_pc (_ bv0 32)))).def_753715))
(assert (let ((.def_753718 (= t4_pc (_ bv0 32)))).def_753718))
(assert (let ((.def_753721 (= t5_pc (_ bv0 32)))).def_753721))
(assert (let ((.def_753724 (= t6_pc (_ bv0 32)))).def_753724))
(assert (let ((.def_753727 (= t7_pc (_ bv0 32)))).def_753727))
(assert (let ((.def_753730 (= t8_pc (_ bv0 32)))).def_753730))
(assert (let ((.def_753732 (= m_pc (_ bv1 32)))).def_753732))
(assert (let ((.def_753734 (= t1_pc (_ bv1 32)))).def_753734))
(assert (let ((.def_753736 (= t2_pc (_ bv1 32)))).def_753736))
(assert (let ((.def_753738 (= t3_pc (_ bv1 32)))).def_753738))
(assert (let ((.def_753740 (= t4_pc (_ bv1 32)))).def_753740))
(assert (let ((.def_753742 (= t5_pc (_ bv1 32)))).def_753742))
(assert (let ((.def_753744 (= t6_pc (_ bv1 32)))).def_753744))
(assert (let ((.def_753746 (= t7_pc (_ bv1 32)))).def_753746))
(assert (let ((.def_753748 (= t8_pc (_ bv1 32)))).def_753748))
(assert (let ((.def_753751 (= m_st (_ bv0 32)))).def_753751))
(assert (let ((.def_771376 (= t4_st (_ bv0 32)))).def_771376))
(assert (let ((.def_771379 (= t1_st (_ bv0 32)))).def_771379))
(assert (let ((.def_771382 (= E_5 (_ bv2 32)))).def_771382))
(assert (let ((.def_771385 (= E_3 (_ bv1 32)))).def_771385))
(assert (let ((.def_771388 (= E_6 (_ bv1 32)))).def_771388))
(assert (let ((.def_771390 (= E_5 (_ bv1 32)))).def_771390))
(assert (let ((.def_771393 (= E_4 (_ bv1 32)))).def_771393))
(assert (let ((.def_771396 (= E_2 (_ bv1 32)))).def_771396))
(assert (let ((.def_771399 (= E_M (_ bv1 32)))).def_771399))
(assert (let ((.def_771402 (= E_7 (_ bv1 32)))).def_771402))
(assert (let ((.def_771405 (= t6_st (_ bv0 32)))).def_771405))
(assert (let ((.def_771408 (= E_8 (_ bv1 32)))).def_771408))
(assert (let ((.def_771411 (= t2_st (_ bv0 32)))).def_771411))
(assert (let ((.def_771414 (= t5_st (_ bv0 32)))).def_771414))
(assert (let ((.def_771417 (= t3_st (_ bv0 32)))).def_771417))
(assert (let ((.def_771420 (= t7_st (_ bv0 32)))).def_771420))
(assert (let ((.def_771423 (= t8_st (_ bv0 32)))).def_771423))
(assert (let ((.def_771425 (= m_st (_ bv2 32)))).def_771425))
(assert (let ((.def_771428 (= E_1 (_ bv1 32)))).def_771428))
(assert (let ((.def_771431 (bvadd (_ bv8 32) local)))(let ((.def_771433 (= .def_771431 token))).def_771433)))
(assert (let ((.def_833614 (= local (_ bv0 32)))).def_833614))
(assert (let ((.def_833616 (= token (_ bv0 32)))).def_833616))
(assert (let ((.def_833618 (= E_7 (_ bv2 32)))).def_833618))
(assert (let ((.def_833620 (= E_4 (_ bv2 32)))).def_833620))
(assert (let ((.def_833622 (= E_2 (_ bv2 32)))).def_833622))
(assert (let ((.def_833624 (= E_3 (_ bv2 32)))).def_833624))
(assert (let ((.def_833626 (= E_6 (_ bv2 32)))).def_833626))
(assert (let ((.def_833628 (= t8_st (_ bv2 32)))).def_833628))
(assert (let ((.def_833630 (= t5_st (_ bv2 32)))).def_833630))
(assert (let ((.def_833632 (= t3_st (_ bv2 32)))).def_833632))
(assert (let ((.def_833634 (bvadd (_ bv5 32) local)))(let ((.def_833635 (= token .def_833634))).def_833635)))
(assert (let ((.def_833637 (= local token))).def_833637))
(assert (let ((.def_833639 (bvadd (_ bv7 32) local)))(let ((.def_833640 (= token .def_833639))).def_833640)))
(assert (let ((.def_833642 (bvadd (_ bv3 32) local)))(let ((.def_833643 (= token .def_833642))).def_833643)))
(assert (let ((.def_833645 (bvadd (_ bv4 32) local)))(let ((.def_833646 (= token .def_833645))).def_833646)))
(assert (let ((.def_833648 (bvadd (_ bv6 32) local)))(let ((.def_833649 (= token .def_833648))).def_833649)))
(assert (let ((.def_833651 (bvadd (_ bv2 32) local)))(let ((.def_833652 (= token .def_833651))).def_833652)))
(assert false)
(assert (let ((.def_833656 (bvadd (_ bv1 32) local)))(let ((.def_833657 (= token .def_833656))).def_833657)))

start_simulation N31103:
(assert (let ((.def_747301 (= m_pc (_ bv0 32)))).def_747301))
(assert (let ((.def_107878 (= a20 (_ bv5 32)))).def_107878))
(assert (let ((.def_753709 (= t1_pc (_ bv0 32)))).def_753709))
(assert (let ((.def_753712 (= t2_pc (_ bv0 32)))).def_753712))
(assert (let ((.def_753715 (= t3_pc (_ bv0 32)))).def_753715))
(assert (let ((.def_753718 (= t4_pc (_ bv0 32)))).def_753718))
(assert (let ((.def_753721 (= t5_pc (_ bv0 32)))).def_753721))
(assert (let ((.def_753724 (= t6_pc (_ bv0 32)))).def_753724))
(assert (let ((.def_753727 (= t7_pc (_ bv0 32)))).def_753727))
(assert (let ((.def_753730 (= t8_pc (_ bv0 32)))).def_753730))
(assert (let ((.def_753732 (= m_pc (_ bv1 32)))).def_753732))
(assert (let ((.def_753734 (= t1_pc (_ bv1 32)))).def_753734))
(assert (let ((.def_753736 (= t2_pc (_ bv1 32)))).def_753736))
(assert (let ((.def_753738 (= t3_pc (_ bv1 32)))).def_753738))
(assert (let ((.def_753740 (= t4_pc (_ bv1 32)))).def_753740))
(assert (let ((.def_753742 (= t5_pc (_ bv1 32)))).def_753742))
(assert (let ((.def_753744 (= t6_pc (_ bv1 32)))).def_753744))
(assert (let ((.def_753746 (= t7_pc (_ bv1 32)))).def_753746))
(assert (let ((.def_753748 (= t8_pc (_ bv1 32)))).def_753748))
(assert (let ((.def_771376 (= t4_st (_ bv0 32)))).def_771376))
(assert (let ((.def_771379 (= t1_st (_ bv0 32)))).def_771379))
(assert (let ((.def_771382 (= E_5 (_ bv2 32)))).def_771382))
(assert (let ((.def_771385 (= E_3 (_ bv1 32)))).def_771385))
(assert (let ((.def_771388 (= E_6 (_ bv1 32)))).def_771388))
(assert (let ((.def_771390 (= E_5 (_ bv1 32)))).def_771390))
(assert (let ((.def_771393 (= E_4 (_ bv1 32)))).def_771393))
(assert (let ((.def_771396 (= E_2 (_ bv1 32)))).def_771396))
(assert (let ((.def_771399 (= E_M (_ bv1 32)))).def_771399))
(assert (let ((.def_771402 (= E_7 (_ bv1 32)))).def_771402))
(assert (let ((.def_771405 (= t6_st (_ bv0 32)))).def_771405))
(assert (let ((.def_771408 (= E_8 (_ bv1 32)))).def_771408))
(assert (let ((.def_771411 (= t2_st (_ bv0 32)))).def_771411))
(assert (let ((.def_753751 (= m_st (_ bv0 32)))).def_753751))
(assert (let ((.def_833614 (= local (_ bv0 32)))).def_833614))
(assert (let ((.def_833616 (= token (_ bv0 32)))).def_833616))
(assert (let ((.def_833618 (= E_7 (_ bv2 32)))).def_833618))
(assert (let ((.def_833620 (= E_4 (_ bv2 32)))).def_833620))
(assert (let ((.def_833622 (= E_2 (_ bv2 32)))).def_833622))
(assert (let ((.def_833624 (= E_3 (_ bv2 32)))).def_833624))
(assert (let ((.def_833626 (= E_6 (_ bv2 32)))).def_833626))

