(set-info :source |printed by MathSAT|)
(declare-fun a20 () (_ BitVec 32))
(declare-fun a25 () (_ BitVec 32))
(declare-fun a12 () (_ BitVec 32))
(declare-fun a15 () (_ BitVec 32))
(declare-fun a16 () (_ BitVec 32))
(declare-fun a2 () (_ BitVec 32))
(declare-fun a27 () (_ BitVec 32))
(declare-fun a9 () (_ BitVec 32))
(declare-fun m_pc () (_ BitVec 32))
(declare-fun t1_pc () (_ BitVec 32))
(declare-fun t2_pc () (_ BitVec 32))
(declare-fun t3_pc () (_ BitVec 32))
(declare-fun t4_pc () (_ BitVec 32))
(declare-fun t5_pc () (_ BitVec 32))
(declare-fun m_st () (_ BitVec 32))
(declare-fun E_3 () (_ BitVec 32))
(declare-fun E_2 () (_ BitVec 32))
(declare-fun E_5 () (_ BitVec 32))
(declare-fun E_M () (_ BitVec 32))
(declare-fun E_4 () (_ BitVec 32))
(declare-fun t1_st () (_ BitVec 32))
(declare-fun t2_st () (_ BitVec 32))
(declare-fun t4_st () (_ BitVec 32))
(declare-fun t3_st () (_ BitVec 32))
(declare-fun t5_st () (_ BitVec 32))
(declare-fun local () (_ BitVec 32))
(declare-fun token () (_ BitVec 32))
(declare-fun E_1 () (_ BitVec 32))
(declare-fun T5_E () (_ BitVec 32))
(declare-fun T4_E () (_ BitVec 32))
(declare-fun T3_E () (_ BitVec 32))
(declare-fun T2_E () (_ BitVec 32))
(declare-fun T1_E () (_ BitVec 32))
(declare-fun M_E () (_ BitVec 32))

*:
(assert (let ((.def_107833 (= a20 (_ bv5 32)))).def_107833))

calculate_output8 N30108:
(assert false)
(assert (let ((.def_107833 (= a20 (_ bv5 32)))).def_107833))

main1 N30136:
(assert (let ((.def_107833 (= a20 (_ bv5 32)))).def_107833))
(assert (let ((.def_155546 (= a25 (_ bv1 32)))).def_155546))
(assert (let ((.def_155549 (= a12 (_ bv4 32)))).def_155549))
(assert (let ((.def_155552 (= a15 (_ bv1 32)))).def_155552))
(assert (let ((.def_155555 (= a16 (_ bv1 32)))).def_155555))
(assert (let ((.def_155558 (= a2 (_ bv10 32)))).def_155558))
(assert (let ((.def_155561 (= a27 (_ bv1 32)))).def_155561))
(assert (let ((.def_155564 (= a9 (_ bv18 32)))).def_155564))
(assert (let ((.def_321736 (= a12 (_ bv5 32)))).def_321736))
(assert (let ((.def_321738 (= a2 (_ bv13 32)))).def_321738))
(assert (let ((.def_321740 (= a12 (_ bv2 32)))).def_321740))
(assert (let ((.def_321742 (= a2 (_ bv12 32)))).def_321742))
(assert (let ((.def_321744 (= a12 (_ bv3 32)))).def_321744))
(assert (let ((.def_321746 (= a9 (_ bv16 32)))).def_321746))
(assert (let ((.def_321748 (= a20 (_ bv7 32)))).def_321748))
(assert (let ((.def_321750 (= a2 (_ bv9 32)))).def_321750))
(assert (let ((.def_321752 (= a9 (_ bv17 32)))).def_321752))

error N30154:
(assert false)
(assert (let ((.def_107833 (= a20 (_ bv5 32)))).def_107833))

eval N30504:
(assert (let ((.def_746883 (= m_pc (_ bv0 32)))).def_746883))
(assert (let ((.def_107833 (= a20 (_ bv5 32)))).def_107833))
(assert (let ((.def_750018 (= t1_pc (_ bv0 32)))).def_750018))
(assert (let ((.def_750021 (= t2_pc (_ bv0 32)))).def_750021))
(assert (let ((.def_750024 (= t3_pc (_ bv0 32)))).def_750024))
(assert (let ((.def_750027 (= t4_pc (_ bv0 32)))).def_750027))
(assert (let ((.def_750030 (= t5_pc (_ bv0 32)))).def_750030))
(assert (let ((.def_750032 (= m_pc (_ bv1 32)))).def_750032))
(assert (let ((.def_750034 (= t1_pc (_ bv1 32)))).def_750034))
(assert (let ((.def_750036 (= t2_pc (_ bv1 32)))).def_750036))
(assert (let ((.def_750038 (= t3_pc (_ bv1 32)))).def_750038))
(assert (let ((.def_750040 (= t4_pc (_ bv1 32)))).def_750040))
(assert (let ((.def_750042 (= t5_pc (_ bv1 32)))).def_750042))
(assert (let ((.def_750045 (= m_st (_ bv0 32)))).def_750045))
(assert (let ((.def_754712 (= E_3 (_ bv1 32)))).def_754712))
(assert (let ((.def_754715 (= E_2 (_ bv1 32)))).def_754715))
(assert (let ((.def_754718 (= E_5 (_ bv1 32)))).def_754718))
(assert (let ((.def_754721 (= E_M (_ bv1 32)))).def_754721))
(assert (let ((.def_754724 (= E_4 (_ bv1 32)))).def_754724))
(assert (let ((.def_754727 (= t1_st (_ bv0 32)))).def_754727))
(assert (let ((.def_754730 (= t2_st (_ bv0 32)))).def_754730))
(assert (let ((.def_754733 (= t4_st (_ bv0 32)))).def_754733))
(assert (let ((.def_754736 (= t3_st (_ bv0 32)))).def_754736))
(assert (let ((.def_754739 (= t5_st (_ bv0 32)))).def_754739))
(assert (let ((.def_754742 (bvadd (_ bv5 32) local)))(let ((.def_754744 (= .def_754742 token))).def_754744)))
(assert (let ((.def_767975 (= E_3 (_ bv2 32)))).def_767975))
(assert (let ((.def_767977 (= t4_st (_ bv2 32)))).def_767977))
(assert (let ((.def_767980 (= E_1 (_ bv1 32)))).def_767980))
(assert (let ((.def_767982 (= t5_st (_ bv2 32)))).def_767982))
(assert (let ((.def_767984 (= m_st (_ bv2 32)))).def_767984))
(assert (let ((.def_767986 (= t3_st (_ bv2 32)))).def_767986))
(assert (let ((.def_767988 (bvadd (_ bv1 32) local)))(let ((.def_767989 (= token .def_767988))).def_767989)))
(assert (let ((.def_767991 (= local token))).def_767991))
(assert (let ((.def_767993 (bvadd (_ bv2 32) local)))(let ((.def_767994 (= token .def_767993))).def_767994)))
(assert (let ((.def_767996 (bvadd (_ bv3 32) local)))(let ((.def_767997 (= token .def_767996))).def_767997)))
(assert (let ((.def_767999 (bvadd (_ bv4 32) local)))(let ((.def_768000 (= token .def_767999))).def_768000)))
(assert (let ((.def_779106 (= E_M (_ bv0 32)))).def_779106))
(assert (let ((.def_779108 (= E_2 (_ bv0 32)))).def_779108))
(assert (let ((.def_779110 (= E_1 (_ bv0 32)))).def_779110))
(assert (let ((.def_790580 (= E_5 (_ bv0 32)))).def_790580))
(assert (let ((.def_790582 (= E_4 (_ bv0 32)))).def_790582))
(assert (let ((.def_790584 (= E_3 (_ bv0 32)))).def_790584))
(assert (let ((.def_790587 (= T5_E (_ bv0 32)))).def_790587))
(assert (let ((.def_790590 (= T4_E (_ bv0 32)))).def_790590))
(assert (let ((.def_790593 (= T3_E (_ bv0 32)))).def_790593))
(assert (let ((.def_790596 (= T2_E (_ bv0 32)))).def_790596))
(assert (let ((.def_790599 (= T1_E (_ bv0 32)))).def_790599))
(assert (let ((.def_790602 (= M_E (_ bv0 32)))).def_790602))
(assert false)

start_simulation N30818:
(assert (let ((.def_746883 (= m_pc (_ bv0 32)))).def_746883))
(assert (let ((.def_107833 (= a20 (_ bv5 32)))).def_107833))
(assert (let ((.def_750018 (= t1_pc (_ bv0 32)))).def_750018))
(assert (let ((.def_750021 (= t2_pc (_ bv0 32)))).def_750021))
(assert (let ((.def_750024 (= t3_pc (_ bv0 32)))).def_750024))
(assert (let ((.def_750027 (= t4_pc (_ bv0 32)))).def_750027))
(assert (let ((.def_750030 (= t5_pc (_ bv0 32)))).def_750030))
(assert (let ((.def_750032 (= m_pc (_ bv1 32)))).def_750032))
(assert (let ((.def_750034 (= t1_pc (_ bv1 32)))).def_750034))
(assert (let ((.def_750036 (= t2_pc (_ bv1 32)))).def_750036))
(assert (let ((.def_750038 (= t3_pc (_ bv1 32)))).def_750038))
(assert (let ((.def_750040 (= t4_pc (_ bv1 32)))).def_750040))
(assert (let ((.def_750042 (= t5_pc (_ bv1 32)))).def_750042))
(assert (let ((.def_754712 (= E_3 (_ bv1 32)))).def_754712))
(assert (let ((.def_754715 (= E_2 (_ bv1 32)))).def_754715))
(assert (let ((.def_754718 (= E_5 (_ bv1 32)))).def_754718))
(assert (let ((.def_754721 (= E_M (_ bv1 32)))).def_754721))
(assert (let ((.def_754724 (= E_4 (_ bv1 32)))).def_754724))
(assert (let ((.def_750045 (= m_st (_ bv0 32)))).def_750045))
(assert (let ((.def_754739 (= t5_st (_ bv0 32)))).def_754739))
(assert (let ((.def_754736 (= t3_st (_ bv0 32)))).def_754736))
(assert (let ((.def_754730 (= t2_st (_ bv0 32)))).def_754730))
(assert (let ((.def_754727 (= t1_st (_ bv0 32)))).def_754727))
(assert (let ((.def_767975 (= E_3 (_ bv2 32)))).def_767975))
(assert (let ((.def_767977 (= t4_st (_ bv2 32)))).def_767977))
(assert (let ((.def_754733 (= t4_st (_ bv0 32)))).def_754733))
(assert (let ((.def_767980 (= E_1 (_ bv1 32)))).def_767980))
(assert (let ((.def_779106 (= E_M (_ bv0 32)))).def_779106))
(assert (let ((.def_779108 (= E_2 (_ bv0 32)))).def_779108))
(assert (let ((.def_790580 (= E_5 (_ bv0 32)))).def_790580))
(assert (let ((.def_790582 (= E_4 (_ bv0 32)))).def_790582))
(assert (let ((.def_790584 (= E_3 (_ bv0 32)))).def_790584))
(assert (let ((.def_790587 (= T5_E (_ bv0 32)))).def_790587))
(assert (let ((.def_790590 (= T4_E (_ bv0 32)))).def_790590))
(assert (let ((.def_790593 (= T3_E (_ bv0 32)))).def_790593))
(assert (let ((.def_790596 (= T2_E (_ bv0 32)))).def_790596))
(assert (let ((.def_790599 (= T1_E (_ bv0 32)))).def_790599))
(assert (let ((.def_790602 (= M_E (_ bv0 32)))).def_790602))

