(set-info :source |printed by MathSAT|)
(declare-fun a20 () (_ BitVec 32))
(declare-fun a25 () (_ BitVec 32))
(declare-fun a12 () (_ BitVec 32))
(declare-fun a15 () (_ BitVec 32))
(declare-fun a16 () (_ BitVec 32))
(declare-fun a2 () (_ BitVec 32))
(declare-fun a27 () (_ BitVec 32))
(declare-fun a9 () (_ BitVec 32))
(declare-fun m_pc () (_ BitVec 32))
(declare-fun t1_pc () (_ BitVec 32))
(declare-fun t2_pc () (_ BitVec 32))
(declare-fun t3_pc () (_ BitVec 32))
(declare-fun t4_pc () (_ BitVec 32))
(declare-fun t5_pc () (_ BitVec 32))
(declare-fun t6_pc () (_ BitVec 32))
(declare-fun t7_pc () (_ BitVec 32))
(declare-fun t8_pc () (_ BitVec 32))
(declare-fun t9_pc () (_ BitVec 32))
(declare-fun t10_pc () (_ BitVec 32))
(declare-fun t11_pc () (_ BitVec 32))
(declare-fun t12_pc () (_ BitVec 32))
(declare-fun t13_pc () (_ BitVec 32))
(declare-fun m_st () (_ BitVec 32))

*:
(assert (let ((.def_107733 (= a20 (_ bv5 32)))).def_107733))

calculate_output8 N30053:
(assert false)
(assert (let ((.def_107733 (= a20 (_ bv5 32)))).def_107733))

main1 N30136:
(assert (let ((.def_107733 (= a20 (_ bv5 32)))).def_107733))
(assert (let ((.def_155345 (= a25 (_ bv1 32)))).def_155345))
(assert (let ((.def_155348 (= a12 (_ bv4 32)))).def_155348))
(assert (let ((.def_155351 (= a15 (_ bv1 32)))).def_155351))
(assert (let ((.def_155354 (= a16 (_ bv1 32)))).def_155354))
(assert (let ((.def_155357 (= a2 (_ bv10 32)))).def_155357))
(assert (let ((.def_155360 (= a27 (_ bv1 32)))).def_155360))
(assert (let ((.def_155363 (= a9 (_ bv18 32)))).def_155363))
(assert (let ((.def_321528 (= a20 (_ bv6 32)))).def_321528))
(assert (let ((.def_321530 (= a12 (_ bv3 32)))).def_321530))
(assert (let ((.def_321532 (= a12 (_ bv6 32)))).def_321532))
(assert (let ((.def_321534 (= a2 (_ bv9 32)))).def_321534))
(assert (let ((.def_321536 (= a9 (_ bv16 32)))).def_321536))
(assert (let ((.def_321538 (= a2 (_ bv12 32)))).def_321538))
(assert (let ((.def_321540 (= a2 (_ bv11 32)))).def_321540))
(assert (let ((.def_321542 (= a9 (_ bv17 32)))).def_321542))
(assert (let ((.def_321544 (= a12 (_ bv2 32)))).def_321544))
(assert (let ((.def_321546 (= a2 (_ bv13 32)))).def_321546))

error N30154:
(assert false)
(assert (let ((.def_107733 (= a20 (_ bv5 32)))).def_107733))

eval N30945:
(assert (let ((.def_747959 (= m_pc (_ bv0 32)))).def_747959))
(assert (let ((.def_107733 (= a20 (_ bv5 32)))).def_107733))
(assert (let ((.def_762402 (= t1_pc (_ bv0 32)))).def_762402))
(assert (let ((.def_762405 (= t2_pc (_ bv0 32)))).def_762405))
(assert (let ((.def_762408 (= t3_pc (_ bv0 32)))).def_762408))
(assert (let ((.def_762411 (= t4_pc (_ bv0 32)))).def_762411))
(assert (let ((.def_762414 (= t5_pc (_ bv0 32)))).def_762414))
(assert (let ((.def_762417 (= t6_pc (_ bv0 32)))).def_762417))
(assert (let ((.def_762420 (= t7_pc (_ bv0 32)))).def_762420))
(assert (let ((.def_762423 (= t8_pc (_ bv0 32)))).def_762423))
(assert (let ((.def_762426 (= t9_pc (_ bv0 32)))).def_762426))
(assert (let ((.def_762429 (= t10_pc (_ bv0 32)))).def_762429))
(assert (let ((.def_762432 (= t11_pc (_ bv0 32)))).def_762432))
(assert (let ((.def_762435 (= t12_pc (_ bv0 32)))).def_762435))
(assert (let ((.def_762438 (= t13_pc (_ bv0 32)))).def_762438))
(assert (let ((.def_762440 (= m_pc (_ bv1 32)))).def_762440))
(assert (let ((.def_762442 (= t1_pc (_ bv1 32)))).def_762442))
(assert (let ((.def_762444 (= t2_pc (_ bv1 32)))).def_762444))
(assert (let ((.def_762446 (= t3_pc (_ bv1 32)))).def_762446))
(assert (let ((.def_762448 (= t4_pc (_ bv1 32)))).def_762448))
(assert (let ((.def_762450 (= t5_pc (_ bv1 32)))).def_762450))
(assert (let ((.def_762452 (= t6_pc (_ bv1 32)))).def_762452))
(assert (let ((.def_762454 (= t7_pc (_ bv1 32)))).def_762454))
(assert (let ((.def_762456 (= t8_pc (_ bv1 32)))).def_762456))
(assert (let ((.def_762458 (= t9_pc (_ bv1 32)))).def_762458))
(assert (let ((.def_762460 (= t10_pc (_ bv1 32)))).def_762460))
(assert (let ((.def_762462 (= t11_pc (_ bv1 32)))).def_762462))
(assert (let ((.def_762464 (= t12_pc (_ bv1 32)))).def_762464))
(assert (let ((.def_762466 (= t13_pc (_ bv1 32)))).def_762466))
(assert (let ((.def_762469 (= m_st (_ bv0 32)))).def_762469))

start_simulation N31587:
(assert (let ((.def_747959 (= m_pc (_ bv0 32)))).def_747959))
(assert (let ((.def_107733 (= a20 (_ bv5 32)))).def_107733))
(assert (let ((.def_762402 (= t1_pc (_ bv0 32)))).def_762402))
(assert (let ((.def_762405 (= t2_pc (_ bv0 32)))).def_762405))
(assert (let ((.def_762408 (= t3_pc (_ bv0 32)))).def_762408))
(assert (let ((.def_762411 (= t4_pc (_ bv0 32)))).def_762411))
(assert (let ((.def_762414 (= t5_pc (_ bv0 32)))).def_762414))
(assert (let ((.def_762417 (= t6_pc (_ bv0 32)))).def_762417))
(assert (let ((.def_762420 (= t7_pc (_ bv0 32)))).def_762420))
(assert (let ((.def_762423 (= t8_pc (_ bv0 32)))).def_762423))
(assert (let ((.def_762426 (= t9_pc (_ bv0 32)))).def_762426))
(assert (let ((.def_762429 (= t10_pc (_ bv0 32)))).def_762429))
(assert (let ((.def_762432 (= t11_pc (_ bv0 32)))).def_762432))
(assert (let ((.def_762435 (= t12_pc (_ bv0 32)))).def_762435))
(assert (let ((.def_762438 (= t13_pc (_ bv0 32)))).def_762438))
(assert (let ((.def_762440 (= m_pc (_ bv1 32)))).def_762440))
(assert (let ((.def_762442 (= t1_pc (_ bv1 32)))).def_762442))
(assert (let ((.def_762444 (= t2_pc (_ bv1 32)))).def_762444))
(assert (let ((.def_762446 (= t3_pc (_ bv1 32)))).def_762446))
(assert (let ((.def_762448 (= t4_pc (_ bv1 32)))).def_762448))
(assert (let ((.def_762450 (= t5_pc (_ bv1 32)))).def_762450))
(assert (let ((.def_762452 (= t6_pc (_ bv1 32)))).def_762452))
(assert (let ((.def_762454 (= t7_pc (_ bv1 32)))).def_762454))
(assert (let ((.def_762456 (= t8_pc (_ bv1 32)))).def_762456))
(assert (let ((.def_762458 (= t9_pc (_ bv1 32)))).def_762458))
(assert (let ((.def_762460 (= t10_pc (_ bv1 32)))).def_762460))
(assert (let ((.def_762462 (= t11_pc (_ bv1 32)))).def_762462))
(assert (let ((.def_762464 (= t12_pc (_ bv1 32)))).def_762464))
(assert (let ((.def_762466 (= t13_pc (_ bv1 32)))).def_762466))

