(set-info :source |printed by MathSAT|)
(declare-fun c_num_read () (_ BitVec 32))
(declare-fun p_num_write () (_ BitVec 32))
(declare-fun c_last_read () (_ BitVec 32))
(declare-fun p_last_write () (_ BitVec 32))
(declare-fun c_dr_pc () (_ BitVec 32))
(declare-fun q_free () (_ BitVec 32))
(declare-fun q_buf_0 () (_ BitVec 32))
(declare-fun c_dr_st () (_ BitVec 32))
(declare-fun q_req_up () (_ BitVec 32))
(declare-fun q_write_ev () (_ BitVec 32))
(declare-fun q_read_ev () (_ BitVec 32))
(declare-fun p_dw_pc () (_ BitVec 32))
(declare-fun p_dw_st () (_ BitVec 32))
(declare-fun m_pc () (_ BitVec 32))
(declare-fun t1_pc () (_ BitVec 32))
(declare-fun m_st () (_ BitVec 32))

*:
(assert (let ((.def_499 (= c_num_read p_num_write))).def_499))
(assert (let ((.def_508 (= c_last_read p_last_write))).def_508))

error1 N4:
(assert false)
(assert (let ((.def_499 (= c_num_read p_num_write))).def_499))
(assert (let ((.def_508 (= c_last_read p_last_write))).def_508))

do_write_p N78:
(assert (let ((.def_695 (= c_dr_pc (_ bv0 32)))).def_695))
(assert (let ((.def_499 (= c_num_read p_num_write))).def_499))
(assert (let ((.def_508 (= c_last_read p_last_write))).def_508))
(assert (let ((.def_763 (= q_free (_ bv1 32)))).def_763))
(assert false)
(assert (let ((.def_947 (= p_last_write q_buf_0))).def_947))
(assert (let ((.def_1087 (= c_dr_pc (_ bv1 32)))).def_1087))
(assert (let ((.def_1089 (= q_free (_ bv0 32)))).def_1089))
(assert (let ((.def_1093 (bvadd (_ bv1 32) c_num_read)))(let ((.def_1094 (= p_num_write .def_1093))).def_1094)))
(assert (let ((.def_1775 (= c_dr_st (_ bv0 32)))).def_1775))
(assert (let ((.def_4175 (= q_req_up (_ bv1 32)))).def_4175))
(assert (let ((.def_5808 (= q_write_ev (_ bv1 32)))).def_5808))
(assert (let ((.def_5810 (= q_write_ev (_ bv0 32)))).def_5810))
(assert (let ((.def_8145 (= q_read_ev (_ bv1 32)))).def_8145))
(assert (let ((.def_8147 (= q_read_ev (_ bv0 32)))).def_8147))

do_read_c N112:
(assert (let ((.def_763 (= q_free (_ bv1 32)))).def_763))
(assert (let ((.def_499 (= c_num_read p_num_write))).def_499))
(assert (let ((.def_508 (= c_last_read p_last_write))).def_508))
(assert (let ((.def_947 (= p_last_write q_buf_0))).def_947))
(assert (let ((.def_1093 (bvadd (_ bv1 32) c_num_read)))(let ((.def_1094 (= p_num_write .def_1093))).def_1094)))
(assert false)
(assert (let ((.def_1089 (= q_free (_ bv0 32)))).def_1089))
(assert (let ((.def_5808 (= q_write_ev (_ bv1 32)))).def_5808))
(assert (let ((.def_5810 (= q_write_ev (_ bv0 32)))).def_5810))
(assert (let ((.def_1091 (= p_dw_pc (_ bv1 32)))).def_1091))
(assert (let ((.def_4175 (= q_req_up (_ bv1 32)))).def_4175))
(assert (let ((.def_2249 (= p_dw_st (_ bv0 32)))).def_2249))
(assert (let ((.def_8145 (= q_read_ev (_ bv1 32)))).def_8145))
(assert (let ((.def_8147 (= q_read_ev (_ bv0 32)))).def_8147))

eval1 N228:
(assert (let ((.def_695 (= c_dr_pc (_ bv0 32)))).def_695))
(assert (let ((.def_499 (= c_num_read p_num_write))).def_499))
(assert (let ((.def_508 (= c_last_read p_last_write))).def_508))
(assert (let ((.def_763 (= q_free (_ bv1 32)))).def_763))
(assert (let ((.def_905 (= p_dw_pc (_ bv0 32)))).def_905))
(assert (let ((.def_1087 (= c_dr_pc (_ bv1 32)))).def_1087))
(assert (let ((.def_1089 (= q_free (_ bv0 32)))).def_1089))
(assert (let ((.def_1091 (= p_dw_pc (_ bv1 32)))).def_1091))
(assert (let ((.def_2249 (= p_dw_st (_ bv0 32)))).def_2249))
(assert (let ((.def_947 (= p_last_write q_buf_0))).def_947))
(assert (let ((.def_1093 (bvadd (_ bv1 32) c_num_read)))(let ((.def_1094 (= p_num_write .def_1093))).def_1094)))
(assert (let ((.def_1775 (= c_dr_st (_ bv0 32)))).def_1775))
(assert (let ((.def_4175 (= q_req_up (_ bv1 32)))).def_4175))
(assert (let ((.def_5808 (= q_write_ev (_ bv1 32)))).def_5808))
(assert (let ((.def_5810 (= q_write_ev (_ bv0 32)))).def_5810))
(assert (let ((.def_8145 (= q_read_ev (_ bv1 32)))).def_8145))
(assert (let ((.def_8147 (= q_read_ev (_ bv0 32)))).def_8147))

start_simulation1 N283:
(assert (let ((.def_695 (= c_dr_pc (_ bv0 32)))).def_695))
(assert (let ((.def_499 (= c_num_read p_num_write))).def_499))
(assert (let ((.def_508 (= c_last_read p_last_write))).def_508))
(assert (let ((.def_763 (= q_free (_ bv1 32)))).def_763))
(assert (let ((.def_905 (= p_dw_pc (_ bv0 32)))).def_905))
(assert (let ((.def_1087 (= c_dr_pc (_ bv1 32)))).def_1087))
(assert (let ((.def_1089 (= q_free (_ bv0 32)))).def_1089))
(assert (let ((.def_1091 (= p_dw_pc (_ bv1 32)))).def_1091))
(assert (let ((.def_1775 (= c_dr_st (_ bv0 32)))).def_1775))
(assert (let ((.def_2249 (= p_dw_st (_ bv0 32)))).def_2249))
(assert (let ((.def_947 (= p_last_write q_buf_0))).def_947))
(assert (let ((.def_5808 (= q_write_ev (_ bv1 32)))).def_5808))
(assert (let ((.def_5810 (= q_write_ev (_ bv0 32)))).def_5810))
(assert (let ((.def_8145 (= q_read_ev (_ bv1 32)))).def_8145))
(assert (let ((.def_8147 (= q_read_ev (_ bv0 32)))).def_8147))
(assert (let ((.def_1093 (bvadd (_ bv1 32) c_num_read)))(let ((.def_1094 (= p_num_write .def_1093))).def_1094)))

error2 N328:
(assert false)
(assert (let ((.def_499 (= c_num_read p_num_write))).def_499))
(assert (let ((.def_508 (= c_last_read p_last_write))).def_508))

eval2 N475:
(assert (let ((.def_10300 (= m_pc (_ bv0 32)))).def_10300))
(assert (let ((.def_499 (= c_num_read p_num_write))).def_499))
(assert (let ((.def_508 (= c_last_read p_last_write))).def_508))
(assert (let ((.def_10896 (= t1_pc (_ bv0 32)))).def_10896))
(assert (let ((.def_10898 (= m_pc (_ bv1 32)))).def_10898))
(assert (let ((.def_10900 (= t1_pc (_ bv1 32)))).def_10900))
(assert (let ((.def_10903 (= m_st (_ bv0 32)))).def_10903))

start_simulation2 N625:
(assert (let ((.def_10300 (= m_pc (_ bv0 32)))).def_10300))
(assert (let ((.def_499 (= c_num_read p_num_write))).def_499))
(assert (let ((.def_508 (= c_last_read p_last_write))).def_508))
(assert (let ((.def_10896 (= t1_pc (_ bv0 32)))).def_10896))
(assert (let ((.def_10898 (= m_pc (_ bv1 32)))).def_10898))
(assert (let ((.def_10900 (= t1_pc (_ bv1 32)))).def_10900))

