(set-info :source |printed by MathSAT|)
(declare-fun c_last_read () (_ BitVec 32))
(declare-fun p_last_write () (_ BitVec 32))
(declare-fun c_num_read () (_ BitVec 32))
(declare-fun p_num_write () (_ BitVec 32))
(declare-fun c_dr_pc () (_ BitVec 32))
(declare-fun c_dr_st () (_ BitVec 32))
(declare-fun m_pc () (_ BitVec 32))
(declare-fun t1_pc () (_ BitVec 32))
(declare-fun t2_pc () (_ BitVec 32))
(declare-fun t3_pc () (_ BitVec 32))
(declare-fun t4_pc () (_ BitVec 32))
(declare-fun t5_pc () (_ BitVec 32))
(declare-fun t6_pc () (_ BitVec 32))
(declare-fun t7_pc () (_ BitVec 32))
(declare-fun t8_pc () (_ BitVec 32))
(declare-fun t9_pc () (_ BitVec 32))
(declare-fun t10_pc () (_ BitVec 32))
(declare-fun t11_pc () (_ BitVec 32))
(declare-fun m_st () (_ BitVec 32))
(declare-fun E_9 () (_ BitVec 32))
(declare-fun E_8 () (_ BitVec 32))
(declare-fun E_7 () (_ BitVec 32))
(declare-fun E_6 () (_ BitVec 32))
(declare-fun E_5 () (_ BitVec 32))
(declare-fun E_4 () (_ BitVec 32))
(declare-fun E_3 () (_ BitVec 32))
(declare-fun E_2 () (_ BitVec 32))
(declare-fun E_M () (_ BitVec 32))
(declare-fun E_10 () (_ BitVec 32))
(declare-fun E_11 () (_ BitVec 32))
(declare-fun t1_st () (_ BitVec 32))
(declare-fun t8_st () (_ BitVec 32))
(declare-fun t9_st () (_ BitVec 32))
(declare-fun t6_st () (_ BitVec 32))
(declare-fun t7_st () (_ BitVec 32))
(declare-fun t10_st () (_ BitVec 32))
(declare-fun t11_st () (_ BitVec 32))
(declare-fun t5_st () (_ BitVec 32))
(declare-fun t3_st () (_ BitVec 32))
(declare-fun t4_st () (_ BitVec 32))
(declare-fun t2_st () (_ BitVec 32))
(declare-fun E_1 () (_ BitVec 32))
(declare-fun local () (_ BitVec 32))
(declare-fun token () (_ BitVec 32))

*:
(assert (let ((.def_782 (= c_last_read p_last_write))).def_782))
(assert (let ((.def_791 (= c_num_read p_num_write))).def_791))

error1 N4:
(assert false)
(assert (let ((.def_782 (= c_last_read p_last_write))).def_782))
(assert (let ((.def_791 (= c_num_read p_num_write))).def_791))

eval1 N282:
(assert (let ((.def_942 (= c_dr_pc (_ bv0 32)))).def_942))
(assert (let ((.def_782 (= c_last_read p_last_write))).def_782))
(assert (let ((.def_791 (= c_num_read p_num_write))).def_791))
(assert (let ((.def_1433 (= c_dr_pc (_ bv2 32)))).def_1433))
(assert (let ((.def_1436 (= c_dr_st (_ bv0 32)))).def_1436))

start_simulation1 N338:
(assert (let ((.def_942 (= c_dr_pc (_ bv0 32)))).def_942))
(assert (let ((.def_782 (= c_last_read p_last_write))).def_782))
(assert (let ((.def_791 (= c_num_read p_num_write))).def_791))
(assert (let ((.def_1433 (= c_dr_pc (_ bv2 32)))).def_1433))

error2 N393:
(assert false)
(assert (let ((.def_782 (= c_last_read p_last_write))).def_782))
(assert (let ((.def_791 (= c_num_read p_num_write))).def_791))

eval2 N1067:
(assert (let ((.def_5269 (= m_pc (_ bv0 32)))).def_5269))
(assert (let ((.def_782 (= c_last_read p_last_write))).def_782))
(assert (let ((.def_791 (= c_num_read p_num_write))).def_791))
(assert (let ((.def_16091 (= t1_pc (_ bv0 32)))).def_16091))
(assert (let ((.def_16094 (= t2_pc (_ bv0 32)))).def_16094))
(assert (let ((.def_16097 (= t3_pc (_ bv0 32)))).def_16097))
(assert (let ((.def_16100 (= t4_pc (_ bv0 32)))).def_16100))
(assert (let ((.def_16103 (= t5_pc (_ bv0 32)))).def_16103))
(assert (let ((.def_16106 (= t6_pc (_ bv0 32)))).def_16106))
(assert (let ((.def_16109 (= t7_pc (_ bv0 32)))).def_16109))
(assert (let ((.def_16112 (= t8_pc (_ bv0 32)))).def_16112))
(assert (let ((.def_16115 (= t9_pc (_ bv0 32)))).def_16115))
(assert (let ((.def_16118 (= t10_pc (_ bv0 32)))).def_16118))
(assert (let ((.def_16121 (= t11_pc (_ bv0 32)))).def_16121))
(assert (let ((.def_16123 (= m_pc (_ bv1 32)))).def_16123))
(assert (let ((.def_16125 (= t1_pc (_ bv1 32)))).def_16125))
(assert (let ((.def_16127 (= t2_pc (_ bv1 32)))).def_16127))
(assert (let ((.def_16129 (= t3_pc (_ bv1 32)))).def_16129))
(assert (let ((.def_16131 (= t4_pc (_ bv1 32)))).def_16131))
(assert (let ((.def_16133 (= t5_pc (_ bv1 32)))).def_16133))
(assert (let ((.def_16135 (= t6_pc (_ bv1 32)))).def_16135))
(assert (let ((.def_16137 (= t7_pc (_ bv1 32)))).def_16137))
(assert (let ((.def_16139 (= t8_pc (_ bv1 32)))).def_16139))
(assert (let ((.def_16141 (= t9_pc (_ bv1 32)))).def_16141))
(assert (let ((.def_16143 (= t10_pc (_ bv1 32)))).def_16143))
(assert (let ((.def_16145 (= t11_pc (_ bv1 32)))).def_16145))
(assert (let ((.def_16148 (= m_st (_ bv0 32)))).def_16148))
(assert (let ((.def_111318 (= E_9 (_ bv1 32)))).def_111318))
(assert (let ((.def_111321 (= E_8 (_ bv1 32)))).def_111321))
(assert (let ((.def_111324 (= E_7 (_ bv1 32)))).def_111324))
(assert (let ((.def_111327 (= E_6 (_ bv1 32)))).def_111327))
(assert (let ((.def_111330 (= E_5 (_ bv1 32)))).def_111330))
(assert (let ((.def_111333 (= E_4 (_ bv1 32)))).def_111333))
(assert (let ((.def_111336 (= E_3 (_ bv1 32)))).def_111336))
(assert (let ((.def_111339 (= E_2 (_ bv1 32)))).def_111339))
(assert (let ((.def_111342 (= E_M (_ bv1 32)))).def_111342))
(assert (let ((.def_111345 (= E_10 (_ bv1 32)))).def_111345))
(assert (let ((.def_111348 (= E_11 (_ bv1 32)))).def_111348))
(assert (let ((.def_111351 (= t1_st (_ bv0 32)))).def_111351))
(assert (let ((.def_111354 (= t8_st (_ bv0 32)))).def_111354))
(assert (let ((.def_111357 (= t9_st (_ bv0 32)))).def_111357))
(assert (let ((.def_111360 (= t6_st (_ bv0 32)))).def_111360))
(assert (let ((.def_111363 (= t7_st (_ bv0 32)))).def_111363))
(assert (let ((.def_111366 (= t10_st (_ bv0 32)))).def_111366))
(assert (let ((.def_111369 (= t11_st (_ bv0 32)))).def_111369))
(assert (let ((.def_111372 (= t5_st (_ bv0 32)))).def_111372))
(assert (let ((.def_111375 (= t3_st (_ bv0 32)))).def_111375))
(assert (let ((.def_111378 (= t4_st (_ bv0 32)))).def_111378))
(assert (let ((.def_111381 (= t2_st (_ bv0 32)))).def_111381))
(assert (let ((.def_111383 (= m_st (_ bv2 32)))).def_111383))
(assert (let ((.def_111386 (= E_1 (_ bv1 32)))).def_111386))
(assert (let ((.def_111389 (bvadd (_ bv11 32) local)))(let ((.def_111391 (= .def_111389 token))).def_111391)))

start_simulation2 N1627:
(assert (let ((.def_5269 (= m_pc (_ bv0 32)))).def_5269))
(assert (let ((.def_782 (= c_last_read p_last_write))).def_782))
(assert (let ((.def_791 (= c_num_read p_num_write))).def_791))
(assert (let ((.def_16091 (= t1_pc (_ bv0 32)))).def_16091))
(assert (let ((.def_16094 (= t2_pc (_ bv0 32)))).def_16094))
(assert (let ((.def_16097 (= t3_pc (_ bv0 32)))).def_16097))
(assert (let ((.def_16100 (= t4_pc (_ bv0 32)))).def_16100))
(assert (let ((.def_16103 (= t5_pc (_ bv0 32)))).def_16103))
(assert (let ((.def_16106 (= t6_pc (_ bv0 32)))).def_16106))
(assert (let ((.def_16109 (= t7_pc (_ bv0 32)))).def_16109))
(assert (let ((.def_16112 (= t8_pc (_ bv0 32)))).def_16112))
(assert (let ((.def_16115 (= t9_pc (_ bv0 32)))).def_16115))
(assert (let ((.def_16118 (= t10_pc (_ bv0 32)))).def_16118))
(assert (let ((.def_16121 (= t11_pc (_ bv0 32)))).def_16121))
(assert (let ((.def_16123 (= m_pc (_ bv1 32)))).def_16123))
(assert (let ((.def_16125 (= t1_pc (_ bv1 32)))).def_16125))
(assert (let ((.def_16127 (= t2_pc (_ bv1 32)))).def_16127))
(assert (let ((.def_16129 (= t3_pc (_ bv1 32)))).def_16129))
(assert (let ((.def_16131 (= t4_pc (_ bv1 32)))).def_16131))
(assert (let ((.def_16133 (= t5_pc (_ bv1 32)))).def_16133))
(assert (let ((.def_16135 (= t6_pc (_ bv1 32)))).def_16135))
(assert (let ((.def_16137 (= t7_pc (_ bv1 32)))).def_16137))
(assert (let ((.def_16139 (= t8_pc (_ bv1 32)))).def_16139))
(assert (let ((.def_16141 (= t9_pc (_ bv1 32)))).def_16141))
(assert (let ((.def_16143 (= t10_pc (_ bv1 32)))).def_16143))
(assert (let ((.def_16145 (= t11_pc (_ bv1 32)))).def_16145))
(assert (let ((.def_111318 (= E_9 (_ bv1 32)))).def_111318))
(assert (let ((.def_111321 (= E_8 (_ bv1 32)))).def_111321))
(assert (let ((.def_111324 (= E_7 (_ bv1 32)))).def_111324))
(assert (let ((.def_111327 (= E_6 (_ bv1 32)))).def_111327))
(assert (let ((.def_111330 (= E_5 (_ bv1 32)))).def_111330))
(assert (let ((.def_111333 (= E_4 (_ bv1 32)))).def_111333))
(assert (let ((.def_111336 (= E_3 (_ bv1 32)))).def_111336))
(assert (let ((.def_111339 (= E_2 (_ bv1 32)))).def_111339))
(assert (let ((.def_111342 (= E_M (_ bv1 32)))).def_111342))
(assert (let ((.def_111345 (= E_10 (_ bv1 32)))).def_111345))
(assert (let ((.def_111348 (= E_11 (_ bv1 32)))).def_111348))
(assert (let ((.def_111351 (= t1_st (_ bv0 32)))).def_111351))
(assert (let ((.def_16148 (= m_st (_ bv0 32)))).def_16148))

