(set-info :source |printed by MathSAT|)
(declare-fun a20 () (_ BitVec 32))
(declare-fun a9 () (_ BitVec 32))
(declare-fun a25 () (_ BitVec 32))
(declare-fun a12 () (_ BitVec 32))
(declare-fun a15 () (_ BitVec 32))
(declare-fun a16 () (_ BitVec 32))
(declare-fun a2 () (_ BitVec 32))
(declare-fun a27 () (_ BitVec 32))

*:
(assert (let ((.def_105823 (= a20 (_ bv5 32)))).def_105823))

calculate_output8 N29613:
(assert false)
(assert (let ((.def_105823 (= a20 (_ bv5 32)))).def_105823))

main1 N30136:
(assert (let ((.def_152629 (= a9 (_ bv18 32)))).def_152629))
(assert (let ((.def_105823 (= a20 (_ bv5 32)))).def_105823))
(assert (let ((.def_339259 (= a25 (_ bv1 32)))).def_339259))
(assert (let ((.def_339262 (= a12 (_ bv4 32)))).def_339262))
(assert (let ((.def_339265 (= a15 (_ bv1 32)))).def_339265))
(assert (let ((.def_339268 (= a16 (_ bv1 32)))).def_339268))
(assert (let ((.def_339271 (= a2 (_ bv10 32)))).def_339271))
(assert (let ((.def_339274 (= a27 (_ bv1 32)))).def_339274))
(assert (let ((.def_339276 (= a12 (_ bv6 32)))).def_339276))
(assert (let ((.def_339278 (= a20 (_ bv6 32)))).def_339278))
(assert (let ((.def_339280 (= a12 (_ bv3 32)))).def_339280))
(assert (let ((.def_339282 (= a2 (_ bv12 32)))).def_339282))
(assert (let ((.def_339284 (= a12 (_ bv2 32)))).def_339284))
(assert (let ((.def_339286 (= a9 (_ bv16 32)))).def_339286))
(assert (let ((.def_339288 (= a12 (_ bv5 32)))).def_339288))
(assert (let ((.def_339290 (= a9 (_ bv17 32)))).def_339290))
(assert (let ((.def_859648 (= a2 (_ bv9 32)))).def_859648))
(assert (let ((.def_859650 (= a20 (_ bv7 32)))).def_859650))
(assert (let ((.def_859652 (= a2 (_ bv13 32)))).def_859652))
(assert (let ((.def_859654 (= a2 (_ bv11 32)))).def_859654))

