(set-info :source |printed by MathSAT|)
(declare-fun a20 () (_ BitVec 32))
(declare-fun a9 () (_ BitVec 32))
(declare-fun a25 () (_ BitVec 32))
(declare-fun a12 () (_ BitVec 32))
(declare-fun a15 () (_ BitVec 32))
(declare-fun a16 () (_ BitVec 32))
(declare-fun a2 () (_ BitVec 32))
(declare-fun a27 () (_ BitVec 32))

*:
(assert (let ((.def_106132 (= a20 (_ bv5 32)))).def_106132))

calculate_output8 N29679:
(assert false)
(assert (let ((.def_106132 (= a20 (_ bv5 32)))).def_106132))

main1 N30136:
(assert (let ((.def_153040 (= a9 (_ bv18 32)))).def_153040))
(assert (let ((.def_106132 (= a20 (_ bv5 32)))).def_106132))
(assert (let ((.def_339643 (= a25 (_ bv1 32)))).def_339643))
(assert (let ((.def_339646 (= a12 (_ bv4 32)))).def_339646))
(assert (let ((.def_339649 (= a15 (_ bv1 32)))).def_339649))
(assert (let ((.def_339652 (= a16 (_ bv1 32)))).def_339652))
(assert (let ((.def_339655 (= a2 (_ bv10 32)))).def_339655))
(assert (let ((.def_339658 (= a27 (_ bv1 32)))).def_339658))
(assert (let ((.def_339660 (= a2 (_ bv13 32)))).def_339660))
(assert (let ((.def_339662 (= a9 (_ bv17 32)))).def_339662))
(assert (let ((.def_339664 (= a2 (_ bv9 32)))).def_339664))
(assert (let ((.def_339666 (= a2 (_ bv11 32)))).def_339666))
(assert (let ((.def_339668 (= a9 (_ bv16 32)))).def_339668))
(assert (let ((.def_339670 (= a2 (_ bv12 32)))).def_339670))
(assert (let ((.def_898016 (= a20 (_ bv7 32)))).def_898016))
(assert (let ((.def_898018 (= a20 (_ bv6 32)))).def_898018))
(assert (let ((.def_898020 (= a12 (_ bv2 32)))).def_898020))
(assert (let ((.def_898022 (= a12 (_ bv6 32)))).def_898022))
(assert (let ((.def_898024 (= a12 (_ bv3 32)))).def_898024))
(assert (let ((.def_898026 (= a12 (_ bv5 32)))).def_898026))

