(set-info :source |printed by MathSAT|)
(declare-fun c_last_read () (_ BitVec 32))
(declare-fun p_last_write () (_ BitVec 32))
(declare-fun c_num_read () (_ BitVec 32))
(declare-fun p_num_write () (_ BitVec 32))
(declare-fun c_dr_pc () (_ BitVec 32))
(declare-fun c_dr_st () (_ BitVec 32))
(declare-fun m_pc () (_ BitVec 32))
(declare-fun t1_pc () (_ BitVec 32))
(declare-fun t2_pc () (_ BitVec 32))
(declare-fun t3_pc () (_ BitVec 32))
(declare-fun t4_pc () (_ BitVec 32))
(declare-fun t5_pc () (_ BitVec 32))
(declare-fun t6_pc () (_ BitVec 32))
(declare-fun t7_pc () (_ BitVec 32))
(declare-fun t8_pc () (_ BitVec 32))
(declare-fun t9_pc () (_ BitVec 32))
(declare-fun m_st () (_ BitVec 32))
(declare-fun t4_st () (_ BitVec 32))
(declare-fun t3_st () (_ BitVec 32))
(declare-fun E_5 () (_ BitVec 32))
(declare-fun E_9 () (_ BitVec 32))
(declare-fun E_7 () (_ BitVec 32))
(declare-fun E_4 () (_ BitVec 32))
(declare-fun E_3 () (_ BitVec 32))
(declare-fun E_2 () (_ BitVec 32))
(declare-fun E_M () (_ BitVec 32))
(declare-fun E_8 () (_ BitVec 32))
(declare-fun E_6 () (_ BitVec 32))
(declare-fun t2_st () (_ BitVec 32))
(declare-fun t6_st () (_ BitVec 32))
(declare-fun t5_st () (_ BitVec 32))
(declare-fun t8_st () (_ BitVec 32))
(declare-fun t1_st () (_ BitVec 32))
(declare-fun t7_st () (_ BitVec 32))
(declare-fun t9_st () (_ BitVec 32))
(declare-fun E_1 () (_ BitVec 32))
(declare-fun local () (_ BitVec 32))
(declare-fun token () (_ BitVec 32))

*:
(assert (let ((.def_752 (= c_last_read p_last_write))).def_752))
(assert (let ((.def_761 (= c_num_read p_num_write))).def_761))

error1 N4:
(assert false)
(assert (let ((.def_752 (= c_last_read p_last_write))).def_752))
(assert (let ((.def_761 (= c_num_read p_num_write))).def_761))

eval1 N282:
(assert (let ((.def_912 (= c_dr_pc (_ bv0 32)))).def_912))
(assert (let ((.def_752 (= c_last_read p_last_write))).def_752))
(assert (let ((.def_761 (= c_num_read p_num_write))).def_761))
(assert (let ((.def_1403 (= c_dr_pc (_ bv2 32)))).def_1403))
(assert (let ((.def_1406 (= c_dr_st (_ bv0 32)))).def_1406))

start_simulation1 N338:
(assert (let ((.def_912 (= c_dr_pc (_ bv0 32)))).def_912))
(assert (let ((.def_752 (= c_last_read p_last_write))).def_752))
(assert (let ((.def_761 (= c_num_read p_num_write))).def_761))
(assert (let ((.def_1403 (= c_dr_pc (_ bv2 32)))).def_1403))

error2 N393:
(assert false)
(assert (let ((.def_752 (= c_last_read p_last_write))).def_752))
(assert (let ((.def_761 (= c_num_read p_num_write))).def_761))

eval2 N959:
(assert (let ((.def_5001 (= m_pc (_ bv0 32)))).def_5001))
(assert (let ((.def_752 (= c_last_read p_last_write))).def_752))
(assert (let ((.def_761 (= c_num_read p_num_write))).def_761))
(assert (let ((.def_12752 (= t1_pc (_ bv0 32)))).def_12752))
(assert (let ((.def_12755 (= t2_pc (_ bv0 32)))).def_12755))
(assert (let ((.def_12758 (= t3_pc (_ bv0 32)))).def_12758))
(assert (let ((.def_12761 (= t4_pc (_ bv0 32)))).def_12761))
(assert (let ((.def_12764 (= t5_pc (_ bv0 32)))).def_12764))
(assert (let ((.def_12767 (= t6_pc (_ bv0 32)))).def_12767))
(assert (let ((.def_12770 (= t7_pc (_ bv0 32)))).def_12770))
(assert (let ((.def_12773 (= t8_pc (_ bv0 32)))).def_12773))
(assert (let ((.def_12776 (= t9_pc (_ bv0 32)))).def_12776))
(assert (let ((.def_12778 (= m_pc (_ bv1 32)))).def_12778))
(assert (let ((.def_12780 (= t1_pc (_ bv1 32)))).def_12780))
(assert (let ((.def_12782 (= t2_pc (_ bv1 32)))).def_12782))
(assert (let ((.def_12784 (= t3_pc (_ bv1 32)))).def_12784))
(assert (let ((.def_12786 (= t4_pc (_ bv1 32)))).def_12786))
(assert (let ((.def_12788 (= t5_pc (_ bv1 32)))).def_12788))
(assert (let ((.def_12790 (= t6_pc (_ bv1 32)))).def_12790))
(assert (let ((.def_12792 (= t7_pc (_ bv1 32)))).def_12792))
(assert (let ((.def_12794 (= t8_pc (_ bv1 32)))).def_12794))
(assert (let ((.def_12796 (= t9_pc (_ bv1 32)))).def_12796))
(assert (let ((.def_12799 (= m_st (_ bv0 32)))).def_12799))
(assert (let ((.def_41808 (= t4_st (_ bv0 32)))).def_41808))
(assert (let ((.def_41811 (= t3_st (_ bv0 32)))).def_41811))
(assert (let ((.def_41814 (= E_5 (_ bv2 32)))).def_41814))
(assert (let ((.def_41817 (= E_9 (_ bv1 32)))).def_41817))
(assert (let ((.def_41820 (= E_7 (_ bv1 32)))).def_41820))
(assert (let ((.def_41822 (= E_5 (_ bv1 32)))).def_41822))
(assert (let ((.def_41825 (= E_4 (_ bv1 32)))).def_41825))
(assert (let ((.def_41828 (= E_3 (_ bv1 32)))).def_41828))
(assert (let ((.def_41831 (= E_2 (_ bv1 32)))).def_41831))
(assert (let ((.def_41834 (= E_M (_ bv1 32)))).def_41834))
(assert (let ((.def_41837 (= E_8 (_ bv1 32)))).def_41837))
(assert (let ((.def_41840 (= E_6 (_ bv1 32)))).def_41840))
(assert (let ((.def_41843 (= t2_st (_ bv0 32)))).def_41843))
(assert (let ((.def_41846 (= t6_st (_ bv0 32)))).def_41846))
(assert (let ((.def_41849 (= t5_st (_ bv0 32)))).def_41849))
(assert (let ((.def_41852 (= t8_st (_ bv0 32)))).def_41852))
(assert (let ((.def_41855 (= t1_st (_ bv0 32)))).def_41855))
(assert (let ((.def_41858 (= t7_st (_ bv0 32)))).def_41858))
(assert (let ((.def_41861 (= t9_st (_ bv0 32)))).def_41861))
(assert (let ((.def_41864 (= E_1 (_ bv1 32)))).def_41864))
(assert (let ((.def_41867 (bvadd (_ bv9 32) local)))(let ((.def_41869 (= .def_41867 token))).def_41869)))

start_simulation2 N1437:
(assert (let ((.def_5001 (= m_pc (_ bv0 32)))).def_5001))
(assert (let ((.def_752 (= c_last_read p_last_write))).def_752))
(assert (let ((.def_761 (= c_num_read p_num_write))).def_761))
(assert (let ((.def_12752 (= t1_pc (_ bv0 32)))).def_12752))
(assert (let ((.def_12755 (= t2_pc (_ bv0 32)))).def_12755))
(assert (let ((.def_12758 (= t3_pc (_ bv0 32)))).def_12758))
(assert (let ((.def_12761 (= t4_pc (_ bv0 32)))).def_12761))
(assert (let ((.def_12764 (= t5_pc (_ bv0 32)))).def_12764))
(assert (let ((.def_12767 (= t6_pc (_ bv0 32)))).def_12767))
(assert (let ((.def_12770 (= t7_pc (_ bv0 32)))).def_12770))
(assert (let ((.def_12773 (= t8_pc (_ bv0 32)))).def_12773))
(assert (let ((.def_12776 (= t9_pc (_ bv0 32)))).def_12776))
(assert (let ((.def_12778 (= m_pc (_ bv1 32)))).def_12778))
(assert (let ((.def_12780 (= t1_pc (_ bv1 32)))).def_12780))
(assert (let ((.def_12782 (= t2_pc (_ bv1 32)))).def_12782))
(assert (let ((.def_12784 (= t3_pc (_ bv1 32)))).def_12784))
(assert (let ((.def_12786 (= t4_pc (_ bv1 32)))).def_12786))
(assert (let ((.def_12788 (= t5_pc (_ bv1 32)))).def_12788))
(assert (let ((.def_12790 (= t6_pc (_ bv1 32)))).def_12790))
(assert (let ((.def_12792 (= t7_pc (_ bv1 32)))).def_12792))
(assert (let ((.def_12794 (= t8_pc (_ bv1 32)))).def_12794))
(assert (let ((.def_12796 (= t9_pc (_ bv1 32)))).def_12796))
(assert (let ((.def_41808 (= t4_st (_ bv0 32)))).def_41808))
(assert (let ((.def_41811 (= t3_st (_ bv0 32)))).def_41811))
(assert (let ((.def_41814 (= E_5 (_ bv2 32)))).def_41814))
(assert (let ((.def_41817 (= E_9 (_ bv1 32)))).def_41817))
(assert (let ((.def_41820 (= E_7 (_ bv1 32)))).def_41820))
(assert (let ((.def_41822 (= E_5 (_ bv1 32)))).def_41822))
(assert (let ((.def_41825 (= E_4 (_ bv1 32)))).def_41825))
(assert (let ((.def_41828 (= E_3 (_ bv1 32)))).def_41828))
(assert (let ((.def_41831 (= E_2 (_ bv1 32)))).def_41831))
(assert (let ((.def_41834 (= E_M (_ bv1 32)))).def_41834))
(assert (let ((.def_41837 (= E_8 (_ bv1 32)))).def_41837))
(assert (let ((.def_41840 (= E_6 (_ bv1 32)))).def_41840))
(assert (let ((.def_41843 (= t2_st (_ bv0 32)))).def_41843))
(assert (let ((.def_12799 (= m_st (_ bv0 32)))).def_12799))

