(set-info :source |printed by MathSAT|)
(declare-fun c_last_read () (_ BitVec 32))
(declare-fun p_last_write () (_ BitVec 32))
(declare-fun c_num_read () (_ BitVec 32))
(declare-fun p_num_write () (_ BitVec 32))
(declare-fun c_dr_pc () (_ BitVec 32))
(declare-fun q_free () (_ BitVec 32))
(declare-fun q_buf_0 () (_ BitVec 32))
(declare-fun c_dr_st () (_ BitVec 32))
(declare-fun q_req_up () (_ BitVec 32))
(declare-fun q_write_ev () (_ BitVec 32))
(declare-fun q_read_ev () (_ BitVec 32))
(declare-fun p_dw_pc () (_ BitVec 32))
(declare-fun p_dw_st () (_ BitVec 32))
(declare-fun m_pc () (_ BitVec 32))
(declare-fun t1_pc () (_ BitVec 32))
(declare-fun t2_pc () (_ BitVec 32))
(declare-fun t3_pc () (_ BitVec 32))
(declare-fun t4_pc () (_ BitVec 32))
(declare-fun t5_pc () (_ BitVec 32))
(declare-fun t6_pc () (_ BitVec 32))
(declare-fun t7_pc () (_ BitVec 32))
(declare-fun t8_pc () (_ BitVec 32))
(declare-fun t9_pc () (_ BitVec 32))
(declare-fun t10_pc () (_ BitVec 32))
(declare-fun t11_pc () (_ BitVec 32))
(declare-fun t12_pc () (_ BitVec 32))
(declare-fun t13_pc () (_ BitVec 32))
(declare-fun m_st () (_ BitVec 32))

*:
(assert (let ((.def_679 (= c_last_read p_last_write))).def_679))
(assert (let ((.def_688 (= c_num_read p_num_write))).def_688))

error1 N4:
(assert false)
(assert (let ((.def_679 (= c_last_read p_last_write))).def_679))
(assert (let ((.def_688 (= c_num_read p_num_write))).def_688))

do_write_p N78:
(assert (let ((.def_875 (= c_dr_pc (_ bv0 32)))).def_875))
(assert (let ((.def_679 (= c_last_read p_last_write))).def_679))
(assert (let ((.def_688 (= c_num_read p_num_write))).def_688))
(assert (let ((.def_943 (= q_free (_ bv1 32)))).def_943))
(assert false)
(assert (let ((.def_1127 (= p_last_write q_buf_0))).def_1127))
(assert (let ((.def_1269 (= c_dr_pc (_ bv1 32)))).def_1269))
(assert (let ((.def_1271 (= q_free (_ bv0 32)))).def_1271))
(assert (let ((.def_1275 (bvadd (_ bv1 32) c_num_read)))(let ((.def_1276 (= p_num_write .def_1275))).def_1276)))
(assert (let ((.def_1956 (= c_dr_st (_ bv0 32)))).def_1956))
(assert (let ((.def_4362 (= q_req_up (_ bv1 32)))).def_4362))
(assert (let ((.def_5995 (= q_write_ev (_ bv1 32)))).def_5995))
(assert (let ((.def_5997 (= q_write_ev (_ bv0 32)))).def_5997))
(assert (let ((.def_8330 (= q_read_ev (_ bv1 32)))).def_8330))
(assert (let ((.def_8332 (= q_read_ev (_ bv0 32)))).def_8332))

do_read_c N112:
(assert (let ((.def_943 (= q_free (_ bv1 32)))).def_943))
(assert (let ((.def_679 (= c_last_read p_last_write))).def_679))
(assert (let ((.def_688 (= c_num_read p_num_write))).def_688))
(assert (let ((.def_1127 (= p_last_write q_buf_0))).def_1127))
(assert (let ((.def_1275 (bvadd (_ bv1 32) c_num_read)))(let ((.def_1276 (= p_num_write .def_1275))).def_1276)))
(assert false)
(assert (let ((.def_1271 (= q_free (_ bv0 32)))).def_1271))
(assert (let ((.def_5995 (= q_write_ev (_ bv1 32)))).def_5995))
(assert (let ((.def_5997 (= q_write_ev (_ bv0 32)))).def_5997))
(assert (let ((.def_1273 (= p_dw_pc (_ bv1 32)))).def_1273))
(assert (let ((.def_4362 (= q_req_up (_ bv1 32)))).def_4362))
(assert (let ((.def_2433 (= p_dw_st (_ bv0 32)))).def_2433))
(assert (let ((.def_8330 (= q_read_ev (_ bv1 32)))).def_8330))
(assert (let ((.def_8332 (= q_read_ev (_ bv0 32)))).def_8332))

eval1 N228:
(assert (let ((.def_875 (= c_dr_pc (_ bv0 32)))).def_875))
(assert (let ((.def_679 (= c_last_read p_last_write))).def_679))
(assert (let ((.def_688 (= c_num_read p_num_write))).def_688))
(assert (let ((.def_943 (= q_free (_ bv1 32)))).def_943))
(assert (let ((.def_1085 (= p_dw_pc (_ bv0 32)))).def_1085))
(assert (let ((.def_1269 (= c_dr_pc (_ bv1 32)))).def_1269))
(assert (let ((.def_1271 (= q_free (_ bv0 32)))).def_1271))
(assert (let ((.def_1273 (= p_dw_pc (_ bv1 32)))).def_1273))
(assert (let ((.def_2433 (= p_dw_st (_ bv0 32)))).def_2433))
(assert (let ((.def_1127 (= p_last_write q_buf_0))).def_1127))
(assert (let ((.def_1275 (bvadd (_ bv1 32) c_num_read)))(let ((.def_1276 (= p_num_write .def_1275))).def_1276)))
(assert (let ((.def_1956 (= c_dr_st (_ bv0 32)))).def_1956))
(assert (let ((.def_4362 (= q_req_up (_ bv1 32)))).def_4362))
(assert (let ((.def_5995 (= q_write_ev (_ bv1 32)))).def_5995))
(assert (let ((.def_5997 (= q_write_ev (_ bv0 32)))).def_5997))
(assert (let ((.def_8330 (= q_read_ev (_ bv1 32)))).def_8330))
(assert (let ((.def_8332 (= q_read_ev (_ bv0 32)))).def_8332))

start_simulation1 N283:
(assert (let ((.def_875 (= c_dr_pc (_ bv0 32)))).def_875))
(assert (let ((.def_679 (= c_last_read p_last_write))).def_679))
(assert (let ((.def_688 (= c_num_read p_num_write))).def_688))
(assert (let ((.def_943 (= q_free (_ bv1 32)))).def_943))
(assert (let ((.def_1085 (= p_dw_pc (_ bv0 32)))).def_1085))
(assert (let ((.def_1269 (= c_dr_pc (_ bv1 32)))).def_1269))
(assert (let ((.def_1271 (= q_free (_ bv0 32)))).def_1271))
(assert (let ((.def_1273 (= p_dw_pc (_ bv1 32)))).def_1273))
(assert (let ((.def_1956 (= c_dr_st (_ bv0 32)))).def_1956))
(assert (let ((.def_2433 (= p_dw_st (_ bv0 32)))).def_2433))
(assert (let ((.def_1127 (= p_last_write q_buf_0))).def_1127))
(assert (let ((.def_5995 (= q_write_ev (_ bv1 32)))).def_5995))
(assert (let ((.def_5997 (= q_write_ev (_ bv0 32)))).def_5997))
(assert (let ((.def_8330 (= q_read_ev (_ bv1 32)))).def_8330))
(assert (let ((.def_8332 (= q_read_ev (_ bv0 32)))).def_8332))
(assert (let ((.def_1275 (bvadd (_ bv1 32) c_num_read)))(let ((.def_1276 (= p_num_write .def_1275))).def_1276)))

error2 N328:
(assert false)
(assert (let ((.def_679 (= c_last_read p_last_write))).def_679))
(assert (let ((.def_688 (= c_num_read p_num_write))).def_688))

eval2 N1123:
(assert (let ((.def_11914 (= m_pc (_ bv0 32)))).def_11914))
(assert (let ((.def_679 (= c_last_read p_last_write))).def_679))
(assert (let ((.def_688 (= c_num_read p_num_write))).def_688))
(assert (let ((.def_26356 (= t1_pc (_ bv0 32)))).def_26356))
(assert (let ((.def_26359 (= t2_pc (_ bv0 32)))).def_26359))
(assert (let ((.def_26362 (= t3_pc (_ bv0 32)))).def_26362))
(assert (let ((.def_26365 (= t4_pc (_ bv0 32)))).def_26365))
(assert (let ((.def_26368 (= t5_pc (_ bv0 32)))).def_26368))
(assert (let ((.def_26371 (= t6_pc (_ bv0 32)))).def_26371))
(assert (let ((.def_26374 (= t7_pc (_ bv0 32)))).def_26374))
(assert (let ((.def_26377 (= t8_pc (_ bv0 32)))).def_26377))
(assert (let ((.def_26380 (= t9_pc (_ bv0 32)))).def_26380))
(assert (let ((.def_26383 (= t10_pc (_ bv0 32)))).def_26383))
(assert (let ((.def_26386 (= t11_pc (_ bv0 32)))).def_26386))
(assert (let ((.def_26389 (= t12_pc (_ bv0 32)))).def_26389))
(assert (let ((.def_26392 (= t13_pc (_ bv0 32)))).def_26392))
(assert (let ((.def_26394 (= m_pc (_ bv1 32)))).def_26394))
(assert (let ((.def_26396 (= t1_pc (_ bv1 32)))).def_26396))
(assert (let ((.def_26398 (= t2_pc (_ bv1 32)))).def_26398))
(assert (let ((.def_26400 (= t3_pc (_ bv1 32)))).def_26400))
(assert (let ((.def_26402 (= t4_pc (_ bv1 32)))).def_26402))
(assert (let ((.def_26404 (= t5_pc (_ bv1 32)))).def_26404))
(assert (let ((.def_26406 (= t6_pc (_ bv1 32)))).def_26406))
(assert (let ((.def_26408 (= t7_pc (_ bv1 32)))).def_26408))
(assert (let ((.def_26410 (= t8_pc (_ bv1 32)))).def_26410))
(assert (let ((.def_26412 (= t9_pc (_ bv1 32)))).def_26412))
(assert (let ((.def_26414 (= t10_pc (_ bv1 32)))).def_26414))
(assert (let ((.def_26416 (= t11_pc (_ bv1 32)))).def_26416))
(assert (let ((.def_26418 (= t12_pc (_ bv1 32)))).def_26418))
(assert (let ((.def_26420 (= t13_pc (_ bv1 32)))).def_26420))
(assert (let ((.def_26423 (= m_st (_ bv0 32)))).def_26423))

start_simulation2 N1765:
(assert (let ((.def_11914 (= m_pc (_ bv0 32)))).def_11914))
(assert (let ((.def_679 (= c_last_read p_last_write))).def_679))
(assert (let ((.def_688 (= c_num_read p_num_write))).def_688))
(assert (let ((.def_26356 (= t1_pc (_ bv0 32)))).def_26356))
(assert (let ((.def_26359 (= t2_pc (_ bv0 32)))).def_26359))
(assert (let ((.def_26362 (= t3_pc (_ bv0 32)))).def_26362))
(assert (let ((.def_26365 (= t4_pc (_ bv0 32)))).def_26365))
(assert (let ((.def_26368 (= t5_pc (_ bv0 32)))).def_26368))
(assert (let ((.def_26371 (= t6_pc (_ bv0 32)))).def_26371))
(assert (let ((.def_26374 (= t7_pc (_ bv0 32)))).def_26374))
(assert (let ((.def_26377 (= t8_pc (_ bv0 32)))).def_26377))
(assert (let ((.def_26380 (= t9_pc (_ bv0 32)))).def_26380))
(assert (let ((.def_26383 (= t10_pc (_ bv0 32)))).def_26383))
(assert (let ((.def_26386 (= t11_pc (_ bv0 32)))).def_26386))
(assert (let ((.def_26389 (= t12_pc (_ bv0 32)))).def_26389))
(assert (let ((.def_26392 (= t13_pc (_ bv0 32)))).def_26392))
(assert (let ((.def_26394 (= m_pc (_ bv1 32)))).def_26394))
(assert (let ((.def_26396 (= t1_pc (_ bv1 32)))).def_26396))
(assert (let ((.def_26398 (= t2_pc (_ bv1 32)))).def_26398))
(assert (let ((.def_26400 (= t3_pc (_ bv1 32)))).def_26400))
(assert (let ((.def_26402 (= t4_pc (_ bv1 32)))).def_26402))
(assert (let ((.def_26404 (= t5_pc (_ bv1 32)))).def_26404))
(assert (let ((.def_26406 (= t6_pc (_ bv1 32)))).def_26406))
(assert (let ((.def_26408 (= t7_pc (_ bv1 32)))).def_26408))
(assert (let ((.def_26410 (= t8_pc (_ bv1 32)))).def_26410))
(assert (let ((.def_26412 (= t9_pc (_ bv1 32)))).def_26412))
(assert (let ((.def_26414 (= t10_pc (_ bv1 32)))).def_26414))
(assert (let ((.def_26416 (= t11_pc (_ bv1 32)))).def_26416))
(assert (let ((.def_26418 (= t12_pc (_ bv1 32)))).def_26418))
(assert (let ((.def_26420 (= t13_pc (_ bv1 32)))).def_26420))

