(set-info :source |printed by MathSAT|)
(declare-fun |ssl3_connect::blastFlag| () (_ BitVec 32))
(declare-fun |ssl3_connect::s__state| () (_ BitVec 32))

ssl3_connect:
(assert (let ((.def_703 (= |ssl3_connect::blastFlag| (_ bv4 32)))).def_703))

ssl3_connect N132:
(assert (let ((.def_1700 (= |ssl3_connect::s__state| (_ bv12292 32)))).def_1700))
(assert (let ((.def_1702 (= |ssl3_connect::blastFlag| (_ bv0 32)))).def_1702))
(assert (let ((.def_703 (= |ssl3_connect::blastFlag| (_ bv4 32)))).def_703))
(assert (let ((.def_3941 (= |ssl3_connect::s__state| (_ bv4368 32)))).def_3941))
(assert (let ((.def_3943 (= |ssl3_connect::blastFlag| (_ bv1 32)))).def_3943))
(assert (let ((.def_3945 (= |ssl3_connect::s__state| (_ bv4384 32)))).def_3945))
(assert (let ((.def_5653 (= |ssl3_connect::blastFlag| (_ bv2 32)))).def_5653))
(assert (let ((.def_5655 (= |ssl3_connect::blastFlag| (_ bv3 32)))).def_5655))
(assert (let ((.def_5657 (= |ssl3_connect::s__state| (_ bv4099 32)))).def_5657))
(assert (let ((.def_5659 (= |ssl3_connect::s__state| (_ bv20480 32)))).def_5659))
(assert (let ((.def_5661 (= |ssl3_connect::s__state| (_ bv4096 32)))).def_5661))
(assert (let ((.def_5663 (= |ssl3_connect::s__state| (_ bv16384 32)))).def_5663))
(assert (let ((.def_5665 (= |ssl3_connect::s__state| (_ bv4369 32)))).def_5665))

ssl3_connect N600:
(assert false)
(assert (let ((.def_703 (= |ssl3_connect::blastFlag| (_ bv4 32)))).def_703))

