(set-info :source |printed by MathSAT|)
(declare-fun c_num_read () (_ BitVec 32))
(declare-fun p_num_write () (_ BitVec 32))
(declare-fun c_last_read () (_ BitVec 32))
(declare-fun p_last_write () (_ BitVec 32))
(declare-fun c_dr_pc () (_ BitVec 32))
(declare-fun q_free () (_ BitVec 32))
(declare-fun q_buf_0 () (_ BitVec 32))
(declare-fun c_dr_st () (_ BitVec 32))
(declare-fun q_req_up () (_ BitVec 32))
(declare-fun q_write_ev () (_ BitVec 32))
(declare-fun q_read_ev () (_ BitVec 32))
(declare-fun p_dw_pc () (_ BitVec 32))
(declare-fun p_dw_st () (_ BitVec 32))
(declare-fun m_pc () (_ BitVec 32))
(declare-fun t1_pc () (_ BitVec 32))
(declare-fun t2_pc () (_ BitVec 32))
(declare-fun t3_pc () (_ BitVec 32))
(declare-fun t4_pc () (_ BitVec 32))
(declare-fun t5_pc () (_ BitVec 32))
(declare-fun t6_pc () (_ BitVec 32))
(declare-fun t7_pc () (_ BitVec 32))
(declare-fun t8_pc () (_ BitVec 32))
(declare-fun m_st () (_ BitVec 32))

*:
(assert (let ((.def_604 (= c_num_read p_num_write))).def_604))
(assert (let ((.def_613 (= c_last_read p_last_write))).def_613))

error1 N4:
(assert false)
(assert (let ((.def_604 (= c_num_read p_num_write))).def_604))
(assert (let ((.def_613 (= c_last_read p_last_write))).def_613))

do_write_p N78:
(assert (let ((.def_800 (= c_dr_pc (_ bv0 32)))).def_800))
(assert (let ((.def_604 (= c_num_read p_num_write))).def_604))
(assert (let ((.def_613 (= c_last_read p_last_write))).def_613))
(assert (let ((.def_868 (= q_free (_ bv1 32)))).def_868))
(assert false)
(assert (let ((.def_1052 (= p_last_write q_buf_0))).def_1052))
(assert (let ((.def_1192 (= c_dr_pc (_ bv1 32)))).def_1192))
(assert (let ((.def_1194 (= q_free (_ bv0 32)))).def_1194))
(assert (let ((.def_1198 (bvadd (_ bv1 32) c_num_read)))(let ((.def_1199 (= p_num_write .def_1198))).def_1199)))
(assert (let ((.def_1880 (= c_dr_st (_ bv0 32)))).def_1880))
(assert (let ((.def_4280 (= q_req_up (_ bv1 32)))).def_4280))
(assert (let ((.def_5913 (= q_write_ev (_ bv1 32)))).def_5913))
(assert (let ((.def_5915 (= q_write_ev (_ bv0 32)))).def_5915))
(assert (let ((.def_8250 (= q_read_ev (_ bv1 32)))).def_8250))
(assert (let ((.def_8252 (= q_read_ev (_ bv0 32)))).def_8252))

do_read_c N112:
(assert (let ((.def_868 (= q_free (_ bv1 32)))).def_868))
(assert (let ((.def_604 (= c_num_read p_num_write))).def_604))
(assert (let ((.def_613 (= c_last_read p_last_write))).def_613))
(assert (let ((.def_1052 (= p_last_write q_buf_0))).def_1052))
(assert (let ((.def_1198 (bvadd (_ bv1 32) c_num_read)))(let ((.def_1199 (= p_num_write .def_1198))).def_1199)))
(assert false)
(assert (let ((.def_1194 (= q_free (_ bv0 32)))).def_1194))
(assert (let ((.def_5913 (= q_write_ev (_ bv1 32)))).def_5913))
(assert (let ((.def_5915 (= q_write_ev (_ bv0 32)))).def_5915))
(assert (let ((.def_1196 (= p_dw_pc (_ bv1 32)))).def_1196))
(assert (let ((.def_4280 (= q_req_up (_ bv1 32)))).def_4280))
(assert (let ((.def_2354 (= p_dw_st (_ bv0 32)))).def_2354))
(assert (let ((.def_8250 (= q_read_ev (_ bv1 32)))).def_8250))
(assert (let ((.def_8252 (= q_read_ev (_ bv0 32)))).def_8252))

eval1 N228:
(assert (let ((.def_800 (= c_dr_pc (_ bv0 32)))).def_800))
(assert (let ((.def_604 (= c_num_read p_num_write))).def_604))
(assert (let ((.def_613 (= c_last_read p_last_write))).def_613))
(assert (let ((.def_868 (= q_free (_ bv1 32)))).def_868))
(assert (let ((.def_1010 (= p_dw_pc (_ bv0 32)))).def_1010))
(assert (let ((.def_1192 (= c_dr_pc (_ bv1 32)))).def_1192))
(assert (let ((.def_1194 (= q_free (_ bv0 32)))).def_1194))
(assert (let ((.def_1196 (= p_dw_pc (_ bv1 32)))).def_1196))
(assert (let ((.def_2354 (= p_dw_st (_ bv0 32)))).def_2354))
(assert (let ((.def_1052 (= p_last_write q_buf_0))).def_1052))
(assert (let ((.def_1198 (bvadd (_ bv1 32) c_num_read)))(let ((.def_1199 (= p_num_write .def_1198))).def_1199)))
(assert (let ((.def_1880 (= c_dr_st (_ bv0 32)))).def_1880))
(assert (let ((.def_4280 (= q_req_up (_ bv1 32)))).def_4280))
(assert (let ((.def_5913 (= q_write_ev (_ bv1 32)))).def_5913))
(assert (let ((.def_5915 (= q_write_ev (_ bv0 32)))).def_5915))
(assert (let ((.def_8250 (= q_read_ev (_ bv1 32)))).def_8250))
(assert (let ((.def_8252 (= q_read_ev (_ bv0 32)))).def_8252))

start_simulation1 N283:
(assert (let ((.def_800 (= c_dr_pc (_ bv0 32)))).def_800))
(assert (let ((.def_604 (= c_num_read p_num_write))).def_604))
(assert (let ((.def_613 (= c_last_read p_last_write))).def_613))
(assert (let ((.def_868 (= q_free (_ bv1 32)))).def_868))
(assert (let ((.def_1010 (= p_dw_pc (_ bv0 32)))).def_1010))
(assert (let ((.def_1192 (= c_dr_pc (_ bv1 32)))).def_1192))
(assert (let ((.def_1194 (= q_free (_ bv0 32)))).def_1194))
(assert (let ((.def_1196 (= p_dw_pc (_ bv1 32)))).def_1196))
(assert (let ((.def_1880 (= c_dr_st (_ bv0 32)))).def_1880))
(assert (let ((.def_2354 (= p_dw_st (_ bv0 32)))).def_2354))
(assert (let ((.def_1052 (= p_last_write q_buf_0))).def_1052))
(assert (let ((.def_5913 (= q_write_ev (_ bv1 32)))).def_5913))
(assert (let ((.def_5915 (= q_write_ev (_ bv0 32)))).def_5915))
(assert (let ((.def_8250 (= q_read_ev (_ bv1 32)))).def_8250))
(assert (let ((.def_8252 (= q_read_ev (_ bv0 32)))).def_8252))
(assert (let ((.def_1198 (bvadd (_ bv1 32) c_num_read)))(let ((.def_1199 (= p_num_write .def_1198))).def_1199)))

error2 N328:
(assert false)
(assert (let ((.def_604 (= c_num_read p_num_write))).def_604))
(assert (let ((.def_613 (= c_last_read p_last_write))).def_613))

eval2 N853:
(assert (let ((.def_11239 (= m_pc (_ bv0 32)))).def_11239))
(assert (let ((.def_604 (= c_num_read p_num_write))).def_604))
(assert (let ((.def_613 (= c_last_read p_last_write))).def_613))
(assert (let ((.def_17686 (= t1_pc (_ bv0 32)))).def_17686))
(assert (let ((.def_17689 (= t2_pc (_ bv0 32)))).def_17689))
(assert (let ((.def_17692 (= t3_pc (_ bv0 32)))).def_17692))
(assert (let ((.def_17695 (= t4_pc (_ bv0 32)))).def_17695))
(assert (let ((.def_17698 (= t5_pc (_ bv0 32)))).def_17698))
(assert (let ((.def_17701 (= t6_pc (_ bv0 32)))).def_17701))
(assert (let ((.def_17704 (= t7_pc (_ bv0 32)))).def_17704))
(assert (let ((.def_17707 (= t8_pc (_ bv0 32)))).def_17707))
(assert (let ((.def_17709 (= m_pc (_ bv1 32)))).def_17709))
(assert (let ((.def_17711 (= t1_pc (_ bv1 32)))).def_17711))
(assert (let ((.def_17713 (= t2_pc (_ bv1 32)))).def_17713))
(assert (let ((.def_17715 (= t3_pc (_ bv1 32)))).def_17715))
(assert (let ((.def_17717 (= t4_pc (_ bv1 32)))).def_17717))
(assert (let ((.def_17719 (= t5_pc (_ bv1 32)))).def_17719))
(assert (let ((.def_17721 (= t6_pc (_ bv1 32)))).def_17721))
(assert (let ((.def_17723 (= t7_pc (_ bv1 32)))).def_17723))
(assert (let ((.def_17725 (= t8_pc (_ bv1 32)))).def_17725))
(assert (let ((.def_17728 (= m_st (_ bv0 32)))).def_17728))

start_simulation2 N1290:
(assert (let ((.def_11239 (= m_pc (_ bv0 32)))).def_11239))
(assert (let ((.def_604 (= c_num_read p_num_write))).def_604))
(assert (let ((.def_613 (= c_last_read p_last_write))).def_613))
(assert (let ((.def_17686 (= t1_pc (_ bv0 32)))).def_17686))
(assert (let ((.def_17689 (= t2_pc (_ bv0 32)))).def_17689))
(assert (let ((.def_17692 (= t3_pc (_ bv0 32)))).def_17692))
(assert (let ((.def_17695 (= t4_pc (_ bv0 32)))).def_17695))
(assert (let ((.def_17698 (= t5_pc (_ bv0 32)))).def_17698))
(assert (let ((.def_17701 (= t6_pc (_ bv0 32)))).def_17701))
(assert (let ((.def_17704 (= t7_pc (_ bv0 32)))).def_17704))
(assert (let ((.def_17707 (= t8_pc (_ bv0 32)))).def_17707))
(assert (let ((.def_17709 (= m_pc (_ bv1 32)))).def_17709))
(assert (let ((.def_17711 (= t1_pc (_ bv1 32)))).def_17711))
(assert (let ((.def_17713 (= t2_pc (_ bv1 32)))).def_17713))
(assert (let ((.def_17715 (= t3_pc (_ bv1 32)))).def_17715))
(assert (let ((.def_17717 (= t4_pc (_ bv1 32)))).def_17717))
(assert (let ((.def_17719 (= t5_pc (_ bv1 32)))).def_17719))
(assert (let ((.def_17721 (= t6_pc (_ bv1 32)))).def_17721))
(assert (let ((.def_17723 (= t7_pc (_ bv1 32)))).def_17723))
(assert (let ((.def_17725 (= t8_pc (_ bv1 32)))).def_17725))

