(set-info :source |printed by MathSAT|)
(declare-fun |assert::arg| () (_ BitVec 8))
(declare-fun st1 () (_ BitVec 8))
(declare-fun st2 () (_ BitVec 8))
(declare-fun st3 () (_ BitVec 8))
(declare-fun st4 () (_ BitVec 8))
(declare-fun st5 () (_ BitVec 8))
(declare-fun st6 () (_ BitVec 8))
(declare-fun r1 () (_ BitVec 8))
(declare-fun p4_new () (_ BitVec 8))
(declare-fun nomsg () (_ BitVec 8))
(declare-fun p3_new () (_ BitVec 8))
(declare-fun p2_new () (_ BitVec 8))
(declare-fun p5_new () (_ BitVec 8))
(declare-fun mode1 () (_ BitVec 8))
(declare-fun mode2 () (_ BitVec 8))
(declare-fun mode3 () (_ BitVec 8))
(declare-fun mode4 () (_ BitVec 8))
(declare-fun mode5 () (_ BitVec 8))
(declare-fun mode6 () (_ BitVec 8))
(declare-fun id4 () (_ BitVec 8))
(declare-fun send3 () (_ BitVec 8))
(declare-fun send6 () (_ BitVec 8))
(declare-fun id1 () (_ BitVec 8))
(declare-fun id3 () (_ BitVec 8))
(declare-fun send2 () (_ BitVec 8))
(declare-fun id5 () (_ BitVec 8))
(declare-fun send4 () (_ BitVec 8))
(declare-fun id2 () (_ BitVec 8))
(declare-fun send1 () (_ BitVec 8))
(declare-fun id6 () (_ BitVec 8))
(declare-fun send5 () (_ BitVec 8))
(declare-fun p6_new () (_ BitVec 8))
(declare-fun p1_new () (_ BitVec 8))
(declare-fun p3_old () (_ BitVec 8))
(declare-fun p6_old () (_ BitVec 8))
(declare-fun p2_old () (_ BitVec 8))
(declare-fun p4_old () (_ BitVec 8))
(declare-fun p1_old () (_ BitVec 8))
(declare-fun p5_old () (_ BitVec 8))
(declare-fun |node1::__CPAchecker_TMP_0| () (_ BitVec 32))
(declare-fun |node5::__CPAchecker_TMP_0| () (_ BitVec 32))
(declare-fun |node4::__CPAchecker_TMP_0| () (_ BitVec 32))

assert:
(assert (let ((.def_2620 (= |assert::arg| (_ bv0 8)))).def_2620))

main1 N411:
(assert (let ((.def_2945 (= st1 (_ bv0 8)))).def_2945))
(assert (let ((.def_2948 (= st2 (_ bv0 8)))).def_2948))
(assert (let ((.def_2951 (= st3 (_ bv0 8)))).def_2951))
(assert (let ((.def_2954 (= st4 (_ bv0 8)))).def_2954))
(assert (let ((.def_2957 (= st5 (_ bv0 8)))).def_2957))
(assert (let ((.def_2960 (= st6 (_ bv0 8)))).def_2960))
(assert (let ((.def_2963 (= r1 (_ bv0 8)))).def_2963))
(assert (let ((.def_2967 (= p4_new nomsg))).def_2967))
(assert (let ((.def_2970 (= nomsg p3_new))).def_2970))
(assert (let ((.def_2973 (= nomsg p2_new))).def_2973))
(assert (let ((.def_2976 (= nomsg p5_new))).def_2976))
(assert (let ((.def_2979 (= mode1 (_ bv0 8)))).def_2979))
(assert (let ((.def_2982 (= mode2 (_ bv0 8)))).def_2982))
(assert (let ((.def_2985 (= mode3 (_ bv0 8)))).def_2985))
(assert (let ((.def_2988 (= mode4 (_ bv0 8)))).def_2988))
(assert (let ((.def_2991 (= mode5 (_ bv0 8)))).def_2991))
(assert (let ((.def_2994 (= mode6 (_ bv0 8)))).def_2994))
(assert (let ((.def_5201 (= st1 st6))).def_5201))
(assert (let ((.def_5203 (= st2 st6))).def_5203))
(assert (let ((.def_5205 (= st3 st6))).def_5205))
(assert (let ((.def_5207 (= st4 st6))).def_5207))
(assert (let ((.def_5209 (= st5 st6))).def_5209))
(assert (let ((.def_5213 (= id4 send3))).def_5213))
(assert (let ((.def_5216 ((_ sign_extend 24) send3)))(let ((.def_5215 ((_ sign_extend 24) id4)))(let ((.def_5217 (= .def_5215 .def_5216))).def_5217))))
(assert (let ((.def_5221 (= send6 id1))).def_5221))
(assert (let ((.def_5224 ((_ sign_extend 24) id1)))(let ((.def_5223 ((_ sign_extend 24) send6)))(let ((.def_5225 (= .def_5223 .def_5224))).def_5225))))
(assert (let ((.def_5230 ((_ sign_extend 24) send2)))(let ((.def_5228 ((_ sign_extend 24) id3)))(let ((.def_5231 (= .def_5228 .def_5230))).def_5231))))
(assert (let ((.def_5236 ((_ sign_extend 24) send4)))(let ((.def_5234 ((_ sign_extend 24) id5)))(let ((.def_5237 (= .def_5234 .def_5236))).def_5237))))
(assert (let ((.def_5241 (= id2 send1))).def_5241))
(assert (let ((.def_5244 ((_ sign_extend 24) send1)))(let ((.def_5243 ((_ sign_extend 24) id2)))(let ((.def_5245 (= .def_5243 .def_5244))).def_5245))))
(assert (let ((.def_5250 ((_ sign_extend 24) send5)))(let ((.def_5248 ((_ sign_extend 24) id6)))(let ((.def_5251 (= .def_5248 .def_5250))).def_5251))))
(assert (let ((.def_5253 ((_ sign_extend 24) nomsg)))(let ((.def_5230 ((_ sign_extend 24) send2)))(let ((.def_5254 (= .def_5230 .def_5253))).def_5254))))
(assert (let ((.def_5253 ((_ sign_extend 24) nomsg)))(let ((.def_5216 ((_ sign_extend 24) send3)))(let ((.def_5256 (= .def_5216 .def_5253))).def_5256))))
(assert (let ((.def_5259 (= nomsg p6_new))).def_5259))
(assert (let ((.def_5262 (= nomsg p1_new))).def_5262))
(assert (let ((.def_5265 ((_ sign_extend 24) p3_old)))(let ((.def_5215 ((_ sign_extend 24) id4)))(let ((.def_5266 (= .def_5215 .def_5265))).def_5266))))
(assert (let ((.def_5274 ((_ sign_extend 24) st1)))(let ((.def_5273 ((_ sign_extend 24) st2)))(let ((.def_5276 (bvadd .def_5273 .def_5274)))(let ((.def_5272 ((_ sign_extend 24) st3)))(let ((.def_5278 (bvadd .def_5272 .def_5276)))(let ((.def_5271 ((_ sign_extend 24) st4)))(let ((.def_5280 (bvadd .def_5271 .def_5278)))(let ((.def_5270 ((_ sign_extend 24) st5)))(let ((.def_5282 (bvadd .def_5270 .def_5280)))(let ((.def_5268 ((_ sign_extend 24) st6)))(let ((.def_5269 (bvneg .def_5268)))(let ((.def_5283 (= .def_5269 .def_5282))).def_5283)))))))))))))
(assert (let ((.def_5286 ((_ sign_extend 24) p6_old)))(let ((.def_5224 ((_ sign_extend 24) id1)))(let ((.def_5287 (= .def_5224 .def_5286))).def_5287))))
(assert (let ((.def_5290 ((_ sign_extend 24) p2_old)))(let ((.def_5228 ((_ sign_extend 24) id3)))(let ((.def_5291 (= .def_5228 .def_5290))).def_5291))))
(assert (let ((.def_5294 ((_ sign_extend 24) p4_old)))(let ((.def_5234 ((_ sign_extend 24) id5)))(let ((.def_5295 (= .def_5234 .def_5294))).def_5295))))
(assert (let ((.def_5298 ((_ sign_extend 24) p1_old)))(let ((.def_5243 ((_ sign_extend 24) id2)))(let ((.def_5299 (= .def_5243 .def_5298))).def_5299))))
(assert (let ((.def_5302 ((_ sign_extend 24) p5_old)))(let ((.def_5248 ((_ sign_extend 24) id6)))(let ((.def_5303 (= .def_5248 .def_5302))).def_5303))))
(assert (let ((.def_5273 ((_ sign_extend 24) st2)))(let ((.def_5272 ((_ sign_extend 24) st3)))(let ((.def_11398 (= .def_5272 .def_5273))).def_11398))))
(assert (let ((.def_5274 ((_ sign_extend 24) st1)))(let ((.def_5271 ((_ sign_extend 24) st4)))(let ((.def_11400 (= .def_5271 .def_5274))).def_11400))))
(assert (let ((.def_5271 ((_ sign_extend 24) st4)))(let ((.def_5270 ((_ sign_extend 24) st5)))(let ((.def_11402 (= .def_5270 .def_5271))).def_11402))))
(assert (let ((.def_11404 (= st4 (_ bv1 8)))).def_11404))
(assert (let ((.def_11406 (= st5 (_ bv1 8)))).def_11406))
(assert (let ((.def_11408 (= st1 (_ bv1 8)))).def_11408))
(assert (let ((.def_5274 ((_ sign_extend 24) st1)))(let ((.def_5270 ((_ sign_extend 24) st5)))(let ((.def_11410 (= .def_5270 .def_5274))).def_11410))))
(assert (let ((.def_5273 ((_ sign_extend 24) st2)))(let ((.def_5271 ((_ sign_extend 24) st4)))(let ((.def_11412 (= .def_5271 .def_5273))).def_11412))))
(assert (let ((.def_5274 ((_ sign_extend 24) st1)))(let ((.def_5272 ((_ sign_extend 24) st3)))(let ((.def_11414 (= .def_5272 .def_5274))).def_11414))))
(assert (let ((.def_5272 ((_ sign_extend 24) st3)))(let ((.def_5270 ((_ sign_extend 24) st5)))(let ((.def_11416 (= .def_5270 .def_5272))).def_11416))))
(assert (let ((.def_11418 (= st3 (_ bv1 8)))).def_11418))
(assert (let ((.def_5272 ((_ sign_extend 24) st3)))(let ((.def_5271 ((_ sign_extend 24) st4)))(let ((.def_11420 (= .def_5271 .def_5272))).def_11420))))
(assert (let ((.def_11422 (= st2 (_ bv1 8)))).def_11422))
(assert (let ((.def_5274 ((_ sign_extend 24) st1)))(let ((.def_5273 ((_ sign_extend 24) st2)))(let ((.def_11424 (= .def_5273 .def_5274))).def_11424))))
(assert (let ((.def_5273 ((_ sign_extend 24) st2)))(let ((.def_5270 ((_ sign_extend 24) st5)))(let ((.def_11426 (= .def_5270 .def_5273))).def_11426))))
(assert (let ((.def_11428 ((_ zero_extend 24) r1)))(let ((.def_11429 (bvslt .def_11428 (_ bv6 32)))).def_11429)))
(assert (let ((.def_5274 ((_ sign_extend 24) st1)))(let ((.def_5273 ((_ sign_extend 24) st2)))(let ((.def_5276 (bvadd .def_5273 .def_5274)))(let ((.def_5272 ((_ sign_extend 24) st3)))(let ((.def_5278 (bvadd .def_5272 .def_5276)))(let ((.def_5271 ((_ sign_extend 24) st4)))(let ((.def_5280 (bvadd .def_5271 .def_5278)))(let ((.def_5270 ((_ sign_extend 24) st5)))(let ((.def_5282 (bvadd .def_5270 .def_5280)))(let ((.def_5268 ((_ sign_extend 24) st6)))(let ((.def_11432 (bvadd .def_5268 .def_5282)))(let ((.def_11433 (= .def_11432 (_ bv1 32)))).def_11433)))))))))))))
(assert (let ((.def_5244 ((_ sign_extend 24) send1)))(let ((.def_5243 ((_ sign_extend 24) id2)))(let ((.def_20139 (bvslt .def_5243 .def_5244))).def_20139))))
(assert (let ((.def_5230 ((_ sign_extend 24) send2)))(let ((.def_5215 ((_ sign_extend 24) id4)))(let ((.def_20141 (bvslt .def_5215 .def_5230))).def_20141))))
(assert (let ((.def_5230 ((_ sign_extend 24) send2)))(let ((.def_5215 ((_ sign_extend 24) id4)))(let ((.def_20143 (= .def_5215 .def_5230))).def_20143))))
(assert (let ((.def_20145 (= st1 st5))).def_20145))
(assert (let ((.def_20147 (= st2 st5))).def_20147))
(assert (let ((.def_20149 (= st3 st5))).def_20149))
(assert (let ((.def_20151 (= st4 st5))).def_20151))
(assert (let ((.def_5216 ((_ sign_extend 24) send3)))(let ((.def_5215 ((_ sign_extend 24) id4)))(let ((.def_20153 (bvslt .def_5215 .def_5216))).def_20153))))
(assert (let ((.def_5223 ((_ sign_extend 24) send6)))(let ((.def_5224 ((_ sign_extend 24) id1)))(let ((.def_20155 (bvslt .def_5224 .def_5223))).def_20155))))
(assert (let ((.def_5250 ((_ sign_extend 24) send5)))(let ((.def_5224 ((_ sign_extend 24) id1)))(let ((.def_20157 (= .def_5224 .def_5250))).def_20157))))
(assert (let ((.def_5248 ((_ sign_extend 24) id6)))(let ((.def_5236 ((_ sign_extend 24) send4)))(let ((.def_20159 (= .def_5236 .def_5248))).def_20159))))
(assert (let ((.def_5250 ((_ sign_extend 24) send5)))(let ((.def_5248 ((_ sign_extend 24) id6)))(let ((.def_20161 (bvslt .def_5248 .def_5250))).def_20161))))
(assert (let ((.def_5244 ((_ sign_extend 24) send1)))(let ((.def_5224 ((_ sign_extend 24) id1)))(let ((.def_20163 (= .def_5224 .def_5244))).def_20163))))
(assert (let ((.def_5243 ((_ sign_extend 24) id2)))(let ((.def_5223 ((_ sign_extend 24) send6)))(let ((.def_20165 (= .def_5223 .def_5243))).def_20165))))
(assert (let ((.def_5230 ((_ sign_extend 24) send2)))(let ((.def_5228 ((_ sign_extend 24) id3)))(let ((.def_20167 (bvslt .def_5228 .def_5230))).def_20167))))
(assert (let ((.def_20169 (= nomsg (_ bv255 8)))).def_20169))
(assert (let ((.def_5244 ((_ sign_extend 24) send1)))(let ((.def_5228 ((_ sign_extend 24) id3)))(let ((.def_20171 (= .def_5228 .def_5244))).def_20171))))
(assert (let ((.def_20173 (= nomsg send3))).def_20173))
(assert (let ((.def_20175 (= nomsg send6))).def_20175))
(assert (let ((.def_5253 ((_ sign_extend 24) nomsg)))(let ((.def_5223 ((_ sign_extend 24) send6)))(let ((.def_20177 (= .def_5223 .def_5253))).def_20177))))
(assert (let ((.def_5234 ((_ sign_extend 24) id5)))(let ((.def_5216 ((_ sign_extend 24) send3)))(let ((.def_20179 (= .def_5216 .def_5234))).def_20179))))
(assert (let ((.def_5236 ((_ sign_extend 24) send4)))(let ((.def_5234 ((_ sign_extend 24) id5)))(let ((.def_20181 (bvslt .def_5234 .def_5236))).def_20181))))
(assert (let ((.def_5250 ((_ sign_extend 24) send5)))(let ((.def_5234 ((_ sign_extend 24) id5)))(let ((.def_20183 (= .def_5234 .def_5250))).def_20183))))
(assert (let ((.def_5243 ((_ sign_extend 24) id2)))(let ((.def_5230 ((_ sign_extend 24) send2)))(let ((.def_20185 (= .def_5230 .def_5243))).def_20185))))
(assert (let ((.def_5253 ((_ sign_extend 24) nomsg)))(let ((.def_5250 ((_ sign_extend 24) send5)))(let ((.def_20187 (= .def_5250 .def_5253))).def_20187))))
(assert (let ((.def_5298 ((_ sign_extend 24) p1_old)))(let ((.def_5243 ((_ sign_extend 24) id2)))(let ((.def_20189 (bvslt .def_5243 .def_5298))).def_20189))))
(assert (let ((.def_5244 ((_ sign_extend 24) send1)))(let ((.def_20192 (= .def_5244 |node1::__CPAchecker_TMP_0|))).def_20192)))
(assert (let ((.def_20194 ((_ extract 7 0) |node1::__CPAchecker_TMP_0|)))(let ((.def_20195 (= p1_old .def_20194))).def_20195)))
(assert (let ((.def_5290 ((_ sign_extend 24) p2_old)))(let ((.def_5215 ((_ sign_extend 24) id4)))(let ((.def_20197 (bvslt .def_5215 .def_5290))).def_20197))))
(assert (let ((.def_5290 ((_ sign_extend 24) p2_old)))(let ((.def_5215 ((_ sign_extend 24) id4)))(let ((.def_20199 (= .def_5215 .def_5290))).def_20199))))
(assert (let ((.def_20201 (= send3 p3_old))).def_20201))
(assert (let ((.def_5265 ((_ sign_extend 24) p3_old)))(let ((.def_5215 ((_ sign_extend 24) id4)))(let ((.def_20203 (bvslt .def_5215 .def_5265))).def_20203))))
(assert (let ((.def_5286 ((_ sign_extend 24) p6_old)))(let ((.def_5224 ((_ sign_extend 24) id1)))(let ((.def_20205 (bvslt .def_5224 .def_5286))).def_20205))))
(assert (let ((.def_5302 ((_ sign_extend 24) p5_old)))(let ((.def_5224 ((_ sign_extend 24) id1)))(let ((.def_20207 (= .def_5224 .def_5302))).def_20207))))
(assert (let ((.def_20209 (= send6 p6_old))).def_20209))
(assert (let ((.def_5294 ((_ sign_extend 24) p4_old)))(let ((.def_5248 ((_ sign_extend 24) id6)))(let ((.def_20211 (= .def_5248 .def_5294))).def_20211))))
(assert (let ((.def_5250 ((_ sign_extend 24) send5)))(let ((.def_20214 (= .def_5250 |node5::__CPAchecker_TMP_0|))).def_20214)))
(assert (let ((.def_20216 ((_ extract 7 0) |node5::__CPAchecker_TMP_0|)))(let ((.def_20217 (= p5_old .def_20216))).def_20217)))
(assert (let ((.def_5302 ((_ sign_extend 24) p5_old)))(let ((.def_5248 ((_ sign_extend 24) id6)))(let ((.def_20219 (bvslt .def_5248 .def_5302))).def_20219))))
(assert (let ((.def_5224 ((_ sign_extend 24) id1)))(let ((.def_20221 (= .def_5224 |node1::__CPAchecker_TMP_0|))).def_20221)))
(assert (let ((.def_5286 ((_ sign_extend 24) p6_old)))(let ((.def_5243 ((_ sign_extend 24) id2)))(let ((.def_20223 (= .def_5243 .def_5286))).def_20223))))
(assert (let ((.def_5302 ((_ sign_extend 24) p5_old)))(let ((.def_5253 ((_ sign_extend 24) nomsg)))(let ((.def_20225 (= .def_5253 .def_5302))).def_20225))))
(assert (let ((.def_5290 ((_ sign_extend 24) p2_old)))(let ((.def_5228 ((_ sign_extend 24) id3)))(let ((.def_20227 (bvslt .def_5228 .def_5290))).def_20227))))
(assert (let ((.def_20229 (= send2 p2_old))).def_20229))
(assert (let ((.def_5298 ((_ sign_extend 24) p1_old)))(let ((.def_5228 ((_ sign_extend 24) id3)))(let ((.def_20231 (= .def_5228 .def_5298))).def_20231))))
(assert (let ((.def_5265 ((_ sign_extend 24) p3_old)))(let ((.def_5253 ((_ sign_extend 24) nomsg)))(let ((.def_20233 (= .def_5253 .def_5265))).def_20233))))
(assert (let ((.def_5286 ((_ sign_extend 24) p6_old)))(let ((.def_5253 ((_ sign_extend 24) nomsg)))(let ((.def_20235 (= .def_5253 .def_5286))).def_20235))))
(assert (let ((.def_5265 ((_ sign_extend 24) p3_old)))(let ((.def_5234 ((_ sign_extend 24) id5)))(let ((.def_20237 (= .def_5234 .def_5265))).def_20237))))
(assert (let ((.def_5294 ((_ sign_extend 24) p4_old)))(let ((.def_5234 ((_ sign_extend 24) id5)))(let ((.def_20239 (bvslt .def_5234 .def_5294))).def_20239))))
(assert (let ((.def_5236 ((_ sign_extend 24) send4)))(let ((.def_20242 (= .def_5236 |node4::__CPAchecker_TMP_0|))).def_20242)))
(assert (let ((.def_20244 ((_ extract 7 0) |node4::__CPAchecker_TMP_0|)))(let ((.def_20245 (= p4_old .def_20244))).def_20245)))
(assert (let ((.def_5253 ((_ sign_extend 24) nomsg)))(let ((.def_5234 ((_ sign_extend 24) id5)))(let ((.def_20247 (= .def_5234 .def_5253))).def_20247))))
(assert (let ((.def_5253 ((_ sign_extend 24) nomsg)))(let ((.def_5243 ((_ sign_extend 24) id2)))(let ((.def_20249 (= .def_5243 .def_5253))).def_20249))))
(assert (let ((.def_5253 ((_ sign_extend 24) nomsg)))(let ((.def_5244 ((_ sign_extend 24) send1)))(let ((.def_20251 (= .def_5244 .def_5253))).def_20251))))
(assert (let ((.def_20253 (= id6 send5))).def_20253))
(assert (let ((.def_20255 (= send6 send1))).def_20255))
(assert (let ((.def_20257 (= st6 (_ bv1 8)))).def_20257))
(assert (let ((.def_20259 (= r1 (_ bv1 8)))).def_20259))
(assert (let ((.def_20261 (= id5 send4))).def_20261))
(assert (let ((.def_5298 ((_ sign_extend 24) p1_old)))(let ((.def_5253 ((_ sign_extend 24) nomsg)))(let ((.def_20263 (= .def_5253 .def_5298))).def_20263))))
(assert (let ((.def_5270 ((_ sign_extend 24) st5)))(let ((.def_5268 ((_ sign_extend 24) st6)))(let ((.def_20265 (= .def_5268 .def_5270))).def_20265))))

assert N441:
(assert false)
(assert (let ((.def_2620 (= |assert::arg| (_ bv0 8)))).def_2620))

