(set-info :source |printed by MathSAT|)
(declare-fun c_num_read () (_ BitVec 32))
(declare-fun p_num_write () (_ BitVec 32))
(declare-fun c_last_read () (_ BitVec 32))
(declare-fun p_last_write () (_ BitVec 32))
(declare-fun c_dr_pc () (_ BitVec 32))
(declare-fun c_dr_st () (_ BitVec 32))
(declare-fun m_pc () (_ BitVec 32))
(declare-fun t1_pc () (_ BitVec 32))
(declare-fun t2_pc () (_ BitVec 32))
(declare-fun t3_pc () (_ BitVec 32))
(declare-fun t4_pc () (_ BitVec 32))
(declare-fun t5_pc () (_ BitVec 32))
(declare-fun t6_pc () (_ BitVec 32))
(declare-fun t7_pc () (_ BitVec 32))
(declare-fun t8_pc () (_ BitVec 32))
(declare-fun t9_pc () (_ BitVec 32))
(declare-fun t10_pc () (_ BitVec 32))
(declare-fun t11_pc () (_ BitVec 32))
(declare-fun t12_pc () (_ BitVec 32))
(declare-fun t13_pc () (_ BitVec 32))
(declare-fun m_st () (_ BitVec 32))

*:
(assert (let ((.def_812 (= c_num_read p_num_write))).def_812))
(assert (let ((.def_821 (= c_last_read p_last_write))).def_821))

error1 N4:
(assert false)
(assert (let ((.def_812 (= c_num_read p_num_write))).def_812))
(assert (let ((.def_821 (= c_last_read p_last_write))).def_821))

eval1 N282:
(assert (let ((.def_972 (= c_dr_pc (_ bv0 32)))).def_972))
(assert (let ((.def_812 (= c_num_read p_num_write))).def_812))
(assert (let ((.def_821 (= c_last_read p_last_write))).def_821))
(assert (let ((.def_1463 (= c_dr_pc (_ bv2 32)))).def_1463))
(assert (let ((.def_1466 (= c_dr_st (_ bv0 32)))).def_1466))

start_simulation1 N338:
(assert (let ((.def_972 (= c_dr_pc (_ bv0 32)))).def_972))
(assert (let ((.def_812 (= c_num_read p_num_write))).def_812))
(assert (let ((.def_821 (= c_last_read p_last_write))).def_821))
(assert (let ((.def_1463 (= c_dr_pc (_ bv2 32)))).def_1463))

error2 N393:
(assert false)
(assert (let ((.def_812 (= c_num_read p_num_write))).def_812))
(assert (let ((.def_821 (= c_last_read p_last_write))).def_821))

eval2 N1175:
(assert (let ((.def_5537 (= m_pc (_ bv0 32)))).def_5537))
(assert (let ((.def_812 (= c_num_read p_num_write))).def_812))
(assert (let ((.def_821 (= c_last_read p_last_write))).def_821))
(assert (let ((.def_19938 (= t1_pc (_ bv0 32)))).def_19938))
(assert (let ((.def_19941 (= t2_pc (_ bv0 32)))).def_19941))
(assert (let ((.def_19944 (= t3_pc (_ bv0 32)))).def_19944))
(assert (let ((.def_19947 (= t4_pc (_ bv0 32)))).def_19947))
(assert (let ((.def_19950 (= t5_pc (_ bv0 32)))).def_19950))
(assert (let ((.def_19953 (= t6_pc (_ bv0 32)))).def_19953))
(assert (let ((.def_19956 (= t7_pc (_ bv0 32)))).def_19956))
(assert (let ((.def_19959 (= t8_pc (_ bv0 32)))).def_19959))
(assert (let ((.def_19962 (= t9_pc (_ bv0 32)))).def_19962))
(assert (let ((.def_19965 (= t10_pc (_ bv0 32)))).def_19965))
(assert (let ((.def_19968 (= t11_pc (_ bv0 32)))).def_19968))
(assert (let ((.def_19971 (= t12_pc (_ bv0 32)))).def_19971))
(assert (let ((.def_19974 (= t13_pc (_ bv0 32)))).def_19974))
(assert (let ((.def_19976 (= m_pc (_ bv1 32)))).def_19976))
(assert (let ((.def_19978 (= t1_pc (_ bv1 32)))).def_19978))
(assert (let ((.def_19980 (= t2_pc (_ bv1 32)))).def_19980))
(assert (let ((.def_19982 (= t3_pc (_ bv1 32)))).def_19982))
(assert (let ((.def_19984 (= t4_pc (_ bv1 32)))).def_19984))
(assert (let ((.def_19986 (= t5_pc (_ bv1 32)))).def_19986))
(assert (let ((.def_19988 (= t6_pc (_ bv1 32)))).def_19988))
(assert (let ((.def_19990 (= t7_pc (_ bv1 32)))).def_19990))
(assert (let ((.def_19992 (= t8_pc (_ bv1 32)))).def_19992))
(assert (let ((.def_19994 (= t9_pc (_ bv1 32)))).def_19994))
(assert (let ((.def_19996 (= t10_pc (_ bv1 32)))).def_19996))
(assert (let ((.def_19998 (= t11_pc (_ bv1 32)))).def_19998))
(assert (let ((.def_20000 (= t12_pc (_ bv1 32)))).def_20000))
(assert (let ((.def_20002 (= t13_pc (_ bv1 32)))).def_20002))
(assert (let ((.def_20005 (= m_st (_ bv0 32)))).def_20005))

start_simulation2 N1817:
(assert (let ((.def_5537 (= m_pc (_ bv0 32)))).def_5537))
(assert (let ((.def_812 (= c_num_read p_num_write))).def_812))
(assert (let ((.def_821 (= c_last_read p_last_write))).def_821))
(assert (let ((.def_19938 (= t1_pc (_ bv0 32)))).def_19938))
(assert (let ((.def_19941 (= t2_pc (_ bv0 32)))).def_19941))
(assert (let ((.def_19944 (= t3_pc (_ bv0 32)))).def_19944))
(assert (let ((.def_19947 (= t4_pc (_ bv0 32)))).def_19947))
(assert (let ((.def_19950 (= t5_pc (_ bv0 32)))).def_19950))
(assert (let ((.def_19953 (= t6_pc (_ bv0 32)))).def_19953))
(assert (let ((.def_19956 (= t7_pc (_ bv0 32)))).def_19956))
(assert (let ((.def_19959 (= t8_pc (_ bv0 32)))).def_19959))
(assert (let ((.def_19962 (= t9_pc (_ bv0 32)))).def_19962))
(assert (let ((.def_19965 (= t10_pc (_ bv0 32)))).def_19965))
(assert (let ((.def_19968 (= t11_pc (_ bv0 32)))).def_19968))
(assert (let ((.def_19971 (= t12_pc (_ bv0 32)))).def_19971))
(assert (let ((.def_19974 (= t13_pc (_ bv0 32)))).def_19974))
(assert (let ((.def_19976 (= m_pc (_ bv1 32)))).def_19976))
(assert (let ((.def_19978 (= t1_pc (_ bv1 32)))).def_19978))
(assert (let ((.def_19980 (= t2_pc (_ bv1 32)))).def_19980))
(assert (let ((.def_19982 (= t3_pc (_ bv1 32)))).def_19982))
(assert (let ((.def_19984 (= t4_pc (_ bv1 32)))).def_19984))
(assert (let ((.def_19986 (= t5_pc (_ bv1 32)))).def_19986))
(assert (let ((.def_19988 (= t6_pc (_ bv1 32)))).def_19988))
(assert (let ((.def_19990 (= t7_pc (_ bv1 32)))).def_19990))
(assert (let ((.def_19992 (= t8_pc (_ bv1 32)))).def_19992))
(assert (let ((.def_19994 (= t9_pc (_ bv1 32)))).def_19994))
(assert (let ((.def_19996 (= t10_pc (_ bv1 32)))).def_19996))
(assert (let ((.def_19998 (= t11_pc (_ bv1 32)))).def_19998))
(assert (let ((.def_20000 (= t12_pc (_ bv1 32)))).def_20000))
(assert (let ((.def_20002 (= t13_pc (_ bv1 32)))).def_20002))

