(set-info :source |printed by MathSAT|)
(declare-fun |assert::arg| () (_ BitVec 8))
(declare-fun st1 () (_ BitVec 8))
(declare-fun st2 () (_ BitVec 8))
(declare-fun st3 () (_ BitVec 8))
(declare-fun st4 () (_ BitVec 8))
(declare-fun r1 () (_ BitVec 8))
(declare-fun p2_new () (_ BitVec 8))
(declare-fun nomsg () (_ BitVec 8))
(declare-fun p3_new () (_ BitVec 8))
(declare-fun mode1 () (_ BitVec 8))
(declare-fun mode2 () (_ BitVec 8))
(declare-fun mode3 () (_ BitVec 8))
(declare-fun mode4 () (_ BitVec 8))
(declare-fun send4 () (_ BitVec 8))
(declare-fun id1 () (_ BitVec 8))
(declare-fun id2 () (_ BitVec 8))
(declare-fun send1 () (_ BitVec 8))
(declare-fun id3 () (_ BitVec 8))
(declare-fun send2 () (_ BitVec 8))
(declare-fun id4 () (_ BitVec 8))
(declare-fun send3 () (_ BitVec 8))
(declare-fun p4_new () (_ BitVec 8))
(declare-fun p1_new () (_ BitVec 8))
(declare-fun p4_old () (_ BitVec 8))
(declare-fun p1_old () (_ BitVec 8))
(declare-fun p2_old () (_ BitVec 8))
(declare-fun p3_old () (_ BitVec 8))
(declare-fun |node2::__CPAchecker_TMP_0| () (_ BitVec 32))
(declare-fun |node3::__CPAchecker_TMP_0| () (_ BitVec 32))
(declare-fun |node1::__CPAchecker_TMP_0| () (_ BitVec 32))
(declare-fun |node4::__CPAchecker_TMP_0| () (_ BitVec 32))

assert:
(assert (let ((.def_1777 (= |assert::arg| (_ bv0 8)))).def_1777))

main1 N277:
(assert (let ((.def_1987 (= st1 (_ bv0 8)))).def_1987))
(assert (let ((.def_1990 (= st2 (_ bv0 8)))).def_1990))
(assert (let ((.def_1993 (= st3 (_ bv0 8)))).def_1993))
(assert (let ((.def_1996 (= st4 (_ bv0 8)))).def_1996))
(assert (let ((.def_1999 (= r1 (_ bv0 8)))).def_1999))
(assert (let ((.def_2003 (= p2_new nomsg))).def_2003))
(assert (let ((.def_2006 (= nomsg p3_new))).def_2006))
(assert (let ((.def_2009 (= mode1 (_ bv0 8)))).def_2009))
(assert (let ((.def_2012 (= mode2 (_ bv0 8)))).def_2012))
(assert (let ((.def_2015 (= mode3 (_ bv0 8)))).def_2015))
(assert (let ((.def_2018 (= mode4 (_ bv0 8)))).def_2018))
(assert (let ((.def_3564 ((_ sign_extend 24) id1)))(let ((.def_3562 ((_ sign_extend 24) send4)))(let ((.def_3565 (= .def_3562 .def_3564))).def_3565))))
(assert (let ((.def_3567 (= st1 st4))).def_3567))
(assert (let ((.def_3569 (= st2 st4))).def_3569))
(assert (let ((.def_3571 (= st3 st4))).def_3571))
(assert (let ((.def_3575 (= id2 send1))).def_3575))
(assert (let ((.def_3578 ((_ sign_extend 24) send1)))(let ((.def_3577 ((_ sign_extend 24) id2)))(let ((.def_3579 (= .def_3577 .def_3578))).def_3579))))
(assert (let ((.def_3583 (= id3 send2))).def_3583))
(assert (let ((.def_3586 ((_ sign_extend 24) send2)))(let ((.def_3585 ((_ sign_extend 24) id3)))(let ((.def_3587 (= .def_3585 .def_3586))).def_3587))))
(assert (let ((.def_3591 (= id4 send3))).def_3591))
(assert (let ((.def_3594 ((_ sign_extend 24) send3)))(let ((.def_3593 ((_ sign_extend 24) id4)))(let ((.def_3595 (= .def_3593 .def_3594))).def_3595))))
(assert (let ((.def_3597 ((_ sign_extend 24) nomsg)))(let ((.def_3586 ((_ sign_extend 24) send2)))(let ((.def_3598 (= .def_3586 .def_3597))).def_3598))))
(assert (let ((.def_3597 ((_ sign_extend 24) nomsg)))(let ((.def_3594 ((_ sign_extend 24) send3)))(let ((.def_3600 (= .def_3594 .def_3597))).def_3600))))
(assert (let ((.def_3603 (= nomsg p4_new))).def_3603))
(assert (let ((.def_3606 (= nomsg p1_new))).def_3606))
(assert (let ((.def_3609 ((_ sign_extend 24) p4_old)))(let ((.def_3564 ((_ sign_extend 24) id1)))(let ((.def_3610 (= .def_3564 .def_3609))).def_3610))))
(assert (let ((.def_3616 ((_ sign_extend 24) st1)))(let ((.def_3615 ((_ sign_extend 24) st2)))(let ((.def_3618 (bvadd .def_3615 .def_3616)))(let ((.def_3614 ((_ sign_extend 24) st3)))(let ((.def_3620 (bvadd .def_3614 .def_3618)))(let ((.def_3612 ((_ sign_extend 24) st4)))(let ((.def_3613 (bvneg .def_3612)))(let ((.def_3621 (= .def_3613 .def_3620))).def_3621)))))))))
(assert (let ((.def_3624 ((_ sign_extend 24) p1_old)))(let ((.def_3577 ((_ sign_extend 24) id2)))(let ((.def_3625 (= .def_3577 .def_3624))).def_3625))))
(assert (let ((.def_3628 ((_ sign_extend 24) p2_old)))(let ((.def_3585 ((_ sign_extend 24) id3)))(let ((.def_3629 (= .def_3585 .def_3628))).def_3629))))
(assert (let ((.def_3632 ((_ sign_extend 24) p3_old)))(let ((.def_3593 ((_ sign_extend 24) id4)))(let ((.def_3633 (= .def_3593 .def_3632))).def_3633))))
(assert (let ((.def_3615 ((_ sign_extend 24) st2)))(let ((.def_3614 ((_ sign_extend 24) st3)))(let ((.def_6596 (= .def_3614 .def_3615))).def_6596))))
(assert (let ((.def_3616 ((_ sign_extend 24) st1)))(let ((.def_3614 ((_ sign_extend 24) st3)))(let ((.def_6598 (= .def_3614 .def_3616))).def_6598))))
(assert (let ((.def_6600 (= st2 (_ bv1 8)))).def_6600))
(assert (let ((.def_6602 (= st3 (_ bv1 8)))).def_6602))
(assert (let ((.def_6604 (= st1 (_ bv1 8)))).def_6604))
(assert (let ((.def_3616 ((_ sign_extend 24) st1)))(let ((.def_3615 ((_ sign_extend 24) st2)))(let ((.def_6606 (= .def_3615 .def_3616))).def_6606))))
(assert (let ((.def_6608 ((_ zero_extend 24) r1)))(let ((.def_6609 (bvslt .def_6608 (_ bv4 32)))).def_6609)))
(assert (let ((.def_3616 ((_ sign_extend 24) st1)))(let ((.def_3615 ((_ sign_extend 24) st2)))(let ((.def_3618 (bvadd .def_3615 .def_3616)))(let ((.def_3614 ((_ sign_extend 24) st3)))(let ((.def_3620 (bvadd .def_3614 .def_3618)))(let ((.def_3612 ((_ sign_extend 24) st4)))(let ((.def_6612 (bvadd .def_3612 .def_3620)))(let ((.def_6613 (= .def_6612 (_ bv1 32)))).def_6613)))))))))
(assert (let ((.def_3578 ((_ sign_extend 24) send1)))(let ((.def_3585 ((_ sign_extend 24) id3)))(let ((.def_10940 (bvslt .def_3585 .def_3578))).def_10940))))
(assert (let ((.def_3585 ((_ sign_extend 24) id3)))(let ((.def_3578 ((_ sign_extend 24) send1)))(let ((.def_10942 (= .def_3578 .def_3585))).def_10942))))
(assert (let ((.def_3586 ((_ sign_extend 24) send2)))(let ((.def_3585 ((_ sign_extend 24) id3)))(let ((.def_10944 (bvslt .def_3585 .def_3586))).def_10944))))
(assert (let ((.def_3594 ((_ sign_extend 24) send3)))(let ((.def_3585 ((_ sign_extend 24) id3)))(let ((.def_10946 (= .def_3585 .def_3594))).def_10946))))
(assert (let ((.def_11003 ((_ extract 7 7) id1)))(let ((.def_11004 (bvnot .def_11003)))(let ((.def_10997 ((_ extract 6 6) id1)))(let ((.def_10996 ((_ extract 6 6) send3)))(let ((.def_11002 (bvor .def_10996 .def_10997)))(let ((.def_11006 (bvand .def_11002 .def_11004)))(let ((.def_10999 (bvand .def_10996 .def_10997)))(let ((.def_11000 (bvnot .def_10999)))(let ((.def_11008 (bvand .def_11000 .def_11006)))(let ((.def_11009 (bvand .def_11004 .def_11008)))(let ((.def_11010 (bvnot .def_11009)))(let ((.def_10989 ((_ extract 5 5) id1)))(let ((.def_10993 (bvnot .def_10989)))(let ((.def_10988 ((_ extract 5 5) send3)))(let ((.def_10992 (bvnot .def_10988)))(let ((.def_10995 (bvand .def_10992 .def_10993)))(let ((.def_11012 (bvand .def_10995 .def_11010)))(let ((.def_10991 (bvand .def_10988 .def_10989)))(let ((.def_11014 (bvor .def_10991 .def_11012)))(let ((.def_11015 (bvand .def_11010 .def_11014)))(let ((.def_10981 ((_ extract 4 4) id1)))(let ((.def_10985 (bvnot .def_10981)))(let ((.def_10980 ((_ extract 4 4) send3)))(let ((.def_10984 (bvnot .def_10980)))(let ((.def_10987 (bvand .def_10984 .def_10985)))(let ((.def_11017 (bvand .def_10987 .def_11015)))(let ((.def_10983 (bvand .def_10980 .def_10981)))(let ((.def_11019 (bvor .def_10983 .def_11017)))(let ((.def_11020 (bvand .def_11015 .def_11019)))(let ((.def_10973 ((_ extract 3 3) id1)))(let ((.def_10977 (bvnot .def_10973)))(let ((.def_10972 ((_ extract 3 3) send3)))(let ((.def_10976 (bvnot .def_10972)))(let ((.def_10979 (bvand .def_10976 .def_10977)))(let ((.def_11022 (bvand .def_10979 .def_11020)))(let ((.def_10975 (bvand .def_10972 .def_10973)))(let ((.def_11024 (bvor .def_10975 .def_11022)))(let ((.def_11025 (bvand .def_11020 .def_11024)))(let ((.def_10965 ((_ extract 2 2) id1)))(let ((.def_10969 (bvnot .def_10965)))(let ((.def_10964 ((_ extract 2 2) send3)))(let ((.def_10968 (bvnot .def_10964)))(let ((.def_10971 (bvand .def_10968 .def_10969)))(let ((.def_11027 (bvand .def_10971 .def_11025)))(let ((.def_10967 (bvand .def_10964 .def_10965)))(let ((.def_11029 (bvor .def_10967 .def_11027)))(let ((.def_11030 (bvand .def_11025 .def_11029)))(let ((.def_10957 ((_ extract 1 1) id1)))(let ((.def_10961 (bvnot .def_10957)))(let ((.def_10956 ((_ extract 1 1) send3)))(let ((.def_10960 (bvnot .def_10956)))(let ((.def_10963 (bvand .def_10960 .def_10961)))(let ((.def_11032 (bvand .def_10963 .def_11030)))(let ((.def_10959 (bvand .def_10956 .def_10957)))(let ((.def_11034 (bvor .def_10959 .def_11032)))(let ((.def_11035 (bvand .def_11030 .def_11034)))(let ((.def_10949 ((_ extract 0 0) id1)))(let ((.def_10953 (bvnot .def_10949)))(let ((.def_10948 ((_ extract 0 0) send3)))(let ((.def_10952 (bvnot .def_10948)))(let ((.def_10955 (bvand .def_10952 .def_10953)))(let ((.def_11037 (bvand .def_10955 .def_11035)))(let ((.def_10951 (bvand .def_10948 .def_10949)))(let ((.def_11039 (bvor .def_10951 .def_11037)))(let ((.def_11040 (bvand .def_11035 .def_11039)))(let ((.def_11041 (= .def_11040 (_ bv0 1)))).def_11041)))))))))))))))))))))))))))))))))))))))))))))))))))))))))))))))))))
(assert (let ((.def_3577 ((_ sign_extend 24) id2)))(let ((.def_3562 ((_ sign_extend 24) send4)))(let ((.def_11043 (= .def_3562 .def_3577))).def_11043))))
(assert (let ((.def_3594 ((_ sign_extend 24) send3)))(let ((.def_3593 ((_ sign_extend 24) id4)))(let ((.def_11045 (bvslt .def_3593 .def_3594))).def_11045))))
(assert (let ((.def_3578 ((_ sign_extend 24) send1)))(let ((.def_3577 ((_ sign_extend 24) id2)))(let ((.def_11047 (bvslt .def_3577 .def_3578))).def_11047))))
(assert (let ((.def_3593 ((_ sign_extend 24) id4)))(let ((.def_3586 ((_ sign_extend 24) send2)))(let ((.def_11049 (= .def_3586 .def_3593))).def_11049))))
(assert (let ((.def_3578 ((_ sign_extend 24) send1)))(let ((.def_3564 ((_ sign_extend 24) id1)))(let ((.def_11051 (= .def_3564 .def_3578))).def_11051))))
(assert (let ((.def_3562 ((_ sign_extend 24) send4)))(let ((.def_3564 ((_ sign_extend 24) id1)))(let ((.def_11053 (bvslt .def_3564 .def_3562))).def_11053))))
(assert (let ((.def_11055 (= nomsg send3))).def_11055))
(assert (let ((.def_11057 (= nomsg send1))).def_11057))
(assert (let ((.def_3597 ((_ sign_extend 24) nomsg)))(let ((.def_3578 ((_ sign_extend 24) send1)))(let ((.def_11059 (= .def_3578 .def_3597))).def_11059))))
(assert (let ((.def_11061 (= st4 (_ bv1 8)))).def_11061))
(assert (let ((.def_3597 ((_ sign_extend 24) nomsg)))(let ((.def_3562 ((_ sign_extend 24) send4)))(let ((.def_11063 (= .def_3562 .def_3597))).def_11063))))
(assert (let ((.def_3624 ((_ sign_extend 24) p1_old)))(let ((.def_3585 ((_ sign_extend 24) id3)))(let ((.def_11065 (bvslt .def_3585 .def_3624))).def_11065))))
(assert (let ((.def_3624 ((_ sign_extend 24) p1_old)))(let ((.def_3585 ((_ sign_extend 24) id3)))(let ((.def_11067 (= .def_3585 .def_3624))).def_11067))))
(assert (let ((.def_3628 ((_ sign_extend 24) p2_old)))(let ((.def_3585 ((_ sign_extend 24) id3)))(let ((.def_11069 (bvslt .def_3585 .def_3628))).def_11069))))
(assert (let ((.def_3586 ((_ sign_extend 24) send2)))(let ((.def_11072 (= .def_3586 |node2::__CPAchecker_TMP_0|))).def_11072)))
(assert (let ((.def_11074 ((_ extract 7 0) |node2::__CPAchecker_TMP_0|)))(let ((.def_11075 (= p2_old .def_11074))).def_11075)))
(assert (let ((.def_3597 ((_ sign_extend 24) nomsg)))(let ((.def_3585 ((_ sign_extend 24) id3)))(let ((.def_11077 (= .def_3585 .def_3597))).def_11077))))
(assert (let ((.def_11079 (= send4 p4_old))).def_11079))
(assert (let ((.def_3632 ((_ sign_extend 24) p3_old)))(let ((.def_3564 ((_ sign_extend 24) id1)))(let ((.def_11081 (= .def_3564 .def_3632))).def_11081))))
(assert (let ((.def_3609 ((_ sign_extend 24) p4_old)))(let ((.def_3577 ((_ sign_extend 24) id2)))(let ((.def_11083 (= .def_3577 .def_3609))).def_11083))))
(assert (let ((.def_3632 ((_ sign_extend 24) p3_old)))(let ((.def_3593 ((_ sign_extend 24) id4)))(let ((.def_11085 (bvslt .def_3593 .def_3632))).def_11085))))
(assert (let ((.def_11087 (= send3 p3_old))).def_11087))
(assert (let ((.def_3594 ((_ sign_extend 24) send3)))(let ((.def_11090 (= .def_3594 |node3::__CPAchecker_TMP_0|))).def_11090)))
(assert (let ((.def_11092 ((_ extract 7 0) |node3::__CPAchecker_TMP_0|)))(let ((.def_11093 (= p3_old .def_11092))).def_11093)))
(assert (let ((.def_3624 ((_ sign_extend 24) p1_old)))(let ((.def_3577 ((_ sign_extend 24) id2)))(let ((.def_11095 (bvslt .def_3577 .def_3624))).def_11095))))
(assert (let ((.def_3628 ((_ sign_extend 24) p2_old)))(let ((.def_3593 ((_ sign_extend 24) id4)))(let ((.def_11097 (= .def_3593 .def_3628))).def_11097))))
(assert (let ((.def_3564 ((_ sign_extend 24) id1)))(let ((.def_11100 (= .def_3564 |node1::__CPAchecker_TMP_0|))).def_11100)))
(assert (let ((.def_3609 ((_ sign_extend 24) p4_old)))(let ((.def_3564 ((_ sign_extend 24) id1)))(let ((.def_11102 (bvslt .def_3564 .def_3609))).def_11102))))
(assert (let ((.def_3632 ((_ sign_extend 24) p3_old)))(let ((.def_3597 ((_ sign_extend 24) nomsg)))(let ((.def_11104 (= .def_3597 .def_3632))).def_11104))))
(assert (let ((.def_3624 ((_ sign_extend 24) p1_old)))(let ((.def_3597 ((_ sign_extend 24) nomsg)))(let ((.def_11106 (= .def_3597 .def_3624))).def_11106))))
(assert (let ((.def_3616 ((_ sign_extend 24) st1)))(let ((.def_3612 ((_ sign_extend 24) st4)))(let ((.def_11108 (= .def_3612 .def_3616))).def_11108))))
(assert (let ((.def_3609 ((_ sign_extend 24) p4_old)))(let ((.def_3597 ((_ sign_extend 24) nomsg)))(let ((.def_11110 (= .def_3597 .def_3609))).def_11110))))
(assert (let ((.def_3562 ((_ sign_extend 24) send4)))(let ((.def_11113 (= .def_3562 |node4::__CPAchecker_TMP_0|))).def_11113)))
(assert (let ((.def_11115 (= send4 send1))).def_11115))
(assert (let ((.def_11117 (= r1 (_ bv4 8)))).def_11117))
(assert (let ((.def_3578 ((_ sign_extend 24) send1)))(let ((.def_11119 (= .def_3578 |node1::__CPAchecker_TMP_0|))).def_11119)))
(assert (let ((.def_11121 (= r1 (_ bv1 8)))).def_11121))
(assert (let ((.def_3562 ((_ sign_extend 24) send4)))(let ((.def_3577 ((_ sign_extend 24) id2)))(let ((.def_146439 (bvslt .def_3577 .def_3562))).def_146439))))
(assert (let ((.def_3593 ((_ sign_extend 24) id4)))(let ((.def_3578 ((_ sign_extend 24) send1)))(let ((.def_146441 (= .def_3578 .def_3593))).def_146441))))
(assert (let ((.def_3586 ((_ sign_extend 24) send2)))(let ((.def_3593 ((_ sign_extend 24) id4)))(let ((.def_146443 (bvslt .def_3593 .def_3586))).def_146443))))
(assert (let ((.def_146445 (= nomsg (_ bv255 8)))).def_146445))
(assert (let ((.def_3593 ((_ sign_extend 24) id4)))(let ((.def_146447 ((_ extract 31 31) .def_3593)))(let ((.def_146448 (= .def_146447 (_ bv1 1)))).def_146448))))
(assert (let ((.def_3564 ((_ sign_extend 24) id1)))(let ((.def_146450 ((_ extract 31 31) .def_3564)))(let ((.def_146451 (= .def_146450 (_ bv1 1)))).def_146451))))
(assert (let ((.def_3577 ((_ sign_extend 24) id2)))(let ((.def_146453 ((_ extract 31 31) .def_3577)))(let ((.def_146454 (= .def_146453 (_ bv1 1)))).def_146454))))
(assert (let ((.def_3586 ((_ sign_extend 24) send2)))(let ((.def_3577 ((_ sign_extend 24) id2)))(let ((.def_146456 (= .def_3577 .def_3586))).def_146456))))
(assert (let ((.def_146458 (= st1 st2))).def_146458))
(assert (let ((.def_146460 (= st2 st3))).def_146460))
(assert (let ((.def_3586 ((_ sign_extend 24) send2)))(let ((.def_3564 ((_ sign_extend 24) id1)))(let ((.def_146462 (= .def_3564 .def_3586))).def_146462))))
(assert (let ((.def_3585 ((_ sign_extend 24) id3)))(let ((.def_146464 ((_ extract 31 31) .def_3585)))(let ((.def_146465 (= .def_146464 (_ bv1 1)))).def_146465))))
(assert (let ((.def_3594 ((_ sign_extend 24) send3)))(let ((.def_3564 ((_ sign_extend 24) id1)))(let ((.def_146467 (bvslt .def_3564 .def_3594))).def_146467))))
(assert (let ((.def_3594 ((_ sign_extend 24) send3)))(let ((.def_3564 ((_ sign_extend 24) id1)))(let ((.def_146469 (= .def_3564 .def_3594))).def_146469))))
(assert (let ((.def_3593 ((_ sign_extend 24) id4)))(let ((.def_3562 ((_ sign_extend 24) send4)))(let ((.def_146471 (= .def_3562 .def_3593))).def_146471))))
(assert (let ((.def_146473 (= send4 send2))).def_146473))
(assert (let ((.def_146475 (= send2 id4))).def_146475))
(assert (let ((.def_146477 (= nomsg send2))).def_146477))
(assert (let ((.def_3585 ((_ sign_extend 24) id3)))(let ((.def_3562 ((_ sign_extend 24) send4)))(let ((.def_146479 (= .def_3562 .def_3585))).def_146479))))
(assert (let ((.def_11092 ((_ extract 7 0) |node3::__CPAchecker_TMP_0|)))(let ((.def_146481 ((_ sign_extend 24) .def_11092)))(let ((.def_3593 ((_ sign_extend 24) id4)))(let ((.def_146482 (= .def_3593 .def_146481))).def_146482)))))
(assert (let ((.def_11092 ((_ extract 7 0) |node3::__CPAchecker_TMP_0|)))(let ((.def_146481 ((_ sign_extend 24) .def_11092)))(let ((.def_3593 ((_ sign_extend 24) id4)))(let ((.def_146484 (bvslt .def_3593 .def_146481))).def_146484)))))
(assert (let ((.def_3609 ((_ sign_extend 24) p4_old)))(let ((.def_3577 ((_ sign_extend 24) id2)))(let ((.def_146486 (bvslt .def_3577 .def_3609))).def_146486))))
(assert (let ((.def_3624 ((_ sign_extend 24) p1_old)))(let ((.def_3593 ((_ sign_extend 24) id4)))(let ((.def_146488 (= .def_3593 .def_3624))).def_146488))))
(assert (let ((.def_3628 ((_ sign_extend 24) p2_old)))(let ((.def_3593 ((_ sign_extend 24) id4)))(let ((.def_146490 (bvslt .def_3593 .def_3628))).def_146490))))
(assert (let ((.def_3609 ((_ sign_extend 24) p4_old)))(let ((.def_3562 ((_ sign_extend 24) send4)))(let ((.def_146492 (= .def_3562 .def_3609))).def_146492))))
(assert (let ((.def_3585 ((_ sign_extend 24) id3)))(let ((.def_146494 (= .def_3585 |node3::__CPAchecker_TMP_0|))).def_146494)))
(assert (let ((.def_146496 ((_ extract 7 0) |node4::__CPAchecker_TMP_0|)))(let ((.def_146497 (= p4_old .def_146496))).def_146497)))
(assert (let ((.def_146499 ((_ extract 7 0) |node1::__CPAchecker_TMP_0|)))(let ((.def_146500 (= p1_old .def_146499))).def_146500)))
(assert (let ((.def_3597 ((_ sign_extend 24) nomsg)))(let ((.def_146502 (= .def_3597 |node2::__CPAchecker_TMP_0|))).def_146502)))
(assert (let ((.def_3628 ((_ sign_extend 24) p2_old)))(let ((.def_3564 ((_ sign_extend 24) id1)))(let ((.def_146504 (= .def_3564 .def_3628))).def_146504))))
(assert (let ((.def_146506 (= id1 p2_old))).def_146506))
(assert (let ((.def_3628 ((_ sign_extend 24) p2_old)))(let ((.def_3597 ((_ sign_extend 24) nomsg)))(let ((.def_146508 (= .def_3597 .def_3628))).def_146508))))
(assert (let ((.def_3632 ((_ sign_extend 24) p3_old)))(let ((.def_3577 ((_ sign_extend 24) id2)))(let ((.def_146510 (= .def_3577 .def_3632))).def_146510))))
(assert (let ((.def_146514 ((_ extract 3 3) p3_old)))(let ((.def_146512 ((_ extract 3 3) id3)))(let ((.def_146513 (bvnot .def_146512)))(let ((.def_146516 (bvand .def_146513 .def_146514)))(let ((.def_146517 (= .def_146516 (_ bv0 1)))).def_146517))))))
(assert (let ((.def_146521 ((_ extract 2 2) p3_old)))(let ((.def_146519 ((_ extract 2 2) id3)))(let ((.def_146520 (bvnot .def_146519)))(let ((.def_146523 (bvand .def_146520 .def_146521)))(let ((.def_146524 (= .def_146523 (_ bv0 1)))).def_146524))))))
(assert (let ((.def_146528 ((_ extract 1 1) p3_old)))(let ((.def_146526 ((_ extract 1 1) id3)))(let ((.def_146527 (bvnot .def_146526)))(let ((.def_146530 (bvand .def_146527 .def_146528)))(let ((.def_146531 (= .def_146530 (_ bv0 1)))).def_146531))))))
(assert (let ((.def_146538 ((_ extract 0 0) p3_old)))(let ((.def_146534 ((_ extract 0 0) id3)))(let ((.def_146528 ((_ extract 1 1) p3_old)))(let ((.def_146526 ((_ extract 1 1) id3)))(let ((.def_146527 (bvnot .def_146526)))(let ((.def_146530 (bvand .def_146527 .def_146528)))(let ((.def_146533 (bvnot .def_146530)))(let ((.def_146536 (bvand .def_146533 .def_146534)))(let ((.def_146537 (bvnot .def_146536)))(let ((.def_146540 (bvand .def_146537 .def_146538)))(let ((.def_146541 (= .def_146540 (_ bv0 1)))).def_146541))))))))))))
(assert (let ((.def_146545 ((_ extract 4 4) p3_old)))(let ((.def_146543 ((_ extract 4 4) id3)))(let ((.def_146544 (bvnot .def_146543)))(let ((.def_146547 (bvand .def_146544 .def_146545)))(let ((.def_146548 (= .def_146547 (_ bv0 1)))).def_146548))))))
(assert (let ((.def_146552 ((_ extract 5 5) p3_old)))(let ((.def_146550 ((_ extract 5 5) id3)))(let ((.def_146551 (bvnot .def_146550)))(let ((.def_146554 (bvand .def_146551 .def_146552)))(let ((.def_146555 (= .def_146554 (_ bv0 1)))).def_146555))))))
(assert (let ((.def_146545 ((_ extract 4 4) p3_old)))(let ((.def_146543 ((_ extract 4 4) id3)))(let ((.def_146544 (bvnot .def_146543)))(let ((.def_146547 (bvand .def_146544 .def_146545)))(let ((.def_146565 (bvnot .def_146547)))(let ((.def_146514 ((_ extract 3 3) p3_old)))(let ((.def_146512 ((_ extract 3 3) id3)))(let ((.def_146513 (bvnot .def_146512)))(let ((.def_146516 (bvand .def_146513 .def_146514)))(let ((.def_146562 (bvnot .def_146516)))(let ((.def_146521 ((_ extract 2 2) p3_old)))(let ((.def_146519 ((_ extract 2 2) id3)))(let ((.def_146520 (bvnot .def_146519)))(let ((.def_146523 (bvand .def_146520 .def_146521)))(let ((.def_146559 (bvnot .def_146523)))(let ((.def_146538 ((_ extract 0 0) p3_old)))(let ((.def_146534 ((_ extract 0 0) id3)))(let ((.def_146528 ((_ extract 1 1) p3_old)))(let ((.def_146526 ((_ extract 1 1) id3)))(let ((.def_146527 (bvnot .def_146526)))(let ((.def_146530 (bvand .def_146527 .def_146528)))(let ((.def_146533 (bvnot .def_146530)))(let ((.def_146536 (bvand .def_146533 .def_146534)))(let ((.def_146537 (bvnot .def_146536)))(let ((.def_146540 (bvand .def_146537 .def_146538)))(let ((.def_146557 (bvnot .def_146540)))(let ((.def_146558 (bvand .def_146533 .def_146557)))(let ((.def_146561 (bvand .def_146558 .def_146559)))(let ((.def_146564 (bvand .def_146561 .def_146562)))(let ((.def_146567 (bvand .def_146564 .def_146565)))(let ((.def_146568 (= .def_146567 (_ bv1 1)))).def_146568))))))))))))))))))))))))))))))))
(assert (let ((.def_146552 ((_ extract 5 5) p3_old)))(let ((.def_146550 ((_ extract 5 5) id3)))(let ((.def_146551 (bvnot .def_146550)))(let ((.def_146554 (bvand .def_146551 .def_146552)))(let ((.def_146584 (bvnot .def_146554)))(let ((.def_146580 ((_ extract 7 7) id3)))(let ((.def_146581 (bvnot .def_146580)))(let ((.def_146576 ((_ extract 7 7) id4)))(let ((.def_146577 (bvnot .def_146576)))(let ((.def_146572 ((_ extract 6 6) p3_old)))(let ((.def_146570 ((_ extract 6 6) id3)))(let ((.def_146571 (bvnot .def_146570)))(let ((.def_146574 (bvand .def_146571 .def_146572)))(let ((.def_146575 (bvnot .def_146574)))(let ((.def_146579 (bvand .def_146575 .def_146577)))(let ((.def_146583 (bvand .def_146579 .def_146581)))(let ((.def_146586 (bvand .def_146583 .def_146584)))(let ((.def_146587 (= .def_146586 (_ bv1 1)))).def_146587)))))))))))))))))))
(assert (let ((.def_146580 ((_ extract 7 7) id3)))(let ((.def_146581 (bvnot .def_146580)))(let ((.def_146576 ((_ extract 7 7) id4)))(let ((.def_146577 (bvnot .def_146576)))(let ((.def_146572 ((_ extract 6 6) p3_old)))(let ((.def_146570 ((_ extract 6 6) id3)))(let ((.def_146571 (bvnot .def_146570)))(let ((.def_146574 (bvand .def_146571 .def_146572)))(let ((.def_146575 (bvnot .def_146574)))(let ((.def_146579 (bvand .def_146575 .def_146577)))(let ((.def_146583 (bvand .def_146579 .def_146581)))(let ((.def_146589 (= .def_146583 (_ bv1 1)))).def_146589)))))))))))))
(assert (let ((.def_146572 ((_ extract 6 6) p3_old)))(let ((.def_146570 ((_ extract 6 6) id3)))(let ((.def_146571 (bvnot .def_146570)))(let ((.def_146574 (bvand .def_146571 .def_146572)))(let ((.def_146591 (= .def_146574 (_ bv0 1)))).def_146591))))))
(assert (let ((.def_146552 ((_ extract 5 5) p3_old)))(let ((.def_146550 ((_ extract 5 5) id3)))(let ((.def_146551 (bvnot .def_146550)))(let ((.def_146554 (bvand .def_146551 .def_146552)))(let ((.def_146584 (bvnot .def_146554)))(let ((.def_146580 ((_ extract 7 7) id3)))(let ((.def_146581 (bvnot .def_146580)))(let ((.def_146576 ((_ extract 7 7) id4)))(let ((.def_146577 (bvnot .def_146576)))(let ((.def_146572 ((_ extract 6 6) p3_old)))(let ((.def_146570 ((_ extract 6 6) id3)))(let ((.def_146571 (bvnot .def_146570)))(let ((.def_146574 (bvand .def_146571 .def_146572)))(let ((.def_146575 (bvnot .def_146574)))(let ((.def_146579 (bvand .def_146575 .def_146577)))(let ((.def_146583 (bvand .def_146579 .def_146581)))(let ((.def_146586 (bvand .def_146583 .def_146584)))(let ((.def_146545 ((_ extract 4 4) p3_old)))(let ((.def_146543 ((_ extract 4 4) id3)))(let ((.def_146544 (bvnot .def_146543)))(let ((.def_146547 (bvand .def_146544 .def_146545)))(let ((.def_146565 (bvnot .def_146547)))(let ((.def_146514 ((_ extract 3 3) p3_old)))(let ((.def_146512 ((_ extract 3 3) id3)))(let ((.def_146513 (bvnot .def_146512)))(let ((.def_146516 (bvand .def_146513 .def_146514)))(let ((.def_146562 (bvnot .def_146516)))(let ((.def_146521 ((_ extract 2 2) p3_old)))(let ((.def_146519 ((_ extract 2 2) id3)))(let ((.def_146520 (bvnot .def_146519)))(let ((.def_146523 (bvand .def_146520 .def_146521)))(let ((.def_146559 (bvnot .def_146523)))(let ((.def_146538 ((_ extract 0 0) p3_old)))(let ((.def_146534 ((_ extract 0 0) id3)))(let ((.def_146528 ((_ extract 1 1) p3_old)))(let ((.def_146526 ((_ extract 1 1) id3)))(let ((.def_146527 (bvnot .def_146526)))(let ((.def_146530 (bvand .def_146527 .def_146528)))(let ((.def_146533 (bvnot .def_146530)))(let ((.def_146536 (bvand .def_146533 .def_146534)))(let ((.def_146537 (bvnot .def_146536)))(let ((.def_146540 (bvand .def_146537 .def_146538)))(let ((.def_146557 (bvnot .def_146540)))(let ((.def_146558 (bvand .def_146533 .def_146557)))(let ((.def_146561 (bvand .def_146558 .def_146559)))(let ((.def_146564 (bvand .def_146561 .def_146562)))(let ((.def_146567 (bvand .def_146564 .def_146565)))(let ((.def_146593 (bvand .def_146567 .def_146586)))(let ((.def_146594 (bvand .def_146584 .def_146593)))(let ((.def_146595 (bvand .def_146567 .def_146594)))(let ((.def_146596 (bvand .def_146586 .def_146595)))(let ((.def_146597 (bvand .def_146583 .def_146596)))(let ((.def_146598 (= .def_146597 (_ bv1 1)))).def_146598))))))))))))))))))))))))))))))))))))))))))))))))))))))
(assert (let ((.def_146576 ((_ extract 7 7) id4)))(let ((.def_146600 (= .def_146576 (_ bv0 1)))).def_146600)))
(assert (let ((.def_146580 ((_ extract 7 7) id3)))(let ((.def_146602 (= .def_146580 (_ bv0 1)))).def_146602)))
(assert (let ((.def_3632 ((_ sign_extend 24) p3_old)))(let ((.def_3585 ((_ sign_extend 24) id3)))(let ((.def_146604 (bvslt .def_3585 .def_3632))).def_146604))))
(assert (let ((.def_3632 ((_ sign_extend 24) p3_old)))(let ((.def_3628 ((_ sign_extend 24) p2_old)))(let ((.def_146606 (= .def_3628 .def_3632))).def_146606))))
(assert (let ((.def_146608 (= p2_old p3_old))).def_146608))
(assert (let ((.def_3632 ((_ sign_extend 24) p3_old)))(let ((.def_3564 ((_ sign_extend 24) id1)))(let ((.def_146610 (bvslt .def_3564 .def_3632))).def_146610))))
(assert (let ((.def_146612 (= send2 p4_old))).def_146612))
(assert (let ((.def_3593 ((_ sign_extend 24) id4)))(let ((.def_146614 (= .def_3593 |node2::__CPAchecker_TMP_0|))).def_146614)))
(assert (let ((.def_11074 ((_ extract 7 0) |node2::__CPAchecker_TMP_0|)))(let ((.def_146616 (= send2 .def_11074))).def_146616)))
(assert (let ((.def_3577 ((_ sign_extend 24) id2)))(let ((.def_146618 (= .def_3577 |node2::__CPAchecker_TMP_0|))).def_146618)))
(assert (let ((.def_146620 (= id4 p4_old))).def_146620))
(assert (let ((.def_3597 ((_ sign_extend 24) nomsg)))(let ((.def_3577 ((_ sign_extend 24) id2)))(let ((.def_146622 (= .def_3577 .def_3597))).def_146622))))
(assert (let ((.def_3632 ((_ sign_extend 24) p3_old)))(let ((.def_3577 ((_ sign_extend 24) id2)))(let ((.def_146624 (bvslt .def_3577 .def_3632))).def_146624))))
(assert (let ((.def_146635 ((_ extract 5 5) |node3::__CPAchecker_TMP_0|)))(let ((.def_146550 ((_ extract 5 5) id3)))(let ((.def_146707 (bvand .def_146550 .def_146635)))(let ((.def_146708 (bvnot .def_146707)))(let ((.def_146552 ((_ extract 5 5) p3_old)))(let ((.def_146709 (bvand .def_146552 .def_146708)))(let ((.def_146710 (bvnot .def_146709)))(let ((.def_146691 ((_ extract 4 4) |node3::__CPAchecker_TMP_0|)))(let ((.def_146545 ((_ extract 4 4) p3_old)))(let ((.def_146699 (bvor .def_146545 .def_146691)))(let ((.def_146543 ((_ extract 4 4) id3)))(let ((.def_146544 (bvnot .def_146543)))(let ((.def_146701 (bvand .def_146544 .def_146699)))(let ((.def_146702 (bvnot .def_146701)))(let ((.def_146692 (bvand .def_146543 .def_146691)))(let ((.def_146693 (bvnot .def_146692)))(let ((.def_146694 (bvand .def_146545 .def_146693)))(let ((.def_146695 (bvnot .def_146694)))(let ((.def_146677 ((_ extract 3 3) |node3::__CPAchecker_TMP_0|)))(let ((.def_146514 ((_ extract 3 3) p3_old)))(let ((.def_146685 (bvor .def_146514 .def_146677)))(let ((.def_146512 ((_ extract 3 3) id3)))(let ((.def_146513 (bvnot .def_146512)))(let ((.def_146687 (bvand .def_146513 .def_146685)))(let ((.def_146688 (bvnot .def_146687)))(let ((.def_146678 (bvand .def_146512 .def_146677)))(let ((.def_146679 (bvnot .def_146678)))(let ((.def_146680 (bvand .def_146514 .def_146679)))(let ((.def_146681 (bvnot .def_146680)))(let ((.def_146663 ((_ extract 2 2) |node3::__CPAchecker_TMP_0|)))(let ((.def_146521 ((_ extract 2 2) p3_old)))(let ((.def_146671 (bvor .def_146521 .def_146663)))(let ((.def_146519 ((_ extract 2 2) id3)))(let ((.def_146520 (bvnot .def_146519)))(let ((.def_146673 (bvand .def_146520 .def_146671)))(let ((.def_146674 (bvnot .def_146673)))(let ((.def_146664 (bvand .def_146519 .def_146663)))(let ((.def_146665 (bvnot .def_146664)))(let ((.def_146666 (bvand .def_146521 .def_146665)))(let ((.def_146667 (bvnot .def_146666)))(let ((.def_146656 ((_ extract 0 0) |node3::__CPAchecker_TMP_0|)))(let ((.def_146657 (bvnot .def_146656)))(let ((.def_146538 ((_ extract 0 0) p3_old)))(let ((.def_146653 (bvnot .def_146538)))(let ((.def_146643 ((_ extract 1 1) |node3::__CPAchecker_TMP_0|)))(let ((.def_146526 ((_ extract 1 1) id3)))(let ((.def_146649 (bvand .def_146526 .def_146643)))(let ((.def_146650 (bvnot .def_146649)))(let ((.def_146528 ((_ extract 1 1) p3_old)))(let ((.def_146651 (bvand .def_146528 .def_146650)))(let ((.def_146652 (bvnot .def_146651)))(let ((.def_146655 (bvand .def_146652 .def_146653)))(let ((.def_146659 (bvand .def_146655 .def_146657)))(let ((.def_146534 ((_ extract 0 0) id3)))(let ((.def_146660 (bvor .def_146534 .def_146659)))(let ((.def_146645 (bvor .def_146528 .def_146643)))(let ((.def_146527 (bvnot .def_146526)))(let ((.def_146647 (bvand .def_146527 .def_146645)))(let ((.def_146648 (bvnot .def_146647)))(let ((.def_146662 (bvand .def_146648 .def_146660)))(let ((.def_146669 (bvand .def_146662 .def_146667)))(let ((.def_146676 (bvand .def_146669 .def_146674)))(let ((.def_146683 (bvand .def_146676 .def_146681)))(let ((.def_146690 (bvand .def_146683 .def_146688)))(let ((.def_146697 (bvand .def_146690 .def_146695)))(let ((.def_146704 (bvand .def_146697 .def_146702)))(let ((.def_146637 (bvor .def_146552 .def_146635)))(let ((.def_146551 (bvnot .def_146550)))(let ((.def_146639 (bvand .def_146551 .def_146637)))(let ((.def_146640 (bvnot .def_146639)))(let ((.def_146626 ((_ extract 6 6) |node3::__CPAchecker_TMP_0|)))(let ((.def_146572 ((_ extract 6 6) p3_old)))(let ((.def_146628 (bvor .def_146572 .def_146626)))(let ((.def_146570 ((_ extract 6 6) id3)))(let ((.def_146571 (bvnot .def_146570)))(let ((.def_146630 (bvand .def_146571 .def_146628)))(let ((.def_146631 (bvnot .def_146630)))(let ((.def_146580 ((_ extract 7 7) id3)))(let ((.def_146581 (bvnot .def_146580)))(let ((.def_146632 (bvand .def_146581 .def_146631)))(let ((.def_146576 ((_ extract 7 7) id4)))(let ((.def_146577 (bvnot .def_146576)))(let ((.def_146633 (bvand .def_146577 .def_146632)))(let ((.def_146634 (bvand .def_146581 .def_146633)))(let ((.def_146642 (bvand .def_146634 .def_146640)))(let ((.def_146706 (bvand .def_146642 .def_146704)))(let ((.def_146712 (bvand .def_146706 .def_146710)))(let ((.def_146713 (bvand .def_146704 .def_146712)))(let ((.def_146714 (bvand .def_146642 .def_146713)))(let ((.def_146715 (bvand .def_146634 .def_146714)))(let ((.def_146716 (= .def_146715 (_ bv1 1)))).def_146716))))))))))))))))))))))))))))))))))))))))))))))))))))))))))))))))))))))))))))))))))))))))))))
(assert (let ((.def_146626 ((_ extract 6 6) |node3::__CPAchecker_TMP_0|)))(let ((.def_146572 ((_ extract 6 6) p3_old)))(let ((.def_146628 (bvor .def_146572 .def_146626)))(let ((.def_146570 ((_ extract 6 6) id3)))(let ((.def_146571 (bvnot .def_146570)))(let ((.def_146630 (bvand .def_146571 .def_146628)))(let ((.def_146631 (bvnot .def_146630)))(let ((.def_146580 ((_ extract 7 7) id3)))(let ((.def_146581 (bvnot .def_146580)))(let ((.def_146632 (bvand .def_146581 .def_146631)))(let ((.def_146576 ((_ extract 7 7) id4)))(let ((.def_146577 (bvnot .def_146576)))(let ((.def_146633 (bvand .def_146577 .def_146632)))(let ((.def_146634 (bvand .def_146581 .def_146633)))(let ((.def_146718 (= .def_146634 (_ bv1 1)))).def_146718))))))))))))))))
(assert (let ((.def_146635 ((_ extract 5 5) |node3::__CPAchecker_TMP_0|)))(let ((.def_146552 ((_ extract 5 5) p3_old)))(let ((.def_146637 (bvor .def_146552 .def_146635)))(let ((.def_146550 ((_ extract 5 5) id3)))(let ((.def_146551 (bvnot .def_146550)))(let ((.def_146639 (bvand .def_146551 .def_146637)))(let ((.def_146640 (bvnot .def_146639)))(let ((.def_146626 ((_ extract 6 6) |node3::__CPAchecker_TMP_0|)))(let ((.def_146572 ((_ extract 6 6) p3_old)))(let ((.def_146628 (bvor .def_146572 .def_146626)))(let ((.def_146570 ((_ extract 6 6) id3)))(let ((.def_146571 (bvnot .def_146570)))(let ((.def_146630 (bvand .def_146571 .def_146628)))(let ((.def_146631 (bvnot .def_146630)))(let ((.def_146580 ((_ extract 7 7) id3)))(let ((.def_146581 (bvnot .def_146580)))(let ((.def_146632 (bvand .def_146581 .def_146631)))(let ((.def_146576 ((_ extract 7 7) id4)))(let ((.def_146577 (bvnot .def_146576)))(let ((.def_146633 (bvand .def_146577 .def_146632)))(let ((.def_146634 (bvand .def_146581 .def_146633)))(let ((.def_146642 (bvand .def_146634 .def_146640)))(let ((.def_146720 (= .def_146642 (_ bv1 1)))).def_146720))))))))))))))))))))))))
(assert (let ((.def_146691 ((_ extract 4 4) |node3::__CPAchecker_TMP_0|)))(let ((.def_146545 ((_ extract 4 4) p3_old)))(let ((.def_146699 (bvor .def_146545 .def_146691)))(let ((.def_146543 ((_ extract 4 4) id3)))(let ((.def_146544 (bvnot .def_146543)))(let ((.def_146701 (bvand .def_146544 .def_146699)))(let ((.def_146702 (bvnot .def_146701)))(let ((.def_146692 (bvand .def_146543 .def_146691)))(let ((.def_146693 (bvnot .def_146692)))(let ((.def_146694 (bvand .def_146545 .def_146693)))(let ((.def_146695 (bvnot .def_146694)))(let ((.def_146677 ((_ extract 3 3) |node3::__CPAchecker_TMP_0|)))(let ((.def_146514 ((_ extract 3 3) p3_old)))(let ((.def_146685 (bvor .def_146514 .def_146677)))(let ((.def_146512 ((_ extract 3 3) id3)))(let ((.def_146513 (bvnot .def_146512)))(let ((.def_146687 (bvand .def_146513 .def_146685)))(let ((.def_146688 (bvnot .def_146687)))(let ((.def_146678 (bvand .def_146512 .def_146677)))(let ((.def_146679 (bvnot .def_146678)))(let ((.def_146680 (bvand .def_146514 .def_146679)))(let ((.def_146681 (bvnot .def_146680)))(let ((.def_146663 ((_ extract 2 2) |node3::__CPAchecker_TMP_0|)))(let ((.def_146521 ((_ extract 2 2) p3_old)))(let ((.def_146671 (bvor .def_146521 .def_146663)))(let ((.def_146519 ((_ extract 2 2) id3)))(let ((.def_146520 (bvnot .def_146519)))(let ((.def_146673 (bvand .def_146520 .def_146671)))(let ((.def_146674 (bvnot .def_146673)))(let ((.def_146664 (bvand .def_146519 .def_146663)))(let ((.def_146665 (bvnot .def_146664)))(let ((.def_146666 (bvand .def_146521 .def_146665)))(let ((.def_146667 (bvnot .def_146666)))(let ((.def_146656 ((_ extract 0 0) |node3::__CPAchecker_TMP_0|)))(let ((.def_146657 (bvnot .def_146656)))(let ((.def_146538 ((_ extract 0 0) p3_old)))(let ((.def_146653 (bvnot .def_146538)))(let ((.def_146643 ((_ extract 1 1) |node3::__CPAchecker_TMP_0|)))(let ((.def_146526 ((_ extract 1 1) id3)))(let ((.def_146649 (bvand .def_146526 .def_146643)))(let ((.def_146650 (bvnot .def_146649)))(let ((.def_146528 ((_ extract 1 1) p3_old)))(let ((.def_146651 (bvand .def_146528 .def_146650)))(let ((.def_146652 (bvnot .def_146651)))(let ((.def_146655 (bvand .def_146652 .def_146653)))(let ((.def_146659 (bvand .def_146655 .def_146657)))(let ((.def_146534 ((_ extract 0 0) id3)))(let ((.def_146660 (bvor .def_146534 .def_146659)))(let ((.def_146645 (bvor .def_146528 .def_146643)))(let ((.def_146527 (bvnot .def_146526)))(let ((.def_146647 (bvand .def_146527 .def_146645)))(let ((.def_146648 (bvnot .def_146647)))(let ((.def_146662 (bvand .def_146648 .def_146660)))(let ((.def_146669 (bvand .def_146662 .def_146667)))(let ((.def_146676 (bvand .def_146669 .def_146674)))(let ((.def_146683 (bvand .def_146676 .def_146681)))(let ((.def_146690 (bvand .def_146683 .def_146688)))(let ((.def_146697 (bvand .def_146690 .def_146695)))(let ((.def_146704 (bvand .def_146697 .def_146702)))(let ((.def_146722 (= .def_146704 (_ bv1 1)))).def_146722)))))))))))))))))))))))))))))))))))))))))))))))))))))))))))))
(assert (let ((.def_146626 ((_ extract 6 6) |node3::__CPAchecker_TMP_0|)))(let ((.def_146572 ((_ extract 6 6) p3_old)))(let ((.def_146628 (bvor .def_146572 .def_146626)))(let ((.def_146570 ((_ extract 6 6) id3)))(let ((.def_146571 (bvnot .def_146570)))(let ((.def_146630 (bvand .def_146571 .def_146628)))(let ((.def_146724 (= .def_146630 (_ bv0 1)))).def_146724))))))))
(assert (let ((.def_146635 ((_ extract 5 5) |node3::__CPAchecker_TMP_0|)))(let ((.def_146552 ((_ extract 5 5) p3_old)))(let ((.def_146637 (bvor .def_146552 .def_146635)))(let ((.def_146550 ((_ extract 5 5) id3)))(let ((.def_146551 (bvnot .def_146550)))(let ((.def_146639 (bvand .def_146551 .def_146637)))(let ((.def_146726 (= .def_146639 (_ bv0 1)))).def_146726))))))))
(assert (let ((.def_146691 ((_ extract 4 4) |node3::__CPAchecker_TMP_0|)))(let ((.def_146545 ((_ extract 4 4) p3_old)))(let ((.def_146699 (bvor .def_146545 .def_146691)))(let ((.def_146543 ((_ extract 4 4) id3)))(let ((.def_146544 (bvnot .def_146543)))(let ((.def_146701 (bvand .def_146544 .def_146699)))(let ((.def_146728 (= .def_146701 (_ bv0 1)))).def_146728))))))))
(assert (let ((.def_146677 ((_ extract 3 3) |node3::__CPAchecker_TMP_0|)))(let ((.def_146514 ((_ extract 3 3) p3_old)))(let ((.def_146685 (bvor .def_146514 .def_146677)))(let ((.def_146512 ((_ extract 3 3) id3)))(let ((.def_146513 (bvnot .def_146512)))(let ((.def_146687 (bvand .def_146513 .def_146685)))(let ((.def_146730 (= .def_146687 (_ bv0 1)))).def_146730))))))))
(assert (let ((.def_146663 ((_ extract 2 2) |node3::__CPAchecker_TMP_0|)))(let ((.def_146521 ((_ extract 2 2) p3_old)))(let ((.def_146671 (bvor .def_146521 .def_146663)))(let ((.def_146519 ((_ extract 2 2) id3)))(let ((.def_146520 (bvnot .def_146519)))(let ((.def_146673 (bvand .def_146520 .def_146671)))(let ((.def_146732 (= .def_146673 (_ bv0 1)))).def_146732))))))))
(assert (let ((.def_146643 ((_ extract 1 1) |node3::__CPAchecker_TMP_0|)))(let ((.def_146528 ((_ extract 1 1) p3_old)))(let ((.def_146645 (bvor .def_146528 .def_146643)))(let ((.def_146526 ((_ extract 1 1) id3)))(let ((.def_146527 (bvnot .def_146526)))(let ((.def_146647 (bvand .def_146527 .def_146645)))(let ((.def_146734 (= .def_146647 (_ bv0 1)))).def_146734))))))))
(assert (let ((.def_146656 ((_ extract 0 0) |node3::__CPAchecker_TMP_0|)))(let ((.def_146657 (bvnot .def_146656)))(let ((.def_146538 ((_ extract 0 0) p3_old)))(let ((.def_146653 (bvnot .def_146538)))(let ((.def_146643 ((_ extract 1 1) |node3::__CPAchecker_TMP_0|)))(let ((.def_146526 ((_ extract 1 1) id3)))(let ((.def_146649 (bvand .def_146526 .def_146643)))(let ((.def_146650 (bvnot .def_146649)))(let ((.def_146528 ((_ extract 1 1) p3_old)))(let ((.def_146651 (bvand .def_146528 .def_146650)))(let ((.def_146652 (bvnot .def_146651)))(let ((.def_146655 (bvand .def_146652 .def_146653)))(let ((.def_146659 (bvand .def_146655 .def_146657)))(let ((.def_146534 ((_ extract 0 0) id3)))(let ((.def_146660 (bvor .def_146534 .def_146659)))(let ((.def_146736 (= .def_146660 (_ bv1 1)))).def_146736)))))))))))))))))
(assert (let ((.def_146663 ((_ extract 2 2) |node3::__CPAchecker_TMP_0|)))(let ((.def_146519 ((_ extract 2 2) id3)))(let ((.def_146664 (bvand .def_146519 .def_146663)))(let ((.def_146665 (bvnot .def_146664)))(let ((.def_146521 ((_ extract 2 2) p3_old)))(let ((.def_146666 (bvand .def_146521 .def_146665)))(let ((.def_146738 (= .def_146666 (_ bv0 1)))).def_146738))))))))
(assert (let ((.def_146677 ((_ extract 3 3) |node3::__CPAchecker_TMP_0|)))(let ((.def_146512 ((_ extract 3 3) id3)))(let ((.def_146678 (bvand .def_146512 .def_146677)))(let ((.def_146679 (bvnot .def_146678)))(let ((.def_146514 ((_ extract 3 3) p3_old)))(let ((.def_146680 (bvand .def_146514 .def_146679)))(let ((.def_146740 (= .def_146680 (_ bv0 1)))).def_146740))))))))
(assert (let ((.def_146691 ((_ extract 4 4) |node3::__CPAchecker_TMP_0|)))(let ((.def_146543 ((_ extract 4 4) id3)))(let ((.def_146692 (bvand .def_146543 .def_146691)))(let ((.def_146693 (bvnot .def_146692)))(let ((.def_146545 ((_ extract 4 4) p3_old)))(let ((.def_146694 (bvand .def_146545 .def_146693)))(let ((.def_146742 (= .def_146694 (_ bv0 1)))).def_146742))))))))
(assert (let ((.def_146635 ((_ extract 5 5) |node3::__CPAchecker_TMP_0|)))(let ((.def_146550 ((_ extract 5 5) id3)))(let ((.def_146707 (bvand .def_146550 .def_146635)))(let ((.def_146708 (bvnot .def_146707)))(let ((.def_146552 ((_ extract 5 5) p3_old)))(let ((.def_146709 (bvand .def_146552 .def_146708)))(let ((.def_146744 (= .def_146709 (_ bv0 1)))).def_146744))))))))
(assert (let ((.def_146626 ((_ extract 6 6) |node3::__CPAchecker_TMP_0|)))(let ((.def_146570 ((_ extract 6 6) id3)))(let ((.def_146746 (bvand .def_146570 .def_146626)))(let ((.def_146747 (bvnot .def_146746)))(let ((.def_146572 ((_ extract 6 6) p3_old)))(let ((.def_146748 (bvand .def_146572 .def_146747)))(let ((.def_146749 (= .def_146748 (_ bv0 1)))).def_146749))))))))
(assert (let ((.def_3609 ((_ sign_extend 24) p4_old)))(let ((.def_3585 ((_ sign_extend 24) id3)))(let ((.def_146751 (= .def_3585 .def_3609))).def_146751))))
(assert (let ((.def_3578 ((_ sign_extend 24) send1)))(let ((.def_3562 ((_ sign_extend 24) send4)))(let ((.def_146753 (= .def_3562 .def_3578))).def_146753))))
(assert (let ((.def_146755 (= send2 send3))).def_146755))
(assert (let ((.def_146757 (= p2_new (_ bv255 8)))).def_146757))
(assert (let ((.def_3593 ((_ sign_extend 24) id4)))(let ((.def_3585 ((_ sign_extend 24) id3)))(let ((.def_146759 (= .def_3585 .def_3593))).def_146759))))
(assert (let ((.def_3614 ((_ sign_extend 24) st3)))(let ((.def_146761 (bvneg .def_3614)))(let ((.def_3616 ((_ sign_extend 24) st1)))(let ((.def_3615 ((_ sign_extend 24) st2)))(let ((.def_3618 (bvadd .def_3615 .def_3616)))(let ((.def_146762 (= .def_3618 .def_146761))).def_146762)))))))
(assert (let ((.def_3614 ((_ sign_extend 24) st3)))(let ((.def_146761 (bvneg .def_3614)))(let ((.def_3615 ((_ sign_extend 24) st2)))(let ((.def_146764 (= .def_3615 .def_146761))).def_146764)))))
(assert (let ((.def_146766 ((_ sign_extend 24) p2_new)))(let ((.def_3586 ((_ sign_extend 24) send2)))(let ((.def_146767 (= .def_3586 .def_146766))).def_146767))))
(assert (let ((.def_3597 ((_ sign_extend 24) nomsg)))(let ((.def_3593 ((_ sign_extend 24) id4)))(let ((.def_146769 (= .def_3593 .def_3597))).def_146769))))
(assert (let ((.def_3615 ((_ sign_extend 24) st2)))(let ((.def_146771 (bvneg .def_3615)))(let ((.def_3612 ((_ sign_extend 24) st4)))(let ((.def_146772 (bvadd .def_3612 .def_146771)))(let ((.def_146773 (= .def_146772 (_ bv1 32)))).def_146773))))))
(assert (let ((.def_146822 ((_ extract 6 6) id4)))(let ((.def_146570 ((_ extract 6 6) id3)))(let ((.def_146571 (bvnot .def_146570)))(let ((.def_146844 (bvand .def_146571 .def_146822)))(let ((.def_146845 (bvnot .def_146844)))(let ((.def_146818 ((_ extract 5 5) id4)))(let ((.def_146550 ((_ extract 5 5) id3)))(let ((.def_146551 (bvnot .def_146550)))(let ((.def_146833 (bvand .def_146551 .def_146818)))(let ((.def_146834 (bvnot .def_146833)))(let ((.def_146823 (bvnot .def_146822)))(let ((.def_146824 (bvand .def_146570 .def_146823)))(let ((.def_146576 ((_ extract 7 7) id4)))(let ((.def_146577 (bvnot .def_146576)))(let ((.def_146825 (bvand .def_146577 .def_146824)))(let ((.def_146580 ((_ extract 7 7) id3)))(let ((.def_146581 (bvnot .def_146580)))(let ((.def_146826 (bvand .def_146581 .def_146825)))(let ((.def_146827 (bvnot .def_146826)))(let ((.def_146819 (bvnot .def_146818)))(let ((.def_146820 (bvand .def_146550 .def_146819)))(let ((.def_146821 (bvnot .def_146820)))(let ((.def_146829 (bvand .def_146821 .def_146827)))(let ((.def_146805 ((_ extract 4 4) id4)))(let ((.def_146810 (bvnot .def_146805)))(let ((.def_146543 ((_ extract 4 4) id3)))(let ((.def_146811 (bvand .def_146543 .def_146810)))(let ((.def_146815 (bvnot .def_146811)))(let ((.def_146544 (bvnot .def_146543)))(let ((.def_146806 (bvand .def_146544 .def_146805)))(let ((.def_146807 (bvnot .def_146806)))(let ((.def_146796 ((_ extract 3 3) id4)))(let ((.def_146801 (bvnot .def_146796)))(let ((.def_146512 ((_ extract 3 3) id3)))(let ((.def_146802 (bvand .def_146512 .def_146801)))(let ((.def_146513 (bvnot .def_146512)))(let ((.def_146797 (bvand .def_146513 .def_146796)))(let ((.def_146798 (bvnot .def_146797)))(let ((.def_146787 ((_ extract 2 2) id4)))(let ((.def_146792 (bvnot .def_146787)))(let ((.def_146519 ((_ extract 2 2) id3)))(let ((.def_146793 (bvand .def_146519 .def_146792)))(let ((.def_146520 (bvnot .def_146519)))(let ((.def_146788 (bvand .def_146520 .def_146787)))(let ((.def_146789 (bvnot .def_146788)))(let ((.def_146775 ((_ extract 1 1) id4)))(let ((.def_146783 (bvnot .def_146775)))(let ((.def_146526 ((_ extract 1 1) id3)))(let ((.def_146784 (bvand .def_146526 .def_146783)))(let ((.def_146779 ((_ extract 0 0) id4)))(let ((.def_146780 (bvnot .def_146779)))(let ((.def_146527 (bvnot .def_146526)))(let ((.def_146776 (bvand .def_146527 .def_146775)))(let ((.def_146777 (bvnot .def_146776)))(let ((.def_146534 ((_ extract 0 0) id3)))(let ((.def_146778 (bvand .def_146534 .def_146777)))(let ((.def_146782 (bvand .def_146778 .def_146780)))(let ((.def_146786 (bvor .def_146782 .def_146784)))(let ((.def_146791 (bvand .def_146786 .def_146789)))(let ((.def_146795 (bvor .def_146791 .def_146793)))(let ((.def_146800 (bvand .def_146795 .def_146798)))(let ((.def_146804 (bvor .def_146800 .def_146802)))(let ((.def_146809 (bvand .def_146804 .def_146807)))(let ((.def_146814 (bvnot .def_146809)))(let ((.def_146817 (bvand .def_146814 .def_146815)))(let ((.def_146831 (bvand .def_146817 .def_146829)))(let ((.def_146832 (bvnot .def_146831)))(let ((.def_146836 (bvand .def_146832 .def_146834)))(let ((.def_146813 (bvor .def_146809 .def_146811)))(let ((.def_146838 (bvand .def_146813 .def_146836)))(let ((.def_146839 (bvnot .def_146838)))(let ((.def_146840 (bvand .def_146829 .def_146839)))(let ((.def_146841 (bvand .def_146827 .def_146840)))(let ((.def_146842 (bvnot .def_146841)))(let ((.def_146843 (bvand .def_146581 .def_146842)))(let ((.def_146847 (bvand .def_146843 .def_146845)))(let ((.def_146848 (bvand .def_146842 .def_146847)))(let ((.def_146849 (bvand .def_146577 .def_146848)))(let ((.def_146850 (bvor .def_146580 .def_146849)))(let ((.def_146851 (= .def_146850 (_ bv1 1)))).def_146851)))))))))))))))))))))))))))))))))))))))))))))))))))))))))))))))))))))))))))))))))
(assert (let ((.def_146853 (= send4 send3))).def_146853))
(assert (let ((.def_3594 ((_ sign_extend 24) send3)))(let ((.def_3577 ((_ sign_extend 24) id2)))(let ((.def_146855 (= .def_3577 .def_3594))).def_146855))))
(assert (let ((.def_3594 ((_ sign_extend 24) send3)))(let ((.def_3562 ((_ sign_extend 24) send4)))(let ((.def_146857 (= .def_3562 .def_3594))).def_146857))))
(assert (let ((.def_11092 ((_ extract 7 0) |node3::__CPAchecker_TMP_0|)))(let ((.def_146859 (= send3 .def_11092))).def_146859)))
(assert (let ((.def_146861 (= send1 send2))).def_146861))
(assert (let ((.def_3585 ((_ sign_extend 24) id3)))(let ((.def_3593 ((_ sign_extend 24) id4)))(let ((.def_146863 (bvslt .def_3593 .def_3585))).def_146863))))
(assert (let ((.def_3577 ((_ sign_extend 24) id2)))(let ((.def_3585 ((_ sign_extend 24) id3)))(let ((.def_146865 (bvslt .def_3585 .def_3577))).def_146865))))
(assert (let ((.def_146867 (= send1 id4))).def_146867))
(assert (let ((.def_3615 ((_ sign_extend 24) st2)))(let ((.def_3612 ((_ sign_extend 24) st4)))(let ((.def_3613 (bvneg .def_3612)))(let ((.def_146869 (= .def_3613 .def_3615))).def_146869)))))
(assert (let ((.def_146822 ((_ extract 6 6) id4)))(let ((.def_146570 ((_ extract 6 6) id3)))(let ((.def_146910 (bvor .def_146570 .def_146822)))(let ((.def_146818 ((_ extract 5 5) id4)))(let ((.def_146550 ((_ extract 5 5) id3)))(let ((.def_146897 (bvor .def_146550 .def_146818)))(let ((.def_146571 (bvnot .def_146570)))(let ((.def_146844 (bvand .def_146571 .def_146822)))(let ((.def_146845 (bvnot .def_146844)))(let ((.def_146580 ((_ extract 7 7) id3)))(let ((.def_146581 (bvnot .def_146580)))(let ((.def_146890 (bvand .def_146581 .def_146845)))(let ((.def_146576 ((_ extract 7 7) id4)))(let ((.def_146577 (bvnot .def_146576)))(let ((.def_146891 (bvand .def_146577 .def_146890)))(let ((.def_146892 (bvand .def_146581 .def_146891)))(let ((.def_146551 (bvnot .def_146550)))(let ((.def_146833 (bvand .def_146551 .def_146818)))(let ((.def_146834 (bvnot .def_146833)))(let ((.def_146894 (bvand .def_146834 .def_146892)))(let ((.def_146534 ((_ extract 0 0) id3)))(let ((.def_146875 (bvnot .def_146534)))(let ((.def_146775 ((_ extract 1 1) id4)))(let ((.def_146783 (bvnot .def_146775)))(let ((.def_146526 ((_ extract 1 1) id3)))(let ((.def_146784 (bvand .def_146526 .def_146783)))(let ((.def_146873 (bvnot .def_146784)))(let ((.def_146779 ((_ extract 0 0) id4)))(let ((.def_146874 (bvand .def_146779 .def_146873)))(let ((.def_146877 (bvand .def_146874 .def_146875)))(let ((.def_146527 (bvnot .def_146526)))(let ((.def_146776 (bvand .def_146527 .def_146775)))(let ((.def_146878 (bvor .def_146776 .def_146877)))(let ((.def_146787 ((_ extract 2 2) id4)))(let ((.def_146792 (bvnot .def_146787)))(let ((.def_146519 ((_ extract 2 2) id3)))(let ((.def_146793 (bvand .def_146519 .def_146792)))(let ((.def_146872 (bvnot .def_146793)))(let ((.def_146880 (bvand .def_146872 .def_146878)))(let ((.def_146520 (bvnot .def_146519)))(let ((.def_146788 (bvand .def_146520 .def_146787)))(let ((.def_146881 (bvor .def_146788 .def_146880)))(let ((.def_146796 ((_ extract 3 3) id4)))(let ((.def_146801 (bvnot .def_146796)))(let ((.def_146512 ((_ extract 3 3) id3)))(let ((.def_146802 (bvand .def_146512 .def_146801)))(let ((.def_146871 (bvnot .def_146802)))(let ((.def_146883 (bvand .def_146871 .def_146881)))(let ((.def_146513 (bvnot .def_146512)))(let ((.def_146797 (bvand .def_146513 .def_146796)))(let ((.def_146884 (bvor .def_146797 .def_146883)))(let ((.def_146805 ((_ extract 4 4) id4)))(let ((.def_146810 (bvnot .def_146805)))(let ((.def_146543 ((_ extract 4 4) id3)))(let ((.def_146811 (bvand .def_146543 .def_146810)))(let ((.def_146815 (bvnot .def_146811)))(let ((.def_146886 (bvand .def_146815 .def_146884)))(let ((.def_146544 (bvnot .def_146543)))(let ((.def_146806 (bvand .def_146544 .def_146805)))(let ((.def_146887 (bvor .def_146806 .def_146886)))(let ((.def_146888 (bvand .def_146818 .def_146887)))(let ((.def_146889 (bvnot .def_146888)))(let ((.def_146896 (bvand .def_146889 .def_146894)))(let ((.def_146899 (bvand .def_146896 .def_146897)))(let ((.def_146900 (bvnot .def_146899)))(let ((.def_146901 (bvand .def_146887 .def_146900)))(let ((.def_146902 (bvnot .def_146901)))(let ((.def_146903 (bvand .def_146894 .def_146902)))(let ((.def_146904 (bvand .def_146892 .def_146903)))(let ((.def_146905 (bvnot .def_146904)))(let ((.def_146906 (bvand .def_146822 .def_146905)))(let ((.def_146907 (bvnot .def_146906)))(let ((.def_146908 (bvand .def_146577 .def_146907)))(let ((.def_146909 (bvand .def_146581 .def_146908)))(let ((.def_146912 (bvand .def_146909 .def_146910)))(let ((.def_146913 (bvor .def_146904 .def_146912)))(let ((.def_146914 (bvand .def_146577 .def_146913)))(let ((.def_146915 (bvor .def_146580 .def_146914)))(let ((.def_146916 (= .def_146915 (_ bv1 1)))).def_146916))))))))))))))))))))))))))))))))))))))))))))))))))))))))))))))))))))))))))))))))
(assert (let ((.def_3615 ((_ sign_extend 24) st2)))(let ((.def_146771 (bvneg .def_3615)))(let ((.def_3616 ((_ sign_extend 24) st1)))(let ((.def_146918 (= .def_3616 .def_146771))).def_146918)))))
(assert (let ((.def_3616 ((_ sign_extend 24) st1)))(let ((.def_3615 ((_ sign_extend 24) st2)))(let ((.def_3618 (bvadd .def_3615 .def_3616)))(let ((.def_3612 ((_ sign_extend 24) st4)))(let ((.def_3613 (bvneg .def_3612)))(let ((.def_146920 (= .def_3613 .def_3618))).def_146920)))))))
(assert (let ((.def_3615 ((_ sign_extend 24) st2)))(let ((.def_146924 (bvadd (_ bv2 32) .def_3615)))(let ((.def_3612 ((_ sign_extend 24) st4)))(let ((.def_3613 (bvneg .def_3612)))(let ((.def_146925 (= .def_3613 .def_146924))).def_146925))))))
(assert (let ((.def_3612 ((_ sign_extend 24) st4)))(let ((.def_146928 (= .def_3612 (_ bv4294967293 32)))).def_146928)))
(assert (let ((.def_146930 (= send1 p4_old))).def_146930))
(assert (let ((.def_146932 (= send3 p2_old))).def_146932))
(assert (let ((.def_146934 (= p2_old (_ bv255 8)))).def_146934))
(assert (let ((.def_146936 (= send2 p2_old))).def_146936))
(assert (let ((.def_146938 (= send1 p1_old))).def_146938))
(assert (let ((.def_146940 (= p4_old p1_old))).def_146940))
(assert (let ((.def_3609 ((_ sign_extend 24) p4_old)))(let ((.def_146942 (= .def_3609 |node1::__CPAchecker_TMP_0|))).def_146942)))
(assert (let ((.def_146944 (= send4 p3_old))).def_146944))
(assert (let ((.def_3597 ((_ sign_extend 24) nomsg)))(let ((.def_3564 ((_ sign_extend 24) id1)))(let ((.def_146946 (= .def_3564 .def_3597))).def_146946))))
(assert (let ((.def_146496 ((_ extract 7 0) |node4::__CPAchecker_TMP_0|)))(let ((.def_146948 ((_ sign_extend 24) .def_146496)))(let ((.def_3564 ((_ sign_extend 24) id1)))(let ((.def_146949 (= .def_3564 .def_146948))).def_146949)))))
(assert (let ((.def_146499 ((_ extract 7 0) |node1::__CPAchecker_TMP_0|)))(let ((.def_146951 ((_ sign_extend 24) .def_146499)))(let ((.def_3577 ((_ sign_extend 24) id2)))(let ((.def_146952 (bvslt .def_3577 .def_146951))).def_146952)))))
(assert (let ((.def_146499 ((_ extract 7 0) |node1::__CPAchecker_TMP_0|)))(let ((.def_146954 (= send2 .def_146499))).def_146954)))
(assert (let ((.def_146499 ((_ extract 7 0) |node1::__CPAchecker_TMP_0|)))(let ((.def_146951 ((_ sign_extend 24) .def_146499)))(let ((.def_3577 ((_ sign_extend 24) id2)))(let ((.def_146956 (= .def_3577 .def_146951))).def_146956)))))
(assert (let ((.def_146958 ((_ sign_extend 24) p1_new)))(let ((.def_146959 (= |node1::__CPAchecker_TMP_0| .def_146958))).def_146959)))
(assert (let ((.def_146961 (= send3 (_ bv255 8)))).def_146961))
(assert (let ((.def_146963 (= st1 st3))).def_146963))
(assert (let ((.def_146965 (= r1 (_ bv5 8)))).def_146965))
(assert (let ((.def_6608 ((_ zero_extend 24) r1)))(let ((.def_146967 (bvadd (_ bv1 32) .def_6608)))(let ((.def_146968 ((_ extract 7 0) .def_146967)))(let ((.def_146969 ((_ zero_extend 24) .def_146968)))(let ((.def_146970 (bvslt .def_146969 (_ bv4 32)))).def_146970))))))
(assert (let ((.def_3615 ((_ sign_extend 24) st2)))(let ((.def_3612 ((_ sign_extend 24) st4)))(let ((.def_146972 (= .def_3612 .def_3615))).def_146972))))
(assert (let ((.def_3615 ((_ sign_extend 24) st2)))(let ((.def_146771 (bvneg .def_3615)))(let ((.def_3616 ((_ sign_extend 24) st1)))(let ((.def_3618 (bvadd .def_3615 .def_3616)))(let ((.def_3614 ((_ sign_extend 24) st3)))(let ((.def_3620 (bvadd .def_3614 .def_3618)))(let ((.def_146974 (= .def_3620 .def_146771))).def_146974))))))))
(assert (let ((.def_146976 ((_ sign_extend 24) p4_new)))(let ((.def_3564 ((_ sign_extend 24) id1)))(let ((.def_146977 (= .def_3564 .def_146976))).def_146977))))
(assert (let ((.def_146496 ((_ extract 7 0) |node4::__CPAchecker_TMP_0|)))(let ((.def_146979 (= send4 .def_146496))).def_146979)))
(assert (let ((.def_146499 ((_ extract 7 0) |node1::__CPAchecker_TMP_0|)))(let ((.def_146981 (= send1 .def_146499))).def_146981)))
(assert (let ((.def_146983 ((_ sign_extend 24) p3_new)))(let ((.def_3594 ((_ sign_extend 24) send3)))(let ((.def_146984 (= .def_3594 .def_146983))).def_146984))))
(assert (let ((.def_146976 ((_ sign_extend 24) p4_new)))(let ((.def_3562 ((_ sign_extend 24) send4)))(let ((.def_146986 (= .def_3562 .def_146976))).def_146986))))
(assert (let ((.def_146988 (= r1 (_ bv2 8)))).def_146988))
(assert (let ((.def_146990 (= send2 (_ bv255 8)))).def_146990))
(assert (let ((.def_146992 (= send2 p1_old))).def_146992))
(assert (let ((.def_3616 ((_ sign_extend 24) st1)))(let ((.def_3615 ((_ sign_extend 24) st2)))(let ((.def_3618 (bvadd .def_3615 .def_3616)))(let ((.def_146994 (bvadd (_ bv1 32) .def_3618)))(let ((.def_3612 ((_ sign_extend 24) st4)))(let ((.def_3613 (bvneg .def_3612)))(let ((.def_146995 (= .def_3613 .def_146994))).def_146995))))))))

assert N301:
(assert false)
(assert (let ((.def_1777 (= |assert::arg| (_ bv0 8)))).def_1777))

