(set-info :source |printed by MathSAT|)
(declare-fun a20 () (_ BitVec 32))
(declare-fun a25 () (_ BitVec 32))
(declare-fun a12 () (_ BitVec 32))
(declare-fun a15 () (_ BitVec 32))
(declare-fun a16 () (_ BitVec 32))
(declare-fun a2 () (_ BitVec 32))
(declare-fun a27 () (_ BitVec 32))
(declare-fun a9 () (_ BitVec 32))
(declare-fun m_pc () (_ BitVec 32))
(declare-fun t1_pc () (_ BitVec 32))
(declare-fun t2_pc () (_ BitVec 32))
(declare-fun t3_pc () (_ BitVec 32))
(declare-fun t4_pc () (_ BitVec 32))
(declare-fun t5_pc () (_ BitVec 32))
(declare-fun t6_pc () (_ BitVec 32))
(declare-fun t7_pc () (_ BitVec 32))
(declare-fun t8_pc () (_ BitVec 32))
(declare-fun t9_pc () (_ BitVec 32))
(declare-fun t10_pc () (_ BitVec 32))
(declare-fun t11_pc () (_ BitVec 32))
(declare-fun t12_pc () (_ BitVec 32))
(declare-fun t13_pc () (_ BitVec 32))
(declare-fun m_st () (_ BitVec 32))

*:
(assert (let ((.def_107733 (= a20 (_ bv5 32)))).def_107733))

calculate_output8 N30053:
(assert false)
(assert (let ((.def_107733 (= a20 (_ bv5 32)))).def_107733))

main1 N30136:
(assert (let ((.def_107733 (= a20 (_ bv5 32)))).def_107733))
(assert (let ((.def_155345 (= a25 (_ bv1 32)))).def_155345))
(assert (let ((.def_155348 (= a12 (_ bv4 32)))).def_155348))
(assert (let ((.def_155351 (= a15 (_ bv1 32)))).def_155351))
(assert (let ((.def_155354 (= a16 (_ bv1 32)))).def_155354))
(assert (let ((.def_155357 (= a2 (_ bv10 32)))).def_155357))
(assert (let ((.def_155360 (= a27 (_ bv1 32)))).def_155360))
(assert (let ((.def_155363 (= a9 (_ bv18 32)))).def_155363))
(assert (let ((.def_321528 (= a20 (_ bv6 32)))).def_321528))
(assert (let ((.def_321530 (= a12 (_ bv3 32)))).def_321530))
(assert (let ((.def_321532 (= a12 (_ bv6 32)))).def_321532))
(assert (let ((.def_321534 (= a2 (_ bv9 32)))).def_321534))
(assert (let ((.def_321536 (= a9 (_ bv16 32)))).def_321536))
(assert (let ((.def_321538 (= a2 (_ bv12 32)))).def_321538))
(assert (let ((.def_321540 (= a2 (_ bv11 32)))).def_321540))
(assert (let ((.def_321542 (= a9 (_ bv17 32)))).def_321542))
(assert (let ((.def_321544 (= a12 (_ bv2 32)))).def_321544))
(assert (let ((.def_321546 (= a2 (_ bv13 32)))).def_321546))

error N30154:
(assert false)
(assert (let ((.def_107733 (= a20 (_ bv5 32)))).def_107733))

eval N30936:
(assert (let ((.def_747935 (= m_pc (_ bv0 32)))).def_747935))
(assert (let ((.def_107733 (= a20 (_ bv5 32)))).def_107733))
(assert (let ((.def_762338 (= t1_pc (_ bv0 32)))).def_762338))
(assert (let ((.def_762341 (= t2_pc (_ bv0 32)))).def_762341))
(assert (let ((.def_762344 (= t3_pc (_ bv0 32)))).def_762344))
(assert (let ((.def_762347 (= t4_pc (_ bv0 32)))).def_762347))
(assert (let ((.def_762350 (= t5_pc (_ bv0 32)))).def_762350))
(assert (let ((.def_762353 (= t6_pc (_ bv0 32)))).def_762353))
(assert (let ((.def_762356 (= t7_pc (_ bv0 32)))).def_762356))
(assert (let ((.def_762359 (= t8_pc (_ bv0 32)))).def_762359))
(assert (let ((.def_762362 (= t9_pc (_ bv0 32)))).def_762362))
(assert (let ((.def_762365 (= t10_pc (_ bv0 32)))).def_762365))
(assert (let ((.def_762368 (= t11_pc (_ bv0 32)))).def_762368))
(assert (let ((.def_762371 (= t12_pc (_ bv0 32)))).def_762371))
(assert (let ((.def_762374 (= t13_pc (_ bv0 32)))).def_762374))
(assert (let ((.def_762376 (= m_pc (_ bv1 32)))).def_762376))
(assert (let ((.def_762378 (= t1_pc (_ bv1 32)))).def_762378))
(assert (let ((.def_762380 (= t2_pc (_ bv1 32)))).def_762380))
(assert (let ((.def_762382 (= t3_pc (_ bv1 32)))).def_762382))
(assert (let ((.def_762384 (= t4_pc (_ bv1 32)))).def_762384))
(assert (let ((.def_762386 (= t5_pc (_ bv1 32)))).def_762386))
(assert (let ((.def_762388 (= t6_pc (_ bv1 32)))).def_762388))
(assert (let ((.def_762390 (= t7_pc (_ bv1 32)))).def_762390))
(assert (let ((.def_762392 (= t8_pc (_ bv1 32)))).def_762392))
(assert (let ((.def_762394 (= t9_pc (_ bv1 32)))).def_762394))
(assert (let ((.def_762396 (= t10_pc (_ bv1 32)))).def_762396))
(assert (let ((.def_762398 (= t11_pc (_ bv1 32)))).def_762398))
(assert (let ((.def_762400 (= t12_pc (_ bv1 32)))).def_762400))
(assert (let ((.def_762402 (= t13_pc (_ bv1 32)))).def_762402))
(assert (let ((.def_762405 (= m_st (_ bv0 32)))).def_762405))

start_simulation N31578:
(assert (let ((.def_747935 (= m_pc (_ bv0 32)))).def_747935))
(assert (let ((.def_107733 (= a20 (_ bv5 32)))).def_107733))
(assert (let ((.def_762338 (= t1_pc (_ bv0 32)))).def_762338))
(assert (let ((.def_762341 (= t2_pc (_ bv0 32)))).def_762341))
(assert (let ((.def_762344 (= t3_pc (_ bv0 32)))).def_762344))
(assert (let ((.def_762347 (= t4_pc (_ bv0 32)))).def_762347))
(assert (let ((.def_762350 (= t5_pc (_ bv0 32)))).def_762350))
(assert (let ((.def_762353 (= t6_pc (_ bv0 32)))).def_762353))
(assert (let ((.def_762356 (= t7_pc (_ bv0 32)))).def_762356))
(assert (let ((.def_762359 (= t8_pc (_ bv0 32)))).def_762359))
(assert (let ((.def_762362 (= t9_pc (_ bv0 32)))).def_762362))
(assert (let ((.def_762365 (= t10_pc (_ bv0 32)))).def_762365))
(assert (let ((.def_762368 (= t11_pc (_ bv0 32)))).def_762368))
(assert (let ((.def_762371 (= t12_pc (_ bv0 32)))).def_762371))
(assert (let ((.def_762374 (= t13_pc (_ bv0 32)))).def_762374))
(assert (let ((.def_762376 (= m_pc (_ bv1 32)))).def_762376))
(assert (let ((.def_762378 (= t1_pc (_ bv1 32)))).def_762378))
(assert (let ((.def_762380 (= t2_pc (_ bv1 32)))).def_762380))
(assert (let ((.def_762382 (= t3_pc (_ bv1 32)))).def_762382))
(assert (let ((.def_762384 (= t4_pc (_ bv1 32)))).def_762384))
(assert (let ((.def_762386 (= t5_pc (_ bv1 32)))).def_762386))
(assert (let ((.def_762388 (= t6_pc (_ bv1 32)))).def_762388))
(assert (let ((.def_762390 (= t7_pc (_ bv1 32)))).def_762390))
(assert (let ((.def_762392 (= t8_pc (_ bv1 32)))).def_762392))
(assert (let ((.def_762394 (= t9_pc (_ bv1 32)))).def_762394))
(assert (let ((.def_762396 (= t10_pc (_ bv1 32)))).def_762396))
(assert (let ((.def_762398 (= t11_pc (_ bv1 32)))).def_762398))
(assert (let ((.def_762400 (= t12_pc (_ bv1 32)))).def_762400))
(assert (let ((.def_762402 (= t13_pc (_ bv1 32)))).def_762402))

