(set-info :source |printed by MathSAT|)
(declare-fun a20 () (_ BitVec 32))
(declare-fun a25 () (_ BitVec 32))
(declare-fun a12 () (_ BitVec 32))
(declare-fun a15 () (_ BitVec 32))
(declare-fun a16 () (_ BitVec 32))
(declare-fun a2 () (_ BitVec 32))
(declare-fun a27 () (_ BitVec 32))
(declare-fun a9 () (_ BitVec 32))
(declare-fun m_pc () (_ BitVec 32))
(declare-fun t1_pc () (_ BitVec 32))
(declare-fun t2_pc () (_ BitVec 32))
(declare-fun t3_pc () (_ BitVec 32))
(declare-fun t4_pc () (_ BitVec 32))
(declare-fun t5_pc () (_ BitVec 32))
(declare-fun t6_pc () (_ BitVec 32))
(declare-fun t7_pc () (_ BitVec 32))
(declare-fun t8_pc () (_ BitVec 32))
(declare-fun t9_pc () (_ BitVec 32))
(declare-fun m_st () (_ BitVec 32))
(declare-fun E_1 () (_ BitVec 32))
(declare-fun E_2 () (_ BitVec 32))
(declare-fun E_9 () (_ BitVec 32))
(declare-fun E_7 () (_ BitVec 32))
(declare-fun E_5 () (_ BitVec 32))
(declare-fun E_4 () (_ BitVec 32))
(declare-fun E_3 () (_ BitVec 32))
(declare-fun E_M () (_ BitVec 32))
(declare-fun E_8 () (_ BitVec 32))
(declare-fun E_6 () (_ BitVec 32))
(declare-fun t3_st () (_ BitVec 32))
(declare-fun t4_st () (_ BitVec 32))
(declare-fun t1_st () (_ BitVec 32))
(declare-fun t6_st () (_ BitVec 32))
(declare-fun t7_st () (_ BitVec 32))
(declare-fun t5_st () (_ BitVec 32))
(declare-fun t2_st () (_ BitVec 32))
(declare-fun t9_st () (_ BitVec 32))
(declare-fun t8_st () (_ BitVec 32))
(declare-fun local () (_ BitVec 32))
(declare-fun token () (_ BitVec 32))

*:
(assert (let ((.def_106661 (= a20 (_ bv5 32)))).def_106661))

calculate_output8 N29800:
(assert false)
(assert (let ((.def_106661 (= a20 (_ bv5 32)))).def_106661))

main1 N30136:
(assert (let ((.def_106661 (= a20 (_ bv5 32)))).def_106661))
(assert (let ((.def_153854 (= a25 (_ bv1 32)))).def_153854))
(assert (let ((.def_153857 (= a12 (_ bv4 32)))).def_153857))
(assert (let ((.def_153860 (= a15 (_ bv1 32)))).def_153860))
(assert (let ((.def_153863 (= a16 (_ bv1 32)))).def_153863))
(assert (let ((.def_153866 (= a2 (_ bv10 32)))).def_153866))
(assert (let ((.def_153869 (= a27 (_ bv1 32)))).def_153869))
(assert (let ((.def_153872 (= a9 (_ bv18 32)))).def_153872))
(assert (let ((.def_319734 (= a2 (_ bv11 32)))).def_319734))
(assert (let ((.def_319736 (= a12 (_ bv2 32)))).def_319736))
(assert (let ((.def_319738 (= a9 (_ bv17 32)))).def_319738))
(assert (let ((.def_319740 (= a2 (_ bv13 32)))).def_319740))
(assert (let ((.def_319742 (= a20 (_ bv6 32)))).def_319742))
(assert (let ((.def_319744 (= a12 (_ bv6 32)))).def_319744))
(assert (let ((.def_319746 (= a2 (_ bv9 32)))).def_319746))
(assert (let ((.def_319748 (= a9 (_ bv16 32)))).def_319748))
(assert (let ((.def_1108289 (= a12 (_ bv3 32)))).def_1108289))
(assert (let ((.def_1108291 (= a2 (_ bv12 32)))).def_1108291))
(assert (let ((.def_1108293 (= a12 (_ bv5 32)))).def_1108293))
(assert (let ((.def_1108295 (= a20 (_ bv7 32)))).def_1108295))

error N30154:
(assert false)
(assert (let ((.def_106661 (= a20 (_ bv5 32)))).def_106661))

eval N30720:
(assert (let ((.def_1250601 (= m_pc (_ bv0 32)))).def_1250601))
(assert (let ((.def_106661 (= a20 (_ bv5 32)))).def_106661))
(assert (let ((.def_1258353 (= t1_pc (_ bv0 32)))).def_1258353))
(assert (let ((.def_1258356 (= t2_pc (_ bv0 32)))).def_1258356))
(assert (let ((.def_1258359 (= t3_pc (_ bv0 32)))).def_1258359))
(assert (let ((.def_1258362 (= t4_pc (_ bv0 32)))).def_1258362))
(assert (let ((.def_1258365 (= t5_pc (_ bv0 32)))).def_1258365))
(assert (let ((.def_1258368 (= t6_pc (_ bv0 32)))).def_1258368))
(assert (let ((.def_1258371 (= t7_pc (_ bv0 32)))).def_1258371))
(assert (let ((.def_1258374 (= t8_pc (_ bv0 32)))).def_1258374))
(assert (let ((.def_1258377 (= t9_pc (_ bv0 32)))).def_1258377))
(assert (let ((.def_1258379 (= m_pc (_ bv1 32)))).def_1258379))
(assert (let ((.def_1258381 (= t1_pc (_ bv1 32)))).def_1258381))
(assert (let ((.def_1258383 (= t2_pc (_ bv1 32)))).def_1258383))
(assert (let ((.def_1258385 (= t3_pc (_ bv1 32)))).def_1258385))
(assert (let ((.def_1258387 (= t4_pc (_ bv1 32)))).def_1258387))
(assert (let ((.def_1258389 (= t5_pc (_ bv1 32)))).def_1258389))
(assert (let ((.def_1258391 (= t6_pc (_ bv1 32)))).def_1258391))
(assert (let ((.def_1258393 (= t7_pc (_ bv1 32)))).def_1258393))
(assert (let ((.def_1258395 (= t8_pc (_ bv1 32)))).def_1258395))
(assert (let ((.def_1258397 (= t9_pc (_ bv1 32)))).def_1258397))
(assert (let ((.def_1258400 (= m_st (_ bv0 32)))).def_1258400))
(assert (let ((.def_1287400 (= E_1 (_ bv1 32)))).def_1287400))
(assert (let ((.def_1287402 (= E_1 (_ bv2 32)))).def_1287402))
(assert (let ((.def_1287405 (= E_2 (_ bv1 32)))).def_1287405))
(assert (let ((.def_1287408 (= E_9 (_ bv1 32)))).def_1287408))
(assert (let ((.def_1287411 (= E_7 (_ bv1 32)))).def_1287411))
(assert (let ((.def_1287414 (= E_5 (_ bv1 32)))).def_1287414))
(assert (let ((.def_1287417 (= E_4 (_ bv1 32)))).def_1287417))
(assert (let ((.def_1287420 (= E_3 (_ bv1 32)))).def_1287420))
(assert (let ((.def_1287423 (= E_M (_ bv1 32)))).def_1287423))
(assert (let ((.def_1287426 (= E_8 (_ bv1 32)))).def_1287426))
(assert (let ((.def_1287429 (= E_6 (_ bv1 32)))).def_1287429))
(assert (let ((.def_1287432 (= t3_st (_ bv0 32)))).def_1287432))
(assert (let ((.def_1287435 (= t4_st (_ bv0 32)))).def_1287435))
(assert (let ((.def_1287438 (= t1_st (_ bv0 32)))).def_1287438))
(assert (let ((.def_1287441 (= t6_st (_ bv0 32)))).def_1287441))
(assert (let ((.def_1287444 (= t7_st (_ bv0 32)))).def_1287444))
(assert (let ((.def_1287447 (= t5_st (_ bv0 32)))).def_1287447))
(assert (let ((.def_1287450 (= t2_st (_ bv0 32)))).def_1287450))
(assert (let ((.def_1287453 (= t9_st (_ bv0 32)))).def_1287453))
(assert (let ((.def_1287456 (= t8_st (_ bv0 32)))).def_1287456))
(assert (let ((.def_1287459 (bvadd (_ bv9 32) local)))(let ((.def_1287461 (= .def_1287459 token))).def_1287461)))

start_simulation N31198:
(assert (let ((.def_1250601 (= m_pc (_ bv0 32)))).def_1250601))
(assert (let ((.def_106661 (= a20 (_ bv5 32)))).def_106661))
(assert (let ((.def_1258353 (= t1_pc (_ bv0 32)))).def_1258353))
(assert (let ((.def_1258356 (= t2_pc (_ bv0 32)))).def_1258356))
(assert (let ((.def_1258359 (= t3_pc (_ bv0 32)))).def_1258359))
(assert (let ((.def_1258362 (= t4_pc (_ bv0 32)))).def_1258362))
(assert (let ((.def_1258365 (= t5_pc (_ bv0 32)))).def_1258365))
(assert (let ((.def_1258368 (= t6_pc (_ bv0 32)))).def_1258368))
(assert (let ((.def_1258371 (= t7_pc (_ bv0 32)))).def_1258371))
(assert (let ((.def_1258374 (= t8_pc (_ bv0 32)))).def_1258374))
(assert (let ((.def_1258377 (= t9_pc (_ bv0 32)))).def_1258377))
(assert (let ((.def_1258379 (= m_pc (_ bv1 32)))).def_1258379))
(assert (let ((.def_1258381 (= t1_pc (_ bv1 32)))).def_1258381))
(assert (let ((.def_1258383 (= t2_pc (_ bv1 32)))).def_1258383))
(assert (let ((.def_1258385 (= t3_pc (_ bv1 32)))).def_1258385))
(assert (let ((.def_1258387 (= t4_pc (_ bv1 32)))).def_1258387))
(assert (let ((.def_1258389 (= t5_pc (_ bv1 32)))).def_1258389))
(assert (let ((.def_1258391 (= t6_pc (_ bv1 32)))).def_1258391))
(assert (let ((.def_1258393 (= t7_pc (_ bv1 32)))).def_1258393))
(assert (let ((.def_1258395 (= t8_pc (_ bv1 32)))).def_1258395))
(assert (let ((.def_1258397 (= t9_pc (_ bv1 32)))).def_1258397))
(assert (let ((.def_1287400 (= E_1 (_ bv1 32)))).def_1287400))
(assert (let ((.def_1287402 (= E_1 (_ bv2 32)))).def_1287402))
(assert (let ((.def_1287405 (= E_2 (_ bv1 32)))).def_1287405))
(assert (let ((.def_1287408 (= E_9 (_ bv1 32)))).def_1287408))
(assert (let ((.def_1287411 (= E_7 (_ bv1 32)))).def_1287411))
(assert (let ((.def_1287414 (= E_5 (_ bv1 32)))).def_1287414))
(assert (let ((.def_1287417 (= E_4 (_ bv1 32)))).def_1287417))
(assert (let ((.def_1287420 (= E_3 (_ bv1 32)))).def_1287420))
(assert (let ((.def_1287423 (= E_M (_ bv1 32)))).def_1287423))
(assert (let ((.def_1287426 (= E_8 (_ bv1 32)))).def_1287426))
(assert (let ((.def_1287429 (= E_6 (_ bv1 32)))).def_1287429))
(assert (let ((.def_1258400 (= m_st (_ bv0 32)))).def_1258400))

