(set-info :source |printed by MathSAT|)
(declare-fun a20 () (_ BitVec 32))
(declare-fun a25 () (_ BitVec 32))
(declare-fun a12 () (_ BitVec 32))
(declare-fun a15 () (_ BitVec 32))
(declare-fun a16 () (_ BitVec 32))
(declare-fun a2 () (_ BitVec 32))
(declare-fun a27 () (_ BitVec 32))
(declare-fun a9 () (_ BitVec 32))
(declare-fun m_pc () (_ BitVec 32))
(declare-fun t1_pc () (_ BitVec 32))
(declare-fun t2_pc () (_ BitVec 32))
(declare-fun t3_pc () (_ BitVec 32))
(declare-fun t4_pc () (_ BitVec 32))
(declare-fun t5_pc () (_ BitVec 32))
(declare-fun t6_pc () (_ BitVec 32))
(declare-fun t7_pc () (_ BitVec 32))
(declare-fun t8_pc () (_ BitVec 32))
(declare-fun t9_pc () (_ BitVec 32))
(declare-fun t10_pc () (_ BitVec 32))
(declare-fun m_st () (_ BitVec 32))

*:
(assert (let ((.def_107248 (= a20 (_ bv5 32)))).def_107248))

calculate_output8 N29943:
(assert false)
(assert (let ((.def_107248 (= a20 (_ bv5 32)))).def_107248))

main1 N30136:
(assert (let ((.def_107248 (= a20 (_ bv5 32)))).def_107248))
(assert (let ((.def_154635 (= a25 (_ bv1 32)))).def_154635))
(assert (let ((.def_154638 (= a12 (_ bv4 32)))).def_154638))
(assert (let ((.def_154641 (= a15 (_ bv1 32)))).def_154641))
(assert (let ((.def_154644 (= a16 (_ bv1 32)))).def_154644))
(assert (let ((.def_154647 (= a2 (_ bv10 32)))).def_154647))
(assert (let ((.def_154650 (= a27 (_ bv1 32)))).def_154650))
(assert (let ((.def_154653 (= a9 (_ bv18 32)))).def_154653))
(assert (let ((.def_593370 (= a20 (_ bv7 32)))).def_593370))
(assert (let ((.def_593372 (= a20 (_ bv6 32)))).def_593372))
(assert (let ((.def_593374 (= a12 (_ bv2 32)))).def_593374))
(assert (let ((.def_593376 (= a12 (_ bv5 32)))).def_593376))
(assert (let ((.def_593378 (= a12 (_ bv6 32)))).def_593378))
(assert (let ((.def_593380 (= a2 (_ bv9 32)))).def_593380))
(assert (let ((.def_593382 (= a9 (_ bv16 32)))).def_593382))
(assert (let ((.def_593384 (= a2 (_ bv11 32)))).def_593384))
(assert (let ((.def_593386 (= a2 (_ bv13 32)))).def_593386))
(assert (let ((.def_593388 (= a12 (_ bv3 32)))).def_593388))
(assert (let ((.def_593390 (= a2 (_ bv12 32)))).def_593390))
(assert (let ((.def_593392 (= a9 (_ bv17 32)))).def_593392))

error N30154:
(assert false)
(assert (let ((.def_107248 (= a20 (_ bv5 32)))).def_107248))

eval N30787:
(assert (let ((.def_930640 (= m_pc (_ bv0 32)))).def_930640))
(assert (let ((.def_107248 (= a20 (_ bv5 32)))).def_107248))
(assert (let ((.def_939904 (= t1_pc (_ bv0 32)))).def_939904))
(assert (let ((.def_939907 (= t2_pc (_ bv0 32)))).def_939907))
(assert (let ((.def_939910 (= t3_pc (_ bv0 32)))).def_939910))
(assert (let ((.def_939913 (= t4_pc (_ bv0 32)))).def_939913))
(assert (let ((.def_939916 (= t5_pc (_ bv0 32)))).def_939916))
(assert (let ((.def_939919 (= t6_pc (_ bv0 32)))).def_939919))
(assert (let ((.def_939922 (= t7_pc (_ bv0 32)))).def_939922))
(assert (let ((.def_939925 (= t8_pc (_ bv0 32)))).def_939925))
(assert (let ((.def_939928 (= t9_pc (_ bv0 32)))).def_939928))
(assert (let ((.def_939931 (= t10_pc (_ bv0 32)))).def_939931))
(assert (let ((.def_939933 (= m_pc (_ bv1 32)))).def_939933))
(assert (let ((.def_939935 (= t1_pc (_ bv1 32)))).def_939935))
(assert (let ((.def_939937 (= t2_pc (_ bv1 32)))).def_939937))
(assert (let ((.def_939939 (= t3_pc (_ bv1 32)))).def_939939))
(assert (let ((.def_939941 (= t4_pc (_ bv1 32)))).def_939941))
(assert (let ((.def_939943 (= t5_pc (_ bv1 32)))).def_939943))
(assert (let ((.def_939945 (= t6_pc (_ bv1 32)))).def_939945))
(assert (let ((.def_939947 (= t7_pc (_ bv1 32)))).def_939947))
(assert (let ((.def_939949 (= t8_pc (_ bv1 32)))).def_939949))
(assert (let ((.def_939951 (= t9_pc (_ bv1 32)))).def_939951))
(assert (let ((.def_939953 (= t10_pc (_ bv1 32)))).def_939953))
(assert (let ((.def_939956 (= m_st (_ bv0 32)))).def_939956))

start_simulation N31306:
(assert (let ((.def_930640 (= m_pc (_ bv0 32)))).def_930640))
(assert (let ((.def_107248 (= a20 (_ bv5 32)))).def_107248))
(assert (let ((.def_939904 (= t1_pc (_ bv0 32)))).def_939904))
(assert (let ((.def_939907 (= t2_pc (_ bv0 32)))).def_939907))
(assert (let ((.def_939910 (= t3_pc (_ bv0 32)))).def_939910))
(assert (let ((.def_939913 (= t4_pc (_ bv0 32)))).def_939913))
(assert (let ((.def_939916 (= t5_pc (_ bv0 32)))).def_939916))
(assert (let ((.def_939919 (= t6_pc (_ bv0 32)))).def_939919))
(assert (let ((.def_939922 (= t7_pc (_ bv0 32)))).def_939922))
(assert (let ((.def_939925 (= t8_pc (_ bv0 32)))).def_939925))
(assert (let ((.def_939928 (= t9_pc (_ bv0 32)))).def_939928))
(assert (let ((.def_939931 (= t10_pc (_ bv0 32)))).def_939931))
(assert (let ((.def_939933 (= m_pc (_ bv1 32)))).def_939933))
(assert (let ((.def_939935 (= t1_pc (_ bv1 32)))).def_939935))
(assert (let ((.def_939937 (= t2_pc (_ bv1 32)))).def_939937))
(assert (let ((.def_939939 (= t3_pc (_ bv1 32)))).def_939939))
(assert (let ((.def_939941 (= t4_pc (_ bv1 32)))).def_939941))
(assert (let ((.def_939943 (= t5_pc (_ bv1 32)))).def_939943))
(assert (let ((.def_939945 (= t6_pc (_ bv1 32)))).def_939945))
(assert (let ((.def_939947 (= t7_pc (_ bv1 32)))).def_939947))
(assert (let ((.def_939949 (= t8_pc (_ bv1 32)))).def_939949))
(assert (let ((.def_939951 (= t9_pc (_ bv1 32)))).def_939951))
(assert (let ((.def_939953 (= t10_pc (_ bv1 32)))).def_939953))

