(set-info :source |printed by MathSAT|)
(declare-fun a20 () (_ BitVec 32))
(declare-fun a25 () (_ BitVec 32))
(declare-fun a12 () (_ BitVec 32))
(declare-fun a15 () (_ BitVec 32))
(declare-fun a16 () (_ BitVec 32))
(declare-fun a2 () (_ BitVec 32))
(declare-fun a27 () (_ BitVec 32))
(declare-fun a9 () (_ BitVec 32))
(declare-fun m_pc () (_ BitVec 32))
(declare-fun t1_pc () (_ BitVec 32))
(declare-fun t2_pc () (_ BitVec 32))
(declare-fun t3_pc () (_ BitVec 32))
(declare-fun t4_pc () (_ BitVec 32))
(declare-fun t5_pc () (_ BitVec 32))
(declare-fun t6_pc () (_ BitVec 32))
(declare-fun m_st () (_ BitVec 32))
(declare-fun E_1 () (_ BitVec 32))
(declare-fun E_2 () (_ BitVec 32))
(declare-fun E_4 () (_ BitVec 32))
(declare-fun E_3 () (_ BitVec 32))
(declare-fun E_M () (_ BitVec 32))
(declare-fun E_5 () (_ BitVec 32))
(declare-fun E_6 () (_ BitVec 32))
(declare-fun t2_st () (_ BitVec 32))
(declare-fun t1_st () (_ BitVec 32))
(declare-fun t3_st () (_ BitVec 32))
(declare-fun t4_st () (_ BitVec 32))
(declare-fun t6_st () (_ BitVec 32))
(declare-fun t5_st () (_ BitVec 32))
(declare-fun local () (_ BitVec 32))
(declare-fun token () (_ BitVec 32))
(declare-fun T6_E () (_ BitVec 32))
(declare-fun T5_E () (_ BitVec 32))
(declare-fun T4_E () (_ BitVec 32))
(declare-fun T3_E () (_ BitVec 32))
(declare-fun T2_E () (_ BitVec 32))
(declare-fun T1_E () (_ BitVec 32))
(declare-fun M_E () (_ BitVec 32))

*:
(assert (let ((.def_107848 (= a20 (_ bv5 32)))).def_107848))

calculate_output8 N30108:
(assert false)
(assert (let ((.def_107848 (= a20 (_ bv5 32)))).def_107848))

main1 N30136:
(assert (let ((.def_107848 (= a20 (_ bv5 32)))).def_107848))
(assert (let ((.def_155566 (= a25 (_ bv1 32)))).def_155566))
(assert (let ((.def_155569 (= a12 (_ bv4 32)))).def_155569))
(assert (let ((.def_155572 (= a15 (_ bv1 32)))).def_155572))
(assert (let ((.def_155575 (= a16 (_ bv1 32)))).def_155575))
(assert (let ((.def_155578 (= a2 (_ bv10 32)))).def_155578))
(assert (let ((.def_155581 (= a27 (_ bv1 32)))).def_155581))
(assert (let ((.def_155584 (= a9 (_ bv18 32)))).def_155584))
(assert (let ((.def_321756 (= a12 (_ bv5 32)))).def_321756))
(assert (let ((.def_321758 (= a2 (_ bv13 32)))).def_321758))
(assert (let ((.def_321760 (= a12 (_ bv2 32)))).def_321760))
(assert (let ((.def_321762 (= a2 (_ bv12 32)))).def_321762))
(assert (let ((.def_321764 (= a12 (_ bv3 32)))).def_321764))
(assert (let ((.def_321766 (= a9 (_ bv16 32)))).def_321766))
(assert (let ((.def_321768 (= a20 (_ bv7 32)))).def_321768))
(assert (let ((.def_321770 (= a2 (_ bv9 32)))).def_321770))
(assert (let ((.def_321772 (= a9 (_ bv17 32)))).def_321772))

error N30154:
(assert false)
(assert (let ((.def_107848 (= a20 (_ bv5 32)))).def_107848))

eval N30558:
(assert (let ((.def_747022 (= m_pc (_ bv0 32)))).def_747022))
(assert (let ((.def_107848 (= a20 (_ bv5 32)))).def_107848))
(assert (let ((.def_751121 (= t1_pc (_ bv0 32)))).def_751121))
(assert (let ((.def_751124 (= t2_pc (_ bv0 32)))).def_751124))
(assert (let ((.def_751127 (= t3_pc (_ bv0 32)))).def_751127))
(assert (let ((.def_751130 (= t4_pc (_ bv0 32)))).def_751130))
(assert (let ((.def_751133 (= t5_pc (_ bv0 32)))).def_751133))
(assert (let ((.def_751136 (= t6_pc (_ bv0 32)))).def_751136))
(assert (let ((.def_751138 (= m_pc (_ bv1 32)))).def_751138))
(assert (let ((.def_751140 (= t1_pc (_ bv1 32)))).def_751140))
(assert (let ((.def_751142 (= t2_pc (_ bv1 32)))).def_751142))
(assert (let ((.def_751144 (= t3_pc (_ bv1 32)))).def_751144))
(assert (let ((.def_751146 (= t4_pc (_ bv1 32)))).def_751146))
(assert (let ((.def_751148 (= t5_pc (_ bv1 32)))).def_751148))
(assert (let ((.def_751150 (= t6_pc (_ bv1 32)))).def_751150))
(assert (let ((.def_751153 (= m_st (_ bv0 32)))).def_751153))
(assert (let ((.def_758242 (= E_1 (_ bv1 32)))).def_758242))
(assert (let ((.def_758245 (= E_2 (_ bv1 32)))).def_758245))
(assert (let ((.def_758248 (= E_4 (_ bv2 32)))).def_758248))
(assert (let ((.def_758250 (= E_4 (_ bv1 32)))).def_758250))
(assert (let ((.def_758253 (= E_3 (_ bv1 32)))).def_758253))
(assert (let ((.def_758256 (= E_M (_ bv1 32)))).def_758256))
(assert (let ((.def_758259 (= E_5 (_ bv1 32)))).def_758259))
(assert (let ((.def_758262 (= E_6 (_ bv1 32)))).def_758262))
(assert (let ((.def_758265 (= t2_st (_ bv0 32)))).def_758265))
(assert (let ((.def_758268 (= t1_st (_ bv0 32)))).def_758268))
(assert (let ((.def_758271 (= t3_st (_ bv0 32)))).def_758271))
(assert (let ((.def_758274 (= t4_st (_ bv0 32)))).def_758274))
(assert (let ((.def_758277 (= t6_st (_ bv0 32)))).def_758277))
(assert (let ((.def_758280 (= t5_st (_ bv0 32)))).def_758280))
(assert (let ((.def_758282 (= m_st (_ bv2 32)))).def_758282))
(assert (let ((.def_758285 (bvadd (_ bv6 32) local)))(let ((.def_758287 (= .def_758285 token))).def_758287)))
(assert (let ((.def_783519 (= E_5 (_ bv2 32)))).def_783519))
(assert (let ((.def_783521 (= local (_ bv0 32)))).def_783521))
(assert (let ((.def_783523 (= token (_ bv0 32)))).def_783523))
(assert (let ((.def_783525 (= E_2 (_ bv2 32)))).def_783525))
(assert (let ((.def_783527 (= t4_st (_ bv2 32)))).def_783527))
(assert (let ((.def_783529 (= t5_st (_ bv2 32)))).def_783529))
(assert (let ((.def_783531 (= t6_st (_ bv2 32)))).def_783531))
(assert (let ((.def_783533 (bvadd (_ bv5 32) local)))(let ((.def_783534 (= token .def_783533))).def_783534)))
(assert (let ((.def_783536 (= local token))).def_783536))
(assert (let ((.def_783538 (bvadd (_ bv4 32) local)))(let ((.def_783539 (= token .def_783538))).def_783539)))
(assert (let ((.def_783541 (bvadd (_ bv3 32) local)))(let ((.def_783542 (= token .def_783541))).def_783542)))
(assert (let ((.def_783544 (bvadd (_ bv2 32) local)))(let ((.def_783545 (= token .def_783544))).def_783545)))
(assert (let ((.def_783547 (bvadd (_ bv1 32) local)))(let ((.def_783548 (= token .def_783547))).def_783548)))
(assert (let ((.def_808549 (= T6_E (_ bv0 32)))).def_808549))
(assert (let ((.def_808552 (= T5_E (_ bv0 32)))).def_808552))
(assert (let ((.def_808555 (= T4_E (_ bv0 32)))).def_808555))
(assert (let ((.def_808558 (= T3_E (_ bv0 32)))).def_808558))
(assert (let ((.def_808561 (= T2_E (_ bv0 32)))).def_808561))
(assert (let ((.def_808564 (= T1_E (_ bv0 32)))).def_808564))
(assert (let ((.def_808566 (= E_M (_ bv0 32)))).def_808566))
(assert (let ((.def_808569 (= M_E (_ bv0 32)))).def_808569))
(assert (let ((.def_808571 (= E_1 (_ bv0 32)))).def_808571))
(assert (let ((.def_836386 (= E_4 (_ bv0 32)))).def_836386))
(assert (let ((.def_836388 (= E_5 (_ bv0 32)))).def_836388))
(assert (let ((.def_836390 (= E_3 (_ bv0 32)))).def_836390))
(assert (let ((.def_836392 (= E_2 (_ bv0 32)))).def_836392))
(assert (let ((.def_836394 (= E_6 (_ bv0 32)))).def_836394))
(assert false)

start_simulation N30913:
(assert (let ((.def_747022 (= m_pc (_ bv0 32)))).def_747022))
(assert (let ((.def_107848 (= a20 (_ bv5 32)))).def_107848))
(assert (let ((.def_751121 (= t1_pc (_ bv0 32)))).def_751121))
(assert (let ((.def_751124 (= t2_pc (_ bv0 32)))).def_751124))
(assert (let ((.def_751127 (= t3_pc (_ bv0 32)))).def_751127))
(assert (let ((.def_751130 (= t4_pc (_ bv0 32)))).def_751130))
(assert (let ((.def_751133 (= t5_pc (_ bv0 32)))).def_751133))
(assert (let ((.def_751136 (= t6_pc (_ bv0 32)))).def_751136))
(assert (let ((.def_751138 (= m_pc (_ bv1 32)))).def_751138))
(assert (let ((.def_751140 (= t1_pc (_ bv1 32)))).def_751140))
(assert (let ((.def_751142 (= t2_pc (_ bv1 32)))).def_751142))
(assert (let ((.def_751144 (= t3_pc (_ bv1 32)))).def_751144))
(assert (let ((.def_751146 (= t4_pc (_ bv1 32)))).def_751146))
(assert (let ((.def_751148 (= t5_pc (_ bv1 32)))).def_751148))
(assert (let ((.def_751150 (= t6_pc (_ bv1 32)))).def_751150))
(assert (let ((.def_758242 (= E_1 (_ bv1 32)))).def_758242))
(assert (let ((.def_758245 (= E_2 (_ bv1 32)))).def_758245))
(assert (let ((.def_758248 (= E_4 (_ bv2 32)))).def_758248))
(assert (let ((.def_758250 (= E_4 (_ bv1 32)))).def_758250))
(assert (let ((.def_758253 (= E_3 (_ bv1 32)))).def_758253))
(assert (let ((.def_758256 (= E_M (_ bv1 32)))).def_758256))
(assert (let ((.def_758259 (= E_5 (_ bv1 32)))).def_758259))
(assert (let ((.def_758262 (= E_6 (_ bv1 32)))).def_758262))
(assert (let ((.def_758265 (= t2_st (_ bv0 32)))).def_758265))
(assert (let ((.def_758268 (= t1_st (_ bv0 32)))).def_758268))
(assert (let ((.def_751153 (= m_st (_ bv0 32)))).def_751153))
(assert (let ((.def_783519 (= E_5 (_ bv2 32)))).def_783519))
(assert (let ((.def_783521 (= local (_ bv0 32)))).def_783521))
(assert (let ((.def_783523 (= token (_ bv0 32)))).def_783523))
(assert (let ((.def_783525 (= E_2 (_ bv2 32)))).def_783525))
(assert (let ((.def_758277 (= t6_st (_ bv0 32)))).def_758277))
(assert (let ((.def_808549 (= T6_E (_ bv0 32)))).def_808549))
(assert (let ((.def_808552 (= T5_E (_ bv0 32)))).def_808552))
(assert (let ((.def_808555 (= T4_E (_ bv0 32)))).def_808555))
(assert (let ((.def_808558 (= T3_E (_ bv0 32)))).def_808558))
(assert (let ((.def_808561 (= T2_E (_ bv0 32)))).def_808561))
(assert (let ((.def_808564 (= T1_E (_ bv0 32)))).def_808564))
(assert (let ((.def_808566 (= E_M (_ bv0 32)))).def_808566))
(assert (let ((.def_808569 (= M_E (_ bv0 32)))).def_808569))
(assert (let ((.def_758274 (= t4_st (_ bv0 32)))).def_758274))
(assert (let ((.def_758280 (= t5_st (_ bv0 32)))).def_758280))
(assert (let ((.def_836386 (= E_4 (_ bv0 32)))).def_836386))
(assert (let ((.def_836388 (= E_5 (_ bv0 32)))).def_836388))
(assert (let ((.def_836390 (= E_3 (_ bv0 32)))).def_836390))
(assert (let ((.def_836392 (= E_2 (_ bv0 32)))).def_836392))
(assert (let ((.def_836394 (= E_6 (_ bv0 32)))).def_836394))
(assert (let ((.def_808571 (= E_1 (_ bv0 32)))).def_808571))
(assert (let ((.def_758271 (= t3_st (_ bv0 32)))).def_758271))

