(set-info :source |printed by MathSAT|)
(declare-fun a20 () (_ BitVec 32))
(declare-fun a25 () (_ BitVec 32))
(declare-fun a12 () (_ BitVec 32))
(declare-fun a15 () (_ BitVec 32))
(declare-fun a16 () (_ BitVec 32))
(declare-fun a2 () (_ BitVec 32))
(declare-fun a27 () (_ BitVec 32))
(declare-fun a9 () (_ BitVec 32))
(declare-fun m_pc () (_ BitVec 32))
(declare-fun t1_pc () (_ BitVec 32))
(declare-fun t2_pc () (_ BitVec 32))
(declare-fun t3_pc () (_ BitVec 32))
(declare-fun m_st () (_ BitVec 32))

*:
(assert (let ((.def_107803 (= a20 (_ bv5 32)))).def_107803))

calculate_output8 N30108:
(assert false)
(assert (let ((.def_107803 (= a20 (_ bv5 32)))).def_107803))

main1 N30136:
(assert (let ((.def_107803 (= a20 (_ bv5 32)))).def_107803))
(assert (let ((.def_155506 (= a25 (_ bv1 32)))).def_155506))
(assert (let ((.def_155509 (= a12 (_ bv4 32)))).def_155509))
(assert (let ((.def_155512 (= a15 (_ bv1 32)))).def_155512))
(assert (let ((.def_155515 (= a16 (_ bv1 32)))).def_155515))
(assert (let ((.def_155518 (= a2 (_ bv10 32)))).def_155518))
(assert (let ((.def_155521 (= a27 (_ bv1 32)))).def_155521))
(assert (let ((.def_155524 (= a9 (_ bv18 32)))).def_155524))
(assert (let ((.def_321696 (= a12 (_ bv5 32)))).def_321696))
(assert (let ((.def_321698 (= a2 (_ bv13 32)))).def_321698))
(assert (let ((.def_321700 (= a12 (_ bv2 32)))).def_321700))
(assert (let ((.def_321702 (= a2 (_ bv12 32)))).def_321702))
(assert (let ((.def_321704 (= a12 (_ bv3 32)))).def_321704))
(assert (let ((.def_321706 (= a9 (_ bv16 32)))).def_321706))
(assert (let ((.def_321708 (= a20 (_ bv7 32)))).def_321708))
(assert (let ((.def_321710 (= a2 (_ bv9 32)))).def_321710))
(assert (let ((.def_321712 (= a9 (_ bv17 32)))).def_321712))

error N30154:
(assert false)
(assert (let ((.def_107803 (= a20 (_ bv5 32)))).def_107803))

eval N30409:
(assert (let ((.def_746629 (= m_pc (_ bv0 32)))).def_746629))
(assert (let ((.def_107803 (= a20 (_ bv5 32)))).def_107803))
(assert (let ((.def_748257 (= t1_pc (_ bv0 32)))).def_748257))
(assert (let ((.def_748260 (= t2_pc (_ bv0 32)))).def_748260))
(assert (let ((.def_748263 (= t3_pc (_ bv0 32)))).def_748263))
(assert (let ((.def_748265 (= m_pc (_ bv1 32)))).def_748265))
(assert (let ((.def_748267 (= t1_pc (_ bv1 32)))).def_748267))
(assert (let ((.def_748269 (= t2_pc (_ bv1 32)))).def_748269))
(assert (let ((.def_748271 (= t3_pc (_ bv1 32)))).def_748271))
(assert (let ((.def_748274 (= m_st (_ bv0 32)))).def_748274))

start_simulation N30641:
(assert (let ((.def_746629 (= m_pc (_ bv0 32)))).def_746629))
(assert (let ((.def_107803 (= a20 (_ bv5 32)))).def_107803))
(assert (let ((.def_748257 (= t1_pc (_ bv0 32)))).def_748257))
(assert (let ((.def_748260 (= t2_pc (_ bv0 32)))).def_748260))
(assert (let ((.def_748263 (= t3_pc (_ bv0 32)))).def_748263))
(assert (let ((.def_748265 (= m_pc (_ bv1 32)))).def_748265))
(assert (let ((.def_748267 (= t1_pc (_ bv1 32)))).def_748267))
(assert (let ((.def_748269 (= t2_pc (_ bv1 32)))).def_748269))
(assert (let ((.def_748271 (= t3_pc (_ bv1 32)))).def_748271))

