(set-info :source |printed by MathSAT|)
(declare-fun c_last_read () (_ BitVec 32))
(declare-fun p_last_write () (_ BitVec 32))
(declare-fun c_num_read () (_ BitVec 32))
(declare-fun p_num_write () (_ BitVec 32))
(declare-fun c_dr_pc () (_ BitVec 32))
(declare-fun q_free () (_ BitVec 32))
(declare-fun q_buf_0 () (_ BitVec 32))
(declare-fun p_dw_pc () (_ BitVec 32))
(declare-fun q_read_ev () (_ BitVec 32))
(declare-fun c_dr_st () (_ BitVec 32))
(declare-fun p_dw_st () (_ BitVec 32))
(declare-fun m_pc () (_ BitVec 32))
(declare-fun t1_pc () (_ BitVec 32))
(declare-fun t2_pc () (_ BitVec 32))
(declare-fun t3_pc () (_ BitVec 32))
(declare-fun t4_pc () (_ BitVec 32))
(declare-fun t5_pc () (_ BitVec 32))
(declare-fun m_st () (_ BitVec 32))
(declare-fun E_4 () (_ BitVec 32))
(declare-fun E_5 () (_ BitVec 32))
(declare-fun E_3 () (_ BitVec 32))
(declare-fun E_2 () (_ BitVec 32))
(declare-fun E_M () (_ BitVec 32))
(declare-fun t2_st () (_ BitVec 32))
(declare-fun t3_st () (_ BitVec 32))
(declare-fun t4_st () (_ BitVec 32))
(declare-fun t1_st () (_ BitVec 32))
(declare-fun t5_st () (_ BitVec 32))
(declare-fun local () (_ BitVec 32))
(declare-fun token () (_ BitVec 32))
(declare-fun E_1 () (_ BitVec 32))
(declare-fun T5_E () (_ BitVec 32))
(declare-fun T4_E () (_ BitVec 32))
(declare-fun T3_E () (_ BitVec 32))
(declare-fun T2_E () (_ BitVec 32))
(declare-fun T1_E () (_ BitVec 32))
(declare-fun M_E () (_ BitVec 32))

*:
(assert (let ((.def_570 (= c_last_read p_last_write))).def_570))
(assert (let ((.def_579 (= c_num_read p_num_write))).def_579))

error1 N4:
(assert false)
(assert (let ((.def_570 (= c_last_read p_last_write))).def_570))
(assert (let ((.def_579 (= c_num_read p_num_write))).def_579))

do_write_p N64:
(assert (let ((.def_914 (= c_dr_pc (_ bv0 32)))).def_914))
(assert (let ((.def_570 (= c_last_read p_last_write))).def_570))
(assert (let ((.def_579 (= c_num_read p_num_write))).def_579))
(assert (let ((.def_1017 (= q_free (_ bv1 32)))).def_1017))
(assert false)
(assert (let ((.def_1360 (= p_last_write q_buf_0))).def_1360))
(assert (let ((.def_1020 (= p_dw_pc (_ bv1 32)))).def_1020))
(assert (let ((.def_1549 (bvadd (_ bv1 32) c_num_read)))(let ((.def_1550 (= p_num_write .def_1549))).def_1550)))
(assert (let ((.def_2441 (= q_free (_ bv0 32)))).def_2441))
(assert (let ((.def_1552 (= c_dr_pc (_ bv1 32)))).def_1552))
(assert (let ((.def_5242 (= q_read_ev (_ bv1 32)))).def_5242))

do_read_c N100:
(assert (let ((.def_1020 (= p_dw_pc (_ bv1 32)))).def_1020))
(assert (let ((.def_1017 (= q_free (_ bv1 32)))).def_1017))
(assert (let ((.def_570 (= c_last_read p_last_write))).def_570))
(assert (let ((.def_579 (= c_num_read p_num_write))).def_579))
(assert (let ((.def_1360 (= p_last_write q_buf_0))).def_1360))
(assert (let ((.def_1549 (bvadd (_ bv1 32) c_num_read)))(let ((.def_1550 (= p_num_write .def_1549))).def_1550)))
(assert (let ((.def_1552 (= c_dr_pc (_ bv1 32)))).def_1552))
(assert false)

eval1 N170:
(assert (let ((.def_914 (= c_dr_pc (_ bv0 32)))).def_914))
(assert (let ((.def_570 (= c_last_read p_last_write))).def_570))
(assert (let ((.def_579 (= c_num_read p_num_write))).def_579))
(assert (let ((.def_1017 (= q_free (_ bv1 32)))).def_1017))
(assert (let ((.def_1290 (= p_dw_pc (_ bv0 32)))).def_1290))
(assert (let ((.def_1552 (= c_dr_pc (_ bv1 32)))).def_1552))
(assert (let ((.def_3864 (= c_dr_st (_ bv0 32)))).def_3864))
(assert (let ((.def_1020 (= p_dw_pc (_ bv1 32)))).def_1020))
(assert (let ((.def_5242 (= q_read_ev (_ bv1 32)))).def_5242))
(assert (let ((.def_5245 (= p_dw_st (_ bv0 32)))).def_5245))
(assert (let ((.def_1360 (= p_last_write q_buf_0))).def_1360))
(assert (let ((.def_1549 (bvadd (_ bv1 32) c_num_read)))(let ((.def_1550 (= p_num_write .def_1549))).def_1550)))

start_simulation1 N221:
(assert (let ((.def_914 (= c_dr_pc (_ bv0 32)))).def_914))
(assert (let ((.def_570 (= c_last_read p_last_write))).def_570))
(assert (let ((.def_579 (= c_num_read p_num_write))).def_579))
(assert (let ((.def_1017 (= q_free (_ bv1 32)))).def_1017))
(assert (let ((.def_1290 (= p_dw_pc (_ bv0 32)))).def_1290))
(assert (let ((.def_5242 (= q_read_ev (_ bv1 32)))).def_5242))

error2 N260:
(assert false)
(assert (let ((.def_570 (= c_last_read p_last_write))).def_570))
(assert (let ((.def_579 (= c_num_read p_num_write))).def_579))

eval2 N610:
(assert (let ((.def_7433 (= m_pc (_ bv0 32)))).def_7433))
(assert (let ((.def_570 (= c_last_read p_last_write))).def_570))
(assert (let ((.def_579 (= c_num_read p_num_write))).def_579))
(assert (let ((.def_10568 (= t1_pc (_ bv0 32)))).def_10568))
(assert (let ((.def_10571 (= t2_pc (_ bv0 32)))).def_10571))
(assert (let ((.def_10574 (= t3_pc (_ bv0 32)))).def_10574))
(assert (let ((.def_10577 (= t4_pc (_ bv0 32)))).def_10577))
(assert (let ((.def_10580 (= t5_pc (_ bv0 32)))).def_10580))
(assert (let ((.def_10582 (= m_pc (_ bv1 32)))).def_10582))
(assert (let ((.def_10584 (= t1_pc (_ bv1 32)))).def_10584))
(assert (let ((.def_10586 (= t2_pc (_ bv1 32)))).def_10586))
(assert (let ((.def_10588 (= t3_pc (_ bv1 32)))).def_10588))
(assert (let ((.def_10590 (= t4_pc (_ bv1 32)))).def_10590))
(assert (let ((.def_10592 (= t5_pc (_ bv1 32)))).def_10592))
(assert (let ((.def_10595 (= m_st (_ bv0 32)))).def_10595))
(assert (let ((.def_15308 (= E_4 (_ bv1 32)))).def_15308))
(assert (let ((.def_15311 (= E_5 (_ bv1 32)))).def_15311))
(assert (let ((.def_15314 (= E_3 (_ bv1 32)))).def_15314))
(assert (let ((.def_15317 (= E_2 (_ bv1 32)))).def_15317))
(assert (let ((.def_15320 (= E_M (_ bv1 32)))).def_15320))
(assert (let ((.def_15323 (= t2_st (_ bv0 32)))).def_15323))
(assert (let ((.def_15326 (= t3_st (_ bv0 32)))).def_15326))
(assert (let ((.def_15329 (= t4_st (_ bv0 32)))).def_15329))
(assert (let ((.def_15332 (= t1_st (_ bv0 32)))).def_15332))
(assert (let ((.def_15335 (= t5_st (_ bv0 32)))).def_15335))
(assert (let ((.def_15338 (bvadd (_ bv5 32) local)))(let ((.def_15340 (= .def_15338 token))).def_15340)))
(assert (let ((.def_27040 (= E_2 (_ bv2 32)))).def_27040))
(assert (let ((.def_27042 (= E_3 (_ bv2 32)))).def_27042))
(assert (let ((.def_27045 (= E_1 (_ bv1 32)))).def_27045))
(assert (let ((.def_27047 (= E_1 (_ bv2 32)))).def_27047))
(assert (let ((.def_27049 (= local token))).def_27049))
(assert (let ((.def_27051 (bvadd (_ bv1 32) local)))(let ((.def_27052 (= token .def_27051))).def_27052)))
(assert (let ((.def_27054 (= m_st (_ bv2 32)))).def_27054))
(assert (let ((.def_27056 (bvadd (_ bv2 32) local)))(let ((.def_27057 (= token .def_27056))).def_27057)))
(assert (let ((.def_27059 (bvadd (_ bv3 32) local)))(let ((.def_27060 (= token .def_27059))).def_27060)))
(assert (let ((.def_27062 (bvadd (_ bv4 32) local)))(let ((.def_27063 (= token .def_27062))).def_27063)))
(assert (let ((.def_37291 (= E_M (_ bv0 32)))).def_37291))
(assert (let ((.def_37293 (= E_2 (_ bv0 32)))).def_37293))
(assert (let ((.def_37295 (= E_1 (_ bv0 32)))).def_37295))
(assert (let ((.def_47402 (= E_5 (_ bv0 32)))).def_47402))
(assert (let ((.def_47404 (= E_3 (_ bv0 32)))).def_47404))
(assert (let ((.def_47407 (= T5_E (_ bv0 32)))).def_47407))
(assert (let ((.def_47410 (= T4_E (_ bv0 32)))).def_47410))
(assert (let ((.def_47413 (= T3_E (_ bv0 32)))).def_47413))
(assert (let ((.def_47416 (= T2_E (_ bv0 32)))).def_47416))
(assert (let ((.def_47419 (= T1_E (_ bv0 32)))).def_47419))
(assert (let ((.def_47421 (= E_4 (_ bv0 32)))).def_47421))
(assert (let ((.def_47424 (= M_E (_ bv0 32)))).def_47424))
(assert false)

start_simulation2 N924:
(assert (let ((.def_7433 (= m_pc (_ bv0 32)))).def_7433))
(assert (let ((.def_570 (= c_last_read p_last_write))).def_570))
(assert (let ((.def_579 (= c_num_read p_num_write))).def_579))
(assert (let ((.def_10568 (= t1_pc (_ bv0 32)))).def_10568))
(assert (let ((.def_10571 (= t2_pc (_ bv0 32)))).def_10571))
(assert (let ((.def_10574 (= t3_pc (_ bv0 32)))).def_10574))
(assert (let ((.def_10577 (= t4_pc (_ bv0 32)))).def_10577))
(assert (let ((.def_10580 (= t5_pc (_ bv0 32)))).def_10580))
(assert (let ((.def_10582 (= m_pc (_ bv1 32)))).def_10582))
(assert (let ((.def_10584 (= t1_pc (_ bv1 32)))).def_10584))
(assert (let ((.def_10586 (= t2_pc (_ bv1 32)))).def_10586))
(assert (let ((.def_10588 (= t3_pc (_ bv1 32)))).def_10588))
(assert (let ((.def_10590 (= t4_pc (_ bv1 32)))).def_10590))
(assert (let ((.def_10592 (= t5_pc (_ bv1 32)))).def_10592))
(assert (let ((.def_15308 (= E_4 (_ bv1 32)))).def_15308))
(assert (let ((.def_15311 (= E_5 (_ bv1 32)))).def_15311))
(assert (let ((.def_15314 (= E_3 (_ bv1 32)))).def_15314))
(assert (let ((.def_15317 (= E_2 (_ bv1 32)))).def_15317))
(assert (let ((.def_15320 (= E_M (_ bv1 32)))).def_15320))
(assert (let ((.def_10595 (= m_st (_ bv0 32)))).def_10595))
(assert (let ((.def_27040 (= E_2 (_ bv2 32)))).def_27040))
(assert (let ((.def_27042 (= E_3 (_ bv2 32)))).def_27042))
(assert (let ((.def_27045 (= E_1 (_ bv1 32)))).def_27045))
(assert (let ((.def_27047 (= E_1 (_ bv2 32)))).def_27047))
(assert (let ((.def_37291 (= E_M (_ bv0 32)))).def_37291))
(assert (let ((.def_37293 (= E_2 (_ bv0 32)))).def_37293))
(assert (let ((.def_47402 (= E_5 (_ bv0 32)))).def_47402))
(assert (let ((.def_15335 (= t5_st (_ bv0 32)))).def_15335))
(assert (let ((.def_15329 (= t4_st (_ bv0 32)))).def_15329))
(assert (let ((.def_15323 (= t2_st (_ bv0 32)))).def_15323))
(assert (let ((.def_15326 (= t3_st (_ bv0 32)))).def_15326))
(assert (let ((.def_15332 (= t1_st (_ bv0 32)))).def_15332))
(assert (let ((.def_47404 (= E_3 (_ bv0 32)))).def_47404))
(assert (let ((.def_47407 (= T5_E (_ bv0 32)))).def_47407))
(assert (let ((.def_47410 (= T4_E (_ bv0 32)))).def_47410))
(assert (let ((.def_47413 (= T3_E (_ bv0 32)))).def_47413))
(assert (let ((.def_47416 (= T2_E (_ bv0 32)))).def_47416))
(assert (let ((.def_47419 (= T1_E (_ bv0 32)))).def_47419))
(assert (let ((.def_47421 (= E_4 (_ bv0 32)))).def_47421))
(assert (let ((.def_47424 (= M_E (_ bv0 32)))).def_47424))

