(set-info :source |printed by MathSAT|)
(declare-fun |assert::arg| () (_ BitVec 8))
(declare-fun st1 () (_ BitVec 8))
(declare-fun st2 () (_ BitVec 8))
(declare-fun st3 () (_ BitVec 8))
(declare-fun st4 () (_ BitVec 8))
(declare-fun st5 () (_ BitVec 8))
(declare-fun st6 () (_ BitVec 8))
(declare-fun st7 () (_ BitVec 8))
(declare-fun st8 () (_ BitVec 8))
(declare-fun r1 () (_ BitVec 8))
(declare-fun p6_new () (_ BitVec 8))
(declare-fun nomsg () (_ BitVec 8))
(declare-fun p5_new () (_ BitVec 8))
(declare-fun p4_new () (_ BitVec 8))
(declare-fun p3_new () (_ BitVec 8))
(declare-fun p2_new () (_ BitVec 8))
(declare-fun p7_new () (_ BitVec 8))
(declare-fun mode1 () (_ BitVec 8))
(declare-fun mode2 () (_ BitVec 8))
(declare-fun mode3 () (_ BitVec 8))
(declare-fun mode4 () (_ BitVec 8))
(declare-fun mode5 () (_ BitVec 8))
(declare-fun mode6 () (_ BitVec 8))
(declare-fun mode7 () (_ BitVec 8))
(declare-fun mode8 () (_ BitVec 8))
(declare-fun send8 () (_ BitVec 8))
(declare-fun id1 () (_ BitVec 8))
(declare-fun id2 () (_ BitVec 8))
(declare-fun send1 () (_ BitVec 8))
(declare-fun id3 () (_ BitVec 8))
(declare-fun send2 () (_ BitVec 8))
(declare-fun p1_new () (_ BitVec 8))
(declare-fun id8 () (_ BitVec 8))
(declare-fun send7 () (_ BitVec 8))
(declare-fun id7 () (_ BitVec 8))
(declare-fun send6 () (_ BitVec 8))
(declare-fun id6 () (_ BitVec 8))
(declare-fun send5 () (_ BitVec 8))
(declare-fun id5 () (_ BitVec 8))
(declare-fun send4 () (_ BitVec 8))
(declare-fun id4 () (_ BitVec 8))
(declare-fun send3 () (_ BitVec 8))
(declare-fun p8_new () (_ BitVec 8))
(declare-fun p8_old () (_ BitVec 8))
(declare-fun p1_old () (_ BitVec 8))
(declare-fun p2_old () (_ BitVec 8))
(declare-fun p7_old () (_ BitVec 8))
(declare-fun p6_old () (_ BitVec 8))
(declare-fun p5_old () (_ BitVec 8))
(declare-fun p4_old () (_ BitVec 8))
(declare-fun p3_old () (_ BitVec 8))
(declare-fun |node7::__CPAchecker_TMP_0| () (_ BitVec 32))
(declare-fun |node3::__CPAchecker_TMP_0| () (_ BitVec 32))
(declare-fun |node2::__CPAchecker_TMP_0| () (_ BitVec 32))
(declare-fun |node1::__CPAchecker_TMP_0| () (_ BitVec 32))
(declare-fun |node8::__CPAchecker_TMP_0| () (_ BitVec 32))
(declare-fun |node5::__CPAchecker_TMP_0| () (_ BitVec 32))
(declare-fun |node4::__CPAchecker_TMP_0| () (_ BitVec 32))

assert:
(assert (let ((.def_3520 (= |assert::arg| (_ bv0 8)))).def_3520))

main1 N560:
(assert (let ((.def_3959 (= st1 (_ bv0 8)))).def_3959))
(assert (let ((.def_3962 (= st2 (_ bv0 8)))).def_3962))
(assert (let ((.def_3965 (= st3 (_ bv0 8)))).def_3965))
(assert (let ((.def_3968 (= st4 (_ bv0 8)))).def_3968))
(assert (let ((.def_3971 (= st5 (_ bv0 8)))).def_3971))
(assert (let ((.def_3974 (= st6 (_ bv0 8)))).def_3974))
(assert (let ((.def_3977 (= st7 (_ bv0 8)))).def_3977))
(assert (let ((.def_3980 (= st8 (_ bv0 8)))).def_3980))
(assert (let ((.def_3983 (= r1 (_ bv0 8)))).def_3983))
(assert (let ((.def_3987 (= p6_new nomsg))).def_3987))
(assert (let ((.def_3990 (= nomsg p5_new))).def_3990))
(assert (let ((.def_3993 (= nomsg p4_new))).def_3993))
(assert (let ((.def_3996 (= nomsg p3_new))).def_3996))
(assert (let ((.def_3999 (= nomsg p2_new))).def_3999))
(assert (let ((.def_4002 (= nomsg p7_new))).def_4002))
(assert (let ((.def_4005 (= mode1 (_ bv0 8)))).def_4005))
(assert (let ((.def_4008 (= mode2 (_ bv0 8)))).def_4008))
(assert (let ((.def_4011 (= mode3 (_ bv0 8)))).def_4011))
(assert (let ((.def_4014 (= mode4 (_ bv0 8)))).def_4014))
(assert (let ((.def_4017 (= mode5 (_ bv0 8)))).def_4017))
(assert (let ((.def_4020 (= mode6 (_ bv0 8)))).def_4020))
(assert (let ((.def_4023 (= mode7 (_ bv0 8)))).def_4023))
(assert (let ((.def_4026 (= mode8 (_ bv0 8)))).def_4026))
(assert (let ((.def_6939 (= st1 st8))).def_6939))
(assert (let ((.def_6941 (= st2 st8))).def_6941))
(assert (let ((.def_6943 (= st3 st8))).def_6943))
(assert (let ((.def_6945 (= st4 st8))).def_6945))
(assert (let ((.def_6947 (= st5 st8))).def_6947))
(assert (let ((.def_6949 (= st6 st8))).def_6949))
(assert (let ((.def_6951 (= st7 st8))).def_6951))
(assert (let ((.def_6956 ((_ sign_extend 24) id1)))(let ((.def_6954 ((_ sign_extend 24) send8)))(let ((.def_6957 (= .def_6954 .def_6956))).def_6957))))
(assert (let ((.def_6962 ((_ sign_extend 24) send1)))(let ((.def_6960 ((_ sign_extend 24) id2)))(let ((.def_6963 (= .def_6960 .def_6962))).def_6963))))
(assert (let ((.def_6967 (= id3 send2))).def_6967))
(assert (let ((.def_6970 ((_ sign_extend 24) send2)))(let ((.def_6969 ((_ sign_extend 24) id3)))(let ((.def_6971 (= .def_6969 .def_6970))).def_6971))))
(assert (let ((.def_6974 (= nomsg p1_new))).def_6974))
(assert (let ((.def_6979 ((_ sign_extend 24) send7)))(let ((.def_6977 ((_ sign_extend 24) id8)))(let ((.def_6980 (= .def_6977 .def_6979))).def_6980))))
(assert (let ((.def_6984 (= id7 send6))).def_6984))
(assert (let ((.def_6987 ((_ sign_extend 24) send6)))(let ((.def_6986 ((_ sign_extend 24) id7)))(let ((.def_6988 (= .def_6986 .def_6987))).def_6988))))
(assert (let ((.def_6992 (= id6 send5))).def_6992))
(assert (let ((.def_6995 ((_ sign_extend 24) send5)))(let ((.def_6994 ((_ sign_extend 24) id6)))(let ((.def_6996 (= .def_6994 .def_6995))).def_6996))))
(assert (let ((.def_7001 ((_ sign_extend 24) send4)))(let ((.def_6999 ((_ sign_extend 24) id5)))(let ((.def_7002 (= .def_6999 .def_7001))).def_7002))))
(assert (let ((.def_7006 (= id4 send3))).def_7006))
(assert (let ((.def_7009 ((_ sign_extend 24) send3)))(let ((.def_7008 ((_ sign_extend 24) id4)))(let ((.def_7010 (= .def_7008 .def_7009))).def_7010))))
(assert (let ((.def_7013 (= nomsg p8_new))).def_7013))
(assert (let ((.def_7015 ((_ sign_extend 24) nomsg)))(let ((.def_7001 ((_ sign_extend 24) send4)))(let ((.def_7016 (= .def_7001 .def_7015))).def_7016))))
(assert (let ((.def_7015 ((_ sign_extend 24) nomsg)))(let ((.def_6995 ((_ sign_extend 24) send5)))(let ((.def_7018 (= .def_6995 .def_7015))).def_7018))))
(assert (let ((.def_7015 ((_ sign_extend 24) nomsg)))(let ((.def_6987 ((_ sign_extend 24) send6)))(let ((.def_7020 (= .def_6987 .def_7015))).def_7020))))
(assert (let ((.def_7015 ((_ sign_extend 24) nomsg)))(let ((.def_6979 ((_ sign_extend 24) send7)))(let ((.def_7022 (= .def_6979 .def_7015))).def_7022))))
(assert (let ((.def_7032 ((_ sign_extend 24) st1)))(let ((.def_7031 ((_ sign_extend 24) st2)))(let ((.def_7034 (bvadd .def_7031 .def_7032)))(let ((.def_7030 ((_ sign_extend 24) st3)))(let ((.def_7036 (bvadd .def_7030 .def_7034)))(let ((.def_7029 ((_ sign_extend 24) st4)))(let ((.def_7038 (bvadd .def_7029 .def_7036)))(let ((.def_7028 ((_ sign_extend 24) st5)))(let ((.def_7040 (bvadd .def_7028 .def_7038)))(let ((.def_7027 ((_ sign_extend 24) st6)))(let ((.def_7042 (bvadd .def_7027 .def_7040)))(let ((.def_7026 ((_ sign_extend 24) st7)))(let ((.def_7044 (bvadd .def_7026 .def_7042)))(let ((.def_7024 ((_ sign_extend 24) st8)))(let ((.def_7025 (bvneg .def_7024)))(let ((.def_7045 (= .def_7025 .def_7044))).def_7045)))))))))))))))))
(assert (let ((.def_7048 ((_ sign_extend 24) p8_old)))(let ((.def_6956 ((_ sign_extend 24) id1)))(let ((.def_7049 (= .def_6956 .def_7048))).def_7049))))
(assert (let ((.def_7052 ((_ sign_extend 24) p1_old)))(let ((.def_6960 ((_ sign_extend 24) id2)))(let ((.def_7053 (= .def_6960 .def_7052))).def_7053))))
(assert (let ((.def_7056 ((_ sign_extend 24) p2_old)))(let ((.def_6969 ((_ sign_extend 24) id3)))(let ((.def_7057 (= .def_6969 .def_7056))).def_7057))))
(assert (let ((.def_7060 ((_ sign_extend 24) p7_old)))(let ((.def_6977 ((_ sign_extend 24) id8)))(let ((.def_7061 (= .def_6977 .def_7060))).def_7061))))
(assert (let ((.def_7064 ((_ sign_extend 24) p6_old)))(let ((.def_6986 ((_ sign_extend 24) id7)))(let ((.def_7065 (= .def_6986 .def_7064))).def_7065))))
(assert (let ((.def_7068 ((_ sign_extend 24) p5_old)))(let ((.def_6994 ((_ sign_extend 24) id6)))(let ((.def_7069 (= .def_6994 .def_7068))).def_7069))))
(assert (let ((.def_7072 ((_ sign_extend 24) p4_old)))(let ((.def_6999 ((_ sign_extend 24) id5)))(let ((.def_7073 (= .def_6999 .def_7072))).def_7073))))
(assert (let ((.def_7076 ((_ sign_extend 24) p3_old)))(let ((.def_7008 ((_ sign_extend 24) id4)))(let ((.def_7077 (= .def_7008 .def_7076))).def_7077))))
(assert (let ((.def_7030 ((_ sign_extend 24) st3)))(let ((.def_7029 ((_ sign_extend 24) st4)))(let ((.def_26615 (= .def_7029 .def_7030))).def_26615))))
(assert (let ((.def_7032 ((_ sign_extend 24) st1)))(let ((.def_7029 ((_ sign_extend 24) st4)))(let ((.def_26617 (= .def_7029 .def_7032))).def_26617))))
(assert (let ((.def_7028 ((_ sign_extend 24) st5)))(let ((.def_7026 ((_ sign_extend 24) st7)))(let ((.def_26619 (= .def_7026 .def_7028))).def_26619))))
(assert (let ((.def_7031 ((_ sign_extend 24) st2)))(let ((.def_7026 ((_ sign_extend 24) st7)))(let ((.def_26621 (= .def_7026 .def_7031))).def_26621))))
(assert (let ((.def_7027 ((_ sign_extend 24) st6)))(let ((.def_7026 ((_ sign_extend 24) st7)))(let ((.def_26623 (= .def_7026 .def_7027))).def_26623))))
(assert (let ((.def_26625 (= st4 (_ bv1 8)))).def_26625))
(assert (let ((.def_26627 (= st3 (_ bv1 8)))).def_26627))
(assert (let ((.def_26629 (= st1 (_ bv1 8)))).def_26629))
(assert (let ((.def_7032 ((_ sign_extend 24) st1)))(let ((.def_7030 ((_ sign_extend 24) st3)))(let ((.def_26631 (= .def_7030 .def_7032))).def_26631))))
(assert (let ((.def_7028 ((_ sign_extend 24) st5)))(let ((.def_7027 ((_ sign_extend 24) st6)))(let ((.def_26633 (= .def_7027 .def_7028))).def_26633))))
(assert (let ((.def_7031 ((_ sign_extend 24) st2)))(let ((.def_7027 ((_ sign_extend 24) st6)))(let ((.def_26635 (= .def_7027 .def_7031))).def_26635))))
(assert (let ((.def_7029 ((_ sign_extend 24) st4)))(let ((.def_7027 ((_ sign_extend 24) st6)))(let ((.def_26637 (= .def_7027 .def_7029))).def_26637))))
(assert (let ((.def_7030 ((_ sign_extend 24) st3)))(let ((.def_7028 ((_ sign_extend 24) st5)))(let ((.def_26639 (= .def_7028 .def_7030))).def_26639))))
(assert (let ((.def_7031 ((_ sign_extend 24) st2)))(let ((.def_7030 ((_ sign_extend 24) st3)))(let ((.def_26641 (= .def_7030 .def_7031))).def_26641))))
(assert (let ((.def_7030 ((_ sign_extend 24) st3)))(let ((.def_7026 ((_ sign_extend 24) st7)))(let ((.def_26643 (= .def_7026 .def_7030))).def_26643))))
(assert (let ((.def_7030 ((_ sign_extend 24) st3)))(let ((.def_7027 ((_ sign_extend 24) st6)))(let ((.def_26645 (= .def_7027 .def_7030))).def_26645))))
(assert (let ((.def_7029 ((_ sign_extend 24) st4)))(let ((.def_7026 ((_ sign_extend 24) st7)))(let ((.def_26647 (= .def_7026 .def_7029))).def_26647))))
(assert (let ((.def_26649 (= st7 (_ bv1 8)))).def_26649))
(assert (let ((.def_7032 ((_ sign_extend 24) st1)))(let ((.def_7026 ((_ sign_extend 24) st7)))(let ((.def_26651 (= .def_7026 .def_7032))).def_26651))))
(assert (let ((.def_7031 ((_ sign_extend 24) st2)))(let ((.def_7028 ((_ sign_extend 24) st5)))(let ((.def_26653 (= .def_7028 .def_7031))).def_26653))))
(assert (let ((.def_7029 ((_ sign_extend 24) st4)))(let ((.def_7028 ((_ sign_extend 24) st5)))(let ((.def_26655 (= .def_7028 .def_7029))).def_26655))))
(assert (let ((.def_26657 (= st5 (_ bv1 8)))).def_26657))
(assert (let ((.def_7032 ((_ sign_extend 24) st1)))(let ((.def_7028 ((_ sign_extend 24) st5)))(let ((.def_26659 (= .def_7028 .def_7032))).def_26659))))
(assert (let ((.def_7031 ((_ sign_extend 24) st2)))(let ((.def_7029 ((_ sign_extend 24) st4)))(let ((.def_26661 (= .def_7029 .def_7031))).def_26661))))
(assert (let ((.def_26663 (= st6 (_ bv1 8)))).def_26663))
(assert (let ((.def_7032 ((_ sign_extend 24) st1)))(let ((.def_7027 ((_ sign_extend 24) st6)))(let ((.def_26665 (= .def_7027 .def_7032))).def_26665))))
(assert (let ((.def_26667 (= st2 (_ bv1 8)))).def_26667))
(assert (let ((.def_7032 ((_ sign_extend 24) st1)))(let ((.def_7031 ((_ sign_extend 24) st2)))(let ((.def_26669 (= .def_7031 .def_7032))).def_26669))))
(assert (let ((.def_26671 ((_ sign_extend 24) r1)))(let ((.def_26672 (bvslt .def_26671 (_ bv8 32)))).def_26672)))
(assert (let ((.def_57670 (= st3 st7))).def_57670))
(assert (let ((.def_57672 (= st5 st7))).def_57672))
(assert (let ((.def_57674 (= st6 st7))).def_57674))
(assert (let ((.def_6979 ((_ sign_extend 24) send7)))(let ((.def_6977 ((_ sign_extend 24) id8)))(let ((.def_57676 (bvslt .def_6977 .def_6979))).def_57676))))
(assert (let ((.def_6987 ((_ sign_extend 24) send6)))(let ((.def_6977 ((_ sign_extend 24) id8)))(let ((.def_57678 (= .def_6977 .def_6987))).def_57678))))
(assert (let ((.def_6977 ((_ sign_extend 24) id8)))(let ((.def_6954 ((_ sign_extend 24) send8)))(let ((.def_57680 (= .def_6954 .def_6977))).def_57680))))
(assert (let ((.def_6970 ((_ sign_extend 24) send2)))(let ((.def_6969 ((_ sign_extend 24) id3)))(let ((.def_57682 (bvslt .def_6969 .def_6970))).def_57682))))
(assert (let ((.def_7009 ((_ sign_extend 24) send3)))(let ((.def_6969 ((_ sign_extend 24) id3)))(let ((.def_57684 (= .def_6969 .def_7009))).def_57684))))
(assert (let ((.def_6960 ((_ sign_extend 24) id2)))(let ((.def_57686 ((_ extract 31 31) .def_6960)))(let ((.def_57687 (= .def_57686 (_ bv1 1)))).def_57687))))
(assert (let ((.def_57689 (= st2 st7))).def_57689))
(assert (let ((.def_57691 (= st8 (_ bv1 8)))).def_57691))
(assert (let ((.def_6969 ((_ sign_extend 24) id3)))(let ((.def_6962 ((_ sign_extend 24) send1)))(let ((.def_57693 (= .def_6962 .def_6969))).def_57693))))
(assert (let ((.def_57695 (= st1 st2))).def_57695))
(assert (let ((.def_57697 (= st1 st3))).def_57697))
(assert (let ((.def_57699 (= st1 st4))).def_57699))
(assert (let ((.def_57701 (= st1 st5))).def_57701))
(assert (let ((.def_57703 (= st1 st6))).def_57703))
(assert (let ((.def_57705 (= st1 st7))).def_57705))
(assert (let ((.def_57707 (= nomsg (_ bv255 8)))).def_57707))
(assert (let ((.def_6979 ((_ sign_extend 24) send7)))(let ((.def_6956 ((_ sign_extend 24) id1)))(let ((.def_57709 (= .def_6956 .def_6979))).def_57709))))
(assert (let ((.def_6960 ((_ sign_extend 24) id2)))(let ((.def_6954 ((_ sign_extend 24) send8)))(let ((.def_57711 (= .def_6954 .def_6960))).def_57711))))
(assert (let ((.def_6962 ((_ sign_extend 24) send1)))(let ((.def_6960 ((_ sign_extend 24) id2)))(let ((.def_57713 (bvslt .def_6960 .def_6962))).def_57713))))
(assert (let ((.def_7015 ((_ sign_extend 24) nomsg)))(let ((.def_6962 ((_ sign_extend 24) send1)))(let ((.def_57715 (= .def_6962 .def_7015))).def_57715))))
(assert (let ((.def_57717 (= nomsg send2))).def_57717))
(assert (let ((.def_7015 ((_ sign_extend 24) nomsg)))(let ((.def_6970 ((_ sign_extend 24) send2)))(let ((.def_57719 (= .def_6970 .def_7015))).def_57719))))
(assert (let ((.def_7009 ((_ sign_extend 24) send3)))(let ((.def_7008 ((_ sign_extend 24) id4)))(let ((.def_57721 (bvslt .def_7008 .def_7009))).def_57721))))
(assert (let ((.def_7008 ((_ sign_extend 24) id4)))(let ((.def_6970 ((_ sign_extend 24) send2)))(let ((.def_57723 (= .def_6970 .def_7008))).def_57723))))
(assert (let ((.def_6995 ((_ sign_extend 24) send5)))(let ((.def_6994 ((_ sign_extend 24) id6)))(let ((.def_57725 (bvslt .def_6994 .def_6995))).def_57725))))
(assert (let ((.def_7001 ((_ sign_extend 24) send4)))(let ((.def_6994 ((_ sign_extend 24) id6)))(let ((.def_57727 (= .def_6994 .def_7001))).def_57727))))
(assert (let ((.def_7009 ((_ sign_extend 24) send3)))(let ((.def_6999 ((_ sign_extend 24) id5)))(let ((.def_57729 (= .def_6999 .def_7009))).def_57729))))
(assert (let ((.def_7001 ((_ sign_extend 24) send4)))(let ((.def_6999 ((_ sign_extend 24) id5)))(let ((.def_57731 (bvslt .def_6999 .def_7001))).def_57731))))
(assert (let ((.def_6987 ((_ sign_extend 24) send6)))(let ((.def_6986 ((_ sign_extend 24) id7)))(let ((.def_57733 (bvslt .def_6986 .def_6987))).def_57733))))
(assert (let ((.def_6995 ((_ sign_extend 24) send5)))(let ((.def_6986 ((_ sign_extend 24) id7)))(let ((.def_57735 (= .def_6986 .def_6995))).def_57735))))
(assert (let ((.def_57737 (= nomsg send5))).def_57737))
(assert (let ((.def_6986 ((_ sign_extend 24) id7)))(let ((.def_6979 ((_ sign_extend 24) send7)))(let ((.def_57739 (= .def_6979 .def_6986))).def_57739))))
(assert (let ((.def_6970 ((_ sign_extend 24) send2)))(let ((.def_6960 ((_ sign_extend 24) id2)))(let ((.def_57741 (= .def_6960 .def_6970))).def_57741))))
(assert (let ((.def_6999 ((_ sign_extend 24) id5)))(let ((.def_6995 ((_ sign_extend 24) send5)))(let ((.def_57743 (= .def_6995 .def_6999))).def_57743))))
(assert (let ((.def_7015 ((_ sign_extend 24) nomsg)))(let ((.def_7009 ((_ sign_extend 24) send3)))(let ((.def_57745 (= .def_7009 .def_7015))).def_57745))))
(assert (let ((.def_6994 ((_ sign_extend 24) id6)))(let ((.def_6987 ((_ sign_extend 24) send6)))(let ((.def_57747 (= .def_6987 .def_6994))).def_57747))))
(assert (let ((.def_7060 ((_ sign_extend 24) p7_old)))(let ((.def_6977 ((_ sign_extend 24) id8)))(let ((.def_57749 (bvslt .def_6977 .def_7060))).def_57749))))
(assert (let ((.def_6979 ((_ sign_extend 24) send7)))(let ((.def_57752 (= .def_6979 |node7::__CPAchecker_TMP_0|))).def_57752)))
(assert (let ((.def_57754 ((_ extract 7 0) |node7::__CPAchecker_TMP_0|)))(let ((.def_57755 (= p7_old .def_57754))).def_57755)))
(assert (let ((.def_7064 ((_ sign_extend 24) p6_old)))(let ((.def_6977 ((_ sign_extend 24) id8)))(let ((.def_57757 (= .def_6977 .def_7064))).def_57757))))
(assert (let ((.def_7015 ((_ sign_extend 24) nomsg)))(let ((.def_6977 ((_ sign_extend 24) id8)))(let ((.def_57759 (= .def_6977 .def_7015))).def_57759))))
(assert (let ((.def_7056 ((_ sign_extend 24) p2_old)))(let ((.def_6969 ((_ sign_extend 24) id3)))(let ((.def_57761 (bvslt .def_6969 .def_7056))).def_57761))))
(assert (let ((.def_6969 ((_ sign_extend 24) id3)))(let ((.def_57764 (= .def_6969 |node3::__CPAchecker_TMP_0|))).def_57764)))
(assert (let ((.def_6970 ((_ sign_extend 24) send2)))(let ((.def_57767 (= .def_6970 |node2::__CPAchecker_TMP_0|))).def_57767)))
(assert (let ((.def_57769 ((_ extract 7 0) |node2::__CPAchecker_TMP_0|)))(let ((.def_57770 (= p2_old .def_57769))).def_57770)))
(assert (let ((.def_7015 ((_ sign_extend 24) nomsg)))(let ((.def_6960 ((_ sign_extend 24) id2)))(let ((.def_57772 (= .def_6960 .def_7015))).def_57772))))
(assert (let ((.def_6962 ((_ sign_extend 24) send1)))(let ((.def_57775 (= .def_6962 |node1::__CPAchecker_TMP_0|))).def_57775)))
(assert (let ((.def_57777 ((_ extract 7 0) |node1::__CPAchecker_TMP_0|)))(let ((.def_57778 (= p1_old .def_57777))).def_57778)))
(assert (let ((.def_7052 ((_ sign_extend 24) p1_old)))(let ((.def_6969 ((_ sign_extend 24) id3)))(let ((.def_57780 (= .def_6969 .def_7052))).def_57780))))
(assert (let ((.def_6954 ((_ sign_extend 24) send8)))(let ((.def_57783 (= .def_6954 |node8::__CPAchecker_TMP_0|))).def_57783)))
(assert (let ((.def_57785 ((_ extract 7 0) |node8::__CPAchecker_TMP_0|)))(let ((.def_57786 (= p8_old .def_57785))).def_57786)))
(assert (let ((.def_7048 ((_ sign_extend 24) p8_old)))(let ((.def_6956 ((_ sign_extend 24) id1)))(let ((.def_57788 (bvslt .def_6956 .def_7048))).def_57788))))
(assert (let ((.def_57790 (= send8 p8_old))).def_57790))
(assert (let ((.def_7060 ((_ sign_extend 24) p7_old)))(let ((.def_6956 ((_ sign_extend 24) id1)))(let ((.def_57792 (= .def_6956 .def_7060))).def_57792))))
(assert (let ((.def_7048 ((_ sign_extend 24) p8_old)))(let ((.def_6960 ((_ sign_extend 24) id2)))(let ((.def_57794 (= .def_6960 .def_7048))).def_57794))))
(assert (let ((.def_7052 ((_ sign_extend 24) p1_old)))(let ((.def_6960 ((_ sign_extend 24) id2)))(let ((.def_57796 (bvslt .def_6960 .def_7052))).def_57796))))
(assert (let ((.def_7052 ((_ sign_extend 24) p1_old)))(let ((.def_7015 ((_ sign_extend 24) nomsg)))(let ((.def_57798 (= .def_7015 .def_7052))).def_57798))))
(assert (let ((.def_7056 ((_ sign_extend 24) p2_old)))(let ((.def_7015 ((_ sign_extend 24) nomsg)))(let ((.def_57800 (= .def_7015 .def_7056))).def_57800))))
(assert (let ((.def_7056 ((_ sign_extend 24) p2_old)))(let ((.def_7008 ((_ sign_extend 24) id4)))(let ((.def_57802 (= .def_7008 .def_7056))).def_57802))))
(assert (let ((.def_57804 ((_ extract 7 0) |node3::__CPAchecker_TMP_0|)))(let ((.def_57805 (= p3_old .def_57804))).def_57805)))
(assert (let ((.def_7076 ((_ sign_extend 24) p3_old)))(let ((.def_7008 ((_ sign_extend 24) id4)))(let ((.def_57807 (bvslt .def_7008 .def_7076))).def_57807))))
(assert (let ((.def_7068 ((_ sign_extend 24) p5_old)))(let ((.def_6994 ((_ sign_extend 24) id6)))(let ((.def_57809 (bvslt .def_6994 .def_7068))).def_57809))))
(assert (let ((.def_6995 ((_ sign_extend 24) send5)))(let ((.def_57812 (= .def_6995 |node5::__CPAchecker_TMP_0|))).def_57812)))
(assert (let ((.def_57814 ((_ extract 7 0) |node5::__CPAchecker_TMP_0|)))(let ((.def_57815 (= p5_old .def_57814))).def_57815)))
(assert (let ((.def_7072 ((_ sign_extend 24) p4_old)))(let ((.def_6994 ((_ sign_extend 24) id6)))(let ((.def_57817 (= .def_6994 .def_7072))).def_57817))))
(assert (let ((.def_7001 ((_ sign_extend 24) send4)))(let ((.def_57820 (= .def_7001 |node4::__CPAchecker_TMP_0|))).def_57820)))
(assert (let ((.def_57822 ((_ extract 7 0) |node4::__CPAchecker_TMP_0|)))(let ((.def_57823 (= p4_old .def_57822))).def_57823)))
(assert (let ((.def_57825 (= id5 p3_old))).def_57825))
(assert (let ((.def_7076 ((_ sign_extend 24) p3_old)))(let ((.def_6999 ((_ sign_extend 24) id5)))(let ((.def_57827 (= .def_6999 .def_7076))).def_57827))))
(assert (let ((.def_7072 ((_ sign_extend 24) p4_old)))(let ((.def_6999 ((_ sign_extend 24) id5)))(let ((.def_57829 (bvslt .def_6999 .def_7072))).def_57829))))
(assert (let ((.def_7064 ((_ sign_extend 24) p6_old)))(let ((.def_6986 ((_ sign_extend 24) id7)))(let ((.def_57831 (bvslt .def_6986 .def_7064))).def_57831))))
(assert (let ((.def_57833 (= send6 p6_old))).def_57833))
(assert (let ((.def_7068 ((_ sign_extend 24) p5_old)))(let ((.def_6986 ((_ sign_extend 24) id7)))(let ((.def_57835 (= .def_6986 .def_7068))).def_57835))))
(assert (let ((.def_7068 ((_ sign_extend 24) p5_old)))(let ((.def_7015 ((_ sign_extend 24) nomsg)))(let ((.def_57837 (= .def_7015 .def_7068))).def_57837))))
(assert (let ((.def_7015 ((_ sign_extend 24) nomsg)))(let ((.def_6986 ((_ sign_extend 24) id7)))(let ((.def_57839 (= .def_6986 .def_7015))).def_57839))))
(assert (let ((.def_7064 ((_ sign_extend 24) p6_old)))(let ((.def_7015 ((_ sign_extend 24) nomsg)))(let ((.def_57841 (= .def_7015 .def_7064))).def_57841))))
(assert (let ((.def_6999 ((_ sign_extend 24) id5)))(let ((.def_57843 (= .def_6999 |node5::__CPAchecker_TMP_0|))).def_57843)))
(assert (let ((.def_7072 ((_ sign_extend 24) p4_old)))(let ((.def_7015 ((_ sign_extend 24) nomsg)))(let ((.def_57845 (= .def_7015 .def_7072))).def_57845))))
(assert (let ((.def_7076 ((_ sign_extend 24) p3_old)))(let ((.def_7015 ((_ sign_extend 24) nomsg)))(let ((.def_57847 (= .def_7015 .def_7076))).def_57847))))
(assert (let ((.def_7009 ((_ sign_extend 24) send3)))(let ((.def_57849 (= .def_7009 |node3::__CPAchecker_TMP_0|))).def_57849)))
(assert (let ((.def_7015 ((_ sign_extend 24) nomsg)))(let ((.def_6994 ((_ sign_extend 24) id6)))(let ((.def_57851 (= .def_6994 .def_7015))).def_57851))))
(assert (let ((.def_57853 (= id8 send7))).def_57853))
(assert (let ((.def_7027 ((_ sign_extend 24) st6)))(let ((.def_7024 ((_ sign_extend 24) st8)))(let ((.def_57855 (= .def_7024 .def_7027))).def_57855))))
(assert (let ((.def_7032 ((_ sign_extend 24) st1)))(let ((.def_7024 ((_ sign_extend 24) st8)))(let ((.def_57857 (= .def_7024 .def_7032))).def_57857))))
(assert (let ((.def_7032 ((_ sign_extend 24) st1)))(let ((.def_7030 ((_ sign_extend 24) st3)))(let ((.def_57860 (bvadd .def_7030 .def_7032)))(let ((.def_7029 ((_ sign_extend 24) st4)))(let ((.def_57861 (bvadd .def_7029 .def_57860)))(let ((.def_7028 ((_ sign_extend 24) st5)))(let ((.def_57862 (bvadd .def_7028 .def_57861)))(let ((.def_7027 ((_ sign_extend 24) st6)))(let ((.def_57863 (bvadd .def_7027 .def_57862)))(let ((.def_7026 ((_ sign_extend 24) st7)))(let ((.def_57864 (bvadd .def_7026 .def_57863)))(let ((.def_57865 (bvadd (_ bv1 32) .def_57864)))(let ((.def_7024 ((_ sign_extend 24) st8)))(let ((.def_7025 (bvneg .def_7024)))(let ((.def_57866 (= .def_7025 .def_57865))).def_57866))))))))))))))))
(assert (let ((.def_57868 (= send2 send3))).def_57868))
(assert (let ((.def_7030 ((_ sign_extend 24) st3)))(let ((.def_57872 (bvshl .def_7030 (_ bv1 32))))(let ((.def_57874 (bvadd .def_7030 .def_57872)))(let ((.def_7029 ((_ sign_extend 24) st4)))(let ((.def_57876 (bvadd .def_7029 .def_57874)))(let ((.def_7024 ((_ sign_extend 24) st8)))(let ((.def_57878 (bvadd .def_7024 .def_57876)))(let ((.def_57880 (bvadd .def_7024 .def_57878)))(let ((.def_57881 (bvadd .def_7024 .def_57880)))(let ((.def_7025 (bvneg .def_7024)))(let ((.def_57882 (= .def_7025 .def_57881))).def_57882))))))))))))
(assert (let ((.def_7028 ((_ sign_extend 24) st5)))(let ((.def_7024 ((_ sign_extend 24) st8)))(let ((.def_57884 (= .def_7024 .def_7028))).def_57884))))
(assert (let ((.def_7026 ((_ sign_extend 24) st7)))(let ((.def_7024 ((_ sign_extend 24) st8)))(let ((.def_57886 (= .def_7024 .def_7026))).def_57886))))
(assert (let ((.def_7024 ((_ sign_extend 24) st8)))(let ((.def_57890 (bvshl .def_7024 (_ bv1 32))))(let ((.def_57892 (bvadd .def_7024 .def_57890)))(let ((.def_7029 ((_ sign_extend 24) st4)))(let ((.def_57894 (bvadd .def_7029 .def_57892)))(let ((.def_7026 ((_ sign_extend 24) st7)))(let ((.def_57896 (bvadd .def_7026 .def_57894)))(let ((.def_57898 (bvadd .def_7026 .def_57896)))(let ((.def_57899 (bvadd .def_7026 .def_57898)))(let ((.def_7025 (bvneg .def_7024)))(let ((.def_57900 (= .def_7025 .def_57899))).def_57900))))))))))))
(assert (let ((.def_7030 ((_ sign_extend 24) st3)))(let ((.def_7024 ((_ sign_extend 24) st8)))(let ((.def_57902 (= .def_7024 .def_7030))).def_57902))))
(assert (let ((.def_7031 ((_ sign_extend 24) st2)))(let ((.def_7024 ((_ sign_extend 24) st8)))(let ((.def_57904 (= .def_7024 .def_7031))).def_57904))))
(assert (let ((.def_7015 ((_ sign_extend 24) nomsg)))(let ((.def_6954 ((_ sign_extend 24) send8)))(let ((.def_57906 (= .def_6954 .def_7015))).def_57906))))
(assert (let ((.def_57908 (= send8 id1))).def_57908))
(assert (let ((.def_57910 (= id2 send1))).def_57910))
(assert (let ((.def_57912 (= send7 send6))).def_57912))
(assert (let ((.def_7029 ((_ sign_extend 24) st4)))(let ((.def_7024 ((_ sign_extend 24) st8)))(let ((.def_57914 (= .def_7024 .def_7029))).def_57914))))
(assert (let ((.def_57916 (= send5 send4))).def_57916))
(assert (let ((.def_57918 ((_ sign_extend 24) p4_new)))(let ((.def_7001 ((_ sign_extend 24) send4)))(let ((.def_57919 (= .def_7001 .def_57918))).def_57919))))
(assert (let ((.def_7015 ((_ sign_extend 24) nomsg)))(let ((.def_6999 ((_ sign_extend 24) id5)))(let ((.def_57921 (= .def_6999 .def_7015))).def_57921))))
(assert (let ((.def_57923 (= r1 (_ bv1 8)))).def_57923))
(assert (let ((.def_7029 ((_ sign_extend 24) st4)))(let ((.def_57925 (= .def_7029 (_ bv4294967294 32)))).def_57925)))
(assert (let ((.def_7029 ((_ sign_extend 24) st4)))(let ((.def_57927 (= .def_7029 (_ bv4294967293 32)))).def_57927)))
(assert (let ((.def_57929 (= send3 p2_old))).def_57929))
(assert (let ((.def_7029 ((_ sign_extend 24) st4)))(let ((.def_57950 (= .def_7029 (_ bv4294967292 32)))).def_57950)))
(assert (let ((.def_7028 ((_ sign_extend 24) st5)))(let ((.def_57952 (= .def_7028 (_ bv4294967293 32)))).def_57952)))

assert N599:
(assert false)
(assert (let ((.def_3520 (= |assert::arg| (_ bv0 8)))).def_3520))

