(set-info :source |printed by MathSAT|)
(declare-fun a20 () (_ BitVec 32))
(declare-fun a25 () (_ BitVec 32))
(declare-fun a12 () (_ BitVec 32))
(declare-fun a15 () (_ BitVec 32))
(declare-fun a16 () (_ BitVec 32))
(declare-fun a2 () (_ BitVec 32))
(declare-fun a27 () (_ BitVec 32))
(declare-fun a9 () (_ BitVec 32))
(declare-fun m_pc () (_ BitVec 32))
(declare-fun t1_pc () (_ BitVec 32))
(declare-fun t2_pc () (_ BitVec 32))
(declare-fun t3_pc () (_ BitVec 32))
(declare-fun t4_pc () (_ BitVec 32))
(declare-fun t5_pc () (_ BitVec 32))
(declare-fun t6_pc () (_ BitVec 32))
(declare-fun t7_pc () (_ BitVec 32))
(declare-fun t8_pc () (_ BitVec 32))
(declare-fun t9_pc () (_ BitVec 32))
(declare-fun t10_pc () (_ BitVec 32))
(declare-fun m_st () (_ BitVec 32))
(declare-fun E_8 () (_ BitVec 32))
(declare-fun E_7 () (_ BitVec 32))
(declare-fun E_6 () (_ BitVec 32))
(declare-fun E_5 () (_ BitVec 32))
(declare-fun E_4 () (_ BitVec 32))
(declare-fun E_3 () (_ BitVec 32))
(declare-fun E_2 () (_ BitVec 32))
(declare-fun E_M () (_ BitVec 32))
(declare-fun E_10 () (_ BitVec 32))
(declare-fun E_9 () (_ BitVec 32))
(declare-fun t2_st () (_ BitVec 32))
(declare-fun t3_st () (_ BitVec 32))
(declare-fun t6_st () (_ BitVec 32))
(declare-fun t4_st () (_ BitVec 32))
(declare-fun t7_st () (_ BitVec 32))
(declare-fun t5_st () (_ BitVec 32))
(declare-fun t1_st () (_ BitVec 32))
(declare-fun t8_st () (_ BitVec 32))
(declare-fun t9_st () (_ BitVec 32))
(declare-fun t10_st () (_ BitVec 32))
(declare-fun E_1 () (_ BitVec 32))
(declare-fun local () (_ BitVec 32))
(declare-fun token () (_ BitVec 32))

*:
(assert (let ((.def_107688 (= a20 (_ bv5 32)))).def_107688))

calculate_output8 N30053:
(assert false)
(assert (let ((.def_107688 (= a20 (_ bv5 32)))).def_107688))

main1 N30136:
(assert (let ((.def_107688 (= a20 (_ bv5 32)))).def_107688))
(assert (let ((.def_155285 (= a25 (_ bv1 32)))).def_155285))
(assert (let ((.def_155288 (= a12 (_ bv4 32)))).def_155288))
(assert (let ((.def_155291 (= a15 (_ bv1 32)))).def_155291))
(assert (let ((.def_155294 (= a16 (_ bv1 32)))).def_155294))
(assert (let ((.def_155297 (= a2 (_ bv10 32)))).def_155297))
(assert (let ((.def_155300 (= a27 (_ bv1 32)))).def_155300))
(assert (let ((.def_155303 (= a9 (_ bv18 32)))).def_155303))
(assert (let ((.def_321468 (= a20 (_ bv6 32)))).def_321468))
(assert (let ((.def_321470 (= a12 (_ bv3 32)))).def_321470))
(assert (let ((.def_321472 (= a12 (_ bv6 32)))).def_321472))
(assert (let ((.def_321474 (= a2 (_ bv9 32)))).def_321474))
(assert (let ((.def_321476 (= a9 (_ bv16 32)))).def_321476))
(assert (let ((.def_321478 (= a2 (_ bv12 32)))).def_321478))
(assert (let ((.def_321480 (= a2 (_ bv11 32)))).def_321480))
(assert (let ((.def_321482 (= a9 (_ bv17 32)))).def_321482))
(assert (let ((.def_321484 (= a12 (_ bv2 32)))).def_321484))
(assert (let ((.def_321486 (= a2 (_ bv13 32)))).def_321486))

error N30154:
(assert false)
(assert (let ((.def_107688 (= a20 (_ bv5 32)))).def_107688))

eval N30774:
(assert (let ((.def_747518 (= m_pc (_ bv0 32)))).def_747518))
(assert (let ((.def_107688 (= a20 (_ bv5 32)))).def_107688))
(assert (let ((.def_756743 (= t1_pc (_ bv0 32)))).def_756743))
(assert (let ((.def_756746 (= t2_pc (_ bv0 32)))).def_756746))
(assert (let ((.def_756749 (= t3_pc (_ bv0 32)))).def_756749))
(assert (let ((.def_756752 (= t4_pc (_ bv0 32)))).def_756752))
(assert (let ((.def_756755 (= t5_pc (_ bv0 32)))).def_756755))
(assert (let ((.def_756758 (= t6_pc (_ bv0 32)))).def_756758))
(assert (let ((.def_756761 (= t7_pc (_ bv0 32)))).def_756761))
(assert (let ((.def_756764 (= t8_pc (_ bv0 32)))).def_756764))
(assert (let ((.def_756767 (= t9_pc (_ bv0 32)))).def_756767))
(assert (let ((.def_756770 (= t10_pc (_ bv0 32)))).def_756770))
(assert (let ((.def_756772 (= m_pc (_ bv1 32)))).def_756772))
(assert (let ((.def_756774 (= t1_pc (_ bv1 32)))).def_756774))
(assert (let ((.def_756776 (= t2_pc (_ bv1 32)))).def_756776))
(assert (let ((.def_756778 (= t3_pc (_ bv1 32)))).def_756778))
(assert (let ((.def_756780 (= t4_pc (_ bv1 32)))).def_756780))
(assert (let ((.def_756782 (= t5_pc (_ bv1 32)))).def_756782))
(assert (let ((.def_756784 (= t6_pc (_ bv1 32)))).def_756784))
(assert (let ((.def_756786 (= t7_pc (_ bv1 32)))).def_756786))
(assert (let ((.def_756788 (= t8_pc (_ bv1 32)))).def_756788))
(assert (let ((.def_756790 (= t9_pc (_ bv1 32)))).def_756790))
(assert (let ((.def_756792 (= t10_pc (_ bv1 32)))).def_756792))
(assert (let ((.def_756795 (= m_st (_ bv0 32)))).def_756795))
(assert (let ((.def_808275 (= E_8 (_ bv1 32)))).def_808275))
(assert (let ((.def_808278 (= E_7 (_ bv1 32)))).def_808278))
(assert (let ((.def_808281 (= E_6 (_ bv1 32)))).def_808281))
(assert (let ((.def_808284 (= E_5 (_ bv1 32)))).def_808284))
(assert (let ((.def_808287 (= E_4 (_ bv1 32)))).def_808287))
(assert (let ((.def_808290 (= E_3 (_ bv1 32)))).def_808290))
(assert (let ((.def_808293 (= E_2 (_ bv1 32)))).def_808293))
(assert (let ((.def_808296 (= E_M (_ bv1 32)))).def_808296))
(assert (let ((.def_808299 (= E_10 (_ bv1 32)))).def_808299))
(assert (let ((.def_808302 (= E_9 (_ bv1 32)))).def_808302))
(assert (let ((.def_808305 (= t2_st (_ bv0 32)))).def_808305))
(assert (let ((.def_808308 (= t3_st (_ bv0 32)))).def_808308))
(assert (let ((.def_808311 (= t6_st (_ bv0 32)))).def_808311))
(assert (let ((.def_808314 (= t4_st (_ bv0 32)))).def_808314))
(assert (let ((.def_808317 (= t7_st (_ bv0 32)))).def_808317))
(assert (let ((.def_808320 (= t5_st (_ bv0 32)))).def_808320))
(assert (let ((.def_808323 (= t1_st (_ bv0 32)))).def_808323))
(assert (let ((.def_808326 (= t8_st (_ bv0 32)))).def_808326))
(assert (let ((.def_808329 (= t9_st (_ bv0 32)))).def_808329))
(assert (let ((.def_808332 (= t10_st (_ bv0 32)))).def_808332))
(assert (let ((.def_808335 (= E_1 (_ bv1 32)))).def_808335))
(assert (let ((.def_808338 (bvadd (_ bv10 32) local)))(let ((.def_808340 (= .def_808338 token))).def_808340)))

start_simulation N31293:
(assert (let ((.def_747518 (= m_pc (_ bv0 32)))).def_747518))
(assert (let ((.def_107688 (= a20 (_ bv5 32)))).def_107688))
(assert (let ((.def_756743 (= t1_pc (_ bv0 32)))).def_756743))
(assert (let ((.def_756746 (= t2_pc (_ bv0 32)))).def_756746))
(assert (let ((.def_756749 (= t3_pc (_ bv0 32)))).def_756749))
(assert (let ((.def_756752 (= t4_pc (_ bv0 32)))).def_756752))
(assert (let ((.def_756755 (= t5_pc (_ bv0 32)))).def_756755))
(assert (let ((.def_756758 (= t6_pc (_ bv0 32)))).def_756758))
(assert (let ((.def_756761 (= t7_pc (_ bv0 32)))).def_756761))
(assert (let ((.def_756764 (= t8_pc (_ bv0 32)))).def_756764))
(assert (let ((.def_756767 (= t9_pc (_ bv0 32)))).def_756767))
(assert (let ((.def_756770 (= t10_pc (_ bv0 32)))).def_756770))
(assert (let ((.def_756772 (= m_pc (_ bv1 32)))).def_756772))
(assert (let ((.def_756774 (= t1_pc (_ bv1 32)))).def_756774))
(assert (let ((.def_756776 (= t2_pc (_ bv1 32)))).def_756776))
(assert (let ((.def_756778 (= t3_pc (_ bv1 32)))).def_756778))
(assert (let ((.def_756780 (= t4_pc (_ bv1 32)))).def_756780))
(assert (let ((.def_756782 (= t5_pc (_ bv1 32)))).def_756782))
(assert (let ((.def_756784 (= t6_pc (_ bv1 32)))).def_756784))
(assert (let ((.def_756786 (= t7_pc (_ bv1 32)))).def_756786))
(assert (let ((.def_756788 (= t8_pc (_ bv1 32)))).def_756788))
(assert (let ((.def_756790 (= t9_pc (_ bv1 32)))).def_756790))
(assert (let ((.def_756792 (= t10_pc (_ bv1 32)))).def_756792))
(assert (let ((.def_808275 (= E_8 (_ bv1 32)))).def_808275))
(assert (let ((.def_808278 (= E_7 (_ bv1 32)))).def_808278))
(assert (let ((.def_808281 (= E_6 (_ bv1 32)))).def_808281))
(assert (let ((.def_808284 (= E_5 (_ bv1 32)))).def_808284))
(assert (let ((.def_808287 (= E_4 (_ bv1 32)))).def_808287))
(assert (let ((.def_808290 (= E_3 (_ bv1 32)))).def_808290))
(assert (let ((.def_808293 (= E_2 (_ bv1 32)))).def_808293))
(assert (let ((.def_808296 (= E_M (_ bv1 32)))).def_808296))
(assert (let ((.def_808299 (= E_10 (_ bv1 32)))).def_808299))
(assert (let ((.def_808302 (= E_9 (_ bv1 32)))).def_808302))
(assert (let ((.def_756795 (= m_st (_ bv0 32)))).def_756795))

