(set-info :source |printed by MathSAT|)
(declare-fun a20 () (_ BitVec 32))
(declare-fun a9 () (_ BitVec 32))
(declare-fun a25 () (_ BitVec 32))
(declare-fun a12 () (_ BitVec 32))
(declare-fun a15 () (_ BitVec 32))
(declare-fun a16 () (_ BitVec 32))
(declare-fun a2 () (_ BitVec 32))
(declare-fun a27 () (_ BitVec 32))

*:
(assert (let ((.def_105883 (= a20 (_ bv5 32)))).def_105883))

calculate_output8 N29613:
(assert false)
(assert (let ((.def_105883 (= a20 (_ bv5 32)))).def_105883))

main1 N30136:
(assert (let ((.def_152709 (= a9 (_ bv18 32)))).def_152709))
(assert (let ((.def_105883 (= a20 (_ bv5 32)))).def_105883))
(assert (let ((.def_339339 (= a25 (_ bv1 32)))).def_339339))
(assert (let ((.def_339342 (= a12 (_ bv4 32)))).def_339342))
(assert (let ((.def_339345 (= a15 (_ bv1 32)))).def_339345))
(assert (let ((.def_339348 (= a16 (_ bv1 32)))).def_339348))
(assert (let ((.def_339351 (= a2 (_ bv10 32)))).def_339351))
(assert (let ((.def_339354 (= a27 (_ bv1 32)))).def_339354))
(assert (let ((.def_339356 (= a12 (_ bv6 32)))).def_339356))
(assert (let ((.def_339358 (= a20 (_ bv6 32)))).def_339358))
(assert (let ((.def_339360 (= a12 (_ bv3 32)))).def_339360))
(assert (let ((.def_339362 (= a2 (_ bv12 32)))).def_339362))
(assert (let ((.def_339364 (= a12 (_ bv2 32)))).def_339364))
(assert (let ((.def_339366 (= a9 (_ bv16 32)))).def_339366))
(assert (let ((.def_339368 (= a12 (_ bv5 32)))).def_339368))
(assert (let ((.def_339370 (= a9 (_ bv17 32)))).def_339370))
(assert (let ((.def_943336 (= a2 (_ bv9 32)))).def_943336))
(assert (let ((.def_943338 (= a2 (_ bv13 32)))).def_943338))
(assert (let ((.def_943340 (= a2 (_ bv11 32)))).def_943340))
(assert (let ((.def_943342 (= a20 (_ bv7 32)))).def_943342))

