(set-info :source |printed by MathSAT|)
(declare-fun c_last_read () (_ BitVec 32))
(declare-fun p_last_write () (_ BitVec 32))
(declare-fun c_num_read () (_ BitVec 32))
(declare-fun p_num_write () (_ BitVec 32))
(declare-fun c_dr_pc () (_ BitVec 32))
(declare-fun q_free () (_ BitVec 32))
(declare-fun q_buf_0 () (_ BitVec 32))
(declare-fun p_dw_pc () (_ BitVec 32))
(declare-fun q_read_ev () (_ BitVec 32))
(declare-fun c_dr_st () (_ BitVec 32))
(declare-fun p_dw_st () (_ BitVec 32))
(declare-fun m_pc () (_ BitVec 32))
(declare-fun t1_pc () (_ BitVec 32))
(declare-fun t2_pc () (_ BitVec 32))
(declare-fun t3_pc () (_ BitVec 32))
(declare-fun t4_pc () (_ BitVec 32))
(declare-fun m_st () (_ BitVec 32))
(declare-fun t4_st () (_ BitVec 32))
(declare-fun E_4 () (_ BitVec 32))
(declare-fun E_2 () (_ BitVec 32))
(declare-fun E_M () (_ BitVec 32))
(declare-fun E_3 () (_ BitVec 32))
(declare-fun t1_st () (_ BitVec 32))
(declare-fun t2_st () (_ BitVec 32))
(declare-fun t3_st () (_ BitVec 32))
(declare-fun E_1 () (_ BitVec 32))
(declare-fun local () (_ BitVec 32))
(declare-fun token () (_ BitVec 32))
(declare-fun T4_E () (_ BitVec 32))
(declare-fun T3_E () (_ BitVec 32))
(declare-fun T2_E () (_ BitVec 32))
(declare-fun T1_E () (_ BitVec 32))
(declare-fun M_E () (_ BitVec 32))

*:
(assert (let ((.def_555 (= c_last_read p_last_write))).def_555))
(assert (let ((.def_564 (= c_num_read p_num_write))).def_564))

error1 N4:
(assert false)
(assert (let ((.def_555 (= c_last_read p_last_write))).def_555))
(assert (let ((.def_564 (= c_num_read p_num_write))).def_564))

do_write_p N64:
(assert (let ((.def_899 (= c_dr_pc (_ bv0 32)))).def_899))
(assert (let ((.def_555 (= c_last_read p_last_write))).def_555))
(assert (let ((.def_564 (= c_num_read p_num_write))).def_564))
(assert (let ((.def_1002 (= q_free (_ bv1 32)))).def_1002))
(assert false)
(assert (let ((.def_1345 (= p_last_write q_buf_0))).def_1345))
(assert (let ((.def_1005 (= p_dw_pc (_ bv1 32)))).def_1005))
(assert (let ((.def_1534 (bvadd (_ bv1 32) c_num_read)))(let ((.def_1535 (= p_num_write .def_1534))).def_1535)))
(assert (let ((.def_2426 (= q_free (_ bv0 32)))).def_2426))
(assert (let ((.def_1537 (= c_dr_pc (_ bv1 32)))).def_1537))
(assert (let ((.def_5227 (= q_read_ev (_ bv1 32)))).def_5227))

do_read_c N100:
(assert (let ((.def_1005 (= p_dw_pc (_ bv1 32)))).def_1005))
(assert (let ((.def_1002 (= q_free (_ bv1 32)))).def_1002))
(assert (let ((.def_555 (= c_last_read p_last_write))).def_555))
(assert (let ((.def_564 (= c_num_read p_num_write))).def_564))
(assert (let ((.def_1345 (= p_last_write q_buf_0))).def_1345))
(assert (let ((.def_1534 (bvadd (_ bv1 32) c_num_read)))(let ((.def_1535 (= p_num_write .def_1534))).def_1535)))
(assert (let ((.def_1537 (= c_dr_pc (_ bv1 32)))).def_1537))
(assert false)

eval1 N170:
(assert (let ((.def_899 (= c_dr_pc (_ bv0 32)))).def_899))
(assert (let ((.def_555 (= c_last_read p_last_write))).def_555))
(assert (let ((.def_564 (= c_num_read p_num_write))).def_564))
(assert (let ((.def_1002 (= q_free (_ bv1 32)))).def_1002))
(assert (let ((.def_1275 (= p_dw_pc (_ bv0 32)))).def_1275))
(assert (let ((.def_1537 (= c_dr_pc (_ bv1 32)))).def_1537))
(assert (let ((.def_3849 (= c_dr_st (_ bv0 32)))).def_3849))
(assert (let ((.def_1005 (= p_dw_pc (_ bv1 32)))).def_1005))
(assert (let ((.def_5227 (= q_read_ev (_ bv1 32)))).def_5227))
(assert (let ((.def_5230 (= p_dw_st (_ bv0 32)))).def_5230))
(assert (let ((.def_1345 (= p_last_write q_buf_0))).def_1345))
(assert (let ((.def_1534 (bvadd (_ bv1 32) c_num_read)))(let ((.def_1535 (= p_num_write .def_1534))).def_1535)))

start_simulation1 N221:
(assert (let ((.def_899 (= c_dr_pc (_ bv0 32)))).def_899))
(assert (let ((.def_555 (= c_last_read p_last_write))).def_555))
(assert (let ((.def_564 (= c_num_read p_num_write))).def_564))
(assert (let ((.def_1002 (= q_free (_ bv1 32)))).def_1002))
(assert (let ((.def_1275 (= p_dw_pc (_ bv0 32)))).def_1275))
(assert (let ((.def_5227 (= q_read_ev (_ bv1 32)))).def_5227))

error2 N260:
(assert false)
(assert (let ((.def_555 (= c_last_read p_last_write))).def_555))
(assert (let ((.def_564 (= c_num_read p_num_write))).def_564))

eval2 N556:
(assert (let ((.def_7298 (= m_pc (_ bv0 32)))).def_7298))
(assert (let ((.def_555 (= c_last_read p_last_write))).def_555))
(assert (let ((.def_564 (= c_num_read p_num_write))).def_564))
(assert (let ((.def_9598 (= t1_pc (_ bv0 32)))).def_9598))
(assert (let ((.def_9601 (= t2_pc (_ bv0 32)))).def_9601))
(assert (let ((.def_9604 (= t3_pc (_ bv0 32)))).def_9604))
(assert (let ((.def_9607 (= t4_pc (_ bv0 32)))).def_9607))
(assert (let ((.def_9609 (= m_pc (_ bv1 32)))).def_9609))
(assert (let ((.def_9611 (= t1_pc (_ bv1 32)))).def_9611))
(assert (let ((.def_9613 (= t2_pc (_ bv1 32)))).def_9613))
(assert (let ((.def_9615 (= t3_pc (_ bv1 32)))).def_9615))
(assert (let ((.def_9617 (= t4_pc (_ bv1 32)))).def_9617))
(assert (let ((.def_9620 (= m_st (_ bv0 32)))).def_9620))
(assert (let ((.def_12876 (= t4_st (_ bv0 32)))).def_12876))
(assert (let ((.def_12879 (= E_4 (_ bv1 32)))).def_12879))
(assert (let ((.def_12882 (= E_2 (_ bv1 32)))).def_12882))
(assert (let ((.def_12885 (= E_M (_ bv1 32)))).def_12885))
(assert (let ((.def_12888 (= E_3 (_ bv1 32)))).def_12888))
(assert (let ((.def_12891 (= t1_st (_ bv0 32)))).def_12891))
(assert (let ((.def_12894 (= t2_st (_ bv0 32)))).def_12894))
(assert (let ((.def_12897 (= t3_st (_ bv0 32)))).def_12897))
(assert (let ((.def_12900 (= E_1 (_ bv1 32)))).def_12900))
(assert (let ((.def_12903 (bvadd (_ bv4 32) local)))(let ((.def_12905 (= .def_12903 token))).def_12905)))
(assert (let ((.def_18452 (= local (_ bv0 32)))).def_18452))
(assert (let ((.def_18454 (= token (_ bv0 32)))).def_18454))
(assert (let ((.def_18456 (= E_1 (_ bv2 32)))).def_18456))
(assert (let ((.def_18458 (= t3_st (_ bv2 32)))).def_18458))
(assert (let ((.def_18460 (= m_st (_ bv2 32)))).def_18460))
(assert (let ((.def_18462 (bvadd (_ bv3 32) local)))(let ((.def_18463 (= token .def_18462))).def_18463)))
(assert (let ((.def_18465 (bvadd (_ bv2 32) local)))(let ((.def_18466 (= token .def_18465))).def_18466)))
(assert (let ((.def_18468 (= local token))).def_18468))
(assert (let ((.def_18470 (bvadd (_ bv1 32) local)))(let ((.def_18471 (= token .def_18470))).def_18471)))
(assert (let ((.def_18473 (= token (_ bv4 32)))).def_18473))
(assert (let ((.def_24840 (= E_M (_ bv0 32)))).def_24840))
(assert (let ((.def_24842 (= E_2 (_ bv0 32)))).def_24842))
(assert (let ((.def_24844 (= E_1 (_ bv0 32)))).def_24844))
(assert (let ((.def_30852 (= E_4 (_ bv0 32)))).def_30852))
(assert (let ((.def_30854 (= E_3 (_ bv0 32)))).def_30854))
(assert (let ((.def_30857 (= T4_E (_ bv0 32)))).def_30857))
(assert (let ((.def_30860 (= T3_E (_ bv0 32)))).def_30860))
(assert (let ((.def_30863 (= T2_E (_ bv0 32)))).def_30863))
(assert (let ((.def_30866 (= T1_E (_ bv0 32)))).def_30866))
(assert (let ((.def_30869 (= M_E (_ bv0 32)))).def_30869))
(assert false)

start_simulation2 N829:
(assert (let ((.def_7298 (= m_pc (_ bv0 32)))).def_7298))
(assert (let ((.def_555 (= c_last_read p_last_write))).def_555))
(assert (let ((.def_564 (= c_num_read p_num_write))).def_564))
(assert (let ((.def_9598 (= t1_pc (_ bv0 32)))).def_9598))
(assert (let ((.def_9601 (= t2_pc (_ bv0 32)))).def_9601))
(assert (let ((.def_9604 (= t3_pc (_ bv0 32)))).def_9604))
(assert (let ((.def_9607 (= t4_pc (_ bv0 32)))).def_9607))
(assert (let ((.def_9609 (= m_pc (_ bv1 32)))).def_9609))
(assert (let ((.def_9611 (= t1_pc (_ bv1 32)))).def_9611))
(assert (let ((.def_9613 (= t2_pc (_ bv1 32)))).def_9613))
(assert (let ((.def_9615 (= t3_pc (_ bv1 32)))).def_9615))
(assert (let ((.def_9617 (= t4_pc (_ bv1 32)))).def_9617))
(assert (let ((.def_12876 (= t4_st (_ bv0 32)))).def_12876))
(assert (let ((.def_12879 (= E_4 (_ bv1 32)))).def_12879))
(assert (let ((.def_12882 (= E_2 (_ bv1 32)))).def_12882))
(assert (let ((.def_12885 (= E_M (_ bv1 32)))).def_12885))
(assert (let ((.def_12888 (= E_3 (_ bv1 32)))).def_12888))
(assert (let ((.def_9620 (= m_st (_ bv0 32)))).def_9620))
(assert (let ((.def_18452 (= local (_ bv0 32)))).def_18452))
(assert (let ((.def_18454 (= token (_ bv0 32)))).def_18454))
(assert (let ((.def_12900 (= E_1 (_ bv1 32)))).def_12900))
(assert (let ((.def_18456 (= E_1 (_ bv2 32)))).def_18456))
(assert (let ((.def_12891 (= t1_st (_ bv0 32)))).def_12891))
(assert (let ((.def_12894 (= t2_st (_ bv0 32)))).def_12894))
(assert (let ((.def_24840 (= E_M (_ bv0 32)))).def_24840))
(assert (let ((.def_24842 (= E_2 (_ bv0 32)))).def_24842))
(assert (let ((.def_12897 (= t3_st (_ bv0 32)))).def_12897))
(assert (let ((.def_30852 (= E_4 (_ bv0 32)))).def_30852))
(assert (let ((.def_30854 (= E_3 (_ bv0 32)))).def_30854))
(assert (let ((.def_30857 (= T4_E (_ bv0 32)))).def_30857))
(assert (let ((.def_30860 (= T3_E (_ bv0 32)))).def_30860))
(assert (let ((.def_30863 (= T2_E (_ bv0 32)))).def_30863))
(assert (let ((.def_30866 (= T1_E (_ bv0 32)))).def_30866))
(assert (let ((.def_30869 (= M_E (_ bv0 32)))).def_30869))

