(set-info :source |printed by MathSAT|)
(declare-fun a20 () (_ BitVec 32))
(declare-fun a25 () (_ BitVec 32))
(declare-fun a12 () (_ BitVec 32))
(declare-fun a15 () (_ BitVec 32))
(declare-fun a16 () (_ BitVec 32))
(declare-fun a2 () (_ BitVec 32))
(declare-fun a27 () (_ BitVec 32))
(declare-fun a9 () (_ BitVec 32))
(declare-fun |calculate_output4::input| () (_ BitVec 32))
(declare-fun |calculate_output5::input| () (_ BitVec 32))
(declare-fun |calculate_output6::input| () (_ BitVec 32))

*:
(assert (let ((.def_105647 (= a20 (_ bv5 32)))).def_105647))

calculate_output8 N29569:
(assert false)
(assert (let ((.def_105647 (= a20 (_ bv5 32)))).def_105647))

main1 N30136:
(assert (let ((.def_105647 (= a20 (_ bv5 32)))).def_105647))
(assert (let ((.def_152234 (= a25 (_ bv1 32)))).def_152234))
(assert (let ((.def_152237 (= a12 (_ bv4 32)))).def_152237))
(assert (let ((.def_152240 (= a15 (_ bv1 32)))).def_152240))
(assert (let ((.def_152243 (= a16 (_ bv1 32)))).def_152243))
(assert (let ((.def_152246 (= a2 (_ bv10 32)))).def_152246))
(assert (let ((.def_152249 (= a27 (_ bv1 32)))).def_152249))
(assert (let ((.def_152252 (= a9 (_ bv18 32)))).def_152252))
(assert (let ((.def_317308 (= a20 (_ bv6 32)))).def_317308))
(assert (let ((.def_317310 (= a2 (_ bv13 32)))).def_317310))
(assert (let ((.def_317312 (= a12 (_ bv3 32)))).def_317312))
(assert (let ((.def_317314 (= a12 (_ bv2 32)))).def_317314))
(assert (let ((.def_317316 (= a9 (_ bv16 32)))).def_317316))
(assert (let ((.def_317318 (= a9 (_ bv17 32)))).def_317318))
(assert (let ((.def_1162932 (= a20 (_ bv7 32)))).def_1162932))
(assert (let ((.def_1162934 (= a12 (_ bv6 32)))).def_1162934))
(assert (let ((.def_1162936 (= a2 (_ bv9 32)))).def_1162936))
(assert (let ((.def_1162938 (= a2 (_ bv11 32)))).def_1162938))
(assert (let ((.def_1162940 (= a2 (_ bv12 32)))).def_1162940))
(assert (let ((.def_1162942 (= a12 (_ bv5 32)))).def_1162942))
(assert (let ((.def_1162944 (= a25 (_ bv0 32)))).def_1162944))
(assert (let ((.def_1162947 (= |calculate_output4::input| (_ bv1 32)))).def_1162947))
(assert (let ((.def_1162950 (= |calculate_output4::input| |calculate_output5::input|))).def_1162950))
(assert (let ((.def_1162953 (= |calculate_output5::input| |calculate_output6::input|))).def_1162953))
(assert (let ((.def_1162955 (= |calculate_output6::input| (_ bv1 32)))).def_1162955))

