(set-info :source |printed by MathSAT|)
(declare-fun a20 () (_ BitVec 32))
(declare-fun a9 () (_ BitVec 32))
(declare-fun a25 () (_ BitVec 32))
(declare-fun a12 () (_ BitVec 32))
(declare-fun a15 () (_ BitVec 32))
(declare-fun a16 () (_ BitVec 32))
(declare-fun a2 () (_ BitVec 32))
(declare-fun a27 () (_ BitVec 32))

*:
(assert (let ((.def_106117 (= a20 (_ bv5 32)))).def_106117))

calculate_output8 N29679:
(assert false)
(assert (let ((.def_106117 (= a20 (_ bv5 32)))).def_106117))

main1 N30136:
(assert (let ((.def_153020 (= a9 (_ bv18 32)))).def_153020))
(assert (let ((.def_106117 (= a20 (_ bv5 32)))).def_106117))
(assert (let ((.def_339623 (= a25 (_ bv1 32)))).def_339623))
(assert (let ((.def_339626 (= a12 (_ bv4 32)))).def_339626))
(assert (let ((.def_339629 (= a15 (_ bv1 32)))).def_339629))
(assert (let ((.def_339632 (= a16 (_ bv1 32)))).def_339632))
(assert (let ((.def_339635 (= a2 (_ bv10 32)))).def_339635))
(assert (let ((.def_339638 (= a27 (_ bv1 32)))).def_339638))
(assert (let ((.def_339640 (= a2 (_ bv13 32)))).def_339640))
(assert (let ((.def_339642 (= a9 (_ bv17 32)))).def_339642))
(assert (let ((.def_339644 (= a2 (_ bv9 32)))).def_339644))
(assert (let ((.def_339646 (= a2 (_ bv11 32)))).def_339646))
(assert (let ((.def_339648 (= a9 (_ bv16 32)))).def_339648))
(assert (let ((.def_339650 (= a2 (_ bv12 32)))).def_339650))
(assert (let ((.def_895507 (= a12 (_ bv3 32)))).def_895507))
(assert (let ((.def_895509 (= a12 (_ bv2 32)))).def_895509))
(assert (let ((.def_895511 (= a20 (_ bv6 32)))).def_895511))
(assert (let ((.def_895513 (= a12 (_ bv6 32)))).def_895513))
(assert (let ((.def_895515 (= a12 (_ bv5 32)))).def_895515))
(assert (let ((.def_895517 (= a20 (_ bv7 32)))).def_895517))

