(set-info :source |printed by MathSAT|)
(declare-fun |ssl3_connect::blastFlag| () (_ BitVec 32))
(declare-fun |ssl3_connect::s__state| () (_ BitVec 32))
(declare-fun |ssl3_connect::s__hit| () (_ BitVec 32))
(declare-fun |ssl3_connect::s__s3__tmp__next_state___0| () (_ BitVec 32))
(declare-fun |ssl3_connect::s__s3__tmp__new_cipher__algorithms| () (_ BitVec 32))
(declare-fun |ssl3_connect::cb| () (_ BitVec 32))
(declare-fun |ssl3_accept::blastFlag| () (_ BitVec 32))
(declare-fun |ssl3_accept::s__state| () (_ BitVec 32))
(declare-fun |ssl3_accept::s__hit| () (_ BitVec 32))
(declare-fun |ssl3_accept::s__s3__tmp__reuse_message| () (_ BitVec 32))
(declare-fun |ssl3_accept::s__s3__tmp__next_state___0| () (_ BitVec 32))
(declare-fun |ssl3_accept::s__verify_mode| () (_ BitVec 32))
(declare-fun |ssl3_accept::s__s3__tmp__new_cipher__algorithms| () (_ BitVec 32))
(declare-fun |ssl3_accept::s__session__peer| () (_ BitVec 32))
(declare-fun |ssl3_accept::skip| () (_ BitVec 32))
(declare-fun |ssl3_accept::cb| () (_ BitVec 32))

ssl3_connect:
(assert (let ((.def_678 (= |ssl3_connect::blastFlag| (_ bv5 32)))).def_678))

ssl3_connect N117:
(assert (let ((.def_1600 (= |ssl3_connect::s__state| (_ bv12292 32)))).def_1600))
(assert (let ((.def_1602 (= |ssl3_connect::blastFlag| (_ bv0 32)))).def_1602))
(assert (let ((.def_678 (= |ssl3_connect::blastFlag| (_ bv5 32)))).def_678))
(assert (let ((.def_3687 (= |ssl3_connect::s__state| (_ bv4368 32)))).def_3687))
(assert (let ((.def_3689 (= |ssl3_connect::s__state| (_ bv4384 32)))).def_3689))
(assert (let ((.def_3691 (= |ssl3_connect::blastFlag| (_ bv1 32)))).def_3691))
(assert (let ((.def_5298 (= |ssl3_connect::blastFlag| (_ bv3 32)))).def_5298))
(assert (let ((.def_5300 (= |ssl3_connect::blastFlag| (_ bv4 32)))).def_5300))
(assert (let ((.def_5302 (= |ssl3_connect::blastFlag| (_ bv2 32)))).def_5302))
(assert (let ((.def_5304 (= |ssl3_connect::s__state| (_ bv4416 32)))).def_5304))
(assert (let ((.def_5306 (= |ssl3_connect::s__state| (_ bv4433 32)))).def_5306))
(assert (let ((.def_5308 (= |ssl3_connect::s__state| (_ bv4432 32)))).def_5308))
(assert (let ((.def_10863 (= |ssl3_connect::s__state| (_ bv4099 32)))).def_10863))
(assert (let ((.def_10865 (= |ssl3_connect::s__state| (_ bv20480 32)))).def_10865))
(assert (let ((.def_10867 (= |ssl3_connect::s__state| (_ bv4096 32)))).def_10867))
(assert (let ((.def_10869 (= |ssl3_connect::s__state| (_ bv16384 32)))).def_10869))
(assert (let ((.def_10871 (= |ssl3_connect::s__state| (_ bv4369 32)))).def_10871))
(assert (let ((.def_10873 (= |ssl3_connect::s__state| (_ bv4401 32)))).def_10873))
(assert (let ((.def_10875 (= |ssl3_connect::s__state| (_ bv4400 32)))).def_10875))
(assert (let ((.def_10877 (= |ssl3_connect::s__state| (_ bv4385 32)))).def_10877))
(assert (let ((.def_10879 (= |ssl3_connect::s__state| (_ bv4352 32)))).def_10879))
(assert (let ((.def_16608 (= |ssl3_connect::s__state| (_ bv4560 32)))).def_16608))
(assert (let ((.def_16610 (= |ssl3_connect::s__state| (_ bv4512 32)))).def_16610))
(assert (let ((.def_16612 (= |ssl3_connect::s__state| (_ bv4513 32)))).def_16612))
(assert (let ((.def_16614 (= |ssl3_connect::s__state| (_ bv4481 32)))).def_16614))
(assert (let ((.def_16616 (= |ssl3_connect::s__state| (_ bv4480 32)))).def_16616))
(assert (let ((.def_16618 (= |ssl3_connect::s__state| (_ bv4467 32)))).def_16618))
(assert (let ((.def_16620 (= |ssl3_connect::s__state| (_ bv4466 32)))).def_16620))
(assert (let ((.def_16622 (= |ssl3_connect::s__state| (_ bv4465 32)))).def_16622))
(assert (let ((.def_16624 (= |ssl3_connect::s__state| (_ bv4464 32)))).def_16624))
(assert (let ((.def_16626 (= |ssl3_connect::s__state| (_ bv4449 32)))).def_16626))
(assert (let ((.def_16628 (= |ssl3_connect::s__state| (_ bv4448 32)))).def_16628))
(assert (let ((.def_16631 (= |ssl3_connect::s__hit| (_ bv0 32)))).def_16631))
(assert (let ((.def_16633 (= |ssl3_connect::s__state| (_ bv4417 32)))).def_16633))
(assert (let ((.def_16635 (= |ssl3_connect::s__state| (_ bv4496 32)))).def_16635))
(assert (let ((.def_16637 (= |ssl3_connect::s__state| (_ bv4497 32)))).def_16637))
(assert (let ((.def_16639 (= |ssl3_connect::s__state| (_ bv4528 32)))).def_16639))
(assert (let ((.def_16641 (= |ssl3_connect::s__state| (_ bv4529 32)))).def_16641))
(assert (let ((.def_16643 (= |ssl3_connect::s__state| (_ bv4561 32)))).def_16643))
(assert (let ((.def_16646 (= |ssl3_connect::s__state| |ssl3_connect::s__s3__tmp__next_state___0|))).def_16646))
(assert (let ((.def_16648 (= |ssl3_connect::s__s3__tmp__next_state___0| (_ bv4401 32)))).def_16648))
(assert (let ((.def_16651 (= |ssl3_connect::s__s3__tmp__new_cipher__algorithms| (_ bv4294967040 32)))).def_16651))
(assert (let ((.def_16654 (= |ssl3_connect::cb| (_ bv0 32)))).def_16654))
(assert (let ((.def_29108 (= |ssl3_connect::s__s3__tmp__next_state___0| (_ bv4099 32)))).def_29108))
(assert (let ((.def_29110 (= |ssl3_connect::s__s3__tmp__next_state___0| (_ bv4096 32)))).def_29110))
(assert (let ((.def_29112 (= |ssl3_connect::s__s3__tmp__next_state___0| (_ bv20480 32)))).def_29112))
(assert (let ((.def_29114 (= |ssl3_connect::s__s3__tmp__next_state___0| (_ bv16384 32)))).def_29114))
(assert (let ((.def_29116 (= |ssl3_connect::s__s3__tmp__next_state___0| (_ bv12292 32)))).def_29116))
(assert (let ((.def_29118 (= |ssl3_connect::s__s3__tmp__next_state___0| (_ bv4369 32)))).def_29118))
(assert (let ((.def_29120 (= |ssl3_connect::s__s3__tmp__next_state___0| (_ bv4368 32)))).def_29120))
(assert (let ((.def_29122 (= |ssl3_connect::s__s3__tmp__next_state___0| (_ bv4384 32)))).def_29122))
(assert (let ((.def_29124 (= |ssl3_connect::s__s3__tmp__next_state___0| (_ bv4385 32)))).def_29124))
(assert (let ((.def_29126 (= |ssl3_connect::s__s3__tmp__next_state___0| (_ bv4400 32)))).def_29126))
(assert (let ((.def_29128 (= |ssl3_connect::s__s3__tmp__next_state___0| (_ bv4416 32)))).def_29128))
(assert (let ((.def_29130 (= |ssl3_connect::s__s3__tmp__next_state___0| (_ bv4417 32)))).def_29130))
(assert (let ((.def_29132 (= |ssl3_connect::s__s3__tmp__next_state___0| (_ bv4432 32)))).def_29132))
(assert (let ((.def_29134 (= |ssl3_connect::s__s3__tmp__next_state___0| (_ bv4433 32)))).def_29134))

ssl3_connect N576:
(assert false)
(assert (let ((.def_678 (= |ssl3_connect::blastFlag| (_ bv5 32)))).def_678))

ssl3_accept N699:
(assert (let ((.def_41496 (= |ssl3_accept::blastFlag| (_ bv4 32)))).def_41496))
(assert (let ((.def_42645 (= |ssl3_accept::s__state| (_ bv8464 32)))).def_42645))
(assert (let ((.def_42647 (= |ssl3_accept::blastFlag| (_ bv0 32)))).def_42647))
(assert (let ((.def_44023 (= |ssl3_accept::s__state| (_ bv8481 32)))).def_44023))
(assert (let ((.def_44025 (= |ssl3_accept::s__state| (_ bv8480 32)))).def_44025))
(assert (let ((.def_44027 (= |ssl3_accept::s__state| (_ bv12292 32)))).def_44027))
(assert (let ((.def_44029 (= |ssl3_accept::s__state| (_ bv16384 32)))).def_44029))
(assert (let ((.def_44031 (= |ssl3_accept::s__state| (_ bv8192 32)))).def_44031))
(assert (let ((.def_44033 (= |ssl3_accept::s__state| (_ bv24576 32)))).def_44033))
(assert (let ((.def_44035 (= |ssl3_accept::s__state| (_ bv8195 32)))).def_44035))
(assert (let ((.def_44037 (= |ssl3_accept::s__state| (_ bv8482 32)))).def_44037))
(assert (let ((.def_44039 (= |ssl3_accept::blastFlag| (_ bv1 32)))).def_44039))
(assert (let ((.def_45985 (= |ssl3_accept::blastFlag| (_ bv3 32)))).def_45985))
(assert (let ((.def_45987 (= |ssl3_accept::blastFlag| (_ bv2 32)))).def_45987))
(assert (let ((.def_45989 (= |ssl3_accept::s__state| (_ bv8496 32)))).def_45989))
(assert (let ((.def_48294 (= |ssl3_accept::s__state| (_ bv8465 32)))).def_48294))
(assert (let ((.def_48296 (= |ssl3_accept::s__state| (_ bv8466 32)))).def_48296))
(assert (let ((.def_48299 (= |ssl3_accept::s__hit| (_ bv0 32)))).def_48299))
(assert (let ((.def_48301 (= |ssl3_accept::s__state| (_ bv8512 32)))).def_48301))
(assert (let ((.def_48303 (= |ssl3_accept::s__state| (_ bv8497 32)))).def_48303))
(assert (let ((.def_48305 (= |ssl3_accept::s__state| (_ bv8641 32)))).def_48305))
(assert (let ((.def_48307 (= |ssl3_accept::s__state| (_ bv8448 32)))).def_48307))
(assert (let ((.def_48309 (= |ssl3_accept::s__state| (_ bv8640 32)))).def_48309))
(assert (let ((.def_51434 (= |ssl3_accept::s__s3__tmp__reuse_message| (_ bv0 32)))).def_51434))
(assert (let ((.def_51436 (= |ssl3_accept::s__state| (_ bv8528 32)))).def_51436))
(assert (let ((.def_51438 (= |ssl3_accept::s__state| (_ bv8544 32)))).def_51438))
(assert (let ((.def_51440 (= |ssl3_accept::s__state| (_ bv8560 32)))).def_51440))
(assert (let ((.def_51442 (= |ssl3_accept::s__state| (_ bv8608 32)))).def_51442))
(assert (let ((.def_51444 (= |ssl3_accept::s__state| (_ bv8609 32)))).def_51444))
(assert (let ((.def_51447 (= |ssl3_accept::s__s3__tmp__next_state___0| (_ bv8482 32)))).def_51447))
(assert (let ((.def_51449 (= |ssl3_accept::s__state| (_ bv8657 32)))).def_51449))
(assert (let ((.def_51451 (= |ssl3_accept::s__state| (_ bv8656 32)))).def_51451))
(assert (let ((.def_51453 (= |ssl3_accept::s__state| (_ bv8592 32)))).def_51453))
(assert (let ((.def_51455 (= |ssl3_accept::s__state| |ssl3_accept::s__s3__tmp__next_state___0|))).def_51455))
(assert (let ((.def_51457 (= |ssl3_accept::s__s3__tmp__next_state___0| (_ bv8576 32)))).def_51457))
(assert (let ((.def_51459 (= |ssl3_accept::s__s3__tmp__next_state___0| (_ bv8640 32)))).def_51459))
(assert (let ((.def_51461 (= |ssl3_accept::s__state| (_ bv8576 32)))).def_51461))
(assert (let ((.def_55327 (= |ssl3_accept::s__state| (_ bv8672 32)))).def_55327))
(assert (let ((.def_55329 (= |ssl3_accept::s__state| (_ bv8593 32)))).def_55329))
(assert (let ((.def_55331 (= |ssl3_accept::s__state| (_ bv8577 32)))).def_55331))
(assert (let ((.def_55333 (= |ssl3_accept::s__state| (_ bv8561 32)))).def_55333))
(assert (let ((.def_55335 (= |ssl3_accept::s__state| (_ bv8545 32)))).def_55335))
(assert (let ((.def_55337 (= |ssl3_accept::s__state| (_ bv8529 32)))).def_55337))
(assert (let ((.def_55339 (= |ssl3_accept::s__state| (_ bv8513 32)))).def_55339))
(assert (let ((.def_55341 (= |ssl3_accept::s__s3__tmp__next_state___0| (_ bv8448 32)))).def_55341))
(assert (let ((.def_55343 (= |ssl3_accept::s__state| (_ bv8673 32)))).def_55343))
(assert (let ((.def_80291 (= |ssl3_accept::s__verify_mode| (_ bv4294967295 32)))).def_80291))
(assert (let ((.def_80293 (= |ssl3_accept::s__s3__tmp__next_state___0| (_ bv8512 32)))).def_80293))
(assert (let ((.def_80295 (= |ssl3_accept::s__s3__tmp__next_state___0| (_ bv8513 32)))).def_80295))
(assert (let ((.def_80298 (= |ssl3_accept::s__s3__tmp__new_cipher__algorithms| (_ bv4294967040 32)))).def_80298))
(assert (let ((.def_80300 (= |ssl3_accept::s__verify_mode| (_ bv4294967294 32)))).def_80300))
(assert (let ((.def_80303 (= |ssl3_accept::s__session__peer| (_ bv0 32)))).def_80303))
(assert (let ((.def_80305 (= |ssl3_accept::s__verify_mode| (_ bv4294967292 32)))).def_80305))
(assert (let ((.def_80307 (= |ssl3_accept::s__s3__tmp__next_state___0| (_ bv8577 32)))).def_80307))
(assert (let ((.def_80309 (= |ssl3_accept::s__s3__tmp__next_state___0| (_ bv8592 32)))).def_80309))
(assert (let ((.def_80311 (= |ssl3_accept::s__s3__tmp__next_state___0| (_ bv8497 32)))).def_80311))
(assert (let ((.def_80313 (= |ssl3_accept::s__s3__tmp__next_state___0| (_ bv8496 32)))).def_80313))
(assert (let ((.def_80315 (= |ssl3_accept::s__s3__tmp__next_state___0| (_ bv8561 32)))).def_80315))
(assert (let ((.def_80317 (= |ssl3_accept::s__s3__tmp__next_state___0| (_ bv8544 32)))).def_80317))
(assert (let ((.def_80319 (= |ssl3_accept::s__s3__tmp__next_state___0| (_ bv8560 32)))).def_80319))
(assert (let ((.def_80321 (= |ssl3_accept::s__s3__tmp__next_state___0| (_ bv8545 32)))).def_80321))
(assert (let ((.def_80323 (= |ssl3_accept::s__s3__tmp__next_state___0| (_ bv8529 32)))).def_80323))
(assert (let ((.def_80325 (= |ssl3_accept::s__s3__tmp__next_state___0| (_ bv8528 32)))).def_80325))
(assert (let ((.def_80327 (= |ssl3_accept::s__s3__tmp__next_state___0| (_ bv3 32)))).def_80327))
(assert (let ((.def_80330 (= |ssl3_accept::skip| (_ bv1 32)))).def_80330))
(assert (let ((.def_80332 (= |ssl3_accept::s__s3__tmp__next_state___0| (_ bv8593 32)))).def_80332))
(assert (let ((.def_80334 (= |ssl3_accept::s__s3__tmp__next_state___0| (_ bv8608 32)))).def_80334))
(assert (let ((.def_80336 (= |ssl3_accept::s__s3__tmp__next_state___0| (_ bv8609 32)))).def_80336))
(assert (let ((.def_80338 (= |ssl3_accept::s__s3__tmp__next_state___0| (_ bv8195 32)))).def_80338))
(assert (let ((.def_80340 (= |ssl3_accept::s__s3__tmp__next_state___0| (_ bv24576 32)))).def_80340))
(assert (let ((.def_80342 (= |ssl3_accept::s__s3__tmp__next_state___0| (_ bv8192 32)))).def_80342))
(assert (let ((.def_80344 (= |ssl3_accept::s__s3__tmp__next_state___0| (_ bv16384 32)))).def_80344))
(assert (let ((.def_80346 (= |ssl3_accept::s__s3__tmp__next_state___0| (_ bv12292 32)))).def_80346))
(assert (let ((.def_80348 (= |ssl3_accept::s__s3__tmp__next_state___0| (_ bv8466 32)))).def_80348))
(assert (let ((.def_80350 (= |ssl3_accept::s__s3__tmp__next_state___0| (_ bv8465 32)))).def_80350))
(assert (let ((.def_80352 (= |ssl3_accept::s__s3__tmp__next_state___0| (_ bv8464 32)))).def_80352))
(assert (let ((.def_80354 (= |ssl3_accept::s__s3__tmp__next_state___0| (_ bv8481 32)))).def_80354))
(assert (let ((.def_80356 (= |ssl3_accept::s__s3__tmp__next_state___0| (_ bv8480 32)))).def_80356))
(assert (let ((.def_80358 (= |ssl3_accept::s__s3__tmp__next_state___0| (_ bv8641 32)))).def_80358))
(assert (let ((.def_80361 (= |ssl3_accept::cb| (_ bv0 32)))).def_80361))

ssl3_accept N1219:
(assert false)

