(set-info :source |printed by MathSAT|)
(declare-fun a20 () (_ BitVec 32))
(declare-fun a9 () (_ BitVec 32))
(declare-fun a25 () (_ BitVec 32))
(declare-fun a12 () (_ BitVec 32))
(declare-fun a15 () (_ BitVec 32))
(declare-fun a16 () (_ BitVec 32))
(declare-fun a2 () (_ BitVec 32))
(declare-fun a27 () (_ BitVec 32))
(declare-fun |calculate_output6::input| () (_ BitVec 32))
(declare-fun |calculate_output7::input| () (_ BitVec 32))
(declare-fun |calculate_output8::input| () (_ BitVec 32))
(declare-fun |calculate_output2::input| () (_ BitVec 32))
(declare-fun |calculate_output5::input| () (_ BitVec 32))

*:
(assert (let ((.def_106295 (= a20 (_ bv5 32)))).def_106295))

calculate_output8 N29701:
(assert false)
(assert (let ((.def_106295 (= a20 (_ bv5 32)))).def_106295))

main1 N30136:
(assert (let ((.def_153174 (= a9 (_ bv18 32)))).def_153174))
(assert (let ((.def_106295 (= a20 (_ bv5 32)))).def_106295))
(assert (let ((.def_339873 (= a25 (_ bv1 32)))).def_339873))
(assert (let ((.def_339876 (= a12 (_ bv4 32)))).def_339876))
(assert (let ((.def_339879 (= a15 (_ bv1 32)))).def_339879))
(assert (let ((.def_339882 (= a16 (_ bv1 32)))).def_339882))
(assert (let ((.def_339885 (= a2 (_ bv10 32)))).def_339885))
(assert (let ((.def_339888 (= a27 (_ bv1 32)))).def_339888))
(assert (let ((.def_339890 (= a20 (_ bv6 32)))).def_339890))
(assert (let ((.def_339892 (= a2 (_ bv13 32)))).def_339892))
(assert (let ((.def_339894 (= a12 (_ bv2 32)))).def_339894))
(assert (let ((.def_339896 (= a2 (_ bv12 32)))).def_339896))
(assert (let ((.def_339898 (= a2 (_ bv11 32)))).def_339898))
(assert (let ((.def_339900 (= a9 (_ bv16 32)))).def_339900))
(assert (let ((.def_339902 (= a9 (_ bv17 32)))).def_339902))
(assert (let ((.def_1395515 (= a20 (_ bv7 32)))).def_1395515))
(assert (let ((.def_1395517 (= a2 (_ bv9 32)))).def_1395517))
(assert (let ((.def_1395519 (= a12 (_ bv6 32)))).def_1395519))
(assert (let ((.def_1395521 (= a12 (_ bv5 32)))).def_1395521))
(assert (let ((.def_1395523 (= a12 (_ bv3 32)))).def_1395523))
(assert (let ((.def_1395526 (= |calculate_output6::input| (_ bv6 32)))).def_1395526))
(assert (let ((.def_1395528 (= |calculate_output6::input| (_ bv2 32)))).def_1395528))
(assert (let ((.def_1395531 (= |calculate_output6::input| |calculate_output7::input|))).def_1395531))
(assert (let ((.def_1395534 (= |calculate_output8::input| (_ bv5 32)))).def_1395534))
(assert (let ((.def_1395536 (= |calculate_output8::input| (_ bv4 32)))).def_1395536))
(assert (let ((.def_1395538 (= |calculate_output6::input| (_ bv1 32)))).def_1395538))
(assert (let ((.def_1395540 (= |calculate_output6::input| (_ bv3 32)))).def_1395540))
(assert (let ((.def_1395542 (= |calculate_output7::input| (_ bv3 32)))).def_1395542))
(assert (let ((.def_1395544 (= |calculate_output7::input| (_ bv1 32)))).def_1395544))
(assert (let ((.def_1395546 (= |calculate_output7::input| |calculate_output8::input|))).def_1395546))
(assert (let ((.def_1395549 (= |calculate_output2::input| (_ bv1 32)))).def_1395549))
(assert (let ((.def_1395551 (= |calculate_output2::input| (_ bv4 32)))).def_1395551))
(assert (let ((.def_1395553 (= |calculate_output2::input| (_ bv2 32)))).def_1395553))
(assert (let ((.def_1395556 (= |calculate_output5::input| (_ bv4 32)))).def_1395556))
(assert (let ((.def_1395558 (= |calculate_output6::input| (_ bv4 32)))).def_1395558))
(assert (let ((.def_1395560 (= |calculate_output6::input| |calculate_output5::input|))).def_1395560))
(assert (let ((.def_1395562 (= |calculate_output7::input| (_ bv4 32)))).def_1395562))
(assert (let ((.def_1395564 (= |calculate_output2::input| (_ bv6 32)))).def_1395564))
(assert (let ((.def_1395566 (= |calculate_output7::input| (_ bv6 32)))).def_1395566))

