(set-info :source |printed by MathSAT|)
(declare-fun |ssl3_connect::blastFlag| () (_ BitVec 32))
(declare-fun |ssl3_connect::s__state| () (_ BitVec 32))
(declare-fun |ssl3_connect::s__s3__tmp__reuse_message| () (_ BitVec 32))
(declare-fun |ssl3_connect::s__hit| () (_ BitVec 32))
(declare-fun |ssl3_connect::s__s3__tmp__next_state___0| () (_ BitVec 32))
(declare-fun |ssl3_connect::skip| () (_ BitVec 32))
(declare-fun |ssl3_connect::s__s3__tmp__new_cipher__algorithms| () (_ BitVec 32))
(declare-fun |ssl3_connect::cb| () (_ BitVec 32))
(declare-fun |ssl3_accept::s__state| () (_ BitVec 32))
(declare-fun |ssl3_accept::blastFlag| () (_ BitVec 32))
(declare-fun |ssl3_accept::s__s3__tmp__reuse_message| () (_ BitVec 32))
(declare-fun |ssl3_accept::s__hit| () (_ BitVec 32))
(declare-fun |ssl3_accept::s__s3__tmp__next_state___0| () (_ BitVec 32))
(declare-fun |ssl3_accept::s__init_buf___0| () (_ BitVec 32))
(declare-fun |ssl3_accept::s__s3__tmp__new_cipher__algorithms| () (_ BitVec 32))
(declare-fun |ssl3_accept::s__verify_mode| () (_ BitVec 32))
(declare-fun |ssl3_accept::s__session__peer| () (_ BitVec 32))

ssl3_connect:
(assert (let ((.def_558 (= |ssl3_connect::blastFlag| (_ bv5 32)))).def_558))

ssl3_connect N85:
(assert (let ((.def_1407 (= |ssl3_connect::s__state| (_ bv12292 32)))).def_1407))
(assert (let ((.def_1409 (= |ssl3_connect::blastFlag| (_ bv0 32)))).def_1409))
(assert (let ((.def_558 (= |ssl3_connect::blastFlag| (_ bv5 32)))).def_558))
(assert (let ((.def_3367 (= |ssl3_connect::s__s3__tmp__reuse_message| (_ bv0 32)))).def_3367))
(assert (let ((.def_3369 (= |ssl3_connect::blastFlag| (_ bv4 32)))).def_3369))
(assert (let ((.def_3371 (= |ssl3_connect::blastFlag| (_ bv3 32)))).def_3371))
(assert (let ((.def_3373 (= |ssl3_connect::s__state| (_ bv4384 32)))).def_3373))
(assert (let ((.def_3375 (= |ssl3_connect::blastFlag| (_ bv1 32)))).def_3375))
(assert (let ((.def_3377 (= |ssl3_connect::s__state| (_ bv4368 32)))).def_3377))
(assert (let ((.def_3379 (= |ssl3_connect::blastFlag| (_ bv2 32)))).def_3379))
(assert (let ((.def_7473 (= |ssl3_connect::s__hit| (_ bv0 32)))).def_7473))
(assert (let ((.def_7476 (= |ssl3_connect::s__state| |ssl3_connect::s__s3__tmp__next_state___0|))).def_7476))
(assert (let ((.def_7478 (= |ssl3_connect::s__s3__tmp__next_state___0| (_ bv4401 32)))).def_7478))
(assert (let ((.def_7480 (= |ssl3_connect::s__state| (_ bv4352 32)))).def_7480))
(assert (let ((.def_7482 (= |ssl3_connect::s__state| (_ bv4560 32)))).def_7482))
(assert (let ((.def_7484 (= |ssl3_connect::s__state| (_ bv4416 32)))).def_7484))
(assert (let ((.def_7486 (= |ssl3_connect::s__state| (_ bv4400 32)))).def_7486))
(assert (let ((.def_7488 (= |ssl3_connect::s__state| (_ bv4432 32)))).def_7488))
(assert (let ((.def_7490 (= |ssl3_connect::s__state| (_ bv4529 32)))).def_7490))
(assert (let ((.def_7492 (= |ssl3_connect::s__state| (_ bv4528 32)))).def_7492))
(assert (let ((.def_7494 (= |ssl3_connect::s__state| (_ bv4401 32)))).def_7494))
(assert (let ((.def_7497 (= |ssl3_connect::skip| (_ bv0 32)))).def_7497))
(assert (let ((.def_7499 (= |ssl3_connect::s__state| (_ bv4417 32)))).def_7499))
(assert (let ((.def_7501 (= |ssl3_connect::s__state| (_ bv4480 32)))).def_7501))
(assert (let ((.def_7503 (= |ssl3_connect::s__state| (_ bv4449 32)))).def_7503))
(assert (let ((.def_7505 (= |ssl3_connect::s__state| (_ bv4448 32)))).def_7505))
(assert (let ((.def_7507 (= |ssl3_connect::s__state| (_ bv4481 32)))).def_7507))
(assert (let ((.def_7509 (= |ssl3_connect::s__s3__tmp__next_state___0| (_ bv4432 32)))).def_7509))
(assert (let ((.def_7512 (= |ssl3_connect::s__s3__tmp__new_cipher__algorithms| (_ bv4294967040 32)))).def_7512))
(assert (let ((.def_7514 (= |ssl3_connect::s__state| (_ bv4433 32)))).def_7514))
(assert (let ((.def_7517 (= |ssl3_connect::cb| (_ bv0 32)))).def_7517))
(assert (let ((.def_7519 (= |ssl3_connect::s__s3__tmp__next_state___0| (_ bv4433 32)))).def_7519))
(assert (let ((.def_17058 (= |ssl3_connect::s__s3__tmp__next_state___0| (_ bv4099 32)))).def_17058))
(assert (let ((.def_17060 (= |ssl3_connect::s__s3__tmp__next_state___0| (_ bv12292 32)))).def_17060))
(assert (let ((.def_17062 (= |ssl3_connect::s__s3__tmp__next_state___0| (_ bv16384 32)))).def_17062))
(assert (let ((.def_17064 (= |ssl3_connect::s__s3__tmp__next_state___0| (_ bv4096 32)))).def_17064))
(assert (let ((.def_17066 (= |ssl3_connect::s__s3__tmp__next_state___0| (_ bv20480 32)))).def_17066))
(assert (let ((.def_17068 (= |ssl3_connect::s__state| (_ bv4096 32)))).def_17068))
(assert (let ((.def_17070 (= |ssl3_connect::s__state| (_ bv4099 32)))).def_17070))
(assert (let ((.def_17072 (= |ssl3_connect::s__state| (_ bv20480 32)))).def_17072))
(assert (let ((.def_17074 (= |ssl3_connect::s__state| (_ bv16384 32)))).def_17074))
(assert (let ((.def_17076 (= |ssl3_connect::s__s3__tmp__next_state___0| (_ bv4368 32)))).def_17076))
(assert (let ((.def_17078 (= |ssl3_connect::s__s3__tmp__next_state___0| (_ bv4369 32)))).def_17078))
(assert (let ((.def_17080 (= |ssl3_connect::s__state| (_ bv4385 32)))).def_17080))
(assert (let ((.def_17082 (= |ssl3_connect::s__state| (_ bv4369 32)))).def_17082))
(assert (let ((.def_17084 (= |ssl3_connect::s__s3__tmp__next_state___0| (_ bv4384 32)))).def_17084))
(assert (let ((.def_17086 (= |ssl3_connect::s__s3__tmp__next_state___0| (_ bv4385 32)))).def_17086))
(assert (let ((.def_17088 (= |ssl3_connect::s__state| (_ bv4496 32)))).def_17088))
(assert (let ((.def_17090 (= |ssl3_connect::s__s3__tmp__next_state___0| (_ bv4400 32)))).def_17090))
(assert (let ((.def_17092 (= |ssl3_connect::s__state| (_ bv4512 32)))).def_17092))
(assert (let ((.def_17094 (= |ssl3_connect::s__s3__tmp__next_state___0| (_ bv4528 32)))).def_17094))
(assert (let ((.def_17096 (= |ssl3_connect::s__s3__tmp__next_state___0| (_ bv4529 32)))).def_17096))
(assert (let ((.def_17098 (= |ssl3_connect::s__s3__tmp__next_state___0| (_ bv3 32)))).def_17098))
(assert (let ((.def_17100 (= |ssl3_connect::s__s3__tmp__next_state___0| (_ bv4560 32)))).def_17100))
(assert (let ((.def_17102 (= |ssl3_connect::s__s3__tmp__next_state___0| (_ bv4416 32)))).def_17102))
(assert (let ((.def_17104 (= |ssl3_connect::s__state| (_ bv4513 32)))).def_17104))
(assert (let ((.def_17106 (= |ssl3_connect::s__state| (_ bv4467 32)))).def_17106))
(assert (let ((.def_17108 (= |ssl3_connect::s__state| (_ bv4466 32)))).def_17108))
(assert (let ((.def_17110 (= |ssl3_connect::s__state| (_ bv4465 32)))).def_17110))
(assert (let ((.def_17112 (= |ssl3_connect::s__state| (_ bv4464 32)))).def_17112))

ssl3_connect N565:
(assert false)
(assert (let ((.def_558 (= |ssl3_connect::blastFlag| (_ bv5 32)))).def_558))

ssl3_accept N688:
(assert (let ((.def_29806 (= |ssl3_accept::s__state| (_ bv8464 32)))).def_29806))
(assert (let ((.def_31015 (= |ssl3_accept::s__state| (_ bv8482 32)))).def_31015))
(assert (let ((.def_31018 (= |ssl3_accept::blastFlag| (_ bv0 32)))).def_31018))
(assert (let ((.def_31020 (= |ssl3_accept::blastFlag| (_ bv8 32)))).def_31020))
(assert (let ((.def_31022 (= |ssl3_accept::blastFlag| (_ bv5 32)))).def_31022))
(assert (let ((.def_32528 (= |ssl3_accept::s__state| (_ bv8481 32)))).def_32528))
(assert (let ((.def_32530 (= |ssl3_accept::s__state| (_ bv8480 32)))).def_32530))
(assert (let ((.def_32532 (= |ssl3_accept::s__state| (_ bv12292 32)))).def_32532))
(assert (let ((.def_32534 (= |ssl3_accept::s__state| (_ bv16384 32)))).def_32534))
(assert (let ((.def_32536 (= |ssl3_accept::s__state| (_ bv8192 32)))).def_32536))
(assert (let ((.def_32538 (= |ssl3_accept::s__state| (_ bv24576 32)))).def_32538))
(assert (let ((.def_32540 (= |ssl3_accept::s__state| (_ bv8195 32)))).def_32540))
(assert (let ((.def_32542 (= |ssl3_accept::s__state| (_ bv8496 32)))).def_32542))
(assert (let ((.def_32544 (= |ssl3_accept::blastFlag| (_ bv1 32)))).def_32544))
(assert (let ((.def_32546 (= |ssl3_accept::s__state| (_ bv8512 32)))).def_32546))
(assert (let ((.def_34576 (= |ssl3_accept::s__s3__tmp__reuse_message| (_ bv0 32)))).def_34576))
(assert (let ((.def_34578 (= |ssl3_accept::s__state| (_ bv8657 32)))).def_34578))
(assert (let ((.def_34580 (= |ssl3_accept::blastFlag| (_ bv2 32)))).def_34580))
(assert (let ((.def_34582 (= |ssl3_accept::s__state| (_ bv8656 32)))).def_34582))
(assert (let ((.def_34584 (= |ssl3_accept::s__state| (_ bv8641 32)))).def_34584))
(assert (let ((.def_34586 (= |ssl3_accept::s__state| (_ bv8640 32)))).def_34586))
(assert (let ((.def_34588 (= |ssl3_accept::s__state| (_ bv8609 32)))).def_34588))
(assert (let ((.def_34590 (= |ssl3_accept::s__state| (_ bv8608 32)))).def_34590))
(assert (let ((.def_34592 (= |ssl3_accept::s__state| (_ bv8593 32)))).def_34592))
(assert (let ((.def_34594 (= |ssl3_accept::s__state| (_ bv8592 32)))).def_34594))
(assert (let ((.def_34596 (= |ssl3_accept::s__state| (_ bv8577 32)))).def_34596))
(assert (let ((.def_34598 (= |ssl3_accept::s__state| (_ bv8576 32)))).def_34598))
(assert (let ((.def_34600 (= |ssl3_accept::s__state| (_ bv8448 32)))).def_34600))
(assert (let ((.def_34602 (= |ssl3_accept::s__state| (_ bv8560 32)))).def_34602))
(assert (let ((.def_34604 (= |ssl3_accept::s__state| (_ bv8544 32)))).def_34604))
(assert (let ((.def_34606 (= |ssl3_accept::s__state| (_ bv8545 32)))).def_34606))
(assert (let ((.def_34608 (= |ssl3_accept::s__state| (_ bv8466 32)))).def_34608))
(assert (let ((.def_34610 (= |ssl3_accept::s__state| (_ bv8528 32)))).def_34610))
(assert (let ((.def_40799 (= |ssl3_accept::s__state| (_ bv8465 32)))).def_40799))
(assert (let ((.def_40802 (= |ssl3_accept::s__hit| (_ bv0 32)))).def_40802))
(assert (let ((.def_40804 (= |ssl3_accept::blastFlag| (_ bv7 32)))).def_40804))
(assert (let ((.def_40806 (= |ssl3_accept::blastFlag| (_ bv3 32)))).def_40806))
(assert (let ((.def_40808 (= |ssl3_accept::blastFlag| (_ bv6 32)))).def_40808))
(assert (let ((.def_40810 (= |ssl3_accept::blastFlag| (_ bv4 32)))).def_40810))
(assert (let ((.def_40813 (= |ssl3_accept::s__state| |ssl3_accept::s__s3__tmp__next_state___0|))).def_40813))
(assert (let ((.def_40815 (= |ssl3_accept::s__s3__tmp__next_state___0| (_ bv8576 32)))).def_40815))
(assert (let ((.def_40817 (= |ssl3_accept::s__s3__tmp__next_state___0| (_ bv8608 32)))).def_40817))
(assert (let ((.def_40819 (= |ssl3_accept::s__s3__tmp__next_state___0| (_ bv8609 32)))).def_40819))
(assert (let ((.def_40821 (= |ssl3_accept::s__s3__tmp__next_state___0| (_ bv8641 32)))).def_40821))
(assert (let ((.def_40823 (= |ssl3_accept::s__s3__tmp__next_state___0| (_ bv8640 32)))).def_40823))
(assert (let ((.def_40825 (= |ssl3_accept::s__state| (_ bv8497 32)))).def_40825))
(assert (let ((.def_40827 (= |ssl3_accept::s__state| (_ bv8513 32)))).def_40827))
(assert (let ((.def_40829 (= |ssl3_accept::s__state| (_ bv8529 32)))).def_40829))
(assert (let ((.def_73328 (= |ssl3_accept::s__init_buf___0| (_ bv0 32)))).def_73328))
(assert (let ((.def_73330 (= |ssl3_accept::s__state| (_ bv8672 32)))).def_73330))
(assert (let ((.def_73332 (= |ssl3_accept::s__state| (_ bv8561 32)))).def_73332))
(assert (let ((.def_73335 (= |ssl3_accept::s__s3__tmp__new_cipher__algorithms| (_ bv4294967266 32)))).def_73335))
(assert (let ((.def_73337 (= |ssl3_accept::s__s3__tmp__new_cipher__algorithms| (_ bv4294967040 32)))).def_73337))
(assert (let ((.def_73339 (= |ssl3_accept::s__s3__tmp__next_state___0| (_ bv8544 32)))).def_73339))
(assert (let ((.def_73341 (= |ssl3_accept::s__s3__tmp__next_state___0| (_ bv8545 32)))).def_73341))
(assert (let ((.def_73343 (= |ssl3_accept::s__s3__tmp__next_state___0| (_ bv8560 32)))).def_73343))
(assert (let ((.def_73345 (= |ssl3_accept::s__s3__tmp__next_state___0| (_ bv8561 32)))).def_73345))
(assert (let ((.def_73347 (= |ssl3_accept::s__s3__tmp__next_state___0| (_ bv12292 32)))).def_73347))
(assert (let ((.def_73349 (= |ssl3_accept::s__s3__tmp__next_state___0| (_ bv16384 32)))).def_73349))
(assert (let ((.def_73351 (= |ssl3_accept::s__s3__tmp__next_state___0| (_ bv8192 32)))).def_73351))
(assert (let ((.def_73353 (= |ssl3_accept::s__s3__tmp__next_state___0| (_ bv24576 32)))).def_73353))
(assert (let ((.def_73355 (= |ssl3_accept::s__s3__tmp__next_state___0| (_ bv8195 32)))).def_73355))
(assert (let ((.def_73357 (= |ssl3_accept::s__s3__tmp__next_state___0| (_ bv8480 32)))).def_73357))
(assert (let ((.def_73359 (= |ssl3_accept::s__s3__tmp__next_state___0| (_ bv8481 32)))).def_73359))
(assert (let ((.def_73361 (= |ssl3_accept::s__s3__tmp__next_state___0| (_ bv8482 32)))).def_73361))
(assert (let ((.def_73363 (= |ssl3_accept::s__s3__tmp__next_state___0| (_ bv8464 32)))).def_73363))
(assert (let ((.def_73365 (= |ssl3_accept::s__s3__tmp__next_state___0| (_ bv8465 32)))).def_73365))
(assert (let ((.def_73367 (= |ssl3_accept::s__s3__tmp__next_state___0| (_ bv8466 32)))).def_73367))
(assert (let ((.def_73369 (= |ssl3_accept::s__s3__tmp__next_state___0| (_ bv8496 32)))).def_73369))
(assert (let ((.def_73371 (= |ssl3_accept::s__s3__tmp__next_state___0| (_ bv8497 32)))).def_73371))
(assert (let ((.def_73373 (= |ssl3_accept::s__s3__tmp__next_state___0| (_ bv8512 32)))).def_73373))
(assert (let ((.def_73375 (= |ssl3_accept::s__s3__tmp__next_state___0| (_ bv8513 32)))).def_73375))
(assert (let ((.def_73377 (= |ssl3_accept::s__s3__tmp__next_state___0| (_ bv8528 32)))).def_73377))
(assert (let ((.def_73379 (= |ssl3_accept::s__s3__tmp__next_state___0| (_ bv8529 32)))).def_73379))
(assert (let ((.def_73381 (= |ssl3_accept::s__s3__tmp__next_state___0| (_ bv8448 32)))).def_73381))
(assert (let ((.def_73383 (= |ssl3_accept::s__s3__tmp__next_state___0| (_ bv8577 32)))).def_73383))
(assert (let ((.def_73385 (= |ssl3_accept::s__s3__tmp__next_state___0| (_ bv8592 32)))).def_73385))
(assert (let ((.def_73387 (= |ssl3_accept::s__s3__tmp__next_state___0| (_ bv8593 32)))).def_73387))
(assert (let ((.def_73389 (= |ssl3_accept::s__s3__tmp__next_state___0| (_ bv8672 32)))).def_73389))
(assert (let ((.def_73391 (= |ssl3_accept::s__s3__tmp__next_state___0| (_ bv3 32)))).def_73391))
(assert (let ((.def_73394 (= |ssl3_accept::s__verify_mode| (_ bv4294967295 32)))).def_73394))
(assert (let ((.def_73396 (= |ssl3_accept::s__verify_mode| (_ bv4294967292 32)))).def_73396))
(assert (let ((.def_73399 (= |ssl3_accept::s__session__peer| (_ bv0 32)))).def_73399))
(assert (let ((.def_73401 (= |ssl3_accept::s__verify_mode| (_ bv4294967294 32)))).def_73401))

ssl3_accept N1225:
(assert false)

