(set-info :source |printed by MathSAT|)
(declare-fun c_last_read () (_ BitVec 32))
(declare-fun p_last_write () (_ BitVec 32))
(declare-fun c_num_read () (_ BitVec 32))
(declare-fun p_num_write () (_ BitVec 32))
(declare-fun c_dr_pc () (_ BitVec 32))
(declare-fun c_dr_st () (_ BitVec 32))
(declare-fun m_pc () (_ BitVec 32))
(declare-fun t1_pc () (_ BitVec 32))
(declare-fun t2_pc () (_ BitVec 32))
(declare-fun t3_pc () (_ BitVec 32))
(declare-fun t4_pc () (_ BitVec 32))
(declare-fun t5_pc () (_ BitVec 32))
(declare-fun t6_pc () (_ BitVec 32))
(declare-fun t7_pc () (_ BitVec 32))
(declare-fun t8_pc () (_ BitVec 32))
(declare-fun t9_pc () (_ BitVec 32))
(declare-fun t10_pc () (_ BitVec 32))
(declare-fun t11_pc () (_ BitVec 32))
(declare-fun m_st () (_ BitVec 32))

*:
(assert (let ((.def_782 (= c_last_read p_last_write))).def_782))
(assert (let ((.def_791 (= c_num_read p_num_write))).def_791))

error1 N4:
(assert false)
(assert (let ((.def_782 (= c_last_read p_last_write))).def_782))
(assert (let ((.def_791 (= c_num_read p_num_write))).def_791))

eval1 N282:
(assert (let ((.def_942 (= c_dr_pc (_ bv0 32)))).def_942))
(assert (let ((.def_782 (= c_last_read p_last_write))).def_782))
(assert (let ((.def_791 (= c_num_read p_num_write))).def_791))
(assert (let ((.def_1433 (= c_dr_pc (_ bv2 32)))).def_1433))
(assert (let ((.def_1436 (= c_dr_st (_ bv0 32)))).def_1436))

start_simulation1 N338:
(assert (let ((.def_942 (= c_dr_pc (_ bv0 32)))).def_942))
(assert (let ((.def_782 (= c_last_read p_last_write))).def_782))
(assert (let ((.def_791 (= c_num_read p_num_write))).def_791))
(assert (let ((.def_1433 (= c_dr_pc (_ bv2 32)))).def_1433))

error2 N393:
(assert false)
(assert (let ((.def_782 (= c_last_read p_last_write))).def_782))
(assert (let ((.def_791 (= c_num_read p_num_write))).def_791))

eval2 N1080:
(assert (let ((.def_5294 (= m_pc (_ bv0 32)))).def_5294))
(assert (let ((.def_782 (= c_last_read p_last_write))).def_782))
(assert (let ((.def_791 (= c_num_read p_num_write))).def_791))
(assert (let ((.def_16159 (= t1_pc (_ bv0 32)))).def_16159))
(assert (let ((.def_16162 (= t2_pc (_ bv0 32)))).def_16162))
(assert (let ((.def_16165 (= t3_pc (_ bv0 32)))).def_16165))
(assert (let ((.def_16168 (= t4_pc (_ bv0 32)))).def_16168))
(assert (let ((.def_16171 (= t5_pc (_ bv0 32)))).def_16171))
(assert (let ((.def_16174 (= t6_pc (_ bv0 32)))).def_16174))
(assert (let ((.def_16177 (= t7_pc (_ bv0 32)))).def_16177))
(assert (let ((.def_16180 (= t8_pc (_ bv0 32)))).def_16180))
(assert (let ((.def_16183 (= t9_pc (_ bv0 32)))).def_16183))
(assert (let ((.def_16186 (= t10_pc (_ bv0 32)))).def_16186))
(assert (let ((.def_16189 (= t11_pc (_ bv0 32)))).def_16189))
(assert (let ((.def_16191 (= m_pc (_ bv1 32)))).def_16191))
(assert (let ((.def_16193 (= t1_pc (_ bv1 32)))).def_16193))
(assert (let ((.def_16195 (= t2_pc (_ bv1 32)))).def_16195))
(assert (let ((.def_16197 (= t3_pc (_ bv1 32)))).def_16197))
(assert (let ((.def_16199 (= t4_pc (_ bv1 32)))).def_16199))
(assert (let ((.def_16201 (= t5_pc (_ bv1 32)))).def_16201))
(assert (let ((.def_16203 (= t6_pc (_ bv1 32)))).def_16203))
(assert (let ((.def_16205 (= t7_pc (_ bv1 32)))).def_16205))
(assert (let ((.def_16207 (= t8_pc (_ bv1 32)))).def_16207))
(assert (let ((.def_16209 (= t9_pc (_ bv1 32)))).def_16209))
(assert (let ((.def_16211 (= t10_pc (_ bv1 32)))).def_16211))
(assert (let ((.def_16213 (= t11_pc (_ bv1 32)))).def_16213))
(assert (let ((.def_16216 (= m_st (_ bv0 32)))).def_16216))

start_simulation2 N1640:
(assert (let ((.def_5294 (= m_pc (_ bv0 32)))).def_5294))
(assert (let ((.def_782 (= c_last_read p_last_write))).def_782))
(assert (let ((.def_791 (= c_num_read p_num_write))).def_791))
(assert (let ((.def_16159 (= t1_pc (_ bv0 32)))).def_16159))
(assert (let ((.def_16162 (= t2_pc (_ bv0 32)))).def_16162))
(assert (let ((.def_16165 (= t3_pc (_ bv0 32)))).def_16165))
(assert (let ((.def_16168 (= t4_pc (_ bv0 32)))).def_16168))
(assert (let ((.def_16171 (= t5_pc (_ bv0 32)))).def_16171))
(assert (let ((.def_16174 (= t6_pc (_ bv0 32)))).def_16174))
(assert (let ((.def_16177 (= t7_pc (_ bv0 32)))).def_16177))
(assert (let ((.def_16180 (= t8_pc (_ bv0 32)))).def_16180))
(assert (let ((.def_16183 (= t9_pc (_ bv0 32)))).def_16183))
(assert (let ((.def_16186 (= t10_pc (_ bv0 32)))).def_16186))
(assert (let ((.def_16189 (= t11_pc (_ bv0 32)))).def_16189))
(assert (let ((.def_16191 (= m_pc (_ bv1 32)))).def_16191))
(assert (let ((.def_16193 (= t1_pc (_ bv1 32)))).def_16193))
(assert (let ((.def_16195 (= t2_pc (_ bv1 32)))).def_16195))
(assert (let ((.def_16197 (= t3_pc (_ bv1 32)))).def_16197))
(assert (let ((.def_16199 (= t4_pc (_ bv1 32)))).def_16199))
(assert (let ((.def_16201 (= t5_pc (_ bv1 32)))).def_16201))
(assert (let ((.def_16203 (= t6_pc (_ bv1 32)))).def_16203))
(assert (let ((.def_16205 (= t7_pc (_ bv1 32)))).def_16205))
(assert (let ((.def_16207 (= t8_pc (_ bv1 32)))).def_16207))
(assert (let ((.def_16209 (= t9_pc (_ bv1 32)))).def_16209))
(assert (let ((.def_16211 (= t10_pc (_ bv1 32)))).def_16211))
(assert (let ((.def_16213 (= t11_pc (_ bv1 32)))).def_16213))

