(set-info :source |printed by MathSAT|)
(declare-fun a20 () (_ BitVec 32))
(declare-fun a25 () (_ BitVec 32))
(declare-fun a12 () (_ BitVec 32))
(declare-fun a15 () (_ BitVec 32))
(declare-fun a16 () (_ BitVec 32))
(declare-fun a2 () (_ BitVec 32))
(declare-fun a27 () (_ BitVec 32))
(declare-fun a9 () (_ BitVec 32))
(declare-fun m_pc () (_ BitVec 32))
(declare-fun t1_pc () (_ BitVec 32))
(declare-fun t2_pc () (_ BitVec 32))
(declare-fun t3_pc () (_ BitVec 32))
(declare-fun t4_pc () (_ BitVec 32))
(declare-fun t5_pc () (_ BitVec 32))
(declare-fun t6_pc () (_ BitVec 32))
(declare-fun t7_pc () (_ BitVec 32))
(declare-fun m_st () (_ BitVec 32))
(declare-fun t1_st () (_ BitVec 32))
(declare-fun E_3 () (_ BitVec 32))
(declare-fun E_2 () (_ BitVec 32))
(declare-fun E_5 () (_ BitVec 32))
(declare-fun E_4 () (_ BitVec 32))
(declare-fun E_M () (_ BitVec 32))
(declare-fun E_6 () (_ BitVec 32))
(declare-fun E_7 () (_ BitVec 32))
(declare-fun t2_st () (_ BitVec 32))
(declare-fun t3_st () (_ BitVec 32))
(declare-fun t4_st () (_ BitVec 32))
(declare-fun t6_st () (_ BitVec 32))
(declare-fun t5_st () (_ BitVec 32))
(declare-fun t7_st () (_ BitVec 32))
(declare-fun E_1 () (_ BitVec 32))
(declare-fun local () (_ BitVec 32))
(declare-fun token () (_ BitVec 32))
(declare-fun T7_E () (_ BitVec 32))
(declare-fun T6_E () (_ BitVec 32))
(declare-fun T5_E () (_ BitVec 32))
(declare-fun T4_E () (_ BitVec 32))
(declare-fun T3_E () (_ BitVec 32))
(declare-fun T2_E () (_ BitVec 32))
(declare-fun T1_E () (_ BitVec 32))
(declare-fun M_E () (_ BitVec 32))

*:
(assert (let ((.def_107643 (= a20 (_ bv5 32)))).def_107643))

calculate_output8 N30053:
(assert false)
(assert (let ((.def_107643 (= a20 (_ bv5 32)))).def_107643))

main1 N30136:
(assert (let ((.def_107643 (= a20 (_ bv5 32)))).def_107643))
(assert (let ((.def_155225 (= a25 (_ bv1 32)))).def_155225))
(assert (let ((.def_155228 (= a12 (_ bv4 32)))).def_155228))
(assert (let ((.def_155231 (= a15 (_ bv1 32)))).def_155231))
(assert (let ((.def_155234 (= a16 (_ bv1 32)))).def_155234))
(assert (let ((.def_155237 (= a2 (_ bv10 32)))).def_155237))
(assert (let ((.def_155240 (= a27 (_ bv1 32)))).def_155240))
(assert (let ((.def_155243 (= a9 (_ bv18 32)))).def_155243))
(assert (let ((.def_321408 (= a20 (_ bv6 32)))).def_321408))
(assert (let ((.def_321410 (= a12 (_ bv3 32)))).def_321410))
(assert (let ((.def_321412 (= a12 (_ bv6 32)))).def_321412))
(assert (let ((.def_321414 (= a2 (_ bv9 32)))).def_321414))
(assert (let ((.def_321416 (= a9 (_ bv16 32)))).def_321416))
(assert (let ((.def_321418 (= a2 (_ bv12 32)))).def_321418))
(assert (let ((.def_321420 (= a2 (_ bv11 32)))).def_321420))
(assert (let ((.def_321422 (= a9 (_ bv17 32)))).def_321422))
(assert (let ((.def_321424 (= a12 (_ bv2 32)))).def_321424))
(assert (let ((.def_321426 (= a2 (_ bv13 32)))).def_321426))

error N30154:
(assert false)
(assert (let ((.def_107643 (= a20 (_ bv5 32)))).def_107643))

eval N30612:
(assert (let ((.def_747101 (= m_pc (_ bv0 32)))).def_747101))
(assert (let ((.def_107643 (= a20 (_ bv5 32)))).def_107643))
(assert (let ((.def_752291 (= t1_pc (_ bv0 32)))).def_752291))
(assert (let ((.def_752294 (= t2_pc (_ bv0 32)))).def_752294))
(assert (let ((.def_752297 (= t3_pc (_ bv0 32)))).def_752297))
(assert (let ((.def_752300 (= t4_pc (_ bv0 32)))).def_752300))
(assert (let ((.def_752303 (= t5_pc (_ bv0 32)))).def_752303))
(assert (let ((.def_752306 (= t6_pc (_ bv0 32)))).def_752306))
(assert (let ((.def_752309 (= t7_pc (_ bv0 32)))).def_752309))
(assert (let ((.def_752311 (= m_pc (_ bv1 32)))).def_752311))
(assert (let ((.def_752313 (= t1_pc (_ bv1 32)))).def_752313))
(assert (let ((.def_752315 (= t2_pc (_ bv1 32)))).def_752315))
(assert (let ((.def_752317 (= t3_pc (_ bv1 32)))).def_752317))
(assert (let ((.def_752319 (= t4_pc (_ bv1 32)))).def_752319))
(assert (let ((.def_752321 (= t5_pc (_ bv1 32)))).def_752321))
(assert (let ((.def_752323 (= t6_pc (_ bv1 32)))).def_752323))
(assert (let ((.def_752325 (= t7_pc (_ bv1 32)))).def_752325))
(assert (let ((.def_752328 (= m_st (_ bv0 32)))).def_752328))
(assert (let ((.def_763062 (= t1_st (_ bv0 32)))).def_763062))
(assert (let ((.def_763065 (= E_3 (_ bv1 32)))).def_763065))
(assert (let ((.def_763068 (= E_2 (_ bv1 32)))).def_763068))
(assert (let ((.def_763071 (= E_5 (_ bv1 32)))).def_763071))
(assert (let ((.def_763074 (= E_4 (_ bv1 32)))).def_763074))
(assert (let ((.def_763077 (= E_M (_ bv1 32)))).def_763077))
(assert (let ((.def_763080 (= E_6 (_ bv1 32)))).def_763080))
(assert (let ((.def_763083 (= E_7 (_ bv1 32)))).def_763083))
(assert (let ((.def_763086 (= t2_st (_ bv0 32)))).def_763086))
(assert (let ((.def_763089 (= t3_st (_ bv0 32)))).def_763089))
(assert (let ((.def_763092 (= t4_st (_ bv0 32)))).def_763092))
(assert (let ((.def_763095 (= t6_st (_ bv0 32)))).def_763095))
(assert (let ((.def_763098 (= t5_st (_ bv0 32)))).def_763098))
(assert (let ((.def_763101 (= t7_st (_ bv0 32)))).def_763101))
(assert (let ((.def_763103 (= m_st (_ bv2 32)))).def_763103))
(assert (let ((.def_763106 (= E_1 (_ bv1 32)))).def_763106))
(assert (let ((.def_763109 (bvadd (_ bv7 32) local)))(let ((.def_763111 (= .def_763109 token))).def_763111)))
(assert (let ((.def_799463 (= E_2 (_ bv2 32)))).def_799463))
(assert (let ((.def_799465 (= local token))).def_799465))
(assert (let ((.def_799467 (= E_4 (_ bv2 32)))).def_799467))
(assert (let ((.def_799469 (= E_5 (_ bv2 32)))).def_799469))
(assert (let ((.def_799471 (= E_6 (_ bv2 32)))).def_799471))
(assert (let ((.def_799473 (= t5_st (_ bv2 32)))).def_799473))
(assert (let ((.def_799475 (= t7_st (_ bv2 32)))).def_799475))
(assert (let ((.def_799477 (bvadd (_ bv5 32) local)))(let ((.def_799478 (= token .def_799477))).def_799478)))
(assert (let ((.def_799480 (bvadd (_ bv6 32) local)))(let ((.def_799481 (= token .def_799480))).def_799481)))
(assert (let ((.def_799483 (bvadd (_ bv4 32) local)))(let ((.def_799484 (= token .def_799483))).def_799484)))
(assert (let ((.def_799486 (bvadd (_ bv3 32) local)))(let ((.def_799487 (= token .def_799486))).def_799487)))
(assert (let ((.def_799489 (bvadd (_ bv2 32) local)))(let ((.def_799490 (= token .def_799489))).def_799490)))
(assert (let ((.def_799492 (bvadd (_ bv1 32) local)))(let ((.def_799493 (= token .def_799492))).def_799493)))
(assert (let ((.def_831193 (= E_M (_ bv0 32)))).def_831193))
(assert (let ((.def_831195 (= E_1 (_ bv0 32)))).def_831195))
(assert (let ((.def_863359 (= E_3 (_ bv0 32)))).def_863359))
(assert (let ((.def_863361 (= E_5 (_ bv0 32)))).def_863361))
(assert (let ((.def_863363 (= E_6 (_ bv0 32)))).def_863363))
(assert (let ((.def_863366 (= T7_E (_ bv0 32)))).def_863366))
(assert (let ((.def_863369 (= T6_E (_ bv0 32)))).def_863369))
(assert (let ((.def_863372 (= T5_E (_ bv0 32)))).def_863372))
(assert (let ((.def_863375 (= T4_E (_ bv0 32)))).def_863375))
(assert (let ((.def_863378 (= T3_E (_ bv0 32)))).def_863378))
(assert (let ((.def_863381 (= T2_E (_ bv0 32)))).def_863381))
(assert (let ((.def_863384 (= T1_E (_ bv0 32)))).def_863384))
(assert (let ((.def_863386 (= E_2 (_ bv0 32)))).def_863386))
(assert (let ((.def_863388 (= E_7 (_ bv0 32)))).def_863388))
(assert (let ((.def_863390 (= E_4 (_ bv0 32)))).def_863390))
(assert (let ((.def_863393 (= M_E (_ bv0 32)))).def_863393))
(assert false)

start_simulation N31008:
(assert (let ((.def_747101 (= m_pc (_ bv0 32)))).def_747101))
(assert (let ((.def_107643 (= a20 (_ bv5 32)))).def_107643))
(assert (let ((.def_752291 (= t1_pc (_ bv0 32)))).def_752291))
(assert (let ((.def_752294 (= t2_pc (_ bv0 32)))).def_752294))
(assert (let ((.def_752297 (= t3_pc (_ bv0 32)))).def_752297))
(assert (let ((.def_752300 (= t4_pc (_ bv0 32)))).def_752300))
(assert (let ((.def_752303 (= t5_pc (_ bv0 32)))).def_752303))
(assert (let ((.def_752306 (= t6_pc (_ bv0 32)))).def_752306))
(assert (let ((.def_752309 (= t7_pc (_ bv0 32)))).def_752309))
(assert (let ((.def_752311 (= m_pc (_ bv1 32)))).def_752311))
(assert (let ((.def_752313 (= t1_pc (_ bv1 32)))).def_752313))
(assert (let ((.def_752315 (= t2_pc (_ bv1 32)))).def_752315))
(assert (let ((.def_752317 (= t3_pc (_ bv1 32)))).def_752317))
(assert (let ((.def_752319 (= t4_pc (_ bv1 32)))).def_752319))
(assert (let ((.def_752321 (= t5_pc (_ bv1 32)))).def_752321))
(assert (let ((.def_752323 (= t6_pc (_ bv1 32)))).def_752323))
(assert (let ((.def_752325 (= t7_pc (_ bv1 32)))).def_752325))
(assert (let ((.def_763062 (= t1_st (_ bv0 32)))).def_763062))
(assert (let ((.def_763065 (= E_3 (_ bv1 32)))).def_763065))
(assert (let ((.def_763068 (= E_2 (_ bv1 32)))).def_763068))
(assert (let ((.def_763071 (= E_5 (_ bv1 32)))).def_763071))
(assert (let ((.def_763074 (= E_4 (_ bv1 32)))).def_763074))
(assert (let ((.def_763077 (= E_M (_ bv1 32)))).def_763077))
(assert (let ((.def_763080 (= E_6 (_ bv1 32)))).def_763080))
(assert (let ((.def_763083 (= E_7 (_ bv1 32)))).def_763083))
(assert (let ((.def_752328 (= m_st (_ bv0 32)))).def_752328))
(assert (let ((.def_763098 (= t5_st (_ bv0 32)))).def_763098))
(assert (let ((.def_763092 (= t4_st (_ bv0 32)))).def_763092))
(assert (let ((.def_763101 (= t7_st (_ bv0 32)))).def_763101))
(assert (let ((.def_799463 (= E_2 (_ bv2 32)))).def_799463))
(assert (let ((.def_799465 (= local token))).def_799465))
(assert (let ((.def_763106 (= E_1 (_ bv1 32)))).def_763106))
(assert (let ((.def_799467 (= E_4 (_ bv2 32)))).def_799467))
(assert (let ((.def_799469 (= E_5 (_ bv2 32)))).def_799469))
(assert (let ((.def_799471 (= E_6 (_ bv2 32)))).def_799471))
(assert (let ((.def_763086 (= t2_st (_ bv0 32)))).def_763086))
(assert (let ((.def_831193 (= E_M (_ bv0 32)))).def_831193))
(assert (let ((.def_863359 (= E_3 (_ bv0 32)))).def_863359))
(assert (let ((.def_763095 (= t6_st (_ bv0 32)))).def_763095))
(assert (let ((.def_863361 (= E_5 (_ bv0 32)))).def_863361))
(assert (let ((.def_863363 (= E_6 (_ bv0 32)))).def_863363))
(assert (let ((.def_863366 (= T7_E (_ bv0 32)))).def_863366))
(assert (let ((.def_863369 (= T6_E (_ bv0 32)))).def_863369))
(assert (let ((.def_863372 (= T5_E (_ bv0 32)))).def_863372))
(assert (let ((.def_863375 (= T4_E (_ bv0 32)))).def_863375))
(assert (let ((.def_863378 (= T3_E (_ bv0 32)))).def_863378))
(assert (let ((.def_863381 (= T2_E (_ bv0 32)))).def_863381))
(assert (let ((.def_863384 (= T1_E (_ bv0 32)))).def_863384))
(assert (let ((.def_863386 (= E_2 (_ bv0 32)))).def_863386))
(assert (let ((.def_863388 (= E_7 (_ bv0 32)))).def_863388))
(assert (let ((.def_863390 (= E_4 (_ bv0 32)))).def_863390))
(assert (let ((.def_763089 (= t3_st (_ bv0 32)))).def_763089))
(assert (let ((.def_863393 (= M_E (_ bv0 32)))).def_863393))

