(set-info :source |printed by MathSAT|)
(declare-fun a20 () (_ BitVec 32))
(declare-fun a25 () (_ BitVec 32))
(declare-fun a12 () (_ BitVec 32))
(declare-fun a15 () (_ BitVec 32))
(declare-fun a16 () (_ BitVec 32))
(declare-fun a2 () (_ BitVec 32))
(declare-fun a27 () (_ BitVec 32))
(declare-fun a9 () (_ BitVec 32))
(declare-fun m_pc () (_ BitVec 32))
(declare-fun t1_pc () (_ BitVec 32))
(declare-fun t2_pc () (_ BitVec 32))
(declare-fun t3_pc () (_ BitVec 32))
(declare-fun t4_pc () (_ BitVec 32))
(declare-fun m_st () (_ BitVec 32))
(declare-fun t4_st () (_ BitVec 32))
(declare-fun E_4 () (_ BitVec 32))
(declare-fun E_2 () (_ BitVec 32))
(declare-fun E_M () (_ BitVec 32))
(declare-fun E_3 () (_ BitVec 32))
(declare-fun t1_st () (_ BitVec 32))
(declare-fun t2_st () (_ BitVec 32))
(declare-fun t3_st () (_ BitVec 32))
(declare-fun E_1 () (_ BitVec 32))
(declare-fun local () (_ BitVec 32))
(declare-fun token () (_ BitVec 32))
(declare-fun T4_E () (_ BitVec 32))
(declare-fun T3_E () (_ BitVec 32))
(declare-fun T2_E () (_ BitVec 32))
(declare-fun T1_E () (_ BitVec 32))
(declare-fun M_E () (_ BitVec 32))

*:
(assert (let ((.def_107598 (= a20 (_ bv5 32)))).def_107598))

calculate_output8 N30053:
(assert false)
(assert (let ((.def_107598 (= a20 (_ bv5 32)))).def_107598))

main1 N30136:
(assert (let ((.def_107598 (= a20 (_ bv5 32)))).def_107598))
(assert (let ((.def_155165 (= a25 (_ bv1 32)))).def_155165))
(assert (let ((.def_155168 (= a12 (_ bv4 32)))).def_155168))
(assert (let ((.def_155171 (= a15 (_ bv1 32)))).def_155171))
(assert (let ((.def_155174 (= a16 (_ bv1 32)))).def_155174))
(assert (let ((.def_155177 (= a2 (_ bv10 32)))).def_155177))
(assert (let ((.def_155180 (= a27 (_ bv1 32)))).def_155180))
(assert (let ((.def_155183 (= a9 (_ bv18 32)))).def_155183))
(assert (let ((.def_321348 (= a20 (_ bv6 32)))).def_321348))
(assert (let ((.def_321350 (= a12 (_ bv3 32)))).def_321350))
(assert (let ((.def_321352 (= a12 (_ bv6 32)))).def_321352))
(assert (let ((.def_321354 (= a2 (_ bv9 32)))).def_321354))
(assert (let ((.def_321356 (= a9 (_ bv16 32)))).def_321356))
(assert (let ((.def_321358 (= a2 (_ bv12 32)))).def_321358))
(assert (let ((.def_321360 (= a2 (_ bv11 32)))).def_321360))
(assert (let ((.def_321362 (= a9 (_ bv17 32)))).def_321362))
(assert (let ((.def_321364 (= a12 (_ bv2 32)))).def_321364))
(assert (let ((.def_321366 (= a2 (_ bv13 32)))).def_321366))

error N30154:
(assert false)
(assert (let ((.def_107598 (= a20 (_ bv5 32)))).def_107598))

eval N30450:
(assert (let ((.def_746684 (= m_pc (_ bv0 32)))).def_746684))
(assert (let ((.def_107598 (= a20 (_ bv5 32)))).def_107598))
(assert (let ((.def_748983 (= t1_pc (_ bv0 32)))).def_748983))
(assert (let ((.def_748986 (= t2_pc (_ bv0 32)))).def_748986))
(assert (let ((.def_748989 (= t3_pc (_ bv0 32)))).def_748989))
(assert (let ((.def_748992 (= t4_pc (_ bv0 32)))).def_748992))
(assert (let ((.def_748994 (= m_pc (_ bv1 32)))).def_748994))
(assert (let ((.def_748996 (= t1_pc (_ bv1 32)))).def_748996))
(assert (let ((.def_748998 (= t2_pc (_ bv1 32)))).def_748998))
(assert (let ((.def_749000 (= t3_pc (_ bv1 32)))).def_749000))
(assert (let ((.def_749002 (= t4_pc (_ bv1 32)))).def_749002))
(assert (let ((.def_749005 (= m_st (_ bv0 32)))).def_749005))
(assert (let ((.def_752253 (= t4_st (_ bv0 32)))).def_752253))
(assert (let ((.def_752256 (= E_4 (_ bv1 32)))).def_752256))
(assert (let ((.def_752259 (= E_2 (_ bv1 32)))).def_752259))
(assert (let ((.def_752262 (= E_M (_ bv1 32)))).def_752262))
(assert (let ((.def_752265 (= E_3 (_ bv1 32)))).def_752265))
(assert (let ((.def_752268 (= t1_st (_ bv0 32)))).def_752268))
(assert (let ((.def_752271 (= t2_st (_ bv0 32)))).def_752271))
(assert (let ((.def_752274 (= t3_st (_ bv0 32)))).def_752274))
(assert (let ((.def_752277 (= E_1 (_ bv1 32)))).def_752277))
(assert (let ((.def_752280 (bvadd (_ bv4 32) local)))(let ((.def_752282 (= .def_752280 token))).def_752282)))
(assert (let ((.def_758773 (= E_1 (_ bv2 32)))).def_758773))
(assert (let ((.def_758775 (= t3_st (_ bv2 32)))).def_758775))
(assert (let ((.def_758777 (= t4_st (_ bv2 32)))).def_758777))
(assert (let ((.def_758779 (bvadd (_ bv2 32) local)))(let ((.def_758780 (= token .def_758779))).def_758780)))
(assert (let ((.def_758782 (= local token))).def_758782))
(assert (let ((.def_758784 (bvadd (_ bv1 32) local)))(let ((.def_758785 (= token .def_758784))).def_758785)))
(assert (let ((.def_758787 (bvadd (_ bv3 32) local)))(let ((.def_758788 (= token .def_758787))).def_758788)))
(assert (let ((.def_765058 (= E_M (_ bv0 32)))).def_765058))
(assert (let ((.def_765060 (= E_2 (_ bv0 32)))).def_765060))
(assert (let ((.def_765062 (= E_1 (_ bv0 32)))).def_765062))
(assert (let ((.def_770852 (= E_4 (_ bv0 32)))).def_770852))
(assert (let ((.def_770854 (= E_3 (_ bv0 32)))).def_770854))
(assert (let ((.def_770857 (= T4_E (_ bv0 32)))).def_770857))
(assert (let ((.def_770860 (= T3_E (_ bv0 32)))).def_770860))
(assert (let ((.def_770863 (= T2_E (_ bv0 32)))).def_770863))
(assert (let ((.def_770866 (= T1_E (_ bv0 32)))).def_770866))
(assert (let ((.def_770869 (= M_E (_ bv0 32)))).def_770869))
(assert false)

start_simulation N30723:
(assert (let ((.def_746684 (= m_pc (_ bv0 32)))).def_746684))
(assert (let ((.def_107598 (= a20 (_ bv5 32)))).def_107598))
(assert (let ((.def_748983 (= t1_pc (_ bv0 32)))).def_748983))
(assert (let ((.def_748986 (= t2_pc (_ bv0 32)))).def_748986))
(assert (let ((.def_748989 (= t3_pc (_ bv0 32)))).def_748989))
(assert (let ((.def_748992 (= t4_pc (_ bv0 32)))).def_748992))
(assert (let ((.def_748994 (= m_pc (_ bv1 32)))).def_748994))
(assert (let ((.def_748996 (= t1_pc (_ bv1 32)))).def_748996))
(assert (let ((.def_748998 (= t2_pc (_ bv1 32)))).def_748998))
(assert (let ((.def_749000 (= t3_pc (_ bv1 32)))).def_749000))
(assert (let ((.def_749002 (= t4_pc (_ bv1 32)))).def_749002))
(assert (let ((.def_752253 (= t4_st (_ bv0 32)))).def_752253))
(assert (let ((.def_752256 (= E_4 (_ bv1 32)))).def_752256))
(assert (let ((.def_752259 (= E_2 (_ bv1 32)))).def_752259))
(assert (let ((.def_752262 (= E_M (_ bv1 32)))).def_752262))
(assert (let ((.def_752265 (= E_3 (_ bv1 32)))).def_752265))
(assert (let ((.def_749005 (= m_st (_ bv0 32)))).def_749005))
(assert (let ((.def_752277 (= E_1 (_ bv1 32)))).def_752277))
(assert (let ((.def_758773 (= E_1 (_ bv2 32)))).def_758773))
(assert (let ((.def_752271 (= t2_st (_ bv0 32)))).def_752271))
(assert (let ((.def_752268 (= t1_st (_ bv0 32)))).def_752268))
(assert (let ((.def_765058 (= E_M (_ bv0 32)))).def_765058))
(assert (let ((.def_765060 (= E_2 (_ bv0 32)))).def_765060))
(assert (let ((.def_752274 (= t3_st (_ bv0 32)))).def_752274))
(assert (let ((.def_770852 (= E_4 (_ bv0 32)))).def_770852))
(assert (let ((.def_770854 (= E_3 (_ bv0 32)))).def_770854))
(assert (let ((.def_770857 (= T4_E (_ bv0 32)))).def_770857))
(assert (let ((.def_770860 (= T3_E (_ bv0 32)))).def_770860))
(assert (let ((.def_770863 (= T2_E (_ bv0 32)))).def_770863))
(assert (let ((.def_770866 (= T1_E (_ bv0 32)))).def_770866))
(assert (let ((.def_770869 (= M_E (_ bv0 32)))).def_770869))

