(set-info :source |printed by MathSAT|)
(declare-fun a20 () (_ BitVec 32))
(declare-fun a25 () (_ BitVec 32))
(declare-fun a12 () (_ BitVec 32))
(declare-fun a15 () (_ BitVec 32))
(declare-fun a16 () (_ BitVec 32))
(declare-fun a2 () (_ BitVec 32))
(declare-fun a27 () (_ BitVec 32))
(declare-fun a9 () (_ BitVec 32))
(declare-fun m_pc () (_ BitVec 32))
(declare-fun t1_pc () (_ BitVec 32))
(declare-fun t2_pc () (_ BitVec 32))
(declare-fun t3_pc () (_ BitVec 32))
(declare-fun t4_pc () (_ BitVec 32))
(declare-fun t5_pc () (_ BitVec 32))
(declare-fun t6_pc () (_ BitVec 32))
(declare-fun m_st () (_ BitVec 32))

*:
(assert (let ((.def_107188 (= a20 (_ bv5 32)))).def_107188))

calculate_output8 N29943:
(assert false)
(assert (let ((.def_107188 (= a20 (_ bv5 32)))).def_107188))

main1 N30136:
(assert (let ((.def_107188 (= a20 (_ bv5 32)))).def_107188))
(assert (let ((.def_154555 (= a25 (_ bv1 32)))).def_154555))
(assert (let ((.def_154558 (= a12 (_ bv4 32)))).def_154558))
(assert (let ((.def_154561 (= a15 (_ bv1 32)))).def_154561))
(assert (let ((.def_154564 (= a16 (_ bv1 32)))).def_154564))
(assert (let ((.def_154567 (= a2 (_ bv10 32)))).def_154567))
(assert (let ((.def_154570 (= a27 (_ bv1 32)))).def_154570))
(assert (let ((.def_154573 (= a9 (_ bv18 32)))).def_154573))
(assert (let ((.def_586280 (= a2 (_ bv13 32)))).def_586280))
(assert (let ((.def_586282 (= a2 (_ bv9 32)))).def_586282))
(assert (let ((.def_586284 (= a2 (_ bv12 32)))).def_586284))
(assert (let ((.def_586286 (= a20 (_ bv7 32)))).def_586286))
(assert (let ((.def_586288 (= a20 (_ bv6 32)))).def_586288))
(assert (let ((.def_586290 (= a12 (_ bv3 32)))).def_586290))
(assert (let ((.def_586292 (= a12 (_ bv2 32)))).def_586292))
(assert (let ((.def_586294 (= a12 (_ bv5 32)))).def_586294))
(assert (let ((.def_586296 (= a2 (_ bv11 32)))).def_586296))
(assert (let ((.def_586298 (= a9 (_ bv16 32)))).def_586298))
(assert (let ((.def_586300 (= a12 (_ bv6 32)))).def_586300))
(assert (let ((.def_586302 (= a9 (_ bv17 32)))).def_586302))

error N30154:
(assert false)
(assert (let ((.def_107188 (= a20 (_ bv5 32)))).def_107188))

eval N30571:
(assert (let ((.def_923229 (= m_pc (_ bv0 32)))).def_923229))
(assert (let ((.def_107188 (= a20 (_ bv5 32)))).def_107188))
(assert (let ((.def_927367 (= t1_pc (_ bv0 32)))).def_927367))
(assert (let ((.def_927370 (= t2_pc (_ bv0 32)))).def_927370))
(assert (let ((.def_927373 (= t3_pc (_ bv0 32)))).def_927373))
(assert (let ((.def_927376 (= t4_pc (_ bv0 32)))).def_927376))
(assert (let ((.def_927379 (= t5_pc (_ bv0 32)))).def_927379))
(assert (let ((.def_927382 (= t6_pc (_ bv0 32)))).def_927382))
(assert (let ((.def_927384 (= m_pc (_ bv1 32)))).def_927384))
(assert (let ((.def_927386 (= t1_pc (_ bv1 32)))).def_927386))
(assert (let ((.def_927388 (= t2_pc (_ bv1 32)))).def_927388))
(assert (let ((.def_927390 (= t3_pc (_ bv1 32)))).def_927390))
(assert (let ((.def_927392 (= t4_pc (_ bv1 32)))).def_927392))
(assert (let ((.def_927394 (= t5_pc (_ bv1 32)))).def_927394))
(assert (let ((.def_927396 (= t6_pc (_ bv1 32)))).def_927396))
(assert (let ((.def_927399 (= m_st (_ bv0 32)))).def_927399))

start_simulation N30926:
(assert (let ((.def_923229 (= m_pc (_ bv0 32)))).def_923229))
(assert (let ((.def_107188 (= a20 (_ bv5 32)))).def_107188))
(assert (let ((.def_927367 (= t1_pc (_ bv0 32)))).def_927367))
(assert (let ((.def_927370 (= t2_pc (_ bv0 32)))).def_927370))
(assert (let ((.def_927373 (= t3_pc (_ bv0 32)))).def_927373))
(assert (let ((.def_927376 (= t4_pc (_ bv0 32)))).def_927376))
(assert (let ((.def_927379 (= t5_pc (_ bv0 32)))).def_927379))
(assert (let ((.def_927382 (= t6_pc (_ bv0 32)))).def_927382))
(assert (let ((.def_927384 (= m_pc (_ bv1 32)))).def_927384))
(assert (let ((.def_927386 (= t1_pc (_ bv1 32)))).def_927386))
(assert (let ((.def_927388 (= t2_pc (_ bv1 32)))).def_927388))
(assert (let ((.def_927390 (= t3_pc (_ bv1 32)))).def_927390))
(assert (let ((.def_927392 (= t4_pc (_ bv1 32)))).def_927392))
(assert (let ((.def_927394 (= t5_pc (_ bv1 32)))).def_927394))
(assert (let ((.def_927396 (= t6_pc (_ bv1 32)))).def_927396))

