(set-info :source |printed by MathSAT|)
(declare-fun a20 () (_ BitVec 32))
(declare-fun a9 () (_ BitVec 32))
(declare-fun a25 () (_ BitVec 32))
(declare-fun a12 () (_ BitVec 32))
(declare-fun a15 () (_ BitVec 32))
(declare-fun a16 () (_ BitVec 32))
(declare-fun a2 () (_ BitVec 32))
(declare-fun a27 () (_ BitVec 32))
(declare-fun |calculate_output6::input| () (_ BitVec 32))
(declare-fun |calculate_output7::input| () (_ BitVec 32))
(declare-fun |calculate_output5::input| () (_ BitVec 32))

*:
(assert (let ((.def_106205 (= a20 (_ bv5 32)))).def_106205))

calculate_output8 N29701:
(assert false)
(assert (let ((.def_106205 (= a20 (_ bv5 32)))).def_106205))

main1 N30136:
(assert (let ((.def_153054 (= a9 (_ bv18 32)))).def_153054))
(assert (let ((.def_106205 (= a20 (_ bv5 32)))).def_106205))
(assert (let ((.def_339753 (= a25 (_ bv1 32)))).def_339753))
(assert (let ((.def_339756 (= a12 (_ bv4 32)))).def_339756))
(assert (let ((.def_339759 (= a15 (_ bv1 32)))).def_339759))
(assert (let ((.def_339762 (= a16 (_ bv1 32)))).def_339762))
(assert (let ((.def_339765 (= a2 (_ bv10 32)))).def_339765))
(assert (let ((.def_339768 (= a27 (_ bv1 32)))).def_339768))
(assert (let ((.def_339770 (= a20 (_ bv6 32)))).def_339770))
(assert (let ((.def_339772 (= a2 (_ bv13 32)))).def_339772))
(assert (let ((.def_339774 (= a12 (_ bv2 32)))).def_339774))
(assert (let ((.def_339776 (= a2 (_ bv12 32)))).def_339776))
(assert (let ((.def_339778 (= a2 (_ bv11 32)))).def_339778))
(assert (let ((.def_339780 (= a9 (_ bv16 32)))).def_339780))
(assert (let ((.def_339782 (= a9 (_ bv17 32)))).def_339782))
(assert (let ((.def_1110380 (= a12 (_ bv5 32)))).def_1110380))
(assert (let ((.def_1110382 (= a12 (_ bv6 32)))).def_1110382))
(assert (let ((.def_1110384 (= a20 (_ bv7 32)))).def_1110384))
(assert (let ((.def_1110386 (= a12 (_ bv3 32)))).def_1110386))
(assert (let ((.def_1110388 (= a2 (_ bv9 32)))).def_1110388))
(assert (let ((.def_1110391 (= |calculate_output6::input| (_ bv5 32)))).def_1110391))
(assert (let ((.def_1110394 (= |calculate_output7::input| (_ bv1 32)))).def_1110394))
(assert (let ((.def_1110396 (= |calculate_output7::input| (_ bv2 32)))).def_1110396))
(assert (let ((.def_1110399 (= |calculate_output5::input| (_ bv4 32)))).def_1110399))
(assert (let ((.def_1110401 (= |calculate_output7::input| |calculate_output5::input|))).def_1110401))
(assert (let ((.def_1110403 (= |calculate_output7::input| (_ bv4 32)))).def_1110403))
(assert (let ((.def_1110405 (= |calculate_output7::input| (_ bv6 32)))).def_1110405))
(assert (let ((.def_1110407 (= |calculate_output6::input| |calculate_output7::input|))).def_1110407))
(assert (let ((.def_1110409 (= |calculate_output7::input| (_ bv5 32)))).def_1110409))

