(set-info :source |printed by MathSAT|)
(declare-fun a20 () (_ BitVec 32))
(declare-fun a25 () (_ BitVec 32))
(declare-fun a12 () (_ BitVec 32))
(declare-fun a15 () (_ BitVec 32))
(declare-fun a16 () (_ BitVec 32))
(declare-fun a2 () (_ BitVec 32))
(declare-fun a27 () (_ BitVec 32))
(declare-fun a9 () (_ BitVec 32))
(declare-fun m_pc () (_ BitVec 32))
(declare-fun t1_pc () (_ BitVec 32))
(declare-fun t2_pc () (_ BitVec 32))
(declare-fun t3_pc () (_ BitVec 32))
(declare-fun t4_pc () (_ BitVec 32))
(declare-fun t5_pc () (_ BitVec 32))
(declare-fun t6_pc () (_ BitVec 32))
(declare-fun t7_pc () (_ BitVec 32))
(declare-fun t8_pc () (_ BitVec 32))
(declare-fun t9_pc () (_ BitVec 32))
(declare-fun t10_pc () (_ BitVec 32))
(declare-fun t11_pc () (_ BitVec 32))
(declare-fun t12_pc () (_ BitVec 32))
(declare-fun m_st () (_ BitVec 32))

*:
(assert (let ((.def_107938 (= a20 (_ bv5 32)))).def_107938))

calculate_output8 N30108:
(assert false)
(assert (let ((.def_107938 (= a20 (_ bv5 32)))).def_107938))

main1 N30136:
(assert (let ((.def_107938 (= a20 (_ bv5 32)))).def_107938))
(assert (let ((.def_155686 (= a25 (_ bv1 32)))).def_155686))
(assert (let ((.def_155689 (= a12 (_ bv4 32)))).def_155689))
(assert (let ((.def_155692 (= a15 (_ bv1 32)))).def_155692))
(assert (let ((.def_155695 (= a16 (_ bv1 32)))).def_155695))
(assert (let ((.def_155698 (= a2 (_ bv10 32)))).def_155698))
(assert (let ((.def_155701 (= a27 (_ bv1 32)))).def_155701))
(assert (let ((.def_155704 (= a9 (_ bv18 32)))).def_155704))
(assert (let ((.def_321876 (= a12 (_ bv5 32)))).def_321876))
(assert (let ((.def_321878 (= a2 (_ bv13 32)))).def_321878))
(assert (let ((.def_321880 (= a12 (_ bv2 32)))).def_321880))
(assert (let ((.def_321882 (= a2 (_ bv12 32)))).def_321882))
(assert (let ((.def_321884 (= a12 (_ bv3 32)))).def_321884))
(assert (let ((.def_321886 (= a9 (_ bv16 32)))).def_321886))
(assert (let ((.def_321888 (= a20 (_ bv7 32)))).def_321888))
(assert (let ((.def_321890 (= a2 (_ bv9 32)))).def_321890))
(assert (let ((.def_321892 (= a9 (_ bv17 32)))).def_321892))

error N30154:
(assert false)
(assert (let ((.def_107938 (= a20 (_ bv5 32)))).def_107938))

eval N30895:
(assert (let ((.def_747880 (= m_pc (_ bv0 32)))).def_747880))
(assert (let ((.def_107938 (= a20 (_ bv5 32)))).def_107938))
(assert (let ((.def_760470 (= t1_pc (_ bv0 32)))).def_760470))
(assert (let ((.def_760473 (= t2_pc (_ bv0 32)))).def_760473))
(assert (let ((.def_760476 (= t3_pc (_ bv0 32)))).def_760476))
(assert (let ((.def_760479 (= t4_pc (_ bv0 32)))).def_760479))
(assert (let ((.def_760482 (= t5_pc (_ bv0 32)))).def_760482))
(assert (let ((.def_760485 (= t6_pc (_ bv0 32)))).def_760485))
(assert (let ((.def_760488 (= t7_pc (_ bv0 32)))).def_760488))
(assert (let ((.def_760491 (= t8_pc (_ bv0 32)))).def_760491))
(assert (let ((.def_760494 (= t9_pc (_ bv0 32)))).def_760494))
(assert (let ((.def_760497 (= t10_pc (_ bv0 32)))).def_760497))
(assert (let ((.def_760500 (= t11_pc (_ bv0 32)))).def_760500))
(assert (let ((.def_760503 (= t12_pc (_ bv0 32)))).def_760503))
(assert (let ((.def_760505 (= m_pc (_ bv1 32)))).def_760505))
(assert (let ((.def_760507 (= t1_pc (_ bv1 32)))).def_760507))
(assert (let ((.def_760509 (= t2_pc (_ bv1 32)))).def_760509))
(assert (let ((.def_760511 (= t3_pc (_ bv1 32)))).def_760511))
(assert (let ((.def_760513 (= t4_pc (_ bv1 32)))).def_760513))
(assert (let ((.def_760515 (= t5_pc (_ bv1 32)))).def_760515))
(assert (let ((.def_760517 (= t6_pc (_ bv1 32)))).def_760517))
(assert (let ((.def_760519 (= t7_pc (_ bv1 32)))).def_760519))
(assert (let ((.def_760521 (= t8_pc (_ bv1 32)))).def_760521))
(assert (let ((.def_760523 (= t9_pc (_ bv1 32)))).def_760523))
(assert (let ((.def_760525 (= t10_pc (_ bv1 32)))).def_760525))
(assert (let ((.def_760527 (= t11_pc (_ bv1 32)))).def_760527))
(assert (let ((.def_760529 (= t12_pc (_ bv1 32)))).def_760529))
(assert (let ((.def_760532 (= m_st (_ bv0 32)))).def_760532))

start_simulation N31496:
(assert (let ((.def_747880 (= m_pc (_ bv0 32)))).def_747880))
(assert (let ((.def_107938 (= a20 (_ bv5 32)))).def_107938))
(assert (let ((.def_760470 (= t1_pc (_ bv0 32)))).def_760470))
(assert (let ((.def_760473 (= t2_pc (_ bv0 32)))).def_760473))
(assert (let ((.def_760476 (= t3_pc (_ bv0 32)))).def_760476))
(assert (let ((.def_760479 (= t4_pc (_ bv0 32)))).def_760479))
(assert (let ((.def_760482 (= t5_pc (_ bv0 32)))).def_760482))
(assert (let ((.def_760485 (= t6_pc (_ bv0 32)))).def_760485))
(assert (let ((.def_760488 (= t7_pc (_ bv0 32)))).def_760488))
(assert (let ((.def_760491 (= t8_pc (_ bv0 32)))).def_760491))
(assert (let ((.def_760494 (= t9_pc (_ bv0 32)))).def_760494))
(assert (let ((.def_760497 (= t10_pc (_ bv0 32)))).def_760497))
(assert (let ((.def_760500 (= t11_pc (_ bv0 32)))).def_760500))
(assert (let ((.def_760503 (= t12_pc (_ bv0 32)))).def_760503))
(assert (let ((.def_760505 (= m_pc (_ bv1 32)))).def_760505))
(assert (let ((.def_760507 (= t1_pc (_ bv1 32)))).def_760507))
(assert (let ((.def_760509 (= t2_pc (_ bv1 32)))).def_760509))
(assert (let ((.def_760511 (= t3_pc (_ bv1 32)))).def_760511))
(assert (let ((.def_760513 (= t4_pc (_ bv1 32)))).def_760513))
(assert (let ((.def_760515 (= t5_pc (_ bv1 32)))).def_760515))
(assert (let ((.def_760517 (= t6_pc (_ bv1 32)))).def_760517))
(assert (let ((.def_760519 (= t7_pc (_ bv1 32)))).def_760519))
(assert (let ((.def_760521 (= t8_pc (_ bv1 32)))).def_760521))
(assert (let ((.def_760523 (= t9_pc (_ bv1 32)))).def_760523))
(assert (let ((.def_760525 (= t10_pc (_ bv1 32)))).def_760525))
(assert (let ((.def_760527 (= t11_pc (_ bv1 32)))).def_760527))
(assert (let ((.def_760529 (= t12_pc (_ bv1 32)))).def_760529))

