(set-info :source |printed by MathSAT|)
(declare-fun a20 () (_ BitVec 32))
(declare-fun a25 () (_ BitVec 32))
(declare-fun a12 () (_ BitVec 32))
(declare-fun a15 () (_ BitVec 32))
(declare-fun a16 () (_ BitVec 32))
(declare-fun a2 () (_ BitVec 32))
(declare-fun a27 () (_ BitVec 32))
(declare-fun a9 () (_ BitVec 32))
(declare-fun m_pc () (_ BitVec 32))
(declare-fun t1_pc () (_ BitVec 32))
(declare-fun t2_pc () (_ BitVec 32))
(declare-fun t3_pc () (_ BitVec 32))
(declare-fun m_st () (_ BitVec 32))
(declare-fun E_3 () (_ BitVec 32))
(declare-fun E_M () (_ BitVec 32))
(declare-fun E_2 () (_ BitVec 32))
(declare-fun t3_st () (_ BitVec 32))
(declare-fun t1_st () (_ BitVec 32))
(declare-fun t2_st () (_ BitVec 32))
(declare-fun local () (_ BitVec 32))
(declare-fun token () (_ BitVec 32))
(declare-fun E_1 () (_ BitVec 32))

*:
(assert (let ((.def_107143 (= a20 (_ bv5 32)))).def_107143))

calculate_output8 N29943:
(assert false)
(assert (let ((.def_107143 (= a20 (_ bv5 32)))).def_107143))

main1 N30136:
(assert (let ((.def_107143 (= a20 (_ bv5 32)))).def_107143))
(assert (let ((.def_154495 (= a25 (_ bv1 32)))).def_154495))
(assert (let ((.def_154498 (= a12 (_ bv4 32)))).def_154498))
(assert (let ((.def_154501 (= a15 (_ bv1 32)))).def_154501))
(assert (let ((.def_154504 (= a16 (_ bv1 32)))).def_154504))
(assert (let ((.def_154507 (= a2 (_ bv10 32)))).def_154507))
(assert (let ((.def_154510 (= a27 (_ bv1 32)))).def_154510))
(assert (let ((.def_154513 (= a9 (_ bv18 32)))).def_154513))
(assert (let ((.def_584154 (= a9 (_ bv17 32)))).def_584154))
(assert (let ((.def_584156 (= a2 (_ bv13 32)))).def_584156))
(assert (let ((.def_584158 (= a2 (_ bv9 32)))).def_584158))
(assert (let ((.def_584160 (= a2 (_ bv12 32)))).def_584160))
(assert (let ((.def_584162 (= a20 (_ bv6 32)))).def_584162))
(assert (let ((.def_584164 (= a20 (_ bv7 32)))).def_584164))
(assert (let ((.def_584166 (= a12 (_ bv3 32)))).def_584166))
(assert (let ((.def_584168 (= a12 (_ bv2 32)))).def_584168))
(assert (let ((.def_584170 (= a12 (_ bv5 32)))).def_584170))
(assert (let ((.def_584172 (= a2 (_ bv11 32)))).def_584172))
(assert (let ((.def_584174 (= a9 (_ bv16 32)))).def_584174))
(assert (let ((.def_584176 (= a12 (_ bv6 32)))).def_584176))

error N30154:
(assert false)
(assert (let ((.def_107143 (= a20 (_ bv5 32)))).def_107143))

eval N30396:
(assert (let ((.def_920763 (= m_pc (_ bv0 32)))).def_920763))
(assert (let ((.def_107143 (= a20 (_ bv5 32)))).def_107143))
(assert (let ((.def_922353 (= t1_pc (_ bv0 32)))).def_922353))
(assert (let ((.def_922356 (= t2_pc (_ bv0 32)))).def_922356))
(assert (let ((.def_922359 (= t3_pc (_ bv0 32)))).def_922359))
(assert (let ((.def_922361 (= m_pc (_ bv1 32)))).def_922361))
(assert (let ((.def_922363 (= t1_pc (_ bv1 32)))).def_922363))
(assert (let ((.def_922365 (= t2_pc (_ bv1 32)))).def_922365))
(assert (let ((.def_922367 (= t3_pc (_ bv1 32)))).def_922367))
(assert (let ((.def_922370 (= m_st (_ bv0 32)))).def_922370))
(assert (let ((.def_924425 (= E_3 (_ bv1 32)))).def_924425))
(assert (let ((.def_924428 (= E_M (_ bv1 32)))).def_924428))
(assert (let ((.def_924431 (= E_2 (_ bv1 32)))).def_924431))
(assert (let ((.def_924434 (= t3_st (_ bv0 32)))).def_924434))
(assert (let ((.def_924437 (= t1_st (_ bv0 32)))).def_924437))
(assert (let ((.def_924440 (= t2_st (_ bv0 32)))).def_924440))
(assert (let ((.def_924443 (bvadd (_ bv3 32) local)))(let ((.def_924445 (= .def_924443 token))).def_924445)))
(assert (let ((.def_929178 (= E_2 (_ bv2 32)))).def_929178))
(assert (let ((.def_929181 (= E_1 (_ bv1 32)))).def_929181))
(assert (let ((.def_929183 (= t2_st (_ bv2 32)))).def_929183))
(assert (let ((.def_929185 (= local token))).def_929185))
(assert (let ((.def_929187 (bvadd (_ bv1 32) local)))(let ((.def_929188 (= token .def_929187))).def_929188)))
(assert (let ((.def_929190 (bvadd (_ bv2 32) local)))(let ((.def_929191 (= token .def_929190))).def_929191)))
(assert (let ((.def_932787 (= E_M (_ bv0 32)))).def_932787))
(assert (let ((.def_932789 (= E_3 (_ bv0 32)))).def_932789))
(assert (let ((.def_932791 (= E_2 (_ bv0 32)))).def_932791))
(assert (let ((.def_932793 (= E_1 (_ bv0 32)))).def_932793))

start_simulation N30628:
(assert (let ((.def_920763 (= m_pc (_ bv0 32)))).def_920763))
(assert (let ((.def_107143 (= a20 (_ bv5 32)))).def_107143))
(assert (let ((.def_922353 (= t1_pc (_ bv0 32)))).def_922353))
(assert (let ((.def_922356 (= t2_pc (_ bv0 32)))).def_922356))
(assert (let ((.def_922359 (= t3_pc (_ bv0 32)))).def_922359))
(assert (let ((.def_922361 (= m_pc (_ bv1 32)))).def_922361))
(assert (let ((.def_922363 (= t1_pc (_ bv1 32)))).def_922363))
(assert (let ((.def_922365 (= t2_pc (_ bv1 32)))).def_922365))
(assert (let ((.def_922367 (= t3_pc (_ bv1 32)))).def_922367))
(assert (let ((.def_924425 (= E_3 (_ bv1 32)))).def_924425))
(assert (let ((.def_924428 (= E_M (_ bv1 32)))).def_924428))
(assert (let ((.def_924431 (= E_2 (_ bv1 32)))).def_924431))
(assert (let ((.def_924434 (= t3_st (_ bv0 32)))).def_924434))
(assert (let ((.def_922370 (= m_st (_ bv0 32)))).def_922370))
(assert (let ((.def_929178 (= E_2 (_ bv2 32)))).def_929178))
(assert (let ((.def_929181 (= E_1 (_ bv1 32)))).def_929181))
(assert (let ((.def_924440 (= t2_st (_ bv0 32)))).def_924440))
(assert (let ((.def_924437 (= t1_st (_ bv0 32)))).def_924437))
(assert (let ((.def_929183 (= t2_st (_ bv2 32)))).def_929183))
(assert (let ((.def_932787 (= E_M (_ bv0 32)))).def_932787))
(assert (let ((.def_932789 (= E_3 (_ bv0 32)))).def_932789))
(assert (let ((.def_932791 (= E_2 (_ bv0 32)))).def_932791))

