(set-info :source |printed by MathSAT|)
(declare-fun a20 () (_ BitVec 32))
(declare-fun a25 () (_ BitVec 32))
(declare-fun a12 () (_ BitVec 32))
(declare-fun a15 () (_ BitVec 32))
(declare-fun a16 () (_ BitVec 32))
(declare-fun a2 () (_ BitVec 32))
(declare-fun a27 () (_ BitVec 32))
(declare-fun a9 () (_ BitVec 32))
(declare-fun m_pc () (_ BitVec 32))
(declare-fun t1_pc () (_ BitVec 32))
(declare-fun t2_pc () (_ BitVec 32))
(declare-fun t3_pc () (_ BitVec 32))
(declare-fun t4_pc () (_ BitVec 32))
(declare-fun m_st () (_ BitVec 32))
(declare-fun t4_st () (_ BitVec 32))
(declare-fun E_4 () (_ BitVec 32))
(declare-fun E_2 () (_ BitVec 32))
(declare-fun E_M () (_ BitVec 32))
(declare-fun E_3 () (_ BitVec 32))
(declare-fun t1_st () (_ BitVec 32))
(declare-fun t2_st () (_ BitVec 32))
(declare-fun t3_st () (_ BitVec 32))
(declare-fun E_1 () (_ BitVec 32))
(declare-fun local () (_ BitVec 32))
(declare-fun token () (_ BitVec 32))
(declare-fun T4_E () (_ BitVec 32))
(declare-fun T3_E () (_ BitVec 32))
(declare-fun T2_E () (_ BitVec 32))
(declare-fun T1_E () (_ BitVec 32))
(declare-fun M_E () (_ BitVec 32))

*:
(assert (let ((.def_106586 (= a20 (_ bv5 32)))).def_106586))

calculate_output8 N29800:
(assert false)
(assert (let ((.def_106586 (= a20 (_ bv5 32)))).def_106586))

main1 N30136:
(assert (let ((.def_106586 (= a20 (_ bv5 32)))).def_106586))
(assert (let ((.def_153754 (= a25 (_ bv1 32)))).def_153754))
(assert (let ((.def_153757 (= a12 (_ bv4 32)))).def_153757))
(assert (let ((.def_153760 (= a15 (_ bv1 32)))).def_153760))
(assert (let ((.def_153763 (= a16 (_ bv1 32)))).def_153763))
(assert (let ((.def_153766 (= a2 (_ bv10 32)))).def_153766))
(assert (let ((.def_153769 (= a27 (_ bv1 32)))).def_153769))
(assert (let ((.def_153772 (= a9 (_ bv18 32)))).def_153772))
(assert (let ((.def_319634 (= a2 (_ bv11 32)))).def_319634))
(assert (let ((.def_319636 (= a12 (_ bv2 32)))).def_319636))
(assert (let ((.def_319638 (= a9 (_ bv17 32)))).def_319638))
(assert (let ((.def_319640 (= a2 (_ bv13 32)))).def_319640))
(assert (let ((.def_319642 (= a20 (_ bv6 32)))).def_319642))
(assert (let ((.def_319644 (= a12 (_ bv6 32)))).def_319644))
(assert (let ((.def_319646 (= a2 (_ bv9 32)))).def_319646))
(assert (let ((.def_319648 (= a9 (_ bv16 32)))).def_319648))
(assert (let ((.def_1116014 (= a12 (_ bv5 32)))).def_1116014))
(assert (let ((.def_1116016 (= a20 (_ bv7 32)))).def_1116016))
(assert (let ((.def_1116018 (= a2 (_ bv12 32)))).def_1116018))
(assert (let ((.def_1116020 (= a12 (_ bv3 32)))).def_1116020))

error N30154:
(assert false)
(assert (let ((.def_106586 (= a20 (_ bv5 32)))).def_106586))

eval N30450:
(assert (let ((.def_1257729 (= m_pc (_ bv0 32)))).def_1257729))
(assert (let ((.def_106586 (= a20 (_ bv5 32)))).def_106586))
(assert (let ((.def_1260028 (= t1_pc (_ bv0 32)))).def_1260028))
(assert (let ((.def_1260031 (= t2_pc (_ bv0 32)))).def_1260031))
(assert (let ((.def_1260034 (= t3_pc (_ bv0 32)))).def_1260034))
(assert (let ((.def_1260037 (= t4_pc (_ bv0 32)))).def_1260037))
(assert (let ((.def_1260039 (= m_pc (_ bv1 32)))).def_1260039))
(assert (let ((.def_1260041 (= t1_pc (_ bv1 32)))).def_1260041))
(assert (let ((.def_1260043 (= t2_pc (_ bv1 32)))).def_1260043))
(assert (let ((.def_1260045 (= t3_pc (_ bv1 32)))).def_1260045))
(assert (let ((.def_1260047 (= t4_pc (_ bv1 32)))).def_1260047))
(assert (let ((.def_1260050 (= m_st (_ bv0 32)))).def_1260050))
(assert (let ((.def_1263297 (= t4_st (_ bv0 32)))).def_1263297))
(assert (let ((.def_1263300 (= E_4 (_ bv1 32)))).def_1263300))
(assert (let ((.def_1263303 (= E_2 (_ bv1 32)))).def_1263303))
(assert (let ((.def_1263306 (= E_M (_ bv1 32)))).def_1263306))
(assert (let ((.def_1263309 (= E_3 (_ bv1 32)))).def_1263309))
(assert (let ((.def_1263312 (= t1_st (_ bv0 32)))).def_1263312))
(assert (let ((.def_1263315 (= t2_st (_ bv0 32)))).def_1263315))
(assert (let ((.def_1263318 (= t3_st (_ bv0 32)))).def_1263318))
(assert (let ((.def_1263321 (= E_1 (_ bv1 32)))).def_1263321))
(assert (let ((.def_1263324 (bvadd (_ bv4 32) local)))(let ((.def_1263326 (= .def_1263324 token))).def_1263326)))
(assert (let ((.def_1269817 (= E_1 (_ bv2 32)))).def_1269817))
(assert (let ((.def_1269819 (= t3_st (_ bv2 32)))).def_1269819))
(assert (let ((.def_1269821 (= t4_st (_ bv2 32)))).def_1269821))
(assert (let ((.def_1269823 (bvadd (_ bv2 32) local)))(let ((.def_1269824 (= token .def_1269823))).def_1269824)))
(assert (let ((.def_1269826 (= local token))).def_1269826))
(assert (let ((.def_1269828 (bvadd (_ bv1 32) local)))(let ((.def_1269829 (= token .def_1269828))).def_1269829)))
(assert (let ((.def_1269831 (bvadd (_ bv3 32) local)))(let ((.def_1269832 (= token .def_1269831))).def_1269832)))
(assert (let ((.def_1276102 (= E_M (_ bv0 32)))).def_1276102))
(assert (let ((.def_1276104 (= E_2 (_ bv0 32)))).def_1276104))
(assert (let ((.def_1276106 (= E_1 (_ bv0 32)))).def_1276106))
(assert (let ((.def_1281896 (= E_4 (_ bv0 32)))).def_1281896))
(assert (let ((.def_1281898 (= E_3 (_ bv0 32)))).def_1281898))
(assert (let ((.def_1281901 (= T4_E (_ bv0 32)))).def_1281901))
(assert (let ((.def_1281904 (= T3_E (_ bv0 32)))).def_1281904))
(assert (let ((.def_1281907 (= T2_E (_ bv0 32)))).def_1281907))
(assert (let ((.def_1281910 (= T1_E (_ bv0 32)))).def_1281910))
(assert (let ((.def_1281913 (= M_E (_ bv0 32)))).def_1281913))
(assert false)

start_simulation N30723:
(assert (let ((.def_1257729 (= m_pc (_ bv0 32)))).def_1257729))
(assert (let ((.def_106586 (= a20 (_ bv5 32)))).def_106586))
(assert (let ((.def_1260028 (= t1_pc (_ bv0 32)))).def_1260028))
(assert (let ((.def_1260031 (= t2_pc (_ bv0 32)))).def_1260031))
(assert (let ((.def_1260034 (= t3_pc (_ bv0 32)))).def_1260034))
(assert (let ((.def_1260037 (= t4_pc (_ bv0 32)))).def_1260037))
(assert (let ((.def_1260039 (= m_pc (_ bv1 32)))).def_1260039))
(assert (let ((.def_1260041 (= t1_pc (_ bv1 32)))).def_1260041))
(assert (let ((.def_1260043 (= t2_pc (_ bv1 32)))).def_1260043))
(assert (let ((.def_1260045 (= t3_pc (_ bv1 32)))).def_1260045))
(assert (let ((.def_1260047 (= t4_pc (_ bv1 32)))).def_1260047))
(assert (let ((.def_1263297 (= t4_st (_ bv0 32)))).def_1263297))
(assert (let ((.def_1263300 (= E_4 (_ bv1 32)))).def_1263300))
(assert (let ((.def_1263303 (= E_2 (_ bv1 32)))).def_1263303))
(assert (let ((.def_1263306 (= E_M (_ bv1 32)))).def_1263306))
(assert (let ((.def_1263309 (= E_3 (_ bv1 32)))).def_1263309))
(assert (let ((.def_1260050 (= m_st (_ bv0 32)))).def_1260050))
(assert (let ((.def_1263321 (= E_1 (_ bv1 32)))).def_1263321))
(assert (let ((.def_1269817 (= E_1 (_ bv2 32)))).def_1269817))
(assert (let ((.def_1263315 (= t2_st (_ bv0 32)))).def_1263315))
(assert (let ((.def_1263312 (= t1_st (_ bv0 32)))).def_1263312))
(assert (let ((.def_1276102 (= E_M (_ bv0 32)))).def_1276102))
(assert (let ((.def_1276104 (= E_2 (_ bv0 32)))).def_1276104))
(assert (let ((.def_1263318 (= t3_st (_ bv0 32)))).def_1263318))
(assert (let ((.def_1281896 (= E_4 (_ bv0 32)))).def_1281896))
(assert (let ((.def_1281898 (= E_3 (_ bv0 32)))).def_1281898))
(assert (let ((.def_1281901 (= T4_E (_ bv0 32)))).def_1281901))
(assert (let ((.def_1281904 (= T3_E (_ bv0 32)))).def_1281904))
(assert (let ((.def_1281907 (= T2_E (_ bv0 32)))).def_1281907))
(assert (let ((.def_1281910 (= T1_E (_ bv0 32)))).def_1281910))
(assert (let ((.def_1281913 (= M_E (_ bv0 32)))).def_1281913))

