(set-info :source |printed by MathSAT|)
(declare-fun |assert::arg| () (_ BitVec 8))
(declare-fun st1 () (_ BitVec 8))
(declare-fun st2 () (_ BitVec 8))
(declare-fun st3 () (_ BitVec 8))
(declare-fun r1 () (_ BitVec 8))
(declare-fun mode1 () (_ BitVec 8))
(declare-fun mode2 () (_ BitVec 8))
(declare-fun mode3 () (_ BitVec 8))
(declare-fun send3 () (_ BitVec 8))
(declare-fun id1 () (_ BitVec 8))
(declare-fun id2 () (_ BitVec 8))
(declare-fun send1 () (_ BitVec 8))
(declare-fun id3 () (_ BitVec 8))
(declare-fun send2 () (_ BitVec 8))
(declare-fun p3_new () (_ BitVec 8))
(declare-fun nomsg () (_ BitVec 8))
(declare-fun p1_new () (_ BitVec 8))
(declare-fun p2_new () (_ BitVec 8))
(declare-fun p3_old () (_ BitVec 8))
(declare-fun p1_old () (_ BitVec 8))
(declare-fun p2_old () (_ BitVec 8))
(declare-fun |node3::__CPAchecker_TMP_0| () (_ BitVec 32))
(declare-fun |node2::__CPAchecker_TMP_0| () (_ BitVec 32))
(declare-fun |node1::__CPAchecker_TMP_0| () (_ BitVec 32))

assert:
(assert (let ((.def_1347 (= |assert::arg| (_ bv0 8)))).def_1347))

main1 N210:
(assert (let ((.def_1514 (= st1 (_ bv0 8)))).def_1514))
(assert (let ((.def_1517 (= st2 (_ bv0 8)))).def_1517))
(assert (let ((.def_1520 (= st3 (_ bv0 8)))).def_1520))
(assert (let ((.def_1523 (= r1 (_ bv0 8)))).def_1523))
(assert (let ((.def_1526 (= mode1 (_ bv0 8)))).def_1526))
(assert (let ((.def_1529 (= mode2 (_ bv0 8)))).def_1529))
(assert (let ((.def_1532 (= mode3 (_ bv0 8)))).def_1532))
(assert (let ((.def_2400 (= st1 st3))).def_2400))
(assert (let ((.def_2402 (= st2 st3))).def_2402))
(assert (let ((.def_2407 ((_ sign_extend 24) id1)))(let ((.def_2405 ((_ sign_extend 24) send3)))(let ((.def_2408 (= .def_2405 .def_2407))).def_2408))))
(assert (let ((.def_2412 (= id2 send1))).def_2412))
(assert (let ((.def_2415 ((_ sign_extend 24) send1)))(let ((.def_2414 ((_ sign_extend 24) id2)))(let ((.def_2416 (= .def_2414 .def_2415))).def_2416))))
(assert (let ((.def_2420 (= id3 send2))).def_2420))
(assert (let ((.def_2423 ((_ sign_extend 24) send2)))(let ((.def_2422 ((_ sign_extend 24) id3)))(let ((.def_2424 (= .def_2422 .def_2423))).def_2424))))
(assert (let ((.def_2428 (= p3_new nomsg))).def_2428))
(assert (let ((.def_2431 (= nomsg p1_new))).def_2431))
(assert (let ((.def_2434 (= nomsg p2_new))).def_2434))
(assert (let ((.def_2437 ((_ sign_extend 24) p3_old)))(let ((.def_2407 ((_ sign_extend 24) id1)))(let ((.def_2438 (= .def_2407 .def_2437))).def_2438))))
(assert (let ((.def_2443 ((_ sign_extend 24) st1)))(let ((.def_2442 ((_ sign_extend 24) st2)))(let ((.def_2445 (bvadd .def_2442 .def_2443)))(let ((.def_2440 ((_ sign_extend 24) st3)))(let ((.def_2441 (bvneg .def_2440)))(let ((.def_2446 (= .def_2441 .def_2445))).def_2446)))))))
(assert (let ((.def_2449 ((_ sign_extend 24) p1_old)))(let ((.def_2414 ((_ sign_extend 24) id2)))(let ((.def_2450 (= .def_2414 .def_2449))).def_2450))))
(assert (let ((.def_2453 ((_ sign_extend 24) p2_old)))(let ((.def_2422 ((_ sign_extend 24) id3)))(let ((.def_2454 (= .def_2422 .def_2453))).def_2454))))
(assert (let ((.def_4098 (= st1 (_ bv1 8)))).def_4098))
(assert (let ((.def_2443 ((_ sign_extend 24) st1)))(let ((.def_2442 ((_ sign_extend 24) st2)))(let ((.def_4100 (= .def_2442 .def_2443))).def_4100))))
(assert (let ((.def_4102 (= st2 (_ bv1 8)))).def_4102))
(assert (let ((.def_4104 ((_ zero_extend 24) r1)))(let ((.def_4105 (bvslt .def_4104 (_ bv3 32)))).def_4105)))
(assert (let ((.def_2423 ((_ sign_extend 24) send2)))(let ((.def_2422 ((_ sign_extend 24) id3)))(let ((.def_6189 (bvslt .def_2422 .def_2423))).def_6189))))
(assert (let ((.def_2415 ((_ sign_extend 24) send1)))(let ((.def_2414 ((_ sign_extend 24) id2)))(let ((.def_6191 (bvslt .def_2414 .def_2415))).def_6191))))
(assert (let ((.def_2422 ((_ sign_extend 24) id3)))(let ((.def_2415 ((_ sign_extend 24) send1)))(let ((.def_6193 (= .def_2415 .def_2422))).def_6193))))
(assert (let ((.def_2422 ((_ sign_extend 24) id3)))(let ((.def_2405 ((_ sign_extend 24) send3)))(let ((.def_6195 (= .def_2405 .def_2422))).def_6195))))
(assert (let ((.def_2407 ((_ sign_extend 24) id1)))(let ((.def_6197 ((_ extract 31 31) .def_2407)))(let ((.def_6198 (= .def_6197 (_ bv1 1)))).def_6198))))
(assert (let ((.def_2415 ((_ sign_extend 24) send1)))(let ((.def_2407 ((_ sign_extend 24) id1)))(let ((.def_6200 (= .def_2407 .def_2415))).def_6200))))
(assert (let ((.def_2422 ((_ sign_extend 24) id3)))(let ((.def_6202 ((_ extract 31 31) .def_2422)))(let ((.def_6203 (= .def_6202 (_ bv1 1)))).def_6203))))
(assert (let ((.def_6205 (= st1 st2))).def_6205))
(assert (let ((.def_2414 ((_ sign_extend 24) id2)))(let ((.def_6207 ((_ extract 31 31) .def_2414)))(let ((.def_6208 (= .def_6207 (_ bv1 1)))).def_6208))))
(assert (let ((.def_2423 ((_ sign_extend 24) send2)))(let ((.def_2414 ((_ sign_extend 24) id2)))(let ((.def_6210 (= .def_2414 .def_2423))).def_6210))))
(assert (let ((.def_2405 ((_ sign_extend 24) send3)))(let ((.def_2407 ((_ sign_extend 24) id1)))(let ((.def_6212 (bvslt .def_2407 .def_2405))).def_6212))))
(assert (let ((.def_2423 ((_ sign_extend 24) send2)))(let ((.def_2407 ((_ sign_extend 24) id1)))(let ((.def_6214 (= .def_2407 .def_2423))).def_6214))))
(assert (let ((.def_6216 (= send2 nomsg))).def_6216))
(assert (let ((.def_6218 ((_ sign_extend 24) nomsg)))(let ((.def_2423 ((_ sign_extend 24) send2)))(let ((.def_6219 (= .def_2423 .def_6218))).def_6219))))
(assert (let ((.def_6218 ((_ sign_extend 24) nomsg)))(let ((.def_2405 ((_ sign_extend 24) send3)))(let ((.def_6221 (= .def_2405 .def_6218))).def_6221))))
(assert (let ((.def_2449 ((_ sign_extend 24) p1_old)))(let ((.def_2422 ((_ sign_extend 24) id3)))(let ((.def_6223 (= .def_2422 .def_2449))).def_6223))))
(assert (let ((.def_6226 ((_ extract 7 0) |node3::__CPAchecker_TMP_0|)))(let ((.def_6227 ((_ sign_extend 24) .def_6226)))(let ((.def_2407 ((_ sign_extend 24) id1)))(let ((.def_6228 (= .def_2407 .def_6227))).def_6228)))))
(assert (let ((.def_2437 ((_ sign_extend 24) p3_old)))(let ((.def_2407 ((_ sign_extend 24) id1)))(let ((.def_6230 (bvslt .def_2407 .def_2437))).def_6230))))
(assert (let ((.def_2405 ((_ sign_extend 24) send3)))(let ((.def_6232 (= .def_2405 |node3::__CPAchecker_TMP_0|))).def_6232)))
(assert (let ((.def_2453 ((_ sign_extend 24) p2_old)))(let ((.def_2422 ((_ sign_extend 24) id3)))(let ((.def_6234 (bvslt .def_2422 .def_2453))).def_6234))))
(assert (let ((.def_2449 ((_ sign_extend 24) p1_old)))(let ((.def_2414 ((_ sign_extend 24) id2)))(let ((.def_6236 (bvslt .def_2414 .def_2449))).def_6236))))
(assert (let ((.def_6238 (= id3 p1_old))).def_6238))
(assert (let ((.def_2422 ((_ sign_extend 24) id3)))(let ((.def_6240 (= .def_2422 |node3::__CPAchecker_TMP_0|))).def_6240)))
(assert (let ((.def_2423 ((_ sign_extend 24) send2)))(let ((.def_6243 (= .def_2423 |node2::__CPAchecker_TMP_0|))).def_6243)))
(assert (let ((.def_6245 ((_ extract 7 0) |node2::__CPAchecker_TMP_0|)))(let ((.def_6246 (= p2_old .def_6245))).def_6246)))
(assert (let ((.def_2453 ((_ sign_extend 24) p2_old)))(let ((.def_2407 ((_ sign_extend 24) id1)))(let ((.def_6248 (= .def_2407 .def_2453))).def_6248))))
(assert (let ((.def_6250 (= send3 p3_old))).def_6250))
(assert (let ((.def_2415 ((_ sign_extend 24) send1)))(let ((.def_6253 (= .def_2415 |node1::__CPAchecker_TMP_0|))).def_6253)))
(assert (let ((.def_6255 ((_ extract 7 0) |node1::__CPAchecker_TMP_0|)))(let ((.def_6256 (= p1_old .def_6255))).def_6256)))
(assert (let ((.def_6218 ((_ sign_extend 24) nomsg)))(let ((.def_2414 ((_ sign_extend 24) id2)))(let ((.def_6258 (= .def_2414 .def_6218))).def_6258))))
(assert (let ((.def_2437 ((_ sign_extend 24) p3_old)))(let ((.def_2414 ((_ sign_extend 24) id2)))(let ((.def_6260 (= .def_2414 .def_2437))).def_6260))))
(assert (let ((.def_6218 ((_ sign_extend 24) nomsg)))(let ((.def_2453 ((_ sign_extend 24) p2_old)))(let ((.def_6262 (= .def_2453 .def_6218))).def_6262))))
(assert (let ((.def_6218 ((_ sign_extend 24) nomsg)))(let ((.def_2437 ((_ sign_extend 24) p3_old)))(let ((.def_6264 (= .def_2437 .def_6218))).def_6264))))
(assert (let ((.def_6226 ((_ extract 7 0) |node3::__CPAchecker_TMP_0|)))(let ((.def_6266 (= send3 .def_6226))).def_6266)))
(assert (let ((.def_2415 ((_ sign_extend 24) send1)))(let ((.def_2407 ((_ sign_extend 24) id1)))(let ((.def_6268 (bvslt .def_2407 .def_2415))).def_6268))))
(assert (let ((.def_6270 (= send3 send1))).def_6270))
(assert (let ((.def_6272 (= r1 (_ bv1 8)))).def_6272))
(assert (let ((.def_6274 (= send1 p3_old))).def_6274))
(assert (let ((.def_21433 (= nomsg (_ bv255 8)))).def_21433))
(assert (let ((.def_2405 ((_ sign_extend 24) send3)))(let ((.def_2422 ((_ sign_extend 24) id3)))(let ((.def_21435 (bvslt .def_2422 .def_2405))).def_21435))))
(assert (let ((.def_2415 ((_ sign_extend 24) send1)))(let ((.def_2405 ((_ sign_extend 24) send3)))(let ((.def_21437 (= .def_2405 .def_2415))).def_21437))))
(assert (let ((.def_21439 ((_ zero_extend 24) send1)))(let ((.def_2415 ((_ sign_extend 24) send1)))(let ((.def_21440 (bvult .def_2415 .def_21439))).def_21440))))
(assert (let ((.def_2415 ((_ sign_extend 24) send1)))(let ((.def_21439 ((_ zero_extend 24) send1)))(let ((.def_21442 (bvult .def_21439 .def_2415))).def_21442))))
(assert (let ((.def_21444 (bvult send1 (_ bv128 8)))).def_21444))
(assert (let ((.def_21446 (bvult send2 (_ bv128 8)))).def_21446))
(assert (let ((.def_2423 ((_ sign_extend 24) send2)))(let ((.def_2407 ((_ sign_extend 24) id1)))(let ((.def_21448 (bvslt .def_2407 .def_2423))).def_21448))))
(assert (let ((.def_2405 ((_ sign_extend 24) send3)))(let ((.def_2414 ((_ sign_extend 24) id2)))(let ((.def_21450 (bvslt .def_2414 .def_2405))).def_21450))))
(assert (let ((.def_2414 ((_ sign_extend 24) id2)))(let ((.def_2405 ((_ sign_extend 24) send3)))(let ((.def_21452 (= .def_2405 .def_2414))).def_21452))))
(assert (let ((.def_21454 (= send3 send2))).def_21454))
(assert (let ((.def_2423 ((_ sign_extend 24) send2)))(let ((.def_2414 ((_ sign_extend 24) id2)))(let ((.def_21456 (bvslt .def_2414 .def_2423))).def_21456))))
(assert (let ((.def_2423 ((_ sign_extend 24) send2)))(let ((.def_2405 ((_ sign_extend 24) send3)))(let ((.def_21458 (= .def_2405 .def_2423))).def_21458))))
(assert (let ((.def_21460 (= send1 nomsg))).def_21460))
(assert (let ((.def_6218 ((_ sign_extend 24) nomsg)))(let ((.def_2415 ((_ sign_extend 24) send1)))(let ((.def_21462 (= .def_2415 .def_6218))).def_21462))))
(assert (let ((.def_21464 ((_ sign_extend 24) p2_new)))(let ((.def_2423 ((_ sign_extend 24) send2)))(let ((.def_21465 (= .def_2423 .def_21464))).def_21465))))
(assert (let ((.def_21467 ((_ sign_extend 24) p3_new)))(let ((.def_2405 ((_ sign_extend 24) send3)))(let ((.def_21468 (= .def_2405 .def_21467))).def_21468))))
(assert (let ((.def_2414 ((_ sign_extend 24) id2)))(let ((.def_21470 (= .def_2414 |node2::__CPAchecker_TMP_0|))).def_21470)))
(assert (let ((.def_21472 (= id1 p1_old))).def_21472))
(assert (let ((.def_21474 (= id3 p3_old))).def_21474))
(assert (let ((.def_2449 ((_ sign_extend 24) p1_old)))(let ((.def_2407 ((_ sign_extend 24) id1)))(let ((.def_21476 (bvslt .def_2407 .def_2449))).def_21476))))
(assert (let ((.def_2449 ((_ sign_extend 24) p1_old)))(let ((.def_2422 ((_ sign_extend 24) id3)))(let ((.def_21478 (bvslt .def_2422 .def_2449))).def_21478))))
(assert (let ((.def_2449 ((_ sign_extend 24) p1_old)))(let ((.def_2407 ((_ sign_extend 24) id1)))(let ((.def_21480 (= .def_2407 .def_2449))).def_21480))))
(assert (let ((.def_21482 (= id2 p2_old))).def_21482))
(assert (let ((.def_2407 ((_ sign_extend 24) id1)))(let ((.def_21484 (= .def_2407 |node1::__CPAchecker_TMP_0|))).def_21484)))
(assert (let ((.def_21486 (= send3 id2))).def_21486))
(assert (let ((.def_21488 (= send2 p2_old))).def_21488))
(assert (let ((.def_2449 ((_ sign_extend 24) p1_old)))(let ((.def_2415 ((_ sign_extend 24) send1)))(let ((.def_21490 (= .def_2415 .def_2449))).def_21490))))
(assert (let ((.def_2453 ((_ sign_extend 24) p2_old)))(let ((.def_2414 ((_ sign_extend 24) id2)))(let ((.def_21492 (bvslt .def_2414 .def_2453))).def_21492))))
(assert (let ((.def_2453 ((_ sign_extend 24) p2_old)))(let ((.def_2414 ((_ sign_extend 24) id2)))(let ((.def_21494 (= .def_2414 .def_2453))).def_21494))))
(assert (let ((.def_2453 ((_ sign_extend 24) p2_old)))(let ((.def_2407 ((_ sign_extend 24) id1)))(let ((.def_21496 (bvslt .def_2407 .def_2453))).def_21496))))
(assert (let ((.def_2453 ((_ sign_extend 24) p2_old)))(let ((.def_2423 ((_ sign_extend 24) send2)))(let ((.def_21498 (= .def_2423 .def_2453))).def_21498))))
(assert (let ((.def_21500 (= send1 p1_old))).def_21500))
(assert (let ((.def_2437 ((_ sign_extend 24) p3_old)))(let ((.def_2422 ((_ sign_extend 24) id3)))(let ((.def_21502 (= .def_2422 .def_2437))).def_21502))))
(assert (let ((.def_2437 ((_ sign_extend 24) p3_old)))(let ((.def_2422 ((_ sign_extend 24) id3)))(let ((.def_21504 (bvslt .def_2422 .def_2437))).def_21504))))
(assert (let ((.def_2437 ((_ sign_extend 24) p3_old)))(let ((.def_2414 ((_ sign_extend 24) id2)))(let ((.def_21506 (bvslt .def_2414 .def_2437))).def_21506))))
(assert (let ((.def_21508 ((_ zero_extend 24) p3_old)))(let ((.def_2422 ((_ sign_extend 24) id3)))(let ((.def_21509 (bvult .def_2422 .def_21508))).def_21509))))
(assert (let ((.def_21511 ((_ zero_extend 24) p1_old)))(let ((.def_21512 (bvult (_ bv127 32) .def_21511))).def_21512)))
(assert (let ((.def_2407 ((_ sign_extend 24) id1)))(let ((.def_21514 (bvult (_ bv127 32) .def_2407))).def_21514)))
(assert (let ((.def_2422 ((_ sign_extend 24) id3)))(let ((.def_2407 ((_ sign_extend 24) id1)))(let ((.def_21517 (bvadd .def_2407 .def_2422)))(let ((.def_21518 (bvmul (_ bv4294967295 32) .def_21517)))(let ((.def_21508 ((_ zero_extend 24) p3_old)))(let ((.def_21520 (bvadd .def_21508 .def_21518)))(let ((.def_21511 ((_ zero_extend 24) p1_old)))(let ((.def_21516 (bvneg .def_21511)))(let ((.def_21521 (= .def_21516 .def_21520))).def_21521))))))))))
(assert (let ((.def_2422 ((_ sign_extend 24) id3)))(let ((.def_21523 (bvult (_ bv2147483647 32) .def_2422))).def_21523)))
(assert (let ((.def_21537 ((_ extract 6 6) id3)))(let ((.def_21538 (bvnot .def_21537)))(let ((.def_21534 ((_ extract 6 6) p2_old)))(let ((.def_21530 ((_ extract 6 6) |node2::__CPAchecker_TMP_0|)))(let ((.def_21526 ((_ extract 6 6) p3_old)))(let ((.def_21527 (bvnot .def_21526)))(let ((.def_21525 ((_ extract 6 6) id2)))(let ((.def_21529 (bvand .def_21525 .def_21527)))(let ((.def_21532 (bvand .def_21529 .def_21530)))(let ((.def_21533 (bvnot .def_21532)))(let ((.def_21536 (bvand .def_21533 .def_21534)))(let ((.def_21540 (bvand .def_21536 .def_21538)))(let ((.def_21541 (= .def_21540 (_ bv0 1)))).def_21541))))))))))))))
(assert (let ((.def_21555 ((_ extract 5 5) id3)))(let ((.def_21556 (bvnot .def_21555)))(let ((.def_21552 ((_ extract 5 5) p2_old)))(let ((.def_21548 ((_ extract 5 5) |node2::__CPAchecker_TMP_0|)))(let ((.def_21544 ((_ extract 5 5) p3_old)))(let ((.def_21545 (bvnot .def_21544)))(let ((.def_21543 ((_ extract 5 5) id2)))(let ((.def_21547 (bvand .def_21543 .def_21545)))(let ((.def_21550 (bvand .def_21547 .def_21548)))(let ((.def_21551 (bvnot .def_21550)))(let ((.def_21554 (bvand .def_21551 .def_21552)))(let ((.def_21558 (bvand .def_21554 .def_21556)))(let ((.def_21559 (= .def_21558 (_ bv0 1)))).def_21559))))))))))))))
(assert (let ((.def_21573 ((_ extract 4 4) id3)))(let ((.def_21574 (bvnot .def_21573)))(let ((.def_21570 ((_ extract 4 4) p2_old)))(let ((.def_21566 ((_ extract 4 4) |node2::__CPAchecker_TMP_0|)))(let ((.def_21562 ((_ extract 4 4) p3_old)))(let ((.def_21563 (bvnot .def_21562)))(let ((.def_21561 ((_ extract 4 4) id2)))(let ((.def_21565 (bvand .def_21561 .def_21563)))(let ((.def_21568 (bvand .def_21565 .def_21566)))(let ((.def_21569 (bvnot .def_21568)))(let ((.def_21572 (bvand .def_21569 .def_21570)))(let ((.def_21576 (bvand .def_21572 .def_21574)))(let ((.def_21577 (= .def_21576 (_ bv0 1)))).def_21577))))))))))))))
(assert (let ((.def_21591 ((_ extract 3 3) id3)))(let ((.def_21592 (bvnot .def_21591)))(let ((.def_21588 ((_ extract 3 3) p2_old)))(let ((.def_21584 ((_ extract 3 3) |node2::__CPAchecker_TMP_0|)))(let ((.def_21580 ((_ extract 3 3) p3_old)))(let ((.def_21581 (bvnot .def_21580)))(let ((.def_21579 ((_ extract 3 3) id2)))(let ((.def_21583 (bvand .def_21579 .def_21581)))(let ((.def_21586 (bvand .def_21583 .def_21584)))(let ((.def_21587 (bvnot .def_21586)))(let ((.def_21590 (bvand .def_21587 .def_21588)))(let ((.def_21594 (bvand .def_21590 .def_21592)))(let ((.def_21595 (= .def_21594 (_ bv0 1)))).def_21595))))))))))))))
(assert (let ((.def_21609 ((_ extract 2 2) id3)))(let ((.def_21610 (bvnot .def_21609)))(let ((.def_21606 ((_ extract 2 2) p2_old)))(let ((.def_21602 ((_ extract 2 2) |node2::__CPAchecker_TMP_0|)))(let ((.def_21598 ((_ extract 2 2) p3_old)))(let ((.def_21599 (bvnot .def_21598)))(let ((.def_21597 ((_ extract 2 2) id2)))(let ((.def_21601 (bvand .def_21597 .def_21599)))(let ((.def_21604 (bvand .def_21601 .def_21602)))(let ((.def_21605 (bvnot .def_21604)))(let ((.def_21608 (bvand .def_21605 .def_21606)))(let ((.def_21612 (bvand .def_21608 .def_21610)))(let ((.def_21613 (= .def_21612 (_ bv0 1)))).def_21613))))))))))))))
(assert (let ((.def_21627 ((_ extract 1 1) id3)))(let ((.def_21628 (bvnot .def_21627)))(let ((.def_21624 ((_ extract 1 1) p2_old)))(let ((.def_21620 ((_ extract 1 1) |node2::__CPAchecker_TMP_0|)))(let ((.def_21616 ((_ extract 1 1) p3_old)))(let ((.def_21617 (bvnot .def_21616)))(let ((.def_21615 ((_ extract 1 1) id2)))(let ((.def_21619 (bvand .def_21615 .def_21617)))(let ((.def_21622 (bvand .def_21619 .def_21620)))(let ((.def_21623 (bvnot .def_21622)))(let ((.def_21626 (bvand .def_21623 .def_21624)))(let ((.def_21630 (bvand .def_21626 .def_21628)))(let ((.def_21631 (= .def_21630 (_ bv0 1)))).def_21631))))))))))))))
(assert (let ((.def_21656 ((_ extract 0 0) id3)))(let ((.def_21657 (bvnot .def_21656)))(let ((.def_21653 ((_ extract 0 0) p2_old)))(let ((.def_21649 ((_ extract 0 0) |node2::__CPAchecker_TMP_0|)))(let ((.def_21645 ((_ extract 0 0) p3_old)))(let ((.def_21646 (bvnot .def_21645)))(let ((.def_21642 ((_ extract 0 0) id2)))(let ((.def_21620 ((_ extract 1 1) |node2::__CPAchecker_TMP_0|)))(let ((.def_21638 (bvnot .def_21620)))(let ((.def_21624 ((_ extract 1 1) p2_old)))(let ((.def_21635 (bvnot .def_21624)))(let ((.def_21627 ((_ extract 1 1) id3)))(let ((.def_21628 (bvnot .def_21627)))(let ((.def_21616 ((_ extract 1 1) p3_old)))(let ((.def_21633 (bvand .def_21616 .def_21628)))(let ((.def_21634 (bvnot .def_21633)))(let ((.def_21637 (bvand .def_21634 .def_21635)))(let ((.def_21640 (bvand .def_21637 .def_21638)))(let ((.def_21615 ((_ extract 1 1) id2)))(let ((.def_21641 (bvor .def_21615 .def_21640)))(let ((.def_21644 (bvand .def_21641 .def_21642)))(let ((.def_21648 (bvand .def_21644 .def_21646)))(let ((.def_21651 (bvand .def_21648 .def_21649)))(let ((.def_21652 (bvnot .def_21651)))(let ((.def_21655 (bvand .def_21652 .def_21653)))(let ((.def_21659 (bvand .def_21655 .def_21657)))(let ((.def_21660 (= .def_21659 (_ bv0 1)))).def_21660))))))))))))))))))))))))))))
(assert (let ((.def_21602 ((_ extract 2 2) |node2::__CPAchecker_TMP_0|)))(let ((.def_21667 (bvnot .def_21602)))(let ((.def_21606 ((_ extract 2 2) p2_old)))(let ((.def_21664 (bvnot .def_21606)))(let ((.def_21609 ((_ extract 2 2) id3)))(let ((.def_21610 (bvnot .def_21609)))(let ((.def_21598 ((_ extract 2 2) p3_old)))(let ((.def_21662 (bvand .def_21598 .def_21610)))(let ((.def_21663 (bvnot .def_21662)))(let ((.def_21666 (bvand .def_21663 .def_21664)))(let ((.def_21669 (bvand .def_21666 .def_21667)))(let ((.def_21597 ((_ extract 2 2) id2)))(let ((.def_21670 (bvor .def_21597 .def_21669)))(let ((.def_21671 (= .def_21670 (_ bv1 1)))).def_21671)))))))))))))))
(assert (let ((.def_21584 ((_ extract 3 3) |node2::__CPAchecker_TMP_0|)))(let ((.def_21678 (bvnot .def_21584)))(let ((.def_21588 ((_ extract 3 3) p2_old)))(let ((.def_21675 (bvnot .def_21588)))(let ((.def_21591 ((_ extract 3 3) id3)))(let ((.def_21592 (bvnot .def_21591)))(let ((.def_21580 ((_ extract 3 3) p3_old)))(let ((.def_21673 (bvand .def_21580 .def_21592)))(let ((.def_21674 (bvnot .def_21673)))(let ((.def_21677 (bvand .def_21674 .def_21675)))(let ((.def_21680 (bvand .def_21677 .def_21678)))(let ((.def_21579 ((_ extract 3 3) id2)))(let ((.def_21681 (bvor .def_21579 .def_21680)))(let ((.def_21682 (= .def_21681 (_ bv1 1)))).def_21682)))))))))))))))
(assert (let ((.def_21566 ((_ extract 4 4) |node2::__CPAchecker_TMP_0|)))(let ((.def_21689 (bvnot .def_21566)))(let ((.def_21570 ((_ extract 4 4) p2_old)))(let ((.def_21686 (bvnot .def_21570)))(let ((.def_21573 ((_ extract 4 4) id3)))(let ((.def_21574 (bvnot .def_21573)))(let ((.def_21562 ((_ extract 4 4) p3_old)))(let ((.def_21684 (bvand .def_21562 .def_21574)))(let ((.def_21685 (bvnot .def_21684)))(let ((.def_21688 (bvand .def_21685 .def_21686)))(let ((.def_21691 (bvand .def_21688 .def_21689)))(let ((.def_21561 ((_ extract 4 4) id2)))(let ((.def_21692 (bvor .def_21561 .def_21691)))(let ((.def_21693 (= .def_21692 (_ bv1 1)))).def_21693)))))))))))))))
(assert (let ((.def_21548 ((_ extract 5 5) |node2::__CPAchecker_TMP_0|)))(let ((.def_21700 (bvnot .def_21548)))(let ((.def_21552 ((_ extract 5 5) p2_old)))(let ((.def_21697 (bvnot .def_21552)))(let ((.def_21555 ((_ extract 5 5) id3)))(let ((.def_21556 (bvnot .def_21555)))(let ((.def_21544 ((_ extract 5 5) p3_old)))(let ((.def_21695 (bvand .def_21544 .def_21556)))(let ((.def_21696 (bvnot .def_21695)))(let ((.def_21699 (bvand .def_21696 .def_21697)))(let ((.def_21702 (bvand .def_21699 .def_21700)))(let ((.def_21543 ((_ extract 5 5) id2)))(let ((.def_21703 (bvor .def_21543 .def_21702)))(let ((.def_21704 (= .def_21703 (_ bv1 1)))).def_21704)))))))))))))))
(assert (let ((.def_21530 ((_ extract 6 6) |node2::__CPAchecker_TMP_0|)))(let ((.def_21711 (bvnot .def_21530)))(let ((.def_21534 ((_ extract 6 6) p2_old)))(let ((.def_21708 (bvnot .def_21534)))(let ((.def_21537 ((_ extract 6 6) id3)))(let ((.def_21538 (bvnot .def_21537)))(let ((.def_21526 ((_ extract 6 6) p3_old)))(let ((.def_21706 (bvand .def_21526 .def_21538)))(let ((.def_21707 (bvnot .def_21706)))(let ((.def_21710 (bvand .def_21707 .def_21708)))(let ((.def_21713 (bvand .def_21710 .def_21711)))(let ((.def_21525 ((_ extract 6 6) id2)))(let ((.def_21714 (bvor .def_21525 .def_21713)))(let ((.def_21715 (= .def_21714 (_ bv1 1)))).def_21715)))))))))))))))
(assert (let ((.def_21573 ((_ extract 4 4) id3)))(let ((.def_21574 (bvnot .def_21573)))(let ((.def_21570 ((_ extract 4 4) p2_old)))(let ((.def_21566 ((_ extract 4 4) |node2::__CPAchecker_TMP_0|)))(let ((.def_21562 ((_ extract 4 4) p3_old)))(let ((.def_21563 (bvnot .def_21562)))(let ((.def_21561 ((_ extract 4 4) id2)))(let ((.def_21565 (bvand .def_21561 .def_21563)))(let ((.def_21568 (bvand .def_21565 .def_21566)))(let ((.def_21569 (bvnot .def_21568)))(let ((.def_21572 (bvand .def_21569 .def_21570)))(let ((.def_21576 (bvand .def_21572 .def_21574)))(let ((.def_21730 (bvnot .def_21576)))(let ((.def_21591 ((_ extract 3 3) id3)))(let ((.def_21592 (bvnot .def_21591)))(let ((.def_21588 ((_ extract 3 3) p2_old)))(let ((.def_21584 ((_ extract 3 3) |node2::__CPAchecker_TMP_0|)))(let ((.def_21580 ((_ extract 3 3) p3_old)))(let ((.def_21581 (bvnot .def_21580)))(let ((.def_21579 ((_ extract 3 3) id2)))(let ((.def_21583 (bvand .def_21579 .def_21581)))(let ((.def_21586 (bvand .def_21583 .def_21584)))(let ((.def_21587 (bvnot .def_21586)))(let ((.def_21590 (bvand .def_21587 .def_21588)))(let ((.def_21594 (bvand .def_21590 .def_21592)))(let ((.def_21726 (bvnot .def_21594)))(let ((.def_21609 ((_ extract 2 2) id3)))(let ((.def_21610 (bvnot .def_21609)))(let ((.def_21606 ((_ extract 2 2) p2_old)))(let ((.def_21602 ((_ extract 2 2) |node2::__CPAchecker_TMP_0|)))(let ((.def_21598 ((_ extract 2 2) p3_old)))(let ((.def_21599 (bvnot .def_21598)))(let ((.def_21597 ((_ extract 2 2) id2)))(let ((.def_21601 (bvand .def_21597 .def_21599)))(let ((.def_21604 (bvand .def_21601 .def_21602)))(let ((.def_21605 (bvnot .def_21604)))(let ((.def_21608 (bvand .def_21605 .def_21606)))(let ((.def_21612 (bvand .def_21608 .def_21610)))(let ((.def_21722 (bvnot .def_21612)))(let ((.def_21656 ((_ extract 0 0) id3)))(let ((.def_21657 (bvnot .def_21656)))(let ((.def_21653 ((_ extract 0 0) p2_old)))(let ((.def_21649 ((_ extract 0 0) |node2::__CPAchecker_TMP_0|)))(let ((.def_21645 ((_ extract 0 0) p3_old)))(let ((.def_21646 (bvnot .def_21645)))(let ((.def_21642 ((_ extract 0 0) id2)))(let ((.def_21620 ((_ extract 1 1) |node2::__CPAchecker_TMP_0|)))(let ((.def_21638 (bvnot .def_21620)))(let ((.def_21624 ((_ extract 1 1) p2_old)))(let ((.def_21635 (bvnot .def_21624)))(let ((.def_21627 ((_ extract 1 1) id3)))(let ((.def_21628 (bvnot .def_21627)))(let ((.def_21616 ((_ extract 1 1) p3_old)))(let ((.def_21633 (bvand .def_21616 .def_21628)))(let ((.def_21634 (bvnot .def_21633)))(let ((.def_21637 (bvand .def_21634 .def_21635)))(let ((.def_21640 (bvand .def_21637 .def_21638)))(let ((.def_21615 ((_ extract 1 1) id2)))(let ((.def_21641 (bvor .def_21615 .def_21640)))(let ((.def_21644 (bvand .def_21641 .def_21642)))(let ((.def_21648 (bvand .def_21644 .def_21646)))(let ((.def_21651 (bvand .def_21648 .def_21649)))(let ((.def_21652 (bvnot .def_21651)))(let ((.def_21655 (bvand .def_21652 .def_21653)))(let ((.def_21659 (bvand .def_21655 .def_21657)))(let ((.def_21718 (bvnot .def_21659)))(let ((.def_21617 (bvnot .def_21616)))(let ((.def_21619 (bvand .def_21615 .def_21617)))(let ((.def_21622 (bvand .def_21619 .def_21620)))(let ((.def_21623 (bvnot .def_21622)))(let ((.def_21626 (bvand .def_21623 .def_21624)))(let ((.def_21630 (bvand .def_21626 .def_21628)))(let ((.def_21717 (bvnot .def_21630)))(let ((.def_21720 (bvand .def_21717 .def_21718)))(let ((.def_21667 (bvnot .def_21602)))(let ((.def_21664 (bvnot .def_21606)))(let ((.def_21662 (bvand .def_21598 .def_21610)))(let ((.def_21663 (bvnot .def_21662)))(let ((.def_21666 (bvand .def_21663 .def_21664)))(let ((.def_21669 (bvand .def_21666 .def_21667)))(let ((.def_21670 (bvor .def_21597 .def_21669)))(let ((.def_21721 (bvand .def_21670 .def_21720)))(let ((.def_21724 (bvand .def_21721 .def_21722)))(let ((.def_21678 (bvnot .def_21584)))(let ((.def_21675 (bvnot .def_21588)))(let ((.def_21673 (bvand .def_21580 .def_21592)))(let ((.def_21674 (bvnot .def_21673)))(let ((.def_21677 (bvand .def_21674 .def_21675)))(let ((.def_21680 (bvand .def_21677 .def_21678)))(let ((.def_21681 (bvor .def_21579 .def_21680)))(let ((.def_21725 (bvand .def_21681 .def_21724)))(let ((.def_21728 (bvand .def_21725 .def_21726)))(let ((.def_21689 (bvnot .def_21566)))(let ((.def_21686 (bvnot .def_21570)))(let ((.def_21684 (bvand .def_21562 .def_21574)))(let ((.def_21685 (bvnot .def_21684)))(let ((.def_21688 (bvand .def_21685 .def_21686)))(let ((.def_21691 (bvand .def_21688 .def_21689)))(let ((.def_21692 (bvor .def_21561 .def_21691)))(let ((.def_21729 (bvand .def_21692 .def_21728)))(let ((.def_21732 (bvand .def_21729 .def_21730)))(let ((.def_21733 (= .def_21732 (_ bv1 1)))).def_21733)))))))))))))))))))))))))))))))))))))))))))))))))))))))))))))))))))))))))))))))))))))))))))))))))))))))
(assert (let ((.def_21555 ((_ extract 5 5) id3)))(let ((.def_21556 (bvnot .def_21555)))(let ((.def_21552 ((_ extract 5 5) p2_old)))(let ((.def_21548 ((_ extract 5 5) |node2::__CPAchecker_TMP_0|)))(let ((.def_21544 ((_ extract 5 5) p3_old)))(let ((.def_21545 (bvnot .def_21544)))(let ((.def_21543 ((_ extract 5 5) id2)))(let ((.def_21547 (bvand .def_21543 .def_21545)))(let ((.def_21550 (bvand .def_21547 .def_21548)))(let ((.def_21551 (bvnot .def_21550)))(let ((.def_21554 (bvand .def_21551 .def_21552)))(let ((.def_21558 (bvand .def_21554 .def_21556)))(let ((.def_21744 (bvnot .def_21558)))(let ((.def_21740 ((_ extract 7 7) id2)))(let ((.def_21741 (bvnot .def_21740)))(let ((.def_21736 ((_ extract 7 7) id3)))(let ((.def_21737 (bvnot .def_21736)))(let ((.def_21537 ((_ extract 6 6) id3)))(let ((.def_21538 (bvnot .def_21537)))(let ((.def_21534 ((_ extract 6 6) p2_old)))(let ((.def_21530 ((_ extract 6 6) |node2::__CPAchecker_TMP_0|)))(let ((.def_21526 ((_ extract 6 6) p3_old)))(let ((.def_21527 (bvnot .def_21526)))(let ((.def_21525 ((_ extract 6 6) id2)))(let ((.def_21529 (bvand .def_21525 .def_21527)))(let ((.def_21532 (bvand .def_21529 .def_21530)))(let ((.def_21533 (bvnot .def_21532)))(let ((.def_21536 (bvand .def_21533 .def_21534)))(let ((.def_21540 (bvand .def_21536 .def_21538)))(let ((.def_21735 (bvnot .def_21540)))(let ((.def_21739 (bvand .def_21735 .def_21737)))(let ((.def_21743 (bvand .def_21739 .def_21741)))(let ((.def_21746 (bvand .def_21743 .def_21744)))(let ((.def_21747 (= .def_21746 (_ bv1 1)))).def_21747)))))))))))))))))))))))))))))))))))
(assert (let ((.def_21740 ((_ extract 7 7) id2)))(let ((.def_21741 (bvnot .def_21740)))(let ((.def_21736 ((_ extract 7 7) id3)))(let ((.def_21737 (bvnot .def_21736)))(let ((.def_21537 ((_ extract 6 6) id3)))(let ((.def_21538 (bvnot .def_21537)))(let ((.def_21534 ((_ extract 6 6) p2_old)))(let ((.def_21530 ((_ extract 6 6) |node2::__CPAchecker_TMP_0|)))(let ((.def_21526 ((_ extract 6 6) p3_old)))(let ((.def_21527 (bvnot .def_21526)))(let ((.def_21525 ((_ extract 6 6) id2)))(let ((.def_21529 (bvand .def_21525 .def_21527)))(let ((.def_21532 (bvand .def_21529 .def_21530)))(let ((.def_21533 (bvnot .def_21532)))(let ((.def_21536 (bvand .def_21533 .def_21534)))(let ((.def_21540 (bvand .def_21536 .def_21538)))(let ((.def_21735 (bvnot .def_21540)))(let ((.def_21739 (bvand .def_21735 .def_21737)))(let ((.def_21743 (bvand .def_21739 .def_21741)))(let ((.def_21749 (= .def_21743 (_ bv1 1)))).def_21749)))))))))))))))))))))
(assert (let ((.def_21555 ((_ extract 5 5) id3)))(let ((.def_21556 (bvnot .def_21555)))(let ((.def_21552 ((_ extract 5 5) p2_old)))(let ((.def_21548 ((_ extract 5 5) |node2::__CPAchecker_TMP_0|)))(let ((.def_21544 ((_ extract 5 5) p3_old)))(let ((.def_21545 (bvnot .def_21544)))(let ((.def_21543 ((_ extract 5 5) id2)))(let ((.def_21547 (bvand .def_21543 .def_21545)))(let ((.def_21550 (bvand .def_21547 .def_21548)))(let ((.def_21551 (bvnot .def_21550)))(let ((.def_21554 (bvand .def_21551 .def_21552)))(let ((.def_21558 (bvand .def_21554 .def_21556)))(let ((.def_21744 (bvnot .def_21558)))(let ((.def_21740 ((_ extract 7 7) id2)))(let ((.def_21741 (bvnot .def_21740)))(let ((.def_21736 ((_ extract 7 7) id3)))(let ((.def_21737 (bvnot .def_21736)))(let ((.def_21537 ((_ extract 6 6) id3)))(let ((.def_21538 (bvnot .def_21537)))(let ((.def_21534 ((_ extract 6 6) p2_old)))(let ((.def_21530 ((_ extract 6 6) |node2::__CPAchecker_TMP_0|)))(let ((.def_21526 ((_ extract 6 6) p3_old)))(let ((.def_21527 (bvnot .def_21526)))(let ((.def_21525 ((_ extract 6 6) id2)))(let ((.def_21529 (bvand .def_21525 .def_21527)))(let ((.def_21532 (bvand .def_21529 .def_21530)))(let ((.def_21533 (bvnot .def_21532)))(let ((.def_21536 (bvand .def_21533 .def_21534)))(let ((.def_21540 (bvand .def_21536 .def_21538)))(let ((.def_21735 (bvnot .def_21540)))(let ((.def_21739 (bvand .def_21735 .def_21737)))(let ((.def_21743 (bvand .def_21739 .def_21741)))(let ((.def_21746 (bvand .def_21743 .def_21744)))(let ((.def_21573 ((_ extract 4 4) id3)))(let ((.def_21574 (bvnot .def_21573)))(let ((.def_21570 ((_ extract 4 4) p2_old)))(let ((.def_21566 ((_ extract 4 4) |node2::__CPAchecker_TMP_0|)))(let ((.def_21562 ((_ extract 4 4) p3_old)))(let ((.def_21563 (bvnot .def_21562)))(let ((.def_21561 ((_ extract 4 4) id2)))(let ((.def_21565 (bvand .def_21561 .def_21563)))(let ((.def_21568 (bvand .def_21565 .def_21566)))(let ((.def_21569 (bvnot .def_21568)))(let ((.def_21572 (bvand .def_21569 .def_21570)))(let ((.def_21576 (bvand .def_21572 .def_21574)))(let ((.def_21730 (bvnot .def_21576)))(let ((.def_21591 ((_ extract 3 3) id3)))(let ((.def_21592 (bvnot .def_21591)))(let ((.def_21588 ((_ extract 3 3) p2_old)))(let ((.def_21584 ((_ extract 3 3) |node2::__CPAchecker_TMP_0|)))(let ((.def_21580 ((_ extract 3 3) p3_old)))(let ((.def_21581 (bvnot .def_21580)))(let ((.def_21579 ((_ extract 3 3) id2)))(let ((.def_21583 (bvand .def_21579 .def_21581)))(let ((.def_21586 (bvand .def_21583 .def_21584)))(let ((.def_21587 (bvnot .def_21586)))(let ((.def_21590 (bvand .def_21587 .def_21588)))(let ((.def_21594 (bvand .def_21590 .def_21592)))(let ((.def_21726 (bvnot .def_21594)))(let ((.def_21609 ((_ extract 2 2) id3)))(let ((.def_21610 (bvnot .def_21609)))(let ((.def_21606 ((_ extract 2 2) p2_old)))(let ((.def_21602 ((_ extract 2 2) |node2::__CPAchecker_TMP_0|)))(let ((.def_21598 ((_ extract 2 2) p3_old)))(let ((.def_21599 (bvnot .def_21598)))(let ((.def_21597 ((_ extract 2 2) id2)))(let ((.def_21601 (bvand .def_21597 .def_21599)))(let ((.def_21604 (bvand .def_21601 .def_21602)))(let ((.def_21605 (bvnot .def_21604)))(let ((.def_21608 (bvand .def_21605 .def_21606)))(let ((.def_21612 (bvand .def_21608 .def_21610)))(let ((.def_21722 (bvnot .def_21612)))(let ((.def_21656 ((_ extract 0 0) id3)))(let ((.def_21657 (bvnot .def_21656)))(let ((.def_21653 ((_ extract 0 0) p2_old)))(let ((.def_21649 ((_ extract 0 0) |node2::__CPAchecker_TMP_0|)))(let ((.def_21645 ((_ extract 0 0) p3_old)))(let ((.def_21646 (bvnot .def_21645)))(let ((.def_21642 ((_ extract 0 0) id2)))(let ((.def_21620 ((_ extract 1 1) |node2::__CPAchecker_TMP_0|)))(let ((.def_21638 (bvnot .def_21620)))(let ((.def_21624 ((_ extract 1 1) p2_old)))(let ((.def_21635 (bvnot .def_21624)))(let ((.def_21627 ((_ extract 1 1) id3)))(let ((.def_21628 (bvnot .def_21627)))(let ((.def_21616 ((_ extract 1 1) p3_old)))(let ((.def_21633 (bvand .def_21616 .def_21628)))(let ((.def_21634 (bvnot .def_21633)))(let ((.def_21637 (bvand .def_21634 .def_21635)))(let ((.def_21640 (bvand .def_21637 .def_21638)))(let ((.def_21615 ((_ extract 1 1) id2)))(let ((.def_21641 (bvor .def_21615 .def_21640)))(let ((.def_21644 (bvand .def_21641 .def_21642)))(let ((.def_21648 (bvand .def_21644 .def_21646)))(let ((.def_21651 (bvand .def_21648 .def_21649)))(let ((.def_21652 (bvnot .def_21651)))(let ((.def_21655 (bvand .def_21652 .def_21653)))(let ((.def_21659 (bvand .def_21655 .def_21657)))(let ((.def_21718 (bvnot .def_21659)))(let ((.def_21617 (bvnot .def_21616)))(let ((.def_21619 (bvand .def_21615 .def_21617)))(let ((.def_21622 (bvand .def_21619 .def_21620)))(let ((.def_21623 (bvnot .def_21622)))(let ((.def_21626 (bvand .def_21623 .def_21624)))(let ((.def_21630 (bvand .def_21626 .def_21628)))(let ((.def_21717 (bvnot .def_21630)))(let ((.def_21720 (bvand .def_21717 .def_21718)))(let ((.def_21667 (bvnot .def_21602)))(let ((.def_21664 (bvnot .def_21606)))(let ((.def_21662 (bvand .def_21598 .def_21610)))(let ((.def_21663 (bvnot .def_21662)))(let ((.def_21666 (bvand .def_21663 .def_21664)))(let ((.def_21669 (bvand .def_21666 .def_21667)))(let ((.def_21670 (bvor .def_21597 .def_21669)))(let ((.def_21721 (bvand .def_21670 .def_21720)))(let ((.def_21724 (bvand .def_21721 .def_21722)))(let ((.def_21678 (bvnot .def_21584)))(let ((.def_21675 (bvnot .def_21588)))(let ((.def_21673 (bvand .def_21580 .def_21592)))(let ((.def_21674 (bvnot .def_21673)))(let ((.def_21677 (bvand .def_21674 .def_21675)))(let ((.def_21680 (bvand .def_21677 .def_21678)))(let ((.def_21681 (bvor .def_21579 .def_21680)))(let ((.def_21725 (bvand .def_21681 .def_21724)))(let ((.def_21728 (bvand .def_21725 .def_21726)))(let ((.def_21689 (bvnot .def_21566)))(let ((.def_21686 (bvnot .def_21570)))(let ((.def_21684 (bvand .def_21562 .def_21574)))(let ((.def_21685 (bvnot .def_21684)))(let ((.def_21688 (bvand .def_21685 .def_21686)))(let ((.def_21691 (bvand .def_21688 .def_21689)))(let ((.def_21692 (bvor .def_21561 .def_21691)))(let ((.def_21729 (bvand .def_21692 .def_21728)))(let ((.def_21732 (bvand .def_21729 .def_21730)))(let ((.def_21751 (bvand .def_21732 .def_21746)))(let ((.def_21700 (bvnot .def_21548)))(let ((.def_21697 (bvnot .def_21552)))(let ((.def_21695 (bvand .def_21544 .def_21556)))(let ((.def_21696 (bvnot .def_21695)))(let ((.def_21699 (bvand .def_21696 .def_21697)))(let ((.def_21702 (bvand .def_21699 .def_21700)))(let ((.def_21703 (bvor .def_21543 .def_21702)))(let ((.def_21752 (bvand .def_21703 .def_21751)))(let ((.def_21753 (bvand .def_21732 .def_21752)))(let ((.def_21754 (bvand .def_21746 .def_21753)))(let ((.def_21755 (bvand .def_21743 .def_21754)))(let ((.def_21756 (= .def_21755 (_ bv1 1)))).def_21756))))))))))))))))))))))))))))))))))))))))))))))))))))))))))))))))))))))))))))))))))))))))))))))))))))))))))))))))))))))))))))))))))))))))))))))))))))
(assert (let ((.def_21736 ((_ extract 7 7) id3)))(let ((.def_21758 (= .def_21736 (_ bv0 1)))).def_21758)))
(assert (let ((.def_21740 ((_ extract 7 7) id2)))(let ((.def_21760 (= .def_21740 (_ bv0 1)))).def_21760)))
(assert (let ((.def_2453 ((_ sign_extend 24) p2_old)))(let ((.def_2437 ((_ sign_extend 24) p3_old)))(let ((.def_21762 (= .def_2437 .def_2453))).def_21762))))
(assert (let ((.def_2437 ((_ sign_extend 24) p3_old)))(let ((.def_2423 ((_ sign_extend 24) send2)))(let ((.def_21764 (= .def_2423 .def_2437))).def_21764))))
(assert (let ((.def_21766 (= send2 p3_old))).def_21766))
(assert (let ((.def_21768 (= p3_old p2_old))).def_21768))
(assert (let ((.def_2407 ((_ sign_extend 24) id1)))(let ((.def_21770 (bvult (_ bv2147483647 32) .def_2407))).def_21770)))
(assert (let ((.def_21772 (bvult (_ bv127 8) p1_old))).def_21772))
(assert (let ((.def_2437 ((_ sign_extend 24) p3_old)))(let ((.def_2405 ((_ sign_extend 24) send3)))(let ((.def_21774 (= .def_2405 .def_2437))).def_21774))))
(assert (let ((.def_6245 ((_ extract 7 0) |node2::__CPAchecker_TMP_0|)))(let ((.def_21776 ((_ sign_extend 24) .def_6245)))(let ((.def_2422 ((_ sign_extend 24) id3)))(let ((.def_21777 (bvslt .def_2422 .def_21776))).def_21777)))))
(assert (let ((.def_6245 ((_ extract 7 0) |node2::__CPAchecker_TMP_0|)))(let ((.def_21776 ((_ sign_extend 24) .def_6245)))(let ((.def_2407 ((_ sign_extend 24) id1)))(let ((.def_21779 (= .def_2407 .def_21776))).def_21779)))))
(assert (let ((.def_6226 ((_ extract 7 0) |node3::__CPAchecker_TMP_0|)))(let ((.def_21781 (= p3_old .def_6226))).def_21781)))
(assert (let ((.def_6218 ((_ sign_extend 24) nomsg)))(let ((.def_2449 ((_ sign_extend 24) p1_old)))(let ((.def_21783 (= .def_2449 .def_6218))).def_21783))))
(assert (let ((.def_6218 ((_ sign_extend 24) nomsg)))(let ((.def_2422 ((_ sign_extend 24) id3)))(let ((.def_21785 (= .def_2422 .def_6218))).def_21785))))
(assert (let ((.def_2442 ((_ sign_extend 24) st2)))(let ((.def_21787 (bvneg .def_2442)))(let ((.def_2443 ((_ sign_extend 24) st1)))(let ((.def_21788 (= .def_2443 .def_21787))).def_21788)))))
(assert (let ((.def_2422 ((_ sign_extend 24) id3)))(let ((.def_2407 ((_ sign_extend 24) id1)))(let ((.def_21790 (= .def_2407 .def_2422))).def_21790))))
(assert (let ((.def_21792 (= send1 send2))).def_21792))
(assert (let ((.def_2443 ((_ sign_extend 24) st1)))(let ((.def_2440 ((_ sign_extend 24) st3)))(let ((.def_2441 (bvneg .def_2440)))(let ((.def_21794 (= .def_2441 .def_2443))).def_21794)))))
(assert (let ((.def_2443 ((_ sign_extend 24) st1)))(let ((.def_2440 ((_ sign_extend 24) st3)))(let ((.def_21796 (= .def_2440 .def_2443))).def_21796))))
(assert (let ((.def_2442 ((_ sign_extend 24) st2)))(let ((.def_21798 (= .def_2442 (_ bv4294967294 32)))).def_21798)))
(assert (let ((.def_21800 (= st2 (_ bv255 8)))).def_21800))
(assert (let ((.def_21802 (= id1 send2))).def_21802))
(assert (let ((.def_2422 ((_ sign_extend 24) id3)))(let ((.def_2407 ((_ sign_extend 24) id1)))(let ((.def_21804 (bvslt .def_2407 .def_2422))).def_21804))))
(assert (let ((.def_2423 ((_ sign_extend 24) send2)))(let ((.def_2415 ((_ sign_extend 24) send1)))(let ((.def_21806 (= .def_2415 .def_2423))).def_21806))))
(assert (let ((.def_2414 ((_ sign_extend 24) id2)))(let ((.def_2407 ((_ sign_extend 24) id1)))(let ((.def_21808 (= .def_2407 .def_2414))).def_21808))))
(assert (let ((.def_2407 ((_ sign_extend 24) id1)))(let ((.def_2414 ((_ sign_extend 24) id2)))(let ((.def_21810 (bvslt .def_2414 .def_2407))).def_21810))))
(assert (let ((.def_2415 ((_ sign_extend 24) send1)))(let ((.def_2422 ((_ sign_extend 24) id3)))(let ((.def_21812 (bvslt .def_2422 .def_2415))).def_21812))))
(assert (let ((.def_21814 ((_ extract 6 6) send1)))(let ((.def_21878 (bvnot .def_21814)))(let ((.def_21525 ((_ extract 6 6) id2)))(let ((.def_21879 (bvand .def_21525 .def_21878)))(let ((.def_21740 ((_ extract 7 7) id2)))(let ((.def_21741 (bvnot .def_21740)))(let ((.def_21880 (bvand .def_21741 .def_21879)))(let ((.def_21881 (bvnot .def_21880)))(let ((.def_21866 ((_ extract 5 5) send1)))(let ((.def_21875 (bvnot .def_21866)))(let ((.def_21543 ((_ extract 5 5) id2)))(let ((.def_21876 (bvand .def_21543 .def_21875)))(let ((.def_21877 (bvnot .def_21876)))(let ((.def_21883 (bvand .def_21877 .def_21881)))(let ((.def_21819 ((_ extract 4 4) send1)))(let ((.def_21862 (bvnot .def_21819)))(let ((.def_21561 ((_ extract 4 4) id2)))(let ((.def_21863 (bvand .def_21561 .def_21862)))(let ((.def_21872 (bvnot .def_21863)))(let ((.def_21824 ((_ extract 3 3) send1)))(let ((.def_21856 (bvnot .def_21824)))(let ((.def_21579 ((_ extract 3 3) id2)))(let ((.def_21857 (bvand .def_21579 .def_21856)))(let ((.def_21829 ((_ extract 2 2) send1)))(let ((.def_21850 (bvnot .def_21829)))(let ((.def_21597 ((_ extract 2 2) id2)))(let ((.def_21851 (bvand .def_21597 .def_21850)))(let ((.def_21834 ((_ extract 1 1) send1)))(let ((.def_21844 (bvnot .def_21834)))(let ((.def_21615 ((_ extract 1 1) id2)))(let ((.def_21845 (bvand .def_21615 .def_21844)))(let ((.def_21839 ((_ extract 0 0) send1)))(let ((.def_21840 (bvnot .def_21839)))(let ((.def_21835 (bvnot .def_21615)))(let ((.def_21837 (bvand .def_21834 .def_21835)))(let ((.def_21838 (bvnot .def_21837)))(let ((.def_21842 (bvand .def_21838 .def_21840)))(let ((.def_21642 ((_ extract 0 0) id2)))(let ((.def_21843 (bvand .def_21642 .def_21842)))(let ((.def_21847 (bvor .def_21843 .def_21845)))(let ((.def_21830 (bvnot .def_21597)))(let ((.def_21832 (bvand .def_21829 .def_21830)))(let ((.def_21833 (bvnot .def_21832)))(let ((.def_21849 (bvand .def_21833 .def_21847)))(let ((.def_21853 (bvor .def_21849 .def_21851)))(let ((.def_21825 (bvnot .def_21579)))(let ((.def_21827 (bvand .def_21824 .def_21825)))(let ((.def_21828 (bvnot .def_21827)))(let ((.def_21855 (bvand .def_21828 .def_21853)))(let ((.def_21859 (bvor .def_21855 .def_21857)))(let ((.def_21820 (bvnot .def_21561)))(let ((.def_21822 (bvand .def_21819 .def_21820)))(let ((.def_21823 (bvnot .def_21822)))(let ((.def_21861 (bvand .def_21823 .def_21859)))(let ((.def_21871 (bvnot .def_21861)))(let ((.def_21874 (bvand .def_21871 .def_21872)))(let ((.def_21885 (bvand .def_21874 .def_21883)))(let ((.def_21886 (bvnot .def_21885)))(let ((.def_21867 (bvnot .def_21543)))(let ((.def_21869 (bvand .def_21866 .def_21867)))(let ((.def_21870 (bvnot .def_21869)))(let ((.def_21888 (bvand .def_21870 .def_21886)))(let ((.def_21865 (bvor .def_21861 .def_21863)))(let ((.def_21890 (bvand .def_21865 .def_21888)))(let ((.def_21891 (bvnot .def_21890)))(let ((.def_21892 (bvand .def_21883 .def_21891)))(let ((.def_21893 (bvand .def_21881 .def_21892)))(let ((.def_21894 (bvnot .def_21893)))(let ((.def_21895 (bvand .def_21741 .def_21894)))(let ((.def_21815 (bvnot .def_21525)))(let ((.def_21817 (bvand .def_21814 .def_21815)))(let ((.def_21818 (bvnot .def_21817)))(let ((.def_21897 (bvand .def_21818 .def_21895)))(let ((.def_21898 (bvand .def_21894 .def_21897)))(let ((.def_21899 (bvor .def_21740 .def_21898)))(let ((.def_21900 (= .def_21899 (_ bv1 1)))).def_21900)))))))))))))))))))))))))))))))))))))))))))))))))))))))))))))))))))))))))))))
(assert (let ((.def_21902 ((_ extract 7 7) id1)))(let ((.def_21903 (= .def_21902 (_ bv0 1)))).def_21903)))
(assert (let ((.def_21949 ((_ extract 6 6) id1)))(let ((.def_21537 ((_ extract 6 6) id3)))(let ((.def_21972 (bvor .def_21537 .def_21949)))(let ((.def_21943 ((_ extract 5 5) id1)))(let ((.def_21555 ((_ extract 5 5) id3)))(let ((.def_21960 (bvor .def_21555 .def_21943)))(let ((.def_21902 ((_ extract 7 7) id1)))(let ((.def_21953 (bvnot .def_21902)))(let ((.def_21538 (bvnot .def_21537)))(let ((.def_21950 (bvand .def_21538 .def_21949)))(let ((.def_21951 (bvnot .def_21950)))(let ((.def_21736 ((_ extract 7 7) id3)))(let ((.def_21737 (bvnot .def_21736)))(let ((.def_21952 (bvand .def_21737 .def_21951)))(let ((.def_21955 (bvand .def_21952 .def_21953)))(let ((.def_21556 (bvnot .def_21555)))(let ((.def_21947 (bvand .def_21556 .def_21943)))(let ((.def_21948 (bvnot .def_21947)))(let ((.def_21957 (bvand .def_21948 .def_21955)))(let ((.def_21905 ((_ extract 4 4) id1)))(let ((.def_21573 ((_ extract 4 4) id3)))(let ((.def_21574 (bvnot .def_21573)))(let ((.def_21940 (bvand .def_21574 .def_21905)))(let ((.def_21909 ((_ extract 3 3) id1)))(let ((.def_21591 ((_ extract 3 3) id3)))(let ((.def_21592 (bvnot .def_21591)))(let ((.def_21935 (bvand .def_21592 .def_21909)))(let ((.def_21913 ((_ extract 2 2) id1)))(let ((.def_21609 ((_ extract 2 2) id3)))(let ((.def_21610 (bvnot .def_21609)))(let ((.def_21930 (bvand .def_21610 .def_21913)))(let ((.def_21917 ((_ extract 1 1) id1)))(let ((.def_21627 ((_ extract 1 1) id3)))(let ((.def_21628 (bvnot .def_21627)))(let ((.def_21925 (bvand .def_21628 .def_21917)))(let ((.def_21921 ((_ extract 0 0) id1)))(let ((.def_21918 (bvnot .def_21917)))(let ((.def_21919 (bvand .def_21627 .def_21918)))(let ((.def_21920 (bvnot .def_21919)))(let ((.def_21923 (bvand .def_21920 .def_21921)))(let ((.def_21656 ((_ extract 0 0) id3)))(let ((.def_21657 (bvnot .def_21656)))(let ((.def_21924 (bvand .def_21657 .def_21923)))(let ((.def_21927 (bvor .def_21924 .def_21925)))(let ((.def_21914 (bvnot .def_21913)))(let ((.def_21915 (bvand .def_21609 .def_21914)))(let ((.def_21916 (bvnot .def_21915)))(let ((.def_21929 (bvand .def_21916 .def_21927)))(let ((.def_21932 (bvor .def_21929 .def_21930)))(let ((.def_21910 (bvnot .def_21909)))(let ((.def_21911 (bvand .def_21591 .def_21910)))(let ((.def_21912 (bvnot .def_21911)))(let ((.def_21934 (bvand .def_21912 .def_21932)))(let ((.def_21937 (bvor .def_21934 .def_21935)))(let ((.def_21906 (bvnot .def_21905)))(let ((.def_21907 (bvand .def_21573 .def_21906)))(let ((.def_21908 (bvnot .def_21907)))(let ((.def_21939 (bvand .def_21908 .def_21937)))(let ((.def_21942 (bvor .def_21939 .def_21940)))(let ((.def_21945 (bvand .def_21942 .def_21943)))(let ((.def_21946 (bvnot .def_21945)))(let ((.def_21959 (bvand .def_21946 .def_21957)))(let ((.def_21962 (bvand .def_21959 .def_21960)))(let ((.def_21963 (bvnot .def_21962)))(let ((.def_21964 (bvand .def_21942 .def_21963)))(let ((.def_21965 (bvnot .def_21964)))(let ((.def_21966 (bvand .def_21957 .def_21965)))(let ((.def_21967 (bvand .def_21955 .def_21966)))(let ((.def_21968 (bvnot .def_21967)))(let ((.def_21969 (bvand .def_21949 .def_21968)))(let ((.def_21970 (bvnot .def_21969)))(let ((.def_21971 (bvand .def_21953 .def_21970)))(let ((.def_21974 (bvand .def_21971 .def_21972)))(let ((.def_21975 (bvor .def_21967 .def_21974)))(let ((.def_21976 (bvand .def_21737 .def_21975)))(let ((.def_21977 (bvor .def_21902 .def_21976)))(let ((.def_21978 (= .def_21977 (_ bv1 1)))).def_21978))))))))))))))))))))))))))))))))))))))))))))))))))))))))))))))))))))))))))))))
(assert (let ((.def_21980 ((_ sign_extend 24) p1_new)))(let ((.def_2415 ((_ sign_extend 24) send1)))(let ((.def_21981 (= .def_2415 .def_21980))).def_21981))))
(assert (let ((.def_2422 ((_ sign_extend 24) id3)))(let ((.def_2414 ((_ sign_extend 24) id2)))(let ((.def_21983 (= .def_2414 .def_2422))).def_21983))))
(assert (let ((.def_2414 ((_ sign_extend 24) id2)))(let ((.def_2422 ((_ sign_extend 24) id3)))(let ((.def_21985 (bvslt .def_2422 .def_2414))).def_21985))))
(assert (let ((.def_21987 (= send1 id3))).def_21987))
(assert (let ((.def_6245 ((_ extract 7 0) |node2::__CPAchecker_TMP_0|)))(let ((.def_21989 (= send2 .def_6245))).def_21989)))
(assert (let ((.def_21991 (= p1_old p2_old))).def_21991))
(assert (let ((.def_21993 (= send2 p1_old))).def_21993))
(assert (let ((.def_2449 ((_ sign_extend 24) p1_old)))(let ((.def_2437 ((_ sign_extend 24) p3_old)))(let ((.def_21995 (= .def_2437 .def_2449))).def_21995))))
(assert (let ((.def_21997 (= p3_old p1_old))).def_21997))
(assert (let ((.def_21999 (= send3 p2_old))).def_21999))
(assert (let ((.def_2453 ((_ sign_extend 24) p2_old)))(let ((.def_2449 ((_ sign_extend 24) p1_old)))(let ((.def_22001 (= .def_2449 .def_2453))).def_22001))))
(assert (let ((.def_2453 ((_ sign_extend 24) p2_old)))(let ((.def_2405 ((_ sign_extend 24) send3)))(let ((.def_22003 (= .def_2405 .def_2453))).def_22003))))
(assert (let ((.def_2449 ((_ sign_extend 24) p1_old)))(let ((.def_22005 (= .def_2449 |node2::__CPAchecker_TMP_0|))).def_22005)))
(assert (let ((.def_6245 ((_ extract 7 0) |node2::__CPAchecker_TMP_0|)))(let ((.def_22007 (= send3 .def_6245))).def_22007)))
(assert (let ((.def_21464 ((_ sign_extend 24) p2_new)))(let ((.def_22009 (= |node2::__CPAchecker_TMP_0| .def_21464))).def_22009)))
(assert (let ((.def_2437 ((_ sign_extend 24) p3_old)))(let ((.def_22011 (= .def_2437 |node1::__CPAchecker_TMP_0|))).def_22011)))
(assert (let ((.def_2405 ((_ sign_extend 24) send3)))(let ((.def_22013 (= .def_2405 |node2::__CPAchecker_TMP_0|))).def_22013)))
(assert (let ((.def_22015 (= r1 (_ bv2 8)))).def_22015))
(assert (let ((.def_2442 ((_ sign_extend 24) st2)))(let ((.def_2440 ((_ sign_extend 24) st3)))(let ((.def_2441 (bvneg .def_2440)))(let ((.def_22017 (= .def_2441 .def_2442))).def_22017)))))

assert N231:
(assert false)
(assert (let ((.def_1347 (= |assert::arg| (_ bv0 8)))).def_1347))

