(set-info :source |printed by MathSAT|)
(declare-fun c_last_read () (_ BitVec 32))
(declare-fun p_last_write () (_ BitVec 32))
(declare-fun c_num_read () (_ BitVec 32))
(declare-fun p_num_write () (_ BitVec 32))
(declare-fun c_dr_pc () (_ BitVec 32))
(declare-fun c_dr_st () (_ BitVec 32))
(declare-fun m_pc () (_ BitVec 32))
(declare-fun t1_pc () (_ BitVec 32))
(declare-fun t2_pc () (_ BitVec 32))
(declare-fun t3_pc () (_ BitVec 32))
(declare-fun t4_pc () (_ BitVec 32))
(declare-fun t5_pc () (_ BitVec 32))
(declare-fun t6_pc () (_ BitVec 32))
(declare-fun t7_pc () (_ BitVec 32))
(declare-fun t8_pc () (_ BitVec 32))
(declare-fun t9_pc () (_ BitVec 32))
(declare-fun m_st () (_ BitVec 32))

*:
(assert (let ((.def_752 (= c_last_read p_last_write))).def_752))
(assert (let ((.def_761 (= c_num_read p_num_write))).def_761))

error1 N4:
(assert false)
(assert (let ((.def_752 (= c_last_read p_last_write))).def_752))
(assert (let ((.def_761 (= c_num_read p_num_write))).def_761))

eval1 N282:
(assert (let ((.def_912 (= c_dr_pc (_ bv0 32)))).def_912))
(assert (let ((.def_752 (= c_last_read p_last_write))).def_752))
(assert (let ((.def_761 (= c_num_read p_num_write))).def_761))
(assert (let ((.def_1403 (= c_dr_pc (_ bv2 32)))).def_1403))
(assert (let ((.def_1406 (= c_dr_st (_ bv0 32)))).def_1406))

start_simulation1 N338:
(assert (let ((.def_912 (= c_dr_pc (_ bv0 32)))).def_912))
(assert (let ((.def_752 (= c_last_read p_last_write))).def_752))
(assert (let ((.def_761 (= c_num_read p_num_write))).def_761))
(assert (let ((.def_1403 (= c_dr_pc (_ bv2 32)))).def_1403))

error2 N393:
(assert false)
(assert (let ((.def_752 (= c_last_read p_last_write))).def_752))
(assert (let ((.def_761 (= c_num_read p_num_write))).def_761))

eval2 N972:
(assert (let ((.def_5026 (= m_pc (_ bv0 32)))).def_5026))
(assert (let ((.def_752 (= c_last_read p_last_write))).def_752))
(assert (let ((.def_761 (= c_num_read p_num_write))).def_761))
(assert (let ((.def_12820 (= t1_pc (_ bv0 32)))).def_12820))
(assert (let ((.def_12823 (= t2_pc (_ bv0 32)))).def_12823))
(assert (let ((.def_12826 (= t3_pc (_ bv0 32)))).def_12826))
(assert (let ((.def_12829 (= t4_pc (_ bv0 32)))).def_12829))
(assert (let ((.def_12832 (= t5_pc (_ bv0 32)))).def_12832))
(assert (let ((.def_12835 (= t6_pc (_ bv0 32)))).def_12835))
(assert (let ((.def_12838 (= t7_pc (_ bv0 32)))).def_12838))
(assert (let ((.def_12841 (= t8_pc (_ bv0 32)))).def_12841))
(assert (let ((.def_12844 (= t9_pc (_ bv0 32)))).def_12844))
(assert (let ((.def_12846 (= m_pc (_ bv1 32)))).def_12846))
(assert (let ((.def_12848 (= t1_pc (_ bv1 32)))).def_12848))
(assert (let ((.def_12850 (= t2_pc (_ bv1 32)))).def_12850))
(assert (let ((.def_12852 (= t3_pc (_ bv1 32)))).def_12852))
(assert (let ((.def_12854 (= t4_pc (_ bv1 32)))).def_12854))
(assert (let ((.def_12856 (= t5_pc (_ bv1 32)))).def_12856))
(assert (let ((.def_12858 (= t6_pc (_ bv1 32)))).def_12858))
(assert (let ((.def_12860 (= t7_pc (_ bv1 32)))).def_12860))
(assert (let ((.def_12862 (= t8_pc (_ bv1 32)))).def_12862))
(assert (let ((.def_12864 (= t9_pc (_ bv1 32)))).def_12864))
(assert (let ((.def_12867 (= m_st (_ bv0 32)))).def_12867))

start_simulation2 N1450:
(assert (let ((.def_5026 (= m_pc (_ bv0 32)))).def_5026))
(assert (let ((.def_752 (= c_last_read p_last_write))).def_752))
(assert (let ((.def_761 (= c_num_read p_num_write))).def_761))
(assert (let ((.def_12820 (= t1_pc (_ bv0 32)))).def_12820))
(assert (let ((.def_12823 (= t2_pc (_ bv0 32)))).def_12823))
(assert (let ((.def_12826 (= t3_pc (_ bv0 32)))).def_12826))
(assert (let ((.def_12829 (= t4_pc (_ bv0 32)))).def_12829))
(assert (let ((.def_12832 (= t5_pc (_ bv0 32)))).def_12832))
(assert (let ((.def_12835 (= t6_pc (_ bv0 32)))).def_12835))
(assert (let ((.def_12838 (= t7_pc (_ bv0 32)))).def_12838))
(assert (let ((.def_12841 (= t8_pc (_ bv0 32)))).def_12841))
(assert (let ((.def_12844 (= t9_pc (_ bv0 32)))).def_12844))
(assert (let ((.def_12846 (= m_pc (_ bv1 32)))).def_12846))
(assert (let ((.def_12848 (= t1_pc (_ bv1 32)))).def_12848))
(assert (let ((.def_12850 (= t2_pc (_ bv1 32)))).def_12850))
(assert (let ((.def_12852 (= t3_pc (_ bv1 32)))).def_12852))
(assert (let ((.def_12854 (= t4_pc (_ bv1 32)))).def_12854))
(assert (let ((.def_12856 (= t5_pc (_ bv1 32)))).def_12856))
(assert (let ((.def_12858 (= t6_pc (_ bv1 32)))).def_12858))
(assert (let ((.def_12860 (= t7_pc (_ bv1 32)))).def_12860))
(assert (let ((.def_12862 (= t8_pc (_ bv1 32)))).def_12862))
(assert (let ((.def_12864 (= t9_pc (_ bv1 32)))).def_12864))

