(set-info :source |printed by MathSAT|)
(declare-fun c_num_read () (_ BitVec 32))
(declare-fun p_num_write () (_ BitVec 32))
(declare-fun c_last_read () (_ BitVec 32))
(declare-fun p_last_write () (_ BitVec 32))
(declare-fun c_dr_pc () (_ BitVec 32))
(declare-fun q_free () (_ BitVec 32))
(declare-fun q_buf_0 () (_ BitVec 32))
(declare-fun c_dr_st () (_ BitVec 32))
(declare-fun q_req_up () (_ BitVec 32))
(declare-fun q_write_ev () (_ BitVec 32))
(declare-fun q_read_ev () (_ BitVec 32))
(declare-fun p_dw_pc () (_ BitVec 32))
(declare-fun p_dw_st () (_ BitVec 32))
(declare-fun m_pc () (_ BitVec 32))
(declare-fun t1_pc () (_ BitVec 32))
(declare-fun t2_pc () (_ BitVec 32))
(declare-fun t3_pc () (_ BitVec 32))
(declare-fun t4_pc () (_ BitVec 32))
(declare-fun t5_pc () (_ BitVec 32))
(declare-fun m_st () (_ BitVec 32))
(declare-fun E_3 () (_ BitVec 32))
(declare-fun E_2 () (_ BitVec 32))
(declare-fun E_5 () (_ BitVec 32))
(declare-fun E_M () (_ BitVec 32))
(declare-fun E_4 () (_ BitVec 32))
(declare-fun t1_st () (_ BitVec 32))
(declare-fun t2_st () (_ BitVec 32))
(declare-fun t4_st () (_ BitVec 32))
(declare-fun t3_st () (_ BitVec 32))
(declare-fun t5_st () (_ BitVec 32))
(declare-fun local () (_ BitVec 32))
(declare-fun token () (_ BitVec 32))
(declare-fun E_1 () (_ BitVec 32))
(declare-fun T5_E () (_ BitVec 32))
(declare-fun T4_E () (_ BitVec 32))
(declare-fun T3_E () (_ BitVec 32))
(declare-fun T2_E () (_ BitVec 32))
(declare-fun T1_E () (_ BitVec 32))
(declare-fun M_E () (_ BitVec 32))

*:
(assert (let ((.def_559 (= c_num_read p_num_write))).def_559))
(assert (let ((.def_568 (= c_last_read p_last_write))).def_568))

error1 N4:
(assert false)
(assert (let ((.def_559 (= c_num_read p_num_write))).def_559))
(assert (let ((.def_568 (= c_last_read p_last_write))).def_568))

do_write_p N78:
(assert (let ((.def_755 (= c_dr_pc (_ bv0 32)))).def_755))
(assert (let ((.def_559 (= c_num_read p_num_write))).def_559))
(assert (let ((.def_568 (= c_last_read p_last_write))).def_568))
(assert (let ((.def_823 (= q_free (_ bv1 32)))).def_823))
(assert false)
(assert (let ((.def_1007 (= p_last_write q_buf_0))).def_1007))
(assert (let ((.def_1147 (= c_dr_pc (_ bv1 32)))).def_1147))
(assert (let ((.def_1149 (= q_free (_ bv0 32)))).def_1149))
(assert (let ((.def_1153 (bvadd (_ bv1 32) c_num_read)))(let ((.def_1154 (= p_num_write .def_1153))).def_1154)))
(assert (let ((.def_1835 (= c_dr_st (_ bv0 32)))).def_1835))
(assert (let ((.def_4235 (= q_req_up (_ bv1 32)))).def_4235))
(assert (let ((.def_5868 (= q_write_ev (_ bv1 32)))).def_5868))
(assert (let ((.def_5870 (= q_write_ev (_ bv0 32)))).def_5870))
(assert (let ((.def_8205 (= q_read_ev (_ bv1 32)))).def_8205))
(assert (let ((.def_8207 (= q_read_ev (_ bv0 32)))).def_8207))

do_read_c N112:
(assert (let ((.def_823 (= q_free (_ bv1 32)))).def_823))
(assert (let ((.def_559 (= c_num_read p_num_write))).def_559))
(assert (let ((.def_568 (= c_last_read p_last_write))).def_568))
(assert (let ((.def_1007 (= p_last_write q_buf_0))).def_1007))
(assert (let ((.def_1153 (bvadd (_ bv1 32) c_num_read)))(let ((.def_1154 (= p_num_write .def_1153))).def_1154)))
(assert false)
(assert (let ((.def_1149 (= q_free (_ bv0 32)))).def_1149))
(assert (let ((.def_5868 (= q_write_ev (_ bv1 32)))).def_5868))
(assert (let ((.def_5870 (= q_write_ev (_ bv0 32)))).def_5870))
(assert (let ((.def_1151 (= p_dw_pc (_ bv1 32)))).def_1151))
(assert (let ((.def_4235 (= q_req_up (_ bv1 32)))).def_4235))
(assert (let ((.def_2309 (= p_dw_st (_ bv0 32)))).def_2309))
(assert (let ((.def_8205 (= q_read_ev (_ bv1 32)))).def_8205))
(assert (let ((.def_8207 (= q_read_ev (_ bv0 32)))).def_8207))

eval1 N228:
(assert (let ((.def_755 (= c_dr_pc (_ bv0 32)))).def_755))
(assert (let ((.def_559 (= c_num_read p_num_write))).def_559))
(assert (let ((.def_568 (= c_last_read p_last_write))).def_568))
(assert (let ((.def_823 (= q_free (_ bv1 32)))).def_823))
(assert (let ((.def_965 (= p_dw_pc (_ bv0 32)))).def_965))
(assert (let ((.def_1147 (= c_dr_pc (_ bv1 32)))).def_1147))
(assert (let ((.def_1149 (= q_free (_ bv0 32)))).def_1149))
(assert (let ((.def_1151 (= p_dw_pc (_ bv1 32)))).def_1151))
(assert (let ((.def_2309 (= p_dw_st (_ bv0 32)))).def_2309))
(assert (let ((.def_1007 (= p_last_write q_buf_0))).def_1007))
(assert (let ((.def_1153 (bvadd (_ bv1 32) c_num_read)))(let ((.def_1154 (= p_num_write .def_1153))).def_1154)))
(assert (let ((.def_1835 (= c_dr_st (_ bv0 32)))).def_1835))
(assert (let ((.def_4235 (= q_req_up (_ bv1 32)))).def_4235))
(assert (let ((.def_5868 (= q_write_ev (_ bv1 32)))).def_5868))
(assert (let ((.def_5870 (= q_write_ev (_ bv0 32)))).def_5870))
(assert (let ((.def_8205 (= q_read_ev (_ bv1 32)))).def_8205))
(assert (let ((.def_8207 (= q_read_ev (_ bv0 32)))).def_8207))

start_simulation1 N283:
(assert (let ((.def_755 (= c_dr_pc (_ bv0 32)))).def_755))
(assert (let ((.def_559 (= c_num_read p_num_write))).def_559))
(assert (let ((.def_568 (= c_last_read p_last_write))).def_568))
(assert (let ((.def_823 (= q_free (_ bv1 32)))).def_823))
(assert (let ((.def_965 (= p_dw_pc (_ bv0 32)))).def_965))
(assert (let ((.def_1147 (= c_dr_pc (_ bv1 32)))).def_1147))
(assert (let ((.def_1149 (= q_free (_ bv0 32)))).def_1149))
(assert (let ((.def_1151 (= p_dw_pc (_ bv1 32)))).def_1151))
(assert (let ((.def_1835 (= c_dr_st (_ bv0 32)))).def_1835))
(assert (let ((.def_2309 (= p_dw_st (_ bv0 32)))).def_2309))
(assert (let ((.def_1007 (= p_last_write q_buf_0))).def_1007))
(assert (let ((.def_5868 (= q_write_ev (_ bv1 32)))).def_5868))
(assert (let ((.def_5870 (= q_write_ev (_ bv0 32)))).def_5870))
(assert (let ((.def_8205 (= q_read_ev (_ bv1 32)))).def_8205))
(assert (let ((.def_8207 (= q_read_ev (_ bv0 32)))).def_8207))
(assert (let ((.def_1153 (bvadd (_ bv1 32) c_num_read)))(let ((.def_1154 (= p_num_write .def_1153))).def_1154)))

error2 N328:
(assert false)
(assert (let ((.def_559 (= c_num_read p_num_write))).def_559))
(assert (let ((.def_568 (= c_last_read p_last_write))).def_568))

eval2 N678:
(assert (let ((.def_10812 (= m_pc (_ bv0 32)))).def_10812))
(assert (let ((.def_559 (= c_num_read p_num_write))).def_559))
(assert (let ((.def_568 (= c_last_read p_last_write))).def_568))
(assert (let ((.def_13947 (= t1_pc (_ bv0 32)))).def_13947))
(assert (let ((.def_13950 (= t2_pc (_ bv0 32)))).def_13950))
(assert (let ((.def_13953 (= t3_pc (_ bv0 32)))).def_13953))
(assert (let ((.def_13956 (= t4_pc (_ bv0 32)))).def_13956))
(assert (let ((.def_13959 (= t5_pc (_ bv0 32)))).def_13959))
(assert (let ((.def_13961 (= m_pc (_ bv1 32)))).def_13961))
(assert (let ((.def_13963 (= t1_pc (_ bv1 32)))).def_13963))
(assert (let ((.def_13965 (= t2_pc (_ bv1 32)))).def_13965))
(assert (let ((.def_13967 (= t3_pc (_ bv1 32)))).def_13967))
(assert (let ((.def_13969 (= t4_pc (_ bv1 32)))).def_13969))
(assert (let ((.def_13971 (= t5_pc (_ bv1 32)))).def_13971))
(assert (let ((.def_13974 (= m_st (_ bv0 32)))).def_13974))
(assert (let ((.def_18648 (= E_3 (_ bv1 32)))).def_18648))
(assert (let ((.def_18651 (= E_2 (_ bv1 32)))).def_18651))
(assert (let ((.def_18654 (= E_5 (_ bv1 32)))).def_18654))
(assert (let ((.def_18657 (= E_M (_ bv1 32)))).def_18657))
(assert (let ((.def_18660 (= E_4 (_ bv1 32)))).def_18660))
(assert (let ((.def_18663 (= t1_st (_ bv0 32)))).def_18663))
(assert (let ((.def_18666 (= t2_st (_ bv0 32)))).def_18666))
(assert (let ((.def_18669 (= t4_st (_ bv0 32)))).def_18669))
(assert (let ((.def_18672 (= t3_st (_ bv0 32)))).def_18672))
(assert (let ((.def_18675 (= t5_st (_ bv0 32)))).def_18675))
(assert (let ((.def_18678 (bvadd (_ bv5 32) local)))(let ((.def_18680 (= .def_18678 token))).def_18680)))
(assert (let ((.def_29067 (= E_2 (_ bv2 32)))).def_29067))
(assert (let ((.def_29069 (= E_3 (_ bv2 32)))).def_29069))
(assert (let ((.def_29071 (= E_4 (_ bv2 32)))).def_29071))
(assert (let ((.def_29074 (= E_1 (_ bv1 32)))).def_29074))
(assert (let ((.def_29076 (= E_1 (_ bv2 32)))).def_29076))
(assert (let ((.def_29078 (bvadd (_ bv3 32) local)))(let ((.def_29079 (= token .def_29078))).def_29079)))
(assert (let ((.def_29081 (= local token))).def_29081))
(assert (let ((.def_29083 (bvadd (_ bv1 32) local)))(let ((.def_29084 (= token .def_29083))).def_29084)))
(assert (let ((.def_29086 (bvadd (_ bv2 32) local)))(let ((.def_29087 (= token .def_29086))).def_29087)))
(assert (let ((.def_29089 (bvadd (_ bv4 32) local)))(let ((.def_29090 (= token .def_29089))).def_29090)))
(assert (let ((.def_38512 (= E_M (_ bv0 32)))).def_38512))
(assert (let ((.def_38514 (= E_2 (_ bv0 32)))).def_38514))
(assert (let ((.def_38516 (= E_1 (_ bv0 32)))).def_38516))
(assert (let ((.def_48100 (= E_5 (_ bv0 32)))).def_48100))
(assert (let ((.def_48102 (= E_4 (_ bv0 32)))).def_48102))
(assert (let ((.def_48104 (= E_3 (_ bv0 32)))).def_48104))
(assert (let ((.def_48107 (= T5_E (_ bv0 32)))).def_48107))
(assert (let ((.def_48110 (= T4_E (_ bv0 32)))).def_48110))
(assert (let ((.def_48113 (= T3_E (_ bv0 32)))).def_48113))
(assert (let ((.def_48116 (= T2_E (_ bv0 32)))).def_48116))
(assert (let ((.def_48119 (= T1_E (_ bv0 32)))).def_48119))
(assert (let ((.def_48122 (= M_E (_ bv0 32)))).def_48122))
(assert false)

start_simulation2 N992:
(assert (let ((.def_10812 (= m_pc (_ bv0 32)))).def_10812))
(assert (let ((.def_559 (= c_num_read p_num_write))).def_559))
(assert (let ((.def_568 (= c_last_read p_last_write))).def_568))
(assert (let ((.def_13947 (= t1_pc (_ bv0 32)))).def_13947))
(assert (let ((.def_13950 (= t2_pc (_ bv0 32)))).def_13950))
(assert (let ((.def_13953 (= t3_pc (_ bv0 32)))).def_13953))
(assert (let ((.def_13956 (= t4_pc (_ bv0 32)))).def_13956))
(assert (let ((.def_13959 (= t5_pc (_ bv0 32)))).def_13959))
(assert (let ((.def_13961 (= m_pc (_ bv1 32)))).def_13961))
(assert (let ((.def_13963 (= t1_pc (_ bv1 32)))).def_13963))
(assert (let ((.def_13965 (= t2_pc (_ bv1 32)))).def_13965))
(assert (let ((.def_13967 (= t3_pc (_ bv1 32)))).def_13967))
(assert (let ((.def_13969 (= t4_pc (_ bv1 32)))).def_13969))
(assert (let ((.def_13971 (= t5_pc (_ bv1 32)))).def_13971))
(assert (let ((.def_18648 (= E_3 (_ bv1 32)))).def_18648))
(assert (let ((.def_18651 (= E_2 (_ bv1 32)))).def_18651))
(assert (let ((.def_18654 (= E_5 (_ bv1 32)))).def_18654))
(assert (let ((.def_18657 (= E_M (_ bv1 32)))).def_18657))
(assert (let ((.def_18660 (= E_4 (_ bv1 32)))).def_18660))
(assert (let ((.def_13974 (= m_st (_ bv0 32)))).def_13974))
(assert (let ((.def_29067 (= E_2 (_ bv2 32)))).def_29067))
(assert (let ((.def_29069 (= E_3 (_ bv2 32)))).def_29069))
(assert (let ((.def_29071 (= E_4 (_ bv2 32)))).def_29071))
(assert (let ((.def_29074 (= E_1 (_ bv1 32)))).def_29074))
(assert (let ((.def_38512 (= E_M (_ bv0 32)))).def_38512))
(assert (let ((.def_38514 (= E_2 (_ bv0 32)))).def_38514))
(assert (let ((.def_48100 (= E_5 (_ bv0 32)))).def_48100))
(assert (let ((.def_18666 (= t2_st (_ bv0 32)))).def_18666))
(assert (let ((.def_18663 (= t1_st (_ bv0 32)))).def_18663))
(assert (let ((.def_18675 (= t5_st (_ bv0 32)))).def_18675))
(assert (let ((.def_18669 (= t4_st (_ bv0 32)))).def_18669))
(assert (let ((.def_18672 (= t3_st (_ bv0 32)))).def_18672))
(assert (let ((.def_48102 (= E_4 (_ bv0 32)))).def_48102))
(assert (let ((.def_48104 (= E_3 (_ bv0 32)))).def_48104))
(assert (let ((.def_48107 (= T5_E (_ bv0 32)))).def_48107))
(assert (let ((.def_48110 (= T4_E (_ bv0 32)))).def_48110))
(assert (let ((.def_48113 (= T3_E (_ bv0 32)))).def_48113))
(assert (let ((.def_48116 (= T2_E (_ bv0 32)))).def_48116))
(assert (let ((.def_48119 (= T1_E (_ bv0 32)))).def_48119))
(assert (let ((.def_48122 (= M_E (_ bv0 32)))).def_48122))

