(set-info :source |printed by MathSAT|)
(declare-fun a20 () (_ BitVec 32))
(declare-fun a25 () (_ BitVec 32))
(declare-fun a12 () (_ BitVec 32))
(declare-fun a15 () (_ BitVec 32))
(declare-fun a16 () (_ BitVec 32))
(declare-fun a2 () (_ BitVec 32))
(declare-fun a27 () (_ BitVec 32))
(declare-fun a9 () (_ BitVec 32))
(declare-fun m_pc () (_ BitVec 32))
(declare-fun t1_pc () (_ BitVec 32))
(declare-fun t2_pc () (_ BitVec 32))
(declare-fun t3_pc () (_ BitVec 32))
(declare-fun t4_pc () (_ BitVec 32))
(declare-fun t5_pc () (_ BitVec 32))
(declare-fun t6_pc () (_ BitVec 32))
(declare-fun t7_pc () (_ BitVec 32))
(declare-fun t8_pc () (_ BitVec 32))
(declare-fun t9_pc () (_ BitVec 32))
(declare-fun t10_pc () (_ BitVec 32))
(declare-fun t11_pc () (_ BitVec 32))
(declare-fun t12_pc () (_ BitVec 32))
(declare-fun t13_pc () (_ BitVec 32))
(declare-fun m_st () (_ BitVec 32))

*:
(assert (let ((.def_107953 (= a20 (_ bv5 32)))).def_107953))

calculate_output8 N30108:
(assert false)
(assert (let ((.def_107953 (= a20 (_ bv5 32)))).def_107953))

main1 N30136:
(assert (let ((.def_107953 (= a20 (_ bv5 32)))).def_107953))
(assert (let ((.def_155706 (= a25 (_ bv1 32)))).def_155706))
(assert (let ((.def_155709 (= a12 (_ bv4 32)))).def_155709))
(assert (let ((.def_155712 (= a15 (_ bv1 32)))).def_155712))
(assert (let ((.def_155715 (= a16 (_ bv1 32)))).def_155715))
(assert (let ((.def_155718 (= a2 (_ bv10 32)))).def_155718))
(assert (let ((.def_155721 (= a27 (_ bv1 32)))).def_155721))
(assert (let ((.def_155724 (= a9 (_ bv18 32)))).def_155724))
(assert (let ((.def_321896 (= a12 (_ bv5 32)))).def_321896))
(assert (let ((.def_321898 (= a2 (_ bv13 32)))).def_321898))
(assert (let ((.def_321900 (= a12 (_ bv2 32)))).def_321900))
(assert (let ((.def_321902 (= a2 (_ bv12 32)))).def_321902))
(assert (let ((.def_321904 (= a12 (_ bv3 32)))).def_321904))
(assert (let ((.def_321906 (= a9 (_ bv16 32)))).def_321906))
(assert (let ((.def_321908 (= a20 (_ bv7 32)))).def_321908))
(assert (let ((.def_321910 (= a2 (_ bv9 32)))).def_321910))
(assert (let ((.def_321912 (= a9 (_ bv17 32)))).def_321912))

error N30154:
(assert false)
(assert (let ((.def_107953 (= a20 (_ bv5 32)))).def_107953))

eval N30945:
(assert (let ((.def_748019 (= m_pc (_ bv0 32)))).def_748019))
(assert (let ((.def_107953 (= a20 (_ bv5 32)))).def_107953))
(assert (let ((.def_762462 (= t1_pc (_ bv0 32)))).def_762462))
(assert (let ((.def_762465 (= t2_pc (_ bv0 32)))).def_762465))
(assert (let ((.def_762468 (= t3_pc (_ bv0 32)))).def_762468))
(assert (let ((.def_762471 (= t4_pc (_ bv0 32)))).def_762471))
(assert (let ((.def_762474 (= t5_pc (_ bv0 32)))).def_762474))
(assert (let ((.def_762477 (= t6_pc (_ bv0 32)))).def_762477))
(assert (let ((.def_762480 (= t7_pc (_ bv0 32)))).def_762480))
(assert (let ((.def_762483 (= t8_pc (_ bv0 32)))).def_762483))
(assert (let ((.def_762486 (= t9_pc (_ bv0 32)))).def_762486))
(assert (let ((.def_762489 (= t10_pc (_ bv0 32)))).def_762489))
(assert (let ((.def_762492 (= t11_pc (_ bv0 32)))).def_762492))
(assert (let ((.def_762495 (= t12_pc (_ bv0 32)))).def_762495))
(assert (let ((.def_762498 (= t13_pc (_ bv0 32)))).def_762498))
(assert (let ((.def_762500 (= m_pc (_ bv1 32)))).def_762500))
(assert (let ((.def_762502 (= t1_pc (_ bv1 32)))).def_762502))
(assert (let ((.def_762504 (= t2_pc (_ bv1 32)))).def_762504))
(assert (let ((.def_762506 (= t3_pc (_ bv1 32)))).def_762506))
(assert (let ((.def_762508 (= t4_pc (_ bv1 32)))).def_762508))
(assert (let ((.def_762510 (= t5_pc (_ bv1 32)))).def_762510))
(assert (let ((.def_762512 (= t6_pc (_ bv1 32)))).def_762512))
(assert (let ((.def_762514 (= t7_pc (_ bv1 32)))).def_762514))
(assert (let ((.def_762516 (= t8_pc (_ bv1 32)))).def_762516))
(assert (let ((.def_762518 (= t9_pc (_ bv1 32)))).def_762518))
(assert (let ((.def_762520 (= t10_pc (_ bv1 32)))).def_762520))
(assert (let ((.def_762522 (= t11_pc (_ bv1 32)))).def_762522))
(assert (let ((.def_762524 (= t12_pc (_ bv1 32)))).def_762524))
(assert (let ((.def_762526 (= t13_pc (_ bv1 32)))).def_762526))
(assert (let ((.def_762529 (= m_st (_ bv0 32)))).def_762529))

start_simulation N31587:
(assert (let ((.def_748019 (= m_pc (_ bv0 32)))).def_748019))
(assert (let ((.def_107953 (= a20 (_ bv5 32)))).def_107953))
(assert (let ((.def_762462 (= t1_pc (_ bv0 32)))).def_762462))
(assert (let ((.def_762465 (= t2_pc (_ bv0 32)))).def_762465))
(assert (let ((.def_762468 (= t3_pc (_ bv0 32)))).def_762468))
(assert (let ((.def_762471 (= t4_pc (_ bv0 32)))).def_762471))
(assert (let ((.def_762474 (= t5_pc (_ bv0 32)))).def_762474))
(assert (let ((.def_762477 (= t6_pc (_ bv0 32)))).def_762477))
(assert (let ((.def_762480 (= t7_pc (_ bv0 32)))).def_762480))
(assert (let ((.def_762483 (= t8_pc (_ bv0 32)))).def_762483))
(assert (let ((.def_762486 (= t9_pc (_ bv0 32)))).def_762486))
(assert (let ((.def_762489 (= t10_pc (_ bv0 32)))).def_762489))
(assert (let ((.def_762492 (= t11_pc (_ bv0 32)))).def_762492))
(assert (let ((.def_762495 (= t12_pc (_ bv0 32)))).def_762495))
(assert (let ((.def_762498 (= t13_pc (_ bv0 32)))).def_762498))
(assert (let ((.def_762500 (= m_pc (_ bv1 32)))).def_762500))
(assert (let ((.def_762502 (= t1_pc (_ bv1 32)))).def_762502))
(assert (let ((.def_762504 (= t2_pc (_ bv1 32)))).def_762504))
(assert (let ((.def_762506 (= t3_pc (_ bv1 32)))).def_762506))
(assert (let ((.def_762508 (= t4_pc (_ bv1 32)))).def_762508))
(assert (let ((.def_762510 (= t5_pc (_ bv1 32)))).def_762510))
(assert (let ((.def_762512 (= t6_pc (_ bv1 32)))).def_762512))
(assert (let ((.def_762514 (= t7_pc (_ bv1 32)))).def_762514))
(assert (let ((.def_762516 (= t8_pc (_ bv1 32)))).def_762516))
(assert (let ((.def_762518 (= t9_pc (_ bv1 32)))).def_762518))
(assert (let ((.def_762520 (= t10_pc (_ bv1 32)))).def_762520))
(assert (let ((.def_762522 (= t11_pc (_ bv1 32)))).def_762522))
(assert (let ((.def_762524 (= t12_pc (_ bv1 32)))).def_762524))
(assert (let ((.def_762526 (= t13_pc (_ bv1 32)))).def_762526))

