(set-info :source |printed by MathSAT|)
(declare-fun a20 () (_ BitVec 32))
(declare-fun a25 () (_ BitVec 32))
(declare-fun a12 () (_ BitVec 32))
(declare-fun a15 () (_ BitVec 32))
(declare-fun a16 () (_ BitVec 32))
(declare-fun a2 () (_ BitVec 32))
(declare-fun a27 () (_ BitVec 32))
(declare-fun a9 () (_ BitVec 32))
(declare-fun m_pc () (_ BitVec 32))
(declare-fun t1_pc () (_ BitVec 32))
(declare-fun t2_pc () (_ BitVec 32))
(declare-fun t3_pc () (_ BitVec 32))
(declare-fun m_st () (_ BitVec 32))
(declare-fun E_3 () (_ BitVec 32))
(declare-fun E_M () (_ BitVec 32))
(declare-fun E_2 () (_ BitVec 32))
(declare-fun t3_st () (_ BitVec 32))
(declare-fun t1_st () (_ BitVec 32))
(declare-fun t2_st () (_ BitVec 32))
(declare-fun local () (_ BitVec 32))
(declare-fun token () (_ BitVec 32))
(declare-fun E_1 () (_ BitVec 32))

*:
(assert (let ((.def_107583 (= a20 (_ bv5 32)))).def_107583))

calculate_output8 N30053:
(assert false)
(assert (let ((.def_107583 (= a20 (_ bv5 32)))).def_107583))

main1 N30136:
(assert (let ((.def_107583 (= a20 (_ bv5 32)))).def_107583))
(assert (let ((.def_155145 (= a25 (_ bv1 32)))).def_155145))
(assert (let ((.def_155148 (= a12 (_ bv4 32)))).def_155148))
(assert (let ((.def_155151 (= a15 (_ bv1 32)))).def_155151))
(assert (let ((.def_155154 (= a16 (_ bv1 32)))).def_155154))
(assert (let ((.def_155157 (= a2 (_ bv10 32)))).def_155157))
(assert (let ((.def_155160 (= a27 (_ bv1 32)))).def_155160))
(assert (let ((.def_155163 (= a9 (_ bv18 32)))).def_155163))
(assert (let ((.def_321328 (= a20 (_ bv6 32)))).def_321328))
(assert (let ((.def_321330 (= a12 (_ bv3 32)))).def_321330))
(assert (let ((.def_321332 (= a12 (_ bv6 32)))).def_321332))
(assert (let ((.def_321334 (= a2 (_ bv9 32)))).def_321334))
(assert (let ((.def_321336 (= a9 (_ bv16 32)))).def_321336))
(assert (let ((.def_321338 (= a2 (_ bv12 32)))).def_321338))
(assert (let ((.def_321340 (= a2 (_ bv11 32)))).def_321340))
(assert (let ((.def_321342 (= a9 (_ bv17 32)))).def_321342))
(assert (let ((.def_321344 (= a12 (_ bv2 32)))).def_321344))
(assert (let ((.def_321346 (= a2 (_ bv13 32)))).def_321346))

error N30154:
(assert false)
(assert (let ((.def_107583 (= a20 (_ bv5 32)))).def_107583))

eval N30396:
(assert (let ((.def_746545 (= m_pc (_ bv0 32)))).def_746545))
(assert (let ((.def_107583 (= a20 (_ bv5 32)))).def_107583))
(assert (let ((.def_748135 (= t1_pc (_ bv0 32)))).def_748135))
(assert (let ((.def_748138 (= t2_pc (_ bv0 32)))).def_748138))
(assert (let ((.def_748141 (= t3_pc (_ bv0 32)))).def_748141))
(assert (let ((.def_748143 (= m_pc (_ bv1 32)))).def_748143))
(assert (let ((.def_748145 (= t1_pc (_ bv1 32)))).def_748145))
(assert (let ((.def_748147 (= t2_pc (_ bv1 32)))).def_748147))
(assert (let ((.def_748149 (= t3_pc (_ bv1 32)))).def_748149))
(assert (let ((.def_748152 (= m_st (_ bv0 32)))).def_748152))
(assert (let ((.def_750208 (= E_3 (_ bv1 32)))).def_750208))
(assert (let ((.def_750211 (= E_M (_ bv1 32)))).def_750211))
(assert (let ((.def_750214 (= E_2 (_ bv1 32)))).def_750214))
(assert (let ((.def_750217 (= t3_st (_ bv0 32)))).def_750217))
(assert (let ((.def_750220 (= t1_st (_ bv0 32)))).def_750220))
(assert (let ((.def_750223 (= t2_st (_ bv0 32)))).def_750223))
(assert (let ((.def_750226 (bvadd (_ bv3 32) local)))(let ((.def_750228 (= .def_750226 token))).def_750228)))
(assert (let ((.def_754961 (= E_2 (_ bv2 32)))).def_754961))
(assert (let ((.def_754964 (= E_1 (_ bv1 32)))).def_754964))
(assert (let ((.def_754966 (= t2_st (_ bv2 32)))).def_754966))
(assert (let ((.def_754968 (= local token))).def_754968))
(assert (let ((.def_754970 (bvadd (_ bv1 32) local)))(let ((.def_754971 (= token .def_754970))).def_754971)))
(assert (let ((.def_754973 (bvadd (_ bv2 32) local)))(let ((.def_754974 (= token .def_754973))).def_754974)))
(assert (let ((.def_758570 (= E_M (_ bv0 32)))).def_758570))
(assert (let ((.def_758572 (= E_3 (_ bv0 32)))).def_758572))
(assert (let ((.def_758574 (= E_2 (_ bv0 32)))).def_758574))
(assert (let ((.def_758576 (= E_1 (_ bv0 32)))).def_758576))

start_simulation N30628:
(assert (let ((.def_746545 (= m_pc (_ bv0 32)))).def_746545))
(assert (let ((.def_107583 (= a20 (_ bv5 32)))).def_107583))
(assert (let ((.def_748135 (= t1_pc (_ bv0 32)))).def_748135))
(assert (let ((.def_748138 (= t2_pc (_ bv0 32)))).def_748138))
(assert (let ((.def_748141 (= t3_pc (_ bv0 32)))).def_748141))
(assert (let ((.def_748143 (= m_pc (_ bv1 32)))).def_748143))
(assert (let ((.def_748145 (= t1_pc (_ bv1 32)))).def_748145))
(assert (let ((.def_748147 (= t2_pc (_ bv1 32)))).def_748147))
(assert (let ((.def_748149 (= t3_pc (_ bv1 32)))).def_748149))
(assert (let ((.def_750208 (= E_3 (_ bv1 32)))).def_750208))
(assert (let ((.def_750211 (= E_M (_ bv1 32)))).def_750211))
(assert (let ((.def_750214 (= E_2 (_ bv1 32)))).def_750214))
(assert (let ((.def_750217 (= t3_st (_ bv0 32)))).def_750217))
(assert (let ((.def_748152 (= m_st (_ bv0 32)))).def_748152))
(assert (let ((.def_754961 (= E_2 (_ bv2 32)))).def_754961))
(assert (let ((.def_754964 (= E_1 (_ bv1 32)))).def_754964))
(assert (let ((.def_750223 (= t2_st (_ bv0 32)))).def_750223))
(assert (let ((.def_750220 (= t1_st (_ bv0 32)))).def_750220))
(assert (let ((.def_754966 (= t2_st (_ bv2 32)))).def_754966))
(assert (let ((.def_758570 (= E_M (_ bv0 32)))).def_758570))
(assert (let ((.def_758572 (= E_3 (_ bv0 32)))).def_758572))
(assert (let ((.def_758574 (= E_2 (_ bv0 32)))).def_758574))

