(set-info :source |printed by MathSAT|)
(declare-fun c_last_read () (_ BitVec 32))
(declare-fun p_last_write () (_ BitVec 32))
(declare-fun c_num_read () (_ BitVec 32))
(declare-fun p_num_write () (_ BitVec 32))
(declare-fun c_dr_pc () (_ BitVec 32))
(declare-fun q_free () (_ BitVec 32))
(declare-fun q_buf_0 () (_ BitVec 32))
(declare-fun c_dr_st () (_ BitVec 32))
(declare-fun q_req_up () (_ BitVec 32))
(declare-fun q_write_ev () (_ BitVec 32))
(declare-fun q_read_ev () (_ BitVec 32))
(declare-fun p_dw_pc () (_ BitVec 32))
(declare-fun p_dw_st () (_ BitVec 32))
(declare-fun m_pc () (_ BitVec 32))
(declare-fun t1_pc () (_ BitVec 32))
(declare-fun t2_pc () (_ BitVec 32))
(declare-fun t3_pc () (_ BitVec 32))
(declare-fun t4_pc () (_ BitVec 32))
(declare-fun m_st () (_ BitVec 32))

*:
(assert (let ((.def_544 (= c_last_read p_last_write))).def_544))
(assert (let ((.def_553 (= c_num_read p_num_write))).def_553))

error1 N4:
(assert false)
(assert (let ((.def_544 (= c_last_read p_last_write))).def_544))
(assert (let ((.def_553 (= c_num_read p_num_write))).def_553))

do_write_p N78:
(assert (let ((.def_740 (= c_dr_pc (_ bv0 32)))).def_740))
(assert (let ((.def_544 (= c_last_read p_last_write))).def_544))
(assert (let ((.def_553 (= c_num_read p_num_write))).def_553))
(assert (let ((.def_808 (= q_free (_ bv1 32)))).def_808))
(assert false)
(assert (let ((.def_992 (= p_last_write q_buf_0))).def_992))
(assert (let ((.def_1134 (= c_dr_pc (_ bv1 32)))).def_1134))
(assert (let ((.def_1136 (= q_free (_ bv0 32)))).def_1136))
(assert (let ((.def_1140 (bvadd (_ bv1 32) c_num_read)))(let ((.def_1141 (= p_num_write .def_1140))).def_1141)))
(assert (let ((.def_1821 (= c_dr_st (_ bv0 32)))).def_1821))
(assert (let ((.def_4227 (= q_req_up (_ bv1 32)))).def_4227))
(assert (let ((.def_5860 (= q_write_ev (_ bv1 32)))).def_5860))
(assert (let ((.def_5862 (= q_write_ev (_ bv0 32)))).def_5862))
(assert (let ((.def_8195 (= q_read_ev (_ bv1 32)))).def_8195))
(assert (let ((.def_8197 (= q_read_ev (_ bv0 32)))).def_8197))

do_read_c N112:
(assert (let ((.def_808 (= q_free (_ bv1 32)))).def_808))
(assert (let ((.def_544 (= c_last_read p_last_write))).def_544))
(assert (let ((.def_553 (= c_num_read p_num_write))).def_553))
(assert (let ((.def_992 (= p_last_write q_buf_0))).def_992))
(assert (let ((.def_1140 (bvadd (_ bv1 32) c_num_read)))(let ((.def_1141 (= p_num_write .def_1140))).def_1141)))
(assert false)
(assert (let ((.def_1136 (= q_free (_ bv0 32)))).def_1136))
(assert (let ((.def_5860 (= q_write_ev (_ bv1 32)))).def_5860))
(assert (let ((.def_5862 (= q_write_ev (_ bv0 32)))).def_5862))
(assert (let ((.def_1138 (= p_dw_pc (_ bv1 32)))).def_1138))
(assert (let ((.def_4227 (= q_req_up (_ bv1 32)))).def_4227))
(assert (let ((.def_2298 (= p_dw_st (_ bv0 32)))).def_2298))
(assert (let ((.def_8195 (= q_read_ev (_ bv1 32)))).def_8195))
(assert (let ((.def_8197 (= q_read_ev (_ bv0 32)))).def_8197))

eval1 N228:
(assert (let ((.def_740 (= c_dr_pc (_ bv0 32)))).def_740))
(assert (let ((.def_544 (= c_last_read p_last_write))).def_544))
(assert (let ((.def_553 (= c_num_read p_num_write))).def_553))
(assert (let ((.def_808 (= q_free (_ bv1 32)))).def_808))
(assert (let ((.def_950 (= p_dw_pc (_ bv0 32)))).def_950))
(assert (let ((.def_1134 (= c_dr_pc (_ bv1 32)))).def_1134))
(assert (let ((.def_1136 (= q_free (_ bv0 32)))).def_1136))
(assert (let ((.def_1138 (= p_dw_pc (_ bv1 32)))).def_1138))
(assert (let ((.def_2298 (= p_dw_st (_ bv0 32)))).def_2298))
(assert (let ((.def_992 (= p_last_write q_buf_0))).def_992))
(assert (let ((.def_1140 (bvadd (_ bv1 32) c_num_read)))(let ((.def_1141 (= p_num_write .def_1140))).def_1141)))
(assert (let ((.def_1821 (= c_dr_st (_ bv0 32)))).def_1821))
(assert (let ((.def_4227 (= q_req_up (_ bv1 32)))).def_4227))
(assert (let ((.def_5860 (= q_write_ev (_ bv1 32)))).def_5860))
(assert (let ((.def_5862 (= q_write_ev (_ bv0 32)))).def_5862))
(assert (let ((.def_8195 (= q_read_ev (_ bv1 32)))).def_8195))
(assert (let ((.def_8197 (= q_read_ev (_ bv0 32)))).def_8197))

start_simulation1 N283:
(assert (let ((.def_740 (= c_dr_pc (_ bv0 32)))).def_740))
(assert (let ((.def_544 (= c_last_read p_last_write))).def_544))
(assert (let ((.def_553 (= c_num_read p_num_write))).def_553))
(assert (let ((.def_808 (= q_free (_ bv1 32)))).def_808))
(assert (let ((.def_950 (= p_dw_pc (_ bv0 32)))).def_950))
(assert (let ((.def_1134 (= c_dr_pc (_ bv1 32)))).def_1134))
(assert (let ((.def_1136 (= q_free (_ bv0 32)))).def_1136))
(assert (let ((.def_1138 (= p_dw_pc (_ bv1 32)))).def_1138))
(assert (let ((.def_1821 (= c_dr_st (_ bv0 32)))).def_1821))
(assert (let ((.def_2298 (= p_dw_st (_ bv0 32)))).def_2298))
(assert (let ((.def_992 (= p_last_write q_buf_0))).def_992))
(assert (let ((.def_5860 (= q_write_ev (_ bv1 32)))).def_5860))
(assert (let ((.def_5862 (= q_write_ev (_ bv0 32)))).def_5862))
(assert (let ((.def_8195 (= q_read_ev (_ bv1 32)))).def_8195))
(assert (let ((.def_8197 (= q_read_ev (_ bv0 32)))).def_8197))
(assert (let ((.def_1140 (bvadd (_ bv1 32) c_num_read)))(let ((.def_1141 (= p_num_write .def_1140))).def_1141)))

error2 N328:
(assert false)
(assert (let ((.def_544 (= c_last_read p_last_write))).def_544))
(assert (let ((.def_553 (= c_num_read p_num_write))).def_553))

eval2 N637:
(assert (let ((.def_10707 (= m_pc (_ bv0 32)))).def_10707))
(assert (let ((.def_544 (= c_last_read p_last_write))).def_544))
(assert (let ((.def_553 (= c_num_read p_num_write))).def_553))
(assert (let ((.def_13046 (= t1_pc (_ bv0 32)))).def_13046))
(assert (let ((.def_13049 (= t2_pc (_ bv0 32)))).def_13049))
(assert (let ((.def_13052 (= t3_pc (_ bv0 32)))).def_13052))
(assert (let ((.def_13055 (= t4_pc (_ bv0 32)))).def_13055))
(assert (let ((.def_13057 (= m_pc (_ bv1 32)))).def_13057))
(assert (let ((.def_13059 (= t1_pc (_ bv1 32)))).def_13059))
(assert (let ((.def_13061 (= t2_pc (_ bv1 32)))).def_13061))
(assert (let ((.def_13063 (= t3_pc (_ bv1 32)))).def_13063))
(assert (let ((.def_13065 (= t4_pc (_ bv1 32)))).def_13065))
(assert (let ((.def_13068 (= m_st (_ bv0 32)))).def_13068))

start_simulation2 N910:
(assert (let ((.def_10707 (= m_pc (_ bv0 32)))).def_10707))
(assert (let ((.def_544 (= c_last_read p_last_write))).def_544))
(assert (let ((.def_553 (= c_num_read p_num_write))).def_553))
(assert (let ((.def_13046 (= t1_pc (_ bv0 32)))).def_13046))
(assert (let ((.def_13049 (= t2_pc (_ bv0 32)))).def_13049))
(assert (let ((.def_13052 (= t3_pc (_ bv0 32)))).def_13052))
(assert (let ((.def_13055 (= t4_pc (_ bv0 32)))).def_13055))
(assert (let ((.def_13057 (= m_pc (_ bv1 32)))).def_13057))
(assert (let ((.def_13059 (= t1_pc (_ bv1 32)))).def_13059))
(assert (let ((.def_13061 (= t2_pc (_ bv1 32)))).def_13061))
(assert (let ((.def_13063 (= t3_pc (_ bv1 32)))).def_13063))
(assert (let ((.def_13065 (= t4_pc (_ bv1 32)))).def_13065))

