(set-info :source |printed by MathSAT|)
(declare-fun c_num_read () (_ BitVec 32))
(declare-fun p_num_write () (_ BitVec 32))
(declare-fun c_last_read () (_ BitVec 32))
(declare-fun p_last_write () (_ BitVec 32))
(declare-fun c_dr_pc () (_ BitVec 32))
(declare-fun q_free () (_ BitVec 32))
(declare-fun q_buf_0 () (_ BitVec 32))
(declare-fun c_dr_st () (_ BitVec 32))
(declare-fun q_req_up () (_ BitVec 32))
(declare-fun q_write_ev () (_ BitVec 32))
(declare-fun q_read_ev () (_ BitVec 32))
(declare-fun p_dw_pc () (_ BitVec 32))
(declare-fun p_dw_st () (_ BitVec 32))
(declare-fun m_pc () (_ BitVec 32))
(declare-fun t1_pc () (_ BitVec 32))
(declare-fun t2_pc () (_ BitVec 32))
(declare-fun t3_pc () (_ BitVec 32))
(declare-fun t4_pc () (_ BitVec 32))
(declare-fun t5_pc () (_ BitVec 32))
(declare-fun t6_pc () (_ BitVec 32))
(declare-fun t7_pc () (_ BitVec 32))
(declare-fun t8_pc () (_ BitVec 32))
(declare-fun m_st () (_ BitVec 32))
(declare-fun t2_st () (_ BitVec 32))
(declare-fun t4_st () (_ BitVec 32))
(declare-fun t3_st () (_ BitVec 32))
(declare-fun t5_st () (_ BitVec 32))
(declare-fun E_6 () (_ BitVec 32))
(declare-fun E_5 () (_ BitVec 32))
(declare-fun E_4 () (_ BitVec 32))
(declare-fun E_3 () (_ BitVec 32))
(declare-fun E_2 () (_ BitVec 32))
(declare-fun E_M () (_ BitVec 32))
(declare-fun E_7 () (_ BitVec 32))
(declare-fun E_8 () (_ BitVec 32))
(declare-fun t1_st () (_ BitVec 32))
(declare-fun t6_st () (_ BitVec 32))
(declare-fun t7_st () (_ BitVec 32))
(declare-fun t8_st () (_ BitVec 32))
(declare-fun E_1 () (_ BitVec 32))
(declare-fun local () (_ BitVec 32))
(declare-fun token () (_ BitVec 32))

*:
(assert (let ((.def_604 (= c_num_read p_num_write))).def_604))
(assert (let ((.def_613 (= c_last_read p_last_write))).def_613))

error1 N4:
(assert false)
(assert (let ((.def_604 (= c_num_read p_num_write))).def_604))
(assert (let ((.def_613 (= c_last_read p_last_write))).def_613))

do_write_p N78:
(assert (let ((.def_800 (= c_dr_pc (_ bv0 32)))).def_800))
(assert (let ((.def_604 (= c_num_read p_num_write))).def_604))
(assert (let ((.def_613 (= c_last_read p_last_write))).def_613))
(assert (let ((.def_868 (= q_free (_ bv1 32)))).def_868))
(assert false)
(assert (let ((.def_1052 (= p_last_write q_buf_0))).def_1052))
(assert (let ((.def_1192 (= c_dr_pc (_ bv1 32)))).def_1192))
(assert (let ((.def_1194 (= q_free (_ bv0 32)))).def_1194))
(assert (let ((.def_1198 (bvadd (_ bv1 32) c_num_read)))(let ((.def_1199 (= p_num_write .def_1198))).def_1199)))
(assert (let ((.def_1880 (= c_dr_st (_ bv0 32)))).def_1880))
(assert (let ((.def_4280 (= q_req_up (_ bv1 32)))).def_4280))
(assert (let ((.def_5913 (= q_write_ev (_ bv1 32)))).def_5913))
(assert (let ((.def_5915 (= q_write_ev (_ bv0 32)))).def_5915))
(assert (let ((.def_8250 (= q_read_ev (_ bv1 32)))).def_8250))
(assert (let ((.def_8252 (= q_read_ev (_ bv0 32)))).def_8252))

do_read_c N112:
(assert (let ((.def_868 (= q_free (_ bv1 32)))).def_868))
(assert (let ((.def_604 (= c_num_read p_num_write))).def_604))
(assert (let ((.def_613 (= c_last_read p_last_write))).def_613))
(assert (let ((.def_1052 (= p_last_write q_buf_0))).def_1052))
(assert (let ((.def_1198 (bvadd (_ bv1 32) c_num_read)))(let ((.def_1199 (= p_num_write .def_1198))).def_1199)))
(assert false)
(assert (let ((.def_1194 (= q_free (_ bv0 32)))).def_1194))
(assert (let ((.def_5913 (= q_write_ev (_ bv1 32)))).def_5913))
(assert (let ((.def_5915 (= q_write_ev (_ bv0 32)))).def_5915))
(assert (let ((.def_1196 (= p_dw_pc (_ bv1 32)))).def_1196))
(assert (let ((.def_4280 (= q_req_up (_ bv1 32)))).def_4280))
(assert (let ((.def_2354 (= p_dw_st (_ bv0 32)))).def_2354))
(assert (let ((.def_8250 (= q_read_ev (_ bv1 32)))).def_8250))
(assert (let ((.def_8252 (= q_read_ev (_ bv0 32)))).def_8252))

eval1 N228:
(assert (let ((.def_800 (= c_dr_pc (_ bv0 32)))).def_800))
(assert (let ((.def_604 (= c_num_read p_num_write))).def_604))
(assert (let ((.def_613 (= c_last_read p_last_write))).def_613))
(assert (let ((.def_868 (= q_free (_ bv1 32)))).def_868))
(assert (let ((.def_1010 (= p_dw_pc (_ bv0 32)))).def_1010))
(assert (let ((.def_1192 (= c_dr_pc (_ bv1 32)))).def_1192))
(assert (let ((.def_1194 (= q_free (_ bv0 32)))).def_1194))
(assert (let ((.def_1196 (= p_dw_pc (_ bv1 32)))).def_1196))
(assert (let ((.def_2354 (= p_dw_st (_ bv0 32)))).def_2354))
(assert (let ((.def_1052 (= p_last_write q_buf_0))).def_1052))
(assert (let ((.def_1198 (bvadd (_ bv1 32) c_num_read)))(let ((.def_1199 (= p_num_write .def_1198))).def_1199)))
(assert (let ((.def_1880 (= c_dr_st (_ bv0 32)))).def_1880))
(assert (let ((.def_4280 (= q_req_up (_ bv1 32)))).def_4280))
(assert (let ((.def_5913 (= q_write_ev (_ bv1 32)))).def_5913))
(assert (let ((.def_5915 (= q_write_ev (_ bv0 32)))).def_5915))
(assert (let ((.def_8250 (= q_read_ev (_ bv1 32)))).def_8250))
(assert (let ((.def_8252 (= q_read_ev (_ bv0 32)))).def_8252))

start_simulation1 N283:
(assert (let ((.def_800 (= c_dr_pc (_ bv0 32)))).def_800))
(assert (let ((.def_604 (= c_num_read p_num_write))).def_604))
(assert (let ((.def_613 (= c_last_read p_last_write))).def_613))
(assert (let ((.def_868 (= q_free (_ bv1 32)))).def_868))
(assert (let ((.def_1010 (= p_dw_pc (_ bv0 32)))).def_1010))
(assert (let ((.def_1192 (= c_dr_pc (_ bv1 32)))).def_1192))
(assert (let ((.def_1194 (= q_free (_ bv0 32)))).def_1194))
(assert (let ((.def_1196 (= p_dw_pc (_ bv1 32)))).def_1196))
(assert (let ((.def_1880 (= c_dr_st (_ bv0 32)))).def_1880))
(assert (let ((.def_2354 (= p_dw_st (_ bv0 32)))).def_2354))
(assert (let ((.def_1052 (= p_last_write q_buf_0))).def_1052))
(assert (let ((.def_5913 (= q_write_ev (_ bv1 32)))).def_5913))
(assert (let ((.def_5915 (= q_write_ev (_ bv0 32)))).def_5915))
(assert (let ((.def_8250 (= q_read_ev (_ bv1 32)))).def_8250))
(assert (let ((.def_8252 (= q_read_ev (_ bv0 32)))).def_8252))
(assert (let ((.def_1198 (bvadd (_ bv1 32) c_num_read)))(let ((.def_1199 (= p_num_write .def_1198))).def_1199)))

error2 N328:
(assert false)
(assert (let ((.def_604 (= c_num_read p_num_write))).def_604))
(assert (let ((.def_613 (= c_last_read p_last_write))).def_613))

eval2 N840:
(assert (let ((.def_11214 (= m_pc (_ bv0 32)))).def_11214))
(assert (let ((.def_604 (= c_num_read p_num_write))).def_604))
(assert (let ((.def_613 (= c_last_read p_last_write))).def_613))
(assert (let ((.def_17619 (= t1_pc (_ bv0 32)))).def_17619))
(assert (let ((.def_17622 (= t2_pc (_ bv0 32)))).def_17622))
(assert (let ((.def_17625 (= t3_pc (_ bv0 32)))).def_17625))
(assert (let ((.def_17628 (= t4_pc (_ bv0 32)))).def_17628))
(assert (let ((.def_17631 (= t5_pc (_ bv0 32)))).def_17631))
(assert (let ((.def_17634 (= t6_pc (_ bv0 32)))).def_17634))
(assert (let ((.def_17637 (= t7_pc (_ bv0 32)))).def_17637))
(assert (let ((.def_17640 (= t8_pc (_ bv0 32)))).def_17640))
(assert (let ((.def_17642 (= m_pc (_ bv1 32)))).def_17642))
(assert (let ((.def_17644 (= t1_pc (_ bv1 32)))).def_17644))
(assert (let ((.def_17646 (= t2_pc (_ bv1 32)))).def_17646))
(assert (let ((.def_17648 (= t3_pc (_ bv1 32)))).def_17648))
(assert (let ((.def_17650 (= t4_pc (_ bv1 32)))).def_17650))
(assert (let ((.def_17652 (= t5_pc (_ bv1 32)))).def_17652))
(assert (let ((.def_17654 (= t6_pc (_ bv1 32)))).def_17654))
(assert (let ((.def_17656 (= t7_pc (_ bv1 32)))).def_17656))
(assert (let ((.def_17658 (= t8_pc (_ bv1 32)))).def_17658))
(assert (let ((.def_17661 (= m_st (_ bv0 32)))).def_17661))
(assert (let ((.def_35086 (= t2_st (_ bv0 32)))).def_35086))
(assert (let ((.def_35089 (= t4_st (_ bv0 32)))).def_35089))
(assert (let ((.def_35092 (= t3_st (_ bv0 32)))).def_35092))
(assert (let ((.def_35095 (= t5_st (_ bv0 32)))).def_35095))
(assert (let ((.def_35098 (= E_6 (_ bv1 32)))).def_35098))
(assert (let ((.def_35101 (= E_5 (_ bv1 32)))).def_35101))
(assert (let ((.def_35104 (= E_4 (_ bv1 32)))).def_35104))
(assert (let ((.def_35107 (= E_3 (_ bv1 32)))).def_35107))
(assert (let ((.def_35110 (= E_2 (_ bv1 32)))).def_35110))
(assert (let ((.def_35113 (= E_M (_ bv1 32)))).def_35113))
(assert (let ((.def_35116 (= E_7 (_ bv1 32)))).def_35116))
(assert (let ((.def_35119 (= E_8 (_ bv1 32)))).def_35119))
(assert (let ((.def_35122 (= t1_st (_ bv0 32)))).def_35122))
(assert (let ((.def_35125 (= t6_st (_ bv0 32)))).def_35125))
(assert (let ((.def_35128 (= t7_st (_ bv0 32)))).def_35128))
(assert (let ((.def_35131 (= t8_st (_ bv0 32)))).def_35131))
(assert (let ((.def_35134 (= E_1 (_ bv1 32)))).def_35134))
(assert (let ((.def_35137 (bvadd (_ bv8 32) local)))(let ((.def_35139 (= .def_35137 token))).def_35139)))
(assert (let ((.def_87530 (= E_5 (_ bv2 32)))).def_87530))
(assert (let ((.def_87532 (= E_2 (_ bv2 32)))).def_87532))
(assert (let ((.def_87534 (= E_1 (_ bv2 32)))).def_87534))
(assert (let ((.def_87536 (= E_3 (_ bv2 32)))).def_87536))
(assert (let ((.def_87538 (= E_7 (_ bv2 32)))).def_87538))
(assert (let ((.def_87540 (= t7_st (_ bv2 32)))).def_87540))
(assert (let ((.def_87542 (= t8_st (_ bv2 32)))).def_87542))
(assert (let ((.def_87544 (= m_st (_ bv2 32)))).def_87544))
(assert (let ((.def_87546 (= t2_st (_ bv2 32)))).def_87546))
(assert (let ((.def_87548 (bvadd (_ bv4 32) local)))(let ((.def_87549 (= token .def_87548))).def_87549)))
(assert (let ((.def_87551 (bvadd (_ bv5 32) local)))(let ((.def_87552 (= token .def_87551))).def_87552)))
(assert (let ((.def_87554 (bvadd (_ bv6 32) local)))(let ((.def_87555 (= token .def_87554))).def_87555)))
(assert (let ((.def_87557 (bvadd (_ bv7 32) local)))(let ((.def_87558 (= token .def_87557))).def_87558)))
(assert (let ((.def_87560 (bvadd (_ bv3 32) local)))(let ((.def_87561 (= token .def_87560))).def_87561)))
(assert (let ((.def_87563 (= local token))).def_87563))
(assert (let ((.def_87565 (bvadd (_ bv2 32) local)))(let ((.def_87566 (= token .def_87565))).def_87566)))
(assert (let ((.def_87568 (bvadd (_ bv1 32) local)))(let ((.def_87569 (= token .def_87568))).def_87569)))

start_simulation2 N1277:
(assert (let ((.def_11214 (= m_pc (_ bv0 32)))).def_11214))
(assert (let ((.def_604 (= c_num_read p_num_write))).def_604))
(assert (let ((.def_613 (= c_last_read p_last_write))).def_613))
(assert (let ((.def_17619 (= t1_pc (_ bv0 32)))).def_17619))
(assert (let ((.def_17622 (= t2_pc (_ bv0 32)))).def_17622))
(assert (let ((.def_17625 (= t3_pc (_ bv0 32)))).def_17625))
(assert (let ((.def_17628 (= t4_pc (_ bv0 32)))).def_17628))
(assert (let ((.def_17631 (= t5_pc (_ bv0 32)))).def_17631))
(assert (let ((.def_17634 (= t6_pc (_ bv0 32)))).def_17634))
(assert (let ((.def_17637 (= t7_pc (_ bv0 32)))).def_17637))
(assert (let ((.def_17640 (= t8_pc (_ bv0 32)))).def_17640))
(assert (let ((.def_17642 (= m_pc (_ bv1 32)))).def_17642))
(assert (let ((.def_17644 (= t1_pc (_ bv1 32)))).def_17644))
(assert (let ((.def_17646 (= t2_pc (_ bv1 32)))).def_17646))
(assert (let ((.def_17648 (= t3_pc (_ bv1 32)))).def_17648))
(assert (let ((.def_17650 (= t4_pc (_ bv1 32)))).def_17650))
(assert (let ((.def_17652 (= t5_pc (_ bv1 32)))).def_17652))
(assert (let ((.def_17654 (= t6_pc (_ bv1 32)))).def_17654))
(assert (let ((.def_17656 (= t7_pc (_ bv1 32)))).def_17656))
(assert (let ((.def_17658 (= t8_pc (_ bv1 32)))).def_17658))
(assert (let ((.def_35086 (= t2_st (_ bv0 32)))).def_35086))
(assert (let ((.def_35089 (= t4_st (_ bv0 32)))).def_35089))
(assert (let ((.def_35092 (= t3_st (_ bv0 32)))).def_35092))
(assert (let ((.def_35095 (= t5_st (_ bv0 32)))).def_35095))
(assert (let ((.def_35098 (= E_6 (_ bv1 32)))).def_35098))
(assert (let ((.def_35101 (= E_5 (_ bv1 32)))).def_35101))
(assert (let ((.def_35104 (= E_4 (_ bv1 32)))).def_35104))
(assert (let ((.def_35107 (= E_3 (_ bv1 32)))).def_35107))
(assert (let ((.def_35110 (= E_2 (_ bv1 32)))).def_35110))
(assert (let ((.def_35113 (= E_M (_ bv1 32)))).def_35113))
(assert (let ((.def_35116 (= E_7 (_ bv1 32)))).def_35116))
(assert (let ((.def_35119 (= E_8 (_ bv1 32)))).def_35119))
(assert (let ((.def_17661 (= m_st (_ bv0 32)))).def_17661))
(assert (let ((.def_35125 (= t6_st (_ bv0 32)))).def_35125))
(assert (let ((.def_87530 (= E_5 (_ bv2 32)))).def_87530))
(assert (let ((.def_87532 (= E_2 (_ bv2 32)))).def_87532))
(assert (let ((.def_35122 (= t1_st (_ bv0 32)))).def_35122))
(assert (let ((.def_87534 (= E_1 (_ bv2 32)))).def_87534))
(assert (let ((.def_87536 (= E_3 (_ bv2 32)))).def_87536))
(assert (let ((.def_35134 (= E_1 (_ bv1 32)))).def_35134))
(assert (let ((.def_35131 (= t8_st (_ bv0 32)))).def_35131))
(assert (let ((.def_87538 (= E_7 (_ bv2 32)))).def_87538))

