(set-info :source |printed by MathSAT|)
(declare-fun a20 () (_ BitVec 32))
(declare-fun a25 () (_ BitVec 32))
(declare-fun a12 () (_ BitVec 32))
(declare-fun a15 () (_ BitVec 32))
(declare-fun a16 () (_ BitVec 32))
(declare-fun a2 () (_ BitVec 32))
(declare-fun a27 () (_ BitVec 32))
(declare-fun a9 () (_ BitVec 32))
(declare-fun m_pc () (_ BitVec 32))
(declare-fun t1_pc () (_ BitVec 32))
(declare-fun t2_pc () (_ BitVec 32))
(declare-fun t3_pc () (_ BitVec 32))
(declare-fun t4_pc () (_ BitVec 32))
(declare-fun t5_pc () (_ BitVec 32))
(declare-fun t6_pc () (_ BitVec 32))
(declare-fun t7_pc () (_ BitVec 32))
(declare-fun t8_pc () (_ BitVec 32))
(declare-fun t9_pc () (_ BitVec 32))
(declare-fun m_st () (_ BitVec 32))
(declare-fun E_1 () (_ BitVec 32))
(declare-fun E_2 () (_ BitVec 32))
(declare-fun E_9 () (_ BitVec 32))
(declare-fun E_7 () (_ BitVec 32))
(declare-fun E_5 () (_ BitVec 32))
(declare-fun E_4 () (_ BitVec 32))
(declare-fun E_3 () (_ BitVec 32))
(declare-fun E_M () (_ BitVec 32))
(declare-fun E_8 () (_ BitVec 32))
(declare-fun E_6 () (_ BitVec 32))
(declare-fun t3_st () (_ BitVec 32))
(declare-fun t4_st () (_ BitVec 32))
(declare-fun t1_st () (_ BitVec 32))
(declare-fun t6_st () (_ BitVec 32))
(declare-fun t7_st () (_ BitVec 32))
(declare-fun t5_st () (_ BitVec 32))
(declare-fun t2_st () (_ BitVec 32))
(declare-fun t9_st () (_ BitVec 32))
(declare-fun t8_st () (_ BitVec 32))
(declare-fun local () (_ BitVec 32))
(declare-fun token () (_ BitVec 32))

*:
(assert (let ((.def_107893 (= a20 (_ bv5 32)))).def_107893))

calculate_output8 N30108:
(assert false)
(assert (let ((.def_107893 (= a20 (_ bv5 32)))).def_107893))

main1 N30136:
(assert (let ((.def_107893 (= a20 (_ bv5 32)))).def_107893))
(assert (let ((.def_155626 (= a25 (_ bv1 32)))).def_155626))
(assert (let ((.def_155629 (= a12 (_ bv4 32)))).def_155629))
(assert (let ((.def_155632 (= a15 (_ bv1 32)))).def_155632))
(assert (let ((.def_155635 (= a16 (_ bv1 32)))).def_155635))
(assert (let ((.def_155638 (= a2 (_ bv10 32)))).def_155638))
(assert (let ((.def_155641 (= a27 (_ bv1 32)))).def_155641))
(assert (let ((.def_155644 (= a9 (_ bv18 32)))).def_155644))
(assert (let ((.def_321816 (= a12 (_ bv5 32)))).def_321816))
(assert (let ((.def_321818 (= a2 (_ bv13 32)))).def_321818))
(assert (let ((.def_321820 (= a12 (_ bv2 32)))).def_321820))
(assert (let ((.def_321822 (= a2 (_ bv12 32)))).def_321822))
(assert (let ((.def_321824 (= a12 (_ bv3 32)))).def_321824))
(assert (let ((.def_321826 (= a9 (_ bv16 32)))).def_321826))
(assert (let ((.def_321828 (= a20 (_ bv7 32)))).def_321828))
(assert (let ((.def_321830 (= a2 (_ bv9 32)))).def_321830))
(assert (let ((.def_321832 (= a9 (_ bv17 32)))).def_321832))

error N30154:
(assert false)
(assert (let ((.def_107893 (= a20 (_ bv5 32)))).def_107893))

eval N30720:
(assert (let ((.def_747439 (= m_pc (_ bv0 32)))).def_747439))
(assert (let ((.def_107893 (= a20 (_ bv5 32)))).def_107893))
(assert (let ((.def_755192 (= t1_pc (_ bv0 32)))).def_755192))
(assert (let ((.def_755195 (= t2_pc (_ bv0 32)))).def_755195))
(assert (let ((.def_755198 (= t3_pc (_ bv0 32)))).def_755198))
(assert (let ((.def_755201 (= t4_pc (_ bv0 32)))).def_755201))
(assert (let ((.def_755204 (= t5_pc (_ bv0 32)))).def_755204))
(assert (let ((.def_755207 (= t6_pc (_ bv0 32)))).def_755207))
(assert (let ((.def_755210 (= t7_pc (_ bv0 32)))).def_755210))
(assert (let ((.def_755213 (= t8_pc (_ bv0 32)))).def_755213))
(assert (let ((.def_755216 (= t9_pc (_ bv0 32)))).def_755216))
(assert (let ((.def_755218 (= m_pc (_ bv1 32)))).def_755218))
(assert (let ((.def_755220 (= t1_pc (_ bv1 32)))).def_755220))
(assert (let ((.def_755222 (= t2_pc (_ bv1 32)))).def_755222))
(assert (let ((.def_755224 (= t3_pc (_ bv1 32)))).def_755224))
(assert (let ((.def_755226 (= t4_pc (_ bv1 32)))).def_755226))
(assert (let ((.def_755228 (= t5_pc (_ bv1 32)))).def_755228))
(assert (let ((.def_755230 (= t6_pc (_ bv1 32)))).def_755230))
(assert (let ((.def_755232 (= t7_pc (_ bv1 32)))).def_755232))
(assert (let ((.def_755234 (= t8_pc (_ bv1 32)))).def_755234))
(assert (let ((.def_755236 (= t9_pc (_ bv1 32)))).def_755236))
(assert (let ((.def_755239 (= m_st (_ bv0 32)))).def_755239))
(assert (let ((.def_784239 (= E_1 (_ bv1 32)))).def_784239))
(assert (let ((.def_784241 (= E_1 (_ bv2 32)))).def_784241))
(assert (let ((.def_784244 (= E_2 (_ bv1 32)))).def_784244))
(assert (let ((.def_784247 (= E_9 (_ bv1 32)))).def_784247))
(assert (let ((.def_784250 (= E_7 (_ bv1 32)))).def_784250))
(assert (let ((.def_784253 (= E_5 (_ bv1 32)))).def_784253))
(assert (let ((.def_784256 (= E_4 (_ bv1 32)))).def_784256))
(assert (let ((.def_784259 (= E_3 (_ bv1 32)))).def_784259))
(assert (let ((.def_784262 (= E_M (_ bv1 32)))).def_784262))
(assert (let ((.def_784265 (= E_8 (_ bv1 32)))).def_784265))
(assert (let ((.def_784268 (= E_6 (_ bv1 32)))).def_784268))
(assert (let ((.def_784271 (= t3_st (_ bv0 32)))).def_784271))
(assert (let ((.def_784274 (= t4_st (_ bv0 32)))).def_784274))
(assert (let ((.def_784277 (= t1_st (_ bv0 32)))).def_784277))
(assert (let ((.def_784280 (= t6_st (_ bv0 32)))).def_784280))
(assert (let ((.def_784283 (= t7_st (_ bv0 32)))).def_784283))
(assert (let ((.def_784286 (= t5_st (_ bv0 32)))).def_784286))
(assert (let ((.def_784289 (= t2_st (_ bv0 32)))).def_784289))
(assert (let ((.def_784292 (= t9_st (_ bv0 32)))).def_784292))
(assert (let ((.def_784295 (= t8_st (_ bv0 32)))).def_784295))
(assert (let ((.def_784298 (bvadd (_ bv9 32) local)))(let ((.def_784300 (= .def_784298 token))).def_784300)))

start_simulation N31198:
(assert (let ((.def_747439 (= m_pc (_ bv0 32)))).def_747439))
(assert (let ((.def_107893 (= a20 (_ bv5 32)))).def_107893))
(assert (let ((.def_755192 (= t1_pc (_ bv0 32)))).def_755192))
(assert (let ((.def_755195 (= t2_pc (_ bv0 32)))).def_755195))
(assert (let ((.def_755198 (= t3_pc (_ bv0 32)))).def_755198))
(assert (let ((.def_755201 (= t4_pc (_ bv0 32)))).def_755201))
(assert (let ((.def_755204 (= t5_pc (_ bv0 32)))).def_755204))
(assert (let ((.def_755207 (= t6_pc (_ bv0 32)))).def_755207))
(assert (let ((.def_755210 (= t7_pc (_ bv0 32)))).def_755210))
(assert (let ((.def_755213 (= t8_pc (_ bv0 32)))).def_755213))
(assert (let ((.def_755216 (= t9_pc (_ bv0 32)))).def_755216))
(assert (let ((.def_755218 (= m_pc (_ bv1 32)))).def_755218))
(assert (let ((.def_755220 (= t1_pc (_ bv1 32)))).def_755220))
(assert (let ((.def_755222 (= t2_pc (_ bv1 32)))).def_755222))
(assert (let ((.def_755224 (= t3_pc (_ bv1 32)))).def_755224))
(assert (let ((.def_755226 (= t4_pc (_ bv1 32)))).def_755226))
(assert (let ((.def_755228 (= t5_pc (_ bv1 32)))).def_755228))
(assert (let ((.def_755230 (= t6_pc (_ bv1 32)))).def_755230))
(assert (let ((.def_755232 (= t7_pc (_ bv1 32)))).def_755232))
(assert (let ((.def_755234 (= t8_pc (_ bv1 32)))).def_755234))
(assert (let ((.def_755236 (= t9_pc (_ bv1 32)))).def_755236))
(assert (let ((.def_784239 (= E_1 (_ bv1 32)))).def_784239))
(assert (let ((.def_784241 (= E_1 (_ bv2 32)))).def_784241))
(assert (let ((.def_784244 (= E_2 (_ bv1 32)))).def_784244))
(assert (let ((.def_784247 (= E_9 (_ bv1 32)))).def_784247))
(assert (let ((.def_784250 (= E_7 (_ bv1 32)))).def_784250))
(assert (let ((.def_784253 (= E_5 (_ bv1 32)))).def_784253))
(assert (let ((.def_784256 (= E_4 (_ bv1 32)))).def_784256))
(assert (let ((.def_784259 (= E_3 (_ bv1 32)))).def_784259))
(assert (let ((.def_784262 (= E_M (_ bv1 32)))).def_784262))
(assert (let ((.def_784265 (= E_8 (_ bv1 32)))).def_784265))
(assert (let ((.def_784268 (= E_6 (_ bv1 32)))).def_784268))
(assert (let ((.def_755239 (= m_st (_ bv0 32)))).def_755239))

