(set-info :source |printed by MathSAT|)
(declare-fun a20 () (_ BitVec 32))
(declare-fun a25 () (_ BitVec 32))
(declare-fun a12 () (_ BitVec 32))
(declare-fun a15 () (_ BitVec 32))
(declare-fun a16 () (_ BitVec 32))
(declare-fun a2 () (_ BitVec 32))
(declare-fun a27 () (_ BitVec 32))
(declare-fun a9 () (_ BitVec 32))
(declare-fun m_pc () (_ BitVec 32))
(declare-fun t1_pc () (_ BitVec 32))
(declare-fun t2_pc () (_ BitVec 32))
(declare-fun t3_pc () (_ BitVec 32))
(declare-fun t4_pc () (_ BitVec 32))
(declare-fun t5_pc () (_ BitVec 32))
(declare-fun t6_pc () (_ BitVec 32))
(declare-fun t7_pc () (_ BitVec 32))
(declare-fun m_st () (_ BitVec 32))

*:
(assert (let ((.def_107863 (= a20 (_ bv5 32)))).def_107863))

calculate_output8 N30108:
(assert false)
(assert (let ((.def_107863 (= a20 (_ bv5 32)))).def_107863))

main1 N30136:
(assert (let ((.def_107863 (= a20 (_ bv5 32)))).def_107863))
(assert (let ((.def_155586 (= a25 (_ bv1 32)))).def_155586))
(assert (let ((.def_155589 (= a12 (_ bv4 32)))).def_155589))
(assert (let ((.def_155592 (= a15 (_ bv1 32)))).def_155592))
(assert (let ((.def_155595 (= a16 (_ bv1 32)))).def_155595))
(assert (let ((.def_155598 (= a2 (_ bv10 32)))).def_155598))
(assert (let ((.def_155601 (= a27 (_ bv1 32)))).def_155601))
(assert (let ((.def_155604 (= a9 (_ bv18 32)))).def_155604))
(assert (let ((.def_321776 (= a12 (_ bv5 32)))).def_321776))
(assert (let ((.def_321778 (= a2 (_ bv13 32)))).def_321778))
(assert (let ((.def_321780 (= a12 (_ bv2 32)))).def_321780))
(assert (let ((.def_321782 (= a2 (_ bv12 32)))).def_321782))
(assert (let ((.def_321784 (= a12 (_ bv3 32)))).def_321784))
(assert (let ((.def_321786 (= a9 (_ bv16 32)))).def_321786))
(assert (let ((.def_321788 (= a20 (_ bv7 32)))).def_321788))
(assert (let ((.def_321790 (= a2 (_ bv9 32)))).def_321790))
(assert (let ((.def_321792 (= a9 (_ bv17 32)))).def_321792))

error N30154:
(assert false)
(assert (let ((.def_107863 (= a20 (_ bv5 32)))).def_107863))

eval N30625:
(assert (let ((.def_747185 (= m_pc (_ bv0 32)))).def_747185))
(assert (let ((.def_107863 (= a20 (_ bv5 32)))).def_107863))
(assert (let ((.def_752415 (= t1_pc (_ bv0 32)))).def_752415))
(assert (let ((.def_752418 (= t2_pc (_ bv0 32)))).def_752418))
(assert (let ((.def_752421 (= t3_pc (_ bv0 32)))).def_752421))
(assert (let ((.def_752424 (= t4_pc (_ bv0 32)))).def_752424))
(assert (let ((.def_752427 (= t5_pc (_ bv0 32)))).def_752427))
(assert (let ((.def_752430 (= t6_pc (_ bv0 32)))).def_752430))
(assert (let ((.def_752433 (= t7_pc (_ bv0 32)))).def_752433))
(assert (let ((.def_752435 (= m_pc (_ bv1 32)))).def_752435))
(assert (let ((.def_752437 (= t1_pc (_ bv1 32)))).def_752437))
(assert (let ((.def_752439 (= t2_pc (_ bv1 32)))).def_752439))
(assert (let ((.def_752441 (= t3_pc (_ bv1 32)))).def_752441))
(assert (let ((.def_752443 (= t4_pc (_ bv1 32)))).def_752443))
(assert (let ((.def_752445 (= t5_pc (_ bv1 32)))).def_752445))
(assert (let ((.def_752447 (= t6_pc (_ bv1 32)))).def_752447))
(assert (let ((.def_752449 (= t7_pc (_ bv1 32)))).def_752449))
(assert (let ((.def_752452 (= m_st (_ bv0 32)))).def_752452))

start_simulation N31021:
(assert (let ((.def_747185 (= m_pc (_ bv0 32)))).def_747185))
(assert (let ((.def_107863 (= a20 (_ bv5 32)))).def_107863))
(assert (let ((.def_752415 (= t1_pc (_ bv0 32)))).def_752415))
(assert (let ((.def_752418 (= t2_pc (_ bv0 32)))).def_752418))
(assert (let ((.def_752421 (= t3_pc (_ bv0 32)))).def_752421))
(assert (let ((.def_752424 (= t4_pc (_ bv0 32)))).def_752424))
(assert (let ((.def_752427 (= t5_pc (_ bv0 32)))).def_752427))
(assert (let ((.def_752430 (= t6_pc (_ bv0 32)))).def_752430))
(assert (let ((.def_752433 (= t7_pc (_ bv0 32)))).def_752433))
(assert (let ((.def_752435 (= m_pc (_ bv1 32)))).def_752435))
(assert (let ((.def_752437 (= t1_pc (_ bv1 32)))).def_752437))
(assert (let ((.def_752439 (= t2_pc (_ bv1 32)))).def_752439))
(assert (let ((.def_752441 (= t3_pc (_ bv1 32)))).def_752441))
(assert (let ((.def_752443 (= t4_pc (_ bv1 32)))).def_752443))
(assert (let ((.def_752445 (= t5_pc (_ bv1 32)))).def_752445))
(assert (let ((.def_752447 (= t6_pc (_ bv1 32)))).def_752447))
(assert (let ((.def_752449 (= t7_pc (_ bv1 32)))).def_752449))

