(set-info :source |printed by MathSAT|)
(declare-fun a20 () (_ BitVec 32))
(declare-fun a2 () (_ BitVec 32))
(declare-fun a27 () (_ BitVec 32))
(declare-fun a16 () (_ BitVec 32))
(declare-fun a15 () (_ BitVec 32))
(declare-fun a12 () (_ BitVec 32))
(declare-fun a25 () (_ BitVec 32))
(declare-fun a9 () (_ BitVec 32))

*:
(assert (let ((.def_106383 (= a20 (_ bv5 32)))).def_106383))

calculate_output8 N29723:
(assert false)
(assert (let ((.def_106383 (= a20 (_ bv5 32)))).def_106383))

main1 N30136:
(assert (let ((.def_153385 (= a2 (_ bv10 32)))).def_153385))
(assert (let ((.def_153388 (= a27 (_ bv1 32)))).def_153388))
(assert (let ((.def_153391 (= a16 (_ bv1 32)))).def_153391))
(assert (let ((.def_153394 (= a15 (_ bv1 32)))).def_153394))
(assert (let ((.def_153397 (= a12 (_ bv4 32)))).def_153397))
(assert (let ((.def_153400 (= a25 (_ bv1 32)))).def_153400))
(assert (let ((.def_106383 (= a20 (_ bv5 32)))).def_106383))
(assert (let ((.def_321376 (= a9 (_ bv18 32)))).def_321376))
(assert (let ((.def_321378 (= a20 (_ bv6 32)))).def_321378))
(assert (let ((.def_321380 (= a12 (_ bv3 32)))).def_321380))
(assert (let ((.def_321382 (= a2 (_ bv13 32)))).def_321382))
(assert (let ((.def_321384 (= a2 (_ bv9 32)))).def_321384))
(assert (let ((.def_321386 (= a12 (_ bv2 32)))).def_321386))
(assert (let ((.def_321388 (= a2 (_ bv11 32)))).def_321388))
(assert (let ((.def_321390 (= a9 (_ bv16 32)))).def_321390))
(assert (let ((.def_321392 (= a9 (_ bv17 32)))).def_321392))

