(set-info :source |printed by MathSAT|)
(declare-fun a20 () (_ BitVec 32))
(declare-fun a2 () (_ BitVec 32))
(declare-fun a27 () (_ BitVec 32))
(declare-fun a16 () (_ BitVec 32))
(declare-fun a15 () (_ BitVec 32))
(declare-fun a12 () (_ BitVec 32))
(declare-fun a25 () (_ BitVec 32))
(declare-fun a9 () (_ BitVec 32))

*:
(assert (let ((.def_106278 (= a20 (_ bv5 32)))).def_106278))

calculate_output8 N29723:
(assert false)
(assert (let ((.def_106278 (= a20 (_ bv5 32)))).def_106278))

main1 N30136:
(assert (let ((.def_153245 (= a2 (_ bv10 32)))).def_153245))
(assert (let ((.def_153248 (= a27 (_ bv1 32)))).def_153248))
(assert (let ((.def_153251 (= a16 (_ bv1 32)))).def_153251))
(assert (let ((.def_153254 (= a15 (_ bv1 32)))).def_153254))
(assert (let ((.def_153257 (= a12 (_ bv4 32)))).def_153257))
(assert (let ((.def_153260 (= a25 (_ bv1 32)))).def_153260))
(assert (let ((.def_106278 (= a20 (_ bv5 32)))).def_106278))
(assert (let ((.def_321236 (= a9 (_ bv18 32)))).def_321236))
(assert (let ((.def_321238 (= a20 (_ bv6 32)))).def_321238))
(assert (let ((.def_321240 (= a12 (_ bv3 32)))).def_321240))
(assert (let ((.def_321242 (= a2 (_ bv13 32)))).def_321242))
(assert (let ((.def_321244 (= a2 (_ bv9 32)))).def_321244))
(assert (let ((.def_321246 (= a12 (_ bv2 32)))).def_321246))
(assert (let ((.def_321248 (= a2 (_ bv11 32)))).def_321248))
(assert (let ((.def_321250 (= a9 (_ bv16 32)))).def_321250))
(assert (let ((.def_321252 (= a9 (_ bv17 32)))).def_321252))

