(set-info :source |printed by MathSAT|)
(declare-fun |assert::arg| () (_ BitVec 8))
(declare-fun st1 () (_ BitVec 8))
(declare-fun st2 () (_ BitVec 8))
(declare-fun st3 () (_ BitVec 8))
(declare-fun st4 () (_ BitVec 8))
(declare-fun st5 () (_ BitVec 8))
(declare-fun st6 () (_ BitVec 8))
(declare-fun st7 () (_ BitVec 8))
(declare-fun r1 () (_ BitVec 8))
(declare-fun p5_new () (_ BitVec 8))
(declare-fun nomsg () (_ BitVec 8))
(declare-fun p4_new () (_ BitVec 8))
(declare-fun p3_new () (_ BitVec 8))
(declare-fun p2_new () (_ BitVec 8))
(declare-fun p6_new () (_ BitVec 8))
(declare-fun mode1 () (_ BitVec 8))
(declare-fun mode2 () (_ BitVec 8))
(declare-fun mode3 () (_ BitVec 8))
(declare-fun mode4 () (_ BitVec 8))
(declare-fun mode5 () (_ BitVec 8))
(declare-fun mode6 () (_ BitVec 8))
(declare-fun mode7 () (_ BitVec 8))
(declare-fun id3 () (_ BitVec 8))
(declare-fun send2 () (_ BitVec 8))
(declare-fun id7 () (_ BitVec 8))
(declare-fun send6 () (_ BitVec 8))
(declare-fun send7 () (_ BitVec 8))
(declare-fun id1 () (_ BitVec 8))
(declare-fun id2 () (_ BitVec 8))
(declare-fun send1 () (_ BitVec 8))
(declare-fun id6 () (_ BitVec 8))
(declare-fun send5 () (_ BitVec 8))
(declare-fun id5 () (_ BitVec 8))
(declare-fun send4 () (_ BitVec 8))
(declare-fun id4 () (_ BitVec 8))
(declare-fun send3 () (_ BitVec 8))
(declare-fun p7_new () (_ BitVec 8))
(declare-fun p1_new () (_ BitVec 8))
(declare-fun p2_old () (_ BitVec 8))
(declare-fun p6_old () (_ BitVec 8))
(declare-fun p7_old () (_ BitVec 8))
(declare-fun p1_old () (_ BitVec 8))
(declare-fun p5_old () (_ BitVec 8))
(declare-fun p4_old () (_ BitVec 8))
(declare-fun p3_old () (_ BitVec 8))
(declare-fun |node4::__CPAchecker_TMP_0| () (_ BitVec 32))
(declare-fun |node6::__CPAchecker_TMP_0| () (_ BitVec 32))
(declare-fun |node2::__CPAchecker_TMP_0| () (_ BitVec 32))
(declare-fun |node1::__CPAchecker_TMP_0| () (_ BitVec 32))
(declare-fun |node5::__CPAchecker_TMP_0| () (_ BitVec 32))
(declare-fun |node3::__CPAchecker_TMP_0| () (_ BitVec 32))

assert:
(assert (let ((.def_3057 (= |assert::arg| (_ bv0 8)))).def_3057))

main1 N484:
(assert (let ((.def_3436 (= st1 (_ bv0 8)))).def_3436))
(assert (let ((.def_3439 (= st2 (_ bv0 8)))).def_3439))
(assert (let ((.def_3442 (= st3 (_ bv0 8)))).def_3442))
(assert (let ((.def_3445 (= st4 (_ bv0 8)))).def_3445))
(assert (let ((.def_3448 (= st5 (_ bv0 8)))).def_3448))
(assert (let ((.def_3451 (= st6 (_ bv0 8)))).def_3451))
(assert (let ((.def_3454 (= st7 (_ bv0 8)))).def_3454))
(assert (let ((.def_3457 (= r1 (_ bv0 8)))).def_3457))
(assert (let ((.def_3461 (= p5_new nomsg))).def_3461))
(assert (let ((.def_3464 (= nomsg p4_new))).def_3464))
(assert (let ((.def_3467 (= nomsg p3_new))).def_3467))
(assert (let ((.def_3470 (= nomsg p2_new))).def_3470))
(assert (let ((.def_3473 (= nomsg p6_new))).def_3473))
(assert (let ((.def_3476 (= mode1 (_ bv0 8)))).def_3476))
(assert (let ((.def_3479 (= mode2 (_ bv0 8)))).def_3479))
(assert (let ((.def_3482 (= mode3 (_ bv0 8)))).def_3482))
(assert (let ((.def_3485 (= mode4 (_ bv0 8)))).def_3485))
(assert (let ((.def_3488 (= mode5 (_ bv0 8)))).def_3488))
(assert (let ((.def_3491 (= mode6 (_ bv0 8)))).def_3491))
(assert (let ((.def_3494 (= mode7 (_ bv0 8)))).def_3494))
(assert (let ((.def_6043 (= st1 st7))).def_6043))
(assert (let ((.def_6045 (= st2 st7))).def_6045))
(assert (let ((.def_6047 (= st3 st7))).def_6047))
(assert (let ((.def_6049 (= st4 st7))).def_6049))
(assert (let ((.def_6051 (= st5 st7))).def_6051))
(assert (let ((.def_6053 (= st6 st7))).def_6053))
(assert (let ((.def_6057 (= id3 send2))).def_6057))
(assert (let ((.def_6060 ((_ sign_extend 24) send2)))(let ((.def_6059 ((_ sign_extend 24) id3)))(let ((.def_6061 (= .def_6059 .def_6060))).def_6061))))
(assert (let ((.def_6065 (= id7 send6))).def_6065))
(assert (let ((.def_6068 ((_ sign_extend 24) send6)))(let ((.def_6067 ((_ sign_extend 24) id7)))(let ((.def_6069 (= .def_6067 .def_6068))).def_6069))))
(assert (let ((.def_6073 (= send7 id1))).def_6073))
(assert (let ((.def_6076 ((_ sign_extend 24) id1)))(let ((.def_6075 ((_ sign_extend 24) send7)))(let ((.def_6077 (= .def_6075 .def_6076))).def_6077))))
(assert (let ((.def_6082 ((_ sign_extend 24) send1)))(let ((.def_6080 ((_ sign_extend 24) id2)))(let ((.def_6083 (= .def_6080 .def_6082))).def_6083))))
(assert (let ((.def_6088 ((_ sign_extend 24) send5)))(let ((.def_6086 ((_ sign_extend 24) id6)))(let ((.def_6089 (= .def_6086 .def_6088))).def_6089))))
(assert (let ((.def_6094 ((_ sign_extend 24) send4)))(let ((.def_6092 ((_ sign_extend 24) id5)))(let ((.def_6095 (= .def_6092 .def_6094))).def_6095))))
(assert (let ((.def_6100 ((_ sign_extend 24) send3)))(let ((.def_6098 ((_ sign_extend 24) id4)))(let ((.def_6101 (= .def_6098 .def_6100))).def_6101))))
(assert (let ((.def_6104 (= nomsg p7_new))).def_6104))
(assert (let ((.def_6107 (= nomsg p1_new))).def_6107))
(assert (let ((.def_6109 ((_ sign_extend 24) nomsg)))(let ((.def_6094 ((_ sign_extend 24) send4)))(let ((.def_6110 (= .def_6094 .def_6109))).def_6110))))
(assert (let ((.def_6109 ((_ sign_extend 24) nomsg)))(let ((.def_6088 ((_ sign_extend 24) send5)))(let ((.def_6112 (= .def_6088 .def_6109))).def_6112))))
(assert (let ((.def_6109 ((_ sign_extend 24) nomsg)))(let ((.def_6068 ((_ sign_extend 24) send6)))(let ((.def_6114 (= .def_6068 .def_6109))).def_6114))))
(assert (let ((.def_6117 ((_ sign_extend 24) p2_old)))(let ((.def_6059 ((_ sign_extend 24) id3)))(let ((.def_6118 (= .def_6059 .def_6117))).def_6118))))
(assert (let ((.def_6127 ((_ sign_extend 24) st1)))(let ((.def_6126 ((_ sign_extend 24) st2)))(let ((.def_6129 (bvadd .def_6126 .def_6127)))(let ((.def_6125 ((_ sign_extend 24) st3)))(let ((.def_6131 (bvadd .def_6125 .def_6129)))(let ((.def_6124 ((_ sign_extend 24) st4)))(let ((.def_6133 (bvadd .def_6124 .def_6131)))(let ((.def_6123 ((_ sign_extend 24) st5)))(let ((.def_6135 (bvadd .def_6123 .def_6133)))(let ((.def_6122 ((_ sign_extend 24) st6)))(let ((.def_6137 (bvadd .def_6122 .def_6135)))(let ((.def_6120 ((_ sign_extend 24) st7)))(let ((.def_6121 (bvneg .def_6120)))(let ((.def_6138 (= .def_6121 .def_6137))).def_6138)))))))))))))))
(assert (let ((.def_6141 ((_ sign_extend 24) p6_old)))(let ((.def_6067 ((_ sign_extend 24) id7)))(let ((.def_6142 (= .def_6067 .def_6141))).def_6142))))
(assert (let ((.def_6145 ((_ sign_extend 24) p7_old)))(let ((.def_6076 ((_ sign_extend 24) id1)))(let ((.def_6146 (= .def_6076 .def_6145))).def_6146))))
(assert (let ((.def_6149 ((_ sign_extend 24) p1_old)))(let ((.def_6080 ((_ sign_extend 24) id2)))(let ((.def_6150 (= .def_6080 .def_6149))).def_6150))))
(assert (let ((.def_6153 ((_ sign_extend 24) p5_old)))(let ((.def_6086 ((_ sign_extend 24) id6)))(let ((.def_6154 (= .def_6086 .def_6153))).def_6154))))
(assert (let ((.def_6157 ((_ sign_extend 24) p4_old)))(let ((.def_6092 ((_ sign_extend 24) id5)))(let ((.def_6158 (= .def_6092 .def_6157))).def_6158))))
(assert (let ((.def_6161 ((_ sign_extend 24) p3_old)))(let ((.def_6098 ((_ sign_extend 24) id4)))(let ((.def_6162 (= .def_6098 .def_6161))).def_6162))))
(assert (let ((.def_6127 ((_ sign_extend 24) st1)))(let ((.def_6122 ((_ sign_extend 24) st6)))(let ((.def_16362 (= .def_6122 .def_6127))).def_16362))))
(assert (let ((.def_6127 ((_ sign_extend 24) st1)))(let ((.def_6124 ((_ sign_extend 24) st4)))(let ((.def_16364 (= .def_6124 .def_6127))).def_16364))))
(assert (let ((.def_6126 ((_ sign_extend 24) st2)))(let ((.def_6125 ((_ sign_extend 24) st3)))(let ((.def_16366 (= .def_6125 .def_6126))).def_16366))))
(assert (let ((.def_6125 ((_ sign_extend 24) st3)))(let ((.def_6123 ((_ sign_extend 24) st5)))(let ((.def_16368 (= .def_6123 .def_6125))).def_16368))))
(assert (let ((.def_16370 (= st6 (_ bv1 8)))).def_16370))
(assert (let ((.def_16372 (= st4 (_ bv1 8)))).def_16372))
(assert (let ((.def_16374 (= st1 (_ bv1 8)))).def_16374))
(assert (let ((.def_6125 ((_ sign_extend 24) st3)))(let ((.def_6122 ((_ sign_extend 24) st6)))(let ((.def_16376 (= .def_6122 .def_6125))).def_16376))))
(assert (let ((.def_6123 ((_ sign_extend 24) st5)))(let ((.def_6122 ((_ sign_extend 24) st6)))(let ((.def_16378 (= .def_6122 .def_6123))).def_16378))))
(assert (let ((.def_6126 ((_ sign_extend 24) st2)))(let ((.def_6123 ((_ sign_extend 24) st5)))(let ((.def_16380 (= .def_6123 .def_6126))).def_16380))))
(assert (let ((.def_6124 ((_ sign_extend 24) st4)))(let ((.def_6123 ((_ sign_extend 24) st5)))(let ((.def_16382 (= .def_6123 .def_6124))).def_16382))))
(assert (let ((.def_6127 ((_ sign_extend 24) st1)))(let ((.def_6123 ((_ sign_extend 24) st5)))(let ((.def_16384 (= .def_6123 .def_6127))).def_16384))))
(assert (let ((.def_6125 ((_ sign_extend 24) st3)))(let ((.def_6124 ((_ sign_extend 24) st4)))(let ((.def_16386 (= .def_6124 .def_6125))).def_16386))))
(assert (let ((.def_16388 (= st5 (_ bv1 8)))).def_16388))
(assert (let ((.def_6126 ((_ sign_extend 24) st2)))(let ((.def_6122 ((_ sign_extend 24) st6)))(let ((.def_16390 (= .def_6122 .def_6126))).def_16390))))
(assert (let ((.def_6124 ((_ sign_extend 24) st4)))(let ((.def_6122 ((_ sign_extend 24) st6)))(let ((.def_16392 (= .def_6122 .def_6124))).def_16392))))
(assert (let ((.def_16394 (= st3 (_ bv1 8)))).def_16394))
(assert (let ((.def_6127 ((_ sign_extend 24) st1)))(let ((.def_6125 ((_ sign_extend 24) st3)))(let ((.def_16396 (= .def_6125 .def_6127))).def_16396))))
(assert (let ((.def_6126 ((_ sign_extend 24) st2)))(let ((.def_6124 ((_ sign_extend 24) st4)))(let ((.def_16398 (= .def_6124 .def_6126))).def_16398))))
(assert (let ((.def_6127 ((_ sign_extend 24) st1)))(let ((.def_6126 ((_ sign_extend 24) st2)))(let ((.def_16400 (= .def_6126 .def_6127))).def_16400))))
(assert (let ((.def_16402 (= st2 (_ bv1 8)))).def_16402))
(assert (let ((.def_16404 ((_ sign_extend 24) r1)))(let ((.def_16405 (bvslt .def_16404 (_ bv7 32)))).def_16405)))
(assert (let ((.def_6100 ((_ sign_extend 24) send3)))(let ((.def_6092 ((_ sign_extend 24) id5)))(let ((.def_32689 (= .def_6092 .def_6100))).def_32689))))
(assert (let ((.def_6092 ((_ sign_extend 24) id5)))(let ((.def_32691 ((_ extract 31 31) .def_6092)))(let ((.def_32692 (= .def_32691 (_ bv1 1)))).def_32692))))
(assert (let ((.def_6068 ((_ sign_extend 24) send6)))(let ((.def_6067 ((_ sign_extend 24) id7)))(let ((.def_32694 (bvslt .def_6067 .def_6068))).def_32694))))
(assert (let ((.def_6082 ((_ sign_extend 24) send1)))(let ((.def_6059 ((_ sign_extend 24) id3)))(let ((.def_32696 (= .def_6059 .def_6082))).def_32696))))
(assert (let ((.def_6080 ((_ sign_extend 24) id2)))(let ((.def_6075 ((_ sign_extend 24) send7)))(let ((.def_32698 (= .def_6075 .def_6080))).def_32698))))
(assert (let ((.def_6080 ((_ sign_extend 24) id2)))(let ((.def_32700 ((_ extract 31 31) .def_6080)))(let ((.def_32701 (= .def_32700 (_ bv1 1)))).def_32701))))
(assert (let ((.def_32703 (= st5 st6))).def_32703))
(assert (let ((.def_32705 (= st1 st2))).def_32705))
(assert (let ((.def_32707 (= st1 st3))).def_32707))
(assert (let ((.def_32709 (= st1 st4))).def_32709))
(assert (let ((.def_32711 (= st1 st5))).def_32711))
(assert (let ((.def_32713 (= st1 st6))).def_32713))
(assert (let ((.def_6076 ((_ sign_extend 24) id1)))(let ((.def_6068 ((_ sign_extend 24) send6)))(let ((.def_32715 (= .def_6068 .def_6076))).def_32715))))
(assert (let ((.def_6075 ((_ sign_extend 24) send7)))(let ((.def_6076 ((_ sign_extend 24) id1)))(let ((.def_32717 (bvslt .def_6076 .def_6075))).def_32717))))
(assert (let ((.def_6094 ((_ sign_extend 24) send4)))(let ((.def_6092 ((_ sign_extend 24) id5)))(let ((.def_32719 (bvslt .def_6092 .def_6094))).def_32719))))
(assert (let ((.def_6094 ((_ sign_extend 24) send4)))(let ((.def_6086 ((_ sign_extend 24) id6)))(let ((.def_32721 (bvslt .def_6086 .def_6094))).def_32721))))
(assert (let ((.def_6094 ((_ sign_extend 24) send4)))(let ((.def_6086 ((_ sign_extend 24) id6)))(let ((.def_32723 (= .def_6086 .def_6094))).def_32723))))
(assert (let ((.def_6092 ((_ sign_extend 24) id5)))(let ((.def_6088 ((_ sign_extend 24) send5)))(let ((.def_32725 (= .def_6088 .def_6092))).def_32725))))
(assert (let ((.def_6088 ((_ sign_extend 24) send5)))(let ((.def_6086 ((_ sign_extend 24) id6)))(let ((.def_32727 (bvslt .def_6086 .def_6088))).def_32727))))
(assert (let ((.def_6088 ((_ sign_extend 24) send5)))(let ((.def_6067 ((_ sign_extend 24) id7)))(let ((.def_32729 (= .def_6067 .def_6088))).def_32729))))
(assert (let ((.def_6086 ((_ sign_extend 24) id6)))(let ((.def_6068 ((_ sign_extend 24) send6)))(let ((.def_32731 (= .def_6068 .def_6086))).def_32731))))
(assert (let ((.def_6082 ((_ sign_extend 24) send1)))(let ((.def_6080 ((_ sign_extend 24) id2)))(let ((.def_32733 (bvslt .def_6080 .def_6082))).def_32733))))
(assert (let ((.def_6098 ((_ sign_extend 24) id4)))(let ((.def_6060 ((_ sign_extend 24) send2)))(let ((.def_32735 (= .def_6060 .def_6098))).def_32735))))
(assert (let ((.def_6060 ((_ sign_extend 24) send2)))(let ((.def_6059 ((_ sign_extend 24) id3)))(let ((.def_32737 (bvslt .def_6059 .def_6060))).def_32737))))
(assert (let ((.def_6109 ((_ sign_extend 24) nomsg)))(let ((.def_6082 ((_ sign_extend 24) send1)))(let ((.def_32739 (= .def_6082 .def_6109))).def_32739))))
(assert (let ((.def_6080 ((_ sign_extend 24) id2)))(let ((.def_6060 ((_ sign_extend 24) send2)))(let ((.def_32741 (= .def_6060 .def_6080))).def_32741))))
(assert (let ((.def_6109 ((_ sign_extend 24) nomsg)))(let ((.def_6060 ((_ sign_extend 24) send2)))(let ((.def_32743 (= .def_6060 .def_6109))).def_32743))))
(assert (let ((.def_32745 (= nomsg (_ bv255 8)))).def_32745))
(assert (let ((.def_6109 ((_ sign_extend 24) nomsg)))(let ((.def_6075 ((_ sign_extend 24) send7)))(let ((.def_32747 (= .def_6075 .def_6109))).def_32747))))
(assert (let ((.def_6100 ((_ sign_extend 24) send3)))(let ((.def_6059 ((_ sign_extend 24) id3)))(let ((.def_32749 (= .def_6059 .def_6100))).def_32749))))
(assert (let ((.def_6109 ((_ sign_extend 24) nomsg)))(let ((.def_6100 ((_ sign_extend 24) send3)))(let ((.def_32751 (= .def_6100 .def_6109))).def_32751))))
(assert (let ((.def_32754 ((_ extract 7 0) |node4::__CPAchecker_TMP_0|)))(let ((.def_32755 (= p4_old .def_32754))).def_32755)))
(assert (let ((.def_6161 ((_ sign_extend 24) p3_old)))(let ((.def_6092 ((_ sign_extend 24) id5)))(let ((.def_32757 (= .def_6092 .def_6161))).def_32757))))
(assert (let ((.def_6141 ((_ sign_extend 24) p6_old)))(let ((.def_6067 ((_ sign_extend 24) id7)))(let ((.def_32759 (bvslt .def_6067 .def_6141))).def_32759))))
(assert (let ((.def_6068 ((_ sign_extend 24) send6)))(let ((.def_32762 (= .def_6068 |node6::__CPAchecker_TMP_0|))).def_32762)))
(assert (let ((.def_32764 ((_ extract 7 0) |node6::__CPAchecker_TMP_0|)))(let ((.def_32765 (= p6_old .def_32764))).def_32765)))
(assert (let ((.def_32767 (= nomsg send6))).def_32767))
(assert (let ((.def_6080 ((_ sign_extend 24) id2)))(let ((.def_32770 (= .def_6080 |node2::__CPAchecker_TMP_0|))).def_32770)))
(assert (let ((.def_32772 ((_ extract 7 0) |node2::__CPAchecker_TMP_0|)))(let ((.def_32773 (= p2_old .def_32772))).def_32773)))
(assert (let ((.def_6149 ((_ sign_extend 24) p1_old)))(let ((.def_6059 ((_ sign_extend 24) id3)))(let ((.def_32775 (= .def_6059 .def_6149))).def_32775))))
(assert (let ((.def_6082 ((_ sign_extend 24) send1)))(let ((.def_32778 (= .def_6082 |node1::__CPAchecker_TMP_0|))).def_32778)))
(assert (let ((.def_32780 ((_ extract 7 0) |node1::__CPAchecker_TMP_0|)))(let ((.def_32781 (= p1_old .def_32780))).def_32781)))
(assert (let ((.def_6145 ((_ sign_extend 24) p7_old)))(let ((.def_6080 ((_ sign_extend 24) id2)))(let ((.def_32783 (= .def_6080 .def_6145))).def_32783))))
(assert (let ((.def_6109 ((_ sign_extend 24) nomsg)))(let ((.def_6080 ((_ sign_extend 24) id2)))(let ((.def_32785 (= .def_6080 .def_6109))).def_32785))))
(assert (let ((.def_32787 (= send7 p7_old))).def_32787))
(assert (let ((.def_32789 (= id1 p6_old))).def_32789))
(assert (let ((.def_6141 ((_ sign_extend 24) p6_old)))(let ((.def_6076 ((_ sign_extend 24) id1)))(let ((.def_32791 (= .def_6076 .def_6141))).def_32791))))
(assert (let ((.def_6145 ((_ sign_extend 24) p7_old)))(let ((.def_6076 ((_ sign_extend 24) id1)))(let ((.def_32793 (bvslt .def_6076 .def_6145))).def_32793))))
(assert (let ((.def_6100 ((_ sign_extend 24) send3)))(let ((.def_6098 ((_ sign_extend 24) id4)))(let ((.def_32795 (bvslt .def_6098 .def_6100))).def_32795))))
(assert (let ((.def_6161 ((_ sign_extend 24) p3_old)))(let ((.def_6098 ((_ sign_extend 24) id4)))(let ((.def_32797 (bvslt .def_6098 .def_6161))).def_32797))))
(assert (let ((.def_32799 (= send3 p3_old))).def_32799))
(assert (let ((.def_6157 ((_ sign_extend 24) p4_old)))(let ((.def_6086 ((_ sign_extend 24) id6)))(let ((.def_32801 (bvslt .def_6086 .def_6157))).def_32801))))
(assert (let ((.def_6157 ((_ sign_extend 24) p4_old)))(let ((.def_6086 ((_ sign_extend 24) id6)))(let ((.def_32803 (= .def_6086 .def_6157))).def_32803))))
(assert (let ((.def_6157 ((_ sign_extend 24) p4_old)))(let ((.def_6092 ((_ sign_extend 24) id5)))(let ((.def_32805 (bvslt .def_6092 .def_6157))).def_32805))))
(assert (let ((.def_6088 ((_ sign_extend 24) send5)))(let ((.def_32808 (= .def_6088 |node5::__CPAchecker_TMP_0|))).def_32808)))
(assert (let ((.def_32810 ((_ extract 7 0) |node5::__CPAchecker_TMP_0|)))(let ((.def_32811 (= p5_old .def_32810))).def_32811)))
(assert (let ((.def_6109 ((_ sign_extend 24) nomsg)))(let ((.def_32813 (= .def_6109 |node5::__CPAchecker_TMP_0|))).def_32813)))
(assert (let ((.def_6153 ((_ sign_extend 24) p5_old)))(let ((.def_6086 ((_ sign_extend 24) id6)))(let ((.def_32815 (bvslt .def_6086 .def_6153))).def_32815))))
(assert (let ((.def_6153 ((_ sign_extend 24) p5_old)))(let ((.def_6067 ((_ sign_extend 24) id7)))(let ((.def_32817 (= .def_6067 .def_6153))).def_32817))))
(assert (let ((.def_6149 ((_ sign_extend 24) p1_old)))(let ((.def_6080 ((_ sign_extend 24) id2)))(let ((.def_32819 (bvslt .def_6080 .def_6149))).def_32819))))
(assert (let ((.def_6117 ((_ sign_extend 24) p2_old)))(let ((.def_6098 ((_ sign_extend 24) id4)))(let ((.def_32821 (= .def_6098 .def_6117))).def_32821))))
(assert (let ((.def_6153 ((_ sign_extend 24) p5_old)))(let ((.def_6109 ((_ sign_extend 24) nomsg)))(let ((.def_32823 (= .def_6109 .def_6153))).def_32823))))
(assert (let ((.def_6117 ((_ sign_extend 24) p2_old)))(let ((.def_6059 ((_ sign_extend 24) id3)))(let ((.def_32825 (bvslt .def_6059 .def_6117))).def_32825))))
(assert (let ((.def_6060 ((_ sign_extend 24) send2)))(let ((.def_32827 (= .def_6060 |node2::__CPAchecker_TMP_0|))).def_32827)))
(assert (let ((.def_6149 ((_ sign_extend 24) p1_old)))(let ((.def_6109 ((_ sign_extend 24) nomsg)))(let ((.def_32829 (= .def_6109 .def_6149))).def_32829))))
(assert (let ((.def_6100 ((_ sign_extend 24) send3)))(let ((.def_32832 (= .def_6100 |node3::__CPAchecker_TMP_0|))).def_32832)))
(assert (let ((.def_6059 ((_ sign_extend 24) id3)))(let ((.def_32834 (= .def_6059 |node3::__CPAchecker_TMP_0|))).def_32834)))
(assert (let ((.def_6094 ((_ sign_extend 24) send4)))(let ((.def_32836 (= .def_6094 |node4::__CPAchecker_TMP_0|))).def_32836)))
(assert (let ((.def_6109 ((_ sign_extend 24) nomsg)))(let ((.def_6059 ((_ sign_extend 24) id3)))(let ((.def_32838 (= .def_6059 .def_6109))).def_32838))))
(assert (let ((.def_6145 ((_ sign_extend 24) p7_old)))(let ((.def_6109 ((_ sign_extend 24) nomsg)))(let ((.def_32840 (= .def_6109 .def_6145))).def_32840))))
(assert (let ((.def_32842 (= st7 (_ bv1 8)))).def_32842))
(assert (let ((.def_32844 (= send2 send1))).def_32844))
(assert (let ((.def_32846 (= id2 send1))).def_32846))
(assert (let ((.def_6127 ((_ sign_extend 24) st1)))(let ((.def_6125 ((_ sign_extend 24) st3)))(let ((.def_32853 (bvadd .def_6125 .def_6127)))(let ((.def_6124 ((_ sign_extend 24) st4)))(let ((.def_32858 (bvadd .def_6124 .def_32853)))(let ((.def_6122 ((_ sign_extend 24) st6)))(let ((.def_32863 (bvadd .def_6122 .def_32858)))(let ((.def_32867 (bvadd .def_6122 .def_32863)))(let ((.def_32868 (bvadd (_ bv1 32) .def_32867)))(let ((.def_6120 ((_ sign_extend 24) st7)))(let ((.def_6121 (bvneg .def_6120)))(let ((.def_32869 (= .def_6121 .def_32868))).def_32869)))))))))))))
(assert (let ((.def_6127 ((_ sign_extend 24) st1)))(let ((.def_6125 ((_ sign_extend 24) st3)))(let ((.def_32853 (bvadd .def_6125 .def_6127)))(let ((.def_6124 ((_ sign_extend 24) st4)))(let ((.def_32858 (bvadd .def_6124 .def_32853)))(let ((.def_6123 ((_ sign_extend 24) st5)))(let ((.def_32871 (bvadd .def_6123 .def_32858)))(let ((.def_6122 ((_ sign_extend 24) st6)))(let ((.def_32872 (bvadd .def_6122 .def_32871)))(let ((.def_32873 (bvadd (_ bv1 32) .def_32872)))(let ((.def_6120 ((_ sign_extend 24) st7)))(let ((.def_6121 (bvneg .def_6120)))(let ((.def_32874 (= .def_6121 .def_32873))).def_32874))))))))))))))
(assert (let ((.def_32876 ((_ sign_extend 24) p5_new)))(let ((.def_6088 ((_ sign_extend 24) send5)))(let ((.def_32877 (= .def_6088 .def_32876))).def_32877))))
(assert (let ((.def_32876 ((_ sign_extend 24) p5_new)))(let ((.def_6086 ((_ sign_extend 24) id6)))(let ((.def_32879 (= .def_6086 .def_32876))).def_32879))))
(assert (let ((.def_32881 ((_ sign_extend 24) p3_new)))(let ((.def_6100 ((_ sign_extend 24) send3)))(let ((.def_32882 (= .def_6100 .def_32881))).def_32882))))
(assert (let ((.def_32884 (= r1 (_ bv1 8)))).def_32884))
(assert (let ((.def_6120 ((_ sign_extend 24) st7)))(let ((.def_32886 (= .def_6120 (_ bv4294967293 32)))).def_32886)))
(assert (let ((.def_6120 ((_ sign_extend 24) st7)))(let ((.def_32888 (= .def_6120 (_ bv4294967292 32)))).def_32888)))
(assert (let ((.def_6120 ((_ sign_extend 24) st7)))(let ((.def_32890 (= .def_6120 (_ bv4294967291 32)))).def_32890)))
(assert (let ((.def_6120 ((_ sign_extend 24) st7)))(let ((.def_32892 (= .def_6120 (_ bv4294967290 32)))).def_32892)))
(assert (let ((.def_6120 ((_ sign_extend 24) st7)))(let ((.def_32894 (= .def_6120 (_ bv4294967294 32)))).def_32894)))
(assert (let ((.def_6157 ((_ sign_extend 24) p4_old)))(let ((.def_6109 ((_ sign_extend 24) nomsg)))(let ((.def_32896 (= .def_6109 .def_6157))).def_32896))))
(assert (let ((.def_6141 ((_ sign_extend 24) p6_old)))(let ((.def_6109 ((_ sign_extend 24) nomsg)))(let ((.def_32898 (= .def_6109 .def_6141))).def_32898))))
(assert (let ((.def_6127 ((_ sign_extend 24) st1)))(let ((.def_6125 ((_ sign_extend 24) st3)))(let ((.def_32853 (bvadd .def_6125 .def_6127)))(let ((.def_6124 ((_ sign_extend 24) st4)))(let ((.def_32858 (bvadd .def_6124 .def_32853)))(let ((.def_6123 ((_ sign_extend 24) st5)))(let ((.def_32871 (bvadd .def_6123 .def_32858)))(let ((.def_6122 ((_ sign_extend 24) st6)))(let ((.def_32872 (bvadd .def_6122 .def_32871)))(let ((.def_6120 ((_ sign_extend 24) st7)))(let ((.def_6121 (bvneg .def_6120)))(let ((.def_32900 (= .def_6121 .def_32872))).def_32900)))))))))))))
(assert (let ((.def_32908 (= st7 (_ bv255 8)))).def_32908))
(assert (let ((.def_6117 ((_ sign_extend 24) p2_old)))(let ((.def_6109 ((_ sign_extend 24) nomsg)))(let ((.def_32910 (= .def_6109 .def_6117))).def_32910))))
(assert (let ((.def_6161 ((_ sign_extend 24) p3_old)))(let ((.def_6109 ((_ sign_extend 24) nomsg)))(let ((.def_32912 (= .def_6109 .def_6161))).def_32912))))

assert N520:
(assert false)
(assert (let ((.def_3057 (= |assert::arg| (_ bv0 8)))).def_3057))

