(set-info :source |printed by MathSAT|)
(declare-fun a20 () (_ BitVec 32))
(declare-fun a25 () (_ BitVec 32))
(declare-fun a12 () (_ BitVec 32))
(declare-fun a15 () (_ BitVec 32))
(declare-fun a16 () (_ BitVec 32))
(declare-fun a2 () (_ BitVec 32))
(declare-fun a27 () (_ BitVec 32))
(declare-fun a9 () (_ BitVec 32))

*:
(assert (let ((.def_105677 (= a20 (_ bv5 32)))).def_105677))

calculate_output8 N29569:
(assert false)
(assert (let ((.def_105677 (= a20 (_ bv5 32)))).def_105677))

main1 N30136:
(assert (let ((.def_105677 (= a20 (_ bv5 32)))).def_105677))
(assert (let ((.def_152274 (= a25 (_ bv1 32)))).def_152274))
(assert (let ((.def_152277 (= a12 (_ bv4 32)))).def_152277))
(assert (let ((.def_152280 (= a15 (_ bv1 32)))).def_152280))
(assert (let ((.def_152283 (= a16 (_ bv1 32)))).def_152283))
(assert (let ((.def_152286 (= a2 (_ bv10 32)))).def_152286))
(assert (let ((.def_152289 (= a27 (_ bv1 32)))).def_152289))
(assert (let ((.def_152292 (= a9 (_ bv18 32)))).def_152292))
(assert (let ((.def_317348 (= a20 (_ bv6 32)))).def_317348))
(assert (let ((.def_317350 (= a2 (_ bv13 32)))).def_317350))
(assert (let ((.def_317352 (= a12 (_ bv3 32)))).def_317352))
(assert (let ((.def_317354 (= a12 (_ bv2 32)))).def_317354))
(assert (let ((.def_317356 (= a9 (_ bv16 32)))).def_317356))
(assert (let ((.def_317358 (= a9 (_ bv17 32)))).def_317358))
(assert (let ((.def_1299069 (= a2 (_ bv11 32)))).def_1299069))
(assert (let ((.def_1299071 (= a12 (_ bv5 32)))).def_1299071))
(assert (let ((.def_1299073 (= a12 (_ bv6 32)))).def_1299073))
(assert (let ((.def_1299075 (= a20 (_ bv7 32)))).def_1299075))
(assert (let ((.def_1299077 (= a2 (_ bv9 32)))).def_1299077))
(assert (let ((.def_1299079 (= a2 (_ bv12 32)))).def_1299079))

