(set-info :source |printed by MathSAT|)
(declare-fun a20 () (_ BitVec 32))
(declare-fun a25 () (_ BitVec 32))
(declare-fun a12 () (_ BitVec 32))
(declare-fun a15 () (_ BitVec 32))
(declare-fun a16 () (_ BitVec 32))
(declare-fun a2 () (_ BitVec 32))
(declare-fun a27 () (_ BitVec 32))
(declare-fun a9 () (_ BitVec 32))
(declare-fun m_pc () (_ BitVec 32))
(declare-fun t1_pc () (_ BitVec 32))
(declare-fun t2_pc () (_ BitVec 32))
(declare-fun t3_pc () (_ BitVec 32))
(declare-fun t4_pc () (_ BitVec 32))
(declare-fun m_st () (_ BitVec 32))
(declare-fun t4_st () (_ BitVec 32))
(declare-fun E_4 () (_ BitVec 32))
(declare-fun E_2 () (_ BitVec 32))
(declare-fun E_M () (_ BitVec 32))
(declare-fun E_3 () (_ BitVec 32))
(declare-fun t1_st () (_ BitVec 32))
(declare-fun t2_st () (_ BitVec 32))
(declare-fun t3_st () (_ BitVec 32))
(declare-fun E_1 () (_ BitVec 32))
(declare-fun local () (_ BitVec 32))
(declare-fun token () (_ BitVec 32))
(declare-fun T4_E () (_ BitVec 32))
(declare-fun T3_E () (_ BitVec 32))
(declare-fun T2_E () (_ BitVec 32))
(declare-fun T1_E () (_ BitVec 32))
(declare-fun M_E () (_ BitVec 32))

*:
(assert (let ((.def_107818 (= a20 (_ bv5 32)))).def_107818))

calculate_output8 N30108:
(assert false)
(assert (let ((.def_107818 (= a20 (_ bv5 32)))).def_107818))

main1 N30136:
(assert (let ((.def_107818 (= a20 (_ bv5 32)))).def_107818))
(assert (let ((.def_155526 (= a25 (_ bv1 32)))).def_155526))
(assert (let ((.def_155529 (= a12 (_ bv4 32)))).def_155529))
(assert (let ((.def_155532 (= a15 (_ bv1 32)))).def_155532))
(assert (let ((.def_155535 (= a16 (_ bv1 32)))).def_155535))
(assert (let ((.def_155538 (= a2 (_ bv10 32)))).def_155538))
(assert (let ((.def_155541 (= a27 (_ bv1 32)))).def_155541))
(assert (let ((.def_155544 (= a9 (_ bv18 32)))).def_155544))
(assert (let ((.def_321716 (= a12 (_ bv5 32)))).def_321716))
(assert (let ((.def_321718 (= a2 (_ bv13 32)))).def_321718))
(assert (let ((.def_321720 (= a12 (_ bv2 32)))).def_321720))
(assert (let ((.def_321722 (= a2 (_ bv12 32)))).def_321722))
(assert (let ((.def_321724 (= a12 (_ bv3 32)))).def_321724))
(assert (let ((.def_321726 (= a9 (_ bv16 32)))).def_321726))
(assert (let ((.def_321728 (= a20 (_ bv7 32)))).def_321728))
(assert (let ((.def_321730 (= a2 (_ bv9 32)))).def_321730))
(assert (let ((.def_321732 (= a9 (_ bv17 32)))).def_321732))

error N30154:
(assert false)
(assert (let ((.def_107818 (= a20 (_ bv5 32)))).def_107818))

eval N30450:
(assert (let ((.def_746744 (= m_pc (_ bv0 32)))).def_746744))
(assert (let ((.def_107818 (= a20 (_ bv5 32)))).def_107818))
(assert (let ((.def_749043 (= t1_pc (_ bv0 32)))).def_749043))
(assert (let ((.def_749046 (= t2_pc (_ bv0 32)))).def_749046))
(assert (let ((.def_749049 (= t3_pc (_ bv0 32)))).def_749049))
(assert (let ((.def_749052 (= t4_pc (_ bv0 32)))).def_749052))
(assert (let ((.def_749054 (= m_pc (_ bv1 32)))).def_749054))
(assert (let ((.def_749056 (= t1_pc (_ bv1 32)))).def_749056))
(assert (let ((.def_749058 (= t2_pc (_ bv1 32)))).def_749058))
(assert (let ((.def_749060 (= t3_pc (_ bv1 32)))).def_749060))
(assert (let ((.def_749062 (= t4_pc (_ bv1 32)))).def_749062))
(assert (let ((.def_749065 (= m_st (_ bv0 32)))).def_749065))
(assert (let ((.def_752313 (= t4_st (_ bv0 32)))).def_752313))
(assert (let ((.def_752316 (= E_4 (_ bv1 32)))).def_752316))
(assert (let ((.def_752319 (= E_2 (_ bv1 32)))).def_752319))
(assert (let ((.def_752322 (= E_M (_ bv1 32)))).def_752322))
(assert (let ((.def_752325 (= E_3 (_ bv1 32)))).def_752325))
(assert (let ((.def_752328 (= t1_st (_ bv0 32)))).def_752328))
(assert (let ((.def_752331 (= t2_st (_ bv0 32)))).def_752331))
(assert (let ((.def_752334 (= t3_st (_ bv0 32)))).def_752334))
(assert (let ((.def_752337 (= E_1 (_ bv1 32)))).def_752337))
(assert (let ((.def_752340 (bvadd (_ bv4 32) local)))(let ((.def_752342 (= .def_752340 token))).def_752342)))
(assert (let ((.def_758833 (= E_1 (_ bv2 32)))).def_758833))
(assert (let ((.def_758835 (= t3_st (_ bv2 32)))).def_758835))
(assert (let ((.def_758837 (= t4_st (_ bv2 32)))).def_758837))
(assert (let ((.def_758839 (bvadd (_ bv2 32) local)))(let ((.def_758840 (= token .def_758839))).def_758840)))
(assert (let ((.def_758842 (= local token))).def_758842))
(assert (let ((.def_758844 (bvadd (_ bv1 32) local)))(let ((.def_758845 (= token .def_758844))).def_758845)))
(assert (let ((.def_758847 (bvadd (_ bv3 32) local)))(let ((.def_758848 (= token .def_758847))).def_758848)))
(assert (let ((.def_765118 (= E_M (_ bv0 32)))).def_765118))
(assert (let ((.def_765120 (= E_2 (_ bv0 32)))).def_765120))
(assert (let ((.def_765122 (= E_1 (_ bv0 32)))).def_765122))
(assert (let ((.def_770912 (= E_4 (_ bv0 32)))).def_770912))
(assert (let ((.def_770914 (= E_3 (_ bv0 32)))).def_770914))
(assert (let ((.def_770917 (= T4_E (_ bv0 32)))).def_770917))
(assert (let ((.def_770920 (= T3_E (_ bv0 32)))).def_770920))
(assert (let ((.def_770923 (= T2_E (_ bv0 32)))).def_770923))
(assert (let ((.def_770926 (= T1_E (_ bv0 32)))).def_770926))
(assert (let ((.def_770929 (= M_E (_ bv0 32)))).def_770929))
(assert false)

start_simulation N30723:
(assert (let ((.def_746744 (= m_pc (_ bv0 32)))).def_746744))
(assert (let ((.def_107818 (= a20 (_ bv5 32)))).def_107818))
(assert (let ((.def_749043 (= t1_pc (_ bv0 32)))).def_749043))
(assert (let ((.def_749046 (= t2_pc (_ bv0 32)))).def_749046))
(assert (let ((.def_749049 (= t3_pc (_ bv0 32)))).def_749049))
(assert (let ((.def_749052 (= t4_pc (_ bv0 32)))).def_749052))
(assert (let ((.def_749054 (= m_pc (_ bv1 32)))).def_749054))
(assert (let ((.def_749056 (= t1_pc (_ bv1 32)))).def_749056))
(assert (let ((.def_749058 (= t2_pc (_ bv1 32)))).def_749058))
(assert (let ((.def_749060 (= t3_pc (_ bv1 32)))).def_749060))
(assert (let ((.def_749062 (= t4_pc (_ bv1 32)))).def_749062))
(assert (let ((.def_752313 (= t4_st (_ bv0 32)))).def_752313))
(assert (let ((.def_752316 (= E_4 (_ bv1 32)))).def_752316))
(assert (let ((.def_752319 (= E_2 (_ bv1 32)))).def_752319))
(assert (let ((.def_752322 (= E_M (_ bv1 32)))).def_752322))
(assert (let ((.def_752325 (= E_3 (_ bv1 32)))).def_752325))
(assert (let ((.def_749065 (= m_st (_ bv0 32)))).def_749065))
(assert (let ((.def_752337 (= E_1 (_ bv1 32)))).def_752337))
(assert (let ((.def_758833 (= E_1 (_ bv2 32)))).def_758833))
(assert (let ((.def_752331 (= t2_st (_ bv0 32)))).def_752331))
(assert (let ((.def_752328 (= t1_st (_ bv0 32)))).def_752328))
(assert (let ((.def_765118 (= E_M (_ bv0 32)))).def_765118))
(assert (let ((.def_765120 (= E_2 (_ bv0 32)))).def_765120))
(assert (let ((.def_752334 (= t3_st (_ bv0 32)))).def_752334))
(assert (let ((.def_770912 (= E_4 (_ bv0 32)))).def_770912))
(assert (let ((.def_770914 (= E_3 (_ bv0 32)))).def_770914))
(assert (let ((.def_770917 (= T4_E (_ bv0 32)))).def_770917))
(assert (let ((.def_770920 (= T3_E (_ bv0 32)))).def_770920))
(assert (let ((.def_770923 (= T2_E (_ bv0 32)))).def_770923))
(assert (let ((.def_770926 (= T1_E (_ bv0 32)))).def_770926))
(assert (let ((.def_770929 (= M_E (_ bv0 32)))).def_770929))

