(set-info :source |printed by MathSAT|)
(declare-fun a20 () (_ BitVec 32))
(declare-fun a25 () (_ BitVec 32))
(declare-fun a12 () (_ BitVec 32))
(declare-fun a15 () (_ BitVec 32))
(declare-fun a16 () (_ BitVec 32))
(declare-fun a2 () (_ BitVec 32))
(declare-fun a27 () (_ BitVec 32))
(declare-fun a9 () (_ BitVec 32))

*:
(assert (let ((.def_105707 (= a20 (_ bv5 32)))).def_105707))

calculate_output8 N29569:
(assert false)
(assert (let ((.def_105707 (= a20 (_ bv5 32)))).def_105707))

main1 N30136:
(assert (let ((.def_105707 (= a20 (_ bv5 32)))).def_105707))
(assert (let ((.def_152314 (= a25 (_ bv1 32)))).def_152314))
(assert (let ((.def_152317 (= a12 (_ bv4 32)))).def_152317))
(assert (let ((.def_152320 (= a15 (_ bv1 32)))).def_152320))
(assert (let ((.def_152323 (= a16 (_ bv1 32)))).def_152323))
(assert (let ((.def_152326 (= a2 (_ bv10 32)))).def_152326))
(assert (let ((.def_152329 (= a27 (_ bv1 32)))).def_152329))
(assert (let ((.def_152332 (= a9 (_ bv18 32)))).def_152332))
(assert (let ((.def_317388 (= a20 (_ bv6 32)))).def_317388))
(assert (let ((.def_317390 (= a2 (_ bv13 32)))).def_317390))
(assert (let ((.def_317392 (= a12 (_ bv3 32)))).def_317392))
(assert (let ((.def_317394 (= a12 (_ bv2 32)))).def_317394))
(assert (let ((.def_317396 (= a9 (_ bv16 32)))).def_317396))
(assert (let ((.def_317398 (= a9 (_ bv17 32)))).def_317398))
(assert (let ((.def_1074903 (= a2 (_ bv9 32)))).def_1074903))
(assert (let ((.def_1074905 (= a2 (_ bv12 32)))).def_1074905))
(assert (let ((.def_1074907 (= a20 (_ bv7 32)))).def_1074907))
(assert (let ((.def_1074909 (= a2 (_ bv11 32)))).def_1074909))
(assert (let ((.def_1074911 (= a12 (_ bv5 32)))).def_1074911))
(assert (let ((.def_1074913 (= a12 (_ bv6 32)))).def_1074913))

