(set-info :source |printed by MathSAT|)
(declare-fun a20 () (_ BitVec 32))
(declare-fun a25 () (_ BitVec 32))
(declare-fun a12 () (_ BitVec 32))
(declare-fun a15 () (_ BitVec 32))
(declare-fun a16 () (_ BitVec 32))
(declare-fun a2 () (_ BitVec 32))
(declare-fun a27 () (_ BitVec 32))
(declare-fun a9 () (_ BitVec 32))
(declare-fun m_pc () (_ BitVec 32))
(declare-fun t1_pc () (_ BitVec 32))
(declare-fun t2_pc () (_ BitVec 32))
(declare-fun t3_pc () (_ BitVec 32))
(declare-fun t4_pc () (_ BitVec 32))
(declare-fun t5_pc () (_ BitVec 32))
(declare-fun t6_pc () (_ BitVec 32))
(declare-fun t7_pc () (_ BitVec 32))
(declare-fun t8_pc () (_ BitVec 32))
(declare-fun t9_pc () (_ BitVec 32))
(declare-fun m_st () (_ BitVec 32))

*:
(assert (let ((.def_106661 (= a20 (_ bv5 32)))).def_106661))

calculate_output8 N29800:
(assert false)
(assert (let ((.def_106661 (= a20 (_ bv5 32)))).def_106661))

main1 N30136:
(assert (let ((.def_106661 (= a20 (_ bv5 32)))).def_106661))
(assert (let ((.def_153854 (= a25 (_ bv1 32)))).def_153854))
(assert (let ((.def_153857 (= a12 (_ bv4 32)))).def_153857))
(assert (let ((.def_153860 (= a15 (_ bv1 32)))).def_153860))
(assert (let ((.def_153863 (= a16 (_ bv1 32)))).def_153863))
(assert (let ((.def_153866 (= a2 (_ bv10 32)))).def_153866))
(assert (let ((.def_153869 (= a27 (_ bv1 32)))).def_153869))
(assert (let ((.def_153872 (= a9 (_ bv18 32)))).def_153872))
(assert (let ((.def_319734 (= a2 (_ bv11 32)))).def_319734))
(assert (let ((.def_319736 (= a12 (_ bv2 32)))).def_319736))
(assert (let ((.def_319738 (= a9 (_ bv17 32)))).def_319738))
(assert (let ((.def_319740 (= a2 (_ bv13 32)))).def_319740))
(assert (let ((.def_319742 (= a20 (_ bv6 32)))).def_319742))
(assert (let ((.def_319744 (= a12 (_ bv6 32)))).def_319744))
(assert (let ((.def_319746 (= a2 (_ bv9 32)))).def_319746))
(assert (let ((.def_319748 (= a9 (_ bv16 32)))).def_319748))
(assert (let ((.def_1108289 (= a12 (_ bv3 32)))).def_1108289))
(assert (let ((.def_1108291 (= a2 (_ bv12 32)))).def_1108291))
(assert (let ((.def_1108293 (= a12 (_ bv5 32)))).def_1108293))
(assert (let ((.def_1108295 (= a20 (_ bv7 32)))).def_1108295))

error N30154:
(assert false)
(assert (let ((.def_106661 (= a20 (_ bv5 32)))).def_106661))

eval N30733:
(assert (let ((.def_1250625 (= m_pc (_ bv0 32)))).def_1250625))
(assert (let ((.def_106661 (= a20 (_ bv5 32)))).def_106661))
(assert (let ((.def_1258417 (= t1_pc (_ bv0 32)))).def_1258417))
(assert (let ((.def_1258420 (= t2_pc (_ bv0 32)))).def_1258420))
(assert (let ((.def_1258423 (= t3_pc (_ bv0 32)))).def_1258423))
(assert (let ((.def_1258426 (= t4_pc (_ bv0 32)))).def_1258426))
(assert (let ((.def_1258429 (= t5_pc (_ bv0 32)))).def_1258429))
(assert (let ((.def_1258432 (= t6_pc (_ bv0 32)))).def_1258432))
(assert (let ((.def_1258435 (= t7_pc (_ bv0 32)))).def_1258435))
(assert (let ((.def_1258438 (= t8_pc (_ bv0 32)))).def_1258438))
(assert (let ((.def_1258441 (= t9_pc (_ bv0 32)))).def_1258441))
(assert (let ((.def_1258443 (= m_pc (_ bv1 32)))).def_1258443))
(assert (let ((.def_1258445 (= t1_pc (_ bv1 32)))).def_1258445))
(assert (let ((.def_1258447 (= t2_pc (_ bv1 32)))).def_1258447))
(assert (let ((.def_1258449 (= t3_pc (_ bv1 32)))).def_1258449))
(assert (let ((.def_1258451 (= t4_pc (_ bv1 32)))).def_1258451))
(assert (let ((.def_1258453 (= t5_pc (_ bv1 32)))).def_1258453))
(assert (let ((.def_1258455 (= t6_pc (_ bv1 32)))).def_1258455))
(assert (let ((.def_1258457 (= t7_pc (_ bv1 32)))).def_1258457))
(assert (let ((.def_1258459 (= t8_pc (_ bv1 32)))).def_1258459))
(assert (let ((.def_1258461 (= t9_pc (_ bv1 32)))).def_1258461))
(assert (let ((.def_1258464 (= m_st (_ bv0 32)))).def_1258464))

start_simulation N31211:
(assert (let ((.def_1250625 (= m_pc (_ bv0 32)))).def_1250625))
(assert (let ((.def_106661 (= a20 (_ bv5 32)))).def_106661))
(assert (let ((.def_1258417 (= t1_pc (_ bv0 32)))).def_1258417))
(assert (let ((.def_1258420 (= t2_pc (_ bv0 32)))).def_1258420))
(assert (let ((.def_1258423 (= t3_pc (_ bv0 32)))).def_1258423))
(assert (let ((.def_1258426 (= t4_pc (_ bv0 32)))).def_1258426))
(assert (let ((.def_1258429 (= t5_pc (_ bv0 32)))).def_1258429))
(assert (let ((.def_1258432 (= t6_pc (_ bv0 32)))).def_1258432))
(assert (let ((.def_1258435 (= t7_pc (_ bv0 32)))).def_1258435))
(assert (let ((.def_1258438 (= t8_pc (_ bv0 32)))).def_1258438))
(assert (let ((.def_1258441 (= t9_pc (_ bv0 32)))).def_1258441))
(assert (let ((.def_1258443 (= m_pc (_ bv1 32)))).def_1258443))
(assert (let ((.def_1258445 (= t1_pc (_ bv1 32)))).def_1258445))
(assert (let ((.def_1258447 (= t2_pc (_ bv1 32)))).def_1258447))
(assert (let ((.def_1258449 (= t3_pc (_ bv1 32)))).def_1258449))
(assert (let ((.def_1258451 (= t4_pc (_ bv1 32)))).def_1258451))
(assert (let ((.def_1258453 (= t5_pc (_ bv1 32)))).def_1258453))
(assert (let ((.def_1258455 (= t6_pc (_ bv1 32)))).def_1258455))
(assert (let ((.def_1258457 (= t7_pc (_ bv1 32)))).def_1258457))
(assert (let ((.def_1258459 (= t8_pc (_ bv1 32)))).def_1258459))
(assert (let ((.def_1258461 (= t9_pc (_ bv1 32)))).def_1258461))

