(set-info :source |printed by MathSAT|)
(declare-fun c_num_read () (_ BitVec 32))
(declare-fun p_num_write () (_ BitVec 32))
(declare-fun c_last_read () (_ BitVec 32))
(declare-fun p_last_write () (_ BitVec 32))
(declare-fun c_dr_pc () (_ BitVec 32))
(declare-fun q_free () (_ BitVec 32))
(declare-fun q_buf_0 () (_ BitVec 32))
(declare-fun c_dr_st () (_ BitVec 32))
(declare-fun q_req_up () (_ BitVec 32))
(declare-fun q_write_ev () (_ BitVec 32))
(declare-fun q_read_ev () (_ BitVec 32))
(declare-fun p_dw_pc () (_ BitVec 32))
(declare-fun p_dw_st () (_ BitVec 32))
(declare-fun m_pc () (_ BitVec 32))
(declare-fun t1_pc () (_ BitVec 32))
(declare-fun t2_pc () (_ BitVec 32))
(declare-fun t3_pc () (_ BitVec 32))
(declare-fun t4_pc () (_ BitVec 32))
(declare-fun t5_pc () (_ BitVec 32))
(declare-fun t6_pc () (_ BitVec 32))
(declare-fun t7_pc () (_ BitVec 32))
(declare-fun t8_pc () (_ BitVec 32))
(declare-fun t9_pc () (_ BitVec 32))
(declare-fun t10_pc () (_ BitVec 32))
(declare-fun m_st () (_ BitVec 32))
(declare-fun t1_st () (_ BitVec 32))
(declare-fun E_8 () (_ BitVec 32))
(declare-fun E_7 () (_ BitVec 32))
(declare-fun E_6 () (_ BitVec 32))
(declare-fun E_5 () (_ BitVec 32))
(declare-fun E_4 () (_ BitVec 32))
(declare-fun E_3 () (_ BitVec 32))
(declare-fun E_2 () (_ BitVec 32))
(declare-fun E_M () (_ BitVec 32))
(declare-fun E_10 () (_ BitVec 32))
(declare-fun E_9 () (_ BitVec 32))
(declare-fun t5_st () (_ BitVec 32))
(declare-fun t6_st () (_ BitVec 32))
(declare-fun t8_st () (_ BitVec 32))
(declare-fun t3_st () (_ BitVec 32))
(declare-fun t9_st () (_ BitVec 32))
(declare-fun t7_st () (_ BitVec 32))
(declare-fun t10_st () (_ BitVec 32))
(declare-fun t2_st () (_ BitVec 32))
(declare-fun E_1 () (_ BitVec 32))
(declare-fun t4_st () (_ BitVec 32))
(declare-fun local () (_ BitVec 32))
(declare-fun token () (_ BitVec 32))

*:
(assert (let ((.def_634 (= c_num_read p_num_write))).def_634))
(assert (let ((.def_643 (= c_last_read p_last_write))).def_643))

error1 N4:
(assert false)
(assert (let ((.def_634 (= c_num_read p_num_write))).def_634))
(assert (let ((.def_643 (= c_last_read p_last_write))).def_643))

do_write_p N78:
(assert (let ((.def_830 (= c_dr_pc (_ bv0 32)))).def_830))
(assert (let ((.def_634 (= c_num_read p_num_write))).def_634))
(assert (let ((.def_643 (= c_last_read p_last_write))).def_643))
(assert (let ((.def_898 (= q_free (_ bv1 32)))).def_898))
(assert false)
(assert (let ((.def_1082 (= p_last_write q_buf_0))).def_1082))
(assert (let ((.def_1222 (= c_dr_pc (_ bv1 32)))).def_1222))
(assert (let ((.def_1224 (= q_free (_ bv0 32)))).def_1224))
(assert (let ((.def_1228 (bvadd (_ bv1 32) c_num_read)))(let ((.def_1229 (= p_num_write .def_1228))).def_1229)))
(assert (let ((.def_1910 (= c_dr_st (_ bv0 32)))).def_1910))
(assert (let ((.def_4310 (= q_req_up (_ bv1 32)))).def_4310))
(assert (let ((.def_5943 (= q_write_ev (_ bv1 32)))).def_5943))
(assert (let ((.def_5945 (= q_write_ev (_ bv0 32)))).def_5945))
(assert (let ((.def_8280 (= q_read_ev (_ bv1 32)))).def_8280))
(assert (let ((.def_8282 (= q_read_ev (_ bv0 32)))).def_8282))

do_read_c N112:
(assert (let ((.def_898 (= q_free (_ bv1 32)))).def_898))
(assert (let ((.def_634 (= c_num_read p_num_write))).def_634))
(assert (let ((.def_643 (= c_last_read p_last_write))).def_643))
(assert (let ((.def_1082 (= p_last_write q_buf_0))).def_1082))
(assert (let ((.def_1228 (bvadd (_ bv1 32) c_num_read)))(let ((.def_1229 (= p_num_write .def_1228))).def_1229)))
(assert false)
(assert (let ((.def_1224 (= q_free (_ bv0 32)))).def_1224))
(assert (let ((.def_5943 (= q_write_ev (_ bv1 32)))).def_5943))
(assert (let ((.def_5945 (= q_write_ev (_ bv0 32)))).def_5945))
(assert (let ((.def_1226 (= p_dw_pc (_ bv1 32)))).def_1226))
(assert (let ((.def_4310 (= q_req_up (_ bv1 32)))).def_4310))
(assert (let ((.def_2384 (= p_dw_st (_ bv0 32)))).def_2384))
(assert (let ((.def_8280 (= q_read_ev (_ bv1 32)))).def_8280))
(assert (let ((.def_8282 (= q_read_ev (_ bv0 32)))).def_8282))

eval1 N228:
(assert (let ((.def_830 (= c_dr_pc (_ bv0 32)))).def_830))
(assert (let ((.def_634 (= c_num_read p_num_write))).def_634))
(assert (let ((.def_643 (= c_last_read p_last_write))).def_643))
(assert (let ((.def_898 (= q_free (_ bv1 32)))).def_898))
(assert (let ((.def_1040 (= p_dw_pc (_ bv0 32)))).def_1040))
(assert (let ((.def_1222 (= c_dr_pc (_ bv1 32)))).def_1222))
(assert (let ((.def_1224 (= q_free (_ bv0 32)))).def_1224))
(assert (let ((.def_1226 (= p_dw_pc (_ bv1 32)))).def_1226))
(assert (let ((.def_2384 (= p_dw_st (_ bv0 32)))).def_2384))
(assert (let ((.def_1082 (= p_last_write q_buf_0))).def_1082))
(assert (let ((.def_1228 (bvadd (_ bv1 32) c_num_read)))(let ((.def_1229 (= p_num_write .def_1228))).def_1229)))
(assert (let ((.def_1910 (= c_dr_st (_ bv0 32)))).def_1910))
(assert (let ((.def_4310 (= q_req_up (_ bv1 32)))).def_4310))
(assert (let ((.def_5943 (= q_write_ev (_ bv1 32)))).def_5943))
(assert (let ((.def_5945 (= q_write_ev (_ bv0 32)))).def_5945))
(assert (let ((.def_8280 (= q_read_ev (_ bv1 32)))).def_8280))
(assert (let ((.def_8282 (= q_read_ev (_ bv0 32)))).def_8282))

start_simulation1 N283:
(assert (let ((.def_830 (= c_dr_pc (_ bv0 32)))).def_830))
(assert (let ((.def_634 (= c_num_read p_num_write))).def_634))
(assert (let ((.def_643 (= c_last_read p_last_write))).def_643))
(assert (let ((.def_898 (= q_free (_ bv1 32)))).def_898))
(assert (let ((.def_1040 (= p_dw_pc (_ bv0 32)))).def_1040))
(assert (let ((.def_1222 (= c_dr_pc (_ bv1 32)))).def_1222))
(assert (let ((.def_1224 (= q_free (_ bv0 32)))).def_1224))
(assert (let ((.def_1226 (= p_dw_pc (_ bv1 32)))).def_1226))
(assert (let ((.def_1910 (= c_dr_st (_ bv0 32)))).def_1910))
(assert (let ((.def_2384 (= p_dw_st (_ bv0 32)))).def_2384))
(assert (let ((.def_1082 (= p_last_write q_buf_0))).def_1082))
(assert (let ((.def_5943 (= q_write_ev (_ bv1 32)))).def_5943))
(assert (let ((.def_5945 (= q_write_ev (_ bv0 32)))).def_5945))
(assert (let ((.def_8280 (= q_read_ev (_ bv1 32)))).def_8280))
(assert (let ((.def_8282 (= q_read_ev (_ bv0 32)))).def_8282))
(assert (let ((.def_1228 (bvadd (_ bv1 32) c_num_read)))(let ((.def_1229 (= p_num_write .def_1228))).def_1229)))

error2 N328:
(assert false)
(assert (let ((.def_634 (= c_num_read p_num_write))).def_634))
(assert (let ((.def_643 (= c_last_read p_last_write))).def_643))

eval2 N948:
(assert (let ((.def_11482 (= m_pc (_ bv0 32)))).def_11482))
(assert (let ((.def_634 (= c_num_read p_num_write))).def_634))
(assert (let ((.def_643 (= c_last_read p_last_write))).def_643))
(assert (let ((.def_20704 (= t1_pc (_ bv0 32)))).def_20704))
(assert (let ((.def_20707 (= t2_pc (_ bv0 32)))).def_20707))
(assert (let ((.def_20710 (= t3_pc (_ bv0 32)))).def_20710))
(assert (let ((.def_20713 (= t4_pc (_ bv0 32)))).def_20713))
(assert (let ((.def_20716 (= t5_pc (_ bv0 32)))).def_20716))
(assert (let ((.def_20719 (= t6_pc (_ bv0 32)))).def_20719))
(assert (let ((.def_20722 (= t7_pc (_ bv0 32)))).def_20722))
(assert (let ((.def_20725 (= t8_pc (_ bv0 32)))).def_20725))
(assert (let ((.def_20728 (= t9_pc (_ bv0 32)))).def_20728))
(assert (let ((.def_20731 (= t10_pc (_ bv0 32)))).def_20731))
(assert (let ((.def_20733 (= m_pc (_ bv1 32)))).def_20733))
(assert (let ((.def_20735 (= t1_pc (_ bv1 32)))).def_20735))
(assert (let ((.def_20737 (= t2_pc (_ bv1 32)))).def_20737))
(assert (let ((.def_20739 (= t3_pc (_ bv1 32)))).def_20739))
(assert (let ((.def_20741 (= t4_pc (_ bv1 32)))).def_20741))
(assert (let ((.def_20743 (= t5_pc (_ bv1 32)))).def_20743))
(assert (let ((.def_20745 (= t6_pc (_ bv1 32)))).def_20745))
(assert (let ((.def_20747 (= t7_pc (_ bv1 32)))).def_20747))
(assert (let ((.def_20749 (= t8_pc (_ bv1 32)))).def_20749))
(assert (let ((.def_20751 (= t9_pc (_ bv1 32)))).def_20751))
(assert (let ((.def_20753 (= t10_pc (_ bv1 32)))).def_20753))
(assert (let ((.def_20756 (= m_st (_ bv0 32)))).def_20756))
(assert (let ((.def_72354 (= t1_st (_ bv0 32)))).def_72354))
(assert (let ((.def_72357 (= E_8 (_ bv1 32)))).def_72357))
(assert (let ((.def_72360 (= E_7 (_ bv1 32)))).def_72360))
(assert (let ((.def_72363 (= E_6 (_ bv1 32)))).def_72363))
(assert (let ((.def_72366 (= E_5 (_ bv1 32)))).def_72366))
(assert (let ((.def_72369 (= E_4 (_ bv1 32)))).def_72369))
(assert (let ((.def_72372 (= E_3 (_ bv1 32)))).def_72372))
(assert (let ((.def_72375 (= E_2 (_ bv1 32)))).def_72375))
(assert (let ((.def_72378 (= E_M (_ bv1 32)))).def_72378))
(assert (let ((.def_72381 (= E_10 (_ bv1 32)))).def_72381))
(assert (let ((.def_72384 (= E_9 (_ bv1 32)))).def_72384))
(assert (let ((.def_72387 (= t5_st (_ bv0 32)))).def_72387))
(assert (let ((.def_72390 (= t6_st (_ bv0 32)))).def_72390))
(assert (let ((.def_72393 (= t8_st (_ bv0 32)))).def_72393))
(assert (let ((.def_72396 (= t3_st (_ bv0 32)))).def_72396))
(assert (let ((.def_72399 (= t9_st (_ bv0 32)))).def_72399))
(assert (let ((.def_72402 (= t7_st (_ bv0 32)))).def_72402))
(assert (let ((.def_72405 (= t10_st (_ bv0 32)))).def_72405))
(assert (let ((.def_72408 (= t2_st (_ bv0 32)))).def_72408))
(assert (let ((.def_72411 (= E_1 (_ bv1 32)))).def_72411))
(assert (let ((.def_72414 (= t4_st (_ bv0 32)))).def_72414))
(assert (let ((.def_72416 (= m_st (_ bv2 32)))).def_72416))
(assert (let ((.def_72419 (bvadd (_ bv10 32) local)))(let ((.def_72421 (= .def_72419 token))).def_72421)))

start_simulation2 N1467:
(assert (let ((.def_11482 (= m_pc (_ bv0 32)))).def_11482))
(assert (let ((.def_634 (= c_num_read p_num_write))).def_634))
(assert (let ((.def_643 (= c_last_read p_last_write))).def_643))
(assert (let ((.def_20704 (= t1_pc (_ bv0 32)))).def_20704))
(assert (let ((.def_20707 (= t2_pc (_ bv0 32)))).def_20707))
(assert (let ((.def_20710 (= t3_pc (_ bv0 32)))).def_20710))
(assert (let ((.def_20713 (= t4_pc (_ bv0 32)))).def_20713))
(assert (let ((.def_20716 (= t5_pc (_ bv0 32)))).def_20716))
(assert (let ((.def_20719 (= t6_pc (_ bv0 32)))).def_20719))
(assert (let ((.def_20722 (= t7_pc (_ bv0 32)))).def_20722))
(assert (let ((.def_20725 (= t8_pc (_ bv0 32)))).def_20725))
(assert (let ((.def_20728 (= t9_pc (_ bv0 32)))).def_20728))
(assert (let ((.def_20731 (= t10_pc (_ bv0 32)))).def_20731))
(assert (let ((.def_20733 (= m_pc (_ bv1 32)))).def_20733))
(assert (let ((.def_20735 (= t1_pc (_ bv1 32)))).def_20735))
(assert (let ((.def_20737 (= t2_pc (_ bv1 32)))).def_20737))
(assert (let ((.def_20739 (= t3_pc (_ bv1 32)))).def_20739))
(assert (let ((.def_20741 (= t4_pc (_ bv1 32)))).def_20741))
(assert (let ((.def_20743 (= t5_pc (_ bv1 32)))).def_20743))
(assert (let ((.def_20745 (= t6_pc (_ bv1 32)))).def_20745))
(assert (let ((.def_20747 (= t7_pc (_ bv1 32)))).def_20747))
(assert (let ((.def_20749 (= t8_pc (_ bv1 32)))).def_20749))
(assert (let ((.def_20751 (= t9_pc (_ bv1 32)))).def_20751))
(assert (let ((.def_20753 (= t10_pc (_ bv1 32)))).def_20753))
(assert (let ((.def_72354 (= t1_st (_ bv0 32)))).def_72354))
(assert (let ((.def_72357 (= E_8 (_ bv1 32)))).def_72357))
(assert (let ((.def_72360 (= E_7 (_ bv1 32)))).def_72360))
(assert (let ((.def_72363 (= E_6 (_ bv1 32)))).def_72363))
(assert (let ((.def_72366 (= E_5 (_ bv1 32)))).def_72366))
(assert (let ((.def_72369 (= E_4 (_ bv1 32)))).def_72369))
(assert (let ((.def_72372 (= E_3 (_ bv1 32)))).def_72372))
(assert (let ((.def_72375 (= E_2 (_ bv1 32)))).def_72375))
(assert (let ((.def_72378 (= E_M (_ bv1 32)))).def_72378))
(assert (let ((.def_72381 (= E_10 (_ bv1 32)))).def_72381))
(assert (let ((.def_72384 (= E_9 (_ bv1 32)))).def_72384))
(assert (let ((.def_20756 (= m_st (_ bv0 32)))).def_20756))

