(set-info :source |printed by MathSAT|)
(declare-fun |assert::arg| () (_ BitVec 8))
(declare-fun st1 () (_ BitVec 8))
(declare-fun st2 () (_ BitVec 8))
(declare-fun st3 () (_ BitVec 8))
(declare-fun r1 () (_ BitVec 8))
(declare-fun mode1 () (_ BitVec 8))
(declare-fun mode2 () (_ BitVec 8))
(declare-fun mode3 () (_ BitVec 8))
(declare-fun send3 () (_ BitVec 8))
(declare-fun id1 () (_ BitVec 8))
(declare-fun id2 () (_ BitVec 8))
(declare-fun send1 () (_ BitVec 8))
(declare-fun id3 () (_ BitVec 8))
(declare-fun send2 () (_ BitVec 8))
(declare-fun nomsg () (_ BitVec 8))
(declare-fun p3_new () (_ BitVec 8))
(declare-fun p1_new () (_ BitVec 8))
(declare-fun p2_new () (_ BitVec 8))
(declare-fun p3_old () (_ BitVec 8))
(declare-fun p1_old () (_ BitVec 8))
(declare-fun p2_old () (_ BitVec 8))
(declare-fun |node2::__CPAchecker_TMP_0| () (_ BitVec 32))
(declare-fun |node1::__CPAchecker_TMP_0| () (_ BitVec 32))

assert:
(assert (let ((.def_1381 (= |assert::arg| (_ bv0 8)))).def_1381))

main1 N215:
(assert (let ((.def_1551 (= st1 (_ bv0 8)))).def_1551))
(assert (let ((.def_1554 (= st2 (_ bv0 8)))).def_1554))
(assert (let ((.def_1557 (= st3 (_ bv0 8)))).def_1557))
(assert (let ((.def_1560 (= r1 (_ bv0 8)))).def_1560))
(assert (let ((.def_1563 (= mode1 (_ bv0 8)))).def_1563))
(assert (let ((.def_1566 (= mode2 (_ bv0 8)))).def_1566))
(assert (let ((.def_1569 (= mode3 (_ bv0 8)))).def_1569))
(assert (let ((.def_2475 (= st1 st3))).def_2475))
(assert (let ((.def_2477 (= st2 st3))).def_2477))
(assert (let ((.def_2481 (= send3 id1))).def_2481))
(assert (let ((.def_2484 ((_ sign_extend 24) id1)))(let ((.def_2483 ((_ sign_extend 24) send3)))(let ((.def_2485 (= .def_2483 .def_2484))).def_2485))))
(assert (let ((.def_2490 ((_ sign_extend 24) send1)))(let ((.def_2488 ((_ sign_extend 24) id2)))(let ((.def_2491 (= .def_2488 .def_2490))).def_2491))))
(assert (let ((.def_2496 ((_ sign_extend 24) send2)))(let ((.def_2494 ((_ sign_extend 24) id3)))(let ((.def_2497 (= .def_2494 .def_2496))).def_2497))))
(assert (let ((.def_2500 ((_ sign_extend 24) nomsg)))(let ((.def_2496 ((_ sign_extend 24) send2)))(let ((.def_2501 (= .def_2496 .def_2500))).def_2501))))
(assert (let ((.def_2504 (= nomsg p3_new))).def_2504))
(assert (let ((.def_2507 (= nomsg p1_new))).def_2507))
(assert (let ((.def_2510 (= nomsg p2_new))).def_2510))
(assert (let ((.def_2515 ((_ sign_extend 24) st1)))(let ((.def_2514 ((_ sign_extend 24) st2)))(let ((.def_2517 (bvadd .def_2514 .def_2515)))(let ((.def_2512 ((_ sign_extend 24) st3)))(let ((.def_2513 (bvneg .def_2512)))(let ((.def_2518 (= .def_2513 .def_2517))).def_2518)))))))
(assert (let ((.def_2521 ((_ sign_extend 24) p3_old)))(let ((.def_2484 ((_ sign_extend 24) id1)))(let ((.def_2522 (= .def_2484 .def_2521))).def_2522))))
(assert (let ((.def_2525 ((_ sign_extend 24) p1_old)))(let ((.def_2488 ((_ sign_extend 24) id2)))(let ((.def_2526 (= .def_2488 .def_2525))).def_2526))))
(assert (let ((.def_2529 ((_ sign_extend 24) p2_old)))(let ((.def_2494 ((_ sign_extend 24) id3)))(let ((.def_2530 (= .def_2494 .def_2529))).def_2530))))
(assert (let ((.def_4228 (= st1 (_ bv1 8)))).def_4228))
(assert (let ((.def_2515 ((_ sign_extend 24) st1)))(let ((.def_2514 ((_ sign_extend 24) st2)))(let ((.def_4230 (= .def_2514 .def_2515))).def_4230))))
(assert (let ((.def_4232 (= st2 (_ bv1 8)))).def_4232))
(assert (let ((.def_4234 ((_ zero_extend 24) r1)))(let ((.def_4235 (bvslt .def_4234 (_ bv3 32)))).def_4235)))
(assert (let ((.def_2515 ((_ sign_extend 24) st1)))(let ((.def_2514 ((_ sign_extend 24) st2)))(let ((.def_2517 (bvadd .def_2514 .def_2515)))(let ((.def_2512 ((_ sign_extend 24) st3)))(let ((.def_4238 (bvadd .def_2512 .def_2517)))(let ((.def_4239 (= .def_4238 (_ bv1 32)))).def_4239)))))))
(assert (let ((.def_7537 (= send3 nomsg))).def_7537))
(assert (let ((.def_2500 ((_ sign_extend 24) nomsg)))(let ((.def_2483 ((_ sign_extend 24) send3)))(let ((.def_7539 (= .def_2483 .def_2500))).def_7539))))
(assert (let ((.def_2484 ((_ sign_extend 24) id1)))(let ((.def_7541 ((_ extract 31 31) .def_2484)))(let ((.def_7542 (= .def_7541 (_ bv1 1)))).def_7542))))
(assert (let ((.def_2494 ((_ sign_extend 24) id3)))(let ((.def_7544 ((_ extract 31 31) .def_2494)))(let ((.def_7545 (= .def_7544 (_ bv1 1)))).def_7545))))
(assert (let ((.def_2494 ((_ sign_extend 24) id3)))(let ((.def_2483 ((_ sign_extend 24) send3)))(let ((.def_7547 (= .def_2483 .def_2494))).def_7547))))
(assert (let ((.def_2496 ((_ sign_extend 24) send2)))(let ((.def_2484 ((_ sign_extend 24) id1)))(let ((.def_7549 (= .def_2484 .def_2496))).def_7549))))
(assert (let ((.def_2496 ((_ sign_extend 24) send2)))(let ((.def_2494 ((_ sign_extend 24) id3)))(let ((.def_7551 (bvslt .def_2494 .def_2496))).def_7551))))
(assert (let ((.def_2483 ((_ sign_extend 24) send3)))(let ((.def_2484 ((_ sign_extend 24) id1)))(let ((.def_7553 (bvslt .def_2484 .def_2483))).def_7553))))
(assert (let ((.def_2488 ((_ sign_extend 24) id2)))(let ((.def_7555 ((_ extract 31 31) .def_2488)))(let ((.def_7556 (= .def_7555 (_ bv1 1)))).def_7556))))
(assert (let ((.def_2496 ((_ sign_extend 24) send2)))(let ((.def_2488 ((_ sign_extend 24) id2)))(let ((.def_7558 (= .def_2488 .def_2496))).def_7558))))
(assert (let ((.def_2483 ((_ sign_extend 24) send3)))(let ((.def_2488 ((_ sign_extend 24) id2)))(let ((.def_7560 (bvslt .def_2488 .def_2483))).def_7560))))
(assert (let ((.def_2490 ((_ sign_extend 24) send1)))(let ((.def_2488 ((_ sign_extend 24) id2)))(let ((.def_7562 (bvslt .def_2488 .def_2490))).def_7562))))
(assert (let ((.def_2494 ((_ sign_extend 24) id3)))(let ((.def_2490 ((_ sign_extend 24) send1)))(let ((.def_7564 (= .def_2490 .def_2494))).def_7564))))
(assert (let ((.def_2490 ((_ sign_extend 24) send1)))(let ((.def_2484 ((_ sign_extend 24) id1)))(let ((.def_7566 (= .def_2484 .def_2490))).def_7566))))
(assert (let ((.def_2500 ((_ sign_extend 24) nomsg)))(let ((.def_2490 ((_ sign_extend 24) send1)))(let ((.def_7568 (= .def_2490 .def_2500))).def_7568))))
(assert (let ((.def_2521 ((_ sign_extend 24) p3_old)))(let ((.def_2500 ((_ sign_extend 24) nomsg)))(let ((.def_7570 (= .def_2500 .def_2521))).def_7570))))
(assert (let ((.def_2525 ((_ sign_extend 24) p1_old)))(let ((.def_2494 ((_ sign_extend 24) id3)))(let ((.def_7572 (= .def_2494 .def_2525))).def_7572))))
(assert (let ((.def_7574 (= send3 p3_old))).def_7574))
(assert (let ((.def_2496 ((_ sign_extend 24) send2)))(let ((.def_7577 (= .def_2496 |node2::__CPAchecker_TMP_0|))).def_7577)))
(assert (let ((.def_7579 ((_ extract 7 0) |node2::__CPAchecker_TMP_0|)))(let ((.def_7580 (= p2_old .def_7579))).def_7580)))
(assert (let ((.def_2529 ((_ sign_extend 24) p2_old)))(let ((.def_2484 ((_ sign_extend 24) id1)))(let ((.def_7582 (= .def_2484 .def_2529))).def_7582))))
(assert (let ((.def_2529 ((_ sign_extend 24) p2_old)))(let ((.def_2494 ((_ sign_extend 24) id3)))(let ((.def_7584 (bvslt .def_2494 .def_2529))).def_7584))))
(assert (let ((.def_2521 ((_ sign_extend 24) p3_old)))(let ((.def_2484 ((_ sign_extend 24) id1)))(let ((.def_7586 (bvslt .def_2484 .def_2521))).def_7586))))
(assert (let ((.def_2484 ((_ sign_extend 24) id1)))(let ((.def_7589 (= .def_2484 |node1::__CPAchecker_TMP_0|))).def_7589)))
(assert (let ((.def_7591 ((_ extract 7 0) |node1::__CPAchecker_TMP_0|)))(let ((.def_7592 (= p1_old .def_7591))).def_7592)))
(assert (let ((.def_2521 ((_ sign_extend 24) p3_old)))(let ((.def_2488 ((_ sign_extend 24) id2)))(let ((.def_7594 (= .def_2488 .def_2521))).def_7594))))
(assert (let ((.def_2525 ((_ sign_extend 24) p1_old)))(let ((.def_2488 ((_ sign_extend 24) id2)))(let ((.def_7596 (bvslt .def_2488 .def_2525))).def_7596))))
(assert (let ((.def_2521 ((_ sign_extend 24) p3_old)))(let ((.def_2488 ((_ sign_extend 24) id2)))(let ((.def_7598 (bvslt .def_2488 .def_2521))).def_7598))))
(assert (let ((.def_2500 ((_ sign_extend 24) nomsg)))(let ((.def_2488 ((_ sign_extend 24) id2)))(let ((.def_7600 (= .def_2488 .def_2500))).def_7600))))
(assert (let ((.def_7611 ((_ extract 6 6) id3)))(let ((.def_7612 (bvnot .def_7611)))(let ((.def_7608 ((_ extract 6 6) p2_old)))(let ((.def_7603 ((_ extract 6 6) p3_old)))(let ((.def_7604 (bvnot .def_7603)))(let ((.def_7602 ((_ extract 6 6) id2)))(let ((.def_7606 (bvand .def_7602 .def_7604)))(let ((.def_7607 (bvnot .def_7606)))(let ((.def_7610 (bvand .def_7607 .def_7608)))(let ((.def_7614 (bvand .def_7610 .def_7612)))(let ((.def_7615 (= .def_7614 (_ bv0 1)))).def_7615))))))))))))
(assert (let ((.def_7626 ((_ extract 5 5) id3)))(let ((.def_7627 (bvnot .def_7626)))(let ((.def_7623 ((_ extract 5 5) p2_old)))(let ((.def_7618 ((_ extract 5 5) p3_old)))(let ((.def_7619 (bvnot .def_7618)))(let ((.def_7617 ((_ extract 5 5) id2)))(let ((.def_7621 (bvand .def_7617 .def_7619)))(let ((.def_7622 (bvnot .def_7621)))(let ((.def_7625 (bvand .def_7622 .def_7623)))(let ((.def_7629 (bvand .def_7625 .def_7627)))(let ((.def_7630 (= .def_7629 (_ bv0 1)))).def_7630))))))))))))
(assert (let ((.def_7641 ((_ extract 4 4) id3)))(let ((.def_7642 (bvnot .def_7641)))(let ((.def_7638 ((_ extract 4 4) p2_old)))(let ((.def_7633 ((_ extract 4 4) p3_old)))(let ((.def_7634 (bvnot .def_7633)))(let ((.def_7632 ((_ extract 4 4) id2)))(let ((.def_7636 (bvand .def_7632 .def_7634)))(let ((.def_7637 (bvnot .def_7636)))(let ((.def_7640 (bvand .def_7637 .def_7638)))(let ((.def_7644 (bvand .def_7640 .def_7642)))(let ((.def_7645 (= .def_7644 (_ bv0 1)))).def_7645))))))))))))
(assert (let ((.def_7656 ((_ extract 3 3) id3)))(let ((.def_7657 (bvnot .def_7656)))(let ((.def_7653 ((_ extract 3 3) p2_old)))(let ((.def_7648 ((_ extract 3 3) p3_old)))(let ((.def_7649 (bvnot .def_7648)))(let ((.def_7647 ((_ extract 3 3) id2)))(let ((.def_7651 (bvand .def_7647 .def_7649)))(let ((.def_7652 (bvnot .def_7651)))(let ((.def_7655 (bvand .def_7652 .def_7653)))(let ((.def_7659 (bvand .def_7655 .def_7657)))(let ((.def_7660 (= .def_7659 (_ bv0 1)))).def_7660))))))))))))
(assert (let ((.def_7671 ((_ extract 2 2) id3)))(let ((.def_7672 (bvnot .def_7671)))(let ((.def_7668 ((_ extract 2 2) p2_old)))(let ((.def_7663 ((_ extract 2 2) p3_old)))(let ((.def_7664 (bvnot .def_7663)))(let ((.def_7662 ((_ extract 2 2) id2)))(let ((.def_7666 (bvand .def_7662 .def_7664)))(let ((.def_7667 (bvnot .def_7666)))(let ((.def_7670 (bvand .def_7667 .def_7668)))(let ((.def_7674 (bvand .def_7670 .def_7672)))(let ((.def_7675 (= .def_7674 (_ bv0 1)))).def_7675))))))))))))
(assert (let ((.def_7686 ((_ extract 1 1) id3)))(let ((.def_7687 (bvnot .def_7686)))(let ((.def_7683 ((_ extract 1 1) p2_old)))(let ((.def_7678 ((_ extract 1 1) p3_old)))(let ((.def_7679 (bvnot .def_7678)))(let ((.def_7677 ((_ extract 1 1) id2)))(let ((.def_7681 (bvand .def_7677 .def_7679)))(let ((.def_7682 (bvnot .def_7681)))(let ((.def_7685 (bvand .def_7682 .def_7683)))(let ((.def_7689 (bvand .def_7685 .def_7687)))(let ((.def_7690 (= .def_7689 (_ bv0 1)))).def_7690))))))))))))
(assert (let ((.def_7709 ((_ extract 0 0) id3)))(let ((.def_7710 (bvnot .def_7709)))(let ((.def_7706 ((_ extract 0 0) p2_old)))(let ((.def_7701 ((_ extract 0 0) p3_old)))(let ((.def_7702 (bvnot .def_7701)))(let ((.def_7698 ((_ extract 0 0) id2)))(let ((.def_7677 ((_ extract 1 1) id2)))(let ((.def_7694 (bvnot .def_7677)))(let ((.def_7686 ((_ extract 1 1) id3)))(let ((.def_7687 (bvnot .def_7686)))(let ((.def_7678 ((_ extract 1 1) p3_old)))(let ((.def_7692 (bvand .def_7678 .def_7687)))(let ((.def_7683 ((_ extract 1 1) p2_old)))(let ((.def_7693 (bvor .def_7683 .def_7692)))(let ((.def_7696 (bvand .def_7693 .def_7694)))(let ((.def_7697 (bvnot .def_7696)))(let ((.def_7700 (bvand .def_7697 .def_7698)))(let ((.def_7704 (bvand .def_7700 .def_7702)))(let ((.def_7705 (bvnot .def_7704)))(let ((.def_7708 (bvand .def_7705 .def_7706)))(let ((.def_7712 (bvand .def_7708 .def_7710)))(let ((.def_7713 (= .def_7712 (_ bv0 1)))).def_7713)))))))))))))))))))))))
(assert (let ((.def_7662 ((_ extract 2 2) id2)))(let ((.def_7717 (bvnot .def_7662)))(let ((.def_7671 ((_ extract 2 2) id3)))(let ((.def_7672 (bvnot .def_7671)))(let ((.def_7663 ((_ extract 2 2) p3_old)))(let ((.def_7715 (bvand .def_7663 .def_7672)))(let ((.def_7668 ((_ extract 2 2) p2_old)))(let ((.def_7716 (bvor .def_7668 .def_7715)))(let ((.def_7719 (bvand .def_7716 .def_7717)))(let ((.def_7720 (= .def_7719 (_ bv0 1)))).def_7720)))))))))))
(assert (let ((.def_7647 ((_ extract 3 3) id2)))(let ((.def_7724 (bvnot .def_7647)))(let ((.def_7656 ((_ extract 3 3) id3)))(let ((.def_7657 (bvnot .def_7656)))(let ((.def_7648 ((_ extract 3 3) p3_old)))(let ((.def_7722 (bvand .def_7648 .def_7657)))(let ((.def_7653 ((_ extract 3 3) p2_old)))(let ((.def_7723 (bvor .def_7653 .def_7722)))(let ((.def_7726 (bvand .def_7723 .def_7724)))(let ((.def_7727 (= .def_7726 (_ bv0 1)))).def_7727)))))))))))
(assert (let ((.def_7632 ((_ extract 4 4) id2)))(let ((.def_7731 (bvnot .def_7632)))(let ((.def_7641 ((_ extract 4 4) id3)))(let ((.def_7642 (bvnot .def_7641)))(let ((.def_7633 ((_ extract 4 4) p3_old)))(let ((.def_7729 (bvand .def_7633 .def_7642)))(let ((.def_7638 ((_ extract 4 4) p2_old)))(let ((.def_7730 (bvor .def_7638 .def_7729)))(let ((.def_7733 (bvand .def_7730 .def_7731)))(let ((.def_7734 (= .def_7733 (_ bv0 1)))).def_7734)))))))))))
(assert (let ((.def_7617 ((_ extract 5 5) id2)))(let ((.def_7738 (bvnot .def_7617)))(let ((.def_7626 ((_ extract 5 5) id3)))(let ((.def_7627 (bvnot .def_7626)))(let ((.def_7618 ((_ extract 5 5) p3_old)))(let ((.def_7736 (bvand .def_7618 .def_7627)))(let ((.def_7623 ((_ extract 5 5) p2_old)))(let ((.def_7737 (bvor .def_7623 .def_7736)))(let ((.def_7740 (bvand .def_7737 .def_7738)))(let ((.def_7741 (= .def_7740 (_ bv0 1)))).def_7741)))))))))))
(assert (let ((.def_7602 ((_ extract 6 6) id2)))(let ((.def_7745 (bvnot .def_7602)))(let ((.def_7611 ((_ extract 6 6) id3)))(let ((.def_7612 (bvnot .def_7611)))(let ((.def_7603 ((_ extract 6 6) p3_old)))(let ((.def_7743 (bvand .def_7603 .def_7612)))(let ((.def_7608 ((_ extract 6 6) p2_old)))(let ((.def_7744 (bvor .def_7608 .def_7743)))(let ((.def_7747 (bvand .def_7744 .def_7745)))(let ((.def_7748 (= .def_7747 (_ bv0 1)))).def_7748)))))))))))
(assert (let ((.def_7641 ((_ extract 4 4) id3)))(let ((.def_7642 (bvnot .def_7641)))(let ((.def_7638 ((_ extract 4 4) p2_old)))(let ((.def_7633 ((_ extract 4 4) p3_old)))(let ((.def_7634 (bvnot .def_7633)))(let ((.def_7632 ((_ extract 4 4) id2)))(let ((.def_7636 (bvand .def_7632 .def_7634)))(let ((.def_7637 (bvnot .def_7636)))(let ((.def_7640 (bvand .def_7637 .def_7638)))(let ((.def_7644 (bvand .def_7640 .def_7642)))(let ((.def_7769 (bvnot .def_7644)))(let ((.def_7731 (bvnot .def_7632)))(let ((.def_7729 (bvand .def_7633 .def_7642)))(let ((.def_7730 (bvor .def_7638 .def_7729)))(let ((.def_7733 (bvand .def_7730 .def_7731)))(let ((.def_7766 (bvnot .def_7733)))(let ((.def_7656 ((_ extract 3 3) id3)))(let ((.def_7657 (bvnot .def_7656)))(let ((.def_7653 ((_ extract 3 3) p2_old)))(let ((.def_7648 ((_ extract 3 3) p3_old)))(let ((.def_7649 (bvnot .def_7648)))(let ((.def_7647 ((_ extract 3 3) id2)))(let ((.def_7651 (bvand .def_7647 .def_7649)))(let ((.def_7652 (bvnot .def_7651)))(let ((.def_7655 (bvand .def_7652 .def_7653)))(let ((.def_7659 (bvand .def_7655 .def_7657)))(let ((.def_7763 (bvnot .def_7659)))(let ((.def_7724 (bvnot .def_7647)))(let ((.def_7722 (bvand .def_7648 .def_7657)))(let ((.def_7723 (bvor .def_7653 .def_7722)))(let ((.def_7726 (bvand .def_7723 .def_7724)))(let ((.def_7760 (bvnot .def_7726)))(let ((.def_7671 ((_ extract 2 2) id3)))(let ((.def_7672 (bvnot .def_7671)))(let ((.def_7668 ((_ extract 2 2) p2_old)))(let ((.def_7663 ((_ extract 2 2) p3_old)))(let ((.def_7664 (bvnot .def_7663)))(let ((.def_7662 ((_ extract 2 2) id2)))(let ((.def_7666 (bvand .def_7662 .def_7664)))(let ((.def_7667 (bvnot .def_7666)))(let ((.def_7670 (bvand .def_7667 .def_7668)))(let ((.def_7674 (bvand .def_7670 .def_7672)))(let ((.def_7757 (bvnot .def_7674)))(let ((.def_7717 (bvnot .def_7662)))(let ((.def_7715 (bvand .def_7663 .def_7672)))(let ((.def_7716 (bvor .def_7668 .def_7715)))(let ((.def_7719 (bvand .def_7716 .def_7717)))(let ((.def_7754 (bvnot .def_7719)))(let ((.def_7709 ((_ extract 0 0) id3)))(let ((.def_7710 (bvnot .def_7709)))(let ((.def_7706 ((_ extract 0 0) p2_old)))(let ((.def_7701 ((_ extract 0 0) p3_old)))(let ((.def_7702 (bvnot .def_7701)))(let ((.def_7698 ((_ extract 0 0) id2)))(let ((.def_7677 ((_ extract 1 1) id2)))(let ((.def_7694 (bvnot .def_7677)))(let ((.def_7686 ((_ extract 1 1) id3)))(let ((.def_7687 (bvnot .def_7686)))(let ((.def_7678 ((_ extract 1 1) p3_old)))(let ((.def_7692 (bvand .def_7678 .def_7687)))(let ((.def_7683 ((_ extract 1 1) p2_old)))(let ((.def_7693 (bvor .def_7683 .def_7692)))(let ((.def_7696 (bvand .def_7693 .def_7694)))(let ((.def_7697 (bvnot .def_7696)))(let ((.def_7700 (bvand .def_7697 .def_7698)))(let ((.def_7704 (bvand .def_7700 .def_7702)))(let ((.def_7705 (bvnot .def_7704)))(let ((.def_7708 (bvand .def_7705 .def_7706)))(let ((.def_7712 (bvand .def_7708 .def_7710)))(let ((.def_7751 (bvnot .def_7712)))(let ((.def_7679 (bvnot .def_7678)))(let ((.def_7681 (bvand .def_7677 .def_7679)))(let ((.def_7682 (bvnot .def_7681)))(let ((.def_7685 (bvand .def_7682 .def_7683)))(let ((.def_7689 (bvand .def_7685 .def_7687)))(let ((.def_7750 (bvnot .def_7689)))(let ((.def_7753 (bvand .def_7750 .def_7751)))(let ((.def_7756 (bvand .def_7753 .def_7754)))(let ((.def_7759 (bvand .def_7756 .def_7757)))(let ((.def_7762 (bvand .def_7759 .def_7760)))(let ((.def_7765 (bvand .def_7762 .def_7763)))(let ((.def_7768 (bvand .def_7765 .def_7766)))(let ((.def_7771 (bvand .def_7768 .def_7769)))(let ((.def_7772 (= .def_7771 (_ bv1 1)))).def_7772)))))))))))))))))))))))))))))))))))))))))))))))))))))))))))))))))))))))))))))))))))))
(assert (let ((.def_7626 ((_ extract 5 5) id3)))(let ((.def_7627 (bvnot .def_7626)))(let ((.def_7623 ((_ extract 5 5) p2_old)))(let ((.def_7618 ((_ extract 5 5) p3_old)))(let ((.def_7619 (bvnot .def_7618)))(let ((.def_7617 ((_ extract 5 5) id2)))(let ((.def_7621 (bvand .def_7617 .def_7619)))(let ((.def_7622 (bvnot .def_7621)))(let ((.def_7625 (bvand .def_7622 .def_7623)))(let ((.def_7629 (bvand .def_7625 .def_7627)))(let ((.def_7783 (bvnot .def_7629)))(let ((.def_7779 ((_ extract 7 7) id2)))(let ((.def_7780 (bvnot .def_7779)))(let ((.def_7775 ((_ extract 7 7) id3)))(let ((.def_7776 (bvnot .def_7775)))(let ((.def_7611 ((_ extract 6 6) id3)))(let ((.def_7612 (bvnot .def_7611)))(let ((.def_7608 ((_ extract 6 6) p2_old)))(let ((.def_7603 ((_ extract 6 6) p3_old)))(let ((.def_7604 (bvnot .def_7603)))(let ((.def_7602 ((_ extract 6 6) id2)))(let ((.def_7606 (bvand .def_7602 .def_7604)))(let ((.def_7607 (bvnot .def_7606)))(let ((.def_7610 (bvand .def_7607 .def_7608)))(let ((.def_7614 (bvand .def_7610 .def_7612)))(let ((.def_7774 (bvnot .def_7614)))(let ((.def_7778 (bvand .def_7774 .def_7776)))(let ((.def_7782 (bvand .def_7778 .def_7780)))(let ((.def_7785 (bvand .def_7782 .def_7783)))(let ((.def_7786 (= .def_7785 (_ bv1 1)))).def_7786)))))))))))))))))))))))))))))))
(assert (let ((.def_7779 ((_ extract 7 7) id2)))(let ((.def_7780 (bvnot .def_7779)))(let ((.def_7775 ((_ extract 7 7) id3)))(let ((.def_7776 (bvnot .def_7775)))(let ((.def_7611 ((_ extract 6 6) id3)))(let ((.def_7612 (bvnot .def_7611)))(let ((.def_7608 ((_ extract 6 6) p2_old)))(let ((.def_7603 ((_ extract 6 6) p3_old)))(let ((.def_7604 (bvnot .def_7603)))(let ((.def_7602 ((_ extract 6 6) id2)))(let ((.def_7606 (bvand .def_7602 .def_7604)))(let ((.def_7607 (bvnot .def_7606)))(let ((.def_7610 (bvand .def_7607 .def_7608)))(let ((.def_7614 (bvand .def_7610 .def_7612)))(let ((.def_7774 (bvnot .def_7614)))(let ((.def_7778 (bvand .def_7774 .def_7776)))(let ((.def_7782 (bvand .def_7778 .def_7780)))(let ((.def_7788 (= .def_7782 (_ bv1 1)))).def_7788)))))))))))))))))))
(assert (let ((.def_7617 ((_ extract 5 5) id2)))(let ((.def_7738 (bvnot .def_7617)))(let ((.def_7626 ((_ extract 5 5) id3)))(let ((.def_7627 (bvnot .def_7626)))(let ((.def_7618 ((_ extract 5 5) p3_old)))(let ((.def_7736 (bvand .def_7618 .def_7627)))(let ((.def_7623 ((_ extract 5 5) p2_old)))(let ((.def_7737 (bvor .def_7623 .def_7736)))(let ((.def_7740 (bvand .def_7737 .def_7738)))(let ((.def_7791 (bvnot .def_7740)))(let ((.def_7619 (bvnot .def_7618)))(let ((.def_7621 (bvand .def_7617 .def_7619)))(let ((.def_7622 (bvnot .def_7621)))(let ((.def_7625 (bvand .def_7622 .def_7623)))(let ((.def_7629 (bvand .def_7625 .def_7627)))(let ((.def_7783 (bvnot .def_7629)))(let ((.def_7779 ((_ extract 7 7) id2)))(let ((.def_7780 (bvnot .def_7779)))(let ((.def_7775 ((_ extract 7 7) id3)))(let ((.def_7776 (bvnot .def_7775)))(let ((.def_7611 ((_ extract 6 6) id3)))(let ((.def_7612 (bvnot .def_7611)))(let ((.def_7608 ((_ extract 6 6) p2_old)))(let ((.def_7603 ((_ extract 6 6) p3_old)))(let ((.def_7604 (bvnot .def_7603)))(let ((.def_7602 ((_ extract 6 6) id2)))(let ((.def_7606 (bvand .def_7602 .def_7604)))(let ((.def_7607 (bvnot .def_7606)))(let ((.def_7610 (bvand .def_7607 .def_7608)))(let ((.def_7614 (bvand .def_7610 .def_7612)))(let ((.def_7774 (bvnot .def_7614)))(let ((.def_7778 (bvand .def_7774 .def_7776)))(let ((.def_7782 (bvand .def_7778 .def_7780)))(let ((.def_7785 (bvand .def_7782 .def_7783)))(let ((.def_7641 ((_ extract 4 4) id3)))(let ((.def_7642 (bvnot .def_7641)))(let ((.def_7638 ((_ extract 4 4) p2_old)))(let ((.def_7633 ((_ extract 4 4) p3_old)))(let ((.def_7634 (bvnot .def_7633)))(let ((.def_7632 ((_ extract 4 4) id2)))(let ((.def_7636 (bvand .def_7632 .def_7634)))(let ((.def_7637 (bvnot .def_7636)))(let ((.def_7640 (bvand .def_7637 .def_7638)))(let ((.def_7644 (bvand .def_7640 .def_7642)))(let ((.def_7769 (bvnot .def_7644)))(let ((.def_7731 (bvnot .def_7632)))(let ((.def_7729 (bvand .def_7633 .def_7642)))(let ((.def_7730 (bvor .def_7638 .def_7729)))(let ((.def_7733 (bvand .def_7730 .def_7731)))(let ((.def_7766 (bvnot .def_7733)))(let ((.def_7656 ((_ extract 3 3) id3)))(let ((.def_7657 (bvnot .def_7656)))(let ((.def_7653 ((_ extract 3 3) p2_old)))(let ((.def_7648 ((_ extract 3 3) p3_old)))(let ((.def_7649 (bvnot .def_7648)))(let ((.def_7647 ((_ extract 3 3) id2)))(let ((.def_7651 (bvand .def_7647 .def_7649)))(let ((.def_7652 (bvnot .def_7651)))(let ((.def_7655 (bvand .def_7652 .def_7653)))(let ((.def_7659 (bvand .def_7655 .def_7657)))(let ((.def_7763 (bvnot .def_7659)))(let ((.def_7724 (bvnot .def_7647)))(let ((.def_7722 (bvand .def_7648 .def_7657)))(let ((.def_7723 (bvor .def_7653 .def_7722)))(let ((.def_7726 (bvand .def_7723 .def_7724)))(let ((.def_7760 (bvnot .def_7726)))(let ((.def_7671 ((_ extract 2 2) id3)))(let ((.def_7672 (bvnot .def_7671)))(let ((.def_7668 ((_ extract 2 2) p2_old)))(let ((.def_7663 ((_ extract 2 2) p3_old)))(let ((.def_7664 (bvnot .def_7663)))(let ((.def_7662 ((_ extract 2 2) id2)))(let ((.def_7666 (bvand .def_7662 .def_7664)))(let ((.def_7667 (bvnot .def_7666)))(let ((.def_7670 (bvand .def_7667 .def_7668)))(let ((.def_7674 (bvand .def_7670 .def_7672)))(let ((.def_7757 (bvnot .def_7674)))(let ((.def_7717 (bvnot .def_7662)))(let ((.def_7715 (bvand .def_7663 .def_7672)))(let ((.def_7716 (bvor .def_7668 .def_7715)))(let ((.def_7719 (bvand .def_7716 .def_7717)))(let ((.def_7754 (bvnot .def_7719)))(let ((.def_7709 ((_ extract 0 0) id3)))(let ((.def_7710 (bvnot .def_7709)))(let ((.def_7706 ((_ extract 0 0) p2_old)))(let ((.def_7701 ((_ extract 0 0) p3_old)))(let ((.def_7702 (bvnot .def_7701)))(let ((.def_7698 ((_ extract 0 0) id2)))(let ((.def_7677 ((_ extract 1 1) id2)))(let ((.def_7694 (bvnot .def_7677)))(let ((.def_7686 ((_ extract 1 1) id3)))(let ((.def_7687 (bvnot .def_7686)))(let ((.def_7678 ((_ extract 1 1) p3_old)))(let ((.def_7692 (bvand .def_7678 .def_7687)))(let ((.def_7683 ((_ extract 1 1) p2_old)))(let ((.def_7693 (bvor .def_7683 .def_7692)))(let ((.def_7696 (bvand .def_7693 .def_7694)))(let ((.def_7697 (bvnot .def_7696)))(let ((.def_7700 (bvand .def_7697 .def_7698)))(let ((.def_7704 (bvand .def_7700 .def_7702)))(let ((.def_7705 (bvnot .def_7704)))(let ((.def_7708 (bvand .def_7705 .def_7706)))(let ((.def_7712 (bvand .def_7708 .def_7710)))(let ((.def_7751 (bvnot .def_7712)))(let ((.def_7679 (bvnot .def_7678)))(let ((.def_7681 (bvand .def_7677 .def_7679)))(let ((.def_7682 (bvnot .def_7681)))(let ((.def_7685 (bvand .def_7682 .def_7683)))(let ((.def_7689 (bvand .def_7685 .def_7687)))(let ((.def_7750 (bvnot .def_7689)))(let ((.def_7753 (bvand .def_7750 .def_7751)))(let ((.def_7756 (bvand .def_7753 .def_7754)))(let ((.def_7759 (bvand .def_7756 .def_7757)))(let ((.def_7762 (bvand .def_7759 .def_7760)))(let ((.def_7765 (bvand .def_7762 .def_7763)))(let ((.def_7768 (bvand .def_7765 .def_7766)))(let ((.def_7771 (bvand .def_7768 .def_7769)))(let ((.def_7790 (bvand .def_7771 .def_7785)))(let ((.def_7793 (bvand .def_7790 .def_7791)))(let ((.def_7794 (bvand .def_7771 .def_7793)))(let ((.def_7795 (bvand .def_7785 .def_7794)))(let ((.def_7796 (bvand .def_7782 .def_7795)))(let ((.def_7797 (= .def_7796 (_ bv1 1)))).def_7797))))))))))))))))))))))))))))))))))))))))))))))))))))))))))))))))))))))))))))))))))))))))))))))))))))))))))))))))))))))))))))
(assert (let ((.def_7775 ((_ extract 7 7) id3)))(let ((.def_7799 (= .def_7775 (_ bv0 1)))).def_7799)))
(assert (let ((.def_7779 ((_ extract 7 7) id2)))(let ((.def_7801 (= .def_7779 (_ bv0 1)))).def_7801)))
(assert (let ((.def_2529 ((_ sign_extend 24) p2_old)))(let ((.def_2500 ((_ sign_extend 24) nomsg)))(let ((.def_7803 (= .def_2500 .def_2529))).def_7803))))
(assert (let ((.def_2490 ((_ sign_extend 24) send1)))(let ((.def_7805 (= .def_2490 |node1::__CPAchecker_TMP_0|))).def_7805)))
(assert (let ((.def_2500 ((_ sign_extend 24) nomsg)))(let ((.def_2484 ((_ sign_extend 24) id1)))(let ((.def_7807 (= .def_2484 .def_2500))).def_7807))))
(assert (let ((.def_7809 (= id3 send2))).def_7809))
(assert (let ((.def_7811 (= r1 (_ bv3 8)))).def_7811))
(assert (let ((.def_7813 (= r1 (_ bv1 8)))).def_7813))
(assert (let ((.def_7815 ((_ extract 6 6) send1)))(let ((.def_7867 (bvnot .def_7815)))(let ((.def_7602 ((_ extract 6 6) id2)))(let ((.def_7868 (bvand .def_7602 .def_7867)))(let ((.def_7779 ((_ extract 7 7) id2)))(let ((.def_7780 (bvnot .def_7779)))(let ((.def_7869 (bvand .def_7780 .def_7868)))(let ((.def_7870 (bvnot .def_7869)))(let ((.def_7857 ((_ extract 5 5) send1)))(let ((.def_7864 (bvnot .def_7857)))(let ((.def_7617 ((_ extract 5 5) id2)))(let ((.def_7865 (bvand .def_7617 .def_7864)))(let ((.def_7866 (bvnot .def_7865)))(let ((.def_7872 (bvand .def_7866 .def_7870)))(let ((.def_7818 ((_ extract 4 4) send1)))(let ((.def_7853 (bvnot .def_7818)))(let ((.def_7632 ((_ extract 4 4) id2)))(let ((.def_7854 (bvand .def_7632 .def_7853)))(let ((.def_7861 (bvnot .def_7854)))(let ((.def_7821 ((_ extract 3 3) send1)))(let ((.def_7847 (bvnot .def_7821)))(let ((.def_7647 ((_ extract 3 3) id2)))(let ((.def_7848 (bvand .def_7647 .def_7847)))(let ((.def_7824 ((_ extract 2 2) send1)))(let ((.def_7841 (bvnot .def_7824)))(let ((.def_7662 ((_ extract 2 2) id2)))(let ((.def_7842 (bvand .def_7662 .def_7841)))(let ((.def_7827 ((_ extract 1 1) send1)))(let ((.def_7835 (bvnot .def_7827)))(let ((.def_7677 ((_ extract 1 1) id2)))(let ((.def_7836 (bvand .def_7677 .def_7835)))(let ((.def_7830 ((_ extract 0 0) send1)))(let ((.def_7831 (bvnot .def_7830)))(let ((.def_7694 (bvnot .def_7677)))(let ((.def_7828 (bvand .def_7694 .def_7827)))(let ((.def_7829 (bvnot .def_7828)))(let ((.def_7833 (bvand .def_7829 .def_7831)))(let ((.def_7698 ((_ extract 0 0) id2)))(let ((.def_7834 (bvand .def_7698 .def_7833)))(let ((.def_7838 (bvor .def_7834 .def_7836)))(let ((.def_7717 (bvnot .def_7662)))(let ((.def_7825 (bvand .def_7717 .def_7824)))(let ((.def_7826 (bvnot .def_7825)))(let ((.def_7840 (bvand .def_7826 .def_7838)))(let ((.def_7844 (bvor .def_7840 .def_7842)))(let ((.def_7724 (bvnot .def_7647)))(let ((.def_7822 (bvand .def_7724 .def_7821)))(let ((.def_7823 (bvnot .def_7822)))(let ((.def_7846 (bvand .def_7823 .def_7844)))(let ((.def_7850 (bvor .def_7846 .def_7848)))(let ((.def_7731 (bvnot .def_7632)))(let ((.def_7819 (bvand .def_7731 .def_7818)))(let ((.def_7820 (bvnot .def_7819)))(let ((.def_7852 (bvand .def_7820 .def_7850)))(let ((.def_7860 (bvnot .def_7852)))(let ((.def_7863 (bvand .def_7860 .def_7861)))(let ((.def_7874 (bvand .def_7863 .def_7872)))(let ((.def_7875 (bvnot .def_7874)))(let ((.def_7738 (bvnot .def_7617)))(let ((.def_7858 (bvand .def_7738 .def_7857)))(let ((.def_7859 (bvnot .def_7858)))(let ((.def_7877 (bvand .def_7859 .def_7875)))(let ((.def_7856 (bvor .def_7852 .def_7854)))(let ((.def_7879 (bvand .def_7856 .def_7877)))(let ((.def_7880 (bvnot .def_7879)))(let ((.def_7881 (bvand .def_7872 .def_7880)))(let ((.def_7882 (bvand .def_7870 .def_7881)))(let ((.def_7883 (bvnot .def_7882)))(let ((.def_7884 (bvand .def_7780 .def_7883)))(let ((.def_7745 (bvnot .def_7602)))(let ((.def_7816 (bvand .def_7745 .def_7815)))(let ((.def_7817 (bvnot .def_7816)))(let ((.def_7886 (bvand .def_7817 .def_7884)))(let ((.def_7887 (bvand .def_7883 .def_7886)))(let ((.def_7888 (bvor .def_7779 .def_7887)))(let ((.def_7889 (= .def_7888 (_ bv1 1)))).def_7889)))))))))))))))))))))))))))))))))))))))))))))))))))))))))))))))))))))))))))))
(assert (let ((.def_7891 ((_ sign_extend 24) p1_new)))(let ((.def_2490 ((_ sign_extend 24) send1)))(let ((.def_7892 (= .def_2490 .def_7891))).def_7892))))
(assert (let ((.def_7894 ((_ extract 6 6) p1_old)))(let ((.def_7946 (bvnot .def_7894)))(let ((.def_7602 ((_ extract 6 6) id2)))(let ((.def_7947 (bvand .def_7602 .def_7946)))(let ((.def_7779 ((_ extract 7 7) id2)))(let ((.def_7780 (bvnot .def_7779)))(let ((.def_7948 (bvand .def_7780 .def_7947)))(let ((.def_7949 (bvnot .def_7948)))(let ((.def_7936 ((_ extract 5 5) p1_old)))(let ((.def_7943 (bvnot .def_7936)))(let ((.def_7617 ((_ extract 5 5) id2)))(let ((.def_7944 (bvand .def_7617 .def_7943)))(let ((.def_7945 (bvnot .def_7944)))(let ((.def_7951 (bvand .def_7945 .def_7949)))(let ((.def_7897 ((_ extract 4 4) p1_old)))(let ((.def_7932 (bvnot .def_7897)))(let ((.def_7632 ((_ extract 4 4) id2)))(let ((.def_7933 (bvand .def_7632 .def_7932)))(let ((.def_7940 (bvnot .def_7933)))(let ((.def_7900 ((_ extract 3 3) p1_old)))(let ((.def_7926 (bvnot .def_7900)))(let ((.def_7647 ((_ extract 3 3) id2)))(let ((.def_7927 (bvand .def_7647 .def_7926)))(let ((.def_7903 ((_ extract 2 2) p1_old)))(let ((.def_7920 (bvnot .def_7903)))(let ((.def_7662 ((_ extract 2 2) id2)))(let ((.def_7921 (bvand .def_7662 .def_7920)))(let ((.def_7906 ((_ extract 1 1) p1_old)))(let ((.def_7914 (bvnot .def_7906)))(let ((.def_7677 ((_ extract 1 1) id2)))(let ((.def_7915 (bvand .def_7677 .def_7914)))(let ((.def_7909 ((_ extract 0 0) p1_old)))(let ((.def_7910 (bvnot .def_7909)))(let ((.def_7694 (bvnot .def_7677)))(let ((.def_7907 (bvand .def_7694 .def_7906)))(let ((.def_7908 (bvnot .def_7907)))(let ((.def_7912 (bvand .def_7908 .def_7910)))(let ((.def_7698 ((_ extract 0 0) id2)))(let ((.def_7913 (bvand .def_7698 .def_7912)))(let ((.def_7917 (bvor .def_7913 .def_7915)))(let ((.def_7717 (bvnot .def_7662)))(let ((.def_7904 (bvand .def_7717 .def_7903)))(let ((.def_7905 (bvnot .def_7904)))(let ((.def_7919 (bvand .def_7905 .def_7917)))(let ((.def_7923 (bvor .def_7919 .def_7921)))(let ((.def_7724 (bvnot .def_7647)))(let ((.def_7901 (bvand .def_7724 .def_7900)))(let ((.def_7902 (bvnot .def_7901)))(let ((.def_7925 (bvand .def_7902 .def_7923)))(let ((.def_7929 (bvor .def_7925 .def_7927)))(let ((.def_7731 (bvnot .def_7632)))(let ((.def_7898 (bvand .def_7731 .def_7897)))(let ((.def_7899 (bvnot .def_7898)))(let ((.def_7931 (bvand .def_7899 .def_7929)))(let ((.def_7939 (bvnot .def_7931)))(let ((.def_7942 (bvand .def_7939 .def_7940)))(let ((.def_7953 (bvand .def_7942 .def_7951)))(let ((.def_7954 (bvnot .def_7953)))(let ((.def_7738 (bvnot .def_7617)))(let ((.def_7937 (bvand .def_7738 .def_7936)))(let ((.def_7938 (bvnot .def_7937)))(let ((.def_7956 (bvand .def_7938 .def_7954)))(let ((.def_7935 (bvor .def_7931 .def_7933)))(let ((.def_7958 (bvand .def_7935 .def_7956)))(let ((.def_7959 (bvnot .def_7958)))(let ((.def_7960 (bvand .def_7951 .def_7959)))(let ((.def_7961 (bvand .def_7949 .def_7960)))(let ((.def_7962 (bvnot .def_7961)))(let ((.def_7963 (bvand .def_7780 .def_7962)))(let ((.def_7745 (bvnot .def_7602)))(let ((.def_7895 (bvand .def_7745 .def_7894)))(let ((.def_7896 (bvnot .def_7895)))(let ((.def_7965 (bvand .def_7896 .def_7963)))(let ((.def_7966 (bvand .def_7962 .def_7965)))(let ((.def_7967 (bvor .def_7779 .def_7966)))(let ((.def_7968 (= .def_7967 (_ bv1 1)))).def_7968)))))))))))))))))))))))))))))))))))))))))))))))))))))))))))))))))))))))))))))

assert N236:
(assert false)
(assert (let ((.def_1381 (= |assert::arg| (_ bv0 8)))).def_1381))

