(set-info :source |printed by MathSAT|)
(declare-fun |ssl3_connect::blastFlag| () (_ BitVec 32))
(declare-fun |ssl3_connect::s__state| () (_ BitVec 32))
(declare-fun |ssl3_connect::s__s3__tmp__reuse_message| () (_ BitVec 32))
(declare-fun |ssl3_connect::s__hit| () (_ BitVec 32))
(declare-fun |ssl3_connect::s__s3__tmp__next_state___0| () (_ BitVec 32))
(declare-fun |ssl3_accept::s__state| () (_ BitVec 32))
(declare-fun |ssl3_accept::blastFlag| () (_ BitVec 32))
(declare-fun |ssl3_accept::s__s3__tmp__reuse_message| () (_ BitVec 32))
(declare-fun |ssl3_accept::s__hit| () (_ BitVec 32))
(declare-fun |ssl3_accept::s__s3__tmp__next_state___0| () (_ BitVec 32))
(declare-fun |ssl3_accept::s__init_buf___0| () (_ BitVec 32))
(declare-fun |ssl3_accept::s__s3__tmp__new_cipher__algorithms| () (_ BitVec 32))
(declare-fun |ssl3_accept::s__verify_mode| () (_ BitVec 32))
(declare-fun |ssl3_accept::s__session__peer| () (_ BitVec 32))

ssl3_connect:
(assert (let ((.def_678 (= |ssl3_connect::blastFlag| (_ bv5 32)))).def_678))

ssl3_connect N117:
(assert (let ((.def_1602 (= |ssl3_connect::s__state| (_ bv12292 32)))).def_1602))
(assert (let ((.def_1604 (= |ssl3_connect::blastFlag| (_ bv0 32)))).def_1604))
(assert (let ((.def_678 (= |ssl3_connect::blastFlag| (_ bv5 32)))).def_678))
(assert (let ((.def_3753 (= |ssl3_connect::s__s3__tmp__reuse_message| (_ bv0 32)))).def_3753))
(assert (let ((.def_3755 (= |ssl3_connect::s__state| (_ bv4368 32)))).def_3755))
(assert (let ((.def_3757 (= |ssl3_connect::blastFlag| (_ bv2 32)))).def_3757))
(assert (let ((.def_3759 (= |ssl3_connect::blastFlag| (_ bv3 32)))).def_3759))
(assert (let ((.def_3761 (= |ssl3_connect::blastFlag| (_ bv4 32)))).def_3761))
(assert (let ((.def_3763 (= |ssl3_connect::blastFlag| (_ bv1 32)))).def_3763))
(assert (let ((.def_3766 (= |ssl3_connect::s__hit| (_ bv0 32)))).def_3766))
(assert (let ((.def_3768 (= |ssl3_connect::s__state| (_ bv4433 32)))).def_3768))
(assert (let ((.def_3770 (= |ssl3_connect::s__state| (_ bv4432 32)))).def_3770))
(assert (let ((.def_9677 (= |ssl3_connect::s__state| (_ bv4099 32)))).def_9677))
(assert (let ((.def_9679 (= |ssl3_connect::s__state| (_ bv20480 32)))).def_9679))
(assert (let ((.def_9681 (= |ssl3_connect::s__state| (_ bv4096 32)))).def_9681))
(assert (let ((.def_9683 (= |ssl3_connect::s__state| (_ bv16384 32)))).def_9683))
(assert (let ((.def_9685 (= |ssl3_connect::s__state| (_ bv4369 32)))).def_9685))
(assert (let ((.def_9687 (= |ssl3_connect::s__state| (_ bv4384 32)))).def_9687))
(assert (let ((.def_15532 (= |ssl3_connect::s__s3__tmp__next_state___0| (_ bv12292 32)))).def_15532))
(assert (let ((.def_15534 (= |ssl3_connect::s__s3__tmp__next_state___0| (_ bv4099 32)))).def_15534))
(assert (let ((.def_15536 (= |ssl3_connect::s__s3__tmp__next_state___0| (_ bv20480 32)))).def_15536))
(assert (let ((.def_15538 (= |ssl3_connect::s__s3__tmp__next_state___0| (_ bv4096 32)))).def_15538))
(assert (let ((.def_15540 (= |ssl3_connect::s__state| |ssl3_connect::s__s3__tmp__next_state___0|))).def_15540))
(assert (let ((.def_15542 (= |ssl3_connect::s__state| (_ bv4352 32)))).def_15542))
(assert (let ((.def_15544 (= |ssl3_connect::s__s3__tmp__next_state___0| (_ bv3 32)))).def_15544))
(assert (let ((.def_15546 (= |ssl3_connect::s__s3__tmp__next_state___0| (_ bv16384 32)))).def_15546))
(assert (let ((.def_15548 (= |ssl3_connect::s__s3__tmp__next_state___0| (_ bv4369 32)))).def_15548))
(assert (let ((.def_15550 (= |ssl3_connect::s__s3__tmp__next_state___0| (_ bv4368 32)))).def_15550))
(assert (let ((.def_15552 (= |ssl3_connect::s__state| (_ bv4400 32)))).def_15552))
(assert (let ((.def_15554 (= |ssl3_connect::s__s3__tmp__next_state___0| (_ bv4384 32)))).def_15554))
(assert (let ((.def_15556 (= |ssl3_connect::s__s3__tmp__next_state___0| (_ bv4385 32)))).def_15556))
(assert (let ((.def_15558 (= |ssl3_connect::s__s3__tmp__next_state___0| (_ bv4400 32)))).def_15558))
(assert (let ((.def_15560 (= |ssl3_connect::s__state| (_ bv4528 32)))).def_15560))
(assert (let ((.def_15562 (= |ssl3_connect::s__state| (_ bv4561 32)))).def_15562))
(assert (let ((.def_15564 (= |ssl3_connect::s__state| (_ bv4560 32)))).def_15564))
(assert (let ((.def_15566 (= |ssl3_connect::s__state| (_ bv4416 32)))).def_15566))
(assert (let ((.def_15568 (= |ssl3_connect::s__state| (_ bv4448 32)))).def_15568))
(assert (let ((.def_15570 (= |ssl3_connect::s__state| (_ bv4464 32)))).def_15570))
(assert (let ((.def_15572 (= |ssl3_connect::s__state| (_ bv4480 32)))).def_15572))
(assert (let ((.def_15574 (= |ssl3_connect::s__state| (_ bv4496 32)))).def_15574))
(assert (let ((.def_15576 (= |ssl3_connect::s__state| (_ bv4512 32)))).def_15576))
(assert (let ((.def_15578 (= |ssl3_connect::s__s3__tmp__next_state___0| (_ bv4401 32)))).def_15578))
(assert (let ((.def_15580 (= |ssl3_connect::s__state| (_ bv4385 32)))).def_15580))
(assert (let ((.def_15582 (= |ssl3_connect::s__state| (_ bv4401 32)))).def_15582))
(assert (let ((.def_15584 (= |ssl3_connect::s__state| (_ bv4417 32)))).def_15584))
(assert (let ((.def_15586 (= |ssl3_connect::s__state| (_ bv4529 32)))).def_15586))
(assert (let ((.def_15588 (= |ssl3_connect::s__s3__tmp__next_state___0| (_ bv4417 32)))).def_15588))
(assert (let ((.def_15590 (= |ssl3_connect::s__s3__tmp__next_state___0| (_ bv4416 32)))).def_15590))
(assert (let ((.def_15592 (= |ssl3_connect::s__state| (_ bv4497 32)))).def_15592))
(assert (let ((.def_15594 (= |ssl3_connect::s__state| (_ bv4481 32)))).def_15594))
(assert (let ((.def_15596 (= |ssl3_connect::s__state| (_ bv4467 32)))).def_15596))
(assert (let ((.def_15598 (= |ssl3_connect::s__state| (_ bv4466 32)))).def_15598))
(assert (let ((.def_15600 (= |ssl3_connect::s__state| (_ bv4465 32)))).def_15600))
(assert (let ((.def_15602 (= |ssl3_connect::s__state| (_ bv4449 32)))).def_15602))
(assert (let ((.def_15604 (= |ssl3_connect::s__s3__tmp__next_state___0| (_ bv4433 32)))).def_15604))
(assert (let ((.def_15606 (= |ssl3_connect::s__s3__tmp__next_state___0| (_ bv4432 32)))).def_15606))

ssl3_connect N576:
(assert false)
(assert (let ((.def_678 (= |ssl3_connect::blastFlag| (_ bv5 32)))).def_678))

ssl3_accept N699:
(assert (let ((.def_27939 (= |ssl3_accept::s__state| (_ bv8464 32)))).def_27939))
(assert (let ((.def_29147 (= |ssl3_accept::s__state| (_ bv8482 32)))).def_29147))
(assert (let ((.def_29150 (= |ssl3_accept::blastFlag| (_ bv0 32)))).def_29150))
(assert (let ((.def_29152 (= |ssl3_accept::blastFlag| (_ bv8 32)))).def_29152))
(assert (let ((.def_29154 (= |ssl3_accept::blastFlag| (_ bv5 32)))).def_29154))
(assert (let ((.def_30661 (= |ssl3_accept::s__state| (_ bv8481 32)))).def_30661))
(assert (let ((.def_30663 (= |ssl3_accept::s__state| (_ bv8480 32)))).def_30663))
(assert (let ((.def_30665 (= |ssl3_accept::s__state| (_ bv12292 32)))).def_30665))
(assert (let ((.def_30667 (= |ssl3_accept::s__state| (_ bv16384 32)))).def_30667))
(assert (let ((.def_30669 (= |ssl3_accept::s__state| (_ bv8192 32)))).def_30669))
(assert (let ((.def_30671 (= |ssl3_accept::s__state| (_ bv24576 32)))).def_30671))
(assert (let ((.def_30673 (= |ssl3_accept::s__state| (_ bv8195 32)))).def_30673))
(assert (let ((.def_30675 (= |ssl3_accept::s__state| (_ bv8496 32)))).def_30675))
(assert (let ((.def_30677 (= |ssl3_accept::blastFlag| (_ bv1 32)))).def_30677))
(assert (let ((.def_30679 (= |ssl3_accept::s__state| (_ bv8512 32)))).def_30679))
(assert (let ((.def_32708 (= |ssl3_accept::s__s3__tmp__reuse_message| (_ bv0 32)))).def_32708))
(assert (let ((.def_32710 (= |ssl3_accept::s__state| (_ bv8657 32)))).def_32710))
(assert (let ((.def_32712 (= |ssl3_accept::blastFlag| (_ bv2 32)))).def_32712))
(assert (let ((.def_32714 (= |ssl3_accept::s__state| (_ bv8656 32)))).def_32714))
(assert (let ((.def_32716 (= |ssl3_accept::s__state| (_ bv8641 32)))).def_32716))
(assert (let ((.def_32718 (= |ssl3_accept::s__state| (_ bv8640 32)))).def_32718))
(assert (let ((.def_32720 (= |ssl3_accept::s__state| (_ bv8609 32)))).def_32720))
(assert (let ((.def_32722 (= |ssl3_accept::s__state| (_ bv8608 32)))).def_32722))
(assert (let ((.def_32724 (= |ssl3_accept::s__state| (_ bv8593 32)))).def_32724))
(assert (let ((.def_32726 (= |ssl3_accept::s__state| (_ bv8592 32)))).def_32726))
(assert (let ((.def_32728 (= |ssl3_accept::s__state| (_ bv8577 32)))).def_32728))
(assert (let ((.def_32730 (= |ssl3_accept::s__state| (_ bv8576 32)))).def_32730))
(assert (let ((.def_32732 (= |ssl3_accept::s__state| (_ bv8448 32)))).def_32732))
(assert (let ((.def_32734 (= |ssl3_accept::s__state| (_ bv8560 32)))).def_32734))
(assert (let ((.def_32736 (= |ssl3_accept::s__state| (_ bv8544 32)))).def_32736))
(assert (let ((.def_32738 (= |ssl3_accept::s__state| (_ bv8545 32)))).def_32738))
(assert (let ((.def_32740 (= |ssl3_accept::s__state| (_ bv8466 32)))).def_32740))
(assert (let ((.def_32742 (= |ssl3_accept::s__state| (_ bv8528 32)))).def_32742))
(assert (let ((.def_38927 (= |ssl3_accept::s__state| (_ bv8465 32)))).def_38927))
(assert (let ((.def_38930 (= |ssl3_accept::s__hit| (_ bv0 32)))).def_38930))
(assert (let ((.def_38932 (= |ssl3_accept::blastFlag| (_ bv7 32)))).def_38932))
(assert (let ((.def_38934 (= |ssl3_accept::blastFlag| (_ bv3 32)))).def_38934))
(assert (let ((.def_38936 (= |ssl3_accept::blastFlag| (_ bv6 32)))).def_38936))
(assert (let ((.def_38938 (= |ssl3_accept::blastFlag| (_ bv4 32)))).def_38938))
(assert (let ((.def_38941 (= |ssl3_accept::s__state| |ssl3_accept::s__s3__tmp__next_state___0|))).def_38941))
(assert (let ((.def_38943 (= |ssl3_accept::s__s3__tmp__next_state___0| (_ bv8576 32)))).def_38943))
(assert (let ((.def_38945 (= |ssl3_accept::s__s3__tmp__next_state___0| (_ bv8608 32)))).def_38945))
(assert (let ((.def_38947 (= |ssl3_accept::s__s3__tmp__next_state___0| (_ bv8609 32)))).def_38947))
(assert (let ((.def_38949 (= |ssl3_accept::s__s3__tmp__next_state___0| (_ bv8641 32)))).def_38949))
(assert (let ((.def_38951 (= |ssl3_accept::s__s3__tmp__next_state___0| (_ bv8640 32)))).def_38951))
(assert (let ((.def_38953 (= |ssl3_accept::s__state| (_ bv8497 32)))).def_38953))
(assert (let ((.def_38955 (= |ssl3_accept::s__state| (_ bv8513 32)))).def_38955))
(assert (let ((.def_38957 (= |ssl3_accept::s__state| (_ bv8529 32)))).def_38957))
(assert (let ((.def_67691 (= |ssl3_accept::s__init_buf___0| (_ bv0 32)))).def_67691))
(assert (let ((.def_67693 (= |ssl3_accept::s__state| (_ bv8672 32)))).def_67693))
(assert (let ((.def_67695 (= |ssl3_accept::s__state| (_ bv8561 32)))).def_67695))
(assert (let ((.def_67697 (= |ssl3_accept::s__s3__tmp__next_state___0| (_ bv8593 32)))).def_67697))
(assert (let ((.def_67699 (= |ssl3_accept::s__s3__tmp__next_state___0| (_ bv8592 32)))).def_67699))
(assert (let ((.def_67701 (= |ssl3_accept::s__s3__tmp__next_state___0| (_ bv8577 32)))).def_67701))
(assert (let ((.def_67703 (= |ssl3_accept::s__s3__tmp__next_state___0| (_ bv8545 32)))).def_67703))
(assert (let ((.def_67705 (= |ssl3_accept::s__s3__tmp__next_state___0| (_ bv8544 32)))).def_67705))
(assert (let ((.def_67707 (= |ssl3_accept::s__s3__tmp__next_state___0| (_ bv8529 32)))).def_67707))
(assert (let ((.def_67709 (= |ssl3_accept::s__s3__tmp__next_state___0| (_ bv8528 32)))).def_67709))
(assert (let ((.def_67711 (= |ssl3_accept::s__s3__tmp__next_state___0| (_ bv8513 32)))).def_67711))
(assert (let ((.def_67713 (= |ssl3_accept::s__s3__tmp__next_state___0| (_ bv8512 32)))).def_67713))
(assert (let ((.def_67715 (= |ssl3_accept::s__s3__tmp__next_state___0| (_ bv8497 32)))).def_67715))
(assert (let ((.def_67717 (= |ssl3_accept::s__s3__tmp__next_state___0| (_ bv8466 32)))).def_67717))
(assert (let ((.def_67719 (= |ssl3_accept::s__s3__tmp__next_state___0| (_ bv8465 32)))).def_67719))
(assert (let ((.def_67721 (= |ssl3_accept::s__s3__tmp__next_state___0| (_ bv8464 32)))).def_67721))
(assert (let ((.def_67723 (= |ssl3_accept::s__s3__tmp__next_state___0| (_ bv8482 32)))).def_67723))
(assert (let ((.def_67725 (= |ssl3_accept::s__s3__tmp__next_state___0| (_ bv8481 32)))).def_67725))
(assert (let ((.def_67727 (= |ssl3_accept::s__s3__tmp__next_state___0| (_ bv8480 32)))).def_67727))
(assert (let ((.def_67729 (= |ssl3_accept::s__s3__tmp__next_state___0| (_ bv8448 32)))).def_67729))
(assert (let ((.def_67731 (= |ssl3_accept::s__s3__tmp__next_state___0| (_ bv8561 32)))).def_67731))
(assert (let ((.def_67733 (= |ssl3_accept::s__s3__tmp__next_state___0| (_ bv8560 32)))).def_67733))
(assert (let ((.def_67735 (= |ssl3_accept::s__s3__tmp__next_state___0| (_ bv8656 32)))).def_67735))
(assert (let ((.def_67737 (= |ssl3_accept::s__s3__tmp__next_state___0| (_ bv16384 32)))).def_67737))
(assert (let ((.def_67739 (= |ssl3_accept::s__s3__tmp__next_state___0| (_ bv8192 32)))).def_67739))
(assert (let ((.def_67741 (= |ssl3_accept::s__s3__tmp__next_state___0| (_ bv24576 32)))).def_67741))
(assert (let ((.def_67743 (= |ssl3_accept::s__s3__tmp__next_state___0| (_ bv8195 32)))).def_67743))
(assert (let ((.def_67745 (= |ssl3_accept::s__s3__tmp__next_state___0| (_ bv12292 32)))).def_67745))
(assert (let ((.def_67747 (= |ssl3_accept::s__s3__tmp__next_state___0| (_ bv8496 32)))).def_67747))
(assert (let ((.def_67750 (= |ssl3_accept::s__s3__tmp__new_cipher__algorithms| (_ bv4294967040 32)))).def_67750))
(assert (let ((.def_67753 (= |ssl3_accept::s__verify_mode| (_ bv4294967295 32)))).def_67753))
(assert (let ((.def_67755 (= |ssl3_accept::s__verify_mode| (_ bv4294967292 32)))).def_67755))
(assert (let ((.def_67758 (= |ssl3_accept::s__session__peer| (_ bv0 32)))).def_67758))
(assert (let ((.def_67760 (= |ssl3_accept::s__verify_mode| (_ bv4294967294 32)))).def_67760))
(assert (let ((.def_67762 (= |ssl3_accept::s__s3__tmp__next_state___0| (_ bv3 32)))).def_67762))
(assert (let ((.def_67764 (= |ssl3_accept::s__s3__tmp__next_state___0| (_ bv8672 32)))).def_67764))
(assert (let ((.def_67766 (= |ssl3_accept::s__state| (_ bv8673 32)))).def_67766))

ssl3_accept N1236:
(assert false)

