(set-info :source |printed by MathSAT|)
(declare-fun a20 () (_ BitVec 32))
(declare-fun a25 () (_ BitVec 32))
(declare-fun a12 () (_ BitVec 32))
(declare-fun a15 () (_ BitVec 32))
(declare-fun a16 () (_ BitVec 32))
(declare-fun a2 () (_ BitVec 32))
(declare-fun a27 () (_ BitVec 32))
(declare-fun a9 () (_ BitVec 32))
(declare-fun m_pc () (_ BitVec 32))
(declare-fun t1_pc () (_ BitVec 32))
(declare-fun t2_pc () (_ BitVec 32))
(declare-fun t3_pc () (_ BitVec 32))
(declare-fun t4_pc () (_ BitVec 32))
(declare-fun t5_pc () (_ BitVec 32))
(declare-fun t6_pc () (_ BitVec 32))
(declare-fun t7_pc () (_ BitVec 32))
(declare-fun t8_pc () (_ BitVec 32))
(declare-fun t9_pc () (_ BitVec 32))
(declare-fun t10_pc () (_ BitVec 32))
(declare-fun t11_pc () (_ BitVec 32))
(declare-fun m_st () (_ BitVec 32))
(declare-fun t5_st () (_ BitVec 32))
(declare-fun E_2 () (_ BitVec 32))
(declare-fun E_11 () (_ BitVec 32))
(declare-fun E_8 () (_ BitVec 32))
(declare-fun E_7 () (_ BitVec 32))
(declare-fun E_6 () (_ BitVec 32))
(declare-fun E_4 () (_ BitVec 32))
(declare-fun E_3 () (_ BitVec 32))
(declare-fun E_M () (_ BitVec 32))
(declare-fun t3_st () (_ BitVec 32))
(declare-fun t6_st () (_ BitVec 32))
(declare-fun E_9 () (_ BitVec 32))
(declare-fun E_5 () (_ BitVec 32))
(declare-fun E_10 () (_ BitVec 32))
(declare-fun t1_st () (_ BitVec 32))
(declare-fun t7_st () (_ BitVec 32))
(declare-fun t8_st () (_ BitVec 32))
(declare-fun t2_st () (_ BitVec 32))
(declare-fun t11_st () (_ BitVec 32))
(declare-fun t10_st () (_ BitVec 32))
(declare-fun t9_st () (_ BitVec 32))
(declare-fun t4_st () (_ BitVec 32))
(declare-fun E_1 () (_ BitVec 32))
(declare-fun local () (_ BitVec 32))
(declare-fun token () (_ BitVec 32))

*:
(assert (let ((.def_107351 (= a20 (_ bv5 32)))).def_107351))

calculate_output8 N29965:
(assert false)
(assert (let ((.def_107351 (= a20 (_ bv5 32)))).def_107351))

main1 N30136:
(assert (let ((.def_107351 (= a20 (_ bv5 32)))).def_107351))
(assert (let ((.def_154782 (= a25 (_ bv1 32)))).def_154782))
(assert (let ((.def_154785 (= a12 (_ bv4 32)))).def_154785))
(assert (let ((.def_154788 (= a15 (_ bv1 32)))).def_154788))
(assert (let ((.def_154791 (= a16 (_ bv1 32)))).def_154791))
(assert (let ((.def_154794 (= a2 (_ bv10 32)))).def_154794))
(assert (let ((.def_154797 (= a27 (_ bv1 32)))).def_154797))
(assert (let ((.def_154800 (= a9 (_ bv18 32)))).def_154800))
(assert (let ((.def_320747 (= a9 (_ bv17 32)))).def_320747))
(assert (let ((.def_320749 (= a2 (_ bv12 32)))).def_320749))
(assert (let ((.def_320751 (= a2 (_ bv11 32)))).def_320751))
(assert (let ((.def_320753 (= a2 (_ bv9 32)))).def_320753))
(assert (let ((.def_320755 (= a12 (_ bv3 32)))).def_320755))
(assert (let ((.def_320757 (= a20 (_ bv6 32)))).def_320757))
(assert (let ((.def_320759 (= a2 (_ bv13 32)))).def_320759))
(assert (let ((.def_320761 (= a9 (_ bv16 32)))).def_320761))
(assert (let ((.def_1073528 (= a12 (_ bv2 32)))).def_1073528))
(assert (let ((.def_1073530 (= a12 (_ bv6 32)))).def_1073530))
(assert (let ((.def_1073532 (= a12 (_ bv5 32)))).def_1073532))
(assert (let ((.def_1073534 (= a20 (_ bv7 32)))).def_1073534))

error N30154:
(assert false)
(assert (let ((.def_107351 (= a20 (_ bv5 32)))).def_107351))

eval N30828:
(assert (let ((.def_1215488 (= m_pc (_ bv0 32)))).def_1215488))
(assert (let ((.def_107351 (= a20 (_ bv5 32)))).def_107351))
(assert (let ((.def_1226311 (= t1_pc (_ bv0 32)))).def_1226311))
(assert (let ((.def_1226314 (= t2_pc (_ bv0 32)))).def_1226314))
(assert (let ((.def_1226317 (= t3_pc (_ bv0 32)))).def_1226317))
(assert (let ((.def_1226320 (= t4_pc (_ bv0 32)))).def_1226320))
(assert (let ((.def_1226323 (= t5_pc (_ bv0 32)))).def_1226323))
(assert (let ((.def_1226326 (= t6_pc (_ bv0 32)))).def_1226326))
(assert (let ((.def_1226329 (= t7_pc (_ bv0 32)))).def_1226329))
(assert (let ((.def_1226332 (= t8_pc (_ bv0 32)))).def_1226332))
(assert (let ((.def_1226335 (= t9_pc (_ bv0 32)))).def_1226335))
(assert (let ((.def_1226338 (= t10_pc (_ bv0 32)))).def_1226338))
(assert (let ((.def_1226341 (= t11_pc (_ bv0 32)))).def_1226341))
(assert (let ((.def_1226343 (= m_pc (_ bv1 32)))).def_1226343))
(assert (let ((.def_1226345 (= t1_pc (_ bv1 32)))).def_1226345))
(assert (let ((.def_1226347 (= t2_pc (_ bv1 32)))).def_1226347))
(assert (let ((.def_1226349 (= t3_pc (_ bv1 32)))).def_1226349))
(assert (let ((.def_1226351 (= t4_pc (_ bv1 32)))).def_1226351))
(assert (let ((.def_1226353 (= t5_pc (_ bv1 32)))).def_1226353))
(assert (let ((.def_1226355 (= t6_pc (_ bv1 32)))).def_1226355))
(assert (let ((.def_1226357 (= t7_pc (_ bv1 32)))).def_1226357))
(assert (let ((.def_1226359 (= t8_pc (_ bv1 32)))).def_1226359))
(assert (let ((.def_1226361 (= t9_pc (_ bv1 32)))).def_1226361))
(assert (let ((.def_1226363 (= t10_pc (_ bv1 32)))).def_1226363))
(assert (let ((.def_1226365 (= t11_pc (_ bv1 32)))).def_1226365))
(assert (let ((.def_1226368 (= m_st (_ bv0 32)))).def_1226368))
(assert (let ((.def_1321499 (= t5_st (_ bv0 32)))).def_1321499))
(assert (let ((.def_1321502 (= E_2 (_ bv2 32)))).def_1321502))
(assert (let ((.def_1321505 (= E_11 (_ bv1 32)))).def_1321505))
(assert (let ((.def_1321508 (= E_8 (_ bv1 32)))).def_1321508))
(assert (let ((.def_1321511 (= E_7 (_ bv1 32)))).def_1321511))
(assert (let ((.def_1321514 (= E_6 (_ bv1 32)))).def_1321514))
(assert (let ((.def_1321517 (= E_4 (_ bv1 32)))).def_1321517))
(assert (let ((.def_1321520 (= E_3 (_ bv1 32)))).def_1321520))
(assert (let ((.def_1321522 (= E_2 (_ bv1 32)))).def_1321522))
(assert (let ((.def_1321525 (= E_M (_ bv1 32)))).def_1321525))
(assert (let ((.def_1321528 (= t3_st (_ bv0 32)))).def_1321528))
(assert (let ((.def_1321531 (= t6_st (_ bv0 32)))).def_1321531))
(assert (let ((.def_1321534 (= E_9 (_ bv1 32)))).def_1321534))
(assert (let ((.def_1321537 (= E_5 (_ bv1 32)))).def_1321537))
(assert (let ((.def_1321540 (= E_10 (_ bv1 32)))).def_1321540))
(assert (let ((.def_1321543 (= t1_st (_ bv0 32)))).def_1321543))
(assert (let ((.def_1321546 (= t7_st (_ bv0 32)))).def_1321546))
(assert (let ((.def_1321549 (= t8_st (_ bv0 32)))).def_1321549))
(assert (let ((.def_1321552 (= t2_st (_ bv0 32)))).def_1321552))
(assert (let ((.def_1321555 (= t11_st (_ bv0 32)))).def_1321555))
(assert (let ((.def_1321558 (= t10_st (_ bv0 32)))).def_1321558))
(assert (let ((.def_1321561 (= t9_st (_ bv0 32)))).def_1321561))
(assert (let ((.def_1321564 (= t4_st (_ bv0 32)))).def_1321564))
(assert (let ((.def_1321567 (= E_1 (_ bv1 32)))).def_1321567))
(assert (let ((.def_1321570 (bvadd (_ bv11 32) local)))(let ((.def_1321572 (= .def_1321570 token))).def_1321572)))

start_simulation N31388:
(assert (let ((.def_1215488 (= m_pc (_ bv0 32)))).def_1215488))
(assert (let ((.def_107351 (= a20 (_ bv5 32)))).def_107351))
(assert (let ((.def_1226311 (= t1_pc (_ bv0 32)))).def_1226311))
(assert (let ((.def_1226314 (= t2_pc (_ bv0 32)))).def_1226314))
(assert (let ((.def_1226317 (= t3_pc (_ bv0 32)))).def_1226317))
(assert (let ((.def_1226320 (= t4_pc (_ bv0 32)))).def_1226320))
(assert (let ((.def_1226323 (= t5_pc (_ bv0 32)))).def_1226323))
(assert (let ((.def_1226326 (= t6_pc (_ bv0 32)))).def_1226326))
(assert (let ((.def_1226329 (= t7_pc (_ bv0 32)))).def_1226329))
(assert (let ((.def_1226332 (= t8_pc (_ bv0 32)))).def_1226332))
(assert (let ((.def_1226335 (= t9_pc (_ bv0 32)))).def_1226335))
(assert (let ((.def_1226338 (= t10_pc (_ bv0 32)))).def_1226338))
(assert (let ((.def_1226341 (= t11_pc (_ bv0 32)))).def_1226341))
(assert (let ((.def_1226343 (= m_pc (_ bv1 32)))).def_1226343))
(assert (let ((.def_1226345 (= t1_pc (_ bv1 32)))).def_1226345))
(assert (let ((.def_1226347 (= t2_pc (_ bv1 32)))).def_1226347))
(assert (let ((.def_1226349 (= t3_pc (_ bv1 32)))).def_1226349))
(assert (let ((.def_1226351 (= t4_pc (_ bv1 32)))).def_1226351))
(assert (let ((.def_1226353 (= t5_pc (_ bv1 32)))).def_1226353))
(assert (let ((.def_1226355 (= t6_pc (_ bv1 32)))).def_1226355))
(assert (let ((.def_1226357 (= t7_pc (_ bv1 32)))).def_1226357))
(assert (let ((.def_1226359 (= t8_pc (_ bv1 32)))).def_1226359))
(assert (let ((.def_1226361 (= t9_pc (_ bv1 32)))).def_1226361))
(assert (let ((.def_1226363 (= t10_pc (_ bv1 32)))).def_1226363))
(assert (let ((.def_1226365 (= t11_pc (_ bv1 32)))).def_1226365))
(assert (let ((.def_1321499 (= t5_st (_ bv0 32)))).def_1321499))
(assert (let ((.def_1321502 (= E_2 (_ bv2 32)))).def_1321502))
(assert (let ((.def_1321505 (= E_11 (_ bv1 32)))).def_1321505))
(assert (let ((.def_1321508 (= E_8 (_ bv1 32)))).def_1321508))
(assert (let ((.def_1321511 (= E_7 (_ bv1 32)))).def_1321511))
(assert (let ((.def_1321514 (= E_6 (_ bv1 32)))).def_1321514))
(assert (let ((.def_1321517 (= E_4 (_ bv1 32)))).def_1321517))
(assert (let ((.def_1321520 (= E_3 (_ bv1 32)))).def_1321520))
(assert (let ((.def_1321522 (= E_2 (_ bv1 32)))).def_1321522))
(assert (let ((.def_1321525 (= E_M (_ bv1 32)))).def_1321525))
(assert (let ((.def_1321528 (= t3_st (_ bv0 32)))).def_1321528))
(assert (let ((.def_1321531 (= t6_st (_ bv0 32)))).def_1321531))
(assert (let ((.def_1321534 (= E_9 (_ bv1 32)))).def_1321534))
(assert (let ((.def_1321537 (= E_5 (_ bv1 32)))).def_1321537))
(assert (let ((.def_1321540 (= E_10 (_ bv1 32)))).def_1321540))
(assert (let ((.def_1321543 (= t1_st (_ bv0 32)))).def_1321543))
(assert (let ((.def_1321546 (= t7_st (_ bv0 32)))).def_1321546))
(assert (let ((.def_1321549 (= t8_st (_ bv0 32)))).def_1321549))
(assert (let ((.def_1321552 (= t2_st (_ bv0 32)))).def_1321552))
(assert (let ((.def_1226368 (= m_st (_ bv0 32)))).def_1226368))

