(set-info :source |printed by MathSAT|)
(declare-fun a20 () (_ BitVec 32))
(declare-fun a9 () (_ BitVec 32))
(declare-fun a25 () (_ BitVec 32))
(declare-fun a12 () (_ BitVec 32))
(declare-fun a15 () (_ BitVec 32))
(declare-fun a16 () (_ BitVec 32))
(declare-fun a2 () (_ BitVec 32))
(declare-fun a27 () (_ BitVec 32))

*:
(assert (let ((.def_106147 (= a20 (_ bv5 32)))).def_106147))

calculate_output8 N29679:
(assert false)
(assert (let ((.def_106147 (= a20 (_ bv5 32)))).def_106147))

main1 N30136:
(assert (let ((.def_153060 (= a9 (_ bv18 32)))).def_153060))
(assert (let ((.def_106147 (= a20 (_ bv5 32)))).def_106147))
(assert (let ((.def_339663 (= a25 (_ bv1 32)))).def_339663))
(assert (let ((.def_339666 (= a12 (_ bv4 32)))).def_339666))
(assert (let ((.def_339669 (= a15 (_ bv1 32)))).def_339669))
(assert (let ((.def_339672 (= a16 (_ bv1 32)))).def_339672))
(assert (let ((.def_339675 (= a2 (_ bv10 32)))).def_339675))
(assert (let ((.def_339678 (= a27 (_ bv1 32)))).def_339678))
(assert (let ((.def_339680 (= a2 (_ bv13 32)))).def_339680))
(assert (let ((.def_339682 (= a9 (_ bv17 32)))).def_339682))
(assert (let ((.def_339684 (= a2 (_ bv9 32)))).def_339684))
(assert (let ((.def_339686 (= a2 (_ bv11 32)))).def_339686))
(assert (let ((.def_339688 (= a9 (_ bv16 32)))).def_339688))
(assert (let ((.def_339690 (= a2 (_ bv12 32)))).def_339690))
(assert (let ((.def_895484 (= a20 (_ bv6 32)))).def_895484))
(assert (let ((.def_895486 (= a20 (_ bv7 32)))).def_895486))
(assert (let ((.def_895488 (= a12 (_ bv2 32)))).def_895488))
(assert (let ((.def_895490 (= a12 (_ bv3 32)))).def_895490))
(assert (let ((.def_895492 (= a12 (_ bv5 32)))).def_895492))
(assert (let ((.def_895494 (= a12 (_ bv6 32)))).def_895494))

