(set-info :source |printed by MathSAT|)
(declare-fun a20 () (_ BitVec 32))
(declare-fun a25 () (_ BitVec 32))
(declare-fun a12 () (_ BitVec 32))
(declare-fun a15 () (_ BitVec 32))
(declare-fun a16 () (_ BitVec 32))
(declare-fun a2 () (_ BitVec 32))
(declare-fun a27 () (_ BitVec 32))
(declare-fun a9 () (_ BitVec 32))
(declare-fun m_pc () (_ BitVec 32))
(declare-fun t1_pc () (_ BitVec 32))
(declare-fun t2_pc () (_ BitVec 32))
(declare-fun t3_pc () (_ BitVec 32))
(declare-fun t4_pc () (_ BitVec 32))
(declare-fun t5_pc () (_ BitVec 32))
(declare-fun t6_pc () (_ BitVec 32))
(declare-fun t7_pc () (_ BitVec 32))
(declare-fun t8_pc () (_ BitVec 32))
(declare-fun t9_pc () (_ BitVec 32))
(declare-fun t10_pc () (_ BitVec 32))
(declare-fun t11_pc () (_ BitVec 32))
(declare-fun m_st () (_ BitVec 32))
(declare-fun t5_st () (_ BitVec 32))
(declare-fun E_2 () (_ BitVec 32))
(declare-fun E_11 () (_ BitVec 32))
(declare-fun E_8 () (_ BitVec 32))
(declare-fun E_7 () (_ BitVec 32))
(declare-fun E_6 () (_ BitVec 32))
(declare-fun E_4 () (_ BitVec 32))
(declare-fun E_3 () (_ BitVec 32))
(declare-fun E_M () (_ BitVec 32))
(declare-fun t3_st () (_ BitVec 32))
(declare-fun t6_st () (_ BitVec 32))
(declare-fun E_9 () (_ BitVec 32))
(declare-fun E_5 () (_ BitVec 32))
(declare-fun E_10 () (_ BitVec 32))
(declare-fun t1_st () (_ BitVec 32))
(declare-fun t7_st () (_ BitVec 32))
(declare-fun t8_st () (_ BitVec 32))
(declare-fun t2_st () (_ BitVec 32))
(declare-fun t11_st () (_ BitVec 32))
(declare-fun t10_st () (_ BitVec 32))
(declare-fun t9_st () (_ BitVec 32))
(declare-fun t4_st () (_ BitVec 32))
(declare-fun E_1 () (_ BitVec 32))
(declare-fun local () (_ BitVec 32))
(declare-fun token () (_ BitVec 32))

*:
(assert (let ((.def_107703 (= a20 (_ bv5 32)))).def_107703))

calculate_output8 N30053:
(assert false)
(assert (let ((.def_107703 (= a20 (_ bv5 32)))).def_107703))

main1 N30136:
(assert (let ((.def_107703 (= a20 (_ bv5 32)))).def_107703))
(assert (let ((.def_155305 (= a25 (_ bv1 32)))).def_155305))
(assert (let ((.def_155308 (= a12 (_ bv4 32)))).def_155308))
(assert (let ((.def_155311 (= a15 (_ bv1 32)))).def_155311))
(assert (let ((.def_155314 (= a16 (_ bv1 32)))).def_155314))
(assert (let ((.def_155317 (= a2 (_ bv10 32)))).def_155317))
(assert (let ((.def_155320 (= a27 (_ bv1 32)))).def_155320))
(assert (let ((.def_155323 (= a9 (_ bv18 32)))).def_155323))
(assert (let ((.def_321488 (= a20 (_ bv6 32)))).def_321488))
(assert (let ((.def_321490 (= a12 (_ bv3 32)))).def_321490))
(assert (let ((.def_321492 (= a12 (_ bv6 32)))).def_321492))
(assert (let ((.def_321494 (= a2 (_ bv9 32)))).def_321494))
(assert (let ((.def_321496 (= a9 (_ bv16 32)))).def_321496))
(assert (let ((.def_321498 (= a2 (_ bv12 32)))).def_321498))
(assert (let ((.def_321500 (= a2 (_ bv11 32)))).def_321500))
(assert (let ((.def_321502 (= a9 (_ bv17 32)))).def_321502))
(assert (let ((.def_321504 (= a12 (_ bv2 32)))).def_321504))
(assert (let ((.def_321506 (= a2 (_ bv13 32)))).def_321506))

error N30154:
(assert false)
(assert (let ((.def_107703 (= a20 (_ bv5 32)))).def_107703))

eval N30828:
(assert (let ((.def_747657 (= m_pc (_ bv0 32)))).def_747657))
(assert (let ((.def_107703 (= a20 (_ bv5 32)))).def_107703))
(assert (let ((.def_758481 (= t1_pc (_ bv0 32)))).def_758481))
(assert (let ((.def_758484 (= t2_pc (_ bv0 32)))).def_758484))
(assert (let ((.def_758487 (= t3_pc (_ bv0 32)))).def_758487))
(assert (let ((.def_758490 (= t4_pc (_ bv0 32)))).def_758490))
(assert (let ((.def_758493 (= t5_pc (_ bv0 32)))).def_758493))
(assert (let ((.def_758496 (= t6_pc (_ bv0 32)))).def_758496))
(assert (let ((.def_758499 (= t7_pc (_ bv0 32)))).def_758499))
(assert (let ((.def_758502 (= t8_pc (_ bv0 32)))).def_758502))
(assert (let ((.def_758505 (= t9_pc (_ bv0 32)))).def_758505))
(assert (let ((.def_758508 (= t10_pc (_ bv0 32)))).def_758508))
(assert (let ((.def_758511 (= t11_pc (_ bv0 32)))).def_758511))
(assert (let ((.def_758513 (= m_pc (_ bv1 32)))).def_758513))
(assert (let ((.def_758515 (= t1_pc (_ bv1 32)))).def_758515))
(assert (let ((.def_758517 (= t2_pc (_ bv1 32)))).def_758517))
(assert (let ((.def_758519 (= t3_pc (_ bv1 32)))).def_758519))
(assert (let ((.def_758521 (= t4_pc (_ bv1 32)))).def_758521))
(assert (let ((.def_758523 (= t5_pc (_ bv1 32)))).def_758523))
(assert (let ((.def_758525 (= t6_pc (_ bv1 32)))).def_758525))
(assert (let ((.def_758527 (= t7_pc (_ bv1 32)))).def_758527))
(assert (let ((.def_758529 (= t8_pc (_ bv1 32)))).def_758529))
(assert (let ((.def_758531 (= t9_pc (_ bv1 32)))).def_758531))
(assert (let ((.def_758533 (= t10_pc (_ bv1 32)))).def_758533))
(assert (let ((.def_758535 (= t11_pc (_ bv1 32)))).def_758535))
(assert (let ((.def_758538 (= m_st (_ bv0 32)))).def_758538))
(assert (let ((.def_853669 (= t5_st (_ bv0 32)))).def_853669))
(assert (let ((.def_853672 (= E_2 (_ bv2 32)))).def_853672))
(assert (let ((.def_853675 (= E_11 (_ bv1 32)))).def_853675))
(assert (let ((.def_853678 (= E_8 (_ bv1 32)))).def_853678))
(assert (let ((.def_853681 (= E_7 (_ bv1 32)))).def_853681))
(assert (let ((.def_853684 (= E_6 (_ bv1 32)))).def_853684))
(assert (let ((.def_853687 (= E_4 (_ bv1 32)))).def_853687))
(assert (let ((.def_853690 (= E_3 (_ bv1 32)))).def_853690))
(assert (let ((.def_853692 (= E_2 (_ bv1 32)))).def_853692))
(assert (let ((.def_853695 (= E_M (_ bv1 32)))).def_853695))
(assert (let ((.def_853698 (= t3_st (_ bv0 32)))).def_853698))
(assert (let ((.def_853701 (= t6_st (_ bv0 32)))).def_853701))
(assert (let ((.def_853704 (= E_9 (_ bv1 32)))).def_853704))
(assert (let ((.def_853707 (= E_5 (_ bv1 32)))).def_853707))
(assert (let ((.def_853710 (= E_10 (_ bv1 32)))).def_853710))
(assert (let ((.def_853713 (= t1_st (_ bv0 32)))).def_853713))
(assert (let ((.def_853716 (= t7_st (_ bv0 32)))).def_853716))
(assert (let ((.def_853719 (= t8_st (_ bv0 32)))).def_853719))
(assert (let ((.def_853722 (= t2_st (_ bv0 32)))).def_853722))
(assert (let ((.def_853725 (= t11_st (_ bv0 32)))).def_853725))
(assert (let ((.def_853728 (= t10_st (_ bv0 32)))).def_853728))
(assert (let ((.def_853731 (= t9_st (_ bv0 32)))).def_853731))
(assert (let ((.def_853734 (= t4_st (_ bv0 32)))).def_853734))
(assert (let ((.def_853737 (= E_1 (_ bv1 32)))).def_853737))
(assert (let ((.def_853740 (bvadd (_ bv11 32) local)))(let ((.def_853742 (= .def_853740 token))).def_853742)))

start_simulation N31388:
(assert (let ((.def_747657 (= m_pc (_ bv0 32)))).def_747657))
(assert (let ((.def_107703 (= a20 (_ bv5 32)))).def_107703))
(assert (let ((.def_758481 (= t1_pc (_ bv0 32)))).def_758481))
(assert (let ((.def_758484 (= t2_pc (_ bv0 32)))).def_758484))
(assert (let ((.def_758487 (= t3_pc (_ bv0 32)))).def_758487))
(assert (let ((.def_758490 (= t4_pc (_ bv0 32)))).def_758490))
(assert (let ((.def_758493 (= t5_pc (_ bv0 32)))).def_758493))
(assert (let ((.def_758496 (= t6_pc (_ bv0 32)))).def_758496))
(assert (let ((.def_758499 (= t7_pc (_ bv0 32)))).def_758499))
(assert (let ((.def_758502 (= t8_pc (_ bv0 32)))).def_758502))
(assert (let ((.def_758505 (= t9_pc (_ bv0 32)))).def_758505))
(assert (let ((.def_758508 (= t10_pc (_ bv0 32)))).def_758508))
(assert (let ((.def_758511 (= t11_pc (_ bv0 32)))).def_758511))
(assert (let ((.def_758513 (= m_pc (_ bv1 32)))).def_758513))
(assert (let ((.def_758515 (= t1_pc (_ bv1 32)))).def_758515))
(assert (let ((.def_758517 (= t2_pc (_ bv1 32)))).def_758517))
(assert (let ((.def_758519 (= t3_pc (_ bv1 32)))).def_758519))
(assert (let ((.def_758521 (= t4_pc (_ bv1 32)))).def_758521))
(assert (let ((.def_758523 (= t5_pc (_ bv1 32)))).def_758523))
(assert (let ((.def_758525 (= t6_pc (_ bv1 32)))).def_758525))
(assert (let ((.def_758527 (= t7_pc (_ bv1 32)))).def_758527))
(assert (let ((.def_758529 (= t8_pc (_ bv1 32)))).def_758529))
(assert (let ((.def_758531 (= t9_pc (_ bv1 32)))).def_758531))
(assert (let ((.def_758533 (= t10_pc (_ bv1 32)))).def_758533))
(assert (let ((.def_758535 (= t11_pc (_ bv1 32)))).def_758535))
(assert (let ((.def_853669 (= t5_st (_ bv0 32)))).def_853669))
(assert (let ((.def_853672 (= E_2 (_ bv2 32)))).def_853672))
(assert (let ((.def_853675 (= E_11 (_ bv1 32)))).def_853675))
(assert (let ((.def_853678 (= E_8 (_ bv1 32)))).def_853678))
(assert (let ((.def_853681 (= E_7 (_ bv1 32)))).def_853681))
(assert (let ((.def_853684 (= E_6 (_ bv1 32)))).def_853684))
(assert (let ((.def_853687 (= E_4 (_ bv1 32)))).def_853687))
(assert (let ((.def_853690 (= E_3 (_ bv1 32)))).def_853690))
(assert (let ((.def_853692 (= E_2 (_ bv1 32)))).def_853692))
(assert (let ((.def_853695 (= E_M (_ bv1 32)))).def_853695))
(assert (let ((.def_853698 (= t3_st (_ bv0 32)))).def_853698))
(assert (let ((.def_853701 (= t6_st (_ bv0 32)))).def_853701))
(assert (let ((.def_853704 (= E_9 (_ bv1 32)))).def_853704))
(assert (let ((.def_853707 (= E_5 (_ bv1 32)))).def_853707))
(assert (let ((.def_853710 (= E_10 (_ bv1 32)))).def_853710))
(assert (let ((.def_853713 (= t1_st (_ bv0 32)))).def_853713))
(assert (let ((.def_853716 (= t7_st (_ bv0 32)))).def_853716))
(assert (let ((.def_853719 (= t8_st (_ bv0 32)))).def_853719))
(assert (let ((.def_853722 (= t2_st (_ bv0 32)))).def_853722))
(assert (let ((.def_758538 (= m_st (_ bv0 32)))).def_758538))

