(set-info :source |printed by MathSAT|)
(declare-fun c_num_read () (_ BitVec 32))
(declare-fun p_num_write () (_ BitVec 32))
(declare-fun c_last_read () (_ BitVec 32))
(declare-fun p_last_write () (_ BitVec 32))
(declare-fun c_dr_pc () (_ BitVec 32))
(declare-fun c_dr_st () (_ BitVec 32))
(declare-fun m_pc () (_ BitVec 32))
(declare-fun t1_pc () (_ BitVec 32))
(declare-fun t2_pc () (_ BitVec 32))
(declare-fun t3_pc () (_ BitVec 32))
(declare-fun t4_pc () (_ BitVec 32))
(declare-fun t5_pc () (_ BitVec 32))
(declare-fun t6_pc () (_ BitVec 32))
(declare-fun t7_pc () (_ BitVec 32))
(declare-fun t8_pc () (_ BitVec 32))
(declare-fun t9_pc () (_ BitVec 32))
(declare-fun t10_pc () (_ BitVec 32))
(declare-fun t11_pc () (_ BitVec 32))
(declare-fun t12_pc () (_ BitVec 32))
(declare-fun m_st () (_ BitVec 32))

*:
(assert (let ((.def_797 (= c_num_read p_num_write))).def_797))
(assert (let ((.def_806 (= c_last_read p_last_write))).def_806))

error1 N4:
(assert false)
(assert (let ((.def_797 (= c_num_read p_num_write))).def_797))
(assert (let ((.def_806 (= c_last_read p_last_write))).def_806))

eval1 N282:
(assert (let ((.def_957 (= c_dr_pc (_ bv0 32)))).def_957))
(assert (let ((.def_797 (= c_num_read p_num_write))).def_797))
(assert (let ((.def_806 (= c_last_read p_last_write))).def_806))
(assert (let ((.def_1448 (= c_dr_pc (_ bv2 32)))).def_1448))
(assert (let ((.def_1451 (= c_dr_st (_ bv0 32)))).def_1451))

start_simulation1 N338:
(assert (let ((.def_957 (= c_dr_pc (_ bv0 32)))).def_957))
(assert (let ((.def_797 (= c_num_read p_num_write))).def_797))
(assert (let ((.def_806 (= c_last_read p_last_write))).def_806))
(assert (let ((.def_1448 (= c_dr_pc (_ bv2 32)))).def_1448))

error2 N393:
(assert false)
(assert (let ((.def_797 (= c_num_read p_num_write))).def_797))
(assert (let ((.def_806 (= c_last_read p_last_write))).def_806))

eval2 N1130:
(assert (let ((.def_5428 (= m_pc (_ bv0 32)))).def_5428))
(assert (let ((.def_797 (= c_num_read p_num_write))).def_797))
(assert (let ((.def_806 (= c_last_read p_last_write))).def_806))
(assert (let ((.def_18019 (= t1_pc (_ bv0 32)))).def_18019))
(assert (let ((.def_18022 (= t2_pc (_ bv0 32)))).def_18022))
(assert (let ((.def_18025 (= t3_pc (_ bv0 32)))).def_18025))
(assert (let ((.def_18028 (= t4_pc (_ bv0 32)))).def_18028))
(assert (let ((.def_18031 (= t5_pc (_ bv0 32)))).def_18031))
(assert (let ((.def_18034 (= t6_pc (_ bv0 32)))).def_18034))
(assert (let ((.def_18037 (= t7_pc (_ bv0 32)))).def_18037))
(assert (let ((.def_18040 (= t8_pc (_ bv0 32)))).def_18040))
(assert (let ((.def_18043 (= t9_pc (_ bv0 32)))).def_18043))
(assert (let ((.def_18046 (= t10_pc (_ bv0 32)))).def_18046))
(assert (let ((.def_18049 (= t11_pc (_ bv0 32)))).def_18049))
(assert (let ((.def_18052 (= t12_pc (_ bv0 32)))).def_18052))
(assert (let ((.def_18054 (= m_pc (_ bv1 32)))).def_18054))
(assert (let ((.def_18056 (= t1_pc (_ bv1 32)))).def_18056))
(assert (let ((.def_18058 (= t2_pc (_ bv1 32)))).def_18058))
(assert (let ((.def_18060 (= t3_pc (_ bv1 32)))).def_18060))
(assert (let ((.def_18062 (= t4_pc (_ bv1 32)))).def_18062))
(assert (let ((.def_18064 (= t5_pc (_ bv1 32)))).def_18064))
(assert (let ((.def_18066 (= t6_pc (_ bv1 32)))).def_18066))
(assert (let ((.def_18068 (= t7_pc (_ bv1 32)))).def_18068))
(assert (let ((.def_18070 (= t8_pc (_ bv1 32)))).def_18070))
(assert (let ((.def_18072 (= t9_pc (_ bv1 32)))).def_18072))
(assert (let ((.def_18074 (= t10_pc (_ bv1 32)))).def_18074))
(assert (let ((.def_18076 (= t11_pc (_ bv1 32)))).def_18076))
(assert (let ((.def_18078 (= t12_pc (_ bv1 32)))).def_18078))
(assert (let ((.def_18081 (= m_st (_ bv0 32)))).def_18081))

start_simulation2 N1731:
(assert (let ((.def_5428 (= m_pc (_ bv0 32)))).def_5428))
(assert (let ((.def_797 (= c_num_read p_num_write))).def_797))
(assert (let ((.def_806 (= c_last_read p_last_write))).def_806))
(assert (let ((.def_18019 (= t1_pc (_ bv0 32)))).def_18019))
(assert (let ((.def_18022 (= t2_pc (_ bv0 32)))).def_18022))
(assert (let ((.def_18025 (= t3_pc (_ bv0 32)))).def_18025))
(assert (let ((.def_18028 (= t4_pc (_ bv0 32)))).def_18028))
(assert (let ((.def_18031 (= t5_pc (_ bv0 32)))).def_18031))
(assert (let ((.def_18034 (= t6_pc (_ bv0 32)))).def_18034))
(assert (let ((.def_18037 (= t7_pc (_ bv0 32)))).def_18037))
(assert (let ((.def_18040 (= t8_pc (_ bv0 32)))).def_18040))
(assert (let ((.def_18043 (= t9_pc (_ bv0 32)))).def_18043))
(assert (let ((.def_18046 (= t10_pc (_ bv0 32)))).def_18046))
(assert (let ((.def_18049 (= t11_pc (_ bv0 32)))).def_18049))
(assert (let ((.def_18052 (= t12_pc (_ bv0 32)))).def_18052))
(assert (let ((.def_18054 (= m_pc (_ bv1 32)))).def_18054))
(assert (let ((.def_18056 (= t1_pc (_ bv1 32)))).def_18056))
(assert (let ((.def_18058 (= t2_pc (_ bv1 32)))).def_18058))
(assert (let ((.def_18060 (= t3_pc (_ bv1 32)))).def_18060))
(assert (let ((.def_18062 (= t4_pc (_ bv1 32)))).def_18062))
(assert (let ((.def_18064 (= t5_pc (_ bv1 32)))).def_18064))
(assert (let ((.def_18066 (= t6_pc (_ bv1 32)))).def_18066))
(assert (let ((.def_18068 (= t7_pc (_ bv1 32)))).def_18068))
(assert (let ((.def_18070 (= t8_pc (_ bv1 32)))).def_18070))
(assert (let ((.def_18072 (= t9_pc (_ bv1 32)))).def_18072))
(assert (let ((.def_18074 (= t10_pc (_ bv1 32)))).def_18074))
(assert (let ((.def_18076 (= t11_pc (_ bv1 32)))).def_18076))
(assert (let ((.def_18078 (= t12_pc (_ bv1 32)))).def_18078))

