(set-info :source |printed by MathSAT|)
(declare-fun a20 () (_ BitVec 32))
(declare-fun a25 () (_ BitVec 32))
(declare-fun a12 () (_ BitVec 32))
(declare-fun a15 () (_ BitVec 32))
(declare-fun a16 () (_ BitVec 32))
(declare-fun a2 () (_ BitVec 32))
(declare-fun a27 () (_ BitVec 32))
(declare-fun a9 () (_ BitVec 32))
(declare-fun m_pc () (_ BitVec 32))
(declare-fun t1_pc () (_ BitVec 32))
(declare-fun t2_pc () (_ BitVec 32))
(declare-fun t3_pc () (_ BitVec 32))
(declare-fun t4_pc () (_ BitVec 32))
(declare-fun t5_pc () (_ BitVec 32))
(declare-fun t6_pc () (_ BitVec 32))
(declare-fun t7_pc () (_ BitVec 32))
(declare-fun t8_pc () (_ BitVec 32))
(declare-fun t9_pc () (_ BitVec 32))
(declare-fun t10_pc () (_ BitVec 32))
(declare-fun t11_pc () (_ BitVec 32))
(declare-fun t12_pc () (_ BitVec 32))
(declare-fun t13_pc () (_ BitVec 32))
(declare-fun m_st () (_ BitVec 32))

*:
(assert (let ((.def_107293 (= a20 (_ bv5 32)))).def_107293))

calculate_output8 N29943:
(assert false)
(assert (let ((.def_107293 (= a20 (_ bv5 32)))).def_107293))

main1 N30136:
(assert (let ((.def_107293 (= a20 (_ bv5 32)))).def_107293))
(assert (let ((.def_154695 (= a25 (_ bv1 32)))).def_154695))
(assert (let ((.def_154698 (= a12 (_ bv4 32)))).def_154698))
(assert (let ((.def_154701 (= a15 (_ bv1 32)))).def_154701))
(assert (let ((.def_154704 (= a16 (_ bv1 32)))).def_154704))
(assert (let ((.def_154707 (= a2 (_ bv10 32)))).def_154707))
(assert (let ((.def_154710 (= a27 (_ bv1 32)))).def_154710))
(assert (let ((.def_154713 (= a9 (_ bv18 32)))).def_154713))
(assert (let ((.def_585165 (= a12 (_ bv6 32)))).def_585165))
(assert (let ((.def_585167 (= a12 (_ bv5 32)))).def_585167))
(assert (let ((.def_585169 (= a12 (_ bv3 32)))).def_585169))
(assert (let ((.def_585171 (= a20 (_ bv7 32)))).def_585171))
(assert (let ((.def_585173 (= a20 (_ bv6 32)))).def_585173))
(assert (let ((.def_585175 (= a9 (_ bv17 32)))).def_585175))
(assert (let ((.def_585177 (= a2 (_ bv13 32)))).def_585177))
(assert (let ((.def_585179 (= a2 (_ bv12 32)))).def_585179))
(assert (let ((.def_585181 (= a2 (_ bv9 32)))).def_585181))
(assert (let ((.def_585183 (= a12 (_ bv2 32)))).def_585183))
(assert (let ((.def_585185 (= a2 (_ bv11 32)))).def_585185))
(assert (let ((.def_585187 (= a9 (_ bv16 32)))).def_585187))

error N30154:
(assert false)
(assert (let ((.def_107293 (= a20 (_ bv5 32)))).def_107293))

eval N30949:
(assert (let ((.def_922807 (= m_pc (_ bv0 32)))).def_922807))
(assert (let ((.def_107293 (= a20 (_ bv5 32)))).def_107293))
(assert (let ((.def_937249 (= t1_pc (_ bv0 32)))).def_937249))
(assert (let ((.def_937252 (= t2_pc (_ bv0 32)))).def_937252))
(assert (let ((.def_937255 (= t3_pc (_ bv0 32)))).def_937255))
(assert (let ((.def_937258 (= t4_pc (_ bv0 32)))).def_937258))
(assert (let ((.def_937261 (= t5_pc (_ bv0 32)))).def_937261))
(assert (let ((.def_937264 (= t6_pc (_ bv0 32)))).def_937264))
(assert (let ((.def_937267 (= t7_pc (_ bv0 32)))).def_937267))
(assert (let ((.def_937270 (= t8_pc (_ bv0 32)))).def_937270))
(assert (let ((.def_937273 (= t9_pc (_ bv0 32)))).def_937273))
(assert (let ((.def_937276 (= t10_pc (_ bv0 32)))).def_937276))
(assert (let ((.def_937279 (= t11_pc (_ bv0 32)))).def_937279))
(assert (let ((.def_937282 (= t12_pc (_ bv0 32)))).def_937282))
(assert (let ((.def_937285 (= t13_pc (_ bv0 32)))).def_937285))
(assert (let ((.def_937287 (= m_pc (_ bv1 32)))).def_937287))
(assert (let ((.def_937289 (= t1_pc (_ bv1 32)))).def_937289))
(assert (let ((.def_937291 (= t2_pc (_ bv1 32)))).def_937291))
(assert (let ((.def_937293 (= t3_pc (_ bv1 32)))).def_937293))
(assert (let ((.def_937295 (= t4_pc (_ bv1 32)))).def_937295))
(assert (let ((.def_937297 (= t5_pc (_ bv1 32)))).def_937297))
(assert (let ((.def_937299 (= t6_pc (_ bv1 32)))).def_937299))
(assert (let ((.def_937301 (= t7_pc (_ bv1 32)))).def_937301))
(assert (let ((.def_937303 (= t8_pc (_ bv1 32)))).def_937303))
(assert (let ((.def_937305 (= t9_pc (_ bv1 32)))).def_937305))
(assert (let ((.def_937307 (= t10_pc (_ bv1 32)))).def_937307))
(assert (let ((.def_937309 (= t11_pc (_ bv1 32)))).def_937309))
(assert (let ((.def_937311 (= t12_pc (_ bv1 32)))).def_937311))
(assert (let ((.def_937313 (= t13_pc (_ bv1 32)))).def_937313))
(assert (let ((.def_937316 (= m_st (_ bv0 32)))).def_937316))

start_simulation N31591:
(assert (let ((.def_922807 (= m_pc (_ bv0 32)))).def_922807))
(assert (let ((.def_107293 (= a20 (_ bv5 32)))).def_107293))
(assert (let ((.def_937249 (= t1_pc (_ bv0 32)))).def_937249))
(assert (let ((.def_937252 (= t2_pc (_ bv0 32)))).def_937252))
(assert (let ((.def_937255 (= t3_pc (_ bv0 32)))).def_937255))
(assert (let ((.def_937258 (= t4_pc (_ bv0 32)))).def_937258))
(assert (let ((.def_937261 (= t5_pc (_ bv0 32)))).def_937261))
(assert (let ((.def_937264 (= t6_pc (_ bv0 32)))).def_937264))
(assert (let ((.def_937267 (= t7_pc (_ bv0 32)))).def_937267))
(assert (let ((.def_937270 (= t8_pc (_ bv0 32)))).def_937270))
(assert (let ((.def_937273 (= t9_pc (_ bv0 32)))).def_937273))
(assert (let ((.def_937276 (= t10_pc (_ bv0 32)))).def_937276))
(assert (let ((.def_937279 (= t11_pc (_ bv0 32)))).def_937279))
(assert (let ((.def_937282 (= t12_pc (_ bv0 32)))).def_937282))
(assert (let ((.def_937285 (= t13_pc (_ bv0 32)))).def_937285))
(assert (let ((.def_937287 (= m_pc (_ bv1 32)))).def_937287))
(assert (let ((.def_937289 (= t1_pc (_ bv1 32)))).def_937289))
(assert (let ((.def_937291 (= t2_pc (_ bv1 32)))).def_937291))
(assert (let ((.def_937293 (= t3_pc (_ bv1 32)))).def_937293))
(assert (let ((.def_937295 (= t4_pc (_ bv1 32)))).def_937295))
(assert (let ((.def_937297 (= t5_pc (_ bv1 32)))).def_937297))
(assert (let ((.def_937299 (= t6_pc (_ bv1 32)))).def_937299))
(assert (let ((.def_937301 (= t7_pc (_ bv1 32)))).def_937301))
(assert (let ((.def_937303 (= t8_pc (_ bv1 32)))).def_937303))
(assert (let ((.def_937305 (= t9_pc (_ bv1 32)))).def_937305))
(assert (let ((.def_937307 (= t10_pc (_ bv1 32)))).def_937307))
(assert (let ((.def_937309 (= t11_pc (_ bv1 32)))).def_937309))
(assert (let ((.def_937311 (= t12_pc (_ bv1 32)))).def_937311))
(assert (let ((.def_937313 (= t13_pc (_ bv1 32)))).def_937313))

