(set-info :source |printed by MathSAT|)
(declare-fun a20 () (_ BitVec 32))
(declare-fun a9 () (_ BitVec 32))
(declare-fun a25 () (_ BitVec 32))
(declare-fun a12 () (_ BitVec 32))
(declare-fun a15 () (_ BitVec 32))
(declare-fun a16 () (_ BitVec 32))
(declare-fun a2 () (_ BitVec 32))
(declare-fun a27 () (_ BitVec 32))
(declare-fun |calculate_output2::input| () (_ BitVec 32))
(declare-fun |calculate_output3::input| () (_ BitVec 32))
(declare-fun |calculate_output5::input| () (_ BitVec 32))
(declare-fun |calculate_output4::input| () (_ BitVec 32))
(declare-fun |calculate_output8::input| () (_ BitVec 32))

*:
(assert (let ((.def_106160 (= a20 (_ bv5 32)))).def_106160))

calculate_output8 N29701:
(assert false)
(assert (let ((.def_106160 (= a20 (_ bv5 32)))).def_106160))

main1 N30136:
(assert (let ((.def_152994 (= a9 (_ bv18 32)))).def_152994))
(assert (let ((.def_106160 (= a20 (_ bv5 32)))).def_106160))
(assert (let ((.def_339693 (= a25 (_ bv1 32)))).def_339693))
(assert (let ((.def_339696 (= a12 (_ bv4 32)))).def_339696))
(assert (let ((.def_339699 (= a15 (_ bv1 32)))).def_339699))
(assert (let ((.def_339702 (= a16 (_ bv1 32)))).def_339702))
(assert (let ((.def_339705 (= a2 (_ bv10 32)))).def_339705))
(assert (let ((.def_339708 (= a27 (_ bv1 32)))).def_339708))
(assert (let ((.def_339710 (= a20 (_ bv6 32)))).def_339710))
(assert (let ((.def_339712 (= a2 (_ bv13 32)))).def_339712))
(assert (let ((.def_339714 (= a12 (_ bv2 32)))).def_339714))
(assert (let ((.def_339716 (= a2 (_ bv12 32)))).def_339716))
(assert (let ((.def_339718 (= a2 (_ bv11 32)))).def_339718))
(assert (let ((.def_339720 (= a9 (_ bv16 32)))).def_339720))
(assert (let ((.def_339722 (= a9 (_ bv17 32)))).def_339722))
(assert (let ((.def_1065598 (= a2 (_ bv9 32)))).def_1065598))
(assert (let ((.def_1065600 (= a12 (_ bv3 32)))).def_1065600))
(assert (let ((.def_1065602 (= a20 (_ bv7 32)))).def_1065602))
(assert (let ((.def_1065604 (= a12 (_ bv6 32)))).def_1065604))
(assert (let ((.def_1065606 (= a12 (_ bv5 32)))).def_1065606))
(assert (let ((.def_1065609 (= |calculate_output2::input| (_ bv3 32)))).def_1065609))
(assert (let ((.def_1065611 (= |calculate_output2::input| (_ bv2 32)))).def_1065611))
(assert (let ((.def_1065614 (= |calculate_output3::input| (_ bv2 32)))).def_1065614))
(assert (let ((.def_1065616 (= |calculate_output3::input| (_ bv3 32)))).def_1065616))
(assert (let ((.def_1065618 (= |calculate_output2::input| |calculate_output3::input|))).def_1065618))
(assert (let ((.def_1065620 (= |calculate_output3::input| (_ bv1 32)))).def_1065620))
(assert (let ((.def_1065623 (= |calculate_output3::input| |calculate_output5::input|))).def_1065623))
(assert (let ((.def_1065626 (= |calculate_output4::input| (_ bv1 32)))).def_1065626))
(assert (let ((.def_1065628 (= |calculate_output3::input| |calculate_output4::input|))).def_1065628))
(assert (let ((.def_1065630 (= |calculate_output3::input| (_ bv5 32)))).def_1065630))
(assert (let ((.def_1065632 (= |calculate_output4::input| (_ bv5 32)))).def_1065632))
(assert (let ((.def_1065634 (= |calculate_output5::input| (_ bv2 32)))).def_1065634))
(assert (let ((.def_1065637 (= |calculate_output8::input| (_ bv1 32)))).def_1065637))

