(set-info :source |printed by MathSAT|)
(declare-fun a20 () (_ BitVec 32))
(declare-fun a2 () (_ BitVec 32))
(declare-fun a27 () (_ BitVec 32))
(declare-fun a16 () (_ BitVec 32))
(declare-fun a15 () (_ BitVec 32))
(declare-fun a12 () (_ BitVec 32))
(declare-fun a25 () (_ BitVec 32))
(declare-fun a9 () (_ BitVec 32))

*:
(assert (let ((.def_106293 (= a20 (_ bv5 32)))).def_106293))

calculate_output8 N29723:
(assert false)
(assert (let ((.def_106293 (= a20 (_ bv5 32)))).def_106293))

main1 N30136:
(assert (let ((.def_153265 (= a2 (_ bv10 32)))).def_153265))
(assert (let ((.def_153268 (= a27 (_ bv1 32)))).def_153268))
(assert (let ((.def_153271 (= a16 (_ bv1 32)))).def_153271))
(assert (let ((.def_153274 (= a15 (_ bv1 32)))).def_153274))
(assert (let ((.def_153277 (= a12 (_ bv4 32)))).def_153277))
(assert (let ((.def_153280 (= a25 (_ bv1 32)))).def_153280))
(assert (let ((.def_106293 (= a20 (_ bv5 32)))).def_106293))
(assert (let ((.def_321256 (= a9 (_ bv18 32)))).def_321256))
(assert (let ((.def_321258 (= a20 (_ bv6 32)))).def_321258))
(assert (let ((.def_321260 (= a12 (_ bv3 32)))).def_321260))
(assert (let ((.def_321262 (= a2 (_ bv13 32)))).def_321262))
(assert (let ((.def_321264 (= a2 (_ bv9 32)))).def_321264))
(assert (let ((.def_321266 (= a12 (_ bv2 32)))).def_321266))
(assert (let ((.def_321268 (= a2 (_ bv11 32)))).def_321268))
(assert (let ((.def_321270 (= a9 (_ bv16 32)))).def_321270))
(assert (let ((.def_321272 (= a9 (_ bv17 32)))).def_321272))

