(set-info :source |printed by MathSAT|)
(declare-fun |ssl3_connect::blastFlag| () (_ BitVec 32))
(declare-fun |ssl3_connect::s__state| () (_ BitVec 32))
(declare-fun |ssl3_connect::cb| () (_ BitVec 32))
(declare-fun |ssl3_connect::skip| () (_ BitVec 32))
(declare-fun |ssl3_connect::s__s3__tmp__reuse_message| () (_ BitVec 32))
(declare-fun |ssl3_connect::s__s3__tmp__next_state___0| () (_ BitVec 32))
(declare-fun |ssl3_connect::s__hit| () (_ BitVec 32))
(declare-fun |ssl3_connect::s__s3__tmp__cert_req| () (_ BitVec 32))
(declare-fun |ssl3_accept::blastFlag| () (_ BitVec 32))
(declare-fun |ssl3_accept::s__state| () (_ BitVec 32))
(declare-fun |ssl3_accept::s__s3__tmp__next_state___0| () (_ BitVec 32))
(declare-fun |ssl3_accept::skip| () (_ BitVec 32))
(declare-fun |ssl3_accept::s__hit| () (_ BitVec 32))
(declare-fun |ssl3_accept::s__s3__tmp__reuse_message| () (_ BitVec 32))

ssl3_connect:
(assert (let ((.def_698 (= |ssl3_connect::blastFlag| (_ bv5 32)))).def_698))

ssl3_connect N116:
(assert (let ((.def_1604 (= |ssl3_connect::s__state| (_ bv12292 32)))).def_1604))
(assert (let ((.def_1606 (= |ssl3_connect::blastFlag| (_ bv0 32)))).def_1606))
(assert (let ((.def_698 (= |ssl3_connect::blastFlag| (_ bv5 32)))).def_698))
(assert (let ((.def_3713 (= |ssl3_connect::cb| (_ bv0 32)))).def_3713))
(assert (let ((.def_3715 (= |ssl3_connect::blastFlag| (_ bv4 32)))).def_3715))
(assert (let ((.def_3717 (= |ssl3_connect::s__state| (_ bv4384 32)))).def_3717))
(assert (let ((.def_3719 (= |ssl3_connect::blastFlag| (_ bv1 32)))).def_3719))
(assert (let ((.def_3721 (= |ssl3_connect::blastFlag| (_ bv3 32)))).def_3721))
(assert (let ((.def_3723 (= |ssl3_connect::blastFlag| (_ bv2 32)))).def_3723))
(assert (let ((.def_3725 (= |ssl3_connect::s__state| (_ bv4416 32)))).def_3725))
(assert (let ((.def_3727 (= |ssl3_connect::s__state| (_ bv4400 32)))).def_3727))
(assert (let ((.def_3729 (= |ssl3_connect::s__state| (_ bv4432 32)))).def_3729))
(assert (let ((.def_9071 (= |ssl3_connect::s__state| (_ bv4368 32)))).def_9071))
(assert (let ((.def_9074 (= |ssl3_connect::skip| (_ bv0 32)))).def_9074))
(assert (let ((.def_9076 (= |ssl3_connect::s__state| (_ bv4099 32)))).def_9076))
(assert (let ((.def_9078 (= |ssl3_connect::s__state| (_ bv20480 32)))).def_9078))
(assert (let ((.def_9080 (= |ssl3_connect::s__state| (_ bv4096 32)))).def_9080))
(assert (let ((.def_9082 (= |ssl3_connect::s__state| (_ bv16384 32)))).def_9082))
(assert (let ((.def_9085 (= |ssl3_connect::s__s3__tmp__reuse_message| (_ bv0 32)))).def_9085))
(assert (let ((.def_9087 (= |ssl3_connect::s__state| (_ bv4369 32)))).def_9087))
(assert (let ((.def_9090 (= |ssl3_connect::s__state| |ssl3_connect::s__s3__tmp__next_state___0|))).def_9090))
(assert (let ((.def_9092 (= |ssl3_connect::s__state| (_ bv4352 32)))).def_9092))
(assert (let ((.def_9094 (= |ssl3_connect::s__state| (_ bv4512 32)))).def_9094))
(assert (let ((.def_9096 (= |ssl3_connect::s__state| (_ bv4496 32)))).def_9096))
(assert (let ((.def_9098 (= |ssl3_connect::s__state| (_ bv4480 32)))).def_9098))
(assert (let ((.def_9100 (= |ssl3_connect::s__state| (_ bv4464 32)))).def_9100))
(assert (let ((.def_9102 (= |ssl3_connect::s__s3__tmp__next_state___0| (_ bv4416 32)))).def_9102))
(assert (let ((.def_9104 (= |ssl3_connect::s__s3__tmp__next_state___0| (_ bv4432 32)))).def_9104))
(assert (let ((.def_9106 (= |ssl3_connect::s__s3__tmp__next_state___0| (_ bv4513 32)))).def_9106))
(assert (let ((.def_9108 (= |ssl3_connect::s__s3__tmp__next_state___0| (_ bv4512 32)))).def_9108))
(assert (let ((.def_9110 (= |ssl3_connect::s__s3__tmp__next_state___0| (_ bv4481 32)))).def_9110))
(assert (let ((.def_9112 (= |ssl3_connect::s__s3__tmp__next_state___0| (_ bv4480 32)))).def_9112))
(assert (let ((.def_9114 (= |ssl3_connect::s__s3__tmp__next_state___0| (_ bv4417 32)))).def_9114))
(assert (let ((.def_9116 (= |ssl3_connect::s__state| (_ bv4401 32)))).def_9116))
(assert (let ((.def_9118 (= |ssl3_connect::s__state| (_ bv4528 32)))).def_9118))
(assert (let ((.def_9120 (= |ssl3_connect::s__state| (_ bv4529 32)))).def_9120))
(assert (let ((.def_9122 (= |ssl3_connect::s__state| (_ bv4560 32)))).def_9122))
(assert (let ((.def_9124 (= |ssl3_connect::s__state| (_ bv4561 32)))).def_9124))
(assert (let ((.def_9126 (= |ssl3_connect::s__state| (_ bv4481 32)))).def_9126))
(assert (let ((.def_9128 (= |ssl3_connect::s__state| (_ bv4467 32)))).def_9128))
(assert (let ((.def_9130 (= |ssl3_connect::s__state| (_ bv4466 32)))).def_9130))
(assert (let ((.def_9132 (= |ssl3_connect::s__state| (_ bv4465 32)))).def_9132))
(assert (let ((.def_9134 (= |ssl3_connect::s__state| (_ bv4385 32)))).def_9134))
(assert (let ((.def_9136 (= |ssl3_connect::s__state| (_ bv4513 32)))).def_9136))
(assert (let ((.def_9138 (= |ssl3_connect::s__state| (_ bv4417 32)))).def_9138))
(assert (let ((.def_9141 (= |ssl3_connect::s__hit| (_ bv0 32)))).def_9141))
(assert (let ((.def_9143 (= |ssl3_connect::s__s3__tmp__next_state___0| (_ bv4433 32)))).def_9143))
(assert (let ((.def_9146 (= |ssl3_connect::s__s3__tmp__cert_req| (_ bv0 32)))).def_9146))
(assert (let ((.def_9148 (= |ssl3_connect::s__state| (_ bv4433 32)))).def_9148))
(assert (let ((.def_26402 (= |ssl3_connect::s__s3__tmp__next_state___0| (_ bv4352 32)))).def_26402))
(assert (let ((.def_26404 (= |ssl3_connect::s__s3__tmp__next_state___0| (_ bv4528 32)))).def_26404))
(assert (let ((.def_26406 (= |ssl3_connect::s__s3__tmp__next_state___0| (_ bv4449 32)))).def_26406))
(assert (let ((.def_26408 (= |ssl3_connect::s__s3__tmp__next_state___0| (_ bv4448 32)))).def_26408))
(assert (let ((.def_26410 (= |ssl3_connect::s__s3__tmp__next_state___0| (_ bv4529 32)))).def_26410))
(assert (let ((.def_26412 (= |ssl3_connect::s__s3__tmp__next_state___0| (_ bv4497 32)))).def_26412))
(assert (let ((.def_26414 (= |ssl3_connect::s__s3__tmp__next_state___0| (_ bv4496 32)))).def_26414))
(assert (let ((.def_26416 (= |ssl3_connect::s__s3__tmp__next_state___0| (_ bv4467 32)))).def_26416))
(assert (let ((.def_26418 (= |ssl3_connect::s__s3__tmp__next_state___0| (_ bv4466 32)))).def_26418))
(assert (let ((.def_26420 (= |ssl3_connect::s__s3__tmp__next_state___0| (_ bv4465 32)))).def_26420))
(assert (let ((.def_26422 (= |ssl3_connect::s__s3__tmp__next_state___0| (_ bv4464 32)))).def_26422))
(assert (let ((.def_26424 (= |ssl3_connect::s__s3__tmp__next_state___0| (_ bv12292 32)))).def_26424))
(assert (let ((.def_26426 (= |ssl3_connect::s__s3__tmp__next_state___0| (_ bv4096 32)))).def_26426))
(assert (let ((.def_26428 (= |ssl3_connect::s__s3__tmp__next_state___0| (_ bv20480 32)))).def_26428))
(assert (let ((.def_26430 (= |ssl3_connect::s__s3__tmp__next_state___0| (_ bv16384 32)))).def_26430))
(assert (let ((.def_26432 (= |ssl3_connect::s__s3__tmp__next_state___0| (_ bv4099 32)))).def_26432))
(assert (let ((.def_26434 (= |ssl3_connect::s__state| (_ bv4448 32)))).def_26434))
(assert (let ((.def_26436 (= |ssl3_connect::s__state| (_ bv4449 32)))).def_26436))
(assert (let ((.def_26438 (= |ssl3_connect::s__state| (_ bv4497 32)))).def_26438))
(assert (let ((.def_26440 (= |ssl3_connect::s__s3__tmp__next_state___0| (_ bv4368 32)))).def_26440))
(assert (let ((.def_26442 (= |ssl3_connect::s__s3__tmp__next_state___0| (_ bv4369 32)))).def_26442))
(assert (let ((.def_26444 (= |ssl3_connect::s__s3__tmp__next_state___0| (_ bv4385 32)))).def_26444))
(assert (let ((.def_26446 (= |ssl3_connect::s__s3__tmp__next_state___0| (_ bv4384 32)))).def_26446))
(assert (let ((.def_26448 (= |ssl3_connect::s__s3__tmp__next_state___0| (_ bv4400 32)))).def_26448))
(assert (let ((.def_26450 (= |ssl3_connect::s__s3__tmp__next_state___0| (_ bv4401 32)))).def_26450))

ssl3_connect N573:
(assert false)
(assert (let ((.def_698 (= |ssl3_connect::blastFlag| (_ bv5 32)))).def_698))

ssl3_accept N696:
(assert (let ((.def_34428 (= |ssl3_accept::blastFlag| (_ bv4 32)))).def_34428))
(assert (let ((.def_35575 (= |ssl3_accept::s__state| (_ bv8464 32)))).def_35575))
(assert (let ((.def_35577 (= |ssl3_accept::blastFlag| (_ bv0 32)))).def_35577))
(assert (let ((.def_36952 (= |ssl3_accept::s__state| (_ bv8481 32)))).def_36952))
(assert (let ((.def_36954 (= |ssl3_accept::s__state| (_ bv8480 32)))).def_36954))
(assert (let ((.def_36956 (= |ssl3_accept::s__state| (_ bv12292 32)))).def_36956))
(assert (let ((.def_36958 (= |ssl3_accept::s__state| (_ bv16384 32)))).def_36958))
(assert (let ((.def_36960 (= |ssl3_accept::s__state| (_ bv8192 32)))).def_36960))
(assert (let ((.def_36962 (= |ssl3_accept::s__state| (_ bv24576 32)))).def_36962))
(assert (let ((.def_36964 (= |ssl3_accept::s__state| (_ bv8195 32)))).def_36964))
(assert (let ((.def_36966 (= |ssl3_accept::s__state| (_ bv8482 32)))).def_36966))
(assert (let ((.def_36968 (= |ssl3_accept::blastFlag| (_ bv1 32)))).def_36968))
(assert (let ((.def_38921 (= |ssl3_accept::blastFlag| (_ bv2 32)))).def_38921))
(assert (let ((.def_38923 (= |ssl3_accept::blastFlag| (_ bv3 32)))).def_38923))
(assert (let ((.def_38925 (= |ssl3_accept::s__state| (_ bv8466 32)))).def_38925))
(assert (let ((.def_38927 (= |ssl3_accept::s__state| (_ bv8496 32)))).def_38927))
(assert (let ((.def_38929 (= |ssl3_accept::s__state| (_ bv8528 32)))).def_38929))
(assert (let ((.def_38931 (= |ssl3_accept::s__state| (_ bv8544 32)))).def_38931))
(assert (let ((.def_38933 (= |ssl3_accept::s__state| (_ bv8560 32)))).def_38933))
(assert (let ((.def_38935 (= |ssl3_accept::s__state| (_ bv8448 32)))).def_38935))
(assert (let ((.def_38937 (= |ssl3_accept::s__state| (_ bv8592 32)))).def_38937))
(assert (let ((.def_38939 (= |ssl3_accept::s__state| (_ bv8608 32)))).def_38939))
(assert (let ((.def_38941 (= |ssl3_accept::s__state| (_ bv8640 32)))).def_38941))
(assert (let ((.def_41560 (= |ssl3_accept::s__state| (_ bv8657 32)))).def_41560))
(assert (let ((.def_41562 (= |ssl3_accept::s__state| (_ bv8656 32)))).def_41562))
(assert (let ((.def_41565 (= |ssl3_accept::s__s3__tmp__next_state___0| (_ bv8482 32)))).def_41565))
(assert (let ((.def_41567 (= |ssl3_accept::s__state| (_ bv8641 32)))).def_41567))
(assert (let ((.def_41569 (= |ssl3_accept::s__state| (_ bv3 32)))).def_41569))
(assert (let ((.def_41571 (= |ssl3_accept::s__state| (_ bv8512 32)))).def_41571))
(assert (let ((.def_44382 (= |ssl3_accept::skip| (_ bv1 32)))).def_44382))
(assert (let ((.def_44385 (= |ssl3_accept::s__hit| (_ bv0 32)))).def_44385))
(assert (let ((.def_44387 (= |ssl3_accept::s__state| (_ bv8497 32)))).def_44387))
(assert (let ((.def_48069 (= |ssl3_accept::s__state| (_ bv8465 32)))).def_48069))
(assert (let ((.def_48071 (= |ssl3_accept::s__state| (_ bv8529 32)))).def_48071))
(assert (let ((.def_48073 (= |ssl3_accept::s__state| (_ bv8593 32)))).def_48073))
(assert (let ((.def_48075 (= |ssl3_accept::s__state| (_ bv8545 32)))).def_48075))
(assert (let ((.def_48077 (= |ssl3_accept::s__state| (_ bv8609 32)))).def_48077))
(assert (let ((.def_48079 (= |ssl3_accept::s__state| (_ bv8577 32)))).def_48079))
(assert (let ((.def_48081 (= |ssl3_accept::s__state| (_ bv8576 32)))).def_48081))
(assert (let ((.def_48083 (= |ssl3_accept::s__state| (_ bv8561 32)))).def_48083))
(assert (let ((.def_48085 (= |ssl3_accept::s__state| (_ bv8513 32)))).def_48085))
(assert (let ((.def_48087 (= |ssl3_accept::s__state| |ssl3_accept::s__s3__tmp__next_state___0|))).def_48087))
(assert (let ((.def_48089 (= |ssl3_accept::s__s3__tmp__next_state___0| (_ bv8657 32)))).def_48089))
(assert (let ((.def_48091 (= |ssl3_accept::s__s3__tmp__next_state___0| (_ bv8656 32)))).def_48091))
(assert (let ((.def_48093 (= |ssl3_accept::s__s3__tmp__next_state___0| (_ bv8576 32)))).def_48093))
(assert (let ((.def_53689 (= |ssl3_accept::s__s3__tmp__reuse_message| (_ bv0 32)))).def_53689))
(assert (let ((.def_53691 (= |ssl3_accept::s__s3__tmp__next_state___0| (_ bv8496 32)))).def_53691))
(assert (let ((.def_53693 (= |ssl3_accept::s__s3__tmp__next_state___0| (_ bv8609 32)))).def_53693))
(assert (let ((.def_53695 (= |ssl3_accept::s__s3__tmp__next_state___0| (_ bv8608 32)))).def_53695))
(assert (let ((.def_53697 (= |ssl3_accept::s__s3__tmp__next_state___0| (_ bv8640 32)))).def_53697))
(assert (let ((.def_53699 (= |ssl3_accept::s__s3__tmp__next_state___0| (_ bv8497 32)))).def_53699))
(assert (let ((.def_53701 (= |ssl3_accept::s__s3__tmp__next_state___0| (_ bv3 32)))).def_53701))
(assert (let ((.def_53703 (= |ssl3_accept::skip| (_ bv0 32)))).def_53703))

ssl3_accept N1217:
(assert false)

