(set-info :source |printed by MathSAT|)
(declare-fun a20 () (_ BitVec 32))
(declare-fun a9 () (_ BitVec 32))
(declare-fun a25 () (_ BitVec 32))
(declare-fun a12 () (_ BitVec 32))
(declare-fun a15 () (_ BitVec 32))
(declare-fun a16 () (_ BitVec 32))
(declare-fun a2 () (_ BitVec 32))
(declare-fun a27 () (_ BitVec 32))

*:
(assert (let ((.def_105943 (= a20 (_ bv5 32)))).def_105943))

calculate_output8 N29613:
(assert false)
(assert (let ((.def_105943 (= a20 (_ bv5 32)))).def_105943))

main1 N30136:
(assert (let ((.def_152789 (= a9 (_ bv18 32)))).def_152789))
(assert (let ((.def_105943 (= a20 (_ bv5 32)))).def_105943))
(assert (let ((.def_339419 (= a25 (_ bv1 32)))).def_339419))
(assert (let ((.def_339422 (= a12 (_ bv4 32)))).def_339422))
(assert (let ((.def_339425 (= a15 (_ bv1 32)))).def_339425))
(assert (let ((.def_339428 (= a16 (_ bv1 32)))).def_339428))
(assert (let ((.def_339431 (= a2 (_ bv10 32)))).def_339431))
(assert (let ((.def_339434 (= a27 (_ bv1 32)))).def_339434))
(assert (let ((.def_339436 (= a12 (_ bv6 32)))).def_339436))
(assert (let ((.def_339438 (= a20 (_ bv6 32)))).def_339438))
(assert (let ((.def_339440 (= a12 (_ bv3 32)))).def_339440))
(assert (let ((.def_339442 (= a2 (_ bv12 32)))).def_339442))
(assert (let ((.def_339444 (= a12 (_ bv2 32)))).def_339444))
(assert (let ((.def_339446 (= a9 (_ bv16 32)))).def_339446))
(assert (let ((.def_339448 (= a12 (_ bv5 32)))).def_339448))
(assert (let ((.def_339450 (= a9 (_ bv17 32)))).def_339450))
(assert (let ((.def_1056536 (= a2 (_ bv11 32)))).def_1056536))
(assert (let ((.def_1056538 (= a2 (_ bv13 32)))).def_1056538))
(assert (let ((.def_1056540 (= a2 (_ bv9 32)))).def_1056540))
(assert (let ((.def_1056542 (= a20 (_ bv7 32)))).def_1056542))

