(set-info :source |printed by MathSAT|)
(declare-fun a20 () (_ BitVec 32))
(declare-fun a25 () (_ BitVec 32))
(declare-fun a12 () (_ BitVec 32))
(declare-fun a15 () (_ BitVec 32))
(declare-fun a16 () (_ BitVec 32))
(declare-fun a2 () (_ BitVec 32))
(declare-fun a27 () (_ BitVec 32))
(declare-fun a9 () (_ BitVec 32))
(declare-fun m_pc () (_ BitVec 32))
(declare-fun t1_pc () (_ BitVec 32))
(declare-fun t2_pc () (_ BitVec 32))
(declare-fun t3_pc () (_ BitVec 32))
(declare-fun t4_pc () (_ BitVec 32))
(declare-fun t5_pc () (_ BitVec 32))
(declare-fun t6_pc () (_ BitVec 32))
(declare-fun t7_pc () (_ BitVec 32))
(declare-fun t8_pc () (_ BitVec 32))
(declare-fun t9_pc () (_ BitVec 32))
(declare-fun t10_pc () (_ BitVec 32))
(declare-fun t11_pc () (_ BitVec 32))
(declare-fun t12_pc () (_ BitVec 32))
(declare-fun m_st () (_ BitVec 32))

*:
(assert (let ((.def_107718 (= a20 (_ bv5 32)))).def_107718))

calculate_output8 N30053:
(assert false)
(assert (let ((.def_107718 (= a20 (_ bv5 32)))).def_107718))

main1 N30136:
(assert (let ((.def_107718 (= a20 (_ bv5 32)))).def_107718))
(assert (let ((.def_155325 (= a25 (_ bv1 32)))).def_155325))
(assert (let ((.def_155328 (= a12 (_ bv4 32)))).def_155328))
(assert (let ((.def_155331 (= a15 (_ bv1 32)))).def_155331))
(assert (let ((.def_155334 (= a16 (_ bv1 32)))).def_155334))
(assert (let ((.def_155337 (= a2 (_ bv10 32)))).def_155337))
(assert (let ((.def_155340 (= a27 (_ bv1 32)))).def_155340))
(assert (let ((.def_155343 (= a9 (_ bv18 32)))).def_155343))
(assert (let ((.def_321508 (= a20 (_ bv6 32)))).def_321508))
(assert (let ((.def_321510 (= a12 (_ bv3 32)))).def_321510))
(assert (let ((.def_321512 (= a12 (_ bv6 32)))).def_321512))
(assert (let ((.def_321514 (= a2 (_ bv9 32)))).def_321514))
(assert (let ((.def_321516 (= a9 (_ bv16 32)))).def_321516))
(assert (let ((.def_321518 (= a2 (_ bv12 32)))).def_321518))
(assert (let ((.def_321520 (= a2 (_ bv11 32)))).def_321520))
(assert (let ((.def_321522 (= a9 (_ bv17 32)))).def_321522))
(assert (let ((.def_321524 (= a12 (_ bv2 32)))).def_321524))
(assert (let ((.def_321526 (= a2 (_ bv13 32)))).def_321526))

error N30154:
(assert false)
(assert (let ((.def_107718 (= a20 (_ bv5 32)))).def_107718))

eval N30882:
(assert (let ((.def_747796 (= m_pc (_ bv0 32)))).def_747796))
(assert (let ((.def_107718 (= a20 (_ bv5 32)))).def_107718))
(assert (let ((.def_760346 (= t1_pc (_ bv0 32)))).def_760346))
(assert (let ((.def_760349 (= t2_pc (_ bv0 32)))).def_760349))
(assert (let ((.def_760352 (= t3_pc (_ bv0 32)))).def_760352))
(assert (let ((.def_760355 (= t4_pc (_ bv0 32)))).def_760355))
(assert (let ((.def_760358 (= t5_pc (_ bv0 32)))).def_760358))
(assert (let ((.def_760361 (= t6_pc (_ bv0 32)))).def_760361))
(assert (let ((.def_760364 (= t7_pc (_ bv0 32)))).def_760364))
(assert (let ((.def_760367 (= t8_pc (_ bv0 32)))).def_760367))
(assert (let ((.def_760370 (= t9_pc (_ bv0 32)))).def_760370))
(assert (let ((.def_760373 (= t10_pc (_ bv0 32)))).def_760373))
(assert (let ((.def_760376 (= t11_pc (_ bv0 32)))).def_760376))
(assert (let ((.def_760379 (= t12_pc (_ bv0 32)))).def_760379))
(assert (let ((.def_760381 (= m_pc (_ bv1 32)))).def_760381))
(assert (let ((.def_760383 (= t1_pc (_ bv1 32)))).def_760383))
(assert (let ((.def_760385 (= t2_pc (_ bv1 32)))).def_760385))
(assert (let ((.def_760387 (= t3_pc (_ bv1 32)))).def_760387))
(assert (let ((.def_760389 (= t4_pc (_ bv1 32)))).def_760389))
(assert (let ((.def_760391 (= t5_pc (_ bv1 32)))).def_760391))
(assert (let ((.def_760393 (= t6_pc (_ bv1 32)))).def_760393))
(assert (let ((.def_760395 (= t7_pc (_ bv1 32)))).def_760395))
(assert (let ((.def_760397 (= t8_pc (_ bv1 32)))).def_760397))
(assert (let ((.def_760399 (= t9_pc (_ bv1 32)))).def_760399))
(assert (let ((.def_760401 (= t10_pc (_ bv1 32)))).def_760401))
(assert (let ((.def_760403 (= t11_pc (_ bv1 32)))).def_760403))
(assert (let ((.def_760405 (= t12_pc (_ bv1 32)))).def_760405))
(assert (let ((.def_760408 (= m_st (_ bv0 32)))).def_760408))

start_simulation N31483:
(assert (let ((.def_747796 (= m_pc (_ bv0 32)))).def_747796))
(assert (let ((.def_107718 (= a20 (_ bv5 32)))).def_107718))
(assert (let ((.def_760346 (= t1_pc (_ bv0 32)))).def_760346))
(assert (let ((.def_760349 (= t2_pc (_ bv0 32)))).def_760349))
(assert (let ((.def_760352 (= t3_pc (_ bv0 32)))).def_760352))
(assert (let ((.def_760355 (= t4_pc (_ bv0 32)))).def_760355))
(assert (let ((.def_760358 (= t5_pc (_ bv0 32)))).def_760358))
(assert (let ((.def_760361 (= t6_pc (_ bv0 32)))).def_760361))
(assert (let ((.def_760364 (= t7_pc (_ bv0 32)))).def_760364))
(assert (let ((.def_760367 (= t8_pc (_ bv0 32)))).def_760367))
(assert (let ((.def_760370 (= t9_pc (_ bv0 32)))).def_760370))
(assert (let ((.def_760373 (= t10_pc (_ bv0 32)))).def_760373))
(assert (let ((.def_760376 (= t11_pc (_ bv0 32)))).def_760376))
(assert (let ((.def_760379 (= t12_pc (_ bv0 32)))).def_760379))
(assert (let ((.def_760381 (= m_pc (_ bv1 32)))).def_760381))
(assert (let ((.def_760383 (= t1_pc (_ bv1 32)))).def_760383))
(assert (let ((.def_760385 (= t2_pc (_ bv1 32)))).def_760385))
(assert (let ((.def_760387 (= t3_pc (_ bv1 32)))).def_760387))
(assert (let ((.def_760389 (= t4_pc (_ bv1 32)))).def_760389))
(assert (let ((.def_760391 (= t5_pc (_ bv1 32)))).def_760391))
(assert (let ((.def_760393 (= t6_pc (_ bv1 32)))).def_760393))
(assert (let ((.def_760395 (= t7_pc (_ bv1 32)))).def_760395))
(assert (let ((.def_760397 (= t8_pc (_ bv1 32)))).def_760397))
(assert (let ((.def_760399 (= t9_pc (_ bv1 32)))).def_760399))
(assert (let ((.def_760401 (= t10_pc (_ bv1 32)))).def_760401))
(assert (let ((.def_760403 (= t11_pc (_ bv1 32)))).def_760403))
(assert (let ((.def_760405 (= t12_pc (_ bv1 32)))).def_760405))

