(set-info :source |printed by MathSAT|)
(declare-fun a20 () (_ BitVec 32))
(declare-fun a9 () (_ BitVec 32))
(declare-fun a25 () (_ BitVec 32))
(declare-fun a12 () (_ BitVec 32))
(declare-fun a15 () (_ BitVec 32))
(declare-fun a16 () (_ BitVec 32))
(declare-fun a2 () (_ BitVec 32))
(declare-fun a27 () (_ BitVec 32))

*:
(assert (let ((.def_106250 (= a20 (_ bv5 32)))).def_106250))

calculate_output8 N29701:
(assert false)
(assert (let ((.def_106250 (= a20 (_ bv5 32)))).def_106250))

main1 N30136:
(assert (let ((.def_153114 (= a9 (_ bv18 32)))).def_153114))
(assert (let ((.def_106250 (= a20 (_ bv5 32)))).def_106250))
(assert (let ((.def_339813 (= a25 (_ bv1 32)))).def_339813))
(assert (let ((.def_339816 (= a12 (_ bv4 32)))).def_339816))
(assert (let ((.def_339819 (= a15 (_ bv1 32)))).def_339819))
(assert (let ((.def_339822 (= a16 (_ bv1 32)))).def_339822))
(assert (let ((.def_339825 (= a2 (_ bv10 32)))).def_339825))
(assert (let ((.def_339828 (= a27 (_ bv1 32)))).def_339828))
(assert (let ((.def_339830 (= a20 (_ bv6 32)))).def_339830))
(assert (let ((.def_339832 (= a2 (_ bv13 32)))).def_339832))
(assert (let ((.def_339834 (= a12 (_ bv2 32)))).def_339834))
(assert (let ((.def_339836 (= a2 (_ bv12 32)))).def_339836))
(assert (let ((.def_339838 (= a2 (_ bv11 32)))).def_339838))
(assert (let ((.def_339840 (= a9 (_ bv16 32)))).def_339840))
(assert (let ((.def_339842 (= a9 (_ bv17 32)))).def_339842))
(assert (let ((.def_1067075 (= a12 (_ bv5 32)))).def_1067075))
(assert (let ((.def_1067077 (= a20 (_ bv7 32)))).def_1067077))
(assert (let ((.def_1067079 (= a2 (_ bv9 32)))).def_1067079))
(assert (let ((.def_1067081 (= a12 (_ bv3 32)))).def_1067081))
(assert (let ((.def_1067083 (= a12 (_ bv6 32)))).def_1067083))

