(set-info :source |printed by MathSAT|)
(declare-fun a20 () (_ BitVec 32))
(declare-fun a2 () (_ BitVec 32))
(declare-fun a27 () (_ BitVec 32))
(declare-fun a16 () (_ BitVec 32))
(declare-fun a15 () (_ BitVec 32))
(declare-fun a12 () (_ BitVec 32))
(declare-fun a25 () (_ BitVec 32))
(declare-fun a9 () (_ BitVec 32))

*:
(assert (let ((.def_106368 (= a20 (_ bv5 32)))).def_106368))

calculate_output8 N29723:
(assert false)
(assert (let ((.def_106368 (= a20 (_ bv5 32)))).def_106368))

main1 N30136:
(assert (let ((.def_153365 (= a2 (_ bv10 32)))).def_153365))
(assert (let ((.def_153368 (= a27 (_ bv1 32)))).def_153368))
(assert (let ((.def_153371 (= a16 (_ bv1 32)))).def_153371))
(assert (let ((.def_153374 (= a15 (_ bv1 32)))).def_153374))
(assert (let ((.def_153377 (= a12 (_ bv4 32)))).def_153377))
(assert (let ((.def_153380 (= a25 (_ bv1 32)))).def_153380))
(assert (let ((.def_106368 (= a20 (_ bv5 32)))).def_106368))
(assert (let ((.def_321356 (= a9 (_ bv18 32)))).def_321356))
(assert (let ((.def_321358 (= a20 (_ bv6 32)))).def_321358))
(assert (let ((.def_321360 (= a12 (_ bv3 32)))).def_321360))
(assert (let ((.def_321362 (= a2 (_ bv13 32)))).def_321362))
(assert (let ((.def_321364 (= a2 (_ bv9 32)))).def_321364))
(assert (let ((.def_321366 (= a12 (_ bv2 32)))).def_321366))
(assert (let ((.def_321368 (= a2 (_ bv11 32)))).def_321368))
(assert (let ((.def_321370 (= a9 (_ bv16 32)))).def_321370))
(assert (let ((.def_321372 (= a9 (_ bv17 32)))).def_321372))

