(set-info :source |printed by MathSAT|)
(declare-fun |assert::arg| () (_ BitVec 8))
(declare-fun st1 () (_ BitVec 8))
(declare-fun st2 () (_ BitVec 8))
(declare-fun st3 () (_ BitVec 8))
(declare-fun st4 () (_ BitVec 8))
(declare-fun st5 () (_ BitVec 8))
(declare-fun st6 () (_ BitVec 8))
(declare-fun st7 () (_ BitVec 8))
(declare-fun st8 () (_ BitVec 8))
(declare-fun r1 () (_ BitVec 8))
(declare-fun p6_new () (_ BitVec 8))
(declare-fun nomsg () (_ BitVec 8))
(declare-fun p5_new () (_ BitVec 8))
(declare-fun p4_new () (_ BitVec 8))
(declare-fun p3_new () (_ BitVec 8))
(declare-fun p2_new () (_ BitVec 8))
(declare-fun p7_new () (_ BitVec 8))
(declare-fun mode1 () (_ BitVec 8))
(declare-fun mode2 () (_ BitVec 8))
(declare-fun mode3 () (_ BitVec 8))
(declare-fun mode4 () (_ BitVec 8))
(declare-fun mode5 () (_ BitVec 8))
(declare-fun mode6 () (_ BitVec 8))
(declare-fun mode7 () (_ BitVec 8))
(declare-fun mode8 () (_ BitVec 8))
(declare-fun send8 () (_ BitVec 8))
(declare-fun id1 () (_ BitVec 8))
(declare-fun id2 () (_ BitVec 8))
(declare-fun send1 () (_ BitVec 8))
(declare-fun id3 () (_ BitVec 8))
(declare-fun send2 () (_ BitVec 8))
(declare-fun p8_new () (_ BitVec 8))
(declare-fun id4 () (_ BitVec 8))
(declare-fun send3 () (_ BitVec 8))
(declare-fun id6 () (_ BitVec 8))
(declare-fun send5 () (_ BitVec 8))
(declare-fun id5 () (_ BitVec 8))
(declare-fun send4 () (_ BitVec 8))
(declare-fun id7 () (_ BitVec 8))
(declare-fun send6 () (_ BitVec 8))
(declare-fun id8 () (_ BitVec 8))
(declare-fun send7 () (_ BitVec 8))
(declare-fun p1_new () (_ BitVec 8))
(declare-fun p3_old () (_ BitVec 8))
(declare-fun p8_old () (_ BitVec 8))
(declare-fun p1_old () (_ BitVec 8))
(declare-fun p2_old () (_ BitVec 8))
(declare-fun p5_old () (_ BitVec 8))
(declare-fun p4_old () (_ BitVec 8))
(declare-fun p6_old () (_ BitVec 8))
(declare-fun p7_old () (_ BitVec 8))
(declare-fun |node4::__CPAchecker_TMP_0| () (_ BitVec 32))
(declare-fun |node2::__CPAchecker_TMP_0| () (_ BitVec 32))
(declare-fun |node3::__CPAchecker_TMP_0| () (_ BitVec 32))
(declare-fun |node6::__CPAchecker_TMP_0| () (_ BitVec 32))
(declare-fun |node1::__CPAchecker_TMP_0| () (_ BitVec 32))
(declare-fun |node5::__CPAchecker_TMP_0| () (_ BitVec 32))
(declare-fun |node8::__CPAchecker_TMP_0| () (_ BitVec 32))

assert:
(assert (let ((.def_3540 (= |assert::arg| (_ bv0 8)))).def_3540))

main1 N563:
(assert (let ((.def_3982 (= st1 (_ bv0 8)))).def_3982))
(assert (let ((.def_3985 (= st2 (_ bv0 8)))).def_3985))
(assert (let ((.def_3988 (= st3 (_ bv0 8)))).def_3988))
(assert (let ((.def_3991 (= st4 (_ bv0 8)))).def_3991))
(assert (let ((.def_3994 (= st5 (_ bv0 8)))).def_3994))
(assert (let ((.def_3997 (= st6 (_ bv0 8)))).def_3997))
(assert (let ((.def_4000 (= st7 (_ bv0 8)))).def_4000))
(assert (let ((.def_4003 (= st8 (_ bv0 8)))).def_4003))
(assert (let ((.def_4006 (= r1 (_ bv0 8)))).def_4006))
(assert (let ((.def_4010 (= p6_new nomsg))).def_4010))
(assert (let ((.def_4013 (= nomsg p5_new))).def_4013))
(assert (let ((.def_4016 (= nomsg p4_new))).def_4016))
(assert (let ((.def_4019 (= nomsg p3_new))).def_4019))
(assert (let ((.def_4022 (= nomsg p2_new))).def_4022))
(assert (let ((.def_4025 (= nomsg p7_new))).def_4025))
(assert (let ((.def_4028 (= mode1 (_ bv0 8)))).def_4028))
(assert (let ((.def_4031 (= mode2 (_ bv0 8)))).def_4031))
(assert (let ((.def_4034 (= mode3 (_ bv0 8)))).def_4034))
(assert (let ((.def_4037 (= mode4 (_ bv0 8)))).def_4037))
(assert (let ((.def_4040 (= mode5 (_ bv0 8)))).def_4040))
(assert (let ((.def_4043 (= mode6 (_ bv0 8)))).def_4043))
(assert (let ((.def_4046 (= mode7 (_ bv0 8)))).def_4046))
(assert (let ((.def_4049 (= mode8 (_ bv0 8)))).def_4049))
(assert (let ((.def_6929 (= st1 st8))).def_6929))
(assert (let ((.def_6931 (= st2 st8))).def_6931))
(assert (let ((.def_6933 (= st3 st8))).def_6933))
(assert (let ((.def_6935 (= st4 st8))).def_6935))
(assert (let ((.def_6937 (= st5 st8))).def_6937))
(assert (let ((.def_6939 (= st6 st8))).def_6939))
(assert (let ((.def_6941 (= st7 st8))).def_6941))
(assert (let ((.def_6946 ((_ sign_extend 24) id1)))(let ((.def_6944 ((_ sign_extend 24) send8)))(let ((.def_6947 (= .def_6944 .def_6946))).def_6947))))
(assert (let ((.def_6951 (= id2 send1))).def_6951))
(assert (let ((.def_6954 ((_ sign_extend 24) send1)))(let ((.def_6953 ((_ sign_extend 24) id2)))(let ((.def_6955 (= .def_6953 .def_6954))).def_6955))))
(assert (let ((.def_6959 (= id3 send2))).def_6959))
(assert (let ((.def_6962 ((_ sign_extend 24) send2)))(let ((.def_6961 ((_ sign_extend 24) id3)))(let ((.def_6963 (= .def_6961 .def_6962))).def_6963))))
(assert (let ((.def_6966 (= nomsg p8_new))).def_6966))
(assert (let ((.def_6971 ((_ sign_extend 24) send3)))(let ((.def_6969 ((_ sign_extend 24) id4)))(let ((.def_6972 (= .def_6969 .def_6971))).def_6972))))
(assert (let ((.def_6977 ((_ sign_extend 24) send5)))(let ((.def_6975 ((_ sign_extend 24) id6)))(let ((.def_6978 (= .def_6975 .def_6977))).def_6978))))
(assert (let ((.def_6982 (= id5 send4))).def_6982))
(assert (let ((.def_6985 ((_ sign_extend 24) send4)))(let ((.def_6984 ((_ sign_extend 24) id5)))(let ((.def_6986 (= .def_6984 .def_6985))).def_6986))))
(assert (let ((.def_6991 ((_ sign_extend 24) send6)))(let ((.def_6989 ((_ sign_extend 24) id7)))(let ((.def_6992 (= .def_6989 .def_6991))).def_6992))))
(assert (let ((.def_6996 (= id8 send7))).def_6996))
(assert (let ((.def_6999 ((_ sign_extend 24) send7)))(let ((.def_6998 ((_ sign_extend 24) id8)))(let ((.def_7000 (= .def_6998 .def_6999))).def_7000))))
(assert (let ((.def_7002 ((_ sign_extend 24) nomsg)))(let ((.def_6962 ((_ sign_extend 24) send2)))(let ((.def_7003 (= .def_6962 .def_7002))).def_7003))))
(assert (let ((.def_7002 ((_ sign_extend 24) nomsg)))(let ((.def_6971 ((_ sign_extend 24) send3)))(let ((.def_7005 (= .def_6971 .def_7002))).def_7005))))
(assert (let ((.def_7008 (= nomsg p1_new))).def_7008))
(assert (let ((.def_7011 ((_ sign_extend 24) p3_old)))(let ((.def_6969 ((_ sign_extend 24) id4)))(let ((.def_7012 (= .def_6969 .def_7011))).def_7012))))
(assert (let ((.def_7015 ((_ sign_extend 24) p8_old)))(let ((.def_6946 ((_ sign_extend 24) id1)))(let ((.def_7016 (= .def_6946 .def_7015))).def_7016))))
(assert (let ((.def_7026 ((_ sign_extend 24) st1)))(let ((.def_7025 ((_ sign_extend 24) st2)))(let ((.def_7028 (bvadd .def_7025 .def_7026)))(let ((.def_7024 ((_ sign_extend 24) st3)))(let ((.def_7030 (bvadd .def_7024 .def_7028)))(let ((.def_7023 ((_ sign_extend 24) st4)))(let ((.def_7032 (bvadd .def_7023 .def_7030)))(let ((.def_7022 ((_ sign_extend 24) st5)))(let ((.def_7034 (bvadd .def_7022 .def_7032)))(let ((.def_7021 ((_ sign_extend 24) st6)))(let ((.def_7036 (bvadd .def_7021 .def_7034)))(let ((.def_7020 ((_ sign_extend 24) st7)))(let ((.def_7038 (bvadd .def_7020 .def_7036)))(let ((.def_7018 ((_ sign_extend 24) st8)))(let ((.def_7019 (bvneg .def_7018)))(let ((.def_7039 (= .def_7019 .def_7038))).def_7039)))))))))))))))))
(assert (let ((.def_7042 ((_ sign_extend 24) p1_old)))(let ((.def_6953 ((_ sign_extend 24) id2)))(let ((.def_7043 (= .def_6953 .def_7042))).def_7043))))
(assert (let ((.def_7046 ((_ sign_extend 24) p2_old)))(let ((.def_6961 ((_ sign_extend 24) id3)))(let ((.def_7047 (= .def_6961 .def_7046))).def_7047))))
(assert (let ((.def_7050 ((_ sign_extend 24) p5_old)))(let ((.def_6975 ((_ sign_extend 24) id6)))(let ((.def_7051 (= .def_6975 .def_7050))).def_7051))))
(assert (let ((.def_7054 ((_ sign_extend 24) p4_old)))(let ((.def_6984 ((_ sign_extend 24) id5)))(let ((.def_7055 (= .def_6984 .def_7054))).def_7055))))
(assert (let ((.def_7058 ((_ sign_extend 24) p6_old)))(let ((.def_6989 ((_ sign_extend 24) id7)))(let ((.def_7059 (= .def_6989 .def_7058))).def_7059))))
(assert (let ((.def_7062 ((_ sign_extend 24) p7_old)))(let ((.def_6998 ((_ sign_extend 24) id8)))(let ((.def_7063 (= .def_6998 .def_7062))).def_7063))))
(assert (let ((.def_7026 ((_ sign_extend 24) st1)))(let ((.def_7023 ((_ sign_extend 24) st4)))(let ((.def_24078 (= .def_7023 .def_7026))).def_24078))))
(assert (let ((.def_7026 ((_ sign_extend 24) st1)))(let ((.def_7024 ((_ sign_extend 24) st3)))(let ((.def_24080 (= .def_7024 .def_7026))).def_24080))))
(assert (let ((.def_7025 ((_ sign_extend 24) st2)))(let ((.def_7021 ((_ sign_extend 24) st6)))(let ((.def_24082 (= .def_7021 .def_7025))).def_24082))))
(assert (let ((.def_7022 ((_ sign_extend 24) st5)))(let ((.def_7021 ((_ sign_extend 24) st6)))(let ((.def_24084 (= .def_7021 .def_7022))).def_24084))))
(assert (let ((.def_7021 ((_ sign_extend 24) st6)))(let ((.def_7020 ((_ sign_extend 24) st7)))(let ((.def_24086 (= .def_7020 .def_7021))).def_24086))))
(assert (let ((.def_24088 (= st4 (_ bv1 8)))).def_24088))
(assert (let ((.def_24090 (= st3 (_ bv1 8)))).def_24090))
(assert (let ((.def_24092 (= st1 (_ bv1 8)))).def_24092))
(assert (let ((.def_7023 ((_ sign_extend 24) st4)))(let ((.def_7021 ((_ sign_extend 24) st6)))(let ((.def_24094 (= .def_7021 .def_7023))).def_24094))))
(assert (let ((.def_7024 ((_ sign_extend 24) st3)))(let ((.def_7021 ((_ sign_extend 24) st6)))(let ((.def_24096 (= .def_7021 .def_7024))).def_24096))))
(assert (let ((.def_7023 ((_ sign_extend 24) st4)))(let ((.def_7020 ((_ sign_extend 24) st7)))(let ((.def_24098 (= .def_7020 .def_7023))).def_24098))))
(assert (let ((.def_7025 ((_ sign_extend 24) st2)))(let ((.def_7022 ((_ sign_extend 24) st5)))(let ((.def_24100 (= .def_7022 .def_7025))).def_24100))))
(assert (let ((.def_7024 ((_ sign_extend 24) st3)))(let ((.def_7022 ((_ sign_extend 24) st5)))(let ((.def_24102 (= .def_7022 .def_7024))).def_24102))))
(assert (let ((.def_24104 (= st7 (_ bv1 8)))).def_24104))
(assert (let ((.def_7023 ((_ sign_extend 24) st4)))(let ((.def_7022 ((_ sign_extend 24) st5)))(let ((.def_24106 (= .def_7022 .def_7023))).def_24106))))
(assert (let ((.def_7026 ((_ sign_extend 24) st1)))(let ((.def_7020 ((_ sign_extend 24) st7)))(let ((.def_24108 (= .def_7020 .def_7026))).def_24108))))
(assert (let ((.def_7024 ((_ sign_extend 24) st3)))(let ((.def_7020 ((_ sign_extend 24) st7)))(let ((.def_24110 (= .def_7020 .def_7024))).def_24110))))
(assert (let ((.def_7024 ((_ sign_extend 24) st3)))(let ((.def_7023 ((_ sign_extend 24) st4)))(let ((.def_24112 (= .def_7023 .def_7024))).def_24112))))
(assert (let ((.def_24114 (= st5 (_ bv1 8)))).def_24114))
(assert (let ((.def_7026 ((_ sign_extend 24) st1)))(let ((.def_7022 ((_ sign_extend 24) st5)))(let ((.def_24116 (= .def_7022 .def_7026))).def_24116))))
(assert (let ((.def_7025 ((_ sign_extend 24) st2)))(let ((.def_7024 ((_ sign_extend 24) st3)))(let ((.def_24118 (= .def_7024 .def_7025))).def_24118))))
(assert (let ((.def_7025 ((_ sign_extend 24) st2)))(let ((.def_7023 ((_ sign_extend 24) st4)))(let ((.def_24120 (= .def_7023 .def_7025))).def_24120))))
(assert (let ((.def_7022 ((_ sign_extend 24) st5)))(let ((.def_7020 ((_ sign_extend 24) st7)))(let ((.def_24122 (= .def_7020 .def_7022))).def_24122))))
(assert (let ((.def_24124 (= st6 (_ bv1 8)))).def_24124))
(assert (let ((.def_7026 ((_ sign_extend 24) st1)))(let ((.def_7021 ((_ sign_extend 24) st6)))(let ((.def_24126 (= .def_7021 .def_7026))).def_24126))))
(assert (let ((.def_7025 ((_ sign_extend 24) st2)))(let ((.def_7020 ((_ sign_extend 24) st7)))(let ((.def_24128 (= .def_7020 .def_7025))).def_24128))))
(assert (let ((.def_24130 (= st2 (_ bv1 8)))).def_24130))
(assert (let ((.def_7026 ((_ sign_extend 24) st1)))(let ((.def_7025 ((_ sign_extend 24) st2)))(let ((.def_24132 (= .def_7025 .def_7026))).def_24132))))
(assert (let ((.def_24134 ((_ zero_extend 24) r1)))(let ((.def_24135 (bvslt .def_24134 (_ bv8 32)))).def_24135)))
(assert (let ((.def_7026 ((_ sign_extend 24) st1)))(let ((.def_7025 ((_ sign_extend 24) st2)))(let ((.def_7028 (bvadd .def_7025 .def_7026)))(let ((.def_7024 ((_ sign_extend 24) st3)))(let ((.def_7030 (bvadd .def_7024 .def_7028)))(let ((.def_7023 ((_ sign_extend 24) st4)))(let ((.def_7032 (bvadd .def_7023 .def_7030)))(let ((.def_7022 ((_ sign_extend 24) st5)))(let ((.def_7034 (bvadd .def_7022 .def_7032)))(let ((.def_7021 ((_ sign_extend 24) st6)))(let ((.def_7036 (bvadd .def_7021 .def_7034)))(let ((.def_7020 ((_ sign_extend 24) st7)))(let ((.def_7038 (bvadd .def_7020 .def_7036)))(let ((.def_7018 ((_ sign_extend 24) st8)))(let ((.def_24138 (bvadd .def_7018 .def_7038)))(let ((.def_24139 (= .def_24138 (_ bv1 32)))).def_24139)))))))))))))))))
(assert (let ((.def_6985 ((_ sign_extend 24) send4)))(let ((.def_6984 ((_ sign_extend 24) id5)))(let ((.def_49191 (bvslt .def_6984 .def_6985))).def_49191))))
(assert (let ((.def_6971 ((_ sign_extend 24) send3)))(let ((.def_6969 ((_ sign_extend 24) id4)))(let ((.def_49193 (bvslt .def_6969 .def_6971))).def_49193))))
(assert (let ((.def_6984 ((_ sign_extend 24) id5)))(let ((.def_6971 ((_ sign_extend 24) send3)))(let ((.def_49195 (= .def_6971 .def_6984))).def_49195))))
(assert (let ((.def_6984 ((_ sign_extend 24) id5)))(let ((.def_49197 ((_ extract 31 31) .def_6984)))(let ((.def_49198 (= .def_49197 (_ bv1 1)))).def_49198))))
(assert (let ((.def_6962 ((_ sign_extend 24) send2)))(let ((.def_6969 ((_ sign_extend 24) id4)))(let ((.def_49200 (bvslt .def_6969 .def_6962))).def_49200))))
(assert (let ((.def_6962 ((_ sign_extend 24) send2)))(let ((.def_6961 ((_ sign_extend 24) id3)))(let ((.def_49202 (bvslt .def_6961 .def_6962))).def_49202))))
(assert (let ((.def_6969 ((_ sign_extend 24) id4)))(let ((.def_6962 ((_ sign_extend 24) send2)))(let ((.def_49204 (= .def_6962 .def_6969))).def_49204))))
(assert (let ((.def_6961 ((_ sign_extend 24) id3)))(let ((.def_6954 ((_ sign_extend 24) send1)))(let ((.def_49206 (= .def_6954 .def_6961))).def_49206))))
(assert (let ((.def_6954 ((_ sign_extend 24) send1)))(let ((.def_6953 ((_ sign_extend 24) id2)))(let ((.def_49208 (bvslt .def_6953 .def_6954))).def_49208))))
(assert (let ((.def_6998 ((_ sign_extend 24) id8)))(let ((.def_6991 ((_ sign_extend 24) send6)))(let ((.def_49210 (= .def_6991 .def_6998))).def_49210))))
(assert (let ((.def_6999 ((_ sign_extend 24) send7)))(let ((.def_6998 ((_ sign_extend 24) id8)))(let ((.def_49212 (bvslt .def_6998 .def_6999))).def_49212))))
(assert (let ((.def_49214 (= st8 (_ bv1 8)))).def_49214))
(assert (let ((.def_6989 ((_ sign_extend 24) id7)))(let ((.def_49216 ((_ extract 31 31) .def_6989)))(let ((.def_49217 (= .def_49216 (_ bv1 1)))).def_49217))))
(assert (let ((.def_6991 ((_ sign_extend 24) send6)))(let ((.def_6989 ((_ sign_extend 24) id7)))(let ((.def_49219 (bvslt .def_6989 .def_6991))).def_49219))))
(assert (let ((.def_6989 ((_ sign_extend 24) id7)))(let ((.def_6977 ((_ sign_extend 24) send5)))(let ((.def_49221 (= .def_6977 .def_6989))).def_49221))))
(assert (let ((.def_6953 ((_ sign_extend 24) id2)))(let ((.def_6944 ((_ sign_extend 24) send8)))(let ((.def_49223 (= .def_6944 .def_6953))).def_49223))))
(assert (let ((.def_6985 ((_ sign_extend 24) send4)))(let ((.def_6975 ((_ sign_extend 24) id6)))(let ((.def_49225 (= .def_6975 .def_6985))).def_49225))))
(assert (let ((.def_6975 ((_ sign_extend 24) id6)))(let ((.def_49227 ((_ extract 31 31) .def_6975)))(let ((.def_49228 (= .def_49227 (_ bv1 1)))).def_49228))))
(assert (let ((.def_6944 ((_ sign_extend 24) send8)))(let ((.def_6946 ((_ sign_extend 24) id1)))(let ((.def_49230 (bvslt .def_6946 .def_6944))).def_49230))))
(assert (let ((.def_6999 ((_ sign_extend 24) send7)))(let ((.def_6946 ((_ sign_extend 24) id1)))(let ((.def_49232 (= .def_6946 .def_6999))).def_49232))))
(assert (let ((.def_6954 ((_ sign_extend 24) send1)))(let ((.def_6946 ((_ sign_extend 24) id1)))(let ((.def_49234 (= .def_6946 .def_6954))).def_49234))))
(assert (let ((.def_49236 (= nomsg send4))).def_49236))
(assert (let ((.def_7002 ((_ sign_extend 24) nomsg)))(let ((.def_6985 ((_ sign_extend 24) send4)))(let ((.def_49238 (= .def_6985 .def_7002))).def_49238))))
(assert (let ((.def_49240 (= nomsg send1))).def_49240))
(assert (let ((.def_7002 ((_ sign_extend 24) nomsg)))(let ((.def_6954 ((_ sign_extend 24) send1)))(let ((.def_49242 (= .def_6954 .def_7002))).def_49242))))
(assert (let ((.def_6998 ((_ sign_extend 24) id8)))(let ((.def_6944 ((_ sign_extend 24) send8)))(let ((.def_49244 (= .def_6944 .def_6998))).def_49244))))
(assert (let ((.def_7002 ((_ sign_extend 24) nomsg)))(let ((.def_6944 ((_ sign_extend 24) send8)))(let ((.def_49246 (= .def_6944 .def_7002))).def_49246))))
(assert (let ((.def_49248 (= nomsg send7))).def_49248))
(assert (let ((.def_7002 ((_ sign_extend 24) nomsg)))(let ((.def_6999 ((_ sign_extend 24) send7)))(let ((.def_49250 (= .def_6999 .def_7002))).def_49250))))
(assert (let ((.def_6971 ((_ sign_extend 24) send3)))(let ((.def_6961 ((_ sign_extend 24) id3)))(let ((.def_49252 (= .def_6961 .def_6971))).def_49252))))
(assert (let ((.def_6991 ((_ sign_extend 24) send6)))(let ((.def_6975 ((_ sign_extend 24) id6)))(let ((.def_49254 (= .def_6975 .def_6991))).def_49254))))
(assert (let ((.def_7002 ((_ sign_extend 24) nomsg)))(let ((.def_6991 ((_ sign_extend 24) send6)))(let ((.def_49256 (= .def_6991 .def_7002))).def_49256))))
(assert (let ((.def_7011 ((_ sign_extend 24) p3_old)))(let ((.def_6969 ((_ sign_extend 24) id4)))(let ((.def_49258 (bvslt .def_6969 .def_7011))).def_49258))))
(assert (let ((.def_7011 ((_ sign_extend 24) p3_old)))(let ((.def_6984 ((_ sign_extend 24) id5)))(let ((.def_49260 (= .def_6984 .def_7011))).def_49260))))
(assert (let ((.def_7054 ((_ sign_extend 24) p4_old)))(let ((.def_6984 ((_ sign_extend 24) id5)))(let ((.def_49262 (bvslt .def_6984 .def_7054))).def_49262))))
(assert (let ((.def_6985 ((_ sign_extend 24) send4)))(let ((.def_49265 (= .def_6985 |node4::__CPAchecker_TMP_0|))).def_49265)))
(assert (let ((.def_49267 ((_ extract 7 0) |node4::__CPAchecker_TMP_0|)))(let ((.def_49268 (= p4_old .def_49267))).def_49268)))
(assert (let ((.def_7046 ((_ sign_extend 24) p2_old)))(let ((.def_6969 ((_ sign_extend 24) id4)))(let ((.def_49270 (bvslt .def_6969 .def_7046))).def_49270))))
(assert (let ((.def_7046 ((_ sign_extend 24) p2_old)))(let ((.def_6961 ((_ sign_extend 24) id3)))(let ((.def_49272 (bvslt .def_6961 .def_7046))).def_49272))))
(assert (let ((.def_7046 ((_ sign_extend 24) p2_old)))(let ((.def_6969 ((_ sign_extend 24) id4)))(let ((.def_49274 (= .def_6969 .def_7046))).def_49274))))
(assert (let ((.def_7042 ((_ sign_extend 24) p1_old)))(let ((.def_6961 ((_ sign_extend 24) id3)))(let ((.def_49276 (= .def_6961 .def_7042))).def_49276))))
(assert (let ((.def_7042 ((_ sign_extend 24) p1_old)))(let ((.def_6953 ((_ sign_extend 24) id2)))(let ((.def_49278 (bvslt .def_6953 .def_7042))).def_49278))))
(assert (let ((.def_6962 ((_ sign_extend 24) send2)))(let ((.def_49281 (= .def_6962 |node2::__CPAchecker_TMP_0|))).def_49281)))
(assert (let ((.def_49283 ((_ extract 7 0) |node2::__CPAchecker_TMP_0|)))(let ((.def_49284 (= p2_old .def_49283))).def_49284)))
(assert (let ((.def_6971 ((_ sign_extend 24) send3)))(let ((.def_49287 (= .def_6971 |node3::__CPAchecker_TMP_0|))).def_49287)))
(assert (let ((.def_49289 ((_ extract 7 0) |node3::__CPAchecker_TMP_0|)))(let ((.def_49290 (= p3_old .def_49289))).def_49290)))
(assert (let ((.def_49292 (= send7 p7_old))).def_49292))
(assert (let ((.def_49294 (= id8 p6_old))).def_49294))
(assert (let ((.def_7058 ((_ sign_extend 24) p6_old)))(let ((.def_6998 ((_ sign_extend 24) id8)))(let ((.def_49296 (= .def_6998 .def_7058))).def_49296))))
(assert (let ((.def_7062 ((_ sign_extend 24) p7_old)))(let ((.def_6998 ((_ sign_extend 24) id8)))(let ((.def_49298 (bvslt .def_6998 .def_7062))).def_49298))))
(assert (let ((.def_7058 ((_ sign_extend 24) p6_old)))(let ((.def_6989 ((_ sign_extend 24) id7)))(let ((.def_49300 (bvslt .def_6989 .def_7058))).def_49300))))
(assert (let ((.def_6975 ((_ sign_extend 24) id6)))(let ((.def_49303 (= .def_6975 |node6::__CPAchecker_TMP_0|))).def_49303)))
(assert (let ((.def_49305 ((_ extract 7 0) |node6::__CPAchecker_TMP_0|)))(let ((.def_49306 (= p6_old .def_49305))).def_49306)))
(assert (let ((.def_7050 ((_ sign_extend 24) p5_old)))(let ((.def_6989 ((_ sign_extend 24) id7)))(let ((.def_49308 (= .def_6989 .def_7050))).def_49308))))
(assert (let ((.def_7015 ((_ sign_extend 24) p8_old)))(let ((.def_6953 ((_ sign_extend 24) id2)))(let ((.def_49310 (= .def_6953 .def_7015))).def_49310))))
(assert (let ((.def_6954 ((_ sign_extend 24) send1)))(let ((.def_49313 (= .def_6954 |node1::__CPAchecker_TMP_0|))).def_49313)))
(assert (let ((.def_49315 ((_ extract 7 0) |node1::__CPAchecker_TMP_0|)))(let ((.def_49316 (= p1_old .def_49315))).def_49316)))
(assert (let ((.def_6977 ((_ sign_extend 24) send5)))(let ((.def_49319 (= .def_6977 |node5::__CPAchecker_TMP_0|))).def_49319)))
(assert (let ((.def_49321 ((_ extract 7 0) |node5::__CPAchecker_TMP_0|)))(let ((.def_49322 (= p5_old .def_49321))).def_49322)))
(assert (let ((.def_7054 ((_ sign_extend 24) p4_old)))(let ((.def_6975 ((_ sign_extend 24) id6)))(let ((.def_49324 (= .def_6975 .def_7054))).def_49324))))
(assert (let ((.def_7015 ((_ sign_extend 24) p8_old)))(let ((.def_6946 ((_ sign_extend 24) id1)))(let ((.def_49326 (bvslt .def_6946 .def_7015))).def_49326))))
(assert (let ((.def_6944 ((_ sign_extend 24) send8)))(let ((.def_49329 (= .def_6944 |node8::__CPAchecker_TMP_0|))).def_49329)))
(assert (let ((.def_49331 ((_ extract 7 0) |node8::__CPAchecker_TMP_0|)))(let ((.def_49332 (= p8_old .def_49331))).def_49332)))
(assert (let ((.def_7062 ((_ sign_extend 24) p7_old)))(let ((.def_6946 ((_ sign_extend 24) id1)))(let ((.def_49334 (= .def_6946 .def_7062))).def_49334))))
(assert (let ((.def_7002 ((_ sign_extend 24) nomsg)))(let ((.def_6946 ((_ sign_extend 24) id1)))(let ((.def_49336 (= .def_6946 .def_7002))).def_49336))))
(assert (let ((.def_7002 ((_ sign_extend 24) nomsg)))(let ((.def_6961 ((_ sign_extend 24) id3)))(let ((.def_49338 (= .def_6961 .def_7002))).def_49338))))
(assert (let ((.def_7046 ((_ sign_extend 24) p2_old)))(let ((.def_7002 ((_ sign_extend 24) nomsg)))(let ((.def_49340 (= .def_7002 .def_7046))).def_49340))))
(assert (let ((.def_7054 ((_ sign_extend 24) p4_old)))(let ((.def_7002 ((_ sign_extend 24) nomsg)))(let ((.def_49342 (= .def_7002 .def_7054))).def_49342))))
(assert (let ((.def_7042 ((_ sign_extend 24) p1_old)))(let ((.def_7002 ((_ sign_extend 24) nomsg)))(let ((.def_49344 (= .def_7002 .def_7042))).def_49344))))
(assert (let ((.def_7062 ((_ sign_extend 24) p7_old)))(let ((.def_7002 ((_ sign_extend 24) nomsg)))(let ((.def_49346 (= .def_7002 .def_7062))).def_49346))))
(assert (let ((.def_7011 ((_ sign_extend 24) p3_old)))(let ((.def_7002 ((_ sign_extend 24) nomsg)))(let ((.def_49348 (= .def_7002 .def_7011))).def_49348))))
(assert (let ((.def_7002 ((_ sign_extend 24) nomsg)))(let ((.def_6975 ((_ sign_extend 24) id6)))(let ((.def_49350 (= .def_6975 .def_7002))).def_49350))))
(assert (let ((.def_6991 ((_ sign_extend 24) send6)))(let ((.def_49352 (= .def_6991 |node6::__CPAchecker_TMP_0|))).def_49352)))
(assert (let ((.def_7058 ((_ sign_extend 24) p6_old)))(let ((.def_7002 ((_ sign_extend 24) nomsg)))(let ((.def_49354 (= .def_7002 .def_7058))).def_49354))))
(assert (let ((.def_7020 ((_ sign_extend 24) st7)))(let ((.def_7018 ((_ sign_extend 24) st8)))(let ((.def_49356 (= .def_7018 .def_7020))).def_49356))))
(assert (let ((.def_49358 (= id7 send6))).def_49358))
(assert (let ((.def_49360 (= id6 send5))).def_49360))
(assert (let ((.def_49362 ((_ sign_extend 24) p4_new)))(let ((.def_6985 ((_ sign_extend 24) send4)))(let ((.def_49363 (= .def_6985 .def_49362))).def_49363))))
(assert (let ((.def_49365 (= r1 (_ bv1 8)))).def_49365))

assert N599:
(assert false)
(assert (let ((.def_3540 (= |assert::arg| (_ bv0 8)))).def_3540))

