(set-info :source |printed by MathSAT|)
(declare-fun |ssl3_connect::blastFlag| () (_ BitVec 32))
(declare-fun |ssl3_connect::s__state| () (_ BitVec 32))
(declare-fun |ssl3_connect::s__hit| () (_ BitVec 32))
(declare-fun |ssl3_connect::s__s3__tmp__next_state___0| () (_ BitVec 32))
(declare-fun |ssl3_connect::s__s3__tmp__new_cipher__algorithms| () (_ BitVec 32))
(declare-fun |ssl3_connect::cb| () (_ BitVec 32))
(declare-fun |ssl3_accept::s__state| () (_ BitVec 32))
(declare-fun |ssl3_accept::blastFlag| () (_ BitVec 32))

ssl3_connect:
(assert (let ((.def_678 (= |ssl3_connect::blastFlag| (_ bv5 32)))).def_678))

ssl3_connect N117:
(assert (let ((.def_1600 (= |ssl3_connect::s__state| (_ bv12292 32)))).def_1600))
(assert (let ((.def_1602 (= |ssl3_connect::blastFlag| (_ bv0 32)))).def_1602))
(assert (let ((.def_678 (= |ssl3_connect::blastFlag| (_ bv5 32)))).def_678))
(assert (let ((.def_3687 (= |ssl3_connect::s__state| (_ bv4368 32)))).def_3687))
(assert (let ((.def_3689 (= |ssl3_connect::s__state| (_ bv4384 32)))).def_3689))
(assert (let ((.def_3691 (= |ssl3_connect::blastFlag| (_ bv1 32)))).def_3691))
(assert (let ((.def_5298 (= |ssl3_connect::blastFlag| (_ bv3 32)))).def_5298))
(assert (let ((.def_5300 (= |ssl3_connect::blastFlag| (_ bv4 32)))).def_5300))
(assert (let ((.def_5302 (= |ssl3_connect::blastFlag| (_ bv2 32)))).def_5302))
(assert (let ((.def_5304 (= |ssl3_connect::s__state| (_ bv4416 32)))).def_5304))
(assert (let ((.def_5306 (= |ssl3_connect::s__state| (_ bv4433 32)))).def_5306))
(assert (let ((.def_5308 (= |ssl3_connect::s__state| (_ bv4432 32)))).def_5308))
(assert (let ((.def_10863 (= |ssl3_connect::s__state| (_ bv4099 32)))).def_10863))
(assert (let ((.def_10865 (= |ssl3_connect::s__state| (_ bv20480 32)))).def_10865))
(assert (let ((.def_10867 (= |ssl3_connect::s__state| (_ bv4096 32)))).def_10867))
(assert (let ((.def_10869 (= |ssl3_connect::s__state| (_ bv16384 32)))).def_10869))
(assert (let ((.def_10871 (= |ssl3_connect::s__state| (_ bv4369 32)))).def_10871))
(assert (let ((.def_10873 (= |ssl3_connect::s__state| (_ bv4401 32)))).def_10873))
(assert (let ((.def_10875 (= |ssl3_connect::s__state| (_ bv4400 32)))).def_10875))
(assert (let ((.def_10877 (= |ssl3_connect::s__state| (_ bv4385 32)))).def_10877))
(assert (let ((.def_10879 (= |ssl3_connect::s__state| (_ bv4352 32)))).def_10879))
(assert (let ((.def_16608 (= |ssl3_connect::s__state| (_ bv4560 32)))).def_16608))
(assert (let ((.def_16610 (= |ssl3_connect::s__state| (_ bv4512 32)))).def_16610))
(assert (let ((.def_16612 (= |ssl3_connect::s__state| (_ bv4513 32)))).def_16612))
(assert (let ((.def_16614 (= |ssl3_connect::s__state| (_ bv4481 32)))).def_16614))
(assert (let ((.def_16616 (= |ssl3_connect::s__state| (_ bv4480 32)))).def_16616))
(assert (let ((.def_16618 (= |ssl3_connect::s__state| (_ bv4467 32)))).def_16618))
(assert (let ((.def_16620 (= |ssl3_connect::s__state| (_ bv4466 32)))).def_16620))
(assert (let ((.def_16622 (= |ssl3_connect::s__state| (_ bv4465 32)))).def_16622))
(assert (let ((.def_16624 (= |ssl3_connect::s__state| (_ bv4464 32)))).def_16624))
(assert (let ((.def_16626 (= |ssl3_connect::s__state| (_ bv4449 32)))).def_16626))
(assert (let ((.def_16628 (= |ssl3_connect::s__state| (_ bv4448 32)))).def_16628))
(assert (let ((.def_16631 (= |ssl3_connect::s__hit| (_ bv0 32)))).def_16631))
(assert (let ((.def_16633 (= |ssl3_connect::s__state| (_ bv4417 32)))).def_16633))
(assert (let ((.def_16635 (= |ssl3_connect::s__state| (_ bv4496 32)))).def_16635))
(assert (let ((.def_16637 (= |ssl3_connect::s__state| (_ bv4497 32)))).def_16637))
(assert (let ((.def_16639 (= |ssl3_connect::s__state| (_ bv4528 32)))).def_16639))
(assert (let ((.def_16641 (= |ssl3_connect::s__state| (_ bv4529 32)))).def_16641))
(assert (let ((.def_16643 (= |ssl3_connect::s__state| (_ bv4561 32)))).def_16643))
(assert (let ((.def_16646 (= |ssl3_connect::s__state| |ssl3_connect::s__s3__tmp__next_state___0|))).def_16646))
(assert (let ((.def_16648 (= |ssl3_connect::s__s3__tmp__next_state___0| (_ bv4401 32)))).def_16648))
(assert (let ((.def_16651 (= |ssl3_connect::s__s3__tmp__new_cipher__algorithms| (_ bv4294967040 32)))).def_16651))
(assert (let ((.def_16654 (= |ssl3_connect::cb| (_ bv0 32)))).def_16654))
(assert (let ((.def_29108 (= |ssl3_connect::s__s3__tmp__next_state___0| (_ bv4099 32)))).def_29108))
(assert (let ((.def_29110 (= |ssl3_connect::s__s3__tmp__next_state___0| (_ bv4096 32)))).def_29110))
(assert (let ((.def_29112 (= |ssl3_connect::s__s3__tmp__next_state___0| (_ bv20480 32)))).def_29112))
(assert (let ((.def_29114 (= |ssl3_connect::s__s3__tmp__next_state___0| (_ bv16384 32)))).def_29114))
(assert (let ((.def_29116 (= |ssl3_connect::s__s3__tmp__next_state___0| (_ bv12292 32)))).def_29116))
(assert (let ((.def_29118 (= |ssl3_connect::s__s3__tmp__next_state___0| (_ bv4369 32)))).def_29118))
(assert (let ((.def_29120 (= |ssl3_connect::s__s3__tmp__next_state___0| (_ bv4368 32)))).def_29120))
(assert (let ((.def_29122 (= |ssl3_connect::s__s3__tmp__next_state___0| (_ bv4384 32)))).def_29122))
(assert (let ((.def_29124 (= |ssl3_connect::s__s3__tmp__next_state___0| (_ bv4385 32)))).def_29124))
(assert (let ((.def_29126 (= |ssl3_connect::s__s3__tmp__next_state___0| (_ bv4400 32)))).def_29126))
(assert (let ((.def_29128 (= |ssl3_connect::s__s3__tmp__next_state___0| (_ bv4416 32)))).def_29128))
(assert (let ((.def_29130 (= |ssl3_connect::s__s3__tmp__next_state___0| (_ bv4417 32)))).def_29130))
(assert (let ((.def_29132 (= |ssl3_connect::s__s3__tmp__next_state___0| (_ bv4432 32)))).def_29132))
(assert (let ((.def_29134 (= |ssl3_connect::s__s3__tmp__next_state___0| (_ bv4433 32)))).def_29134))

ssl3_connect N576:
(assert false)
(assert (let ((.def_678 (= |ssl3_connect::blastFlag| (_ bv5 32)))).def_678))

ssl3_accept N700:
(assert (let ((.def_42514 (= |ssl3_accept::s__state| (_ bv8496 32)))).def_42514))
(assert (let ((.def_42516 (= |ssl3_accept::s__state| (_ bv12292 32)))).def_42516))
(assert (let ((.def_42518 (= |ssl3_accept::s__state| (_ bv8464 32)))).def_42518))
(assert (let ((.def_42521 (= |ssl3_accept::blastFlag| (_ bv0 32)))).def_42521))

ssl3_accept N1253:
(assert false)

