(set-info :source |printed by MathSAT|)
(declare-fun c_num_read () (_ BitVec 32))
(declare-fun p_num_write () (_ BitVec 32))
(declare-fun c_last_read () (_ BitVec 32))
(declare-fun p_last_write () (_ BitVec 32))
(declare-fun c_dr_pc () (_ BitVec 32))
(declare-fun q_free () (_ BitVec 32))
(declare-fun q_buf_0 () (_ BitVec 32))
(declare-fun c_dr_st () (_ BitVec 32))
(declare-fun q_req_up () (_ BitVec 32))
(declare-fun q_write_ev () (_ BitVec 32))
(declare-fun q_read_ev () (_ BitVec 32))
(declare-fun p_dw_pc () (_ BitVec 32))
(declare-fun p_dw_st () (_ BitVec 32))
(declare-fun m_pc () (_ BitVec 32))
(declare-fun t1_pc () (_ BitVec 32))
(declare-fun t2_pc () (_ BitVec 32))
(declare-fun t3_pc () (_ BitVec 32))
(declare-fun t4_pc () (_ BitVec 32))
(declare-fun t5_pc () (_ BitVec 32))
(declare-fun t6_pc () (_ BitVec 32))
(declare-fun t7_pc () (_ BitVec 32))
(declare-fun t8_pc () (_ BitVec 32))
(declare-fun t9_pc () (_ BitVec 32))
(declare-fun t10_pc () (_ BitVec 32))
(declare-fun t11_pc () (_ BitVec 32))
(declare-fun m_st () (_ BitVec 32))
(declare-fun t9_st () (_ BitVec 32))
(declare-fun t7_st () (_ BitVec 32))
(declare-fun E_3 () (_ BitVec 32))
(declare-fun E_2 () (_ BitVec 32))
(declare-fun E_11 () (_ BitVec 32))
(declare-fun E_9 () (_ BitVec 32))
(declare-fun E_8 () (_ BitVec 32))
(declare-fun E_7 () (_ BitVec 32))
(declare-fun E_6 () (_ BitVec 32))
(declare-fun E_5 () (_ BitVec 32))
(declare-fun E_4 () (_ BitVec 32))
(declare-fun E_10 () (_ BitVec 32))
(declare-fun t11_st () (_ BitVec 32))
(declare-fun t8_st () (_ BitVec 32))
(declare-fun t4_st () (_ BitVec 32))
(declare-fun t2_st () (_ BitVec 32))
(declare-fun t3_st () (_ BitVec 32))
(declare-fun E_M () (_ BitVec 32))
(declare-fun t1_st () (_ BitVec 32))
(declare-fun t5_st () (_ BitVec 32))
(declare-fun t6_st () (_ BitVec 32))
(declare-fun t10_st () (_ BitVec 32))
(declare-fun E_1 () (_ BitVec 32))
(declare-fun local () (_ BitVec 32))
(declare-fun token () (_ BitVec 32))

*:
(assert (let ((.def_649 (= c_num_read p_num_write))).def_649))
(assert (let ((.def_658 (= c_last_read p_last_write))).def_658))

error1 N4:
(assert false)
(assert (let ((.def_649 (= c_num_read p_num_write))).def_649))
(assert (let ((.def_658 (= c_last_read p_last_write))).def_658))

do_write_p N78:
(assert (let ((.def_845 (= c_dr_pc (_ bv0 32)))).def_845))
(assert (let ((.def_649 (= c_num_read p_num_write))).def_649))
(assert (let ((.def_658 (= c_last_read p_last_write))).def_658))
(assert (let ((.def_913 (= q_free (_ bv1 32)))).def_913))
(assert false)
(assert (let ((.def_1097 (= p_last_write q_buf_0))).def_1097))
(assert (let ((.def_1237 (= c_dr_pc (_ bv1 32)))).def_1237))
(assert (let ((.def_1239 (= q_free (_ bv0 32)))).def_1239))
(assert (let ((.def_1243 (bvadd (_ bv1 32) c_num_read)))(let ((.def_1244 (= p_num_write .def_1243))).def_1244)))
(assert (let ((.def_1925 (= c_dr_st (_ bv0 32)))).def_1925))
(assert (let ((.def_4325 (= q_req_up (_ bv1 32)))).def_4325))
(assert (let ((.def_5958 (= q_write_ev (_ bv1 32)))).def_5958))
(assert (let ((.def_5960 (= q_write_ev (_ bv0 32)))).def_5960))
(assert (let ((.def_8295 (= q_read_ev (_ bv1 32)))).def_8295))
(assert (let ((.def_8297 (= q_read_ev (_ bv0 32)))).def_8297))

do_read_c N112:
(assert (let ((.def_913 (= q_free (_ bv1 32)))).def_913))
(assert (let ((.def_649 (= c_num_read p_num_write))).def_649))
(assert (let ((.def_658 (= c_last_read p_last_write))).def_658))
(assert (let ((.def_1097 (= p_last_write q_buf_0))).def_1097))
(assert (let ((.def_1243 (bvadd (_ bv1 32) c_num_read)))(let ((.def_1244 (= p_num_write .def_1243))).def_1244)))
(assert false)
(assert (let ((.def_1239 (= q_free (_ bv0 32)))).def_1239))
(assert (let ((.def_5958 (= q_write_ev (_ bv1 32)))).def_5958))
(assert (let ((.def_5960 (= q_write_ev (_ bv0 32)))).def_5960))
(assert (let ((.def_1241 (= p_dw_pc (_ bv1 32)))).def_1241))
(assert (let ((.def_4325 (= q_req_up (_ bv1 32)))).def_4325))
(assert (let ((.def_2399 (= p_dw_st (_ bv0 32)))).def_2399))
(assert (let ((.def_8295 (= q_read_ev (_ bv1 32)))).def_8295))
(assert (let ((.def_8297 (= q_read_ev (_ bv0 32)))).def_8297))

eval1 N228:
(assert (let ((.def_845 (= c_dr_pc (_ bv0 32)))).def_845))
(assert (let ((.def_649 (= c_num_read p_num_write))).def_649))
(assert (let ((.def_658 (= c_last_read p_last_write))).def_658))
(assert (let ((.def_913 (= q_free (_ bv1 32)))).def_913))
(assert (let ((.def_1055 (= p_dw_pc (_ bv0 32)))).def_1055))
(assert (let ((.def_1237 (= c_dr_pc (_ bv1 32)))).def_1237))
(assert (let ((.def_1239 (= q_free (_ bv0 32)))).def_1239))
(assert (let ((.def_1241 (= p_dw_pc (_ bv1 32)))).def_1241))
(assert (let ((.def_2399 (= p_dw_st (_ bv0 32)))).def_2399))
(assert (let ((.def_1097 (= p_last_write q_buf_0))).def_1097))
(assert (let ((.def_1243 (bvadd (_ bv1 32) c_num_read)))(let ((.def_1244 (= p_num_write .def_1243))).def_1244)))
(assert (let ((.def_1925 (= c_dr_st (_ bv0 32)))).def_1925))
(assert (let ((.def_4325 (= q_req_up (_ bv1 32)))).def_4325))
(assert (let ((.def_5958 (= q_write_ev (_ bv1 32)))).def_5958))
(assert (let ((.def_5960 (= q_write_ev (_ bv0 32)))).def_5960))
(assert (let ((.def_8295 (= q_read_ev (_ bv1 32)))).def_8295))
(assert (let ((.def_8297 (= q_read_ev (_ bv0 32)))).def_8297))

start_simulation1 N283:
(assert (let ((.def_845 (= c_dr_pc (_ bv0 32)))).def_845))
(assert (let ((.def_649 (= c_num_read p_num_write))).def_649))
(assert (let ((.def_658 (= c_last_read p_last_write))).def_658))
(assert (let ((.def_913 (= q_free (_ bv1 32)))).def_913))
(assert (let ((.def_1055 (= p_dw_pc (_ bv0 32)))).def_1055))
(assert (let ((.def_1237 (= c_dr_pc (_ bv1 32)))).def_1237))
(assert (let ((.def_1239 (= q_free (_ bv0 32)))).def_1239))
(assert (let ((.def_1241 (= p_dw_pc (_ bv1 32)))).def_1241))
(assert (let ((.def_1925 (= c_dr_st (_ bv0 32)))).def_1925))
(assert (let ((.def_2399 (= p_dw_st (_ bv0 32)))).def_2399))
(assert (let ((.def_1097 (= p_last_write q_buf_0))).def_1097))
(assert (let ((.def_5958 (= q_write_ev (_ bv1 32)))).def_5958))
(assert (let ((.def_5960 (= q_write_ev (_ bv0 32)))).def_5960))
(assert (let ((.def_8295 (= q_read_ev (_ bv1 32)))).def_8295))
(assert (let ((.def_8297 (= q_read_ev (_ bv0 32)))).def_8297))
(assert (let ((.def_1243 (bvadd (_ bv1 32) c_num_read)))(let ((.def_1244 (= p_num_write .def_1243))).def_1244)))

error2 N328:
(assert false)
(assert (let ((.def_649 (= c_num_read p_num_write))).def_649))
(assert (let ((.def_658 (= c_last_read p_last_write))).def_658))

eval2 N1002:
(assert (let ((.def_11616 (= m_pc (_ bv0 32)))).def_11616))
(assert (let ((.def_649 (= c_num_read p_num_write))).def_649))
(assert (let ((.def_658 (= c_last_read p_last_write))).def_658))
(assert (let ((.def_22437 (= t1_pc (_ bv0 32)))).def_22437))
(assert (let ((.def_22440 (= t2_pc (_ bv0 32)))).def_22440))
(assert (let ((.def_22443 (= t3_pc (_ bv0 32)))).def_22443))
(assert (let ((.def_22446 (= t4_pc (_ bv0 32)))).def_22446))
(assert (let ((.def_22449 (= t5_pc (_ bv0 32)))).def_22449))
(assert (let ((.def_22452 (= t6_pc (_ bv0 32)))).def_22452))
(assert (let ((.def_22455 (= t7_pc (_ bv0 32)))).def_22455))
(assert (let ((.def_22458 (= t8_pc (_ bv0 32)))).def_22458))
(assert (let ((.def_22461 (= t9_pc (_ bv0 32)))).def_22461))
(assert (let ((.def_22464 (= t10_pc (_ bv0 32)))).def_22464))
(assert (let ((.def_22467 (= t11_pc (_ bv0 32)))).def_22467))
(assert (let ((.def_22469 (= m_pc (_ bv1 32)))).def_22469))
(assert (let ((.def_22471 (= t1_pc (_ bv1 32)))).def_22471))
(assert (let ((.def_22473 (= t2_pc (_ bv1 32)))).def_22473))
(assert (let ((.def_22475 (= t3_pc (_ bv1 32)))).def_22475))
(assert (let ((.def_22477 (= t4_pc (_ bv1 32)))).def_22477))
(assert (let ((.def_22479 (= t5_pc (_ bv1 32)))).def_22479))
(assert (let ((.def_22481 (= t6_pc (_ bv1 32)))).def_22481))
(assert (let ((.def_22483 (= t7_pc (_ bv1 32)))).def_22483))
(assert (let ((.def_22485 (= t8_pc (_ bv1 32)))).def_22485))
(assert (let ((.def_22487 (= t9_pc (_ bv1 32)))).def_22487))
(assert (let ((.def_22489 (= t10_pc (_ bv1 32)))).def_22489))
(assert (let ((.def_22491 (= t11_pc (_ bv1 32)))).def_22491))
(assert (let ((.def_22494 (= m_st (_ bv0 32)))).def_22494))
(assert (let ((.def_117836 (= t9_st (_ bv0 32)))).def_117836))
(assert (let ((.def_117839 (= t7_st (_ bv0 32)))).def_117839))
(assert (let ((.def_117842 (= E_3 (_ bv2 32)))).def_117842))
(assert (let ((.def_117845 (= E_2 (_ bv2 32)))).def_117845))
(assert (let ((.def_117848 (= E_11 (_ bv1 32)))).def_117848))
(assert (let ((.def_117851 (= E_9 (_ bv1 32)))).def_117851))
(assert (let ((.def_117854 (= E_8 (_ bv1 32)))).def_117854))
(assert (let ((.def_117857 (= E_7 (_ bv1 32)))).def_117857))
(assert (let ((.def_117860 (= E_6 (_ bv1 32)))).def_117860))
(assert (let ((.def_117863 (= E_5 (_ bv1 32)))).def_117863))
(assert (let ((.def_117866 (= E_4 (_ bv1 32)))).def_117866))
(assert (let ((.def_117868 (= E_3 (_ bv1 32)))).def_117868))
(assert (let ((.def_117870 (= E_2 (_ bv1 32)))).def_117870))
(assert (let ((.def_117873 (= E_10 (_ bv1 32)))).def_117873))
(assert (let ((.def_117876 (= t11_st (_ bv0 32)))).def_117876))
(assert (let ((.def_117879 (= t8_st (_ bv0 32)))).def_117879))
(assert (let ((.def_117882 (= t4_st (_ bv0 32)))).def_117882))
(assert (let ((.def_117885 (= t2_st (_ bv0 32)))).def_117885))
(assert (let ((.def_117888 (= t3_st (_ bv0 32)))).def_117888))
(assert (let ((.def_117891 (= E_M (_ bv1 32)))).def_117891))
(assert (let ((.def_117894 (= t1_st (_ bv0 32)))).def_117894))
(assert (let ((.def_117897 (= t5_st (_ bv0 32)))).def_117897))
(assert (let ((.def_117900 (= t6_st (_ bv0 32)))).def_117900))
(assert (let ((.def_117903 (= t10_st (_ bv0 32)))).def_117903))
(assert (let ((.def_117905 (= m_st (_ bv2 32)))).def_117905))
(assert (let ((.def_117908 (= E_1 (_ bv1 32)))).def_117908))
(assert (let ((.def_117911 (bvadd (_ bv11 32) local)))(let ((.def_117913 (= .def_117911 token))).def_117913)))

start_simulation2 N1562:
(assert (let ((.def_11616 (= m_pc (_ bv0 32)))).def_11616))
(assert (let ((.def_649 (= c_num_read p_num_write))).def_649))
(assert (let ((.def_658 (= c_last_read p_last_write))).def_658))
(assert (let ((.def_22437 (= t1_pc (_ bv0 32)))).def_22437))
(assert (let ((.def_22440 (= t2_pc (_ bv0 32)))).def_22440))
(assert (let ((.def_22443 (= t3_pc (_ bv0 32)))).def_22443))
(assert (let ((.def_22446 (= t4_pc (_ bv0 32)))).def_22446))
(assert (let ((.def_22449 (= t5_pc (_ bv0 32)))).def_22449))
(assert (let ((.def_22452 (= t6_pc (_ bv0 32)))).def_22452))
(assert (let ((.def_22455 (= t7_pc (_ bv0 32)))).def_22455))
(assert (let ((.def_22458 (= t8_pc (_ bv0 32)))).def_22458))
(assert (let ((.def_22461 (= t9_pc (_ bv0 32)))).def_22461))
(assert (let ((.def_22464 (= t10_pc (_ bv0 32)))).def_22464))
(assert (let ((.def_22467 (= t11_pc (_ bv0 32)))).def_22467))
(assert (let ((.def_22469 (= m_pc (_ bv1 32)))).def_22469))
(assert (let ((.def_22471 (= t1_pc (_ bv1 32)))).def_22471))
(assert (let ((.def_22473 (= t2_pc (_ bv1 32)))).def_22473))
(assert (let ((.def_22475 (= t3_pc (_ bv1 32)))).def_22475))
(assert (let ((.def_22477 (= t4_pc (_ bv1 32)))).def_22477))
(assert (let ((.def_22479 (= t5_pc (_ bv1 32)))).def_22479))
(assert (let ((.def_22481 (= t6_pc (_ bv1 32)))).def_22481))
(assert (let ((.def_22483 (= t7_pc (_ bv1 32)))).def_22483))
(assert (let ((.def_22485 (= t8_pc (_ bv1 32)))).def_22485))
(assert (let ((.def_22487 (= t9_pc (_ bv1 32)))).def_22487))
(assert (let ((.def_22489 (= t10_pc (_ bv1 32)))).def_22489))
(assert (let ((.def_22491 (= t11_pc (_ bv1 32)))).def_22491))
(assert (let ((.def_117836 (= t9_st (_ bv0 32)))).def_117836))
(assert (let ((.def_117839 (= t7_st (_ bv0 32)))).def_117839))
(assert (let ((.def_117842 (= E_3 (_ bv2 32)))).def_117842))
(assert (let ((.def_117845 (= E_2 (_ bv2 32)))).def_117845))
(assert (let ((.def_117848 (= E_11 (_ bv1 32)))).def_117848))
(assert (let ((.def_117851 (= E_9 (_ bv1 32)))).def_117851))
(assert (let ((.def_117854 (= E_8 (_ bv1 32)))).def_117854))
(assert (let ((.def_117857 (= E_7 (_ bv1 32)))).def_117857))
(assert (let ((.def_117860 (= E_6 (_ bv1 32)))).def_117860))
(assert (let ((.def_117863 (= E_5 (_ bv1 32)))).def_117863))
(assert (let ((.def_117866 (= E_4 (_ bv1 32)))).def_117866))
(assert (let ((.def_117868 (= E_3 (_ bv1 32)))).def_117868))
(assert (let ((.def_117870 (= E_2 (_ bv1 32)))).def_117870))
(assert (let ((.def_117873 (= E_10 (_ bv1 32)))).def_117873))
(assert (let ((.def_117876 (= t11_st (_ bv0 32)))).def_117876))
(assert (let ((.def_117879 (= t8_st (_ bv0 32)))).def_117879))
(assert (let ((.def_117882 (= t4_st (_ bv0 32)))).def_117882))
(assert (let ((.def_117885 (= t2_st (_ bv0 32)))).def_117885))
(assert (let ((.def_117888 (= t3_st (_ bv0 32)))).def_117888))
(assert (let ((.def_117891 (= E_M (_ bv1 32)))).def_117891))
(assert (let ((.def_117894 (= t1_st (_ bv0 32)))).def_117894))
(assert (let ((.def_117897 (= t5_st (_ bv0 32)))).def_117897))
(assert (let ((.def_117900 (= t6_st (_ bv0 32)))).def_117900))
(assert (let ((.def_22494 (= m_st (_ bv0 32)))).def_22494))

