(set-info :source |printed by MathSAT|)
(declare-fun a20 () (_ BitVec 32))
(declare-fun a25 () (_ BitVec 32))
(declare-fun a12 () (_ BitVec 32))
(declare-fun a15 () (_ BitVec 32))
(declare-fun a16 () (_ BitVec 32))
(declare-fun a2 () (_ BitVec 32))
(declare-fun a27 () (_ BitVec 32))
(declare-fun a9 () (_ BitVec 32))
(declare-fun m_pc () (_ BitVec 32))
(declare-fun t1_pc () (_ BitVec 32))
(declare-fun t2_pc () (_ BitVec 32))
(declare-fun t3_pc () (_ BitVec 32))
(declare-fun t4_pc () (_ BitVec 32))
(declare-fun t5_pc () (_ BitVec 32))
(declare-fun t6_pc () (_ BitVec 32))
(declare-fun t7_pc () (_ BitVec 32))
(declare-fun t8_pc () (_ BitVec 32))
(declare-fun m_st () (_ BitVec 32))
(declare-fun t4_st () (_ BitVec 32))
(declare-fun t1_st () (_ BitVec 32))
(declare-fun E_5 () (_ BitVec 32))
(declare-fun E_3 () (_ BitVec 32))
(declare-fun E_6 () (_ BitVec 32))
(declare-fun E_4 () (_ BitVec 32))
(declare-fun E_2 () (_ BitVec 32))
(declare-fun E_M () (_ BitVec 32))
(declare-fun E_7 () (_ BitVec 32))
(declare-fun t6_st () (_ BitVec 32))
(declare-fun E_8 () (_ BitVec 32))
(declare-fun t2_st () (_ BitVec 32))
(declare-fun t5_st () (_ BitVec 32))
(declare-fun t3_st () (_ BitVec 32))
(declare-fun t7_st () (_ BitVec 32))
(declare-fun t8_st () (_ BitVec 32))
(declare-fun E_1 () (_ BitVec 32))
(declare-fun local () (_ BitVec 32))
(declare-fun token () (_ BitVec 32))

*:
(assert (let ((.def_107218 (= a20 (_ bv5 32)))).def_107218))

calculate_output8 N29943:
(assert false)
(assert (let ((.def_107218 (= a20 (_ bv5 32)))).def_107218))

main1 N30136:
(assert (let ((.def_107218 (= a20 (_ bv5 32)))).def_107218))
(assert (let ((.def_154595 (= a25 (_ bv1 32)))).def_154595))
(assert (let ((.def_154598 (= a12 (_ bv4 32)))).def_154598))
(assert (let ((.def_154601 (= a15 (_ bv1 32)))).def_154601))
(assert (let ((.def_154604 (= a16 (_ bv1 32)))).def_154604))
(assert (let ((.def_154607 (= a2 (_ bv10 32)))).def_154607))
(assert (let ((.def_154610 (= a27 (_ bv1 32)))).def_154610))
(assert (let ((.def_154613 (= a9 (_ bv18 32)))).def_154613))
(assert (let ((.def_585106 (= a9 (_ bv17 32)))).def_585106))
(assert (let ((.def_585108 (= a12 (_ bv6 32)))).def_585108))
(assert (let ((.def_585110 (= a9 (_ bv16 32)))).def_585110))
(assert (let ((.def_585112 (= a2 (_ bv9 32)))).def_585112))
(assert (let ((.def_585114 (= a2 (_ bv12 32)))).def_585114))
(assert (let ((.def_585116 (= a20 (_ bv6 32)))).def_585116))
(assert (let ((.def_585118 (= a20 (_ bv7 32)))).def_585118))
(assert (let ((.def_585120 (= a2 (_ bv13 32)))).def_585120))
(assert (let ((.def_585122 (= a12 (_ bv3 32)))).def_585122))
(assert (let ((.def_585124 (= a12 (_ bv2 32)))).def_585124))
(assert (let ((.def_585126 (= a12 (_ bv5 32)))).def_585126))
(assert (let ((.def_585128 (= a2 (_ bv11 32)))).def_585128))

error N30154:
(assert false)
(assert (let ((.def_107218 (= a20 (_ bv5 32)))).def_107218))

eval N30666:
(assert (let ((.def_922031 (= m_pc (_ bv0 32)))).def_922031))
(assert (let ((.def_107218 (= a20 (_ bv5 32)))).def_107218))
(assert (let ((.def_928438 (= t1_pc (_ bv0 32)))).def_928438))
(assert (let ((.def_928441 (= t2_pc (_ bv0 32)))).def_928441))
(assert (let ((.def_928444 (= t3_pc (_ bv0 32)))).def_928444))
(assert (let ((.def_928447 (= t4_pc (_ bv0 32)))).def_928447))
(assert (let ((.def_928450 (= t5_pc (_ bv0 32)))).def_928450))
(assert (let ((.def_928453 (= t6_pc (_ bv0 32)))).def_928453))
(assert (let ((.def_928456 (= t7_pc (_ bv0 32)))).def_928456))
(assert (let ((.def_928459 (= t8_pc (_ bv0 32)))).def_928459))
(assert (let ((.def_928461 (= m_pc (_ bv1 32)))).def_928461))
(assert (let ((.def_928463 (= t1_pc (_ bv1 32)))).def_928463))
(assert (let ((.def_928465 (= t2_pc (_ bv1 32)))).def_928465))
(assert (let ((.def_928467 (= t3_pc (_ bv1 32)))).def_928467))
(assert (let ((.def_928469 (= t4_pc (_ bv1 32)))).def_928469))
(assert (let ((.def_928471 (= t5_pc (_ bv1 32)))).def_928471))
(assert (let ((.def_928473 (= t6_pc (_ bv1 32)))).def_928473))
(assert (let ((.def_928475 (= t7_pc (_ bv1 32)))).def_928475))
(assert (let ((.def_928477 (= t8_pc (_ bv1 32)))).def_928477))
(assert (let ((.def_928480 (= m_st (_ bv0 32)))).def_928480))
(assert (let ((.def_946105 (= t4_st (_ bv0 32)))).def_946105))
(assert (let ((.def_946108 (= t1_st (_ bv0 32)))).def_946108))
(assert (let ((.def_946111 (= E_5 (_ bv2 32)))).def_946111))
(assert (let ((.def_946114 (= E_3 (_ bv1 32)))).def_946114))
(assert (let ((.def_946117 (= E_6 (_ bv1 32)))).def_946117))
(assert (let ((.def_946119 (= E_5 (_ bv1 32)))).def_946119))
(assert (let ((.def_946122 (= E_4 (_ bv1 32)))).def_946122))
(assert (let ((.def_946125 (= E_2 (_ bv1 32)))).def_946125))
(assert (let ((.def_946128 (= E_M (_ bv1 32)))).def_946128))
(assert (let ((.def_946131 (= E_7 (_ bv1 32)))).def_946131))
(assert (let ((.def_946134 (= t6_st (_ bv0 32)))).def_946134))
(assert (let ((.def_946137 (= E_8 (_ bv1 32)))).def_946137))
(assert (let ((.def_946140 (= t2_st (_ bv0 32)))).def_946140))
(assert (let ((.def_946143 (= t5_st (_ bv0 32)))).def_946143))
(assert (let ((.def_946146 (= t3_st (_ bv0 32)))).def_946146))
(assert (let ((.def_946149 (= t7_st (_ bv0 32)))).def_946149))
(assert (let ((.def_946152 (= t8_st (_ bv0 32)))).def_946152))
(assert (let ((.def_946154 (= m_st (_ bv2 32)))).def_946154))
(assert (let ((.def_946157 (= E_1 (_ bv1 32)))).def_946157))
(assert (let ((.def_946160 (bvadd (_ bv8 32) local)))(let ((.def_946162 (= .def_946160 token))).def_946162)))
(assert (let ((.def_1008343 (= local (_ bv0 32)))).def_1008343))
(assert (let ((.def_1008345 (= token (_ bv0 32)))).def_1008345))
(assert (let ((.def_1008347 (= E_7 (_ bv2 32)))).def_1008347))
(assert (let ((.def_1008349 (= E_4 (_ bv2 32)))).def_1008349))
(assert (let ((.def_1008351 (= E_2 (_ bv2 32)))).def_1008351))
(assert (let ((.def_1008353 (= E_3 (_ bv2 32)))).def_1008353))
(assert (let ((.def_1008355 (= E_6 (_ bv2 32)))).def_1008355))
(assert (let ((.def_1008357 (= t8_st (_ bv2 32)))).def_1008357))
(assert (let ((.def_1008359 (= t5_st (_ bv2 32)))).def_1008359))
(assert (let ((.def_1008361 (= t3_st (_ bv2 32)))).def_1008361))
(assert (let ((.def_1008363 (bvadd (_ bv5 32) local)))(let ((.def_1008364 (= token .def_1008363))).def_1008364)))
(assert (let ((.def_1008366 (= local token))).def_1008366))
(assert (let ((.def_1008368 (bvadd (_ bv7 32) local)))(let ((.def_1008369 (= token .def_1008368))).def_1008369)))
(assert (let ((.def_1008371 (bvadd (_ bv3 32) local)))(let ((.def_1008372 (= token .def_1008371))).def_1008372)))
(assert (let ((.def_1008374 (bvadd (_ bv4 32) local)))(let ((.def_1008375 (= token .def_1008374))).def_1008375)))
(assert (let ((.def_1008377 (bvadd (_ bv6 32) local)))(let ((.def_1008378 (= token .def_1008377))).def_1008378)))
(assert (let ((.def_1008380 (bvadd (_ bv2 32) local)))(let ((.def_1008381 (= token .def_1008380))).def_1008381)))
(assert false)
(assert (let ((.def_1008385 (bvadd (_ bv1 32) local)))(let ((.def_1008386 (= token .def_1008385))).def_1008386)))

start_simulation N31103:
(assert (let ((.def_922031 (= m_pc (_ bv0 32)))).def_922031))
(assert (let ((.def_107218 (= a20 (_ bv5 32)))).def_107218))
(assert (let ((.def_928438 (= t1_pc (_ bv0 32)))).def_928438))
(assert (let ((.def_928441 (= t2_pc (_ bv0 32)))).def_928441))
(assert (let ((.def_928444 (= t3_pc (_ bv0 32)))).def_928444))
(assert (let ((.def_928447 (= t4_pc (_ bv0 32)))).def_928447))
(assert (let ((.def_928450 (= t5_pc (_ bv0 32)))).def_928450))
(assert (let ((.def_928453 (= t6_pc (_ bv0 32)))).def_928453))
(assert (let ((.def_928456 (= t7_pc (_ bv0 32)))).def_928456))
(assert (let ((.def_928459 (= t8_pc (_ bv0 32)))).def_928459))
(assert (let ((.def_928461 (= m_pc (_ bv1 32)))).def_928461))
(assert (let ((.def_928463 (= t1_pc (_ bv1 32)))).def_928463))
(assert (let ((.def_928465 (= t2_pc (_ bv1 32)))).def_928465))
(assert (let ((.def_928467 (= t3_pc (_ bv1 32)))).def_928467))
(assert (let ((.def_928469 (= t4_pc (_ bv1 32)))).def_928469))
(assert (let ((.def_928471 (= t5_pc (_ bv1 32)))).def_928471))
(assert (let ((.def_928473 (= t6_pc (_ bv1 32)))).def_928473))
(assert (let ((.def_928475 (= t7_pc (_ bv1 32)))).def_928475))
(assert (let ((.def_928477 (= t8_pc (_ bv1 32)))).def_928477))
(assert (let ((.def_946105 (= t4_st (_ bv0 32)))).def_946105))
(assert (let ((.def_946108 (= t1_st (_ bv0 32)))).def_946108))
(assert (let ((.def_946111 (= E_5 (_ bv2 32)))).def_946111))
(assert (let ((.def_946114 (= E_3 (_ bv1 32)))).def_946114))
(assert (let ((.def_946117 (= E_6 (_ bv1 32)))).def_946117))
(assert (let ((.def_946119 (= E_5 (_ bv1 32)))).def_946119))
(assert (let ((.def_946122 (= E_4 (_ bv1 32)))).def_946122))
(assert (let ((.def_946125 (= E_2 (_ bv1 32)))).def_946125))
(assert (let ((.def_946128 (= E_M (_ bv1 32)))).def_946128))
(assert (let ((.def_946131 (= E_7 (_ bv1 32)))).def_946131))
(assert (let ((.def_946134 (= t6_st (_ bv0 32)))).def_946134))
(assert (let ((.def_946137 (= E_8 (_ bv1 32)))).def_946137))
(assert (let ((.def_946140 (= t2_st (_ bv0 32)))).def_946140))
(assert (let ((.def_928480 (= m_st (_ bv0 32)))).def_928480))
(assert (let ((.def_1008343 (= local (_ bv0 32)))).def_1008343))
(assert (let ((.def_1008345 (= token (_ bv0 32)))).def_1008345))
(assert (let ((.def_1008347 (= E_7 (_ bv2 32)))).def_1008347))
(assert (let ((.def_1008349 (= E_4 (_ bv2 32)))).def_1008349))
(assert (let ((.def_1008351 (= E_2 (_ bv2 32)))).def_1008351))
(assert (let ((.def_1008353 (= E_3 (_ bv2 32)))).def_1008353))
(assert (let ((.def_1008355 (= E_6 (_ bv2 32)))).def_1008355))

