(set-info :source |printed by MathSAT|)
(declare-fun a20 () (_ BitVec 32))
(declare-fun a9 () (_ BitVec 32))
(declare-fun a25 () (_ BitVec 32))
(declare-fun a12 () (_ BitVec 32))
(declare-fun a15 () (_ BitVec 32))
(declare-fun a16 () (_ BitVec 32))
(declare-fun a2 () (_ BitVec 32))
(declare-fun a27 () (_ BitVec 32))
(declare-fun |calculate_output6::input| () (_ BitVec 32))
(declare-fun |calculate_output7::input| () (_ BitVec 32))
(declare-fun |calculate_output5::input| () (_ BitVec 32))
(declare-fun |calculate_output2::input| () (_ BitVec 32))
(declare-fun |calculate_output8::input| () (_ BitVec 32))
(declare-fun |calculate_output3::input| () (_ BitVec 32))
(declare-fun |calculate_output4::input| () (_ BitVec 32))

*:
(assert (let ((.def_106310 (= a20 (_ bv5 32)))).def_106310))

calculate_output8 N29701:
(assert false)
(assert (let ((.def_106310 (= a20 (_ bv5 32)))).def_106310))

main1 N30136:
(assert (let ((.def_153194 (= a9 (_ bv18 32)))).def_153194))
(assert (let ((.def_106310 (= a20 (_ bv5 32)))).def_106310))
(assert (let ((.def_339893 (= a25 (_ bv1 32)))).def_339893))
(assert (let ((.def_339896 (= a12 (_ bv4 32)))).def_339896))
(assert (let ((.def_339899 (= a15 (_ bv1 32)))).def_339899))
(assert (let ((.def_339902 (= a16 (_ bv1 32)))).def_339902))
(assert (let ((.def_339905 (= a2 (_ bv10 32)))).def_339905))
(assert (let ((.def_339908 (= a27 (_ bv1 32)))).def_339908))
(assert (let ((.def_339910 (= a20 (_ bv6 32)))).def_339910))
(assert (let ((.def_339912 (= a2 (_ bv13 32)))).def_339912))
(assert (let ((.def_339914 (= a12 (_ bv2 32)))).def_339914))
(assert (let ((.def_339916 (= a2 (_ bv12 32)))).def_339916))
(assert (let ((.def_339918 (= a2 (_ bv11 32)))).def_339918))
(assert (let ((.def_339920 (= a9 (_ bv16 32)))).def_339920))
(assert (let ((.def_339922 (= a9 (_ bv17 32)))).def_339922))
(assert (let ((.def_1098498 (= a20 (_ bv7 32)))).def_1098498))
(assert (let ((.def_1098500 (= a2 (_ bv9 32)))).def_1098500))
(assert (let ((.def_1098502 (= a12 (_ bv6 32)))).def_1098502))
(assert (let ((.def_1098504 (= a12 (_ bv5 32)))).def_1098504))
(assert (let ((.def_1098506 (= a12 (_ bv3 32)))).def_1098506))
(assert (let ((.def_1098509 (= |calculate_output6::input| (_ bv1 32)))).def_1098509))
(assert (let ((.def_1098512 (= |calculate_output7::input| (_ bv1 32)))).def_1098512))
(assert (let ((.def_1098514 (= |calculate_output6::input| (_ bv4 32)))).def_1098514))
(assert (let ((.def_1098516 (= |calculate_output6::input| (_ bv3 32)))).def_1098516))
(assert (let ((.def_1098518 (= |calculate_output6::input| (_ bv6 32)))).def_1098518))
(assert (let ((.def_1098520 (= |calculate_output6::input| |calculate_output7::input|))).def_1098520))
(assert (let ((.def_1098522 (= |calculate_output7::input| (_ bv4 32)))).def_1098522))
(assert (let ((.def_1098524 (= |calculate_output7::input| (_ bv3 32)))).def_1098524))
(assert (let ((.def_1098527 (= |calculate_output5::input| (_ bv4 32)))).def_1098527))
(assert (let ((.def_1098529 (= |calculate_output6::input| |calculate_output5::input|))).def_1098529))
(assert (let ((.def_1098531 (= |calculate_output7::input| (_ bv6 32)))).def_1098531))
(assert (let ((.def_1098534 (= |calculate_output2::input| (_ bv6 32)))).def_1098534))
(assert (let ((.def_1098536 (= |calculate_output2::input| (_ bv4 32)))).def_1098536))
(assert (let ((.def_1098538 (= |calculate_output2::input| (_ bv1 32)))).def_1098538))
(assert (let ((.def_1098540 (= |calculate_output2::input| (_ bv2 32)))).def_1098540))
(assert (let ((.def_1098543 (= |calculate_output7::input| |calculate_output8::input|))).def_1098543))
(assert (let ((.def_1098545 (= |calculate_output8::input| (_ bv6 32)))).def_1098545))
(assert (let ((.def_1098547 (= |calculate_output8::input| (_ bv1 32)))).def_1098547))
(assert (let ((.def_1098549 (= |calculate_output2::input| (_ bv3 32)))).def_1098549))
(assert (let ((.def_1098552 (= |calculate_output3::input| (_ bv3 32)))).def_1098552))
(assert (let ((.def_1098554 (= |calculate_output2::input| |calculate_output3::input|))).def_1098554))
(assert (let ((.def_1098557 (= |calculate_output4::input| (_ bv2 32)))).def_1098557))
(assert (let ((.def_1098559 (= |calculate_output2::input| |calculate_output4::input|))).def_1098559))
(assert (let ((.def_1098561 (= |calculate_output3::input| (_ bv5 32)))).def_1098561))
(assert (let ((.def_1098563 (= |calculate_output3::input| (_ bv1 32)))).def_1098563))
(assert (let ((.def_1098565 (= |calculate_output3::input| (_ bv6 32)))).def_1098565))
(assert (let ((.def_1098567 (= |calculate_output3::input| |calculate_output4::input|))).def_1098567))
(assert (let ((.def_1098569 (= |calculate_output4::input| (_ bv1 32)))).def_1098569))
(assert (let ((.def_1098571 (= |calculate_output4::input| (_ bv3 32)))).def_1098571))

