(set-info :source |printed by MathSAT|)
(declare-fun a20 () (_ BitVec 32))
(declare-fun a25 () (_ BitVec 32))
(declare-fun a12 () (_ BitVec 32))
(declare-fun a15 () (_ BitVec 32))
(declare-fun a16 () (_ BitVec 32))
(declare-fun a2 () (_ BitVec 32))
(declare-fun a27 () (_ BitVec 32))
(declare-fun a9 () (_ BitVec 32))
(declare-fun m_pc () (_ BitVec 32))
(declare-fun t1_pc () (_ BitVec 32))
(declare-fun t2_pc () (_ BitVec 32))
(declare-fun t3_pc () (_ BitVec 32))
(declare-fun t4_pc () (_ BitVec 32))
(declare-fun t5_pc () (_ BitVec 32))
(declare-fun t6_pc () (_ BitVec 32))
(declare-fun t7_pc () (_ BitVec 32))
(declare-fun t8_pc () (_ BitVec 32))
(declare-fun t9_pc () (_ BitVec 32))
(declare-fun m_st () (_ BitVec 32))
(declare-fun E_1 () (_ BitVec 32))
(declare-fun E_2 () (_ BitVec 32))
(declare-fun E_9 () (_ BitVec 32))
(declare-fun E_7 () (_ BitVec 32))
(declare-fun E_5 () (_ BitVec 32))
(declare-fun E_4 () (_ BitVec 32))
(declare-fun E_3 () (_ BitVec 32))
(declare-fun E_M () (_ BitVec 32))
(declare-fun E_8 () (_ BitVec 32))
(declare-fun E_6 () (_ BitVec 32))
(declare-fun t3_st () (_ BitVec 32))
(declare-fun t4_st () (_ BitVec 32))
(declare-fun t1_st () (_ BitVec 32))
(declare-fun t6_st () (_ BitVec 32))
(declare-fun t7_st () (_ BitVec 32))
(declare-fun t5_st () (_ BitVec 32))
(declare-fun t2_st () (_ BitVec 32))
(declare-fun t9_st () (_ BitVec 32))
(declare-fun t8_st () (_ BitVec 32))
(declare-fun local () (_ BitVec 32))
(declare-fun token () (_ BitVec 32))

*:
(assert (let ((.def_107321 (= a20 (_ bv5 32)))).def_107321))

calculate_output8 N29965:
(assert false)
(assert (let ((.def_107321 (= a20 (_ bv5 32)))).def_107321))

main1 N30136:
(assert (let ((.def_107321 (= a20 (_ bv5 32)))).def_107321))
(assert (let ((.def_154742 (= a25 (_ bv1 32)))).def_154742))
(assert (let ((.def_154745 (= a12 (_ bv4 32)))).def_154745))
(assert (let ((.def_154748 (= a15 (_ bv1 32)))).def_154748))
(assert (let ((.def_154751 (= a16 (_ bv1 32)))).def_154751))
(assert (let ((.def_154754 (= a2 (_ bv10 32)))).def_154754))
(assert (let ((.def_154757 (= a27 (_ bv1 32)))).def_154757))
(assert (let ((.def_154760 (= a9 (_ bv18 32)))).def_154760))
(assert (let ((.def_320707 (= a9 (_ bv17 32)))).def_320707))
(assert (let ((.def_320709 (= a2 (_ bv12 32)))).def_320709))
(assert (let ((.def_320711 (= a2 (_ bv11 32)))).def_320711))
(assert (let ((.def_320713 (= a2 (_ bv9 32)))).def_320713))
(assert (let ((.def_320715 (= a12 (_ bv3 32)))).def_320715))
(assert (let ((.def_320717 (= a20 (_ bv6 32)))).def_320717))
(assert (let ((.def_320719 (= a2 (_ bv13 32)))).def_320719))
(assert (let ((.def_320721 (= a9 (_ bv16 32)))).def_320721))
(assert (let ((.def_1069045 (= a12 (_ bv2 32)))).def_1069045))
(assert (let ((.def_1069047 (= a20 (_ bv7 32)))).def_1069047))
(assert (let ((.def_1069049 (= a12 (_ bv6 32)))).def_1069049))
(assert (let ((.def_1069051 (= a12 (_ bv5 32)))).def_1069051))

error N30154:
(assert false)
(assert (let ((.def_107321 (= a20 (_ bv5 32)))).def_107321))

eval N30720:
(assert (let ((.def_1210748 (= m_pc (_ bv0 32)))).def_1210748))
(assert (let ((.def_107321 (= a20 (_ bv5 32)))).def_107321))
(assert (let ((.def_1218500 (= t1_pc (_ bv0 32)))).def_1218500))
(assert (let ((.def_1218503 (= t2_pc (_ bv0 32)))).def_1218503))
(assert (let ((.def_1218506 (= t3_pc (_ bv0 32)))).def_1218506))
(assert (let ((.def_1218509 (= t4_pc (_ bv0 32)))).def_1218509))
(assert (let ((.def_1218512 (= t5_pc (_ bv0 32)))).def_1218512))
(assert (let ((.def_1218515 (= t6_pc (_ bv0 32)))).def_1218515))
(assert (let ((.def_1218518 (= t7_pc (_ bv0 32)))).def_1218518))
(assert (let ((.def_1218521 (= t8_pc (_ bv0 32)))).def_1218521))
(assert (let ((.def_1218524 (= t9_pc (_ bv0 32)))).def_1218524))
(assert (let ((.def_1218526 (= m_pc (_ bv1 32)))).def_1218526))
(assert (let ((.def_1218528 (= t1_pc (_ bv1 32)))).def_1218528))
(assert (let ((.def_1218530 (= t2_pc (_ bv1 32)))).def_1218530))
(assert (let ((.def_1218532 (= t3_pc (_ bv1 32)))).def_1218532))
(assert (let ((.def_1218534 (= t4_pc (_ bv1 32)))).def_1218534))
(assert (let ((.def_1218536 (= t5_pc (_ bv1 32)))).def_1218536))
(assert (let ((.def_1218538 (= t6_pc (_ bv1 32)))).def_1218538))
(assert (let ((.def_1218540 (= t7_pc (_ bv1 32)))).def_1218540))
(assert (let ((.def_1218542 (= t8_pc (_ bv1 32)))).def_1218542))
(assert (let ((.def_1218544 (= t9_pc (_ bv1 32)))).def_1218544))
(assert (let ((.def_1218547 (= m_st (_ bv0 32)))).def_1218547))
(assert (let ((.def_1247547 (= E_1 (_ bv1 32)))).def_1247547))
(assert (let ((.def_1247549 (= E_1 (_ bv2 32)))).def_1247549))
(assert (let ((.def_1247552 (= E_2 (_ bv1 32)))).def_1247552))
(assert (let ((.def_1247555 (= E_9 (_ bv1 32)))).def_1247555))
(assert (let ((.def_1247558 (= E_7 (_ bv1 32)))).def_1247558))
(assert (let ((.def_1247561 (= E_5 (_ bv1 32)))).def_1247561))
(assert (let ((.def_1247564 (= E_4 (_ bv1 32)))).def_1247564))
(assert (let ((.def_1247567 (= E_3 (_ bv1 32)))).def_1247567))
(assert (let ((.def_1247570 (= E_M (_ bv1 32)))).def_1247570))
(assert (let ((.def_1247573 (= E_8 (_ bv1 32)))).def_1247573))
(assert (let ((.def_1247576 (= E_6 (_ bv1 32)))).def_1247576))
(assert (let ((.def_1247579 (= t3_st (_ bv0 32)))).def_1247579))
(assert (let ((.def_1247582 (= t4_st (_ bv0 32)))).def_1247582))
(assert (let ((.def_1247585 (= t1_st (_ bv0 32)))).def_1247585))
(assert (let ((.def_1247588 (= t6_st (_ bv0 32)))).def_1247588))
(assert (let ((.def_1247591 (= t7_st (_ bv0 32)))).def_1247591))
(assert (let ((.def_1247594 (= t5_st (_ bv0 32)))).def_1247594))
(assert (let ((.def_1247597 (= t2_st (_ bv0 32)))).def_1247597))
(assert (let ((.def_1247600 (= t9_st (_ bv0 32)))).def_1247600))
(assert (let ((.def_1247603 (= t8_st (_ bv0 32)))).def_1247603))
(assert (let ((.def_1247606 (bvadd (_ bv9 32) local)))(let ((.def_1247608 (= .def_1247606 token))).def_1247608)))

start_simulation N31198:
(assert (let ((.def_1210748 (= m_pc (_ bv0 32)))).def_1210748))
(assert (let ((.def_107321 (= a20 (_ bv5 32)))).def_107321))
(assert (let ((.def_1218500 (= t1_pc (_ bv0 32)))).def_1218500))
(assert (let ((.def_1218503 (= t2_pc (_ bv0 32)))).def_1218503))
(assert (let ((.def_1218506 (= t3_pc (_ bv0 32)))).def_1218506))
(assert (let ((.def_1218509 (= t4_pc (_ bv0 32)))).def_1218509))
(assert (let ((.def_1218512 (= t5_pc (_ bv0 32)))).def_1218512))
(assert (let ((.def_1218515 (= t6_pc (_ bv0 32)))).def_1218515))
(assert (let ((.def_1218518 (= t7_pc (_ bv0 32)))).def_1218518))
(assert (let ((.def_1218521 (= t8_pc (_ bv0 32)))).def_1218521))
(assert (let ((.def_1218524 (= t9_pc (_ bv0 32)))).def_1218524))
(assert (let ((.def_1218526 (= m_pc (_ bv1 32)))).def_1218526))
(assert (let ((.def_1218528 (= t1_pc (_ bv1 32)))).def_1218528))
(assert (let ((.def_1218530 (= t2_pc (_ bv1 32)))).def_1218530))
(assert (let ((.def_1218532 (= t3_pc (_ bv1 32)))).def_1218532))
(assert (let ((.def_1218534 (= t4_pc (_ bv1 32)))).def_1218534))
(assert (let ((.def_1218536 (= t5_pc (_ bv1 32)))).def_1218536))
(assert (let ((.def_1218538 (= t6_pc (_ bv1 32)))).def_1218538))
(assert (let ((.def_1218540 (= t7_pc (_ bv1 32)))).def_1218540))
(assert (let ((.def_1218542 (= t8_pc (_ bv1 32)))).def_1218542))
(assert (let ((.def_1218544 (= t9_pc (_ bv1 32)))).def_1218544))
(assert (let ((.def_1247547 (= E_1 (_ bv1 32)))).def_1247547))
(assert (let ((.def_1247549 (= E_1 (_ bv2 32)))).def_1247549))
(assert (let ((.def_1247552 (= E_2 (_ bv1 32)))).def_1247552))
(assert (let ((.def_1247555 (= E_9 (_ bv1 32)))).def_1247555))
(assert (let ((.def_1247558 (= E_7 (_ bv1 32)))).def_1247558))
(assert (let ((.def_1247561 (= E_5 (_ bv1 32)))).def_1247561))
(assert (let ((.def_1247564 (= E_4 (_ bv1 32)))).def_1247564))
(assert (let ((.def_1247567 (= E_3 (_ bv1 32)))).def_1247567))
(assert (let ((.def_1247570 (= E_M (_ bv1 32)))).def_1247570))
(assert (let ((.def_1247573 (= E_8 (_ bv1 32)))).def_1247573))
(assert (let ((.def_1247576 (= E_6 (_ bv1 32)))).def_1247576))
(assert (let ((.def_1218547 (= m_st (_ bv0 32)))).def_1218547))

