(set-info :source |printed by MathSAT|)
(declare-fun a20 () (_ BitVec 32))
(declare-fun a25 () (_ BitVec 32))
(declare-fun a12 () (_ BitVec 32))
(declare-fun a15 () (_ BitVec 32))
(declare-fun a16 () (_ BitVec 32))
(declare-fun a2 () (_ BitVec 32))
(declare-fun a27 () (_ BitVec 32))
(declare-fun a9 () (_ BitVec 32))
(declare-fun m_pc () (_ BitVec 32))
(declare-fun t1_pc () (_ BitVec 32))
(declare-fun t2_pc () (_ BitVec 32))
(declare-fun t3_pc () (_ BitVec 32))
(declare-fun t4_pc () (_ BitVec 32))
(declare-fun t5_pc () (_ BitVec 32))
(declare-fun t6_pc () (_ BitVec 32))
(declare-fun t7_pc () (_ BitVec 32))
(declare-fun t8_pc () (_ BitVec 32))
(declare-fun t9_pc () (_ BitVec 32))
(declare-fun t10_pc () (_ BitVec 32))
(declare-fun t11_pc () (_ BitVec 32))
(declare-fun t12_pc () (_ BitVec 32))
(declare-fun t13_pc () (_ BitVec 32))
(declare-fun m_st () (_ BitVec 32))

*:
(assert (let ((.def_107953 (= a20 (_ bv5 32)))).def_107953))

calculate_output8 N30108:
(assert false)
(assert (let ((.def_107953 (= a20 (_ bv5 32)))).def_107953))

main1 N30136:
(assert (let ((.def_107953 (= a20 (_ bv5 32)))).def_107953))
(assert (let ((.def_155706 (= a25 (_ bv1 32)))).def_155706))
(assert (let ((.def_155709 (= a12 (_ bv4 32)))).def_155709))
(assert (let ((.def_155712 (= a15 (_ bv1 32)))).def_155712))
(assert (let ((.def_155715 (= a16 (_ bv1 32)))).def_155715))
(assert (let ((.def_155718 (= a2 (_ bv10 32)))).def_155718))
(assert (let ((.def_155721 (= a27 (_ bv1 32)))).def_155721))
(assert (let ((.def_155724 (= a9 (_ bv18 32)))).def_155724))
(assert (let ((.def_321896 (= a12 (_ bv5 32)))).def_321896))
(assert (let ((.def_321898 (= a2 (_ bv13 32)))).def_321898))
(assert (let ((.def_321900 (= a12 (_ bv2 32)))).def_321900))
(assert (let ((.def_321902 (= a2 (_ bv12 32)))).def_321902))
(assert (let ((.def_321904 (= a12 (_ bv3 32)))).def_321904))
(assert (let ((.def_321906 (= a9 (_ bv16 32)))).def_321906))
(assert (let ((.def_321908 (= a20 (_ bv7 32)))).def_321908))
(assert (let ((.def_321910 (= a2 (_ bv9 32)))).def_321910))
(assert (let ((.def_321912 (= a9 (_ bv17 32)))).def_321912))

error N30154:
(assert false)
(assert (let ((.def_107953 (= a20 (_ bv5 32)))).def_107953))

eval N30936:
(assert (let ((.def_747995 (= m_pc (_ bv0 32)))).def_747995))
(assert (let ((.def_107953 (= a20 (_ bv5 32)))).def_107953))
(assert (let ((.def_762398 (= t1_pc (_ bv0 32)))).def_762398))
(assert (let ((.def_762401 (= t2_pc (_ bv0 32)))).def_762401))
(assert (let ((.def_762404 (= t3_pc (_ bv0 32)))).def_762404))
(assert (let ((.def_762407 (= t4_pc (_ bv0 32)))).def_762407))
(assert (let ((.def_762410 (= t5_pc (_ bv0 32)))).def_762410))
(assert (let ((.def_762413 (= t6_pc (_ bv0 32)))).def_762413))
(assert (let ((.def_762416 (= t7_pc (_ bv0 32)))).def_762416))
(assert (let ((.def_762419 (= t8_pc (_ bv0 32)))).def_762419))
(assert (let ((.def_762422 (= t9_pc (_ bv0 32)))).def_762422))
(assert (let ((.def_762425 (= t10_pc (_ bv0 32)))).def_762425))
(assert (let ((.def_762428 (= t11_pc (_ bv0 32)))).def_762428))
(assert (let ((.def_762431 (= t12_pc (_ bv0 32)))).def_762431))
(assert (let ((.def_762434 (= t13_pc (_ bv0 32)))).def_762434))
(assert (let ((.def_762436 (= m_pc (_ bv1 32)))).def_762436))
(assert (let ((.def_762438 (= t1_pc (_ bv1 32)))).def_762438))
(assert (let ((.def_762440 (= t2_pc (_ bv1 32)))).def_762440))
(assert (let ((.def_762442 (= t3_pc (_ bv1 32)))).def_762442))
(assert (let ((.def_762444 (= t4_pc (_ bv1 32)))).def_762444))
(assert (let ((.def_762446 (= t5_pc (_ bv1 32)))).def_762446))
(assert (let ((.def_762448 (= t6_pc (_ bv1 32)))).def_762448))
(assert (let ((.def_762450 (= t7_pc (_ bv1 32)))).def_762450))
(assert (let ((.def_762452 (= t8_pc (_ bv1 32)))).def_762452))
(assert (let ((.def_762454 (= t9_pc (_ bv1 32)))).def_762454))
(assert (let ((.def_762456 (= t10_pc (_ bv1 32)))).def_762456))
(assert (let ((.def_762458 (= t11_pc (_ bv1 32)))).def_762458))
(assert (let ((.def_762460 (= t12_pc (_ bv1 32)))).def_762460))
(assert (let ((.def_762462 (= t13_pc (_ bv1 32)))).def_762462))
(assert (let ((.def_762465 (= m_st (_ bv0 32)))).def_762465))

start_simulation N31578:
(assert (let ((.def_747995 (= m_pc (_ bv0 32)))).def_747995))
(assert (let ((.def_107953 (= a20 (_ bv5 32)))).def_107953))
(assert (let ((.def_762398 (= t1_pc (_ bv0 32)))).def_762398))
(assert (let ((.def_762401 (= t2_pc (_ bv0 32)))).def_762401))
(assert (let ((.def_762404 (= t3_pc (_ bv0 32)))).def_762404))
(assert (let ((.def_762407 (= t4_pc (_ bv0 32)))).def_762407))
(assert (let ((.def_762410 (= t5_pc (_ bv0 32)))).def_762410))
(assert (let ((.def_762413 (= t6_pc (_ bv0 32)))).def_762413))
(assert (let ((.def_762416 (= t7_pc (_ bv0 32)))).def_762416))
(assert (let ((.def_762419 (= t8_pc (_ bv0 32)))).def_762419))
(assert (let ((.def_762422 (= t9_pc (_ bv0 32)))).def_762422))
(assert (let ((.def_762425 (= t10_pc (_ bv0 32)))).def_762425))
(assert (let ((.def_762428 (= t11_pc (_ bv0 32)))).def_762428))
(assert (let ((.def_762431 (= t12_pc (_ bv0 32)))).def_762431))
(assert (let ((.def_762434 (= t13_pc (_ bv0 32)))).def_762434))
(assert (let ((.def_762436 (= m_pc (_ bv1 32)))).def_762436))
(assert (let ((.def_762438 (= t1_pc (_ bv1 32)))).def_762438))
(assert (let ((.def_762440 (= t2_pc (_ bv1 32)))).def_762440))
(assert (let ((.def_762442 (= t3_pc (_ bv1 32)))).def_762442))
(assert (let ((.def_762444 (= t4_pc (_ bv1 32)))).def_762444))
(assert (let ((.def_762446 (= t5_pc (_ bv1 32)))).def_762446))
(assert (let ((.def_762448 (= t6_pc (_ bv1 32)))).def_762448))
(assert (let ((.def_762450 (= t7_pc (_ bv1 32)))).def_762450))
(assert (let ((.def_762452 (= t8_pc (_ bv1 32)))).def_762452))
(assert (let ((.def_762454 (= t9_pc (_ bv1 32)))).def_762454))
(assert (let ((.def_762456 (= t10_pc (_ bv1 32)))).def_762456))
(assert (let ((.def_762458 (= t11_pc (_ bv1 32)))).def_762458))
(assert (let ((.def_762460 (= t12_pc (_ bv1 32)))).def_762460))
(assert (let ((.def_762462 (= t13_pc (_ bv1 32)))).def_762462))

