(set-info :source |printed by MathSAT|)
(declare-fun c_num_read () (_ BitVec 32))
(declare-fun p_num_write () (_ BitVec 32))
(declare-fun c_last_read () (_ BitVec 32))
(declare-fun p_last_write () (_ BitVec 32))
(declare-fun c_dr_pc () (_ BitVec 32))
(declare-fun q_free () (_ BitVec 32))
(declare-fun q_buf_0 () (_ BitVec 32))
(declare-fun c_dr_st () (_ BitVec 32))
(declare-fun q_req_up () (_ BitVec 32))
(declare-fun q_write_ev () (_ BitVec 32))
(declare-fun q_read_ev () (_ BitVec 32))
(declare-fun p_dw_pc () (_ BitVec 32))
(declare-fun p_dw_st () (_ BitVec 32))
(declare-fun m_pc () (_ BitVec 32))
(declare-fun t1_pc () (_ BitVec 32))
(declare-fun t2_pc () (_ BitVec 32))
(declare-fun t3_pc () (_ BitVec 32))
(declare-fun t4_pc () (_ BitVec 32))
(declare-fun t5_pc () (_ BitVec 32))
(declare-fun t6_pc () (_ BitVec 32))
(declare-fun t7_pc () (_ BitVec 32))
(declare-fun t8_pc () (_ BitVec 32))
(declare-fun t9_pc () (_ BitVec 32))
(declare-fun t10_pc () (_ BitVec 32))
(declare-fun t11_pc () (_ BitVec 32))
(declare-fun t12_pc () (_ BitVec 32))
(declare-fun m_st () (_ BitVec 32))

*:
(assert (let ((.def_664 (= c_num_read p_num_write))).def_664))
(assert (let ((.def_673 (= c_last_read p_last_write))).def_673))

error1 N4:
(assert false)
(assert (let ((.def_664 (= c_num_read p_num_write))).def_664))
(assert (let ((.def_673 (= c_last_read p_last_write))).def_673))

do_write_p N78:
(assert (let ((.def_860 (= c_dr_pc (_ bv0 32)))).def_860))
(assert (let ((.def_664 (= c_num_read p_num_write))).def_664))
(assert (let ((.def_673 (= c_last_read p_last_write))).def_673))
(assert (let ((.def_928 (= q_free (_ bv1 32)))).def_928))
(assert false)
(assert (let ((.def_1112 (= p_last_write q_buf_0))).def_1112))
(assert (let ((.def_1252 (= c_dr_pc (_ bv1 32)))).def_1252))
(assert (let ((.def_1254 (= q_free (_ bv0 32)))).def_1254))
(assert (let ((.def_1258 (bvadd (_ bv1 32) c_num_read)))(let ((.def_1259 (= p_num_write .def_1258))).def_1259)))
(assert (let ((.def_1940 (= c_dr_st (_ bv0 32)))).def_1940))
(assert (let ((.def_4340 (= q_req_up (_ bv1 32)))).def_4340))
(assert (let ((.def_5973 (= q_write_ev (_ bv1 32)))).def_5973))
(assert (let ((.def_5975 (= q_write_ev (_ bv0 32)))).def_5975))
(assert (let ((.def_8310 (= q_read_ev (_ bv1 32)))).def_8310))
(assert (let ((.def_8312 (= q_read_ev (_ bv0 32)))).def_8312))

do_read_c N112:
(assert (let ((.def_928 (= q_free (_ bv1 32)))).def_928))
(assert (let ((.def_664 (= c_num_read p_num_write))).def_664))
(assert (let ((.def_673 (= c_last_read p_last_write))).def_673))
(assert (let ((.def_1112 (= p_last_write q_buf_0))).def_1112))
(assert (let ((.def_1258 (bvadd (_ bv1 32) c_num_read)))(let ((.def_1259 (= p_num_write .def_1258))).def_1259)))
(assert false)
(assert (let ((.def_1254 (= q_free (_ bv0 32)))).def_1254))
(assert (let ((.def_5973 (= q_write_ev (_ bv1 32)))).def_5973))
(assert (let ((.def_5975 (= q_write_ev (_ bv0 32)))).def_5975))
(assert (let ((.def_1256 (= p_dw_pc (_ bv1 32)))).def_1256))
(assert (let ((.def_4340 (= q_req_up (_ bv1 32)))).def_4340))
(assert (let ((.def_2414 (= p_dw_st (_ bv0 32)))).def_2414))
(assert (let ((.def_8310 (= q_read_ev (_ bv1 32)))).def_8310))
(assert (let ((.def_8312 (= q_read_ev (_ bv0 32)))).def_8312))

eval1 N228:
(assert (let ((.def_860 (= c_dr_pc (_ bv0 32)))).def_860))
(assert (let ((.def_664 (= c_num_read p_num_write))).def_664))
(assert (let ((.def_673 (= c_last_read p_last_write))).def_673))
(assert (let ((.def_928 (= q_free (_ bv1 32)))).def_928))
(assert (let ((.def_1070 (= p_dw_pc (_ bv0 32)))).def_1070))
(assert (let ((.def_1252 (= c_dr_pc (_ bv1 32)))).def_1252))
(assert (let ((.def_1254 (= q_free (_ bv0 32)))).def_1254))
(assert (let ((.def_1256 (= p_dw_pc (_ bv1 32)))).def_1256))
(assert (let ((.def_2414 (= p_dw_st (_ bv0 32)))).def_2414))
(assert (let ((.def_1112 (= p_last_write q_buf_0))).def_1112))
(assert (let ((.def_1258 (bvadd (_ bv1 32) c_num_read)))(let ((.def_1259 (= p_num_write .def_1258))).def_1259)))
(assert (let ((.def_1940 (= c_dr_st (_ bv0 32)))).def_1940))
(assert (let ((.def_4340 (= q_req_up (_ bv1 32)))).def_4340))
(assert (let ((.def_5973 (= q_write_ev (_ bv1 32)))).def_5973))
(assert (let ((.def_5975 (= q_write_ev (_ bv0 32)))).def_5975))
(assert (let ((.def_8310 (= q_read_ev (_ bv1 32)))).def_8310))
(assert (let ((.def_8312 (= q_read_ev (_ bv0 32)))).def_8312))

start_simulation1 N283:
(assert (let ((.def_860 (= c_dr_pc (_ bv0 32)))).def_860))
(assert (let ((.def_664 (= c_num_read p_num_write))).def_664))
(assert (let ((.def_673 (= c_last_read p_last_write))).def_673))
(assert (let ((.def_928 (= q_free (_ bv1 32)))).def_928))
(assert (let ((.def_1070 (= p_dw_pc (_ bv0 32)))).def_1070))
(assert (let ((.def_1252 (= c_dr_pc (_ bv1 32)))).def_1252))
(assert (let ((.def_1254 (= q_free (_ bv0 32)))).def_1254))
(assert (let ((.def_1256 (= p_dw_pc (_ bv1 32)))).def_1256))
(assert (let ((.def_1940 (= c_dr_st (_ bv0 32)))).def_1940))
(assert (let ((.def_2414 (= p_dw_st (_ bv0 32)))).def_2414))
(assert (let ((.def_1112 (= p_last_write q_buf_0))).def_1112))
(assert (let ((.def_5973 (= q_write_ev (_ bv1 32)))).def_5973))
(assert (let ((.def_5975 (= q_write_ev (_ bv0 32)))).def_5975))
(assert (let ((.def_8310 (= q_read_ev (_ bv1 32)))).def_8310))
(assert (let ((.def_8312 (= q_read_ev (_ bv0 32)))).def_8312))
(assert (let ((.def_1258 (bvadd (_ bv1 32) c_num_read)))(let ((.def_1259 (= p_num_write .def_1258))).def_1259)))

error2 N328:
(assert false)
(assert (let ((.def_664 (= c_num_read p_num_write))).def_664))
(assert (let ((.def_673 (= c_last_read p_last_write))).def_673))

eval2 N1056:
(assert (let ((.def_11750 (= m_pc (_ bv0 32)))).def_11750))
(assert (let ((.def_664 (= c_num_read p_num_write))).def_664))
(assert (let ((.def_673 (= c_last_read p_last_write))).def_673))
(assert (let ((.def_24297 (= t1_pc (_ bv0 32)))).def_24297))
(assert (let ((.def_24300 (= t2_pc (_ bv0 32)))).def_24300))
(assert (let ((.def_24303 (= t3_pc (_ bv0 32)))).def_24303))
(assert (let ((.def_24306 (= t4_pc (_ bv0 32)))).def_24306))
(assert (let ((.def_24309 (= t5_pc (_ bv0 32)))).def_24309))
(assert (let ((.def_24312 (= t6_pc (_ bv0 32)))).def_24312))
(assert (let ((.def_24315 (= t7_pc (_ bv0 32)))).def_24315))
(assert (let ((.def_24318 (= t8_pc (_ bv0 32)))).def_24318))
(assert (let ((.def_24321 (= t9_pc (_ bv0 32)))).def_24321))
(assert (let ((.def_24324 (= t10_pc (_ bv0 32)))).def_24324))
(assert (let ((.def_24327 (= t11_pc (_ bv0 32)))).def_24327))
(assert (let ((.def_24330 (= t12_pc (_ bv0 32)))).def_24330))
(assert (let ((.def_24332 (= m_pc (_ bv1 32)))).def_24332))
(assert (let ((.def_24334 (= t1_pc (_ bv1 32)))).def_24334))
(assert (let ((.def_24336 (= t2_pc (_ bv1 32)))).def_24336))
(assert (let ((.def_24338 (= t3_pc (_ bv1 32)))).def_24338))
(assert (let ((.def_24340 (= t4_pc (_ bv1 32)))).def_24340))
(assert (let ((.def_24342 (= t5_pc (_ bv1 32)))).def_24342))
(assert (let ((.def_24344 (= t6_pc (_ bv1 32)))).def_24344))
(assert (let ((.def_24346 (= t7_pc (_ bv1 32)))).def_24346))
(assert (let ((.def_24348 (= t8_pc (_ bv1 32)))).def_24348))
(assert (let ((.def_24350 (= t9_pc (_ bv1 32)))).def_24350))
(assert (let ((.def_24352 (= t10_pc (_ bv1 32)))).def_24352))
(assert (let ((.def_24354 (= t11_pc (_ bv1 32)))).def_24354))
(assert (let ((.def_24356 (= t12_pc (_ bv1 32)))).def_24356))
(assert (let ((.def_24359 (= m_st (_ bv0 32)))).def_24359))

start_simulation2 N1657:
(assert (let ((.def_11750 (= m_pc (_ bv0 32)))).def_11750))
(assert (let ((.def_664 (= c_num_read p_num_write))).def_664))
(assert (let ((.def_673 (= c_last_read p_last_write))).def_673))
(assert (let ((.def_24297 (= t1_pc (_ bv0 32)))).def_24297))
(assert (let ((.def_24300 (= t2_pc (_ bv0 32)))).def_24300))
(assert (let ((.def_24303 (= t3_pc (_ bv0 32)))).def_24303))
(assert (let ((.def_24306 (= t4_pc (_ bv0 32)))).def_24306))
(assert (let ((.def_24309 (= t5_pc (_ bv0 32)))).def_24309))
(assert (let ((.def_24312 (= t6_pc (_ bv0 32)))).def_24312))
(assert (let ((.def_24315 (= t7_pc (_ bv0 32)))).def_24315))
(assert (let ((.def_24318 (= t8_pc (_ bv0 32)))).def_24318))
(assert (let ((.def_24321 (= t9_pc (_ bv0 32)))).def_24321))
(assert (let ((.def_24324 (= t10_pc (_ bv0 32)))).def_24324))
(assert (let ((.def_24327 (= t11_pc (_ bv0 32)))).def_24327))
(assert (let ((.def_24330 (= t12_pc (_ bv0 32)))).def_24330))
(assert (let ((.def_24332 (= m_pc (_ bv1 32)))).def_24332))
(assert (let ((.def_24334 (= t1_pc (_ bv1 32)))).def_24334))
(assert (let ((.def_24336 (= t2_pc (_ bv1 32)))).def_24336))
(assert (let ((.def_24338 (= t3_pc (_ bv1 32)))).def_24338))
(assert (let ((.def_24340 (= t4_pc (_ bv1 32)))).def_24340))
(assert (let ((.def_24342 (= t5_pc (_ bv1 32)))).def_24342))
(assert (let ((.def_24344 (= t6_pc (_ bv1 32)))).def_24344))
(assert (let ((.def_24346 (= t7_pc (_ bv1 32)))).def_24346))
(assert (let ((.def_24348 (= t8_pc (_ bv1 32)))).def_24348))
(assert (let ((.def_24350 (= t9_pc (_ bv1 32)))).def_24350))
(assert (let ((.def_24352 (= t10_pc (_ bv1 32)))).def_24352))
(assert (let ((.def_24354 (= t11_pc (_ bv1 32)))).def_24354))
(assert (let ((.def_24356 (= t12_pc (_ bv1 32)))).def_24356))

