(set-info :source |printed by MathSAT|)
(declare-fun |assert::arg| () (_ BitVec 8))
(declare-fun st1 () (_ BitVec 8))
(declare-fun st2 () (_ BitVec 8))
(declare-fun st3 () (_ BitVec 8))
(declare-fun st4 () (_ BitVec 8))
(declare-fun st5 () (_ BitVec 8))
(declare-fun r1 () (_ BitVec 8))
(declare-fun p3_new () (_ BitVec 8))
(declare-fun nomsg () (_ BitVec 8))
(declare-fun p2_new () (_ BitVec 8))
(declare-fun p4_new () (_ BitVec 8))
(declare-fun mode1 () (_ BitVec 8))
(declare-fun mode2 () (_ BitVec 8))
(declare-fun mode3 () (_ BitVec 8))
(declare-fun mode4 () (_ BitVec 8))
(declare-fun mode5 () (_ BitVec 8))
(declare-fun send5 () (_ BitVec 8))
(declare-fun id1 () (_ BitVec 8))
(declare-fun id5 () (_ BitVec 8))
(declare-fun send4 () (_ BitVec 8))
(declare-fun id2 () (_ BitVec 8))
(declare-fun send1 () (_ BitVec 8))
(declare-fun id3 () (_ BitVec 8))
(declare-fun send2 () (_ BitVec 8))
(declare-fun id4 () (_ BitVec 8))
(declare-fun send3 () (_ BitVec 8))
(declare-fun p5_new () (_ BitVec 8))
(declare-fun p1_new () (_ BitVec 8))
(declare-fun p5_old () (_ BitVec 8))
(declare-fun p4_old () (_ BitVec 8))
(declare-fun p1_old () (_ BitVec 8))
(declare-fun p2_old () (_ BitVec 8))
(declare-fun p3_old () (_ BitVec 8))
(declare-fun |node4::__CPAchecker_TMP_0| () (_ BitVec 32))
(declare-fun |node3::__CPAchecker_TMP_0| () (_ BitVec 32))
(declare-fun |node1::__CPAchecker_TMP_0| () (_ BitVec 32))
(declare-fun |node2::__CPAchecker_TMP_0| () (_ BitVec 32))
(declare-fun |node5::__CPAchecker_TMP_0| () (_ BitVec 32))

assert:
(assert (let ((.def_2159 (= |assert::arg| (_ bv0 8)))).def_2159))

main1 N338:
(assert (let ((.def_2414 (= st1 (_ bv0 8)))).def_2414))
(assert (let ((.def_2417 (= st2 (_ bv0 8)))).def_2417))
(assert (let ((.def_2420 (= st3 (_ bv0 8)))).def_2420))
(assert (let ((.def_2423 (= st4 (_ bv0 8)))).def_2423))
(assert (let ((.def_2426 (= st5 (_ bv0 8)))).def_2426))
(assert (let ((.def_2429 (= r1 (_ bv0 8)))).def_2429))
(assert (let ((.def_2433 (= p3_new nomsg))).def_2433))
(assert (let ((.def_2436 (= nomsg p2_new))).def_2436))
(assert (let ((.def_2439 (= nomsg p4_new))).def_2439))
(assert (let ((.def_2442 (= mode1 (_ bv0 8)))).def_2442))
(assert (let ((.def_2445 (= mode2 (_ bv0 8)))).def_2445))
(assert (let ((.def_2448 (= mode3 (_ bv0 8)))).def_2448))
(assert (let ((.def_2451 (= mode4 (_ bv0 8)))).def_2451))
(assert (let ((.def_2454 (= mode5 (_ bv0 8)))).def_2454))
(assert (let ((.def_4283 ((_ sign_extend 24) id1)))(let ((.def_4281 ((_ sign_extend 24) send5)))(let ((.def_4284 (= .def_4281 .def_4283))).def_4284))))
(assert (let ((.def_4289 ((_ sign_extend 24) send4)))(let ((.def_4287 ((_ sign_extend 24) id5)))(let ((.def_4290 (= .def_4287 .def_4289))).def_4290))))
(assert (let ((.def_4292 (= st1 st5))).def_4292))
(assert (let ((.def_4294 (= st2 st5))).def_4294))
(assert (let ((.def_4296 (= st3 st5))).def_4296))
(assert (let ((.def_4298 (= st4 st5))).def_4298))
(assert (let ((.def_4303 ((_ sign_extend 24) send1)))(let ((.def_4301 ((_ sign_extend 24) id2)))(let ((.def_4304 (= .def_4301 .def_4303))).def_4304))))
(assert (let ((.def_4308 (= id3 send2))).def_4308))
(assert (let ((.def_4311 ((_ sign_extend 24) send2)))(let ((.def_4310 ((_ sign_extend 24) id3)))(let ((.def_4312 (= .def_4310 .def_4311))).def_4312))))
(assert (let ((.def_4317 ((_ sign_extend 24) send3)))(let ((.def_4315 ((_ sign_extend 24) id4)))(let ((.def_4318 (= .def_4315 .def_4317))).def_4318))))
(assert (let ((.def_4320 ((_ sign_extend 24) nomsg)))(let ((.def_4317 ((_ sign_extend 24) send3)))(let ((.def_4321 (= .def_4317 .def_4320))).def_4321))))
(assert (let ((.def_4320 ((_ sign_extend 24) nomsg)))(let ((.def_4289 ((_ sign_extend 24) send4)))(let ((.def_4323 (= .def_4289 .def_4320))).def_4323))))
(assert (let ((.def_4326 (= nomsg p5_new))).def_4326))
(assert (let ((.def_4329 (= nomsg p1_new))).def_4329))
(assert (let ((.def_4332 ((_ sign_extend 24) p5_old)))(let ((.def_4283 ((_ sign_extend 24) id1)))(let ((.def_4333 (= .def_4283 .def_4332))).def_4333))))
(assert (let ((.def_4336 ((_ sign_extend 24) p4_old)))(let ((.def_4287 ((_ sign_extend 24) id5)))(let ((.def_4337 (= .def_4287 .def_4336))).def_4337))))
(assert (let ((.def_4344 ((_ sign_extend 24) st1)))(let ((.def_4343 ((_ sign_extend 24) st2)))(let ((.def_4346 (bvadd .def_4343 .def_4344)))(let ((.def_4342 ((_ sign_extend 24) st3)))(let ((.def_4348 (bvadd .def_4342 .def_4346)))(let ((.def_4341 ((_ sign_extend 24) st4)))(let ((.def_4350 (bvadd .def_4341 .def_4348)))(let ((.def_4339 ((_ sign_extend 24) st5)))(let ((.def_4340 (bvneg .def_4339)))(let ((.def_4351 (= .def_4340 .def_4350))).def_4351)))))))))))
(assert (let ((.def_4354 ((_ sign_extend 24) p1_old)))(let ((.def_4301 ((_ sign_extend 24) id2)))(let ((.def_4355 (= .def_4301 .def_4354))).def_4355))))
(assert (let ((.def_4358 ((_ sign_extend 24) p2_old)))(let ((.def_4310 ((_ sign_extend 24) id3)))(let ((.def_4359 (= .def_4310 .def_4358))).def_4359))))
(assert (let ((.def_4362 ((_ sign_extend 24) p3_old)))(let ((.def_4315 ((_ sign_extend 24) id4)))(let ((.def_4363 (= .def_4315 .def_4362))).def_4363))))
(assert (let ((.def_4343 ((_ sign_extend 24) st2)))(let ((.def_4342 ((_ sign_extend 24) st3)))(let ((.def_8324 (= .def_4342 .def_4343))).def_8324))))
(assert (let ((.def_4342 ((_ sign_extend 24) st3)))(let ((.def_4341 ((_ sign_extend 24) st4)))(let ((.def_8326 (= .def_4341 .def_4342))).def_8326))))
(assert (let ((.def_8328 (= st1 (_ bv1 8)))).def_8328))
(assert (let ((.def_4344 ((_ sign_extend 24) st1)))(let ((.def_4341 ((_ sign_extend 24) st4)))(let ((.def_8330 (= .def_4341 .def_4344))).def_8330))))
(assert (let ((.def_8332 (= st4 (_ bv1 8)))).def_8332))
(assert (let ((.def_4344 ((_ sign_extend 24) st1)))(let ((.def_4343 ((_ sign_extend 24) st2)))(let ((.def_8334 (= .def_4343 .def_4344))).def_8334))))
(assert (let ((.def_8336 (= st2 (_ bv1 8)))).def_8336))
(assert (let ((.def_4344 ((_ sign_extend 24) st1)))(let ((.def_4342 ((_ sign_extend 24) st3)))(let ((.def_8338 (= .def_4342 .def_4344))).def_8338))))
(assert (let ((.def_8340 (= st3 (_ bv1 8)))).def_8340))
(assert (let ((.def_4343 ((_ sign_extend 24) st2)))(let ((.def_4341 ((_ sign_extend 24) st4)))(let ((.def_8342 (= .def_4341 .def_4343))).def_8342))))
(assert (let ((.def_8344 ((_ zero_extend 24) r1)))(let ((.def_8345 (bvslt .def_8344 (_ bv5 32)))).def_8345)))
(assert (let ((.def_4311 ((_ sign_extend 24) send2)))(let ((.def_4315 ((_ sign_extend 24) id4)))(let ((.def_13663 (bvslt .def_4315 .def_4311))).def_13663))))
(assert (let ((.def_4311 ((_ sign_extend 24) send2)))(let ((.def_4310 ((_ sign_extend 24) id3)))(let ((.def_13665 (bvslt .def_4310 .def_4311))).def_13665))))
(assert (let ((.def_4317 ((_ sign_extend 24) send3)))(let ((.def_4315 ((_ sign_extend 24) id4)))(let ((.def_13667 (bvslt .def_4315 .def_4317))).def_13667))))
(assert (let ((.def_4315 ((_ sign_extend 24) id4)))(let ((.def_13669 ((_ extract 31 31) .def_4315)))(let ((.def_13670 (= .def_13669 (_ bv1 1)))).def_13670))))
(assert (let ((.def_4315 ((_ sign_extend 24) id4)))(let ((.def_4289 ((_ sign_extend 24) send4)))(let ((.def_13672 (= .def_4289 .def_4315))).def_13672))))
(assert (let ((.def_4315 ((_ sign_extend 24) id4)))(let ((.def_4311 ((_ sign_extend 24) send2)))(let ((.def_13674 (= .def_4311 .def_4315))).def_13674))))
(assert (let ((.def_13676 (= st1 st2))).def_13676))
(assert (let ((.def_13678 (= st1 st3))).def_13678))
(assert (let ((.def_13680 (= st1 st4))).def_13680))
(assert (let ((.def_4301 ((_ sign_extend 24) id2)))(let ((.def_4281 ((_ sign_extend 24) send5)))(let ((.def_13682 (= .def_4281 .def_4301))).def_13682))))
(assert (let ((.def_4289 ((_ sign_extend 24) send4)))(let ((.def_4283 ((_ sign_extend 24) id1)))(let ((.def_13684 (= .def_4283 .def_4289))).def_13684))))
(assert (let ((.def_4289 ((_ sign_extend 24) send4)))(let ((.def_4287 ((_ sign_extend 24) id5)))(let ((.def_13686 (bvslt .def_4287 .def_4289))).def_13686))))
(assert (let ((.def_4281 ((_ sign_extend 24) send5)))(let ((.def_4283 ((_ sign_extend 24) id1)))(let ((.def_13688 (bvslt .def_4283 .def_4281))).def_13688))))
(assert (let ((.def_4283 ((_ sign_extend 24) id1)))(let ((.def_13690 ((_ extract 31 31) .def_4283)))(let ((.def_13691 (= .def_13690 (_ bv1 1)))).def_13691))))
(assert (let ((.def_4317 ((_ sign_extend 24) send3)))(let ((.def_4287 ((_ sign_extend 24) id5)))(let ((.def_13693 (= .def_4287 .def_4317))).def_13693))))
(assert (let ((.def_4303 ((_ sign_extend 24) send1)))(let ((.def_4301 ((_ sign_extend 24) id2)))(let ((.def_13695 (bvslt .def_4301 .def_4303))).def_13695))))
(assert (let ((.def_4310 ((_ sign_extend 24) id3)))(let ((.def_4303 ((_ sign_extend 24) send1)))(let ((.def_13697 (= .def_4303 .def_4310))).def_13697))))
(assert (let ((.def_13699 (= nomsg send5))).def_13699))
(assert (let ((.def_4320 ((_ sign_extend 24) nomsg)))(let ((.def_4281 ((_ sign_extend 24) send5)))(let ((.def_13701 (= .def_4281 .def_4320))).def_13701))))
(assert (let ((.def_13703 (= nomsg send2))).def_13703))
(assert (let ((.def_4320 ((_ sign_extend 24) nomsg)))(let ((.def_4311 ((_ sign_extend 24) send2)))(let ((.def_13705 (= .def_4311 .def_4320))).def_13705))))
(assert (let ((.def_4311 ((_ sign_extend 24) send2)))(let ((.def_4301 ((_ sign_extend 24) id2)))(let ((.def_13707 (= .def_4301 .def_4311))).def_13707))))
(assert (let ((.def_4358 ((_ sign_extend 24) p2_old)))(let ((.def_4315 ((_ sign_extend 24) id4)))(let ((.def_13709 (bvslt .def_4315 .def_4358))).def_13709))))
(assert (let ((.def_4358 ((_ sign_extend 24) p2_old)))(let ((.def_4310 ((_ sign_extend 24) id3)))(let ((.def_13711 (bvslt .def_4310 .def_4358))).def_13711))))
(assert (let ((.def_4362 ((_ sign_extend 24) p3_old)))(let ((.def_4315 ((_ sign_extend 24) id4)))(let ((.def_13713 (bvslt .def_4315 .def_4362))).def_13713))))
(assert (let ((.def_4315 ((_ sign_extend 24) id4)))(let ((.def_13716 (= .def_4315 |node4::__CPAchecker_TMP_0|))).def_13716)))
(assert (let ((.def_4317 ((_ sign_extend 24) send3)))(let ((.def_13719 (= .def_4317 |node3::__CPAchecker_TMP_0|))).def_13719)))
(assert (let ((.def_13721 ((_ extract 7 0) |node3::__CPAchecker_TMP_0|)))(let ((.def_13722 (= p3_old .def_13721))).def_13722)))
(assert (let ((.def_4358 ((_ sign_extend 24) p2_old)))(let ((.def_4315 ((_ sign_extend 24) id4)))(let ((.def_13724 (= .def_4315 .def_4358))).def_13724))))
(assert (let ((.def_13726 (= id2 p5_old))).def_13726))
(assert (let ((.def_4332 ((_ sign_extend 24) p5_old)))(let ((.def_4301 ((_ sign_extend 24) id2)))(let ((.def_13728 (= .def_4301 .def_4332))).def_13728))))
(assert (let ((.def_4303 ((_ sign_extend 24) send1)))(let ((.def_13731 (= .def_4303 |node1::__CPAchecker_TMP_0|))).def_13731)))
(assert (let ((.def_13733 ((_ extract 7 0) |node1::__CPAchecker_TMP_0|)))(let ((.def_13734 (= p1_old .def_13733))).def_13734)))
(assert (let ((.def_4311 ((_ sign_extend 24) send2)))(let ((.def_13737 (= .def_4311 |node2::__CPAchecker_TMP_0|))).def_13737)))
(assert (let ((.def_13739 ((_ extract 7 0) |node2::__CPAchecker_TMP_0|)))(let ((.def_13740 (= p2_old .def_13739))).def_13740)))
(assert (let ((.def_4336 ((_ sign_extend 24) p4_old)))(let ((.def_4283 ((_ sign_extend 24) id1)))(let ((.def_13742 (= .def_4283 .def_4336))).def_13742))))
(assert (let ((.def_4336 ((_ sign_extend 24) p4_old)))(let ((.def_4287 ((_ sign_extend 24) id5)))(let ((.def_13744 (bvslt .def_4287 .def_4336))).def_13744))))
(assert (let ((.def_4332 ((_ sign_extend 24) p5_old)))(let ((.def_4283 ((_ sign_extend 24) id1)))(let ((.def_13746 (bvslt .def_4283 .def_4332))).def_13746))))
(assert (let ((.def_4281 ((_ sign_extend 24) send5)))(let ((.def_13749 (= .def_4281 |node5::__CPAchecker_TMP_0|))).def_13749)))
(assert (let ((.def_13751 ((_ extract 7 0) |node5::__CPAchecker_TMP_0|)))(let ((.def_13752 (= p5_old .def_13751))).def_13752)))
(assert (let ((.def_13754 (= send5 p5_old))).def_13754))
(assert (let ((.def_4289 ((_ sign_extend 24) send4)))(let ((.def_13756 (= .def_4289 |node4::__CPAchecker_TMP_0|))).def_13756)))
(assert (let ((.def_13758 ((_ extract 7 0) |node4::__CPAchecker_TMP_0|)))(let ((.def_13759 (= p4_old .def_13758))).def_13759)))
(assert (let ((.def_4362 ((_ sign_extend 24) p3_old)))(let ((.def_4287 ((_ sign_extend 24) id5)))(let ((.def_13761 (= .def_4287 .def_4362))).def_13761))))
(assert (let ((.def_4354 ((_ sign_extend 24) p1_old)))(let ((.def_4301 ((_ sign_extend 24) id2)))(let ((.def_13763 (bvslt .def_4301 .def_4354))).def_13763))))
(assert (let ((.def_13765 (= id2 p2_old))).def_13765))
(assert (let ((.def_4354 ((_ sign_extend 24) p1_old)))(let ((.def_4310 ((_ sign_extend 24) id3)))(let ((.def_13767 (= .def_4310 .def_4354))).def_13767))))
(assert (let ((.def_4362 ((_ sign_extend 24) p3_old)))(let ((.def_4320 ((_ sign_extend 24) nomsg)))(let ((.def_13769 (= .def_4320 .def_4362))).def_13769))))
(assert (let ((.def_4336 ((_ sign_extend 24) p4_old)))(let ((.def_4320 ((_ sign_extend 24) nomsg)))(let ((.def_13771 (= .def_4320 .def_4336))).def_13771))))
(assert (let ((.def_4332 ((_ sign_extend 24) p5_old)))(let ((.def_4320 ((_ sign_extend 24) nomsg)))(let ((.def_13773 (= .def_4320 .def_4332))).def_13773))))
(assert (let ((.def_4358 ((_ sign_extend 24) p2_old)))(let ((.def_4320 ((_ sign_extend 24) nomsg)))(let ((.def_13775 (= .def_4320 .def_4358))).def_13775))))
(assert (let ((.def_4320 ((_ sign_extend 24) nomsg)))(let ((.def_4301 ((_ sign_extend 24) id2)))(let ((.def_13777 (= .def_4301 .def_4320))).def_13777))))
(assert (let ((.def_13779 (= id2 send1))).def_13779))
(assert (let ((.def_13781 (= send4 send3))).def_13781))
(assert (let ((.def_13783 (= id4 send3))).def_13783))
(assert (let ((.def_13785 (= send5 id1))).def_13785))
(assert (let ((.def_13787 (= r1 (_ bv1 8)))).def_13787))
(assert (let ((.def_13789 (= send4 p3_old))).def_13789))
(assert (let ((.def_4317 ((_ sign_extend 24) send3)))(let ((.def_4283 ((_ sign_extend 24) id1)))(let ((.def_882341 (= .def_4283 .def_4317))).def_882341))))
(assert (let ((.def_4301 ((_ sign_extend 24) id2)))(let ((.def_4289 ((_ sign_extend 24) send4)))(let ((.def_882343 (= .def_4289 .def_4301))).def_882343))))
(assert (let ((.def_4311 ((_ sign_extend 24) send2)))(let ((.def_4287 ((_ sign_extend 24) id5)))(let ((.def_882345 (= .def_4287 .def_4311))).def_882345))))
(assert (let ((.def_4301 ((_ sign_extend 24) id2)))(let ((.def_882347 ((_ extract 31 31) .def_4301)))(let ((.def_882348 (= .def_882347 (_ bv1 1)))).def_882348))))
(assert (let ((.def_4287 ((_ sign_extend 24) id5)))(let ((.def_882350 ((_ extract 31 31) .def_4287)))(let ((.def_882351 (= .def_882350 (_ bv1 1)))).def_882351))))
(assert (let ((.def_4287 ((_ sign_extend 24) id5)))(let ((.def_4281 ((_ sign_extend 24) send5)))(let ((.def_882353 (= .def_4281 .def_4287))).def_882353))))
(assert (let ((.def_4303 ((_ sign_extend 24) send1)))(let ((.def_4283 ((_ sign_extend 24) id1)))(let ((.def_882355 (= .def_4283 .def_4303))).def_882355))))
(assert (let ((.def_4320 ((_ sign_extend 24) nomsg)))(let ((.def_4303 ((_ sign_extend 24) send1)))(let ((.def_882357 (= .def_4303 .def_4320))).def_882357))))
(assert (let ((.def_4317 ((_ sign_extend 24) send3)))(let ((.def_4287 ((_ sign_extend 24) id5)))(let ((.def_882359 (bvslt .def_4287 .def_4317))).def_882359))))
(assert (let ((.def_882361 (= nomsg (_ bv255 8)))).def_882361))
(assert (let ((.def_4303 ((_ sign_extend 24) send1)))(let ((.def_4310 ((_ sign_extend 24) id3)))(let ((.def_882363 (bvslt .def_4310 .def_4303))).def_882363))))
(assert (let ((.def_4310 ((_ sign_extend 24) id3)))(let ((.def_4281 ((_ sign_extend 24) send5)))(let ((.def_882365 (= .def_4281 .def_4310))).def_882365))))
(assert (let ((.def_4317 ((_ sign_extend 24) send3)))(let ((.def_4310 ((_ sign_extend 24) id3)))(let ((.def_882367 (= .def_4310 .def_4317))).def_882367))))
(assert (let ((.def_4315 ((_ sign_extend 24) id4)))(let ((.def_4303 ((_ sign_extend 24) send1)))(let ((.def_882369 (= .def_4303 .def_4315))).def_882369))))
(assert (let ((.def_13751 ((_ extract 7 0) |node5::__CPAchecker_TMP_0|)))(let ((.def_882371 ((_ sign_extend 24) .def_13751)))(let ((.def_4283 ((_ sign_extend 24) id1)))(let ((.def_882372 (bvslt .def_4283 .def_882371))).def_882372)))))
(assert (let ((.def_4336 ((_ sign_extend 24) p4_old)))(let ((.def_4301 ((_ sign_extend 24) id2)))(let ((.def_882374 (= .def_4301 .def_4336))).def_882374))))
(assert (let ((.def_4332 ((_ sign_extend 24) p5_old)))(let ((.def_4281 ((_ sign_extend 24) send5)))(let ((.def_882376 (= .def_4281 .def_4332))).def_882376))))
(assert (let ((.def_4358 ((_ sign_extend 24) p2_old)))(let ((.def_4287 ((_ sign_extend 24) id5)))(let ((.def_882378 (= .def_4287 .def_4358))).def_882378))))
(assert (let ((.def_4354 ((_ sign_extend 24) p1_old)))(let ((.def_4303 ((_ sign_extend 24) send1)))(let ((.def_882380 (= .def_4303 .def_4354))).def_882380))))
(assert (let ((.def_882382 (= send1 p1_old))).def_882382))
(assert (let ((.def_4354 ((_ sign_extend 24) p1_old)))(let ((.def_4320 ((_ sign_extend 24) nomsg)))(let ((.def_882384 (= .def_4320 .def_4354))).def_882384))))
(assert (let ((.def_4362 ((_ sign_extend 24) p3_old)))(let ((.def_4287 ((_ sign_extend 24) id5)))(let ((.def_882386 (bvslt .def_4287 .def_4362))).def_882386))))
(assert (let ((.def_4287 ((_ sign_extend 24) id5)))(let ((.def_882388 (= .def_4287 |node5::__CPAchecker_TMP_0|))).def_882388)))
(assert (let ((.def_4354 ((_ sign_extend 24) p1_old)))(let ((.def_4310 ((_ sign_extend 24) id3)))(let ((.def_882390 (bvslt .def_4310 .def_4354))).def_882390))))
(assert (let ((.def_4332 ((_ sign_extend 24) p5_old)))(let ((.def_4310 ((_ sign_extend 24) id3)))(let ((.def_882392 (= .def_4310 .def_4332))).def_882392))))
(assert (let ((.def_13751 ((_ extract 7 0) |node5::__CPAchecker_TMP_0|)))(let ((.def_882371 ((_ sign_extend 24) .def_13751)))(let ((.def_4301 ((_ sign_extend 24) id2)))(let ((.def_882394 (= .def_4301 .def_882371))).def_882394)))))
(assert (let ((.def_13751 ((_ extract 7 0) |node5::__CPAchecker_TMP_0|)))(let ((.def_882396 (= send5 .def_13751))).def_882396)))
(assert (let ((.def_13751 ((_ extract 7 0) |node5::__CPAchecker_TMP_0|)))(let ((.def_882371 ((_ sign_extend 24) .def_13751)))(let ((.def_4332 ((_ sign_extend 24) p5_old)))(let ((.def_882398 (= .def_4332 .def_882371))).def_882398)))))
(assert (let ((.def_4332 ((_ sign_extend 24) p5_old)))(let ((.def_882400 (= .def_4332 |node5::__CPAchecker_TMP_0|))).def_882400)))
(assert (let ((.def_4310 ((_ sign_extend 24) id3)))(let ((.def_882402 (= .def_4310 |node3::__CPAchecker_TMP_0|))).def_882402)))
(assert (let ((.def_4362 ((_ sign_extend 24) p3_old)))(let ((.def_4283 ((_ sign_extend 24) id1)))(let ((.def_882404 (= .def_4283 .def_4362))).def_882404))))
(assert (let ((.def_4354 ((_ sign_extend 24) p1_old)))(let ((.def_4315 ((_ sign_extend 24) id4)))(let ((.def_882406 (= .def_4315 .def_4354))).def_882406))))
(assert (let ((.def_882408 (= send5 send4))).def_882408))
(assert (let ((.def_882410 (= send5 send1))).def_882410))
(assert (let ((.def_4303 ((_ sign_extend 24) send1)))(let ((.def_4283 ((_ sign_extend 24) id1)))(let ((.def_882412 (bvslt .def_4283 .def_4303))).def_882412))))
(assert (let ((.def_4303 ((_ sign_extend 24) send1)))(let ((.def_4281 ((_ sign_extend 24) send5)))(let ((.def_882414 (= .def_4281 .def_4303))).def_882414))))
(assert (let ((.def_4311 ((_ sign_extend 24) send2)))(let ((.def_4303 ((_ sign_extend 24) send1)))(let ((.def_882416 (= .def_4303 .def_4311))).def_882416))))
(assert (let ((.def_882418 (= send1 send2))).def_882418))
(assert (let ((.def_4315 ((_ sign_extend 24) id4)))(let ((.def_4287 ((_ sign_extend 24) id5)))(let ((.def_882420 (= .def_4287 .def_4315))).def_882420))))
(assert (let ((.def_882422 (= nomsg send1))).def_882422))
(assert (let ((.def_882424 ((_ extract 7 7) id4)))(let ((.def_882425 (= .def_882424 (_ bv0 1)))).def_882425)))
(assert (let ((.def_882490 ((_ extract 6 6) id5)))(let ((.def_882488 ((_ extract 6 6) id4)))(let ((.def_882520 (bvor .def_882488 .def_882490)))(let ((.def_882484 ((_ extract 5 5) id4)))(let ((.def_882480 ((_ extract 5 5) id5)))(let ((.def_882507 (bvor .def_882480 .def_882484)))(let ((.def_882497 ((_ extract 7 7) id5)))(let ((.def_882498 (bvnot .def_882497)))(let ((.def_882424 ((_ extract 7 7) id4)))(let ((.def_882494 (bvnot .def_882424)))(let ((.def_882489 (bvnot .def_882488)))(let ((.def_882492 (bvand .def_882489 .def_882490)))(let ((.def_882493 (bvnot .def_882492)))(let ((.def_882496 (bvand .def_882493 .def_882494)))(let ((.def_882500 (bvand .def_882496 .def_882498)))(let ((.def_882501 (bvand .def_882494 .def_882500)))(let ((.def_882485 (bvnot .def_882484)))(let ((.def_882486 (bvand .def_882480 .def_882485)))(let ((.def_882487 (bvnot .def_882486)))(let ((.def_882503 (bvand .def_882487 .def_882501)))(let ((.def_882429 ((_ extract 4 4) id4)))(let ((.def_882476 (bvnot .def_882429)))(let ((.def_882427 ((_ extract 4 4) id5)))(let ((.def_882477 (bvand .def_882427 .def_882476)))(let ((.def_882435 ((_ extract 3 3) id4)))(let ((.def_882470 (bvnot .def_882435)))(let ((.def_882433 ((_ extract 3 3) id5)))(let ((.def_882471 (bvand .def_882433 .def_882470)))(let ((.def_882441 ((_ extract 2 2) id4)))(let ((.def_882464 (bvnot .def_882441)))(let ((.def_882439 ((_ extract 2 2) id5)))(let ((.def_882465 (bvand .def_882439 .def_882464)))(let ((.def_882447 ((_ extract 1 1) id4)))(let ((.def_882458 (bvnot .def_882447)))(let ((.def_882445 ((_ extract 1 1) id5)))(let ((.def_882459 (bvand .def_882445 .def_882458)))(let ((.def_882454 ((_ extract 0 0) id4)))(let ((.def_882455 (bvnot .def_882454)))(let ((.def_882451 ((_ extract 0 0) id5)))(let ((.def_882446 (bvnot .def_882445)))(let ((.def_882449 (bvand .def_882446 .def_882447)))(let ((.def_882450 (bvnot .def_882449)))(let ((.def_882453 (bvand .def_882450 .def_882451)))(let ((.def_882457 (bvand .def_882453 .def_882455)))(let ((.def_882461 (bvor .def_882457 .def_882459)))(let ((.def_882440 (bvnot .def_882439)))(let ((.def_882443 (bvand .def_882440 .def_882441)))(let ((.def_882444 (bvnot .def_882443)))(let ((.def_882463 (bvand .def_882444 .def_882461)))(let ((.def_882467 (bvor .def_882463 .def_882465)))(let ((.def_882434 (bvnot .def_882433)))(let ((.def_882437 (bvand .def_882434 .def_882435)))(let ((.def_882438 (bvnot .def_882437)))(let ((.def_882469 (bvand .def_882438 .def_882467)))(let ((.def_882473 (bvor .def_882469 .def_882471)))(let ((.def_882428 (bvnot .def_882427)))(let ((.def_882431 (bvand .def_882428 .def_882429)))(let ((.def_882432 (bvnot .def_882431)))(let ((.def_882475 (bvand .def_882432 .def_882473)))(let ((.def_882479 (bvor .def_882475 .def_882477)))(let ((.def_882482 (bvand .def_882479 .def_882480)))(let ((.def_882483 (bvnot .def_882482)))(let ((.def_882505 (bvand .def_882483 .def_882503)))(let ((.def_882509 (bvand .def_882505 .def_882507)))(let ((.def_882510 (bvnot .def_882509)))(let ((.def_882511 (bvand .def_882479 .def_882510)))(let ((.def_882512 (bvnot .def_882511)))(let ((.def_882513 (bvand .def_882503 .def_882512)))(let ((.def_882514 (bvand .def_882501 .def_882513)))(let ((.def_882515 (bvnot .def_882514)))(let ((.def_882516 (bvand .def_882490 .def_882515)))(let ((.def_882517 (bvnot .def_882516)))(let ((.def_882518 (bvand .def_882498 .def_882517)))(let ((.def_882519 (bvand .def_882494 .def_882518)))(let ((.def_882522 (bvand .def_882519 .def_882520)))(let ((.def_882523 (bvor .def_882514 .def_882522)))(let ((.def_882524 (bvand .def_882498 .def_882523)))(let ((.def_882525 (bvor .def_882424 .def_882524)))(let ((.def_882526 (= .def_882525 (_ bv1 1)))).def_882526))))))))))))))))))))))))))))))))))))))))))))))))))))))))))))))))))))))))))))))))
(assert (let ((.def_882528 (= send2 send3))).def_882528))
(assert (let ((.def_882530 (= nomsg send3))).def_882530))
(assert (let ((.def_882532 (= st2 (_ bv255 8)))).def_882532))
(assert (let ((.def_4343 ((_ sign_extend 24) st2)))(let ((.def_882534 (= .def_4343 (_ bv4294967294 32)))).def_882534)))
(assert (let ((.def_4343 ((_ sign_extend 24) st2)))(let ((.def_882536 (= .def_4343 (_ bv4294967293 32)))).def_882536)))
(assert (let ((.def_4343 ((_ sign_extend 24) st2)))(let ((.def_882538 (= .def_4343 (_ bv4294967292 32)))).def_882538)))
(assert (let ((.def_882540 (= send5 p4_old))).def_882540))
(assert (let ((.def_882542 (= send1 p5_old))).def_882542))
(assert (let ((.def_4283 ((_ sign_extend 24) id1)))(let ((.def_882544 (= .def_4283 |node1::__CPAchecker_TMP_0|))).def_882544)))
(assert (let ((.def_4332 ((_ sign_extend 24) p5_old)))(let ((.def_4303 ((_ sign_extend 24) send1)))(let ((.def_882546 (= .def_4303 .def_4332))).def_882546))))
(assert (let ((.def_13733 ((_ extract 7 0) |node1::__CPAchecker_TMP_0|)))(let ((.def_882548 ((_ sign_extend 24) .def_13733)))(let ((.def_4301 ((_ sign_extend 24) id2)))(let ((.def_882549 (= .def_4301 .def_882548))).def_882549)))))
(assert (let ((.def_882551 (= send2 p1_old))).def_882551))
(assert (let ((.def_4344 ((_ sign_extend 24) st1)))(let ((.def_4342 ((_ sign_extend 24) st3)))(let ((.def_882554 (bvadd .def_4342 .def_4344)))(let ((.def_4341 ((_ sign_extend 24) st4)))(let ((.def_882555 (bvadd .def_4341 .def_882554)))(let ((.def_4339 ((_ sign_extend 24) st5)))(let ((.def_4340 (bvneg .def_4339)))(let ((.def_882556 (= .def_4340 .def_882555))).def_882556)))))))))
(assert (let ((.def_4344 ((_ sign_extend 24) st1)))(let ((.def_4339 ((_ sign_extend 24) st5)))(let ((.def_882558 (= .def_4339 .def_4344))).def_882558))))
(assert (let ((.def_4342 ((_ sign_extend 24) st3)))(let ((.def_4339 ((_ sign_extend 24) st5)))(let ((.def_882560 (= .def_4339 .def_4342))).def_882560))))
(assert (let ((.def_4343 ((_ sign_extend 24) st2)))(let ((.def_4341 ((_ sign_extend 24) st4)))(let ((.def_882563 (bvadd .def_4341 .def_4343)))(let ((.def_4339 ((_ sign_extend 24) st5)))(let ((.def_4340 (bvneg .def_4339)))(let ((.def_882564 (= .def_4340 .def_882563))).def_882564)))))))
(assert (let ((.def_4343 ((_ sign_extend 24) st2)))(let ((.def_4339 ((_ sign_extend 24) st5)))(let ((.def_882566 (= .def_4339 .def_4343))).def_882566))))
(assert (let ((.def_4344 ((_ sign_extend 24) st1)))(let ((.def_4343 ((_ sign_extend 24) st2)))(let ((.def_4346 (bvadd .def_4343 .def_4344)))(let ((.def_4341 ((_ sign_extend 24) st4)))(let ((.def_882569 (bvadd .def_4341 .def_4346)))(let ((.def_4339 ((_ sign_extend 24) st5)))(let ((.def_4340 (bvneg .def_4339)))(let ((.def_882570 (= .def_4340 .def_882569))).def_882570)))))))))
(assert (let ((.def_4344 ((_ sign_extend 24) st1)))(let ((.def_4341 ((_ sign_extend 24) st4)))(let ((.def_882573 (bvadd .def_4341 .def_4344)))(let ((.def_4339 ((_ sign_extend 24) st5)))(let ((.def_4340 (bvneg .def_4339)))(let ((.def_882574 (= .def_4340 .def_882573))).def_882574)))))))
(assert (let ((.def_882576 (= send4 p4_old))).def_882576))
(assert (let ((.def_882578 (= p4_old p3_old))).def_882578))
(assert (let ((.def_882580 (= p5_old p1_old))).def_882580))
(assert (let ((.def_882582 (= p1_old p2_old))).def_882582))
(assert (let ((.def_882584 (= send2 p2_old))).def_882584))
(assert (let ((.def_882586 (= send3 p3_old))).def_882586))
(assert (let ((.def_882588 (= send3 p2_old))).def_882588))
(assert (let ((.def_4344 ((_ sign_extend 24) st1)))(let ((.def_4342 ((_ sign_extend 24) st3)))(let ((.def_882554 (bvadd .def_4342 .def_4344)))(let ((.def_882590 (bvneg .def_882554)))(let ((.def_4341 ((_ sign_extend 24) st4)))(let ((.def_882591 (= .def_4341 .def_882590))).def_882591)))))))
(assert (let ((.def_4341 ((_ sign_extend 24) st4)))(let ((.def_882593 (bvneg .def_4341)))(let ((.def_4344 ((_ sign_extend 24) st1)))(let ((.def_4343 ((_ sign_extend 24) st2)))(let ((.def_4346 (bvadd .def_4343 .def_4344)))(let ((.def_4342 ((_ sign_extend 24) st3)))(let ((.def_4348 (bvadd .def_4342 .def_4346)))(let ((.def_882594 (= .def_4348 .def_882593))).def_882594)))))))))
(assert (let ((.def_4341 ((_ sign_extend 24) st4)))(let ((.def_882593 (bvneg .def_4341)))(let ((.def_4342 ((_ sign_extend 24) st3)))(let ((.def_882596 (= .def_4342 .def_882593))).def_882596)))))
(assert (let ((.def_4343 ((_ sign_extend 24) st2)))(let ((.def_4342 ((_ sign_extend 24) st3)))(let ((.def_882599 (bvadd .def_4342 .def_4343)))(let ((.def_882600 (bvneg .def_882599)))(let ((.def_4341 ((_ sign_extend 24) st4)))(let ((.def_882601 (= .def_4341 .def_882600))).def_882601)))))))
(assert (let ((.def_882603 (= id5 send4))).def_882603))
(assert (let ((.def_13733 ((_ extract 7 0) |node1::__CPAchecker_TMP_0|)))(let ((.def_882605 (= send2 .def_13733))).def_882605)))
(assert (let ((.def_13733 ((_ extract 7 0) |node1::__CPAchecker_TMP_0|)))(let ((.def_882548 ((_ sign_extend 24) .def_13733)))(let ((.def_4301 ((_ sign_extend 24) id2)))(let ((.def_882607 (bvslt .def_4301 .def_882548))).def_882607)))))
(assert (let ((.def_882609 (= st5 (_ bv1 8)))).def_882609))
(assert (let ((.def_882611 (= r1 (_ bv2 8)))).def_882611))
(assert (let ((.def_4342 ((_ sign_extend 24) st3)))(let ((.def_4341 ((_ sign_extend 24) st4)))(let ((.def_882617 (bvadd .def_4341 .def_4342)))(let ((.def_882621 (bvadd .def_4341 .def_882617)))(let ((.def_882622 (bvadd (_ bv1 32) .def_882621)))(let ((.def_4339 ((_ sign_extend 24) st5)))(let ((.def_4340 (bvneg .def_4339)))(let ((.def_882623 (= .def_4340 .def_882622))).def_882623)))))))))
(assert (let ((.def_4339 ((_ sign_extend 24) st5)))(let ((.def_882625 (= .def_4339 (_ bv1 32)))).def_882625)))
(assert (let ((.def_4343 ((_ sign_extend 24) st2)))(let ((.def_4341 ((_ sign_extend 24) st4)))(let ((.def_882563 (bvadd .def_4341 .def_4343)))(let ((.def_882627 (= .def_882563 (_ bv4294967295 32)))).def_882627)))))

assert N365:
(assert false)
(assert (let ((.def_2159 (= |assert::arg| (_ bv0 8)))).def_2159))

