(set-info :source |printed by MathSAT|)
(declare-fun a20 () (_ BitVec 32))
(declare-fun a25 () (_ BitVec 32))
(declare-fun a12 () (_ BitVec 32))
(declare-fun a15 () (_ BitVec 32))
(declare-fun a16 () (_ BitVec 32))
(declare-fun a2 () (_ BitVec 32))
(declare-fun a27 () (_ BitVec 32))
(declare-fun a9 () (_ BitVec 32))
(declare-fun m_pc () (_ BitVec 32))
(declare-fun t1_pc () (_ BitVec 32))
(declare-fun t2_pc () (_ BitVec 32))
(declare-fun t3_pc () (_ BitVec 32))
(declare-fun t4_pc () (_ BitVec 32))
(declare-fun t5_pc () (_ BitVec 32))
(declare-fun t6_pc () (_ BitVec 32))
(declare-fun t7_pc () (_ BitVec 32))
(declare-fun t8_pc () (_ BitVec 32))
(declare-fun t9_pc () (_ BitVec 32))
(declare-fun t10_pc () (_ BitVec 32))
(declare-fun t11_pc () (_ BitVec 32))
(declare-fun m_st () (_ BitVec 32))

*:
(assert (let ((.def_107351 (= a20 (_ bv5 32)))).def_107351))

calculate_output8 N29965:
(assert false)
(assert (let ((.def_107351 (= a20 (_ bv5 32)))).def_107351))

main1 N30136:
(assert (let ((.def_107351 (= a20 (_ bv5 32)))).def_107351))
(assert (let ((.def_154782 (= a25 (_ bv1 32)))).def_154782))
(assert (let ((.def_154785 (= a12 (_ bv4 32)))).def_154785))
(assert (let ((.def_154788 (= a15 (_ bv1 32)))).def_154788))
(assert (let ((.def_154791 (= a16 (_ bv1 32)))).def_154791))
(assert (let ((.def_154794 (= a2 (_ bv10 32)))).def_154794))
(assert (let ((.def_154797 (= a27 (_ bv1 32)))).def_154797))
(assert (let ((.def_154800 (= a9 (_ bv18 32)))).def_154800))
(assert (let ((.def_320747 (= a9 (_ bv17 32)))).def_320747))
(assert (let ((.def_320749 (= a2 (_ bv12 32)))).def_320749))
(assert (let ((.def_320751 (= a2 (_ bv11 32)))).def_320751))
(assert (let ((.def_320753 (= a2 (_ bv9 32)))).def_320753))
(assert (let ((.def_320755 (= a12 (_ bv3 32)))).def_320755))
(assert (let ((.def_320757 (= a20 (_ bv6 32)))).def_320757))
(assert (let ((.def_320759 (= a2 (_ bv13 32)))).def_320759))
(assert (let ((.def_320761 (= a9 (_ bv16 32)))).def_320761))
(assert (let ((.def_1073528 (= a12 (_ bv2 32)))).def_1073528))
(assert (let ((.def_1073530 (= a12 (_ bv6 32)))).def_1073530))
(assert (let ((.def_1073532 (= a12 (_ bv5 32)))).def_1073532))
(assert (let ((.def_1073534 (= a20 (_ bv7 32)))).def_1073534))

error N30154:
(assert false)
(assert (let ((.def_107351 (= a20 (_ bv5 32)))).def_107351))

eval N30841:
(assert (let ((.def_1215512 (= m_pc (_ bv0 32)))).def_1215512))
(assert (let ((.def_107351 (= a20 (_ bv5 32)))).def_107351))
(assert (let ((.def_1226375 (= t1_pc (_ bv0 32)))).def_1226375))
(assert (let ((.def_1226378 (= t2_pc (_ bv0 32)))).def_1226378))
(assert (let ((.def_1226381 (= t3_pc (_ bv0 32)))).def_1226381))
(assert (let ((.def_1226384 (= t4_pc (_ bv0 32)))).def_1226384))
(assert (let ((.def_1226387 (= t5_pc (_ bv0 32)))).def_1226387))
(assert (let ((.def_1226390 (= t6_pc (_ bv0 32)))).def_1226390))
(assert (let ((.def_1226393 (= t7_pc (_ bv0 32)))).def_1226393))
(assert (let ((.def_1226396 (= t8_pc (_ bv0 32)))).def_1226396))
(assert (let ((.def_1226399 (= t9_pc (_ bv0 32)))).def_1226399))
(assert (let ((.def_1226402 (= t10_pc (_ bv0 32)))).def_1226402))
(assert (let ((.def_1226405 (= t11_pc (_ bv0 32)))).def_1226405))
(assert (let ((.def_1226407 (= m_pc (_ bv1 32)))).def_1226407))
(assert (let ((.def_1226409 (= t1_pc (_ bv1 32)))).def_1226409))
(assert (let ((.def_1226411 (= t2_pc (_ bv1 32)))).def_1226411))
(assert (let ((.def_1226413 (= t3_pc (_ bv1 32)))).def_1226413))
(assert (let ((.def_1226415 (= t4_pc (_ bv1 32)))).def_1226415))
(assert (let ((.def_1226417 (= t5_pc (_ bv1 32)))).def_1226417))
(assert (let ((.def_1226419 (= t6_pc (_ bv1 32)))).def_1226419))
(assert (let ((.def_1226421 (= t7_pc (_ bv1 32)))).def_1226421))
(assert (let ((.def_1226423 (= t8_pc (_ bv1 32)))).def_1226423))
(assert (let ((.def_1226425 (= t9_pc (_ bv1 32)))).def_1226425))
(assert (let ((.def_1226427 (= t10_pc (_ bv1 32)))).def_1226427))
(assert (let ((.def_1226429 (= t11_pc (_ bv1 32)))).def_1226429))
(assert (let ((.def_1226432 (= m_st (_ bv0 32)))).def_1226432))

start_simulation N31401:
(assert (let ((.def_1215512 (= m_pc (_ bv0 32)))).def_1215512))
(assert (let ((.def_107351 (= a20 (_ bv5 32)))).def_107351))
(assert (let ((.def_1226375 (= t1_pc (_ bv0 32)))).def_1226375))
(assert (let ((.def_1226378 (= t2_pc (_ bv0 32)))).def_1226378))
(assert (let ((.def_1226381 (= t3_pc (_ bv0 32)))).def_1226381))
(assert (let ((.def_1226384 (= t4_pc (_ bv0 32)))).def_1226384))
(assert (let ((.def_1226387 (= t5_pc (_ bv0 32)))).def_1226387))
(assert (let ((.def_1226390 (= t6_pc (_ bv0 32)))).def_1226390))
(assert (let ((.def_1226393 (= t7_pc (_ bv0 32)))).def_1226393))
(assert (let ((.def_1226396 (= t8_pc (_ bv0 32)))).def_1226396))
(assert (let ((.def_1226399 (= t9_pc (_ bv0 32)))).def_1226399))
(assert (let ((.def_1226402 (= t10_pc (_ bv0 32)))).def_1226402))
(assert (let ((.def_1226405 (= t11_pc (_ bv0 32)))).def_1226405))
(assert (let ((.def_1226407 (= m_pc (_ bv1 32)))).def_1226407))
(assert (let ((.def_1226409 (= t1_pc (_ bv1 32)))).def_1226409))
(assert (let ((.def_1226411 (= t2_pc (_ bv1 32)))).def_1226411))
(assert (let ((.def_1226413 (= t3_pc (_ bv1 32)))).def_1226413))
(assert (let ((.def_1226415 (= t4_pc (_ bv1 32)))).def_1226415))
(assert (let ((.def_1226417 (= t5_pc (_ bv1 32)))).def_1226417))
(assert (let ((.def_1226419 (= t6_pc (_ bv1 32)))).def_1226419))
(assert (let ((.def_1226421 (= t7_pc (_ bv1 32)))).def_1226421))
(assert (let ((.def_1226423 (= t8_pc (_ bv1 32)))).def_1226423))
(assert (let ((.def_1226425 (= t9_pc (_ bv1 32)))).def_1226425))
(assert (let ((.def_1226427 (= t10_pc (_ bv1 32)))).def_1226427))
(assert (let ((.def_1226429 (= t11_pc (_ bv1 32)))).def_1226429))

