(set-info :source |printed by MathSAT|)
(declare-fun c_last_read () (_ BitVec 32))
(declare-fun p_last_write () (_ BitVec 32))
(declare-fun c_num_read () (_ BitVec 32))
(declare-fun p_num_write () (_ BitVec 32))
(declare-fun c_dr_pc () (_ BitVec 32))
(declare-fun q_free () (_ BitVec 32))
(declare-fun q_buf_0 () (_ BitVec 32))
(declare-fun p_dw_pc () (_ BitVec 32))
(declare-fun q_read_ev () (_ BitVec 32))
(declare-fun c_dr_st () (_ BitVec 32))
(declare-fun p_dw_st () (_ BitVec 32))
(declare-fun m_pc () (_ BitVec 32))
(declare-fun t1_pc () (_ BitVec 32))
(declare-fun t2_pc () (_ BitVec 32))
(declare-fun t3_pc () (_ BitVec 32))
(declare-fun t4_pc () (_ BitVec 32))
(declare-fun t5_pc () (_ BitVec 32))
(declare-fun t6_pc () (_ BitVec 32))
(declare-fun t7_pc () (_ BitVec 32))
(declare-fun t8_pc () (_ BitVec 32))
(declare-fun t9_pc () (_ BitVec 32))
(declare-fun t10_pc () (_ BitVec 32))
(declare-fun t11_pc () (_ BitVec 32))
(declare-fun t12_pc () (_ BitVec 32))
(declare-fun t13_pc () (_ BitVec 32))
(declare-fun m_st () (_ BitVec 32))

*:
(assert (let ((.def_690 (= c_last_read p_last_write))).def_690))
(assert (let ((.def_699 (= c_num_read p_num_write))).def_699))

error1 N4:
(assert false)
(assert (let ((.def_690 (= c_last_read p_last_write))).def_690))
(assert (let ((.def_699 (= c_num_read p_num_write))).def_699))

do_write_p N64:
(assert (let ((.def_1034 (= c_dr_pc (_ bv0 32)))).def_1034))
(assert (let ((.def_690 (= c_last_read p_last_write))).def_690))
(assert (let ((.def_699 (= c_num_read p_num_write))).def_699))
(assert (let ((.def_1137 (= q_free (_ bv1 32)))).def_1137))
(assert false)
(assert (let ((.def_1480 (= p_last_write q_buf_0))).def_1480))
(assert (let ((.def_1140 (= p_dw_pc (_ bv1 32)))).def_1140))
(assert (let ((.def_1669 (bvadd (_ bv1 32) c_num_read)))(let ((.def_1670 (= p_num_write .def_1669))).def_1670)))
(assert (let ((.def_2561 (= q_free (_ bv0 32)))).def_2561))
(assert (let ((.def_1672 (= c_dr_pc (_ bv1 32)))).def_1672))
(assert (let ((.def_5362 (= q_read_ev (_ bv1 32)))).def_5362))

do_read_c N100:
(assert (let ((.def_1140 (= p_dw_pc (_ bv1 32)))).def_1140))
(assert (let ((.def_1137 (= q_free (_ bv1 32)))).def_1137))
(assert (let ((.def_690 (= c_last_read p_last_write))).def_690))
(assert (let ((.def_699 (= c_num_read p_num_write))).def_699))
(assert (let ((.def_1480 (= p_last_write q_buf_0))).def_1480))
(assert (let ((.def_1669 (bvadd (_ bv1 32) c_num_read)))(let ((.def_1670 (= p_num_write .def_1669))).def_1670)))
(assert (let ((.def_1672 (= c_dr_pc (_ bv1 32)))).def_1672))
(assert false)

eval1 N170:
(assert (let ((.def_1034 (= c_dr_pc (_ bv0 32)))).def_1034))
(assert (let ((.def_690 (= c_last_read p_last_write))).def_690))
(assert (let ((.def_699 (= c_num_read p_num_write))).def_699))
(assert (let ((.def_1137 (= q_free (_ bv1 32)))).def_1137))
(assert (let ((.def_1410 (= p_dw_pc (_ bv0 32)))).def_1410))
(assert (let ((.def_1672 (= c_dr_pc (_ bv1 32)))).def_1672))
(assert (let ((.def_3984 (= c_dr_st (_ bv0 32)))).def_3984))
(assert (let ((.def_1140 (= p_dw_pc (_ bv1 32)))).def_1140))
(assert (let ((.def_5362 (= q_read_ev (_ bv1 32)))).def_5362))
(assert (let ((.def_5365 (= p_dw_st (_ bv0 32)))).def_5365))
(assert (let ((.def_1480 (= p_last_write q_buf_0))).def_1480))
(assert (let ((.def_1669 (bvadd (_ bv1 32) c_num_read)))(let ((.def_1670 (= p_num_write .def_1669))).def_1670)))

start_simulation1 N221:
(assert (let ((.def_1034 (= c_dr_pc (_ bv0 32)))).def_1034))
(assert (let ((.def_690 (= c_last_read p_last_write))).def_690))
(assert (let ((.def_699 (= c_num_read p_num_write))).def_699))
(assert (let ((.def_1137 (= q_free (_ bv1 32)))).def_1137))
(assert (let ((.def_1410 (= p_dw_pc (_ bv0 32)))).def_1410))
(assert (let ((.def_5362 (= q_read_ev (_ bv1 32)))).def_5362))

error2 N260:
(assert false)
(assert (let ((.def_690 (= c_last_read p_last_write))).def_690))
(assert (let ((.def_699 (= c_num_read p_num_write))).def_699))

eval2 N1042:
(assert (let ((.def_8505 (= m_pc (_ bv0 32)))).def_8505))
(assert (let ((.def_690 (= c_last_read p_last_write))).def_690))
(assert (let ((.def_699 (= c_num_read p_num_write))).def_699))
(assert (let ((.def_22907 (= t1_pc (_ bv0 32)))).def_22907))
(assert (let ((.def_22910 (= t2_pc (_ bv0 32)))).def_22910))
(assert (let ((.def_22913 (= t3_pc (_ bv0 32)))).def_22913))
(assert (let ((.def_22916 (= t4_pc (_ bv0 32)))).def_22916))
(assert (let ((.def_22919 (= t5_pc (_ bv0 32)))).def_22919))
(assert (let ((.def_22922 (= t6_pc (_ bv0 32)))).def_22922))
(assert (let ((.def_22925 (= t7_pc (_ bv0 32)))).def_22925))
(assert (let ((.def_22928 (= t8_pc (_ bv0 32)))).def_22928))
(assert (let ((.def_22931 (= t9_pc (_ bv0 32)))).def_22931))
(assert (let ((.def_22934 (= t10_pc (_ bv0 32)))).def_22934))
(assert (let ((.def_22937 (= t11_pc (_ bv0 32)))).def_22937))
(assert (let ((.def_22940 (= t12_pc (_ bv0 32)))).def_22940))
(assert (let ((.def_22943 (= t13_pc (_ bv0 32)))).def_22943))
(assert (let ((.def_22945 (= m_pc (_ bv1 32)))).def_22945))
(assert (let ((.def_22947 (= t1_pc (_ bv1 32)))).def_22947))
(assert (let ((.def_22949 (= t2_pc (_ bv1 32)))).def_22949))
(assert (let ((.def_22951 (= t3_pc (_ bv1 32)))).def_22951))
(assert (let ((.def_22953 (= t4_pc (_ bv1 32)))).def_22953))
(assert (let ((.def_22955 (= t5_pc (_ bv1 32)))).def_22955))
(assert (let ((.def_22957 (= t6_pc (_ bv1 32)))).def_22957))
(assert (let ((.def_22959 (= t7_pc (_ bv1 32)))).def_22959))
(assert (let ((.def_22961 (= t8_pc (_ bv1 32)))).def_22961))
(assert (let ((.def_22963 (= t9_pc (_ bv1 32)))).def_22963))
(assert (let ((.def_22965 (= t10_pc (_ bv1 32)))).def_22965))
(assert (let ((.def_22967 (= t11_pc (_ bv1 32)))).def_22967))
(assert (let ((.def_22969 (= t12_pc (_ bv1 32)))).def_22969))
(assert (let ((.def_22971 (= t13_pc (_ bv1 32)))).def_22971))
(assert (let ((.def_22974 (= m_st (_ bv0 32)))).def_22974))

start_simulation2 N1684:
(assert (let ((.def_8505 (= m_pc (_ bv0 32)))).def_8505))
(assert (let ((.def_690 (= c_last_read p_last_write))).def_690))
(assert (let ((.def_699 (= c_num_read p_num_write))).def_699))
(assert (let ((.def_22907 (= t1_pc (_ bv0 32)))).def_22907))
(assert (let ((.def_22910 (= t2_pc (_ bv0 32)))).def_22910))
(assert (let ((.def_22913 (= t3_pc (_ bv0 32)))).def_22913))
(assert (let ((.def_22916 (= t4_pc (_ bv0 32)))).def_22916))
(assert (let ((.def_22919 (= t5_pc (_ bv0 32)))).def_22919))
(assert (let ((.def_22922 (= t6_pc (_ bv0 32)))).def_22922))
(assert (let ((.def_22925 (= t7_pc (_ bv0 32)))).def_22925))
(assert (let ((.def_22928 (= t8_pc (_ bv0 32)))).def_22928))
(assert (let ((.def_22931 (= t9_pc (_ bv0 32)))).def_22931))
(assert (let ((.def_22934 (= t10_pc (_ bv0 32)))).def_22934))
(assert (let ((.def_22937 (= t11_pc (_ bv0 32)))).def_22937))
(assert (let ((.def_22940 (= t12_pc (_ bv0 32)))).def_22940))
(assert (let ((.def_22943 (= t13_pc (_ bv0 32)))).def_22943))
(assert (let ((.def_22945 (= m_pc (_ bv1 32)))).def_22945))
(assert (let ((.def_22947 (= t1_pc (_ bv1 32)))).def_22947))
(assert (let ((.def_22949 (= t2_pc (_ bv1 32)))).def_22949))
(assert (let ((.def_22951 (= t3_pc (_ bv1 32)))).def_22951))
(assert (let ((.def_22953 (= t4_pc (_ bv1 32)))).def_22953))
(assert (let ((.def_22955 (= t5_pc (_ bv1 32)))).def_22955))
(assert (let ((.def_22957 (= t6_pc (_ bv1 32)))).def_22957))
(assert (let ((.def_22959 (= t7_pc (_ bv1 32)))).def_22959))
(assert (let ((.def_22961 (= t8_pc (_ bv1 32)))).def_22961))
(assert (let ((.def_22963 (= t9_pc (_ bv1 32)))).def_22963))
(assert (let ((.def_22965 (= t10_pc (_ bv1 32)))).def_22965))
(assert (let ((.def_22967 (= t11_pc (_ bv1 32)))).def_22967))
(assert (let ((.def_22969 (= t12_pc (_ bv1 32)))).def_22969))
(assert (let ((.def_22971 (= t13_pc (_ bv1 32)))).def_22971))

