(set-info :source |printed by MathSAT|)
(declare-fun a20 () (_ BitVec 32))
(declare-fun a25 () (_ BitVec 32))
(declare-fun a12 () (_ BitVec 32))
(declare-fun a15 () (_ BitVec 32))
(declare-fun a16 () (_ BitVec 32))
(declare-fun a2 () (_ BitVec 32))
(declare-fun a27 () (_ BitVec 32))
(declare-fun a9 () (_ BitVec 32))
(declare-fun m_pc () (_ BitVec 32))
(declare-fun t1_pc () (_ BitVec 32))
(declare-fun t2_pc () (_ BitVec 32))
(declare-fun t3_pc () (_ BitVec 32))
(declare-fun t4_pc () (_ BitVec 32))
(declare-fun t5_pc () (_ BitVec 32))
(declare-fun m_st () (_ BitVec 32))

*:
(assert (let ((.def_107261 (= a20 (_ bv5 32)))).def_107261))

calculate_output8 N29965:
(assert false)
(assert (let ((.def_107261 (= a20 (_ bv5 32)))).def_107261))

main1 N30136:
(assert (let ((.def_107261 (= a20 (_ bv5 32)))).def_107261))
(assert (let ((.def_154662 (= a25 (_ bv1 32)))).def_154662))
(assert (let ((.def_154665 (= a12 (_ bv4 32)))).def_154665))
(assert (let ((.def_154668 (= a15 (_ bv1 32)))).def_154668))
(assert (let ((.def_154671 (= a16 (_ bv1 32)))).def_154671))
(assert (let ((.def_154674 (= a2 (_ bv10 32)))).def_154674))
(assert (let ((.def_154677 (= a27 (_ bv1 32)))).def_154677))
(assert (let ((.def_154680 (= a9 (_ bv18 32)))).def_154680))
(assert (let ((.def_320627 (= a9 (_ bv17 32)))).def_320627))
(assert (let ((.def_320629 (= a2 (_ bv12 32)))).def_320629))
(assert (let ((.def_320631 (= a2 (_ bv11 32)))).def_320631))
(assert (let ((.def_320633 (= a2 (_ bv9 32)))).def_320633))
(assert (let ((.def_320635 (= a12 (_ bv3 32)))).def_320635))
(assert (let ((.def_320637 (= a20 (_ bv6 32)))).def_320637))
(assert (let ((.def_320639 (= a2 (_ bv13 32)))).def_320639))
(assert (let ((.def_320641 (= a9 (_ bv16 32)))).def_320641))
(assert (let ((.def_1060039 (= a12 (_ bv2 32)))).def_1060039))
(assert (let ((.def_1060041 (= a12 (_ bv5 32)))).def_1060041))
(assert (let ((.def_1060043 (= a20 (_ bv7 32)))).def_1060043))
(assert (let ((.def_1060045 (= a12 (_ bv6 32)))).def_1060045))

error N30154:
(assert false)
(assert (let ((.def_107261 (= a20 (_ bv5 32)))).def_107261))

eval N30517:
(assert (let ((.def_1201310 (= m_pc (_ bv0 32)))).def_1201310))
(assert (let ((.def_107261 (= a20 (_ bv5 32)))).def_107261))
(assert (let ((.def_1204484 (= t1_pc (_ bv0 32)))).def_1204484))
(assert (let ((.def_1204487 (= t2_pc (_ bv0 32)))).def_1204487))
(assert (let ((.def_1204490 (= t3_pc (_ bv0 32)))).def_1204490))
(assert (let ((.def_1204493 (= t4_pc (_ bv0 32)))).def_1204493))
(assert (let ((.def_1204496 (= t5_pc (_ bv0 32)))).def_1204496))
(assert (let ((.def_1204498 (= m_pc (_ bv1 32)))).def_1204498))
(assert (let ((.def_1204500 (= t1_pc (_ bv1 32)))).def_1204500))
(assert (let ((.def_1204502 (= t2_pc (_ bv1 32)))).def_1204502))
(assert (let ((.def_1204504 (= t3_pc (_ bv1 32)))).def_1204504))
(assert (let ((.def_1204506 (= t4_pc (_ bv1 32)))).def_1204506))
(assert (let ((.def_1204508 (= t5_pc (_ bv1 32)))).def_1204508))
(assert (let ((.def_1204511 (= m_st (_ bv0 32)))).def_1204511))

start_simulation N30831:
(assert (let ((.def_1201310 (= m_pc (_ bv0 32)))).def_1201310))
(assert (let ((.def_107261 (= a20 (_ bv5 32)))).def_107261))
(assert (let ((.def_1204484 (= t1_pc (_ bv0 32)))).def_1204484))
(assert (let ((.def_1204487 (= t2_pc (_ bv0 32)))).def_1204487))
(assert (let ((.def_1204490 (= t3_pc (_ bv0 32)))).def_1204490))
(assert (let ((.def_1204493 (= t4_pc (_ bv0 32)))).def_1204493))
(assert (let ((.def_1204496 (= t5_pc (_ bv0 32)))).def_1204496))
(assert (let ((.def_1204498 (= m_pc (_ bv1 32)))).def_1204498))
(assert (let ((.def_1204500 (= t1_pc (_ bv1 32)))).def_1204500))
(assert (let ((.def_1204502 (= t2_pc (_ bv1 32)))).def_1204502))
(assert (let ((.def_1204504 (= t3_pc (_ bv1 32)))).def_1204504))
(assert (let ((.def_1204506 (= t4_pc (_ bv1 32)))).def_1204506))
(assert (let ((.def_1204508 (= t5_pc (_ bv1 32)))).def_1204508))

