(set-info :source |printed by MathSAT|)
(declare-fun a20 () (_ BitVec 32))
(declare-fun a25 () (_ BitVec 32))
(declare-fun a12 () (_ BitVec 32))
(declare-fun a15 () (_ BitVec 32))
(declare-fun a16 () (_ BitVec 32))
(declare-fun a2 () (_ BitVec 32))
(declare-fun a27 () (_ BitVec 32))
(declare-fun a9 () (_ BitVec 32))
(declare-fun m_pc () (_ BitVec 32))
(declare-fun t1_pc () (_ BitVec 32))
(declare-fun t2_pc () (_ BitVec 32))
(declare-fun t3_pc () (_ BitVec 32))
(declare-fun t4_pc () (_ BitVec 32))
(declare-fun t5_pc () (_ BitVec 32))
(declare-fun t6_pc () (_ BitVec 32))
(declare-fun t7_pc () (_ BitVec 32))
(declare-fun t8_pc () (_ BitVec 32))
(declare-fun t9_pc () (_ BitVec 32))
(declare-fun t10_pc () (_ BitVec 32))
(declare-fun t11_pc () (_ BitVec 32))
(declare-fun t12_pc () (_ BitVec 32))
(declare-fun m_st () (_ BitVec 32))

*:
(assert (let ((.def_107278 (= a20 (_ bv5 32)))).def_107278))

calculate_output8 N29943:
(assert false)
(assert (let ((.def_107278 (= a20 (_ bv5 32)))).def_107278))

main1 N30136:
(assert (let ((.def_107278 (= a20 (_ bv5 32)))).def_107278))
(assert (let ((.def_154675 (= a25 (_ bv1 32)))).def_154675))
(assert (let ((.def_154678 (= a12 (_ bv4 32)))).def_154678))
(assert (let ((.def_154681 (= a15 (_ bv1 32)))).def_154681))
(assert (let ((.def_154684 (= a16 (_ bv1 32)))).def_154684))
(assert (let ((.def_154687 (= a2 (_ bv10 32)))).def_154687))
(assert (let ((.def_154690 (= a27 (_ bv1 32)))).def_154690))
(assert (let ((.def_154693 (= a9 (_ bv18 32)))).def_154693))
(assert (let ((.def_588497 (= a9 (_ bv16 32)))).def_588497))
(assert (let ((.def_588499 (= a9 (_ bv17 32)))).def_588499))
(assert (let ((.def_588501 (= a2 (_ bv9 32)))).def_588501))
(assert (let ((.def_588503 (= a2 (_ bv12 32)))).def_588503))
(assert (let ((.def_588505 (= a12 (_ bv6 32)))).def_588505))
(assert (let ((.def_588507 (= a2 (_ bv11 32)))).def_588507))
(assert (let ((.def_588509 (= a20 (_ bv6 32)))).def_588509))
(assert (let ((.def_588511 (= a20 (_ bv7 32)))).def_588511))
(assert (let ((.def_588513 (= a2 (_ bv13 32)))).def_588513))
(assert (let ((.def_588515 (= a12 (_ bv3 32)))).def_588515))
(assert (let ((.def_588517 (= a12 (_ bv2 32)))).def_588517))
(assert (let ((.def_588519 (= a12 (_ bv5 32)))).def_588519))

error N30154:
(assert false)
(assert (let ((.def_107278 (= a20 (_ bv5 32)))).def_107278))

eval N30891:
(assert (let ((.def_925900 (= m_pc (_ bv0 32)))).def_925900))
(assert (let ((.def_107278 (= a20 (_ bv5 32)))).def_107278))
(assert (let ((.def_938489 (= t1_pc (_ bv0 32)))).def_938489))
(assert (let ((.def_938492 (= t2_pc (_ bv0 32)))).def_938492))
(assert (let ((.def_938495 (= t3_pc (_ bv0 32)))).def_938495))
(assert (let ((.def_938498 (= t4_pc (_ bv0 32)))).def_938498))
(assert (let ((.def_938501 (= t5_pc (_ bv0 32)))).def_938501))
(assert (let ((.def_938504 (= t6_pc (_ bv0 32)))).def_938504))
(assert (let ((.def_938507 (= t7_pc (_ bv0 32)))).def_938507))
(assert (let ((.def_938510 (= t8_pc (_ bv0 32)))).def_938510))
(assert (let ((.def_938513 (= t9_pc (_ bv0 32)))).def_938513))
(assert (let ((.def_938516 (= t10_pc (_ bv0 32)))).def_938516))
(assert (let ((.def_938519 (= t11_pc (_ bv0 32)))).def_938519))
(assert (let ((.def_938522 (= t12_pc (_ bv0 32)))).def_938522))
(assert (let ((.def_938524 (= m_pc (_ bv1 32)))).def_938524))
(assert (let ((.def_938526 (= t1_pc (_ bv1 32)))).def_938526))
(assert (let ((.def_938528 (= t2_pc (_ bv1 32)))).def_938528))
(assert (let ((.def_938530 (= t3_pc (_ bv1 32)))).def_938530))
(assert (let ((.def_938532 (= t4_pc (_ bv1 32)))).def_938532))
(assert (let ((.def_938534 (= t5_pc (_ bv1 32)))).def_938534))
(assert (let ((.def_938536 (= t6_pc (_ bv1 32)))).def_938536))
(assert (let ((.def_938538 (= t7_pc (_ bv1 32)))).def_938538))
(assert (let ((.def_938540 (= t8_pc (_ bv1 32)))).def_938540))
(assert (let ((.def_938542 (= t9_pc (_ bv1 32)))).def_938542))
(assert (let ((.def_938544 (= t10_pc (_ bv1 32)))).def_938544))
(assert (let ((.def_938546 (= t11_pc (_ bv1 32)))).def_938546))
(assert (let ((.def_938548 (= t12_pc (_ bv1 32)))).def_938548))
(assert (let ((.def_938551 (= m_st (_ bv0 32)))).def_938551))

start_simulation N31492:
(assert (let ((.def_925900 (= m_pc (_ bv0 32)))).def_925900))
(assert (let ((.def_107278 (= a20 (_ bv5 32)))).def_107278))
(assert (let ((.def_938489 (= t1_pc (_ bv0 32)))).def_938489))
(assert (let ((.def_938492 (= t2_pc (_ bv0 32)))).def_938492))
(assert (let ((.def_938495 (= t3_pc (_ bv0 32)))).def_938495))
(assert (let ((.def_938498 (= t4_pc (_ bv0 32)))).def_938498))
(assert (let ((.def_938501 (= t5_pc (_ bv0 32)))).def_938501))
(assert (let ((.def_938504 (= t6_pc (_ bv0 32)))).def_938504))
(assert (let ((.def_938507 (= t7_pc (_ bv0 32)))).def_938507))
(assert (let ((.def_938510 (= t8_pc (_ bv0 32)))).def_938510))
(assert (let ((.def_938513 (= t9_pc (_ bv0 32)))).def_938513))
(assert (let ((.def_938516 (= t10_pc (_ bv0 32)))).def_938516))
(assert (let ((.def_938519 (= t11_pc (_ bv0 32)))).def_938519))
(assert (let ((.def_938522 (= t12_pc (_ bv0 32)))).def_938522))
(assert (let ((.def_938524 (= m_pc (_ bv1 32)))).def_938524))
(assert (let ((.def_938526 (= t1_pc (_ bv1 32)))).def_938526))
(assert (let ((.def_938528 (= t2_pc (_ bv1 32)))).def_938528))
(assert (let ((.def_938530 (= t3_pc (_ bv1 32)))).def_938530))
(assert (let ((.def_938532 (= t4_pc (_ bv1 32)))).def_938532))
(assert (let ((.def_938534 (= t5_pc (_ bv1 32)))).def_938534))
(assert (let ((.def_938536 (= t6_pc (_ bv1 32)))).def_938536))
(assert (let ((.def_938538 (= t7_pc (_ bv1 32)))).def_938538))
(assert (let ((.def_938540 (= t8_pc (_ bv1 32)))).def_938540))
(assert (let ((.def_938542 (= t9_pc (_ bv1 32)))).def_938542))
(assert (let ((.def_938544 (= t10_pc (_ bv1 32)))).def_938544))
(assert (let ((.def_938546 (= t11_pc (_ bv1 32)))).def_938546))
(assert (let ((.def_938548 (= t12_pc (_ bv1 32)))).def_938548))

