(set-info :source |printed by MathSAT|)
(declare-fun a20 () (_ BitVec 32))
(declare-fun a9 () (_ BitVec 32))
(declare-fun a25 () (_ BitVec 32))
(declare-fun a12 () (_ BitVec 32))
(declare-fun a15 () (_ BitVec 32))
(declare-fun a16 () (_ BitVec 32))
(declare-fun a2 () (_ BitVec 32))
(declare-fun a27 () (_ BitVec 32))

*:
(assert (let ((.def_106220 (= a20 (_ bv5 32)))).def_106220))

calculate_output8 N29701:
(assert false)
(assert (let ((.def_106220 (= a20 (_ bv5 32)))).def_106220))

main1 N30136:
(assert (let ((.def_153074 (= a9 (_ bv18 32)))).def_153074))
(assert (let ((.def_106220 (= a20 (_ bv5 32)))).def_106220))
(assert (let ((.def_339773 (= a25 (_ bv1 32)))).def_339773))
(assert (let ((.def_339776 (= a12 (_ bv4 32)))).def_339776))
(assert (let ((.def_339779 (= a15 (_ bv1 32)))).def_339779))
(assert (let ((.def_339782 (= a16 (_ bv1 32)))).def_339782))
(assert (let ((.def_339785 (= a2 (_ bv10 32)))).def_339785))
(assert (let ((.def_339788 (= a27 (_ bv1 32)))).def_339788))
(assert (let ((.def_339790 (= a20 (_ bv6 32)))).def_339790))
(assert (let ((.def_339792 (= a2 (_ bv13 32)))).def_339792))
(assert (let ((.def_339794 (= a12 (_ bv2 32)))).def_339794))
(assert (let ((.def_339796 (= a2 (_ bv12 32)))).def_339796))
(assert (let ((.def_339798 (= a2 (_ bv11 32)))).def_339798))
(assert (let ((.def_339800 (= a9 (_ bv16 32)))).def_339800))
(assert (let ((.def_339802 (= a9 (_ bv17 32)))).def_339802))
(assert (let ((.def_1065098 (= a12 (_ bv3 32)))).def_1065098))
(assert (let ((.def_1065100 (= a20 (_ bv7 32)))).def_1065100))
(assert (let ((.def_1065102 (= a12 (_ bv6 32)))).def_1065102))
(assert (let ((.def_1065104 (= a12 (_ bv5 32)))).def_1065104))
(assert (let ((.def_1065106 (= a2 (_ bv9 32)))).def_1065106))

