(set-info :source |printed by MathSAT|)
(declare-fun a20 () (_ BitVec 32))
(declare-fun a25 () (_ BitVec 32))
(declare-fun a12 () (_ BitVec 32))
(declare-fun a15 () (_ BitVec 32))
(declare-fun a16 () (_ BitVec 32))
(declare-fun a2 () (_ BitVec 32))
(declare-fun a27 () (_ BitVec 32))
(declare-fun a9 () (_ BitVec 32))
(declare-fun m_pc () (_ BitVec 32))
(declare-fun t1_pc () (_ BitVec 32))
(declare-fun t2_pc () (_ BitVec 32))
(declare-fun t3_pc () (_ BitVec 32))
(declare-fun t4_pc () (_ BitVec 32))
(declare-fun t5_pc () (_ BitVec 32))
(declare-fun m_st () (_ BitVec 32))
(declare-fun E_3 () (_ BitVec 32))
(declare-fun E_2 () (_ BitVec 32))
(declare-fun E_5 () (_ BitVec 32))
(declare-fun E_M () (_ BitVec 32))
(declare-fun E_4 () (_ BitVec 32))
(declare-fun t1_st () (_ BitVec 32))
(declare-fun t2_st () (_ BitVec 32))
(declare-fun t4_st () (_ BitVec 32))
(declare-fun t3_st () (_ BitVec 32))
(declare-fun t5_st () (_ BitVec 32))
(declare-fun local () (_ BitVec 32))
(declare-fun token () (_ BitVec 32))
(declare-fun E_1 () (_ BitVec 32))
(declare-fun T5_E () (_ BitVec 32))
(declare-fun T4_E () (_ BitVec 32))
(declare-fun T3_E () (_ BitVec 32))
(declare-fun T2_E () (_ BitVec 32))
(declare-fun T1_E () (_ BitVec 32))
(declare-fun M_E () (_ BitVec 32))

*:
(assert (let ((.def_107173 (= a20 (_ bv5 32)))).def_107173))

calculate_output8 N29943:
(assert false)
(assert (let ((.def_107173 (= a20 (_ bv5 32)))).def_107173))

main1 N30136:
(assert (let ((.def_107173 (= a20 (_ bv5 32)))).def_107173))
(assert (let ((.def_154535 (= a25 (_ bv1 32)))).def_154535))
(assert (let ((.def_154538 (= a12 (_ bv4 32)))).def_154538))
(assert (let ((.def_154541 (= a15 (_ bv1 32)))).def_154541))
(assert (let ((.def_154544 (= a16 (_ bv1 32)))).def_154544))
(assert (let ((.def_154547 (= a2 (_ bv10 32)))).def_154547))
(assert (let ((.def_154550 (= a27 (_ bv1 32)))).def_154550))
(assert (let ((.def_154553 (= a9 (_ bv18 32)))).def_154553))
(assert (let ((.def_608960 (= a2 (_ bv12 32)))).def_608960))
(assert (let ((.def_608962 (= a20 (_ bv7 32)))).def_608962))
(assert (let ((.def_608964 (= a20 (_ bv6 32)))).def_608964))
(assert (let ((.def_608966 (= a9 (_ bv16 32)))).def_608966))
(assert (let ((.def_608968 (= a9 (_ bv17 32)))).def_608968))
(assert (let ((.def_608970 (= a12 (_ bv6 32)))).def_608970))
(assert (let ((.def_608972 (= a12 (_ bv5 32)))).def_608972))
(assert (let ((.def_608974 (= a12 (_ bv3 32)))).def_608974))
(assert (let ((.def_608976 (= a12 (_ bv2 32)))).def_608976))
(assert (let ((.def_608978 (= a2 (_ bv11 32)))).def_608978))
(assert (let ((.def_608980 (= a2 (_ bv9 32)))).def_608980))
(assert (let ((.def_608982 (= a2 (_ bv13 32)))).def_608982))

error N30154:
(assert false)
(assert (let ((.def_107173 (= a20 (_ bv5 32)))).def_107173))

eval N30504:
(assert (let ((.def_945455 (= m_pc (_ bv0 32)))).def_945455))
(assert (let ((.def_107173 (= a20 (_ bv5 32)))).def_107173))
(assert (let ((.def_948590 (= t1_pc (_ bv0 32)))).def_948590))
(assert (let ((.def_948593 (= t2_pc (_ bv0 32)))).def_948593))
(assert (let ((.def_948596 (= t3_pc (_ bv0 32)))).def_948596))
(assert (let ((.def_948599 (= t4_pc (_ bv0 32)))).def_948599))
(assert (let ((.def_948602 (= t5_pc (_ bv0 32)))).def_948602))
(assert (let ((.def_948604 (= m_pc (_ bv1 32)))).def_948604))
(assert (let ((.def_948606 (= t1_pc (_ bv1 32)))).def_948606))
(assert (let ((.def_948608 (= t2_pc (_ bv1 32)))).def_948608))
(assert (let ((.def_948610 (= t3_pc (_ bv1 32)))).def_948610))
(assert (let ((.def_948612 (= t4_pc (_ bv1 32)))).def_948612))
(assert (let ((.def_948614 (= t5_pc (_ bv1 32)))).def_948614))
(assert (let ((.def_948617 (= m_st (_ bv0 32)))).def_948617))
(assert (let ((.def_953283 (= E_3 (_ bv1 32)))).def_953283))
(assert (let ((.def_953286 (= E_2 (_ bv1 32)))).def_953286))
(assert (let ((.def_953289 (= E_5 (_ bv1 32)))).def_953289))
(assert (let ((.def_953292 (= E_M (_ bv1 32)))).def_953292))
(assert (let ((.def_953295 (= E_4 (_ bv1 32)))).def_953295))
(assert (let ((.def_953298 (= t1_st (_ bv0 32)))).def_953298))
(assert (let ((.def_953301 (= t2_st (_ bv0 32)))).def_953301))
(assert (let ((.def_953304 (= t4_st (_ bv0 32)))).def_953304))
(assert (let ((.def_953307 (= t3_st (_ bv0 32)))).def_953307))
(assert (let ((.def_953310 (= t5_st (_ bv0 32)))).def_953310))
(assert (let ((.def_953313 (bvadd (_ bv5 32) local)))(let ((.def_953315 (= .def_953313 token))).def_953315)))
(assert (let ((.def_966546 (= E_3 (_ bv2 32)))).def_966546))
(assert (let ((.def_966548 (= t4_st (_ bv2 32)))).def_966548))
(assert (let ((.def_966551 (= E_1 (_ bv1 32)))).def_966551))
(assert (let ((.def_966553 (= t5_st (_ bv2 32)))).def_966553))
(assert (let ((.def_966555 (= m_st (_ bv2 32)))).def_966555))
(assert (let ((.def_966557 (= t3_st (_ bv2 32)))).def_966557))
(assert (let ((.def_966559 (bvadd (_ bv1 32) local)))(let ((.def_966560 (= token .def_966559))).def_966560)))
(assert (let ((.def_966562 (= local token))).def_966562))
(assert (let ((.def_966564 (bvadd (_ bv2 32) local)))(let ((.def_966565 (= token .def_966564))).def_966565)))
(assert (let ((.def_966567 (bvadd (_ bv3 32) local)))(let ((.def_966568 (= token .def_966567))).def_966568)))
(assert (let ((.def_966570 (bvadd (_ bv4 32) local)))(let ((.def_966571 (= token .def_966570))).def_966571)))
(assert (let ((.def_977677 (= E_M (_ bv0 32)))).def_977677))
(assert (let ((.def_977679 (= E_2 (_ bv0 32)))).def_977679))
(assert (let ((.def_977681 (= E_1 (_ bv0 32)))).def_977681))
(assert (let ((.def_989151 (= E_5 (_ bv0 32)))).def_989151))
(assert (let ((.def_989153 (= E_4 (_ bv0 32)))).def_989153))
(assert (let ((.def_989155 (= E_3 (_ bv0 32)))).def_989155))
(assert (let ((.def_989158 (= T5_E (_ bv0 32)))).def_989158))
(assert (let ((.def_989161 (= T4_E (_ bv0 32)))).def_989161))
(assert (let ((.def_989164 (= T3_E (_ bv0 32)))).def_989164))
(assert (let ((.def_989167 (= T2_E (_ bv0 32)))).def_989167))
(assert (let ((.def_989170 (= T1_E (_ bv0 32)))).def_989170))
(assert (let ((.def_989173 (= M_E (_ bv0 32)))).def_989173))
(assert false)

start_simulation N30818:
(assert (let ((.def_945455 (= m_pc (_ bv0 32)))).def_945455))
(assert (let ((.def_107173 (= a20 (_ bv5 32)))).def_107173))
(assert (let ((.def_948590 (= t1_pc (_ bv0 32)))).def_948590))
(assert (let ((.def_948593 (= t2_pc (_ bv0 32)))).def_948593))
(assert (let ((.def_948596 (= t3_pc (_ bv0 32)))).def_948596))
(assert (let ((.def_948599 (= t4_pc (_ bv0 32)))).def_948599))
(assert (let ((.def_948602 (= t5_pc (_ bv0 32)))).def_948602))
(assert (let ((.def_948604 (= m_pc (_ bv1 32)))).def_948604))
(assert (let ((.def_948606 (= t1_pc (_ bv1 32)))).def_948606))
(assert (let ((.def_948608 (= t2_pc (_ bv1 32)))).def_948608))
(assert (let ((.def_948610 (= t3_pc (_ bv1 32)))).def_948610))
(assert (let ((.def_948612 (= t4_pc (_ bv1 32)))).def_948612))
(assert (let ((.def_948614 (= t5_pc (_ bv1 32)))).def_948614))
(assert (let ((.def_953283 (= E_3 (_ bv1 32)))).def_953283))
(assert (let ((.def_953286 (= E_2 (_ bv1 32)))).def_953286))
(assert (let ((.def_953289 (= E_5 (_ bv1 32)))).def_953289))
(assert (let ((.def_953292 (= E_M (_ bv1 32)))).def_953292))
(assert (let ((.def_953295 (= E_4 (_ bv1 32)))).def_953295))
(assert (let ((.def_948617 (= m_st (_ bv0 32)))).def_948617))
(assert (let ((.def_953310 (= t5_st (_ bv0 32)))).def_953310))
(assert (let ((.def_953307 (= t3_st (_ bv0 32)))).def_953307))
(assert (let ((.def_953301 (= t2_st (_ bv0 32)))).def_953301))
(assert (let ((.def_953298 (= t1_st (_ bv0 32)))).def_953298))
(assert (let ((.def_966546 (= E_3 (_ bv2 32)))).def_966546))
(assert (let ((.def_966548 (= t4_st (_ bv2 32)))).def_966548))
(assert (let ((.def_953304 (= t4_st (_ bv0 32)))).def_953304))
(assert (let ((.def_966551 (= E_1 (_ bv1 32)))).def_966551))
(assert (let ((.def_977677 (= E_M (_ bv0 32)))).def_977677))
(assert (let ((.def_977679 (= E_2 (_ bv0 32)))).def_977679))
(assert (let ((.def_989151 (= E_5 (_ bv0 32)))).def_989151))
(assert (let ((.def_989153 (= E_4 (_ bv0 32)))).def_989153))
(assert (let ((.def_989155 (= E_3 (_ bv0 32)))).def_989155))
(assert (let ((.def_989158 (= T5_E (_ bv0 32)))).def_989158))
(assert (let ((.def_989161 (= T4_E (_ bv0 32)))).def_989161))
(assert (let ((.def_989164 (= T3_E (_ bv0 32)))).def_989164))
(assert (let ((.def_989167 (= T2_E (_ bv0 32)))).def_989167))
(assert (let ((.def_989170 (= T1_E (_ bv0 32)))).def_989170))
(assert (let ((.def_989173 (= M_E (_ bv0 32)))).def_989173))

