(set-info :source |printed by MathSAT|)
(declare-fun a20 () (_ BitVec 32))
(declare-fun a25 () (_ BitVec 32))
(declare-fun a12 () (_ BitVec 32))
(declare-fun a15 () (_ BitVec 32))
(declare-fun a16 () (_ BitVec 32))
(declare-fun a2 () (_ BitVec 32))
(declare-fun a27 () (_ BitVec 32))
(declare-fun a9 () (_ BitVec 32))
(declare-fun m_pc () (_ BitVec 32))
(declare-fun t1_pc () (_ BitVec 32))
(declare-fun t2_pc () (_ BitVec 32))
(declare-fun t3_pc () (_ BitVec 32))
(declare-fun t4_pc () (_ BitVec 32))
(declare-fun t5_pc () (_ BitVec 32))
(declare-fun t6_pc () (_ BitVec 32))
(declare-fun t7_pc () (_ BitVec 32))
(declare-fun m_st () (_ BitVec 32))
(declare-fun t1_st () (_ BitVec 32))
(declare-fun E_3 () (_ BitVec 32))
(declare-fun E_2 () (_ BitVec 32))
(declare-fun E_5 () (_ BitVec 32))
(declare-fun E_4 () (_ BitVec 32))
(declare-fun E_M () (_ BitVec 32))
(declare-fun E_6 () (_ BitVec 32))
(declare-fun E_7 () (_ BitVec 32))
(declare-fun t2_st () (_ BitVec 32))
(declare-fun t3_st () (_ BitVec 32))
(declare-fun t4_st () (_ BitVec 32))
(declare-fun t6_st () (_ BitVec 32))
(declare-fun t5_st () (_ BitVec 32))
(declare-fun t7_st () (_ BitVec 32))
(declare-fun E_1 () (_ BitVec 32))
(declare-fun local () (_ BitVec 32))
(declare-fun token () (_ BitVec 32))
(declare-fun T7_E () (_ BitVec 32))
(declare-fun T6_E () (_ BitVec 32))
(declare-fun T5_E () (_ BitVec 32))
(declare-fun T4_E () (_ BitVec 32))
(declare-fun T3_E () (_ BitVec 32))
(declare-fun T2_E () (_ BitVec 32))
(declare-fun T1_E () (_ BitVec 32))
(declare-fun M_E () (_ BitVec 32))

*:
(assert (let ((.def_107863 (= a20 (_ bv5 32)))).def_107863))

calculate_output8 N30108:
(assert false)
(assert (let ((.def_107863 (= a20 (_ bv5 32)))).def_107863))

main1 N30136:
(assert (let ((.def_107863 (= a20 (_ bv5 32)))).def_107863))
(assert (let ((.def_155586 (= a25 (_ bv1 32)))).def_155586))
(assert (let ((.def_155589 (= a12 (_ bv4 32)))).def_155589))
(assert (let ((.def_155592 (= a15 (_ bv1 32)))).def_155592))
(assert (let ((.def_155595 (= a16 (_ bv1 32)))).def_155595))
(assert (let ((.def_155598 (= a2 (_ bv10 32)))).def_155598))
(assert (let ((.def_155601 (= a27 (_ bv1 32)))).def_155601))
(assert (let ((.def_155604 (= a9 (_ bv18 32)))).def_155604))
(assert (let ((.def_321776 (= a12 (_ bv5 32)))).def_321776))
(assert (let ((.def_321778 (= a2 (_ bv13 32)))).def_321778))
(assert (let ((.def_321780 (= a12 (_ bv2 32)))).def_321780))
(assert (let ((.def_321782 (= a2 (_ bv12 32)))).def_321782))
(assert (let ((.def_321784 (= a12 (_ bv3 32)))).def_321784))
(assert (let ((.def_321786 (= a9 (_ bv16 32)))).def_321786))
(assert (let ((.def_321788 (= a20 (_ bv7 32)))).def_321788))
(assert (let ((.def_321790 (= a2 (_ bv9 32)))).def_321790))
(assert (let ((.def_321792 (= a9 (_ bv17 32)))).def_321792))

error N30154:
(assert false)
(assert (let ((.def_107863 (= a20 (_ bv5 32)))).def_107863))

eval N30612:
(assert (let ((.def_747161 (= m_pc (_ bv0 32)))).def_747161))
(assert (let ((.def_107863 (= a20 (_ bv5 32)))).def_107863))
(assert (let ((.def_752351 (= t1_pc (_ bv0 32)))).def_752351))
(assert (let ((.def_752354 (= t2_pc (_ bv0 32)))).def_752354))
(assert (let ((.def_752357 (= t3_pc (_ bv0 32)))).def_752357))
(assert (let ((.def_752360 (= t4_pc (_ bv0 32)))).def_752360))
(assert (let ((.def_752363 (= t5_pc (_ bv0 32)))).def_752363))
(assert (let ((.def_752366 (= t6_pc (_ bv0 32)))).def_752366))
(assert (let ((.def_752369 (= t7_pc (_ bv0 32)))).def_752369))
(assert (let ((.def_752371 (= m_pc (_ bv1 32)))).def_752371))
(assert (let ((.def_752373 (= t1_pc (_ bv1 32)))).def_752373))
(assert (let ((.def_752375 (= t2_pc (_ bv1 32)))).def_752375))
(assert (let ((.def_752377 (= t3_pc (_ bv1 32)))).def_752377))
(assert (let ((.def_752379 (= t4_pc (_ bv1 32)))).def_752379))
(assert (let ((.def_752381 (= t5_pc (_ bv1 32)))).def_752381))
(assert (let ((.def_752383 (= t6_pc (_ bv1 32)))).def_752383))
(assert (let ((.def_752385 (= t7_pc (_ bv1 32)))).def_752385))
(assert (let ((.def_752388 (= m_st (_ bv0 32)))).def_752388))
(assert (let ((.def_763122 (= t1_st (_ bv0 32)))).def_763122))
(assert (let ((.def_763125 (= E_3 (_ bv1 32)))).def_763125))
(assert (let ((.def_763128 (= E_2 (_ bv1 32)))).def_763128))
(assert (let ((.def_763131 (= E_5 (_ bv1 32)))).def_763131))
(assert (let ((.def_763134 (= E_4 (_ bv1 32)))).def_763134))
(assert (let ((.def_763137 (= E_M (_ bv1 32)))).def_763137))
(assert (let ((.def_763140 (= E_6 (_ bv1 32)))).def_763140))
(assert (let ((.def_763143 (= E_7 (_ bv1 32)))).def_763143))
(assert (let ((.def_763146 (= t2_st (_ bv0 32)))).def_763146))
(assert (let ((.def_763149 (= t3_st (_ bv0 32)))).def_763149))
(assert (let ((.def_763152 (= t4_st (_ bv0 32)))).def_763152))
(assert (let ((.def_763155 (= t6_st (_ bv0 32)))).def_763155))
(assert (let ((.def_763158 (= t5_st (_ bv0 32)))).def_763158))
(assert (let ((.def_763161 (= t7_st (_ bv0 32)))).def_763161))
(assert (let ((.def_763163 (= m_st (_ bv2 32)))).def_763163))
(assert (let ((.def_763166 (= E_1 (_ bv1 32)))).def_763166))
(assert (let ((.def_763169 (bvadd (_ bv7 32) local)))(let ((.def_763171 (= .def_763169 token))).def_763171)))
(assert (let ((.def_799523 (= E_2 (_ bv2 32)))).def_799523))
(assert (let ((.def_799525 (= local token))).def_799525))
(assert (let ((.def_799527 (= E_4 (_ bv2 32)))).def_799527))
(assert (let ((.def_799529 (= E_5 (_ bv2 32)))).def_799529))
(assert (let ((.def_799531 (= E_6 (_ bv2 32)))).def_799531))
(assert (let ((.def_799533 (= t5_st (_ bv2 32)))).def_799533))
(assert (let ((.def_799535 (= t7_st (_ bv2 32)))).def_799535))
(assert (let ((.def_799537 (bvadd (_ bv5 32) local)))(let ((.def_799538 (= token .def_799537))).def_799538)))
(assert (let ((.def_799540 (bvadd (_ bv6 32) local)))(let ((.def_799541 (= token .def_799540))).def_799541)))
(assert (let ((.def_799543 (bvadd (_ bv4 32) local)))(let ((.def_799544 (= token .def_799543))).def_799544)))
(assert (let ((.def_799546 (bvadd (_ bv3 32) local)))(let ((.def_799547 (= token .def_799546))).def_799547)))
(assert (let ((.def_799549 (bvadd (_ bv2 32) local)))(let ((.def_799550 (= token .def_799549))).def_799550)))
(assert (let ((.def_799552 (bvadd (_ bv1 32) local)))(let ((.def_799553 (= token .def_799552))).def_799553)))
(assert (let ((.def_831253 (= E_M (_ bv0 32)))).def_831253))
(assert (let ((.def_831255 (= E_1 (_ bv0 32)))).def_831255))
(assert (let ((.def_863419 (= E_3 (_ bv0 32)))).def_863419))
(assert (let ((.def_863421 (= E_5 (_ bv0 32)))).def_863421))
(assert (let ((.def_863423 (= E_6 (_ bv0 32)))).def_863423))
(assert (let ((.def_863426 (= T7_E (_ bv0 32)))).def_863426))
(assert (let ((.def_863429 (= T6_E (_ bv0 32)))).def_863429))
(assert (let ((.def_863432 (= T5_E (_ bv0 32)))).def_863432))
(assert (let ((.def_863435 (= T4_E (_ bv0 32)))).def_863435))
(assert (let ((.def_863438 (= T3_E (_ bv0 32)))).def_863438))
(assert (let ((.def_863441 (= T2_E (_ bv0 32)))).def_863441))
(assert (let ((.def_863444 (= T1_E (_ bv0 32)))).def_863444))
(assert (let ((.def_863446 (= E_2 (_ bv0 32)))).def_863446))
(assert (let ((.def_863448 (= E_7 (_ bv0 32)))).def_863448))
(assert (let ((.def_863450 (= E_4 (_ bv0 32)))).def_863450))
(assert (let ((.def_863453 (= M_E (_ bv0 32)))).def_863453))
(assert false)

start_simulation N31008:
(assert (let ((.def_747161 (= m_pc (_ bv0 32)))).def_747161))
(assert (let ((.def_107863 (= a20 (_ bv5 32)))).def_107863))
(assert (let ((.def_752351 (= t1_pc (_ bv0 32)))).def_752351))
(assert (let ((.def_752354 (= t2_pc (_ bv0 32)))).def_752354))
(assert (let ((.def_752357 (= t3_pc (_ bv0 32)))).def_752357))
(assert (let ((.def_752360 (= t4_pc (_ bv0 32)))).def_752360))
(assert (let ((.def_752363 (= t5_pc (_ bv0 32)))).def_752363))
(assert (let ((.def_752366 (= t6_pc (_ bv0 32)))).def_752366))
(assert (let ((.def_752369 (= t7_pc (_ bv0 32)))).def_752369))
(assert (let ((.def_752371 (= m_pc (_ bv1 32)))).def_752371))
(assert (let ((.def_752373 (= t1_pc (_ bv1 32)))).def_752373))
(assert (let ((.def_752375 (= t2_pc (_ bv1 32)))).def_752375))
(assert (let ((.def_752377 (= t3_pc (_ bv1 32)))).def_752377))
(assert (let ((.def_752379 (= t4_pc (_ bv1 32)))).def_752379))
(assert (let ((.def_752381 (= t5_pc (_ bv1 32)))).def_752381))
(assert (let ((.def_752383 (= t6_pc (_ bv1 32)))).def_752383))
(assert (let ((.def_752385 (= t7_pc (_ bv1 32)))).def_752385))
(assert (let ((.def_763122 (= t1_st (_ bv0 32)))).def_763122))
(assert (let ((.def_763125 (= E_3 (_ bv1 32)))).def_763125))
(assert (let ((.def_763128 (= E_2 (_ bv1 32)))).def_763128))
(assert (let ((.def_763131 (= E_5 (_ bv1 32)))).def_763131))
(assert (let ((.def_763134 (= E_4 (_ bv1 32)))).def_763134))
(assert (let ((.def_763137 (= E_M (_ bv1 32)))).def_763137))
(assert (let ((.def_763140 (= E_6 (_ bv1 32)))).def_763140))
(assert (let ((.def_763143 (= E_7 (_ bv1 32)))).def_763143))
(assert (let ((.def_752388 (= m_st (_ bv0 32)))).def_752388))
(assert (let ((.def_763158 (= t5_st (_ bv0 32)))).def_763158))
(assert (let ((.def_763152 (= t4_st (_ bv0 32)))).def_763152))
(assert (let ((.def_763161 (= t7_st (_ bv0 32)))).def_763161))
(assert (let ((.def_799523 (= E_2 (_ bv2 32)))).def_799523))
(assert (let ((.def_799525 (= local token))).def_799525))
(assert (let ((.def_763166 (= E_1 (_ bv1 32)))).def_763166))
(assert (let ((.def_799527 (= E_4 (_ bv2 32)))).def_799527))
(assert (let ((.def_799529 (= E_5 (_ bv2 32)))).def_799529))
(assert (let ((.def_799531 (= E_6 (_ bv2 32)))).def_799531))
(assert (let ((.def_763146 (= t2_st (_ bv0 32)))).def_763146))
(assert (let ((.def_831253 (= E_M (_ bv0 32)))).def_831253))
(assert (let ((.def_863419 (= E_3 (_ bv0 32)))).def_863419))
(assert (let ((.def_763155 (= t6_st (_ bv0 32)))).def_763155))
(assert (let ((.def_863421 (= E_5 (_ bv0 32)))).def_863421))
(assert (let ((.def_863423 (= E_6 (_ bv0 32)))).def_863423))
(assert (let ((.def_863426 (= T7_E (_ bv0 32)))).def_863426))
(assert (let ((.def_863429 (= T6_E (_ bv0 32)))).def_863429))
(assert (let ((.def_863432 (= T5_E (_ bv0 32)))).def_863432))
(assert (let ((.def_863435 (= T4_E (_ bv0 32)))).def_863435))
(assert (let ((.def_863438 (= T3_E (_ bv0 32)))).def_863438))
(assert (let ((.def_863441 (= T2_E (_ bv0 32)))).def_863441))
(assert (let ((.def_863444 (= T1_E (_ bv0 32)))).def_863444))
(assert (let ((.def_863446 (= E_2 (_ bv0 32)))).def_863446))
(assert (let ((.def_863448 (= E_7 (_ bv0 32)))).def_863448))
(assert (let ((.def_863450 (= E_4 (_ bv0 32)))).def_863450))
(assert (let ((.def_763149 (= t3_st (_ bv0 32)))).def_763149))
(assert (let ((.def_863453 (= M_E (_ bv0 32)))).def_863453))

