(set-info :source |printed by MathSAT|)
(declare-fun |ssl3_connect::blastFlag| () (_ BitVec 32))
(declare-fun |ssl3_connect::s__state| () (_ BitVec 32))
(declare-fun |ssl3_connect::cb| () (_ BitVec 32))
(declare-fun |ssl3_connect::skip| () (_ BitVec 32))
(declare-fun |ssl3_connect::s__s3__tmp__reuse_message| () (_ BitVec 32))
(declare-fun |ssl3_connect::s__s3__tmp__next_state___0| () (_ BitVec 32))
(declare-fun |ssl3_connect::s__hit| () (_ BitVec 32))
(declare-fun |ssl3_connect::s__s3__tmp__cert_req| () (_ BitVec 32))
(declare-fun |ssl3_accept::blastFlag| () (_ BitVec 32))
(declare-fun |ssl3_accept::s__state| () (_ BitVec 32))
(declare-fun |ssl3_accept::s__s3__tmp__reuse_message| () (_ BitVec 32))
(declare-fun |ssl3_accept::cb| () (_ BitVec 32))
(declare-fun |ssl3_accept::s__hit| () (_ BitVec 32))
(declare-fun |ssl3_accept::s__s3__tmp__next_state___0| () (_ BitVec 32))

ssl3_connect:
(assert (let ((.def_698 (= |ssl3_connect::blastFlag| (_ bv5 32)))).def_698))

ssl3_connect N116:
(assert (let ((.def_1604 (= |ssl3_connect::s__state| (_ bv12292 32)))).def_1604))
(assert (let ((.def_1606 (= |ssl3_connect::blastFlag| (_ bv0 32)))).def_1606))
(assert (let ((.def_698 (= |ssl3_connect::blastFlag| (_ bv5 32)))).def_698))
(assert (let ((.def_3713 (= |ssl3_connect::cb| (_ bv0 32)))).def_3713))
(assert (let ((.def_3715 (= |ssl3_connect::blastFlag| (_ bv4 32)))).def_3715))
(assert (let ((.def_3717 (= |ssl3_connect::s__state| (_ bv4384 32)))).def_3717))
(assert (let ((.def_3719 (= |ssl3_connect::blastFlag| (_ bv1 32)))).def_3719))
(assert (let ((.def_3721 (= |ssl3_connect::blastFlag| (_ bv3 32)))).def_3721))
(assert (let ((.def_3723 (= |ssl3_connect::blastFlag| (_ bv2 32)))).def_3723))
(assert (let ((.def_3725 (= |ssl3_connect::s__state| (_ bv4416 32)))).def_3725))
(assert (let ((.def_3727 (= |ssl3_connect::s__state| (_ bv4400 32)))).def_3727))
(assert (let ((.def_3729 (= |ssl3_connect::s__state| (_ bv4432 32)))).def_3729))
(assert (let ((.def_9071 (= |ssl3_connect::s__state| (_ bv4368 32)))).def_9071))
(assert (let ((.def_9074 (= |ssl3_connect::skip| (_ bv0 32)))).def_9074))
(assert (let ((.def_9076 (= |ssl3_connect::s__state| (_ bv4099 32)))).def_9076))
(assert (let ((.def_9078 (= |ssl3_connect::s__state| (_ bv20480 32)))).def_9078))
(assert (let ((.def_9080 (= |ssl3_connect::s__state| (_ bv4096 32)))).def_9080))
(assert (let ((.def_9082 (= |ssl3_connect::s__state| (_ bv16384 32)))).def_9082))
(assert (let ((.def_9085 (= |ssl3_connect::s__s3__tmp__reuse_message| (_ bv0 32)))).def_9085))
(assert (let ((.def_9087 (= |ssl3_connect::s__state| (_ bv4369 32)))).def_9087))
(assert (let ((.def_9090 (= |ssl3_connect::s__state| |ssl3_connect::s__s3__tmp__next_state___0|))).def_9090))
(assert (let ((.def_9092 (= |ssl3_connect::s__state| (_ bv4352 32)))).def_9092))
(assert (let ((.def_9094 (= |ssl3_connect::s__state| (_ bv4512 32)))).def_9094))
(assert (let ((.def_9096 (= |ssl3_connect::s__state| (_ bv4496 32)))).def_9096))
(assert (let ((.def_9098 (= |ssl3_connect::s__state| (_ bv4480 32)))).def_9098))
(assert (let ((.def_9100 (= |ssl3_connect::s__state| (_ bv4464 32)))).def_9100))
(assert (let ((.def_9102 (= |ssl3_connect::s__s3__tmp__next_state___0| (_ bv4416 32)))).def_9102))
(assert (let ((.def_9104 (= |ssl3_connect::s__s3__tmp__next_state___0| (_ bv4432 32)))).def_9104))
(assert (let ((.def_9106 (= |ssl3_connect::s__s3__tmp__next_state___0| (_ bv4513 32)))).def_9106))
(assert (let ((.def_9108 (= |ssl3_connect::s__s3__tmp__next_state___0| (_ bv4512 32)))).def_9108))
(assert (let ((.def_9110 (= |ssl3_connect::s__s3__tmp__next_state___0| (_ bv4481 32)))).def_9110))
(assert (let ((.def_9112 (= |ssl3_connect::s__s3__tmp__next_state___0| (_ bv4480 32)))).def_9112))
(assert (let ((.def_9114 (= |ssl3_connect::s__s3__tmp__next_state___0| (_ bv4417 32)))).def_9114))
(assert (let ((.def_9116 (= |ssl3_connect::s__state| (_ bv4401 32)))).def_9116))
(assert (let ((.def_9118 (= |ssl3_connect::s__state| (_ bv4528 32)))).def_9118))
(assert (let ((.def_9120 (= |ssl3_connect::s__state| (_ bv4529 32)))).def_9120))
(assert (let ((.def_9122 (= |ssl3_connect::s__state| (_ bv4560 32)))).def_9122))
(assert (let ((.def_9124 (= |ssl3_connect::s__state| (_ bv4561 32)))).def_9124))
(assert (let ((.def_9126 (= |ssl3_connect::s__state| (_ bv4481 32)))).def_9126))
(assert (let ((.def_9128 (= |ssl3_connect::s__state| (_ bv4467 32)))).def_9128))
(assert (let ((.def_9130 (= |ssl3_connect::s__state| (_ bv4466 32)))).def_9130))
(assert (let ((.def_9132 (= |ssl3_connect::s__state| (_ bv4465 32)))).def_9132))
(assert (let ((.def_9134 (= |ssl3_connect::s__state| (_ bv4385 32)))).def_9134))
(assert (let ((.def_9136 (= |ssl3_connect::s__state| (_ bv4513 32)))).def_9136))
(assert (let ((.def_9138 (= |ssl3_connect::s__state| (_ bv4417 32)))).def_9138))
(assert (let ((.def_9141 (= |ssl3_connect::s__hit| (_ bv0 32)))).def_9141))
(assert (let ((.def_9143 (= |ssl3_connect::s__s3__tmp__next_state___0| (_ bv4433 32)))).def_9143))
(assert (let ((.def_9146 (= |ssl3_connect::s__s3__tmp__cert_req| (_ bv0 32)))).def_9146))
(assert (let ((.def_9148 (= |ssl3_connect::s__state| (_ bv4433 32)))).def_9148))
(assert (let ((.def_26402 (= |ssl3_connect::s__s3__tmp__next_state___0| (_ bv4352 32)))).def_26402))
(assert (let ((.def_26404 (= |ssl3_connect::s__s3__tmp__next_state___0| (_ bv4528 32)))).def_26404))
(assert (let ((.def_26406 (= |ssl3_connect::s__s3__tmp__next_state___0| (_ bv4449 32)))).def_26406))
(assert (let ((.def_26408 (= |ssl3_connect::s__s3__tmp__next_state___0| (_ bv4448 32)))).def_26408))
(assert (let ((.def_26410 (= |ssl3_connect::s__s3__tmp__next_state___0| (_ bv4529 32)))).def_26410))
(assert (let ((.def_26412 (= |ssl3_connect::s__s3__tmp__next_state___0| (_ bv4497 32)))).def_26412))
(assert (let ((.def_26414 (= |ssl3_connect::s__s3__tmp__next_state___0| (_ bv4496 32)))).def_26414))
(assert (let ((.def_26416 (= |ssl3_connect::s__s3__tmp__next_state___0| (_ bv4467 32)))).def_26416))
(assert (let ((.def_26418 (= |ssl3_connect::s__s3__tmp__next_state___0| (_ bv4466 32)))).def_26418))
(assert (let ((.def_26420 (= |ssl3_connect::s__s3__tmp__next_state___0| (_ bv4465 32)))).def_26420))
(assert (let ((.def_26422 (= |ssl3_connect::s__s3__tmp__next_state___0| (_ bv4464 32)))).def_26422))
(assert (let ((.def_26424 (= |ssl3_connect::s__s3__tmp__next_state___0| (_ bv12292 32)))).def_26424))
(assert (let ((.def_26426 (= |ssl3_connect::s__s3__tmp__next_state___0| (_ bv4096 32)))).def_26426))
(assert (let ((.def_26428 (= |ssl3_connect::s__s3__tmp__next_state___0| (_ bv20480 32)))).def_26428))
(assert (let ((.def_26430 (= |ssl3_connect::s__s3__tmp__next_state___0| (_ bv16384 32)))).def_26430))
(assert (let ((.def_26432 (= |ssl3_connect::s__s3__tmp__next_state___0| (_ bv4099 32)))).def_26432))
(assert (let ((.def_26434 (= |ssl3_connect::s__state| (_ bv4448 32)))).def_26434))
(assert (let ((.def_26436 (= |ssl3_connect::s__state| (_ bv4449 32)))).def_26436))
(assert (let ((.def_26438 (= |ssl3_connect::s__state| (_ bv4497 32)))).def_26438))
(assert (let ((.def_26440 (= |ssl3_connect::s__s3__tmp__next_state___0| (_ bv4368 32)))).def_26440))
(assert (let ((.def_26442 (= |ssl3_connect::s__s3__tmp__next_state___0| (_ bv4369 32)))).def_26442))
(assert (let ((.def_26444 (= |ssl3_connect::s__s3__tmp__next_state___0| (_ bv4385 32)))).def_26444))
(assert (let ((.def_26446 (= |ssl3_connect::s__s3__tmp__next_state___0| (_ bv4384 32)))).def_26446))
(assert (let ((.def_26448 (= |ssl3_connect::s__s3__tmp__next_state___0| (_ bv4400 32)))).def_26448))
(assert (let ((.def_26450 (= |ssl3_connect::s__s3__tmp__next_state___0| (_ bv4401 32)))).def_26450))

ssl3_connect N573:
(assert false)
(assert (let ((.def_698 (= |ssl3_connect::blastFlag| (_ bv5 32)))).def_698))

ssl3_accept N696:
(assert (let ((.def_34575 (= |ssl3_accept::blastFlag| (_ bv21 32)))).def_34575))
(assert (let ((.def_35924 (= |ssl3_accept::s__state| (_ bv8464 32)))).def_35924))
(assert (let ((.def_35926 (= |ssl3_accept::blastFlag| (_ bv0 32)))).def_35926))
(assert (let ((.def_37572 (= |ssl3_accept::s__state| (_ bv8481 32)))).def_37572))
(assert (let ((.def_37574 (= |ssl3_accept::s__state| (_ bv8480 32)))).def_37574))
(assert (let ((.def_37576 (= |ssl3_accept::s__state| (_ bv12292 32)))).def_37576))
(assert (let ((.def_37578 (= |ssl3_accept::s__state| (_ bv16384 32)))).def_37578))
(assert (let ((.def_37580 (= |ssl3_accept::s__state| (_ bv8192 32)))).def_37580))
(assert (let ((.def_37582 (= |ssl3_accept::s__state| (_ bv24576 32)))).def_37582))
(assert (let ((.def_37584 (= |ssl3_accept::s__state| (_ bv8195 32)))).def_37584))
(assert (let ((.def_37586 (= |ssl3_accept::s__state| (_ bv8482 32)))).def_37586))
(assert (let ((.def_37588 (= |ssl3_accept::s__state| (_ bv8496 32)))).def_37588))
(assert (let ((.def_37591 (= |ssl3_accept::s__s3__tmp__reuse_message| (_ bv0 32)))).def_37591))
(assert (let ((.def_37593 (= |ssl3_accept::blastFlag| (_ bv1 32)))).def_37593))
(assert (let ((.def_40150 (= |ssl3_accept::blastFlag| (_ bv20 32)))).def_40150))
(assert (let ((.def_40153 (= |ssl3_accept::cb| (_ bv0 32)))).def_40153))
(assert (let ((.def_40155 (= |ssl3_accept::s__state| (_ bv8466 32)))).def_40155))
(assert (let ((.def_40157 (= |ssl3_accept::s__state| (_ bv8448 32)))).def_40157))
(assert (let ((.def_40160 (= |ssl3_accept::s__hit| (_ bv0 32)))).def_40160))
(assert (let ((.def_40162 (= |ssl3_accept::s__state| (_ bv8592 32)))).def_40162))
(assert (let ((.def_40164 (= |ssl3_accept::s__state| (_ bv8512 32)))).def_40164))
(assert (let ((.def_40166 (= |ssl3_accept::s__state| (_ bv8528 32)))).def_40166))
(assert (let ((.def_40168 (= |ssl3_accept::s__state| (_ bv8544 32)))).def_40168))
(assert (let ((.def_40170 (= |ssl3_accept::s__state| (_ bv8560 32)))).def_40170))
(assert (let ((.def_40172 (= |ssl3_accept::s__state| (_ bv8497 32)))).def_40172))
(assert (let ((.def_40175 (= |ssl3_accept::s__s3__tmp__next_state___0| (_ bv8576 32)))).def_40175))
(assert (let ((.def_40177 (= |ssl3_accept::s__s3__tmp__next_state___0| (_ bv3 32)))).def_40177))
(assert (let ((.def_40179 (= |ssl3_accept::s__state| (_ bv8576 32)))).def_40179))
(assert (let ((.def_40181 (= |ssl3_accept::s__state| (_ bv8608 32)))).def_40181))
(assert (let ((.def_40183 (= |ssl3_accept::s__state| (_ bv8641 32)))).def_40183))
(assert (let ((.def_40185 (= |ssl3_accept::s__state| (_ bv8640 32)))).def_40185))
(assert (let ((.def_45321 (= |ssl3_accept::s__state| (_ bv8465 32)))).def_45321))
(assert (let ((.def_45323 (= |ssl3_accept::blastFlag| (_ bv6 32)))).def_45323))
(assert (let ((.def_45325 (= |ssl3_accept::blastFlag| (_ bv16 32)))).def_45325))
(assert (let ((.def_45327 (= |ssl3_accept::blastFlag| (_ bv13 32)))).def_45327))
(assert (let ((.def_45329 (= |ssl3_accept::blastFlag| (_ bv10 32)))).def_45329))
(assert (let ((.def_45331 (= |ssl3_accept::blastFlag| (_ bv19 32)))).def_45331))
(assert (let ((.def_45333 (= |ssl3_accept::s__state| (_ bv8656 32)))).def_45333))
(assert (let ((.def_45335 (= |ssl3_accept::s__state| (_ bv8561 32)))).def_45335))
(assert (let ((.def_45337 (= |ssl3_accept::s__state| (_ bv8593 32)))).def_45337))
(assert (let ((.def_45339 (= |ssl3_accept::s__state| (_ bv8577 32)))).def_45339))
(assert (let ((.def_45341 (= |ssl3_accept::s__state| (_ bv8609 32)))).def_45341))
(assert (let ((.def_45343 (= |ssl3_accept::s__state| (_ bv8513 32)))).def_45343))
(assert (let ((.def_45345 (= |ssl3_accept::s__state| (_ bv8529 32)))).def_45345))
(assert (let ((.def_45347 (= |ssl3_accept::s__state| (_ bv8545 32)))).def_45347))
(assert (let ((.def_45349 (= |ssl3_accept::blastFlag| (_ bv5 32)))).def_45349))
(assert (let ((.def_45351 (= |ssl3_accept::blastFlag| (_ bv8 32)))).def_45351))
(assert (let ((.def_45353 (= |ssl3_accept::blastFlag| (_ bv7 32)))).def_45353))
(assert (let ((.def_45355 (= |ssl3_accept::s__s3__tmp__next_state___0| (_ bv8482 32)))).def_45355))
(assert (let ((.def_45357 (= |ssl3_accept::blastFlag| (_ bv14 32)))).def_45357))
(assert (let ((.def_45359 (= |ssl3_accept::blastFlag| (_ bv11 32)))).def_45359))
(assert (let ((.def_45361 (= |ssl3_accept::blastFlag| (_ bv17 32)))).def_45361))
(assert (let ((.def_45363 (= |ssl3_accept::s__state| (_ bv8672 32)))).def_45363))
(assert (let ((.def_45365 (= |ssl3_accept::s__state| (_ bv8673 32)))).def_45365))
(assert (let ((.def_45367 (= |ssl3_accept::s__state| (_ bv8657 32)))).def_45367))

ssl3_accept N1277:
(assert false)

