(set-info :source |printed by MathSAT|)
(declare-fun |ssl3_connect::blastFlag| () (_ BitVec 32))
(declare-fun |ssl3_connect::s__state| () (_ BitVec 32))
(declare-fun |ssl3_connect::s__s3__tmp__reuse_message| () (_ BitVec 32))
(declare-fun |ssl3_connect::s__hit| () (_ BitVec 32))
(declare-fun |ssl3_connect::s__s3__tmp__next_state___0| () (_ BitVec 32))
(declare-fun |ssl3_connect::skip| () (_ BitVec 32))
(declare-fun |ssl3_connect::s__s3__tmp__new_cipher__algorithms| () (_ BitVec 32))
(declare-fun |ssl3_connect::cb| () (_ BitVec 32))
(declare-fun |ssl3_accept::blastFlag| () (_ BitVec 32))
(declare-fun |ssl3_accept::s__state| () (_ BitVec 32))
(declare-fun |ssl3_accept::s__hit| () (_ BitVec 32))
(declare-fun |ssl3_accept::s__s3__tmp__next_state___0| () (_ BitVec 32))
(declare-fun |ssl3_accept::skip| () (_ BitVec 32))
(declare-fun |ssl3_accept::s__s3__tmp__reuse_message| () (_ BitVec 32))
(declare-fun |ssl3_accept::s__verify_mode| () (_ BitVec 32))
(declare-fun |ssl3_accept::s__s3__tmp__new_cipher__algorithms| () (_ BitVec 32))
(declare-fun |ssl3_accept::s__session__peer| () (_ BitVec 32))

ssl3_connect:
(assert (let ((.def_558 (= |ssl3_connect::blastFlag| (_ bv5 32)))).def_558))

ssl3_connect N85:
(assert (let ((.def_1407 (= |ssl3_connect::s__state| (_ bv12292 32)))).def_1407))
(assert (let ((.def_1409 (= |ssl3_connect::blastFlag| (_ bv0 32)))).def_1409))
(assert (let ((.def_558 (= |ssl3_connect::blastFlag| (_ bv5 32)))).def_558))
(assert (let ((.def_3367 (= |ssl3_connect::s__s3__tmp__reuse_message| (_ bv0 32)))).def_3367))
(assert (let ((.def_3369 (= |ssl3_connect::blastFlag| (_ bv4 32)))).def_3369))
(assert (let ((.def_3371 (= |ssl3_connect::blastFlag| (_ bv3 32)))).def_3371))
(assert (let ((.def_3373 (= |ssl3_connect::s__state| (_ bv4384 32)))).def_3373))
(assert (let ((.def_3375 (= |ssl3_connect::blastFlag| (_ bv1 32)))).def_3375))
(assert (let ((.def_3377 (= |ssl3_connect::s__state| (_ bv4368 32)))).def_3377))
(assert (let ((.def_3379 (= |ssl3_connect::blastFlag| (_ bv2 32)))).def_3379))
(assert (let ((.def_7473 (= |ssl3_connect::s__hit| (_ bv0 32)))).def_7473))
(assert (let ((.def_7476 (= |ssl3_connect::s__state| |ssl3_connect::s__s3__tmp__next_state___0|))).def_7476))
(assert (let ((.def_7478 (= |ssl3_connect::s__s3__tmp__next_state___0| (_ bv4401 32)))).def_7478))
(assert (let ((.def_7480 (= |ssl3_connect::s__state| (_ bv4352 32)))).def_7480))
(assert (let ((.def_7482 (= |ssl3_connect::s__state| (_ bv4560 32)))).def_7482))
(assert (let ((.def_7484 (= |ssl3_connect::s__state| (_ bv4416 32)))).def_7484))
(assert (let ((.def_7486 (= |ssl3_connect::s__state| (_ bv4400 32)))).def_7486))
(assert (let ((.def_7488 (= |ssl3_connect::s__state| (_ bv4432 32)))).def_7488))
(assert (let ((.def_7490 (= |ssl3_connect::s__state| (_ bv4529 32)))).def_7490))
(assert (let ((.def_7492 (= |ssl3_connect::s__state| (_ bv4528 32)))).def_7492))
(assert (let ((.def_7494 (= |ssl3_connect::s__state| (_ bv4401 32)))).def_7494))
(assert (let ((.def_7497 (= |ssl3_connect::skip| (_ bv0 32)))).def_7497))
(assert (let ((.def_7499 (= |ssl3_connect::s__state| (_ bv4417 32)))).def_7499))
(assert (let ((.def_7501 (= |ssl3_connect::s__state| (_ bv4480 32)))).def_7501))
(assert (let ((.def_7503 (= |ssl3_connect::s__state| (_ bv4449 32)))).def_7503))
(assert (let ((.def_7505 (= |ssl3_connect::s__state| (_ bv4448 32)))).def_7505))
(assert (let ((.def_7507 (= |ssl3_connect::s__state| (_ bv4481 32)))).def_7507))
(assert (let ((.def_7509 (= |ssl3_connect::s__s3__tmp__next_state___0| (_ bv4432 32)))).def_7509))
(assert (let ((.def_7512 (= |ssl3_connect::s__s3__tmp__new_cipher__algorithms| (_ bv4294967040 32)))).def_7512))
(assert (let ((.def_7514 (= |ssl3_connect::s__state| (_ bv4433 32)))).def_7514))
(assert (let ((.def_7517 (= |ssl3_connect::cb| (_ bv0 32)))).def_7517))
(assert (let ((.def_7519 (= |ssl3_connect::s__s3__tmp__next_state___0| (_ bv4433 32)))).def_7519))
(assert (let ((.def_17058 (= |ssl3_connect::s__s3__tmp__next_state___0| (_ bv4099 32)))).def_17058))
(assert (let ((.def_17060 (= |ssl3_connect::s__s3__tmp__next_state___0| (_ bv12292 32)))).def_17060))
(assert (let ((.def_17062 (= |ssl3_connect::s__s3__tmp__next_state___0| (_ bv16384 32)))).def_17062))
(assert (let ((.def_17064 (= |ssl3_connect::s__s3__tmp__next_state___0| (_ bv4096 32)))).def_17064))
(assert (let ((.def_17066 (= |ssl3_connect::s__s3__tmp__next_state___0| (_ bv20480 32)))).def_17066))
(assert (let ((.def_17068 (= |ssl3_connect::s__state| (_ bv4096 32)))).def_17068))
(assert (let ((.def_17070 (= |ssl3_connect::s__state| (_ bv4099 32)))).def_17070))
(assert (let ((.def_17072 (= |ssl3_connect::s__state| (_ bv20480 32)))).def_17072))
(assert (let ((.def_17074 (= |ssl3_connect::s__state| (_ bv16384 32)))).def_17074))
(assert (let ((.def_17076 (= |ssl3_connect::s__s3__tmp__next_state___0| (_ bv4368 32)))).def_17076))
(assert (let ((.def_17078 (= |ssl3_connect::s__s3__tmp__next_state___0| (_ bv4369 32)))).def_17078))
(assert (let ((.def_17080 (= |ssl3_connect::s__state| (_ bv4385 32)))).def_17080))
(assert (let ((.def_17082 (= |ssl3_connect::s__state| (_ bv4369 32)))).def_17082))
(assert (let ((.def_17084 (= |ssl3_connect::s__s3__tmp__next_state___0| (_ bv4384 32)))).def_17084))
(assert (let ((.def_17086 (= |ssl3_connect::s__s3__tmp__next_state___0| (_ bv4385 32)))).def_17086))
(assert (let ((.def_17088 (= |ssl3_connect::s__state| (_ bv4496 32)))).def_17088))
(assert (let ((.def_17090 (= |ssl3_connect::s__s3__tmp__next_state___0| (_ bv4400 32)))).def_17090))
(assert (let ((.def_17092 (= |ssl3_connect::s__state| (_ bv4512 32)))).def_17092))
(assert (let ((.def_17094 (= |ssl3_connect::s__s3__tmp__next_state___0| (_ bv4528 32)))).def_17094))
(assert (let ((.def_17096 (= |ssl3_connect::s__s3__tmp__next_state___0| (_ bv4529 32)))).def_17096))
(assert (let ((.def_17098 (= |ssl3_connect::s__s3__tmp__next_state___0| (_ bv3 32)))).def_17098))
(assert (let ((.def_17100 (= |ssl3_connect::s__s3__tmp__next_state___0| (_ bv4560 32)))).def_17100))
(assert (let ((.def_17102 (= |ssl3_connect::s__s3__tmp__next_state___0| (_ bv4416 32)))).def_17102))
(assert (let ((.def_17104 (= |ssl3_connect::s__state| (_ bv4513 32)))).def_17104))
(assert (let ((.def_17106 (= |ssl3_connect::s__state| (_ bv4467 32)))).def_17106))
(assert (let ((.def_17108 (= |ssl3_connect::s__state| (_ bv4466 32)))).def_17108))
(assert (let ((.def_17110 (= |ssl3_connect::s__state| (_ bv4465 32)))).def_17110))
(assert (let ((.def_17112 (= |ssl3_connect::s__state| (_ bv4464 32)))).def_17112))

ssl3_connect N565:
(assert false)
(assert (let ((.def_558 (= |ssl3_connect::blastFlag| (_ bv5 32)))).def_558))

ssl3_accept N688:
(assert (let ((.def_29516 (= |ssl3_accept::blastFlag| (_ bv4 32)))).def_29516))
(assert (let ((.def_30662 (= |ssl3_accept::s__state| (_ bv8464 32)))).def_30662))
(assert (let ((.def_30664 (= |ssl3_accept::blastFlag| (_ bv0 32)))).def_30664))
(assert (let ((.def_32040 (= |ssl3_accept::s__state| (_ bv8481 32)))).def_32040))
(assert (let ((.def_32042 (= |ssl3_accept::s__state| (_ bv8480 32)))).def_32042))
(assert (let ((.def_32044 (= |ssl3_accept::s__state| (_ bv12292 32)))).def_32044))
(assert (let ((.def_32046 (= |ssl3_accept::s__state| (_ bv16384 32)))).def_32046))
(assert (let ((.def_32048 (= |ssl3_accept::s__state| (_ bv8192 32)))).def_32048))
(assert (let ((.def_32050 (= |ssl3_accept::s__state| (_ bv24576 32)))).def_32050))
(assert (let ((.def_32052 (= |ssl3_accept::s__state| (_ bv8195 32)))).def_32052))
(assert (let ((.def_32054 (= |ssl3_accept::s__state| (_ bv8482 32)))).def_32054))
(assert (let ((.def_32056 (= |ssl3_accept::blastFlag| (_ bv1 32)))).def_32056))
(assert (let ((.def_33984 (= |ssl3_accept::blastFlag| (_ bv2 32)))).def_33984))
(assert (let ((.def_33986 (= |ssl3_accept::blastFlag| (_ bv3 32)))).def_33986))
(assert (let ((.def_33988 (= |ssl3_accept::s__state| (_ bv8496 32)))).def_33988))
(assert (let ((.def_36383 (= |ssl3_accept::s__state| (_ bv8466 32)))).def_36383))
(assert (let ((.def_36385 (= |ssl3_accept::s__state| (_ bv8465 32)))).def_36385))
(assert (let ((.def_36388 (= |ssl3_accept::s__hit| (_ bv0 32)))).def_36388))
(assert (let ((.def_36390 (= |ssl3_accept::s__state| (_ bv8448 32)))).def_36390))
(assert (let ((.def_36392 (= |ssl3_accept::s__state| (_ bv8512 32)))).def_36392))
(assert (let ((.def_36394 (= |ssl3_accept::s__state| (_ bv8497 32)))).def_36394))
(assert (let ((.def_36396 (= |ssl3_accept::s__state| (_ bv8528 32)))).def_36396))
(assert (let ((.def_36399 (= |ssl3_accept::s__s3__tmp__next_state___0| (_ bv8640 32)))).def_36399))
(assert (let ((.def_36401 (= |ssl3_accept::s__s3__tmp__next_state___0| (_ bv8576 32)))).def_36401))
(assert (let ((.def_36403 (= |ssl3_accept::s__s3__tmp__next_state___0| (_ bv8482 32)))).def_36403))
(assert (let ((.def_36405 (= |ssl3_accept::s__state| (_ bv8544 32)))).def_36405))
(assert (let ((.def_36407 (= |ssl3_accept::s__state| (_ bv8560 32)))).def_36407))
(assert (let ((.def_36409 (= |ssl3_accept::s__state| (_ bv8576 32)))).def_36409))
(assert (let ((.def_36411 (= |ssl3_accept::s__state| (_ bv8592 32)))).def_36411))
(assert (let ((.def_36413 (= |ssl3_accept::s__state| (_ bv8608 32)))).def_36413))
(assert (let ((.def_36415 (= |ssl3_accept::s__state| (_ bv8640 32)))).def_36415))
(assert (let ((.def_36417 (= |ssl3_accept::s__state| (_ bv8656 32)))).def_36417))
(assert (let ((.def_42797 (= |ssl3_accept::s__state| (_ bv8513 32)))).def_42797))
(assert (let ((.def_42799 (= |ssl3_accept::s__state| (_ bv8529 32)))).def_42799))
(assert (let ((.def_42801 (= |ssl3_accept::s__state| (_ bv8593 32)))).def_42801))
(assert (let ((.def_42803 (= |ssl3_accept::s__state| (_ bv8561 32)))).def_42803))
(assert (let ((.def_42805 (= |ssl3_accept::s__state| (_ bv8609 32)))).def_42805))
(assert (let ((.def_42807 (= |ssl3_accept::s__state| (_ bv8577 32)))).def_42807))
(assert (let ((.def_42809 (= |ssl3_accept::s__state| (_ bv8545 32)))).def_42809))
(assert (let ((.def_42811 (= |ssl3_accept::s__state| (_ bv8641 32)))).def_42811))
(assert (let ((.def_42813 (= |ssl3_accept::s__state| (_ bv8657 32)))).def_42813))
(assert (let ((.def_42815 (= |ssl3_accept::s__s3__tmp__next_state___0| (_ bv8497 32)))).def_42815))
(assert (let ((.def_42817 (= |ssl3_accept::s__s3__tmp__next_state___0| (_ bv8496 32)))).def_42817))
(assert (let ((.def_42820 (= |ssl3_accept::skip| (_ bv1 32)))).def_42820))
(assert (let ((.def_159763 (= |ssl3_accept::skip| (_ bv0 32)))).def_159763))
(assert (let ((.def_159766 (= |ssl3_accept::s__s3__tmp__reuse_message| (_ bv0 32)))).def_159766))
(assert (let ((.def_159768 (= |ssl3_accept::s__state| (_ bv8672 32)))).def_159768))
(assert (let ((.def_159770 (= |ssl3_accept::s__s3__tmp__next_state___0| (_ bv8512 32)))).def_159770))
(assert (let ((.def_159773 (= |ssl3_accept::s__verify_mode| (_ bv4294967294 32)))).def_159773))
(assert (let ((.def_159775 (= |ssl3_accept::s__verify_mode| (_ bv4294967292 32)))).def_159775))
(assert (let ((.def_159777 (= |ssl3_accept::s__s3__tmp__next_state___0| (_ bv8529 32)))).def_159777))
(assert (let ((.def_159779 (= |ssl3_accept::s__s3__tmp__next_state___0| (_ bv8528 32)))).def_159779))
(assert (let ((.def_159781 (= |ssl3_accept::s__verify_mode| (_ bv4294967295 32)))).def_159781))
(assert (let ((.def_159783 (= |ssl3_accept::s__s3__tmp__next_state___0| (_ bv8544 32)))).def_159783))
(assert (let ((.def_159785 (= |ssl3_accept::s__s3__tmp__next_state___0| (_ bv3 32)))).def_159785))
(assert (let ((.def_159787 (= |ssl3_accept::s__s3__tmp__next_state___0| (_ bv8513 32)))).def_159787))
(assert (let ((.def_159789 (= |ssl3_accept::s__state| |ssl3_accept::s__s3__tmp__next_state___0|))).def_159789))
(assert (let ((.def_159791 (= |ssl3_accept::s__s3__tmp__next_state___0| (_ bv8545 32)))).def_159791))
(assert (let ((.def_159793 (= |ssl3_accept::s__s3__tmp__next_state___0| (_ bv8561 32)))).def_159793))
(assert (let ((.def_159795 (= |ssl3_accept::s__s3__tmp__next_state___0| (_ bv8672 32)))).def_159795))
(assert (let ((.def_159797 (= |ssl3_accept::s__s3__tmp__next_state___0| (_ bv8656 32)))).def_159797))
(assert (let ((.def_159799 (= |ssl3_accept::s__s3__tmp__next_state___0| (_ bv8592 32)))).def_159799))
(assert (let ((.def_159801 (= |ssl3_accept::s__s3__tmp__next_state___0| (_ bv8560 32)))).def_159801))
(assert (let ((.def_159803 (= |ssl3_accept::s__s3__tmp__next_state___0| (_ bv8481 32)))).def_159803))
(assert (let ((.def_159805 (= |ssl3_accept::s__s3__tmp__next_state___0| (_ bv8480 32)))).def_159805))
(assert (let ((.def_159807 (= |ssl3_accept::s__s3__tmp__next_state___0| (_ bv8464 32)))).def_159807))
(assert (let ((.def_159809 (= |ssl3_accept::s__s3__tmp__next_state___0| (_ bv8448 32)))).def_159809))
(assert (let ((.def_159812 (= |ssl3_accept::s__s3__tmp__new_cipher__algorithms| (_ bv4294967040 32)))).def_159812))
(assert (let ((.def_159814 (= |ssl3_accept::s__s3__tmp__next_state___0| (_ bv12292 32)))).def_159814))
(assert (let ((.def_159816 (= |ssl3_accept::s__s3__tmp__next_state___0| (_ bv16384 32)))).def_159816))
(assert (let ((.def_159818 (= |ssl3_accept::s__s3__tmp__next_state___0| (_ bv8192 32)))).def_159818))
(assert (let ((.def_159820 (= |ssl3_accept::s__s3__tmp__next_state___0| (_ bv24576 32)))).def_159820))
(assert (let ((.def_159822 (= |ssl3_accept::s__s3__tmp__next_state___0| (_ bv8195 32)))).def_159822))
(assert (let ((.def_159824 (= |ssl3_accept::s__s3__tmp__next_state___0| (_ bv8465 32)))).def_159824))
(assert (let ((.def_159826 (= |ssl3_accept::s__s3__tmp__next_state___0| (_ bv8466 32)))).def_159826))
(assert (let ((.def_159828 (= |ssl3_accept::s__s3__tmp__next_state___0| (_ bv8608 32)))).def_159828))
(assert (let ((.def_159831 (= |ssl3_accept::s__session__peer| (_ bv0 32)))).def_159831))
(assert (let ((.def_159833 (= |ssl3_accept::s__s3__tmp__next_state___0| (_ bv8657 32)))).def_159833))
(assert (let ((.def_159835 (= |ssl3_accept::s__s3__tmp__next_state___0| (_ bv8641 32)))).def_159835))
(assert (let ((.def_159837 (= |ssl3_accept::s__s3__tmp__next_state___0| (_ bv8609 32)))).def_159837))
(assert (let ((.def_159839 (= |ssl3_accept::s__s3__tmp__next_state___0| (_ bv8593 32)))).def_159839))
(assert (let ((.def_159841 (= |ssl3_accept::s__s3__tmp__next_state___0| (_ bv8577 32)))).def_159841))
(assert (let ((.def_159843 (= |ssl3_accept::s__state| (_ bv8673 32)))).def_159843))

ssl3_accept N1209:
(assert false)

