(set-info :source |printed by MathSAT|)
(declare-fun a20 () (_ BitVec 32))
(declare-fun a25 () (_ BitVec 32))
(declare-fun a12 () (_ BitVec 32))
(declare-fun a15 () (_ BitVec 32))
(declare-fun a16 () (_ BitVec 32))
(declare-fun a2 () (_ BitVec 32))
(declare-fun a27 () (_ BitVec 32))
(declare-fun a9 () (_ BitVec 32))
(declare-fun m_pc () (_ BitVec 32))
(declare-fun t1_pc () (_ BitVec 32))
(declare-fun t2_pc () (_ BitVec 32))
(declare-fun t3_pc () (_ BitVec 32))
(declare-fun t4_pc () (_ BitVec 32))
(declare-fun t5_pc () (_ BitVec 32))
(declare-fun t6_pc () (_ BitVec 32))
(declare-fun t7_pc () (_ BitVec 32))
(declare-fun t8_pc () (_ BitVec 32))
(declare-fun t9_pc () (_ BitVec 32))
(declare-fun m_st () (_ BitVec 32))
(declare-fun E_1 () (_ BitVec 32))
(declare-fun E_2 () (_ BitVec 32))
(declare-fun E_9 () (_ BitVec 32))
(declare-fun E_7 () (_ BitVec 32))
(declare-fun E_5 () (_ BitVec 32))
(declare-fun E_4 () (_ BitVec 32))
(declare-fun E_3 () (_ BitVec 32))
(declare-fun E_M () (_ BitVec 32))
(declare-fun E_8 () (_ BitVec 32))
(declare-fun E_6 () (_ BitVec 32))
(declare-fun t3_st () (_ BitVec 32))
(declare-fun t4_st () (_ BitVec 32))
(declare-fun t1_st () (_ BitVec 32))
(declare-fun t6_st () (_ BitVec 32))
(declare-fun t7_st () (_ BitVec 32))
(declare-fun t5_st () (_ BitVec 32))
(declare-fun t2_st () (_ BitVec 32))
(declare-fun t9_st () (_ BitVec 32))
(declare-fun t8_st () (_ BitVec 32))
(declare-fun local () (_ BitVec 32))
(declare-fun token () (_ BitVec 32))

*:
(assert (let ((.def_107233 (= a20 (_ bv5 32)))).def_107233))

calculate_output8 N29943:
(assert false)
(assert (let ((.def_107233 (= a20 (_ bv5 32)))).def_107233))

main1 N30136:
(assert (let ((.def_107233 (= a20 (_ bv5 32)))).def_107233))
(assert (let ((.def_154615 (= a25 (_ bv1 32)))).def_154615))
(assert (let ((.def_154618 (= a12 (_ bv4 32)))).def_154618))
(assert (let ((.def_154621 (= a15 (_ bv1 32)))).def_154621))
(assert (let ((.def_154624 (= a16 (_ bv1 32)))).def_154624))
(assert (let ((.def_154627 (= a2 (_ bv10 32)))).def_154627))
(assert (let ((.def_154630 (= a27 (_ bv1 32)))).def_154630))
(assert (let ((.def_154633 (= a9 (_ bv18 32)))).def_154633))
(assert (let ((.def_586374 (= a9 (_ bv17 32)))).def_586374))
(assert (let ((.def_586376 (= a2 (_ bv13 32)))).def_586376))
(assert (let ((.def_586378 (= a2 (_ bv9 32)))).def_586378))
(assert (let ((.def_586380 (= a2 (_ bv12 32)))).def_586380))
(assert (let ((.def_586382 (= a20 (_ bv6 32)))).def_586382))
(assert (let ((.def_586384 (= a20 (_ bv7 32)))).def_586384))
(assert (let ((.def_586386 (= a12 (_ bv3 32)))).def_586386))
(assert (let ((.def_586388 (= a12 (_ bv2 32)))).def_586388))
(assert (let ((.def_586390 (= a12 (_ bv5 32)))).def_586390))
(assert (let ((.def_586392 (= a2 (_ bv11 32)))).def_586392))
(assert (let ((.def_586394 (= a9 (_ bv16 32)))).def_586394))
(assert (let ((.def_586396 (= a12 (_ bv6 32)))).def_586396))

error N30154:
(assert false)
(assert (let ((.def_107233 (= a20 (_ bv5 32)))).def_107233))

eval N30720:
(assert (let ((.def_923697 (= m_pc (_ bv0 32)))).def_923697))
(assert (let ((.def_107233 (= a20 (_ bv5 32)))).def_107233))
(assert (let ((.def_931449 (= t1_pc (_ bv0 32)))).def_931449))
(assert (let ((.def_931452 (= t2_pc (_ bv0 32)))).def_931452))
(assert (let ((.def_931455 (= t3_pc (_ bv0 32)))).def_931455))
(assert (let ((.def_931458 (= t4_pc (_ bv0 32)))).def_931458))
(assert (let ((.def_931461 (= t5_pc (_ bv0 32)))).def_931461))
(assert (let ((.def_931464 (= t6_pc (_ bv0 32)))).def_931464))
(assert (let ((.def_931467 (= t7_pc (_ bv0 32)))).def_931467))
(assert (let ((.def_931470 (= t8_pc (_ bv0 32)))).def_931470))
(assert (let ((.def_931473 (= t9_pc (_ bv0 32)))).def_931473))
(assert (let ((.def_931475 (= m_pc (_ bv1 32)))).def_931475))
(assert (let ((.def_931477 (= t1_pc (_ bv1 32)))).def_931477))
(assert (let ((.def_931479 (= t2_pc (_ bv1 32)))).def_931479))
(assert (let ((.def_931481 (= t3_pc (_ bv1 32)))).def_931481))
(assert (let ((.def_931483 (= t4_pc (_ bv1 32)))).def_931483))
(assert (let ((.def_931485 (= t5_pc (_ bv1 32)))).def_931485))
(assert (let ((.def_931487 (= t6_pc (_ bv1 32)))).def_931487))
(assert (let ((.def_931489 (= t7_pc (_ bv1 32)))).def_931489))
(assert (let ((.def_931491 (= t8_pc (_ bv1 32)))).def_931491))
(assert (let ((.def_931493 (= t9_pc (_ bv1 32)))).def_931493))
(assert (let ((.def_931496 (= m_st (_ bv0 32)))).def_931496))
(assert (let ((.def_960496 (= E_1 (_ bv1 32)))).def_960496))
(assert (let ((.def_960498 (= E_1 (_ bv2 32)))).def_960498))
(assert (let ((.def_960501 (= E_2 (_ bv1 32)))).def_960501))
(assert (let ((.def_960504 (= E_9 (_ bv1 32)))).def_960504))
(assert (let ((.def_960507 (= E_7 (_ bv1 32)))).def_960507))
(assert (let ((.def_960510 (= E_5 (_ bv1 32)))).def_960510))
(assert (let ((.def_960513 (= E_4 (_ bv1 32)))).def_960513))
(assert (let ((.def_960516 (= E_3 (_ bv1 32)))).def_960516))
(assert (let ((.def_960519 (= E_M (_ bv1 32)))).def_960519))
(assert (let ((.def_960522 (= E_8 (_ bv1 32)))).def_960522))
(assert (let ((.def_960525 (= E_6 (_ bv1 32)))).def_960525))
(assert (let ((.def_960528 (= t3_st (_ bv0 32)))).def_960528))
(assert (let ((.def_960531 (= t4_st (_ bv0 32)))).def_960531))
(assert (let ((.def_960534 (= t1_st (_ bv0 32)))).def_960534))
(assert (let ((.def_960537 (= t6_st (_ bv0 32)))).def_960537))
(assert (let ((.def_960540 (= t7_st (_ bv0 32)))).def_960540))
(assert (let ((.def_960543 (= t5_st (_ bv0 32)))).def_960543))
(assert (let ((.def_960546 (= t2_st (_ bv0 32)))).def_960546))
(assert (let ((.def_960549 (= t9_st (_ bv0 32)))).def_960549))
(assert (let ((.def_960552 (= t8_st (_ bv0 32)))).def_960552))
(assert (let ((.def_960555 (bvadd (_ bv9 32) local)))(let ((.def_960557 (= .def_960555 token))).def_960557)))

start_simulation N31198:
(assert (let ((.def_923697 (= m_pc (_ bv0 32)))).def_923697))
(assert (let ((.def_107233 (= a20 (_ bv5 32)))).def_107233))
(assert (let ((.def_931449 (= t1_pc (_ bv0 32)))).def_931449))
(assert (let ((.def_931452 (= t2_pc (_ bv0 32)))).def_931452))
(assert (let ((.def_931455 (= t3_pc (_ bv0 32)))).def_931455))
(assert (let ((.def_931458 (= t4_pc (_ bv0 32)))).def_931458))
(assert (let ((.def_931461 (= t5_pc (_ bv0 32)))).def_931461))
(assert (let ((.def_931464 (= t6_pc (_ bv0 32)))).def_931464))
(assert (let ((.def_931467 (= t7_pc (_ bv0 32)))).def_931467))
(assert (let ((.def_931470 (= t8_pc (_ bv0 32)))).def_931470))
(assert (let ((.def_931473 (= t9_pc (_ bv0 32)))).def_931473))
(assert (let ((.def_931475 (= m_pc (_ bv1 32)))).def_931475))
(assert (let ((.def_931477 (= t1_pc (_ bv1 32)))).def_931477))
(assert (let ((.def_931479 (= t2_pc (_ bv1 32)))).def_931479))
(assert (let ((.def_931481 (= t3_pc (_ bv1 32)))).def_931481))
(assert (let ((.def_931483 (= t4_pc (_ bv1 32)))).def_931483))
(assert (let ((.def_931485 (= t5_pc (_ bv1 32)))).def_931485))
(assert (let ((.def_931487 (= t6_pc (_ bv1 32)))).def_931487))
(assert (let ((.def_931489 (= t7_pc (_ bv1 32)))).def_931489))
(assert (let ((.def_931491 (= t8_pc (_ bv1 32)))).def_931491))
(assert (let ((.def_931493 (= t9_pc (_ bv1 32)))).def_931493))
(assert (let ((.def_960496 (= E_1 (_ bv1 32)))).def_960496))
(assert (let ((.def_960498 (= E_1 (_ bv2 32)))).def_960498))
(assert (let ((.def_960501 (= E_2 (_ bv1 32)))).def_960501))
(assert (let ((.def_960504 (= E_9 (_ bv1 32)))).def_960504))
(assert (let ((.def_960507 (= E_7 (_ bv1 32)))).def_960507))
(assert (let ((.def_960510 (= E_5 (_ bv1 32)))).def_960510))
(assert (let ((.def_960513 (= E_4 (_ bv1 32)))).def_960513))
(assert (let ((.def_960516 (= E_3 (_ bv1 32)))).def_960516))
(assert (let ((.def_960519 (= E_M (_ bv1 32)))).def_960519))
(assert (let ((.def_960522 (= E_8 (_ bv1 32)))).def_960522))
(assert (let ((.def_960525 (= E_6 (_ bv1 32)))).def_960525))
(assert (let ((.def_931496 (= m_st (_ bv0 32)))).def_931496))

