(set-info :source |printed by MathSAT|)
(declare-fun a20 () (_ BitVec 32))
(declare-fun a25 () (_ BitVec 32))
(declare-fun a12 () (_ BitVec 32))
(declare-fun a15 () (_ BitVec 32))
(declare-fun a16 () (_ BitVec 32))
(declare-fun a2 () (_ BitVec 32))
(declare-fun a27 () (_ BitVec 32))
(declare-fun a9 () (_ BitVec 32))
(declare-fun m_pc () (_ BitVec 32))
(declare-fun t1_pc () (_ BitVec 32))
(declare-fun t2_pc () (_ BitVec 32))
(declare-fun t3_pc () (_ BitVec 32))
(declare-fun t4_pc () (_ BitVec 32))
(declare-fun t5_pc () (_ BitVec 32))
(declare-fun t6_pc () (_ BitVec 32))
(declare-fun t7_pc () (_ BitVec 32))
(declare-fun t8_pc () (_ BitVec 32))
(declare-fun t9_pc () (_ BitVec 32))
(declare-fun t10_pc () (_ BitVec 32))
(declare-fun t11_pc () (_ BitVec 32))
(declare-fun t12_pc () (_ BitVec 32))
(declare-fun t13_pc () (_ BitVec 32))
(declare-fun m_st () (_ BitVec 32))

*:
(assert (let ((.def_107381 (= a20 (_ bv5 32)))).def_107381))

calculate_output8 N29965:
(assert false)
(assert (let ((.def_107381 (= a20 (_ bv5 32)))).def_107381))

main1 N30136:
(assert (let ((.def_107381 (= a20 (_ bv5 32)))).def_107381))
(assert (let ((.def_154822 (= a25 (_ bv1 32)))).def_154822))
(assert (let ((.def_154825 (= a12 (_ bv4 32)))).def_154825))
(assert (let ((.def_154828 (= a15 (_ bv1 32)))).def_154828))
(assert (let ((.def_154831 (= a16 (_ bv1 32)))).def_154831))
(assert (let ((.def_154834 (= a2 (_ bv10 32)))).def_154834))
(assert (let ((.def_154837 (= a27 (_ bv1 32)))).def_154837))
(assert (let ((.def_154840 (= a9 (_ bv18 32)))).def_154840))
(assert (let ((.def_320787 (= a9 (_ bv17 32)))).def_320787))
(assert (let ((.def_320789 (= a2 (_ bv12 32)))).def_320789))
(assert (let ((.def_320791 (= a2 (_ bv11 32)))).def_320791))
(assert (let ((.def_320793 (= a2 (_ bv9 32)))).def_320793))
(assert (let ((.def_320795 (= a12 (_ bv3 32)))).def_320795))
(assert (let ((.def_320797 (= a20 (_ bv6 32)))).def_320797))
(assert (let ((.def_320799 (= a2 (_ bv13 32)))).def_320799))
(assert (let ((.def_320801 (= a9 (_ bv16 32)))).def_320801))
(assert (let ((.def_1060973 (= a12 (_ bv6 32)))).def_1060973))
(assert (let ((.def_1060975 (= a12 (_ bv2 32)))).def_1060975))
(assert (let ((.def_1060977 (= a20 (_ bv7 32)))).def_1060977))

error N30154:
(assert false)
(assert (let ((.def_107381 (= a20 (_ bv5 32)))).def_107381))

eval N30945:
(assert (let ((.def_1137809 (= m_pc (_ bv0 32)))).def_1137809))
(assert (let ((.def_107381 (= a20 (_ bv5 32)))).def_107381))
(assert (let ((.def_1152252 (= t1_pc (_ bv0 32)))).def_1152252))
(assert (let ((.def_1152255 (= t2_pc (_ bv0 32)))).def_1152255))
(assert (let ((.def_1152258 (= t3_pc (_ bv0 32)))).def_1152258))
(assert (let ((.def_1152261 (= t4_pc (_ bv0 32)))).def_1152261))
(assert (let ((.def_1152264 (= t5_pc (_ bv0 32)))).def_1152264))
(assert (let ((.def_1152267 (= t6_pc (_ bv0 32)))).def_1152267))
(assert (let ((.def_1152270 (= t7_pc (_ bv0 32)))).def_1152270))
(assert (let ((.def_1152273 (= t8_pc (_ bv0 32)))).def_1152273))
(assert (let ((.def_1152276 (= t9_pc (_ bv0 32)))).def_1152276))
(assert (let ((.def_1152279 (= t10_pc (_ bv0 32)))).def_1152279))
(assert (let ((.def_1152282 (= t11_pc (_ bv0 32)))).def_1152282))
(assert (let ((.def_1152285 (= t12_pc (_ bv0 32)))).def_1152285))
(assert (let ((.def_1152288 (= t13_pc (_ bv0 32)))).def_1152288))
(assert (let ((.def_1152290 (= m_pc (_ bv1 32)))).def_1152290))
(assert (let ((.def_1152292 (= t1_pc (_ bv1 32)))).def_1152292))
(assert (let ((.def_1152294 (= t2_pc (_ bv1 32)))).def_1152294))
(assert (let ((.def_1152296 (= t3_pc (_ bv1 32)))).def_1152296))
(assert (let ((.def_1152298 (= t4_pc (_ bv1 32)))).def_1152298))
(assert (let ((.def_1152300 (= t5_pc (_ bv1 32)))).def_1152300))
(assert (let ((.def_1152302 (= t6_pc (_ bv1 32)))).def_1152302))
(assert (let ((.def_1152304 (= t7_pc (_ bv1 32)))).def_1152304))
(assert (let ((.def_1152306 (= t8_pc (_ bv1 32)))).def_1152306))
(assert (let ((.def_1152308 (= t9_pc (_ bv1 32)))).def_1152308))
(assert (let ((.def_1152310 (= t10_pc (_ bv1 32)))).def_1152310))
(assert (let ((.def_1152312 (= t11_pc (_ bv1 32)))).def_1152312))
(assert (let ((.def_1152314 (= t12_pc (_ bv1 32)))).def_1152314))
(assert (let ((.def_1152316 (= t13_pc (_ bv1 32)))).def_1152316))
(assert (let ((.def_1152319 (= m_st (_ bv0 32)))).def_1152319))

start_simulation N31587:
(assert (let ((.def_1137809 (= m_pc (_ bv0 32)))).def_1137809))
(assert (let ((.def_107381 (= a20 (_ bv5 32)))).def_107381))
(assert (let ((.def_1152252 (= t1_pc (_ bv0 32)))).def_1152252))
(assert (let ((.def_1152255 (= t2_pc (_ bv0 32)))).def_1152255))
(assert (let ((.def_1152258 (= t3_pc (_ bv0 32)))).def_1152258))
(assert (let ((.def_1152261 (= t4_pc (_ bv0 32)))).def_1152261))
(assert (let ((.def_1152264 (= t5_pc (_ bv0 32)))).def_1152264))
(assert (let ((.def_1152267 (= t6_pc (_ bv0 32)))).def_1152267))
(assert (let ((.def_1152270 (= t7_pc (_ bv0 32)))).def_1152270))
(assert (let ((.def_1152273 (= t8_pc (_ bv0 32)))).def_1152273))
(assert (let ((.def_1152276 (= t9_pc (_ bv0 32)))).def_1152276))
(assert (let ((.def_1152279 (= t10_pc (_ bv0 32)))).def_1152279))
(assert (let ((.def_1152282 (= t11_pc (_ bv0 32)))).def_1152282))
(assert (let ((.def_1152285 (= t12_pc (_ bv0 32)))).def_1152285))
(assert (let ((.def_1152288 (= t13_pc (_ bv0 32)))).def_1152288))
(assert (let ((.def_1152290 (= m_pc (_ bv1 32)))).def_1152290))
(assert (let ((.def_1152292 (= t1_pc (_ bv1 32)))).def_1152292))
(assert (let ((.def_1152294 (= t2_pc (_ bv1 32)))).def_1152294))
(assert (let ((.def_1152296 (= t3_pc (_ bv1 32)))).def_1152296))
(assert (let ((.def_1152298 (= t4_pc (_ bv1 32)))).def_1152298))
(assert (let ((.def_1152300 (= t5_pc (_ bv1 32)))).def_1152300))
(assert (let ((.def_1152302 (= t6_pc (_ bv1 32)))).def_1152302))
(assert (let ((.def_1152304 (= t7_pc (_ bv1 32)))).def_1152304))
(assert (let ((.def_1152306 (= t8_pc (_ bv1 32)))).def_1152306))
(assert (let ((.def_1152308 (= t9_pc (_ bv1 32)))).def_1152308))
(assert (let ((.def_1152310 (= t10_pc (_ bv1 32)))).def_1152310))
(assert (let ((.def_1152312 (= t11_pc (_ bv1 32)))).def_1152312))
(assert (let ((.def_1152314 (= t12_pc (_ bv1 32)))).def_1152314))
(assert (let ((.def_1152316 (= t13_pc (_ bv1 32)))).def_1152316))

