(set-info :source |printed by MathSAT|)
(declare-fun a20 () (_ BitVec 32))
(declare-fun a25 () (_ BitVec 32))
(declare-fun a12 () (_ BitVec 32))
(declare-fun a15 () (_ BitVec 32))
(declare-fun a16 () (_ BitVec 32))
(declare-fun a2 () (_ BitVec 32))
(declare-fun a27 () (_ BitVec 32))
(declare-fun a9 () (_ BitVec 32))
(declare-fun m_pc () (_ BitVec 32))
(declare-fun t1_pc () (_ BitVec 32))
(declare-fun t2_pc () (_ BitVec 32))
(declare-fun t3_pc () (_ BitVec 32))
(declare-fun t4_pc () (_ BitVec 32))
(declare-fun t5_pc () (_ BitVec 32))
(declare-fun t6_pc () (_ BitVec 32))
(declare-fun t7_pc () (_ BitVec 32))
(declare-fun t8_pc () (_ BitVec 32))
(declare-fun t9_pc () (_ BitVec 32))
(declare-fun m_st () (_ BitVec 32))

*:
(assert (let ((.def_107893 (= a20 (_ bv5 32)))).def_107893))

calculate_output8 N30108:
(assert false)
(assert (let ((.def_107893 (= a20 (_ bv5 32)))).def_107893))

main1 N30136:
(assert (let ((.def_107893 (= a20 (_ bv5 32)))).def_107893))
(assert (let ((.def_155626 (= a25 (_ bv1 32)))).def_155626))
(assert (let ((.def_155629 (= a12 (_ bv4 32)))).def_155629))
(assert (let ((.def_155632 (= a15 (_ bv1 32)))).def_155632))
(assert (let ((.def_155635 (= a16 (_ bv1 32)))).def_155635))
(assert (let ((.def_155638 (= a2 (_ bv10 32)))).def_155638))
(assert (let ((.def_155641 (= a27 (_ bv1 32)))).def_155641))
(assert (let ((.def_155644 (= a9 (_ bv18 32)))).def_155644))
(assert (let ((.def_321816 (= a12 (_ bv5 32)))).def_321816))
(assert (let ((.def_321818 (= a2 (_ bv13 32)))).def_321818))
(assert (let ((.def_321820 (= a12 (_ bv2 32)))).def_321820))
(assert (let ((.def_321822 (= a2 (_ bv12 32)))).def_321822))
(assert (let ((.def_321824 (= a12 (_ bv3 32)))).def_321824))
(assert (let ((.def_321826 (= a9 (_ bv16 32)))).def_321826))
(assert (let ((.def_321828 (= a20 (_ bv7 32)))).def_321828))
(assert (let ((.def_321830 (= a2 (_ bv9 32)))).def_321830))
(assert (let ((.def_321832 (= a9 (_ bv17 32)))).def_321832))

error N30154:
(assert false)
(assert (let ((.def_107893 (= a20 (_ bv5 32)))).def_107893))

eval N30733:
(assert (let ((.def_747463 (= m_pc (_ bv0 32)))).def_747463))
(assert (let ((.def_107893 (= a20 (_ bv5 32)))).def_107893))
(assert (let ((.def_755256 (= t1_pc (_ bv0 32)))).def_755256))
(assert (let ((.def_755259 (= t2_pc (_ bv0 32)))).def_755259))
(assert (let ((.def_755262 (= t3_pc (_ bv0 32)))).def_755262))
(assert (let ((.def_755265 (= t4_pc (_ bv0 32)))).def_755265))
(assert (let ((.def_755268 (= t5_pc (_ bv0 32)))).def_755268))
(assert (let ((.def_755271 (= t6_pc (_ bv0 32)))).def_755271))
(assert (let ((.def_755274 (= t7_pc (_ bv0 32)))).def_755274))
(assert (let ((.def_755277 (= t8_pc (_ bv0 32)))).def_755277))
(assert (let ((.def_755280 (= t9_pc (_ bv0 32)))).def_755280))
(assert (let ((.def_755282 (= m_pc (_ bv1 32)))).def_755282))
(assert (let ((.def_755284 (= t1_pc (_ bv1 32)))).def_755284))
(assert (let ((.def_755286 (= t2_pc (_ bv1 32)))).def_755286))
(assert (let ((.def_755288 (= t3_pc (_ bv1 32)))).def_755288))
(assert (let ((.def_755290 (= t4_pc (_ bv1 32)))).def_755290))
(assert (let ((.def_755292 (= t5_pc (_ bv1 32)))).def_755292))
(assert (let ((.def_755294 (= t6_pc (_ bv1 32)))).def_755294))
(assert (let ((.def_755296 (= t7_pc (_ bv1 32)))).def_755296))
(assert (let ((.def_755298 (= t8_pc (_ bv1 32)))).def_755298))
(assert (let ((.def_755300 (= t9_pc (_ bv1 32)))).def_755300))
(assert (let ((.def_755303 (= m_st (_ bv0 32)))).def_755303))

start_simulation N31211:
(assert (let ((.def_747463 (= m_pc (_ bv0 32)))).def_747463))
(assert (let ((.def_107893 (= a20 (_ bv5 32)))).def_107893))
(assert (let ((.def_755256 (= t1_pc (_ bv0 32)))).def_755256))
(assert (let ((.def_755259 (= t2_pc (_ bv0 32)))).def_755259))
(assert (let ((.def_755262 (= t3_pc (_ bv0 32)))).def_755262))
(assert (let ((.def_755265 (= t4_pc (_ bv0 32)))).def_755265))
(assert (let ((.def_755268 (= t5_pc (_ bv0 32)))).def_755268))
(assert (let ((.def_755271 (= t6_pc (_ bv0 32)))).def_755271))
(assert (let ((.def_755274 (= t7_pc (_ bv0 32)))).def_755274))
(assert (let ((.def_755277 (= t8_pc (_ bv0 32)))).def_755277))
(assert (let ((.def_755280 (= t9_pc (_ bv0 32)))).def_755280))
(assert (let ((.def_755282 (= m_pc (_ bv1 32)))).def_755282))
(assert (let ((.def_755284 (= t1_pc (_ bv1 32)))).def_755284))
(assert (let ((.def_755286 (= t2_pc (_ bv1 32)))).def_755286))
(assert (let ((.def_755288 (= t3_pc (_ bv1 32)))).def_755288))
(assert (let ((.def_755290 (= t4_pc (_ bv1 32)))).def_755290))
(assert (let ((.def_755292 (= t5_pc (_ bv1 32)))).def_755292))
(assert (let ((.def_755294 (= t6_pc (_ bv1 32)))).def_755294))
(assert (let ((.def_755296 (= t7_pc (_ bv1 32)))).def_755296))
(assert (let ((.def_755298 (= t8_pc (_ bv1 32)))).def_755298))
(assert (let ((.def_755300 (= t9_pc (_ bv1 32)))).def_755300))

