(set-info :source |printed by MathSAT|)
(declare-fun a20 () (_ BitVec 32))
(declare-fun a9 () (_ BitVec 32))
(declare-fun a25 () (_ BitVec 32))
(declare-fun a12 () (_ BitVec 32))
(declare-fun a15 () (_ BitVec 32))
(declare-fun a16 () (_ BitVec 32))
(declare-fun a2 () (_ BitVec 32))
(declare-fun a27 () (_ BitVec 32))
(declare-fun |calculate_output5::input| () (_ BitVec 32))
(declare-fun |calculate_output2::input| () (_ BitVec 32))
(declare-fun |calculate_output6::input| () (_ BitVec 32))
(declare-fun |calculate_output7::input| () (_ BitVec 32))

*:
(assert (let ((.def_106235 (= a20 (_ bv5 32)))).def_106235))

calculate_output8 N29701:
(assert false)
(assert (let ((.def_106235 (= a20 (_ bv5 32)))).def_106235))

main1 N30136:
(assert (let ((.def_153094 (= a9 (_ bv18 32)))).def_153094))
(assert (let ((.def_106235 (= a20 (_ bv5 32)))).def_106235))
(assert (let ((.def_339793 (= a25 (_ bv1 32)))).def_339793))
(assert (let ((.def_339796 (= a12 (_ bv4 32)))).def_339796))
(assert (let ((.def_339799 (= a15 (_ bv1 32)))).def_339799))
(assert (let ((.def_339802 (= a16 (_ bv1 32)))).def_339802))
(assert (let ((.def_339805 (= a2 (_ bv10 32)))).def_339805))
(assert (let ((.def_339808 (= a27 (_ bv1 32)))).def_339808))
(assert (let ((.def_339810 (= a20 (_ bv6 32)))).def_339810))
(assert (let ((.def_339812 (= a2 (_ bv13 32)))).def_339812))
(assert (let ((.def_339814 (= a12 (_ bv2 32)))).def_339814))
(assert (let ((.def_339816 (= a2 (_ bv12 32)))).def_339816))
(assert (let ((.def_339818 (= a2 (_ bv11 32)))).def_339818))
(assert (let ((.def_339820 (= a9 (_ bv16 32)))).def_339820))
(assert (let ((.def_339822 (= a9 (_ bv17 32)))).def_339822))
(assert (let ((.def_1038306 (= a2 (_ bv9 32)))).def_1038306))
(assert (let ((.def_1038308 (= a20 (_ bv7 32)))).def_1038308))
(assert (let ((.def_1038310 (= a12 (_ bv5 32)))).def_1038310))
(assert (let ((.def_1038312 (= a12 (_ bv3 32)))).def_1038312))
(assert (let ((.def_1038314 (= a12 (_ bv6 32)))).def_1038314))
(assert (let ((.def_1038317 (= |calculate_output5::input| (_ bv3 32)))).def_1038317))
(assert (let ((.def_1038320 (= |calculate_output2::input| (_ bv2 32)))).def_1038320))
(assert (let ((.def_1038322 (= |calculate_output2::input| (_ bv6 32)))).def_1038322))
(assert (let ((.def_1038325 (= |calculate_output5::input| |calculate_output6::input|))).def_1038325))
(assert (let ((.def_1038327 (= |calculate_output6::input| (_ bv3 32)))).def_1038327))
(assert (let ((.def_1038330 (= |calculate_output7::input| (_ bv6 32)))).def_1038330))
(assert (let ((.def_1038332 (= |calculate_output7::input| (_ bv3 32)))).def_1038332))

