(set-info :source |printed by MathSAT|)
(declare-fun a20 () (_ BitVec 32))
(declare-fun a9 () (_ BitVec 32))
(declare-fun a25 () (_ BitVec 32))
(declare-fun a12 () (_ BitVec 32))
(declare-fun a15 () (_ BitVec 32))
(declare-fun a16 () (_ BitVec 32))
(declare-fun a2 () (_ BitVec 32))
(declare-fun a27 () (_ BitVec 32))

*:
(assert (let ((.def_105928 (= a20 (_ bv5 32)))).def_105928))

calculate_output8 N29613:
(assert false)
(assert (let ((.def_105928 (= a20 (_ bv5 32)))).def_105928))

main1 N30136:
(assert (let ((.def_152769 (= a9 (_ bv18 32)))).def_152769))
(assert (let ((.def_105928 (= a20 (_ bv5 32)))).def_105928))
(assert (let ((.def_339399 (= a25 (_ bv1 32)))).def_339399))
(assert (let ((.def_339402 (= a12 (_ bv4 32)))).def_339402))
(assert (let ((.def_339405 (= a15 (_ bv1 32)))).def_339405))
(assert (let ((.def_339408 (= a16 (_ bv1 32)))).def_339408))
(assert (let ((.def_339411 (= a2 (_ bv10 32)))).def_339411))
(assert (let ((.def_339414 (= a27 (_ bv1 32)))).def_339414))
(assert (let ((.def_339416 (= a12 (_ bv6 32)))).def_339416))
(assert (let ((.def_339418 (= a20 (_ bv6 32)))).def_339418))
(assert (let ((.def_339420 (= a12 (_ bv3 32)))).def_339420))
(assert (let ((.def_339422 (= a2 (_ bv12 32)))).def_339422))
(assert (let ((.def_339424 (= a12 (_ bv2 32)))).def_339424))
(assert (let ((.def_339426 (= a9 (_ bv16 32)))).def_339426))
(assert (let ((.def_339428 (= a12 (_ bv5 32)))).def_339428))
(assert (let ((.def_339430 (= a9 (_ bv17 32)))).def_339430))
(assert (let ((.def_939330 (= a2 (_ bv11 32)))).def_939330))
(assert (let ((.def_939332 (= a2 (_ bv13 32)))).def_939332))
(assert (let ((.def_939334 (= a20 (_ bv7 32)))).def_939334))
(assert (let ((.def_939336 (= a2 (_ bv9 32)))).def_939336))

