(set-info :source |printed by MathSAT|)
(declare-fun a20 () (_ BitVec 32))
(declare-fun a25 () (_ BitVec 32))
(declare-fun a12 () (_ BitVec 32))
(declare-fun a15 () (_ BitVec 32))
(declare-fun a16 () (_ BitVec 32))
(declare-fun a2 () (_ BitVec 32))
(declare-fun a27 () (_ BitVec 32))
(declare-fun a9 () (_ BitVec 32))
(declare-fun m_pc () (_ BitVec 32))
(declare-fun t1_pc () (_ BitVec 32))
(declare-fun t2_pc () (_ BitVec 32))
(declare-fun t3_pc () (_ BitVec 32))
(declare-fun t4_pc () (_ BitVec 32))
(declare-fun t5_pc () (_ BitVec 32))
(declare-fun t6_pc () (_ BitVec 32))
(declare-fun t7_pc () (_ BitVec 32))
(declare-fun t8_pc () (_ BitVec 32))
(declare-fun t9_pc () (_ BitVec 32))
(declare-fun m_st () (_ BitVec 32))

*:
(assert (let ((.def_107673 (= a20 (_ bv5 32)))).def_107673))

calculate_output8 N30053:
(assert false)
(assert (let ((.def_107673 (= a20 (_ bv5 32)))).def_107673))

main1 N30136:
(assert (let ((.def_107673 (= a20 (_ bv5 32)))).def_107673))
(assert (let ((.def_155265 (= a25 (_ bv1 32)))).def_155265))
(assert (let ((.def_155268 (= a12 (_ bv4 32)))).def_155268))
(assert (let ((.def_155271 (= a15 (_ bv1 32)))).def_155271))
(assert (let ((.def_155274 (= a16 (_ bv1 32)))).def_155274))
(assert (let ((.def_155277 (= a2 (_ bv10 32)))).def_155277))
(assert (let ((.def_155280 (= a27 (_ bv1 32)))).def_155280))
(assert (let ((.def_155283 (= a9 (_ bv18 32)))).def_155283))
(assert (let ((.def_321448 (= a20 (_ bv6 32)))).def_321448))
(assert (let ((.def_321450 (= a12 (_ bv3 32)))).def_321450))
(assert (let ((.def_321452 (= a12 (_ bv6 32)))).def_321452))
(assert (let ((.def_321454 (= a2 (_ bv9 32)))).def_321454))
(assert (let ((.def_321456 (= a9 (_ bv16 32)))).def_321456))
(assert (let ((.def_321458 (= a2 (_ bv12 32)))).def_321458))
(assert (let ((.def_321460 (= a2 (_ bv11 32)))).def_321460))
(assert (let ((.def_321462 (= a9 (_ bv17 32)))).def_321462))
(assert (let ((.def_321464 (= a12 (_ bv2 32)))).def_321464))
(assert (let ((.def_321466 (= a2 (_ bv13 32)))).def_321466))

error N30154:
(assert false)
(assert (let ((.def_107673 (= a20 (_ bv5 32)))).def_107673))

eval N30733:
(assert (let ((.def_747403 (= m_pc (_ bv0 32)))).def_747403))
(assert (let ((.def_107673 (= a20 (_ bv5 32)))).def_107673))
(assert (let ((.def_755196 (= t1_pc (_ bv0 32)))).def_755196))
(assert (let ((.def_755199 (= t2_pc (_ bv0 32)))).def_755199))
(assert (let ((.def_755202 (= t3_pc (_ bv0 32)))).def_755202))
(assert (let ((.def_755205 (= t4_pc (_ bv0 32)))).def_755205))
(assert (let ((.def_755208 (= t5_pc (_ bv0 32)))).def_755208))
(assert (let ((.def_755211 (= t6_pc (_ bv0 32)))).def_755211))
(assert (let ((.def_755214 (= t7_pc (_ bv0 32)))).def_755214))
(assert (let ((.def_755217 (= t8_pc (_ bv0 32)))).def_755217))
(assert (let ((.def_755220 (= t9_pc (_ bv0 32)))).def_755220))
(assert (let ((.def_755222 (= m_pc (_ bv1 32)))).def_755222))
(assert (let ((.def_755224 (= t1_pc (_ bv1 32)))).def_755224))
(assert (let ((.def_755226 (= t2_pc (_ bv1 32)))).def_755226))
(assert (let ((.def_755228 (= t3_pc (_ bv1 32)))).def_755228))
(assert (let ((.def_755230 (= t4_pc (_ bv1 32)))).def_755230))
(assert (let ((.def_755232 (= t5_pc (_ bv1 32)))).def_755232))
(assert (let ((.def_755234 (= t6_pc (_ bv1 32)))).def_755234))
(assert (let ((.def_755236 (= t7_pc (_ bv1 32)))).def_755236))
(assert (let ((.def_755238 (= t8_pc (_ bv1 32)))).def_755238))
(assert (let ((.def_755240 (= t9_pc (_ bv1 32)))).def_755240))
(assert (let ((.def_755243 (= m_st (_ bv0 32)))).def_755243))

start_simulation N31211:
(assert (let ((.def_747403 (= m_pc (_ bv0 32)))).def_747403))
(assert (let ((.def_107673 (= a20 (_ bv5 32)))).def_107673))
(assert (let ((.def_755196 (= t1_pc (_ bv0 32)))).def_755196))
(assert (let ((.def_755199 (= t2_pc (_ bv0 32)))).def_755199))
(assert (let ((.def_755202 (= t3_pc (_ bv0 32)))).def_755202))
(assert (let ((.def_755205 (= t4_pc (_ bv0 32)))).def_755205))
(assert (let ((.def_755208 (= t5_pc (_ bv0 32)))).def_755208))
(assert (let ((.def_755211 (= t6_pc (_ bv0 32)))).def_755211))
(assert (let ((.def_755214 (= t7_pc (_ bv0 32)))).def_755214))
(assert (let ((.def_755217 (= t8_pc (_ bv0 32)))).def_755217))
(assert (let ((.def_755220 (= t9_pc (_ bv0 32)))).def_755220))
(assert (let ((.def_755222 (= m_pc (_ bv1 32)))).def_755222))
(assert (let ((.def_755224 (= t1_pc (_ bv1 32)))).def_755224))
(assert (let ((.def_755226 (= t2_pc (_ bv1 32)))).def_755226))
(assert (let ((.def_755228 (= t3_pc (_ bv1 32)))).def_755228))
(assert (let ((.def_755230 (= t4_pc (_ bv1 32)))).def_755230))
(assert (let ((.def_755232 (= t5_pc (_ bv1 32)))).def_755232))
(assert (let ((.def_755234 (= t6_pc (_ bv1 32)))).def_755234))
(assert (let ((.def_755236 (= t7_pc (_ bv1 32)))).def_755236))
(assert (let ((.def_755238 (= t8_pc (_ bv1 32)))).def_755238))
(assert (let ((.def_755240 (= t9_pc (_ bv1 32)))).def_755240))

