(set-info :source |printed by MathSAT|)
(declare-fun a20 () (_ BitVec 32))
(declare-fun a25 () (_ BitVec 32))
(declare-fun a12 () (_ BitVec 32))
(declare-fun a15 () (_ BitVec 32))
(declare-fun a16 () (_ BitVec 32))
(declare-fun a2 () (_ BitVec 32))
(declare-fun a27 () (_ BitVec 32))
(declare-fun a9 () (_ BitVec 32))

*:
(assert (let ((.def_105752 (= a20 (_ bv5 32)))).def_105752))

calculate_output8 N29569:
(assert false)
(assert (let ((.def_105752 (= a20 (_ bv5 32)))).def_105752))

main1 N30136:
(assert (let ((.def_105752 (= a20 (_ bv5 32)))).def_105752))
(assert (let ((.def_152374 (= a25 (_ bv1 32)))).def_152374))
(assert (let ((.def_152377 (= a12 (_ bv4 32)))).def_152377))
(assert (let ((.def_152380 (= a15 (_ bv1 32)))).def_152380))
(assert (let ((.def_152383 (= a16 (_ bv1 32)))).def_152383))
(assert (let ((.def_152386 (= a2 (_ bv10 32)))).def_152386))
(assert (let ((.def_152389 (= a27 (_ bv1 32)))).def_152389))
(assert (let ((.def_152392 (= a9 (_ bv18 32)))).def_152392))
(assert (let ((.def_317448 (= a20 (_ bv6 32)))).def_317448))
(assert (let ((.def_317450 (= a2 (_ bv13 32)))).def_317450))
(assert (let ((.def_317452 (= a12 (_ bv3 32)))).def_317452))
(assert (let ((.def_317454 (= a12 (_ bv2 32)))).def_317454))
(assert (let ((.def_317456 (= a9 (_ bv16 32)))).def_317456))
(assert (let ((.def_317458 (= a9 (_ bv17 32)))).def_317458))
(assert (let ((.def_1102553 (= a20 (_ bv7 32)))).def_1102553))
(assert (let ((.def_1102555 (= a12 (_ bv5 32)))).def_1102555))
(assert (let ((.def_1102557 (= a2 (_ bv12 32)))).def_1102557))
(assert (let ((.def_1102559 (= a2 (_ bv11 32)))).def_1102559))
(assert (let ((.def_1102561 (= a2 (_ bv9 32)))).def_1102561))
(assert (let ((.def_1102563 (= a12 (_ bv6 32)))).def_1102563))

