(set-info :source |printed by MathSAT|)
(declare-fun c_num_read () (_ BitVec 32))
(declare-fun p_num_write () (_ BitVec 32))
(declare-fun c_last_read () (_ BitVec 32))
(declare-fun p_last_write () (_ BitVec 32))
(declare-fun c_dr_pc () (_ BitVec 32))
(declare-fun q_free () (_ BitVec 32))
(declare-fun q_buf_0 () (_ BitVec 32))
(declare-fun c_dr_st () (_ BitVec 32))
(declare-fun q_req_up () (_ BitVec 32))
(declare-fun q_write_ev () (_ BitVec 32))
(declare-fun q_read_ev () (_ BitVec 32))
(declare-fun p_dw_pc () (_ BitVec 32))
(declare-fun p_dw_st () (_ BitVec 32))
(declare-fun m_pc () (_ BitVec 32))
(declare-fun t1_pc () (_ BitVec 32))
(declare-fun t2_pc () (_ BitVec 32))
(declare-fun t3_pc () (_ BitVec 32))
(declare-fun t4_pc () (_ BitVec 32))
(declare-fun t5_pc () (_ BitVec 32))
(declare-fun t6_pc () (_ BitVec 32))
(declare-fun t7_pc () (_ BitVec 32))
(declare-fun t8_pc () (_ BitVec 32))
(declare-fun t9_pc () (_ BitVec 32))
(declare-fun m_st () (_ BitVec 32))

*:
(assert (let ((.def_619 (= c_num_read p_num_write))).def_619))
(assert (let ((.def_628 (= c_last_read p_last_write))).def_628))

error1 N4:
(assert false)
(assert (let ((.def_619 (= c_num_read p_num_write))).def_619))
(assert (let ((.def_628 (= c_last_read p_last_write))).def_628))

do_write_p N78:
(assert (let ((.def_815 (= c_dr_pc (_ bv0 32)))).def_815))
(assert (let ((.def_619 (= c_num_read p_num_write))).def_619))
(assert (let ((.def_628 (= c_last_read p_last_write))).def_628))
(assert (let ((.def_883 (= q_free (_ bv1 32)))).def_883))
(assert false)
(assert (let ((.def_1067 (= p_last_write q_buf_0))).def_1067))
(assert (let ((.def_1207 (= c_dr_pc (_ bv1 32)))).def_1207))
(assert (let ((.def_1209 (= q_free (_ bv0 32)))).def_1209))
(assert (let ((.def_1213 (bvadd (_ bv1 32) c_num_read)))(let ((.def_1214 (= p_num_write .def_1213))).def_1214)))
(assert (let ((.def_1895 (= c_dr_st (_ bv0 32)))).def_1895))
(assert (let ((.def_4295 (= q_req_up (_ bv1 32)))).def_4295))
(assert (let ((.def_5928 (= q_write_ev (_ bv1 32)))).def_5928))
(assert (let ((.def_5930 (= q_write_ev (_ bv0 32)))).def_5930))
(assert (let ((.def_8265 (= q_read_ev (_ bv1 32)))).def_8265))
(assert (let ((.def_8267 (= q_read_ev (_ bv0 32)))).def_8267))

do_read_c N112:
(assert (let ((.def_883 (= q_free (_ bv1 32)))).def_883))
(assert (let ((.def_619 (= c_num_read p_num_write))).def_619))
(assert (let ((.def_628 (= c_last_read p_last_write))).def_628))
(assert (let ((.def_1067 (= p_last_write q_buf_0))).def_1067))
(assert (let ((.def_1213 (bvadd (_ bv1 32) c_num_read)))(let ((.def_1214 (= p_num_write .def_1213))).def_1214)))
(assert false)
(assert (let ((.def_1209 (= q_free (_ bv0 32)))).def_1209))
(assert (let ((.def_5928 (= q_write_ev (_ bv1 32)))).def_5928))
(assert (let ((.def_5930 (= q_write_ev (_ bv0 32)))).def_5930))
(assert (let ((.def_1211 (= p_dw_pc (_ bv1 32)))).def_1211))
(assert (let ((.def_4295 (= q_req_up (_ bv1 32)))).def_4295))
(assert (let ((.def_2369 (= p_dw_st (_ bv0 32)))).def_2369))
(assert (let ((.def_8265 (= q_read_ev (_ bv1 32)))).def_8265))
(assert (let ((.def_8267 (= q_read_ev (_ bv0 32)))).def_8267))

eval1 N228:
(assert (let ((.def_815 (= c_dr_pc (_ bv0 32)))).def_815))
(assert (let ((.def_619 (= c_num_read p_num_write))).def_619))
(assert (let ((.def_628 (= c_last_read p_last_write))).def_628))
(assert (let ((.def_883 (= q_free (_ bv1 32)))).def_883))
(assert (let ((.def_1025 (= p_dw_pc (_ bv0 32)))).def_1025))
(assert (let ((.def_1207 (= c_dr_pc (_ bv1 32)))).def_1207))
(assert (let ((.def_1209 (= q_free (_ bv0 32)))).def_1209))
(assert (let ((.def_1211 (= p_dw_pc (_ bv1 32)))).def_1211))
(assert (let ((.def_2369 (= p_dw_st (_ bv0 32)))).def_2369))
(assert (let ((.def_1067 (= p_last_write q_buf_0))).def_1067))
(assert (let ((.def_1213 (bvadd (_ bv1 32) c_num_read)))(let ((.def_1214 (= p_num_write .def_1213))).def_1214)))
(assert (let ((.def_1895 (= c_dr_st (_ bv0 32)))).def_1895))
(assert (let ((.def_4295 (= q_req_up (_ bv1 32)))).def_4295))
(assert (let ((.def_5928 (= q_write_ev (_ bv1 32)))).def_5928))
(assert (let ((.def_5930 (= q_write_ev (_ bv0 32)))).def_5930))
(assert (let ((.def_8265 (= q_read_ev (_ bv1 32)))).def_8265))
(assert (let ((.def_8267 (= q_read_ev (_ bv0 32)))).def_8267))

start_simulation1 N283:
(assert (let ((.def_815 (= c_dr_pc (_ bv0 32)))).def_815))
(assert (let ((.def_619 (= c_num_read p_num_write))).def_619))
(assert (let ((.def_628 (= c_last_read p_last_write))).def_628))
(assert (let ((.def_883 (= q_free (_ bv1 32)))).def_883))
(assert (let ((.def_1025 (= p_dw_pc (_ bv0 32)))).def_1025))
(assert (let ((.def_1207 (= c_dr_pc (_ bv1 32)))).def_1207))
(assert (let ((.def_1209 (= q_free (_ bv0 32)))).def_1209))
(assert (let ((.def_1211 (= p_dw_pc (_ bv1 32)))).def_1211))
(assert (let ((.def_1895 (= c_dr_st (_ bv0 32)))).def_1895))
(assert (let ((.def_2369 (= p_dw_st (_ bv0 32)))).def_2369))
(assert (let ((.def_1067 (= p_last_write q_buf_0))).def_1067))
(assert (let ((.def_5928 (= q_write_ev (_ bv1 32)))).def_5928))
(assert (let ((.def_5930 (= q_write_ev (_ bv0 32)))).def_5930))
(assert (let ((.def_8265 (= q_read_ev (_ bv1 32)))).def_8265))
(assert (let ((.def_8267 (= q_read_ev (_ bv0 32)))).def_8267))
(assert (let ((.def_1213 (bvadd (_ bv1 32) c_num_read)))(let ((.def_1214 (= p_num_write .def_1213))).def_1214)))

error2 N328:
(assert false)
(assert (let ((.def_619 (= c_num_read p_num_write))).def_619))
(assert (let ((.def_628 (= c_last_read p_last_write))).def_628))

eval2 N907:
(assert (let ((.def_11373 (= m_pc (_ bv0 32)))).def_11373))
(assert (let ((.def_619 (= c_num_read p_num_write))).def_619))
(assert (let ((.def_628 (= c_last_read p_last_write))).def_628))
(assert (let ((.def_19165 (= t1_pc (_ bv0 32)))).def_19165))
(assert (let ((.def_19168 (= t2_pc (_ bv0 32)))).def_19168))
(assert (let ((.def_19171 (= t3_pc (_ bv0 32)))).def_19171))
(assert (let ((.def_19174 (= t4_pc (_ bv0 32)))).def_19174))
(assert (let ((.def_19177 (= t5_pc (_ bv0 32)))).def_19177))
(assert (let ((.def_19180 (= t6_pc (_ bv0 32)))).def_19180))
(assert (let ((.def_19183 (= t7_pc (_ bv0 32)))).def_19183))
(assert (let ((.def_19186 (= t8_pc (_ bv0 32)))).def_19186))
(assert (let ((.def_19189 (= t9_pc (_ bv0 32)))).def_19189))
(assert (let ((.def_19191 (= m_pc (_ bv1 32)))).def_19191))
(assert (let ((.def_19193 (= t1_pc (_ bv1 32)))).def_19193))
(assert (let ((.def_19195 (= t2_pc (_ bv1 32)))).def_19195))
(assert (let ((.def_19197 (= t3_pc (_ bv1 32)))).def_19197))
(assert (let ((.def_19199 (= t4_pc (_ bv1 32)))).def_19199))
(assert (let ((.def_19201 (= t5_pc (_ bv1 32)))).def_19201))
(assert (let ((.def_19203 (= t6_pc (_ bv1 32)))).def_19203))
(assert (let ((.def_19205 (= t7_pc (_ bv1 32)))).def_19205))
(assert (let ((.def_19207 (= t8_pc (_ bv1 32)))).def_19207))
(assert (let ((.def_19209 (= t9_pc (_ bv1 32)))).def_19209))
(assert (let ((.def_19212 (= m_st (_ bv0 32)))).def_19212))

start_simulation2 N1385:
(assert (let ((.def_11373 (= m_pc (_ bv0 32)))).def_11373))
(assert (let ((.def_619 (= c_num_read p_num_write))).def_619))
(assert (let ((.def_628 (= c_last_read p_last_write))).def_628))
(assert (let ((.def_19165 (= t1_pc (_ bv0 32)))).def_19165))
(assert (let ((.def_19168 (= t2_pc (_ bv0 32)))).def_19168))
(assert (let ((.def_19171 (= t3_pc (_ bv0 32)))).def_19171))
(assert (let ((.def_19174 (= t4_pc (_ bv0 32)))).def_19174))
(assert (let ((.def_19177 (= t5_pc (_ bv0 32)))).def_19177))
(assert (let ((.def_19180 (= t6_pc (_ bv0 32)))).def_19180))
(assert (let ((.def_19183 (= t7_pc (_ bv0 32)))).def_19183))
(assert (let ((.def_19186 (= t8_pc (_ bv0 32)))).def_19186))
(assert (let ((.def_19189 (= t9_pc (_ bv0 32)))).def_19189))
(assert (let ((.def_19191 (= m_pc (_ bv1 32)))).def_19191))
(assert (let ((.def_19193 (= t1_pc (_ bv1 32)))).def_19193))
(assert (let ((.def_19195 (= t2_pc (_ bv1 32)))).def_19195))
(assert (let ((.def_19197 (= t3_pc (_ bv1 32)))).def_19197))
(assert (let ((.def_19199 (= t4_pc (_ bv1 32)))).def_19199))
(assert (let ((.def_19201 (= t5_pc (_ bv1 32)))).def_19201))
(assert (let ((.def_19203 (= t6_pc (_ bv1 32)))).def_19203))
(assert (let ((.def_19205 (= t7_pc (_ bv1 32)))).def_19205))
(assert (let ((.def_19207 (= t8_pc (_ bv1 32)))).def_19207))
(assert (let ((.def_19209 (= t9_pc (_ bv1 32)))).def_19209))

