(set-info :source |printed by MathSAT|)
(declare-fun a20 () (_ BitVec 32))
(declare-fun a25 () (_ BitVec 32))
(declare-fun a12 () (_ BitVec 32))
(declare-fun a15 () (_ BitVec 32))
(declare-fun a16 () (_ BitVec 32))
(declare-fun a2 () (_ BitVec 32))
(declare-fun a27 () (_ BitVec 32))
(declare-fun a9 () (_ BitVec 32))
(declare-fun m_pc () (_ BitVec 32))
(declare-fun t1_pc () (_ BitVec 32))
(declare-fun t2_pc () (_ BitVec 32))
(declare-fun t3_pc () (_ BitVec 32))
(declare-fun t4_pc () (_ BitVec 32))
(declare-fun t5_pc () (_ BitVec 32))
(declare-fun t6_pc () (_ BitVec 32))
(declare-fun t7_pc () (_ BitVec 32))
(declare-fun t8_pc () (_ BitVec 32))
(declare-fun t9_pc () (_ BitVec 32))
(declare-fun t10_pc () (_ BitVec 32))
(declare-fun t11_pc () (_ BitVec 32))
(declare-fun m_st () (_ BitVec 32))

*:
(assert (let ((.def_107923 (= a20 (_ bv5 32)))).def_107923))

calculate_output8 N30108:
(assert false)
(assert (let ((.def_107923 (= a20 (_ bv5 32)))).def_107923))

main1 N30136:
(assert (let ((.def_107923 (= a20 (_ bv5 32)))).def_107923))
(assert (let ((.def_155666 (= a25 (_ bv1 32)))).def_155666))
(assert (let ((.def_155669 (= a12 (_ bv4 32)))).def_155669))
(assert (let ((.def_155672 (= a15 (_ bv1 32)))).def_155672))
(assert (let ((.def_155675 (= a16 (_ bv1 32)))).def_155675))
(assert (let ((.def_155678 (= a2 (_ bv10 32)))).def_155678))
(assert (let ((.def_155681 (= a27 (_ bv1 32)))).def_155681))
(assert (let ((.def_155684 (= a9 (_ bv18 32)))).def_155684))
(assert (let ((.def_321856 (= a12 (_ bv5 32)))).def_321856))
(assert (let ((.def_321858 (= a2 (_ bv13 32)))).def_321858))
(assert (let ((.def_321860 (= a12 (_ bv2 32)))).def_321860))
(assert (let ((.def_321862 (= a2 (_ bv12 32)))).def_321862))
(assert (let ((.def_321864 (= a12 (_ bv3 32)))).def_321864))
(assert (let ((.def_321866 (= a9 (_ bv16 32)))).def_321866))
(assert (let ((.def_321868 (= a20 (_ bv7 32)))).def_321868))
(assert (let ((.def_321870 (= a2 (_ bv9 32)))).def_321870))
(assert (let ((.def_321872 (= a9 (_ bv17 32)))).def_321872))

error N30154:
(assert false)
(assert (let ((.def_107923 (= a20 (_ bv5 32)))).def_107923))

eval N30841:
(assert (let ((.def_747741 (= m_pc (_ bv0 32)))).def_747741))
(assert (let ((.def_107923 (= a20 (_ bv5 32)))).def_107923))
(assert (let ((.def_758605 (= t1_pc (_ bv0 32)))).def_758605))
(assert (let ((.def_758608 (= t2_pc (_ bv0 32)))).def_758608))
(assert (let ((.def_758611 (= t3_pc (_ bv0 32)))).def_758611))
(assert (let ((.def_758614 (= t4_pc (_ bv0 32)))).def_758614))
(assert (let ((.def_758617 (= t5_pc (_ bv0 32)))).def_758617))
(assert (let ((.def_758620 (= t6_pc (_ bv0 32)))).def_758620))
(assert (let ((.def_758623 (= t7_pc (_ bv0 32)))).def_758623))
(assert (let ((.def_758626 (= t8_pc (_ bv0 32)))).def_758626))
(assert (let ((.def_758629 (= t9_pc (_ bv0 32)))).def_758629))
(assert (let ((.def_758632 (= t10_pc (_ bv0 32)))).def_758632))
(assert (let ((.def_758635 (= t11_pc (_ bv0 32)))).def_758635))
(assert (let ((.def_758637 (= m_pc (_ bv1 32)))).def_758637))
(assert (let ((.def_758639 (= t1_pc (_ bv1 32)))).def_758639))
(assert (let ((.def_758641 (= t2_pc (_ bv1 32)))).def_758641))
(assert (let ((.def_758643 (= t3_pc (_ bv1 32)))).def_758643))
(assert (let ((.def_758645 (= t4_pc (_ bv1 32)))).def_758645))
(assert (let ((.def_758647 (= t5_pc (_ bv1 32)))).def_758647))
(assert (let ((.def_758649 (= t6_pc (_ bv1 32)))).def_758649))
(assert (let ((.def_758651 (= t7_pc (_ bv1 32)))).def_758651))
(assert (let ((.def_758653 (= t8_pc (_ bv1 32)))).def_758653))
(assert (let ((.def_758655 (= t9_pc (_ bv1 32)))).def_758655))
(assert (let ((.def_758657 (= t10_pc (_ bv1 32)))).def_758657))
(assert (let ((.def_758659 (= t11_pc (_ bv1 32)))).def_758659))
(assert (let ((.def_758662 (= m_st (_ bv0 32)))).def_758662))

start_simulation N31401:
(assert (let ((.def_747741 (= m_pc (_ bv0 32)))).def_747741))
(assert (let ((.def_107923 (= a20 (_ bv5 32)))).def_107923))
(assert (let ((.def_758605 (= t1_pc (_ bv0 32)))).def_758605))
(assert (let ((.def_758608 (= t2_pc (_ bv0 32)))).def_758608))
(assert (let ((.def_758611 (= t3_pc (_ bv0 32)))).def_758611))
(assert (let ((.def_758614 (= t4_pc (_ bv0 32)))).def_758614))
(assert (let ((.def_758617 (= t5_pc (_ bv0 32)))).def_758617))
(assert (let ((.def_758620 (= t6_pc (_ bv0 32)))).def_758620))
(assert (let ((.def_758623 (= t7_pc (_ bv0 32)))).def_758623))
(assert (let ((.def_758626 (= t8_pc (_ bv0 32)))).def_758626))
(assert (let ((.def_758629 (= t9_pc (_ bv0 32)))).def_758629))
(assert (let ((.def_758632 (= t10_pc (_ bv0 32)))).def_758632))
(assert (let ((.def_758635 (= t11_pc (_ bv0 32)))).def_758635))
(assert (let ((.def_758637 (= m_pc (_ bv1 32)))).def_758637))
(assert (let ((.def_758639 (= t1_pc (_ bv1 32)))).def_758639))
(assert (let ((.def_758641 (= t2_pc (_ bv1 32)))).def_758641))
(assert (let ((.def_758643 (= t3_pc (_ bv1 32)))).def_758643))
(assert (let ((.def_758645 (= t4_pc (_ bv1 32)))).def_758645))
(assert (let ((.def_758647 (= t5_pc (_ bv1 32)))).def_758647))
(assert (let ((.def_758649 (= t6_pc (_ bv1 32)))).def_758649))
(assert (let ((.def_758651 (= t7_pc (_ bv1 32)))).def_758651))
(assert (let ((.def_758653 (= t8_pc (_ bv1 32)))).def_758653))
(assert (let ((.def_758655 (= t9_pc (_ bv1 32)))).def_758655))
(assert (let ((.def_758657 (= t10_pc (_ bv1 32)))).def_758657))
(assert (let ((.def_758659 (= t11_pc (_ bv1 32)))).def_758659))

