(set-info :source |printed by MathSAT|)
(declare-fun c_last_read () (_ BitVec 32))
(declare-fun p_last_write () (_ BitVec 32))
(declare-fun c_num_read () (_ BitVec 32))
(declare-fun p_num_write () (_ BitVec 32))
(declare-fun c_dr_pc () (_ BitVec 32))
(declare-fun c_dr_st () (_ BitVec 32))
(declare-fun m_pc () (_ BitVec 32))
(declare-fun t1_pc () (_ BitVec 32))
(declare-fun t2_pc () (_ BitVec 32))
(declare-fun t3_pc () (_ BitVec 32))
(declare-fun t4_pc () (_ BitVec 32))
(declare-fun m_st () (_ BitVec 32))
(declare-fun t4_st () (_ BitVec 32))
(declare-fun E_4 () (_ BitVec 32))
(declare-fun E_2 () (_ BitVec 32))
(declare-fun E_M () (_ BitVec 32))
(declare-fun E_3 () (_ BitVec 32))
(declare-fun t1_st () (_ BitVec 32))
(declare-fun t2_st () (_ BitVec 32))
(declare-fun t3_st () (_ BitVec 32))
(declare-fun E_1 () (_ BitVec 32))
(declare-fun local () (_ BitVec 32))
(declare-fun token () (_ BitVec 32))
(declare-fun T4_E () (_ BitVec 32))
(declare-fun T3_E () (_ BitVec 32))
(declare-fun T2_E () (_ BitVec 32))
(declare-fun T1_E () (_ BitVec 32))
(declare-fun M_E () (_ BitVec 32))

*:
(assert (let ((.def_677 (= c_last_read p_last_write))).def_677))
(assert (let ((.def_686 (= c_num_read p_num_write))).def_686))

error1 N4:
(assert false)
(assert (let ((.def_677 (= c_last_read p_last_write))).def_677))
(assert (let ((.def_686 (= c_num_read p_num_write))).def_686))

eval1 N282:
(assert (let ((.def_837 (= c_dr_pc (_ bv0 32)))).def_837))
(assert (let ((.def_677 (= c_last_read p_last_write))).def_677))
(assert (let ((.def_686 (= c_num_read p_num_write))).def_686))
(assert (let ((.def_1328 (= c_dr_pc (_ bv2 32)))).def_1328))
(assert (let ((.def_1331 (= c_dr_st (_ bv0 32)))).def_1331))

start_simulation1 N338:
(assert (let ((.def_837 (= c_dr_pc (_ bv0 32)))).def_837))
(assert (let ((.def_677 (= c_last_read p_last_write))).def_677))
(assert (let ((.def_686 (= c_num_read p_num_write))).def_686))
(assert (let ((.def_1328 (= c_dr_pc (_ bv2 32)))).def_1328))

error2 N393:
(assert false)
(assert (let ((.def_677 (= c_last_read p_last_write))).def_677))
(assert (let ((.def_686 (= c_num_read p_num_write))).def_686))

eval2 N689:
(assert (let ((.def_4330 (= m_pc (_ bv0 32)))).def_4330))
(assert (let ((.def_677 (= c_last_read p_last_write))).def_677))
(assert (let ((.def_686 (= c_num_read p_num_write))).def_686))
(assert (let ((.def_6630 (= t1_pc (_ bv0 32)))).def_6630))
(assert (let ((.def_6633 (= t2_pc (_ bv0 32)))).def_6633))
(assert (let ((.def_6636 (= t3_pc (_ bv0 32)))).def_6636))
(assert (let ((.def_6639 (= t4_pc (_ bv0 32)))).def_6639))
(assert (let ((.def_6641 (= m_pc (_ bv1 32)))).def_6641))
(assert (let ((.def_6643 (= t1_pc (_ bv1 32)))).def_6643))
(assert (let ((.def_6645 (= t2_pc (_ bv1 32)))).def_6645))
(assert (let ((.def_6647 (= t3_pc (_ bv1 32)))).def_6647))
(assert (let ((.def_6649 (= t4_pc (_ bv1 32)))).def_6649))
(assert (let ((.def_6652 (= m_st (_ bv0 32)))).def_6652))
(assert (let ((.def_9905 (= t4_st (_ bv0 32)))).def_9905))
(assert (let ((.def_9908 (= E_4 (_ bv1 32)))).def_9908))
(assert (let ((.def_9911 (= E_2 (_ bv1 32)))).def_9911))
(assert (let ((.def_9914 (= E_M (_ bv1 32)))).def_9914))
(assert (let ((.def_9917 (= E_3 (_ bv1 32)))).def_9917))
(assert (let ((.def_9920 (= t1_st (_ bv0 32)))).def_9920))
(assert (let ((.def_9923 (= t2_st (_ bv0 32)))).def_9923))
(assert (let ((.def_9926 (= t3_st (_ bv0 32)))).def_9926))
(assert (let ((.def_9929 (= E_1 (_ bv1 32)))).def_9929))
(assert (let ((.def_9932 (bvadd (_ bv4 32) local)))(let ((.def_9934 (= .def_9932 token))).def_9934)))
(assert (let ((.def_16435 (= E_1 (_ bv2 32)))).def_16435))
(assert (let ((.def_16437 (= t3_st (_ bv2 32)))).def_16437))
(assert (let ((.def_16439 (= t4_st (_ bv2 32)))).def_16439))
(assert (let ((.def_16441 (bvadd (_ bv2 32) local)))(let ((.def_16442 (= token .def_16441))).def_16442)))
(assert (let ((.def_16444 (= local token))).def_16444))
(assert (let ((.def_16446 (bvadd (_ bv1 32) local)))(let ((.def_16447 (= token .def_16446))).def_16447)))
(assert (let ((.def_16449 (bvadd (_ bv3 32) local)))(let ((.def_16450 (= token .def_16449))).def_16450)))
(assert (let ((.def_22733 (= E_M (_ bv0 32)))).def_22733))
(assert (let ((.def_22735 (= E_2 (_ bv0 32)))).def_22735))
(assert (let ((.def_22737 (= E_1 (_ bv0 32)))).def_22737))
(assert (let ((.def_28542 (= E_4 (_ bv0 32)))).def_28542))
(assert (let ((.def_28544 (= E_3 (_ bv0 32)))).def_28544))
(assert (let ((.def_28547 (= T4_E (_ bv0 32)))).def_28547))
(assert (let ((.def_28550 (= T3_E (_ bv0 32)))).def_28550))
(assert (let ((.def_28553 (= T2_E (_ bv0 32)))).def_28553))
(assert (let ((.def_28556 (= T1_E (_ bv0 32)))).def_28556))
(assert (let ((.def_28559 (= M_E (_ bv0 32)))).def_28559))
(assert false)

start_simulation2 N962:
(assert (let ((.def_4330 (= m_pc (_ bv0 32)))).def_4330))
(assert (let ((.def_677 (= c_last_read p_last_write))).def_677))
(assert (let ((.def_686 (= c_num_read p_num_write))).def_686))
(assert (let ((.def_6630 (= t1_pc (_ bv0 32)))).def_6630))
(assert (let ((.def_6633 (= t2_pc (_ bv0 32)))).def_6633))
(assert (let ((.def_6636 (= t3_pc (_ bv0 32)))).def_6636))
(assert (let ((.def_6639 (= t4_pc (_ bv0 32)))).def_6639))
(assert (let ((.def_6641 (= m_pc (_ bv1 32)))).def_6641))
(assert (let ((.def_6643 (= t1_pc (_ bv1 32)))).def_6643))
(assert (let ((.def_6645 (= t2_pc (_ bv1 32)))).def_6645))
(assert (let ((.def_6647 (= t3_pc (_ bv1 32)))).def_6647))
(assert (let ((.def_6649 (= t4_pc (_ bv1 32)))).def_6649))
(assert (let ((.def_9905 (= t4_st (_ bv0 32)))).def_9905))
(assert (let ((.def_9908 (= E_4 (_ bv1 32)))).def_9908))
(assert (let ((.def_9911 (= E_2 (_ bv1 32)))).def_9911))
(assert (let ((.def_9914 (= E_M (_ bv1 32)))).def_9914))
(assert (let ((.def_9917 (= E_3 (_ bv1 32)))).def_9917))
(assert (let ((.def_6652 (= m_st (_ bv0 32)))).def_6652))
(assert (let ((.def_9929 (= E_1 (_ bv1 32)))).def_9929))
(assert (let ((.def_16435 (= E_1 (_ bv2 32)))).def_16435))
(assert (let ((.def_9923 (= t2_st (_ bv0 32)))).def_9923))
(assert (let ((.def_9920 (= t1_st (_ bv0 32)))).def_9920))
(assert (let ((.def_22733 (= E_M (_ bv0 32)))).def_22733))
(assert (let ((.def_22735 (= E_2 (_ bv0 32)))).def_22735))
(assert (let ((.def_9926 (= t3_st (_ bv0 32)))).def_9926))
(assert (let ((.def_28542 (= E_4 (_ bv0 32)))).def_28542))
(assert (let ((.def_28544 (= E_3 (_ bv0 32)))).def_28544))
(assert (let ((.def_28547 (= T4_E (_ bv0 32)))).def_28547))
(assert (let ((.def_28550 (= T3_E (_ bv0 32)))).def_28550))
(assert (let ((.def_28553 (= T2_E (_ bv0 32)))).def_28553))
(assert (let ((.def_28556 (= T1_E (_ bv0 32)))).def_28556))
(assert (let ((.def_28559 (= M_E (_ bv0 32)))).def_28559))

