(set-info :source |printed by MathSAT|)
(declare-fun a20 () (_ BitVec 32))
(declare-fun a25 () (_ BitVec 32))
(declare-fun a12 () (_ BitVec 32))
(declare-fun a15 () (_ BitVec 32))
(declare-fun a16 () (_ BitVec 32))
(declare-fun a2 () (_ BitVec 32))
(declare-fun a27 () (_ BitVec 32))
(declare-fun a9 () (_ BitVec 32))
(declare-fun |calculate_output3::input| () (_ BitVec 32))
(declare-fun |calculate_output2::input| () (_ BitVec 32))
(declare-fun |calculate_output4::input| () (_ BitVec 32))
(declare-fun |calculate_output5::input| () (_ BitVec 32))
(declare-fun |calculate_output6::input| () (_ BitVec 32))
(declare-fun |calculate_output7::input| () (_ BitVec 32))
(declare-fun |calculate_output8::input| () (_ BitVec 32))

*:
(assert (let ((.def_106676 (= a20 (_ bv5 32)))).def_106676))

calculate_output8 N29800:
(assert false)
(assert (let ((.def_106676 (= a20 (_ bv5 32)))).def_106676))

main1 N30136:
(assert (let ((.def_106676 (= a20 (_ bv5 32)))).def_106676))
(assert (let ((.def_153874 (= a25 (_ bv1 32)))).def_153874))
(assert (let ((.def_153877 (= a12 (_ bv4 32)))).def_153877))
(assert (let ((.def_153880 (= a15 (_ bv1 32)))).def_153880))
(assert (let ((.def_153883 (= a16 (_ bv1 32)))).def_153883))
(assert (let ((.def_153886 (= a2 (_ bv10 32)))).def_153886))
(assert (let ((.def_153889 (= a27 (_ bv1 32)))).def_153889))
(assert (let ((.def_153892 (= a9 (_ bv18 32)))).def_153892))
(assert (let ((.def_319754 (= a2 (_ bv11 32)))).def_319754))
(assert (let ((.def_319756 (= a12 (_ bv2 32)))).def_319756))
(assert (let ((.def_319758 (= a9 (_ bv17 32)))).def_319758))
(assert (let ((.def_319760 (= a2 (_ bv13 32)))).def_319760))
(assert (let ((.def_319762 (= a20 (_ bv6 32)))).def_319762))
(assert (let ((.def_319764 (= a12 (_ bv6 32)))).def_319764))
(assert (let ((.def_319766 (= a2 (_ bv9 32)))).def_319766))
(assert (let ((.def_319768 (= a9 (_ bv16 32)))).def_319768))
(assert (let ((.def_1236312 (= a20 (_ bv7 32)))).def_1236312))
(assert (let ((.def_1236314 (= a12 (_ bv5 32)))).def_1236314))
(assert (let ((.def_1236316 (= a12 (_ bv3 32)))).def_1236316))
(assert (let ((.def_1236318 (= a2 (_ bv12 32)))).def_1236318))
(assert (let ((.def_1236321 (= |calculate_output3::input| (_ bv4 32)))).def_1236321))
(assert (let ((.def_1236324 (= |calculate_output2::input| (_ bv4 32)))).def_1236324))
(assert (let ((.def_1236326 (= |calculate_output3::input| |calculate_output2::input|))).def_1236326))
(assert (let ((.def_1236328 (= |calculate_output3::input| (_ bv1 32)))).def_1236328))
(assert (let ((.def_1236330 (= |calculate_output3::input| (_ bv6 32)))).def_1236330))
(assert (let ((.def_1236332 (= |calculate_output3::input| (_ bv5 32)))).def_1236332))
(assert (let ((.def_1236334 (= |calculate_output3::input| (_ bv2 32)))).def_1236334))
(assert (let ((.def_1236336 (= |calculate_output3::input| (_ bv3 32)))).def_1236336))
(assert (let ((.def_1236339 (= |calculate_output4::input| (_ bv4 32)))).def_1236339))
(assert (let ((.def_1236341 (= |calculate_output4::input| (_ bv1 32)))).def_1236341))
(assert (let ((.def_1236343 (= |calculate_output4::input| (_ bv6 32)))).def_1236343))
(assert (let ((.def_1236345 (= |calculate_output4::input| (_ bv5 32)))).def_1236345))
(assert (let ((.def_1236347 (= |calculate_output4::input| (_ bv2 32)))).def_1236347))
(assert (let ((.def_1236349 (= |calculate_output4::input| (_ bv3 32)))).def_1236349))
(assert (let ((.def_1236351 (= |calculate_output3::input| |calculate_output4::input|))).def_1236351))
(assert (let ((.def_1236354 (= |calculate_output5::input| (_ bv4 32)))).def_1236354))
(assert (let ((.def_1236356 (= |calculate_output5::input| (_ bv1 32)))).def_1236356))
(assert (let ((.def_1236358 (= |calculate_output5::input| (_ bv2 32)))).def_1236358))
(assert (let ((.def_1236360 (= |calculate_output5::input| (_ bv6 32)))).def_1236360))
(assert (let ((.def_1236362 (= |calculate_output5::input| (_ bv3 32)))).def_1236362))
(assert (let ((.def_1236364 (= |calculate_output4::input| |calculate_output5::input|))).def_1236364))
(assert (let ((.def_1236367 (= |calculate_output6::input| (_ bv5 32)))).def_1236367))
(assert (let ((.def_1236369 (= |calculate_output6::input| (_ bv6 32)))).def_1236369))
(assert (let ((.def_1236371 (= |calculate_output6::input| (_ bv1 32)))).def_1236371))
(assert (let ((.def_1236373 (= |calculate_output6::input| (_ bv3 32)))).def_1236373))
(assert (let ((.def_1236375 (= |calculate_output5::input| |calculate_output6::input|))).def_1236375))
(assert (let ((.def_1236378 (= |calculate_output6::input| |calculate_output7::input|))).def_1236378))
(assert (let ((.def_1236380 (= |calculate_output6::input| (_ bv2 32)))).def_1236380))
(assert (let ((.def_1236382 (= |calculate_output7::input| (_ bv6 32)))).def_1236382))
(assert (let ((.def_1236384 (= |calculate_output5::input| (_ bv5 32)))).def_1236384))
(assert (let ((.def_1236386 (= |calculate_output7::input| (_ bv2 32)))).def_1236386))
(assert (let ((.def_1236388 (= |calculate_output7::input| (_ bv1 32)))).def_1236388))
(assert (let ((.def_1236391 (= |calculate_output8::input| (_ bv1 32)))).def_1236391))
(assert (let ((.def_1236393 (= |calculate_output8::input| (_ bv6 32)))).def_1236393))
(assert (let ((.def_1236395 (= |calculate_output7::input| |calculate_output8::input|))).def_1236395))
(assert (let ((.def_1236397 (= |calculate_output6::input| (_ bv4 32)))).def_1236397))
(assert (let ((.def_1236399 (= |calculate_output7::input| (_ bv4 32)))).def_1236399))
(assert (let ((.def_1236401 (= |calculate_output8::input| (_ bv2 32)))).def_1236401))
(assert (let ((.def_1236403 (= |calculate_output6::input| |calculate_output8::input|))).def_1236403))

