(set-info :source |printed by MathSAT|)
(declare-fun |ssl3_connect::blastFlag| () (_ BitVec 32))
(declare-fun |ssl3_connect::s__state| () (_ BitVec 32))

ssl3_connect:
(assert (let ((.def_685 (= |ssl3_connect::blastFlag| (_ bv4 32)))).def_685))

ssl3_connect N120:
(assert (let ((.def_1604 (= |ssl3_connect::s__state| (_ bv12292 32)))).def_1604))
(assert (let ((.def_1606 (= |ssl3_connect::blastFlag| (_ bv0 32)))).def_1606))
(assert (let ((.def_685 (= |ssl3_connect::blastFlag| (_ bv4 32)))).def_685))
(assert (let ((.def_3691 (= |ssl3_connect::blastFlag| (_ bv3 32)))).def_3691))
(assert (let ((.def_3693 (= |ssl3_connect::s__state| (_ bv4368 32)))).def_3693))
(assert (let ((.def_3695 (= |ssl3_connect::blastFlag| (_ bv1 32)))).def_3695))

ssl3_connect N579:
(assert false)
(assert (let ((.def_685 (= |ssl3_connect::blastFlag| (_ bv4 32)))).def_685))

