extern void abort(void);

extern void __assert_fail (const char *__assertion, const char *__file,
      unsigned int __line, const char *__function)
     __attribute__ ((__nothrow__ , __leaf__)) __attribute__ ((__noreturn__));
extern void __assert_perror_fail (int __errnum, const char *__file,
      unsigned int __line, const char *__function)
     __attribute__ ((__nothrow__ , __leaf__)) __attribute__ ((__noreturn__));
extern void __assert (const char *__assertion, const char *__file, int __line)
     __attribute__ ((__nothrow__ , __leaf__)) __attribute__ ((__noreturn__));

void reach_error() { ((void) sizeof ((0) ? 1 : 0), __extension__ ({ if (0) ; else __assert_fail ("0", "sum04-2.c", 3, __extension__ __PRETTY_FUNCTION__); })); }

void __VERIFIER_assert(int cond) {
  if (!(cond)) {
    ERROR: {reach_error();abort();}
  }
  return;
}


int main() {
  int i, sn=0;
  //@ loop invariant sn == (i - 1) * 2 && i <= 8 + 1;
  for(i=1; i<=8; i++) {
    sn = sn + (2);
  }
  //@ assert sn == 8 * 2 || sn == 0;
  __VERIFIER_assert(sn==8*(2) || sn == 0);
}
