extern void abort(void);

extern void __assert_fail (const char *__assertion, const char *__file,
      unsigned int __line, const char *__function)
     __attribute__ ((__nothrow__ , __leaf__)) __attribute__ ((__noreturn__));
extern void __assert_perror_fail (int __errnum, const char *__file,
      unsigned int __line, const char *__function)
     __attribute__ ((__nothrow__ , __leaf__)) __attribute__ ((__noreturn__));
extern void __assert (const char *__assertion, const char *__file, int __line)
     __attribute__ ((__nothrow__ , __leaf__)) __attribute__ ((__noreturn__));

void reach_error() { ((void) sizeof ((0) ? 1 : 0), __extension__ ({ if (0) ; else __assert_fail ("0", "assert.h", 3, __extension__ __PRETTY_FUNCTION__); })); }
extern void abort(void);
void assume_abort_if_not(int cond) {
  if(!cond) {abort();}
}
void __VERIFIER_assert(int cond) {
  if (!(cond)) {
    ERROR: {reach_error();abort();}
  }
  return;
}
int __VERIFIER_nondet_int();
int main(int argc, char* argv[]) {
  int c1 = 4000;
  int c2 = 2000;
  int c3 = 10000;
  int n, v;
  int i, k, j;
  n = __VERIFIER_nondet_int();
  if (!(0 <= n && n < 10)) return 0;
  k = 0;
  i = 0;
  //@ loop invariant 0 <= i <= n < 10 && i * c2 <= k <= i * c3 && c1 == 4000 && c2 == 2000 && c3 == 10000;
  while( i < n ) {
    i++;
    v = __VERIFIER_nondet_int();
    if (!(0 <= v && n < 2)) return 0;
    if( v == 0 )
      k += c1;
    else if( v == 1 )
      k += c2;
    else
      k += c3;
  }
  j = 0;
  //@ loop invariant n * c2 - j <= k <= n * c3 - j && c2 == 2000 && c3 == 10000;
  while( j < n ) {
    //@ assert k > 0;
    __VERIFIER_assert(k > 0);
    j++;
    k--;
  }
  return 0;
}
