extern int __VERIFIER_nondet_int();
extern _Bool __VERIFIER_nondet_bool();

int main() {
  int i = __VERIFIER_nondet_int();
  int k = __VERIFIER_nondet_int();
  int n = __VERIFIER_nondet_int();
  if (!(i==0 && k==n && n>=0)) return 0;
  //@ loop_invariant 2 * k + i == 2 * n && i <= n + 1;
  while (i<n) {
    k--;
    i+=2;
  }
  //@ assert 2 * k >= n - 1;
  return 0;
}
