int __VERIFIER_nondet_int();
int main() {
    int n, sum, i;
    n = __VERIFIER_nondet_int();
    if (!(1 <= n && n <= 1000)) return 0;
    sum = 0;
    //@ loop_invariant 2 * sum == (i - 1) * i && i - 1 <= n;
    for(i = 1; i <= n; i++) {
        sum = sum + i;
    }
    //@ assert 2 * sum == n * (n + 1);
    return 0;
}
