extern void abort(void);

extern void __assert_fail (const char *__assertion, const char *__file,
      unsigned int __line, const char *__function)
     __attribute__ ((__nothrow__ , __leaf__)) __attribute__ ((__noreturn__));
extern void __assert_perror_fail (int __errnum, const char *__file,
      unsigned int __line, const char *__function)
     __attribute__ ((__nothrow__ , __leaf__)) __attribute__ ((__noreturn__));
extern void __assert (const char *__assertion, const char *__file, int __line)
     __attribute__ ((__nothrow__ , __leaf__)) __attribute__ ((__noreturn__));

void reach_error() { ((void) sizeof ((0) ? 1 : 0), __extension__ ({ if (0) ; else __assert_fail ("0", "assert.h", 3, __extension__ __PRETTY_FUNCTION__); })); }
extern void abort(void);
void assume_abort_if_not(int cond) {
  if(!cond) {abort();}
}
void __VERIFIER_assert(int cond) {
  if (!(cond)) {
      ERROR: {reach_error();abort();}
  }
  return;
}
int __VERIFIER_nondet_int();
int main() {
    int i, j;
    i = __VERIFIER_nondet_int();
    j = __VERIFIER_nondet_int();
    if (!(i >= 0 && i <= 1000000)) return 0;
    if (!(j >= 0)) return 0;
    int x = i;
    int y = j;
    int z = 0;
    //@ loop invariant y + i - j == x - z;
    while(x != 0) {
        x --;
        y -= 2;
        z ++;
    }
    if (i == j) {
        //@ assert y == -z;
        __VERIFIER_assert(y == -z);
    }
    return 0;
}
