int __VERIFIER_nondet_int();
int main() {
    int i = 0;
    int n = 0;
    int k = __VERIFIER_nondet_int();
    if (!(k <= 1000000 && k >= -1000000)) return 0;
    //@ loop_invariant 0 <= i && i == 2 * n - i % 2 && (k < 0 || i <= 2 * k);
    for(i = 0; i < 2*k; i++) {
 if (i % 2 == 0) {
     n ++;
 }
    }
    //@ assert k < 0 || n == k;
    return 0;
}
