extern void abort(void);

extern void __assert_fail (const char *__assertion, const char *__file,
      unsigned int __line, const char *__function)
     __attribute__ ((__nothrow__ , __leaf__)) __attribute__ ((__noreturn__));
extern void __assert_perror_fail (int __errnum, const char *__file,
      unsigned int __line, const char *__function)
     __attribute__ ((__nothrow__ , __leaf__)) __attribute__ ((__noreturn__));
extern void __assert (const char *__assertion, const char *__file, int __line)
     __attribute__ ((__nothrow__ , __leaf__)) __attribute__ ((__noreturn__));

void reach_error() { ((void) sizeof ((0) ? 1 : 0), __extension__ ({ if (0) ; else __assert_fail ("0", "trex01-2.c", 3, __extension__ __PRETTY_FUNCTION__); })); }
extern void abort(void);
void assume_abort_if_not(int cond) {
  if(!cond) {abort();}
}
void __VERIFIER_assert(int cond) {
  if (!(cond)) {
    ERROR: {reach_error();abort();}
  }
  return;
}
_Bool __VERIFIER_nondet_bool();
int __VERIFIER_nondet_int();
void f(int d) {
  int x = __VERIFIER_nondet_int(), y = __VERIFIER_nondet_int(), k = __VERIFIER_nondet_int(), z = 1;
  L1:
  if (!(k <= 1073741823))
    return;
  //@ loop invariant z >= 1;
  while (z < k) { z = 2 * z; }
  //@ assert z >= 1;
  __VERIFIER_assert(z>=1);
  L2:
  if (!(x <= 1000000 && x >= -1000000)) return;
  if (!(y <= 1000000 && y >= -1000000)) return;
  if (!(k <= 1000000 && k >= -1000000)) return;
  while (x > 0 && y > 0) {
    _Bool c = __VERIFIER_nondet_bool();
    if (c) {
      P1:
      x = x - d;
      y = __VERIFIER_nondet_bool();;
      z = z - 1;
    } else {
      y = y - d;
    }
  }
}
int main() {
  _Bool c = __VERIFIER_nondet_bool();
  if (c) {
    f(1);
  } else {
    f(2);
  }
  return 0;
}
