int __VERIFIER_nondet_int();
int main() {
  int n;
  int i = 0;
  int k = 0;
  n = __VERIFIER_nondet_int();
  //@ loop_invariant i == k && (0 <= i && i <= n || i == 0 && 0 > n);
  while( i < n ) {
 i++;
 k++;
  }
  int j = 0;
  //@ loop_invariant k == j && j == 0 && 0 > n || (k + j == n && n >= 0 && j <= n);
  while( j < n ) {
    //@ assert k > 0;
    j++;
    k--;
  }
}
