extern void abort(void);

extern void __assert_fail (const char *__assertion, const char *__file,
      unsigned int __line, const char *__function)
     __attribute__ ((__nothrow__ , __leaf__)) __attribute__ ((__noreturn__));
extern void __assert_perror_fail (int __errnum, const char *__file,
      unsigned int __line, const char *__function)
     __attribute__ ((__nothrow__ , __leaf__)) __attribute__ ((__noreturn__));
extern void __assert (const char *__assertion, const char *__file, int __line)
     __attribute__ ((__nothrow__ , __leaf__)) __attribute__ ((__noreturn__));

void reach_error() { ((void) sizeof ((0) ? 1 : 0), __extension__ ({ if (0) ; else __assert_fail ("0", "assert.h", 3, __extension__ __PRETTY_FUNCTION__); })); }
extern void abort(void);
void assume_abort_if_not(int cond) {
  if(!cond) {abort();}
}
void __VERIFIER_assert(int cond) {
  if (!(cond)) {
      ERROR: {reach_error();abort();}
  }
  return;
}
int __VERIFIER_nondet_int();
int main() {
    int i, n, a, b;
    i = 0; a = 0; b = 0; n = __VERIFIER_nondet_int();
    if(!(n >= 0 && n <= 1000000)) return 0;
    //@ loop invariant a + b == 3*i && i <= n;
    while (i < n) {
        if (__VERIFIER_nondet_int()) {
            a = a + 1;
            b = b + 2;
        } else {
            a = a + 2;
            b = b + 1;
        }
        i = i + 1;
    }
    //@ assert a + b == 3*n;
    __VERIFIER_assert(a + b == 3*n);
    return 0;
}
