extern void abort(void);

extern void __assert_fail (const char *__assertion, const char *__file,
      unsigned int __line, const char *__function)
     __attribute__ ((__nothrow__ , __leaf__)) __attribute__ ((__noreturn__));
extern void __assert_perror_fail (int __errnum, const char *__file,
      unsigned int __line, const char *__function)
     __attribute__ ((__nothrow__ , __leaf__)) __attribute__ ((__noreturn__));
extern void __assert (const char *__assertion, const char *__file, int __line)
     __attribute__ ((__nothrow__ , __leaf__)) __attribute__ ((__noreturn__));

void reach_error() { ((void) sizeof ((0) ? 1 : 0), __extension__ ({ if (0) ; else __assert_fail ("0", "divbin2.c", 10, __extension__ __PRETTY_FUNCTION__); })); }
extern unsigned __VERIFIER_nondet_uint(void);
extern void abort(void);
void assume_abort_if_not(int cond) {
  if(!cond) {abort();}
}
void __VERIFIER_assert(int cond) {
    if (!(cond)) {
    ERROR:
        {reach_error();}
    }
    return;
}
int main() {
  unsigned A, B;
  unsigned q, r, b;
    A = __VERIFIER_nondet_uint();
    B = 1;
    q = 0;
    r = A;
    b = B;
    //@ loop invariant B == 1 && q == 0 && r == A && (b == 1 || b % 2 == 0);
    while (1) {
        if (!(r >= b)) break;
        b = 2 * b;
    }
    //@ loop invariant A == q * b + r && (b == 1 || b % 2 == 0);
    while (1) {
    	//@ assert A == q * b + r;
        __VERIFIER_assert(A == q * b + r);
        if (!(b != B)) break;
        q = 2 * q;
        b = b / 2;
        if (r >= b) {
            q = q + 1;
            r = r - b;
        }
    }
    //@ assert A == q * b + r;
    __VERIFIER_assert(A == q * b + r);
    return 0;
}
