extern void abort(void);

extern void __assert_fail (const char *__assertion, const char *__file,
      unsigned int __line, const char *__function)
     __attribute__ ((__nothrow__ , __leaf__)) __attribute__ ((__noreturn__));
extern void __assert_perror_fail (int __errnum, const char *__file,
      unsigned int __line, const char *__function)
     __attribute__ ((__nothrow__ , __leaf__)) __attribute__ ((__noreturn__));
extern void __assert (const char *__assertion, const char *__file, int __line)
     __attribute__ ((__nothrow__ , __leaf__)) __attribute__ ((__noreturn__));

void reach_error() { ((void) sizeof ((0) ? 1 : 0), __extension__ ({ if (0) ; else __assert_fail ("0", "assert.h", 3, __extension__ __PRETTY_FUNCTION__); })); }
extern void abort(void);
void assume_abort_if_not(int cond) {
  if(!cond) {abort();}
}
void __VERIFIER_assert(int cond) {
  if (!(cond)) {
      ERROR: {reach_error();abort();}
  }
  return;
}
int __VERIFIER_nondet_int();
int main() {
    int x = 0;
    int m = 0;
    int n = __VERIFIER_nondet_int();
    //@ loop invariant (0 <= m < x <= n) || (m == x == 0) || (n <= 0);
    while(x < n) {
 if(__VERIFIER_nondet_int()) {
     m = x;
 }
 x = x + 1;
    }
    //@ assert m >= 0 || n <= 0;
    __VERIFIER_assert((m >= 0 || n <= 0));
    //@ assert m < n || n <= 0;
    __VERIFIER_assert((m < n || n <= 0));
    return 0;
}
