int __VERIFIER_nondet_int();
int main() {
  int n,i,k;
  n = __VERIFIER_nondet_int();
  if (!(n <= 1000000)) return 0;
  k = n;
  i = 0;
  //@ loop_invariant 2 * k + i == 2 * n && (i <= n + 1 || n < 0);
  while( i < n ) {
    k--;
    i = i + 2;
  }
  int j = 0;
  //@ loop_invariant j >= 0 && (n - 1 <= 2 * j + 2 * k && 2 * j + 2 * k <= n || n < 0);
  while( j < n/2 ) {
    //@ assert k > 0; 
    k--;
    j++;
  }
  return 0;
}
