
extern void __assert_fail (const char *__assertion, const char *__file,
      unsigned int __line, const char *__function)
     __attribute__ ((__nothrow__ , __leaf__)) __attribute__ ((__noreturn__));
extern void __assert_perror_fail (int __errnum, const char *__file,
      unsigned int __line, const char *__function)
     __attribute__ ((__nothrow__ , __leaf__)) __attribute__ ((__noreturn__));
extern void __assert (const char *__assertion, const char *__file, int __line)
     __attribute__ ((__nothrow__ , __leaf__)) __attribute__ ((__noreturn__));

void reach_error(void) {((void) sizeof ((0) ? 1 : 0), __extension__ ({ if (0) ; else __assert_fail ("0", "benchmark10_conjunctive.c", 2, __extension__ __PRETTY_FUNCTION__); }));}
extern int __VERIFIER_nondet_int(void);
extern _Bool __VERIFIER_nondet_bool(void);
void __VERIFIER_assert(int cond) {
  if (!cond) {
    reach_error();
  }
}
int main() {
  int i = __VERIFIER_nondet_int();
  int c = __VERIFIER_nondet_int();
  if (!(c==0 && i==0)) return 0;
  //@ loop invariant 2 * c == (i - 1) * i && 0 <= i <= 100;
  while (i<100) {
    c=c+i;
    i=i+1;
    if (i<=0) break;
  }
  //@ assert c >= 0;
  __VERIFIER_assert(c>=0);
  return 0;
}
