extern void abort(void);

extern void __assert_fail (const char *__assertion, const char *__file,
      unsigned int __line, const char *__function)
     __attribute__ ((__nothrow__ , __leaf__)) __attribute__ ((__noreturn__));
extern void __assert_perror_fail (int __errnum, const char *__file,
      unsigned int __line, const char *__function)
     __attribute__ ((__nothrow__ , __leaf__)) __attribute__ ((__noreturn__));
extern void __assert (const char *__assertion, const char *__file, int __line)
     __attribute__ ((__nothrow__ , __leaf__)) __attribute__ ((__noreturn__));

void reach_error() { ((void) sizeof ((0) ? 1 : 0), __extension__ ({ if (0) ; else __assert_fail ("0", "assert.h", 3, __extension__ __PRETTY_FUNCTION__); })); }
extern void abort(void);
void assume_abort_if_not(int cond) {
  if(!cond) {abort();}
}
void __VERIFIER_assert(int cond) {
  if (!(cond)) {
      ERROR: {reach_error();abort();}
  }
  return;
}
int __VERIFIER_nondet_int();
int main() {
    int lo, mid, hi;
    lo = 0;
    mid = __VERIFIER_nondet_int();
    if (!(mid > 0 && mid <= 1000000)) return 0;
    hi = 2*mid;
    //@ loop invariant 2*mid + lo == hi && mid >= 0;
    while (mid > 0) {
        lo = lo + 1;
        hi = hi - 1;
        mid = mid - 1;
    }
    //@ assert lo == hi;
    __VERIFIER_assert(lo == hi);
    return 0;
}
