extern void abort(void);

extern void __assert_fail (const char *__assertion, const char *__file,
      unsigned int __line, const char *__function)
     __attribute__ ((__nothrow__ , __leaf__)) __attribute__ ((__noreturn__));
extern void __assert_perror_fail (int __errnum, const char *__file,
      unsigned int __line, const char *__function)
     __attribute__ ((__nothrow__ , __leaf__)) __attribute__ ((__noreturn__));
extern void __assert (const char *__assertion, const char *__file, int __line)
     __attribute__ ((__nothrow__ , __leaf__)) __attribute__ ((__noreturn__));

void reach_error() { ((void) sizeof ((0) ? 1 : 0), __extension__ ({ if (0) ; else __assert_fail ("0", "terminator_03-2.c", 3, __extension__ __PRETTY_FUNCTION__); })); }
extern void abort(void);
void assume_abort_if_not(int cond) {
  if(!cond) {abort();}
}
void __VERIFIER_assert(int cond) {
  if (!(cond)) {
    ERROR: {reach_error();abort();}
  }
  return;
}
int __VERIFIER_nondet_int();
_Bool __VERIFIER_nondet_bool();
int main() {
    int x=__VERIFIER_nondet_int();
    int y=__VERIFIER_nondet_int();
    if (!(y <= 1000000)) return 0;
    if (y>0) {
        while(x<100) {
            x=x+y;
        }
    }
    //@ assert y <= 0 || (y > 0 && x >= 100);
    __VERIFIER_assert(y<=0 || (y>0 && x>=100));
    return 0;
}
