extern void abort(void);

extern void __assert_fail (const char *__assertion, const char *__file,
      unsigned int __line, const char *__function)
     __attribute__ ((__nothrow__ , __leaf__)) __attribute__ ((__noreturn__));
extern void __assert_perror_fail (int __errnum, const char *__file,
      unsigned int __line, const char *__function)
     __attribute__ ((__nothrow__ , __leaf__)) __attribute__ ((__noreturn__));
extern void __assert (const char *__assertion, const char *__file, int __line)
     __attribute__ ((__nothrow__ , __leaf__)) __attribute__ ((__noreturn__));

void reach_error() { ((void) sizeof ((0) ? 1 : 0), __extension__ ({ if (0) ; else __assert_fail ("0", "assert.h", 3, __extension__ __PRETTY_FUNCTION__); })); }
extern void abort(void);
void assume_abort_if_not(int cond) {
  if(!cond) {abort();}
}
void __VERIFIER_assert(int cond) {
  if (!(cond)) {
    ERROR: {reach_error();abort();}
  }
  return;
}
int __VERIFIER_nondet_int();
int main()
{
  int p;
  int i;
  int leader_len;
  int bufsize;
  int bufsize_0;
  int ielen;
  leader_len = __VERIFIER_nondet_int();
  bufsize = __VERIFIER_nondet_int();
  ielen = __VERIFIER_nondet_int();
  if (!(leader_len < 1000000)) return 0;
  if (!(bufsize < 1000000)) return 0;
  if (!(ielen < 1000000)) return 0;
  if(leader_len >0); else goto END;
  if(bufsize >0); else goto END;
  if(ielen >0); else goto END;
  if (bufsize < leader_len)
    goto END;
  p = 0;
  bufsize_0 = bufsize;
  bufsize -= leader_len;
  p += leader_len;
  if (bufsize < 2*ielen)
    goto END;
  //@ loop invariant 0 <= p == bufsize_0 - bufsize + 2 * i && bufsize >= 2 * ielen;
  for (i = 0; i < ielen && bufsize > 2; i++) {
    //@ assert 0 <= p;
    __VERIFIER_assert(0<=p);
    //@ assert p + 1 < bufsize_0;
    __VERIFIER_assert(p+1<bufsize_0);
    p += 2;
  }
 END:
  ;
}
