extern int __VERIFIER_nondet_int();
extern _Bool __VERIFIER_nondet_bool();

int main() {
  int n = __VERIFIER_nondet_int();
  int i = __VERIFIER_nondet_int();
  int l = __VERIFIER_nondet_int();
  i = l;
  if (!(l>0)) return 0;
  //@ loop_invariant l > 0;
  while (i < n) {
    i++;
  }
  //@ assert l >= 1;
  return 0;
}
