
extern void __assert_fail (const char *__assertion, const char *__file,
      unsigned int __line, const char *__function)
     __attribute__ ((__nothrow__ , __leaf__)) __attribute__ ((__noreturn__));
extern void __assert_perror_fail (int __errnum, const char *__file,
      unsigned int __line, const char *__function)
     __attribute__ ((__nothrow__ , __leaf__)) __attribute__ ((__noreturn__));
extern void __assert (const char *__assertion, const char *__file, int __line)
     __attribute__ ((__nothrow__ , __leaf__)) __attribute__ ((__noreturn__));

void reach_error(void) {((void) sizeof ((0) ? 1 : 0), __extension__ ({ if (0) ; else __assert_fail ("0", "benchmark02_linear.c", 2, __extension__ __PRETTY_FUNCTION__); }));}
extern int __VERIFIER_nondet_int(void);
extern _Bool __VERIFIER_nondet_bool(void);
void __VERIFIER_assert(int cond) {
  if (!cond) {
    reach_error();
  }
}
int main() {
  int n = __VERIFIER_nondet_int();
  int i = __VERIFIER_nondet_int();
  int l = __VERIFIER_nondet_int();
  i = l;
  if (!(l>0)) return 0;
  //@ loop invariant l > 0;
  while (i < n) {
    i++;
  }
  //@ assert l >= 1;
  __VERIFIER_assert(l>=1);
  return 0;
}
