extern void abort(void);

extern void __assert_fail (const char *__assertion, const char *__file,
      unsigned int __line, const char *__function)
     __attribute__ ((__nothrow__ , __leaf__)) __attribute__ ((__noreturn__));
extern void __assert_perror_fail (int __errnum, const char *__file,
      unsigned int __line, const char *__function)
     __attribute__ ((__nothrow__ , __leaf__)) __attribute__ ((__noreturn__));
extern void __assert (const char *__assertion, const char *__file, int __line)
     __attribute__ ((__nothrow__ , __leaf__)) __attribute__ ((__noreturn__));

void reach_error() { ((void) sizeof ((0) ? 1 : 0), __extension__ ({ if (0) ; else __assert_fail ("0", "assert.h", 3, __extension__ __PRETTY_FUNCTION__); })); }
extern void abort(void);
void assume_abort_if_not(int cond) {
  if(!cond) {abort();}
}
void __VERIFIER_assert(int cond) {
  if (!(cond)) {
  ERROR: {reach_error();abort();}
  }
  return;
}
int __VERIFIER_nondet_int();
int main() {
    int i = 0;
    int n = 0;
    int k = __VERIFIER_nondet_int();
    if (!(k <= 1000000 && k >= -1000000)) return 0;
    //@ loop invariant 0 <= i == 2 * n - i % 2 && (k < 0 || i <= 2 * k);
    for(i = 0; i < 2*k; i++) {
 if (i % 2 == 0) {
     n ++;
 }
    }
    //@ assert k < 0 || n == k;
    __VERIFIER_assert(k < 0 || n == k);
    return 0;
}
