30a31
>     //@ loop invariant 0 <= i <= n && n >= 10 && m >= 10 && k == m * i;
31a33
>  //@ loop invariant 0 <= j <= m && 0 <= i < n && n >= 10 && m >= 10 && k == m * i + j;
35a38
>     //@ assert k >= 100;
