extern void abort(void);

extern void __assert_fail (const char *__assertion, const char *__file,
      unsigned int __line, const char *__function)
     __attribute__ ((__nothrow__ , __leaf__)) __attribute__ ((__noreturn__));
extern void __assert_perror_fail (int __errnum, const char *__file,
      unsigned int __line, const char *__function)
     __attribute__ ((__nothrow__ , __leaf__)) __attribute__ ((__noreturn__));
extern void __assert (const char *__assertion, const char *__file, int __line)
     __attribute__ ((__nothrow__ , __leaf__)) __attribute__ ((__noreturn__));

void reach_error() { ((void) sizeof ((0) ? 1 : 0), __extension__ ({ if (0) ; else __assert_fail ("0", "assert.h", 3, __extension__ __PRETTY_FUNCTION__); })); }
extern void abort(void);
void assume_abort_if_not(int cond) {
  if(!cond) {abort();}
}
void __VERIFIER_assert(int cond) {
  if (!(cond)) {
    ERROR: {reach_error();abort();}
  }
  return;
}
int __VERIFIER_nondet_int();
int __BLAST_NONDET;
int main() {
    int i,j,k,n,l,m;
    n = __VERIFIER_nondet_int();
    m = __VERIFIER_nondet_int();
    l = __VERIFIER_nondet_int();
    if (!(-1000000 < n && n < 1000000)) return 0;
    if (!(-1000000 < m && m < 1000000)) return 0;
    if (!(-1000000 < l && l < 1000000)) return 0;
    if(3*n<=m+l); else goto END;
    //@ loop invariant 3 * n <= m + l && i >= 0 && (n < 0 || i <= n);
    for (i=0;i<n;i++)
        //@ loop invariant 3 * n <= m + l && 0 <= i < n && 2 * i <= j <= 3 * i;
        for (j = 2*i;j<3*i;j++)
            //@ loop invariant 3 * n <= m + l && 0 <= i < n && 2 * i <= j < 3 * i && i <= k <= j;
            for (k = i; k< j; k++)
                //@ assert k - i <= 2 * n;
                __VERIFIER_assert( k-i <= 2*n );
END:
    return 0;
}
