37a38
>   //@ loop invariant glob2_p_off == glob2_pathlim_off + 1 || 0 <= glob2_p_off <= glob2_pathlim_off < MAXPATHLEN + 1;
40a42
>     //@ assert 0 <= glob2_p_off;
41a44
>     //@ assert glob2_p_off < MAXPATHLEN + 1;
