<?xml version="1.0" encoding="UTF-8"?>

<!--
This file is part of sv-witnesses repository: https://github.com/sosy-lab/sv-witnesses

SPDX-FileCopyrightText: 2023 Dirk Beyer <https://www.sosy-lab.org>

SPDX-License-Identifier: Apache-2.0
-->

<graphml xmlns="http://graphml.graphdrawing.org/xmlns" xmlns:xsi="http://www.w3.org/2001/XMLSchema-instance" xsi:schemaLocation="http://graphml.graphdrawing.org/xmlns http://graphml.graphdrawing.org/xmlns/1.0/graphml.xsd">
<key id="programfile" attr.name="programfile" for="graph"/>
<key id="programhash" attr.name="programhash" for="graph"/>
<key id="sourcecodelang" attr.name="sourcecodelang" for="graph"/>
<key id="producer" attr.name="producer" for="graph"/>
<key id="specification" attr.name="specification" for="graph"/>
<key id="creationtime" attr.name="creationtime" for="graph"/>
<key id="witness-type" attr.name="witness-type" for="graph"/>
<key id="architecture" attr.name="architecture" for="graph"/>
<key id="entry" attr.name="entry" for="node">
<default>false</default>
</key>
<key id="nodetype" attr.name="nodetype" for="node">
<default>path</default>
</key>
<key id="violation" attr.name="violation" for="node">
<default>false</default>
</key>
<key id="cyclehead" attr.name="cyclehead" for="node">
<default>false</default>
</key>
<key id="invariant" attr.name="invariant" for="node">
<default>true</default>
</key>
<key id="threadId" attr.name="threadId" for="edge"/>
<key id="endline" attr.name="endline" for="edge"/>
<key id="enterLoopHead" attr.name="enterLoopHead" for="edge">
<default>false</default>
</key>
<key id="createThread" attr.name="createThread" for="edge"/>
<key id="enterFunction" attr.name="enterFunction" for="edge"/>
<key id="startline" attr.name="startline" for="edge"/>
<key id="returnFrom" attr.name="returnFrom" for="edge"/>
<key id="assumption" attr.name="assumption" for="edge"/>
<key id="tokens" attr.name="tokens" for="edge"/>
<key id="control" attr.name="control" for="edge"/>
<key id="originfile" attr.name="originfile" for="edge">
<default>termination/Ex02.c</default>
</key>
<key id="sourcecode" attr.name="sourcecode" for="edge"/>
<graph edgedefault="directed">
<data key="programfile">termination/Ex02.c</data>
<data key="programhash">850ff32b6fbf31b3e0c50974692b8ef2c3295b8a6eb6156b8199d8353e1d0435</data>
<data key="sourcecodelang">C</data>
<data key="producer">Automizer</data>
<data key="specification">CHECK( init(main()), LTL(F end) )

</data>
<data key="creationtime">2023-03-03T11:42:03Z</data>
<data key="witness-type">violation_witness</data>
<data key="architecture">32bit</data>
<node id="N1">
<data key="entry">true</data>
</node>
<node id="N2"/>
<node id="N0">
<data key="cyclehead">true</data>
</node>
<node id="N3"/>
<edge id="E0" source="N1" target="N2">
<data key="endline">14</data>
<data key="startline">14</data>
<data key="originfile">termination/Ex02.c</data>
<data key="sourcecode">int i;</data>
</edge>
<edge id="E1" source="N2" target="N0">
<data key="endline">15</data>
<data key="enterLoopHead">true</data>
<data key="startline">15</data>
<data key="originfile">termination/Ex02.c</data>
<data key="sourcecode">i = __VERIFIER_nondet_int()</data>
</edge>
<edge id="E2" source="N0" target="N3">
<data key="endline">17</data>
<data key="startline">17</data>
<data key="control">condition-true</data>
<data key="originfile">termination/Ex02.c</data>
<data key="sourcecode">[i &gt; 0]</data>
</edge>
<edge id="E3" source="N3" target="N0">
<data key="endline">18</data>
<data key="enterLoopHead">true</data>
<data key="startline">18</data>
<data key="control">condition-false</data>
<data key="originfile">termination/Ex02.c</data>
<data key="sourcecode">[!(i != 5)]</data>
</edge>
</graph>
</graphml>
