﻿<!--
This file is part of sv-witnesses repository: https://github.com/sosy-lab/sv-witnesses

SPDX-FileCopyrightText: 2023 Dirk Beyer <https://www.sosy-lab.org>

SPDX-License-Identifier: Apache-2.0
-->

<graphml>
  <graph edgedefault="directed">
    <data key="witness-type">violation_witness</data>
    <data key="sourcecodelang">C</data>
    <data key="producer">HUMAN</data>
    <data key="specification">CHECK( init(main()), LTL(F end) )</data>
    <data key="programfile">program10.c</data>
    <data key="programhash">8e6bfda56fedb3679396ee32ec98e7b030f7f596</data>
    <data key="architecture">32bit</data>
    
    <node id="A0">
      <data key="entry">true</data>
    </node>
    <node id="A1"/>
    <edge source="A0" target="A1">
      <data key="enterFunction">main</data>
      <data key="startline">11</data>
      <data key="endline">11</data>
    </edge>
    <node id="A2"/>
    <edge source="A1" target="A2">
      <data key="control">condition-false</data>
    </edge>
    <node id="sink">
      <data key="sink">true</data>
    </node>
    <edge source="A2" target="sink">
      <data key="control">condition-true</data>
    </edge>
    <node id="A3">
		  <!-- definition where stem ends and (infinite) loop starts -->
      <data key="cyclehead">true</data> 
			<!-- description of recurrent set -->
      <data key="invariant">x&gt;11</data> 
    </node>
    <edge source="A2" target="A3">
       <data key="enterLoopHead">true</data>
    </edge>     
    <node id="A4"/>
    <edge source="A3" target="A4">
      <data key="control">condition-true</data>
      <data key="startline">19</data>
      <data key="endline">19</data>
    </edge>
    <edge source="A3" target="sink">
      <data key="control">condition-false</data>
      <data key="startline">19</data>
      <data key="endline">19</data>
    </edge>
    <node id="A5"/>    
    <edge source="A4" target="A5">
      <data key="startline">21</data>
      <data key="endline">21</data>
			<!-- restrict value of nondeterministic function, if not given assume that loop nonterminates for any returned value -->
      <data key="assumption">x=12</data> 
    </edge>
    <node id="A6"/>
		<!-- if branch in while loop not part of the infinite execution -->
    <edge source="A5" target="sink">
      <data key="control">condition-true</data>
      <data key="startline">23</data>
      <data key="endline">23</data>
    </edge>
    <edge source="A5" target="A6">
      <data key="control">condition-false</data>
      <data key="startline">23</data>
      <data key="endline">23</data>
    </edge>
    <node id="A7">
		  <!-- program loop invariant -->
      <data key="invariant">y>=0</data>
    </node>
    <edge source="A6" target="A7">
       <data key="enterLoopHead">true</data>    
    </edge>
    <node id="A8"/>
    <edge source="A7" target="A8">
      <data key="control">condition-true</data>
      <data key="startline">27</data>
      <data key="endline">27</data>
    </edge>
    <edge source="A8" target="A7">
       <data key="enterLoopHead">true</data>
    </edge>
    <node id="A9"/>
    <edge source="A7" target="A9">
      <data key="control">condition-false</data>
      <data key="startline">27</data>
      <data key="endline">27</data>
    </edge>
    <edge source="A9" target="A3">
       <data key="enterLoopHead">true</data>
    </edge>
  </graph>
</graphml>  
