// This file is part of the SV-Benchmarks collection of verification tasks:
// https://gitlab.com/sosy-lab/benchmarking/sv-benchmarks
//
// SPDX-FileCopyrightText: 2023 Edoardo Manino
//
// SPDX-License-Identifier: MIT

float __VERIFIER_nondet_float();
extern void __assert_fail (const char *__assertion, const char *__file,
      unsigned int __line, const char *__function)
     __attribute__ ((__nothrow__ , __leaf__)) __attribute__ ((__noreturn__));
extern void __assert_perror_fail (int __errnum, const char *__file,
      unsigned int __line, const char *__function)
     __attribute__ ((__nothrow__ , __leaf__)) __attribute__ ((__noreturn__));
extern void __assert (const char *__assertion, const char *__file, int __line)
     __attribute__ ((__nothrow__ , __leaf__)) __attribute__ ((__noreturn__));

void reach_error() {
 ((void) sizeof ((0) ? 1 : 0), __extension__ ({ if (0) ; else __assert_fail ("0", "main.c", 4, __extension__ __PRETTY_FUNCTION__); }));
}
typedef unsigned int size_t;
typedef long int wchar_t;

typedef struct
  {
    int quot;
    int rem;
  } div_t;
typedef struct
  {
    long int quot;
    long int rem;
  } ldiv_t;
__extension__ typedef struct
  {
    long long int quot;
    long long int rem;
  } lldiv_t;
extern size_t __ctype_get_mb_cur_max (void) __attribute__ ((__nothrow__ , __leaf__)) ;
extern double atof (const char *__nptr)
     __attribute__ ((__nothrow__ , __leaf__)) __attribute__ ((__pure__)) __attribute__ ((__nonnull__ (1))) ;
extern int atoi (const char *__nptr)
     __attribute__ ((__nothrow__ , __leaf__)) __attribute__ ((__pure__)) __attribute__ ((__nonnull__ (1))) ;
extern long int atol (const char *__nptr)
     __attribute__ ((__nothrow__ , __leaf__)) __attribute__ ((__pure__)) __attribute__ ((__nonnull__ (1))) ;
__extension__ extern long long int atoll (const char *__nptr)
     __attribute__ ((__nothrow__ , __leaf__)) __attribute__ ((__pure__)) __attribute__ ((__nonnull__ (1))) ;
extern double strtod (const char *__restrict __nptr,
        char **__restrict __endptr)
     __attribute__ ((__nothrow__ , __leaf__)) __attribute__ ((__nonnull__ (1)));
extern float strtof (const char *__restrict __nptr,
       char **__restrict __endptr) __attribute__ ((__nothrow__ , __leaf__)) __attribute__ ((__nonnull__ (1)));
extern long double strtold (const char *__restrict __nptr,
       char **__restrict __endptr)
     __attribute__ ((__nothrow__ , __leaf__)) __attribute__ ((__nonnull__ (1)));
extern long int strtol (const char *__restrict __nptr,
   char **__restrict __endptr, int __base)
     __attribute__ ((__nothrow__ , __leaf__)) __attribute__ ((__nonnull__ (1)));
extern unsigned long int strtoul (const char *__restrict __nptr,
      char **__restrict __endptr, int __base)
     __attribute__ ((__nothrow__ , __leaf__)) __attribute__ ((__nonnull__ (1)));
__extension__
extern long long int strtoq (const char *__restrict __nptr,
        char **__restrict __endptr, int __base)
     __attribute__ ((__nothrow__ , __leaf__)) __attribute__ ((__nonnull__ (1)));
__extension__
extern unsigned long long int strtouq (const char *__restrict __nptr,
           char **__restrict __endptr, int __base)
     __attribute__ ((__nothrow__ , __leaf__)) __attribute__ ((__nonnull__ (1)));
__extension__
extern long long int strtoll (const char *__restrict __nptr,
         char **__restrict __endptr, int __base)
     __attribute__ ((__nothrow__ , __leaf__)) __attribute__ ((__nonnull__ (1)));
__extension__
extern unsigned long long int strtoull (const char *__restrict __nptr,
     char **__restrict __endptr, int __base)
     __attribute__ ((__nothrow__ , __leaf__)) __attribute__ ((__nonnull__ (1)));
extern char *l64a (long int __n) __attribute__ ((__nothrow__ , __leaf__)) ;
extern long int a64l (const char *__s)
     __attribute__ ((__nothrow__ , __leaf__)) __attribute__ ((__pure__)) __attribute__ ((__nonnull__ (1))) ;

typedef unsigned char __u_char;
typedef unsigned short int __u_short;
typedef unsigned int __u_int;
typedef unsigned long int __u_long;
typedef signed char __int8_t;
typedef unsigned char __uint8_t;
typedef signed short int __int16_t;
typedef unsigned short int __uint16_t;
typedef signed int __int32_t;
typedef unsigned int __uint32_t;
__extension__ typedef signed long long int __int64_t;
__extension__ typedef unsigned long long int __uint64_t;
typedef __int8_t __int_least8_t;
typedef __uint8_t __uint_least8_t;
typedef __int16_t __int_least16_t;
typedef __uint16_t __uint_least16_t;
typedef __int32_t __int_least32_t;
typedef __uint32_t __uint_least32_t;
typedef __int64_t __int_least64_t;
typedef __uint64_t __uint_least64_t;
__extension__ typedef long long int __quad_t;
__extension__ typedef unsigned long long int __u_quad_t;
__extension__ typedef long long int __intmax_t;
__extension__ typedef unsigned long long int __uintmax_t;
__extension__ typedef __uint64_t __dev_t;
__extension__ typedef unsigned int __uid_t;
__extension__ typedef unsigned int __gid_t;
__extension__ typedef unsigned long int __ino_t;
__extension__ typedef __uint64_t __ino64_t;
__extension__ typedef unsigned int __mode_t;
__extension__ typedef unsigned int __nlink_t;
__extension__ typedef long int __off_t;
__extension__ typedef __int64_t __off64_t;
__extension__ typedef int __pid_t;
__extension__ typedef struct { int __val[2]; } __fsid_t;
__extension__ typedef long int __clock_t;
__extension__ typedef unsigned long int __rlim_t;
__extension__ typedef __uint64_t __rlim64_t;
__extension__ typedef unsigned int __id_t;
__extension__ typedef long int __time_t;
__extension__ typedef unsigned int __useconds_t;
__extension__ typedef long int __suseconds_t;
__extension__ typedef __int64_t __suseconds64_t;
__extension__ typedef int __daddr_t;
__extension__ typedef int __key_t;
__extension__ typedef int __clockid_t;
__extension__ typedef void * __timer_t;
__extension__ typedef long int __blksize_t;
__extension__ typedef long int __blkcnt_t;
__extension__ typedef __int64_t __blkcnt64_t;
__extension__ typedef unsigned long int __fsblkcnt_t;
__extension__ typedef __uint64_t __fsblkcnt64_t;
__extension__ typedef unsigned long int __fsfilcnt_t;
__extension__ typedef __uint64_t __fsfilcnt64_t;
__extension__ typedef int __fsword_t;
__extension__ typedef int __ssize_t;
__extension__ typedef long int __syscall_slong_t;
__extension__ typedef unsigned long int __syscall_ulong_t;
typedef __off64_t __loff_t;
typedef char *__caddr_t;
__extension__ typedef int __intptr_t;
__extension__ typedef unsigned int __socklen_t;
typedef int __sig_atomic_t;
__extension__ typedef __int64_t __time64_t;
typedef __u_char u_char;
typedef __u_short u_short;
typedef __u_int u_int;
typedef __u_long u_long;
typedef __quad_t quad_t;
typedef __u_quad_t u_quad_t;
typedef __fsid_t fsid_t;
typedef __loff_t loff_t;
typedef __ino_t ino_t;
typedef __dev_t dev_t;
typedef __gid_t gid_t;
typedef __mode_t mode_t;
typedef __nlink_t nlink_t;
typedef __uid_t uid_t;
typedef __off_t off_t;
typedef __pid_t pid_t;
typedef __id_t id_t;
typedef __ssize_t ssize_t;
typedef __daddr_t daddr_t;
typedef __caddr_t caddr_t;
typedef __key_t key_t;
typedef __clock_t clock_t;
typedef __clockid_t clockid_t;
typedef __time_t time_t;
typedef __timer_t timer_t;
typedef unsigned long int ulong;
typedef unsigned short int ushort;
typedef unsigned int uint;
typedef __int8_t int8_t;
typedef __int16_t int16_t;
typedef __int32_t int32_t;
typedef __int64_t int64_t;
typedef __uint8_t u_int8_t;
typedef __uint16_t u_int16_t;
typedef __uint32_t u_int32_t;
typedef __uint64_t u_int64_t;
typedef int register_t __attribute__ ((__mode__ (__word__)));
static __inline __uint16_t
__bswap_16 (__uint16_t __bsx)
{
  return __builtin_bswap16 (__bsx);
}
static __inline __uint32_t
__bswap_32 (__uint32_t __bsx)
{
  return __builtin_bswap32 (__bsx);
}
__extension__ static __inline __uint64_t
__bswap_64 (__uint64_t __bsx)
{
  return __builtin_bswap64 (__bsx);
}
static __inline __uint16_t
__uint16_identity (__uint16_t __x)
{
  return __x;
}
static __inline __uint32_t
__uint32_identity (__uint32_t __x)
{
  return __x;
}
static __inline __uint64_t
__uint64_identity (__uint64_t __x)
{
  return __x;
}
typedef struct
{
  unsigned long int __val[(1024 / (8 * sizeof (unsigned long int)))];
} __sigset_t;
typedef __sigset_t sigset_t;
struct timeval
{
  __time_t tv_sec;
  __suseconds_t tv_usec;
};
struct timespec
{
  __time_t tv_sec;
  __syscall_slong_t tv_nsec;
};
typedef __suseconds_t suseconds_t;
typedef long int __fd_mask;
typedef struct
  {
    __fd_mask __fds_bits[1024 / (8 * (int) sizeof (__fd_mask))];
  } fd_set;
typedef __fd_mask fd_mask;

extern int select (int __nfds, fd_set *__restrict __readfds,
     fd_set *__restrict __writefds,
     fd_set *__restrict __exceptfds,
     struct timeval *__restrict __timeout);
extern int pselect (int __nfds, fd_set *__restrict __readfds,
      fd_set *__restrict __writefds,
      fd_set *__restrict __exceptfds,
      const struct timespec *__restrict __timeout,
      const __sigset_t *__restrict __sigmask);

typedef __blksize_t blksize_t;
typedef __blkcnt_t blkcnt_t;
typedef __fsblkcnt_t fsblkcnt_t;
typedef __fsfilcnt_t fsfilcnt_t;
typedef union
{
  __extension__ unsigned long long int __value64;
  struct
  {
    unsigned int __low;
    unsigned int __high;
  } __value32;
} __atomic_wide_counter;
typedef struct __pthread_internal_list
{
  struct __pthread_internal_list *__prev;
  struct __pthread_internal_list *__next;
} __pthread_list_t;
typedef struct __pthread_internal_slist
{
  struct __pthread_internal_slist *__next;
} __pthread_slist_t;
struct __pthread_mutex_s
{
  int __lock;
  unsigned int __count;
  int __owner;
  int __kind;
  unsigned int __nusers;
  __extension__ union
  {
    struct
    {
      short __espins;
      short __eelision;
    } __elision_data;
    __pthread_slist_t __list;
  };
};
struct __pthread_rwlock_arch_t
{
  unsigned int __readers;
  unsigned int __writers;
  unsigned int __wrphase_futex;
  unsigned int __writers_futex;
  unsigned int __pad3;
  unsigned int __pad4;
  unsigned char __flags;
  unsigned char __shared;
  signed char __rwelision;
  unsigned char __pad2;
  int __cur_writer;
};
struct __pthread_cond_s
{
  __atomic_wide_counter __wseq;
  __atomic_wide_counter __g1_start;
  unsigned int __g_refs[2] ;
  unsigned int __g_size[2];
  unsigned int __g1_orig_size;
  unsigned int __wrefs;
  unsigned int __g_signals[2];
};
typedef unsigned int __tss_t;
typedef unsigned long int __thrd_t;
typedef struct
{
  int __data ;
} __once_flag;
typedef unsigned long int pthread_t;
typedef union
{
  char __size[4];
  int __align;
} pthread_mutexattr_t;
typedef union
{
  char __size[4];
  int __align;
} pthread_condattr_t;
typedef unsigned int pthread_key_t;
typedef int pthread_once_t;
union pthread_attr_t
{
  char __size[36];
  long int __align;
};
typedef union pthread_attr_t pthread_attr_t;
typedef union
{
  struct __pthread_mutex_s __data;
  char __size[24];
  long int __align;
} pthread_mutex_t;
typedef union
{
  struct __pthread_cond_s __data;
  char __size[48];
  __extension__ long long int __align;
} pthread_cond_t;
typedef union
{
  struct __pthread_rwlock_arch_t __data;
  char __size[32];
  long int __align;
} pthread_rwlock_t;
typedef union
{
  char __size[8];
  long int __align;
} pthread_rwlockattr_t;
typedef volatile int pthread_spinlock_t;
typedef union
{
  char __size[20];
  long int __align;
} pthread_barrier_t;
typedef union
{
  char __size[4];
  int __align;
} pthread_barrierattr_t;

extern long int random (void) __attribute__ ((__nothrow__ , __leaf__));
extern void srandom (unsigned int __seed) __attribute__ ((__nothrow__ , __leaf__));
extern char *initstate (unsigned int __seed, char *__statebuf,
   size_t __statelen) __attribute__ ((__nothrow__ , __leaf__)) __attribute__ ((__nonnull__ (2)));
extern char *setstate (char *__statebuf) __attribute__ ((__nothrow__ , __leaf__)) __attribute__ ((__nonnull__ (1)));
struct random_data
  {
    int32_t *fptr;
    int32_t *rptr;
    int32_t *state;
    int rand_type;
    int rand_deg;
    int rand_sep;
    int32_t *end_ptr;
  };
extern int random_r (struct random_data *__restrict __buf,
       int32_t *__restrict __result) __attribute__ ((__nothrow__ , __leaf__)) __attribute__ ((__nonnull__ (1, 2)));
extern int srandom_r (unsigned int __seed, struct random_data *__buf)
     __attribute__ ((__nothrow__ , __leaf__)) __attribute__ ((__nonnull__ (2)));
extern int initstate_r (unsigned int __seed, char *__restrict __statebuf,
   size_t __statelen,
   struct random_data *__restrict __buf)
     __attribute__ ((__nothrow__ , __leaf__)) __attribute__ ((__nonnull__ (2, 4)));
extern int setstate_r (char *__restrict __statebuf,
         struct random_data *__restrict __buf)
     __attribute__ ((__nothrow__ , __leaf__)) __attribute__ ((__nonnull__ (1, 2)));
extern int rand (void) __attribute__ ((__nothrow__ , __leaf__));
extern void srand (unsigned int __seed) __attribute__ ((__nothrow__ , __leaf__));
extern int rand_r (unsigned int *__seed) __attribute__ ((__nothrow__ , __leaf__));
extern double drand48 (void) __attribute__ ((__nothrow__ , __leaf__));
extern double erand48 (unsigned short int __xsubi[3]) __attribute__ ((__nothrow__ , __leaf__)) __attribute__ ((__nonnull__ (1)));
extern long int lrand48 (void) __attribute__ ((__nothrow__ , __leaf__));
extern long int nrand48 (unsigned short int __xsubi[3])
     __attribute__ ((__nothrow__ , __leaf__)) __attribute__ ((__nonnull__ (1)));
extern long int mrand48 (void) __attribute__ ((__nothrow__ , __leaf__));
extern long int jrand48 (unsigned short int __xsubi[3])
     __attribute__ ((__nothrow__ , __leaf__)) __attribute__ ((__nonnull__ (1)));
extern void srand48 (long int __seedval) __attribute__ ((__nothrow__ , __leaf__));
extern unsigned short int *seed48 (unsigned short int __seed16v[3])
     __attribute__ ((__nothrow__ , __leaf__)) __attribute__ ((__nonnull__ (1)));
extern void lcong48 (unsigned short int __param[7]) __attribute__ ((__nothrow__ , __leaf__)) __attribute__ ((__nonnull__ (1)));
struct drand48_data
  {
    unsigned short int __x[3];
    unsigned short int __old_x[3];
    unsigned short int __c;
    unsigned short int __init;
    __extension__ unsigned long long int __a;
  };
extern int drand48_r (struct drand48_data *__restrict __buffer,
        double *__restrict __result) __attribute__ ((__nothrow__ , __leaf__)) __attribute__ ((__nonnull__ (1, 2)));
extern int erand48_r (unsigned short int __xsubi[3],
        struct drand48_data *__restrict __buffer,
        double *__restrict __result) __attribute__ ((__nothrow__ , __leaf__)) __attribute__ ((__nonnull__ (1, 2)));
extern int lrand48_r (struct drand48_data *__restrict __buffer,
        long int *__restrict __result)
     __attribute__ ((__nothrow__ , __leaf__)) __attribute__ ((__nonnull__ (1, 2)));
extern int nrand48_r (unsigned short int __xsubi[3],
        struct drand48_data *__restrict __buffer,
        long int *__restrict __result)
     __attribute__ ((__nothrow__ , __leaf__)) __attribute__ ((__nonnull__ (1, 2)));
extern int mrand48_r (struct drand48_data *__restrict __buffer,
        long int *__restrict __result)
     __attribute__ ((__nothrow__ , __leaf__)) __attribute__ ((__nonnull__ (1, 2)));
extern int jrand48_r (unsigned short int __xsubi[3],
        struct drand48_data *__restrict __buffer,
        long int *__restrict __result)
     __attribute__ ((__nothrow__ , __leaf__)) __attribute__ ((__nonnull__ (1, 2)));
extern int srand48_r (long int __seedval, struct drand48_data *__buffer)
     __attribute__ ((__nothrow__ , __leaf__)) __attribute__ ((__nonnull__ (2)));
extern int seed48_r (unsigned short int __seed16v[3],
       struct drand48_data *__buffer) __attribute__ ((__nothrow__ , __leaf__)) __attribute__ ((__nonnull__ (1, 2)));
extern int lcong48_r (unsigned short int __param[7],
        struct drand48_data *__buffer)
     __attribute__ ((__nothrow__ , __leaf__)) __attribute__ ((__nonnull__ (1, 2)));
extern void *malloc (size_t __size) __attribute__ ((__nothrow__ , __leaf__)) __attribute__ ((__malloc__))
     __attribute__ ((__alloc_size__ (1))) ;
extern void *calloc (size_t __nmemb, size_t __size)
     __attribute__ ((__nothrow__ , __leaf__)) __attribute__ ((__malloc__)) __attribute__ ((__alloc_size__ (1, 2))) ;
extern void *realloc (void *__ptr, size_t __size)
     __attribute__ ((__nothrow__ , __leaf__)) __attribute__ ((__warn_unused_result__)) __attribute__ ((__alloc_size__ (2)));
extern void free (void *__ptr) __attribute__ ((__nothrow__ , __leaf__));
extern void *reallocarray (void *__ptr, size_t __nmemb, size_t __size)
     __attribute__ ((__nothrow__ , __leaf__)) __attribute__ ((__warn_unused_result__))
     __attribute__ ((__alloc_size__ (2, 3)))
     ;
extern void *reallocarray (void *__ptr, size_t __nmemb, size_t __size)
     ;

extern void *alloca (size_t __size) __attribute__ ((__nothrow__ , __leaf__));

extern void *valloc (size_t __size) __attribute__ ((__nothrow__ , __leaf__)) __attribute__ ((__malloc__))
     __attribute__ ((__alloc_size__ (1))) ;
extern int posix_memalign (void **__memptr, size_t __alignment, size_t __size)
     __attribute__ ((__nothrow__ , __leaf__)) __attribute__ ((__nonnull__ (1))) ;
extern void *aligned_alloc (size_t __alignment, size_t __size)
     __attribute__ ((__nothrow__ , __leaf__)) __attribute__ ((__malloc__)) __attribute__ ((__alloc_align__ (1)))
     __attribute__ ((__alloc_size__ (2))) ;
extern void abort (void) __attribute__ ((__nothrow__ , __leaf__)) __attribute__ ((__noreturn__));
extern int atexit (void (*__func) (void)) __attribute__ ((__nothrow__ , __leaf__)) __attribute__ ((__nonnull__ (1)));
extern int at_quick_exit (void (*__func) (void)) __attribute__ ((__nothrow__ , __leaf__)) __attribute__ ((__nonnull__ (1)));
extern int on_exit (void (*__func) (int __status, void *__arg), void *__arg)
     __attribute__ ((__nothrow__ , __leaf__)) __attribute__ ((__nonnull__ (1)));
extern void exit (int __status) __attribute__ ((__nothrow__ , __leaf__)) __attribute__ ((__noreturn__));
extern void quick_exit (int __status) __attribute__ ((__nothrow__ , __leaf__)) __attribute__ ((__noreturn__));
extern void _Exit (int __status) __attribute__ ((__nothrow__ , __leaf__)) __attribute__ ((__noreturn__));
extern char *getenv (const char *__name) __attribute__ ((__nothrow__ , __leaf__)) __attribute__ ((__nonnull__ (1))) ;
extern int putenv (char *__string) __attribute__ ((__nothrow__ , __leaf__)) __attribute__ ((__nonnull__ (1)));
extern int setenv (const char *__name, const char *__value, int __replace)
     __attribute__ ((__nothrow__ , __leaf__)) __attribute__ ((__nonnull__ (2)));
extern int unsetenv (const char *__name) __attribute__ ((__nothrow__ , __leaf__)) __attribute__ ((__nonnull__ (1)));
extern int clearenv (void) __attribute__ ((__nothrow__ , __leaf__));
extern char *mktemp (char *__template) __attribute__ ((__nothrow__ , __leaf__)) __attribute__ ((__nonnull__ (1)));
extern int mkstemp (char *__template) __attribute__ ((__nonnull__ (1))) ;
extern int mkstemps (char *__template, int __suffixlen) __attribute__ ((__nonnull__ (1))) ;
extern char *mkdtemp (char *__template) __attribute__ ((__nothrow__ , __leaf__)) __attribute__ ((__nonnull__ (1))) ;
extern int system (const char *__command) ;
extern char *realpath (const char *__restrict __name,
         char *__restrict __resolved) __attribute__ ((__nothrow__ , __leaf__)) ;
typedef int (*__compar_fn_t) (const void *, const void *);
extern void *bsearch (const void *__key, const void *__base,
        size_t __nmemb, size_t __size, __compar_fn_t __compar)
     __attribute__ ((__nonnull__ (1, 2, 5))) ;
extern void qsort (void *__base, size_t __nmemb, size_t __size,
     __compar_fn_t __compar) __attribute__ ((__nonnull__ (1, 4)));
extern int abs (int __x) __attribute__ ((__nothrow__ , __leaf__)) __attribute__ ((__const__)) ;
extern long int labs (long int __x) __attribute__ ((__nothrow__ , __leaf__)) __attribute__ ((__const__)) ;
__extension__ extern long long int llabs (long long int __x)
     __attribute__ ((__nothrow__ , __leaf__)) __attribute__ ((__const__)) ;
extern div_t div (int __numer, int __denom)
     __attribute__ ((__nothrow__ , __leaf__)) __attribute__ ((__const__)) ;
extern ldiv_t ldiv (long int __numer, long int __denom)
     __attribute__ ((__nothrow__ , __leaf__)) __attribute__ ((__const__)) ;
__extension__ extern lldiv_t lldiv (long long int __numer,
        long long int __denom)
     __attribute__ ((__nothrow__ , __leaf__)) __attribute__ ((__const__)) ;
extern char *ecvt (double __value, int __ndigit, int *__restrict __decpt,
     int *__restrict __sign) __attribute__ ((__nothrow__ , __leaf__)) __attribute__ ((__nonnull__ (3, 4))) ;
extern char *fcvt (double __value, int __ndigit, int *__restrict __decpt,
     int *__restrict __sign) __attribute__ ((__nothrow__ , __leaf__)) __attribute__ ((__nonnull__ (3, 4))) ;
extern char *gcvt (double __value, int __ndigit, char *__buf)
     __attribute__ ((__nothrow__ , __leaf__)) __attribute__ ((__nonnull__ (3))) ;
extern char *qecvt (long double __value, int __ndigit,
      int *__restrict __decpt, int *__restrict __sign)
     __attribute__ ((__nothrow__ , __leaf__)) __attribute__ ((__nonnull__ (3, 4))) ;
extern char *qfcvt (long double __value, int __ndigit,
      int *__restrict __decpt, int *__restrict __sign)
     __attribute__ ((__nothrow__ , __leaf__)) __attribute__ ((__nonnull__ (3, 4))) ;
extern char *qgcvt (long double __value, int __ndigit, char *__buf)
     __attribute__ ((__nothrow__ , __leaf__)) __attribute__ ((__nonnull__ (3))) ;
extern int ecvt_r (double __value, int __ndigit, int *__restrict __decpt,
     int *__restrict __sign, char *__restrict __buf,
     size_t __len) __attribute__ ((__nothrow__ , __leaf__)) __attribute__ ((__nonnull__ (3, 4, 5)));
extern int fcvt_r (double __value, int __ndigit, int *__restrict __decpt,
     int *__restrict __sign, char *__restrict __buf,
     size_t __len) __attribute__ ((__nothrow__ , __leaf__)) __attribute__ ((__nonnull__ (3, 4, 5)));
extern int qecvt_r (long double __value, int __ndigit,
      int *__restrict __decpt, int *__restrict __sign,
      char *__restrict __buf, size_t __len)
     __attribute__ ((__nothrow__ , __leaf__)) __attribute__ ((__nonnull__ (3, 4, 5)));
extern int qfcvt_r (long double __value, int __ndigit,
      int *__restrict __decpt, int *__restrict __sign,
      char *__restrict __buf, size_t __len)
     __attribute__ ((__nothrow__ , __leaf__)) __attribute__ ((__nonnull__ (3, 4, 5)));
extern int mblen (const char *__s, size_t __n) __attribute__ ((__nothrow__ , __leaf__));
extern int mbtowc (wchar_t *__restrict __pwc,
     const char *__restrict __s, size_t __n) __attribute__ ((__nothrow__ , __leaf__));
extern int wctomb (char *__s, wchar_t __wchar) __attribute__ ((__nothrow__ , __leaf__));
extern size_t mbstowcs (wchar_t *__restrict __pwcs,
   const char *__restrict __s, size_t __n) __attribute__ ((__nothrow__ , __leaf__))
    __attribute__ ((__access__ (__read_only__, 2)));
extern size_t wcstombs (char *__restrict __s,
   const wchar_t *__restrict __pwcs, size_t __n)
     __attribute__ ((__nothrow__ , __leaf__))
  __attribute__ ((__access__ (__write_only__, 1, 3)))
  __attribute__ ((__access__ (__read_only__, 2)));
extern int rpmatch (const char *__response) __attribute__ ((__nothrow__ , __leaf__)) __attribute__ ((__nonnull__ (1))) ;
extern int getsubopt (char **__restrict __optionp,
        char *const *__restrict __tokens,
        char **__restrict __valuep)
     __attribute__ ((__nothrow__ , __leaf__)) __attribute__ ((__nonnull__ (1, 2, 3))) ;
extern int getloadavg (double __loadavg[], int __nelem)
     __attribute__ ((__nothrow__ , __leaf__)) __attribute__ ((__nonnull__ (1)));


typedef long double float_t;
typedef long double double_t;
extern int __fpclassify (double __value) __attribute__ ((__nothrow__ , __leaf__))
     __attribute__ ((__const__));
extern int __signbit (double __value) __attribute__ ((__nothrow__ , __leaf__))
     __attribute__ ((__const__));
extern int __isinf (double __value) __attribute__ ((__nothrow__ , __leaf__))
  __attribute__ ((__const__));
extern int __finite (double __value) __attribute__ ((__nothrow__ , __leaf__))
  __attribute__ ((__const__));
extern int __isnan (double __value) __attribute__ ((__nothrow__ , __leaf__))
  __attribute__ ((__const__));
extern int __iseqsig (double __x, double __y) __attribute__ ((__nothrow__ , __leaf__));
extern int __issignaling (double __value) __attribute__ ((__nothrow__ , __leaf__))
     __attribute__ ((__const__));
 extern double acos (double __x) __attribute__ ((__nothrow__ , __leaf__)); extern double __acos (double __x) __attribute__ ((__nothrow__ , __leaf__));
 extern double asin (double __x) __attribute__ ((__nothrow__ , __leaf__)); extern double __asin (double __x) __attribute__ ((__nothrow__ , __leaf__));
 extern double atan (double __x) __attribute__ ((__nothrow__ , __leaf__)); extern double __atan (double __x) __attribute__ ((__nothrow__ , __leaf__));
 extern double atan2 (double __y, double __x) __attribute__ ((__nothrow__ , __leaf__)); extern double __atan2 (double __y, double __x) __attribute__ ((__nothrow__ , __leaf__));
 extern double cos (double __x) __attribute__ ((__nothrow__ , __leaf__)); extern double __cos (double __x) __attribute__ ((__nothrow__ , __leaf__));
 extern double sin (double __x) __attribute__ ((__nothrow__ , __leaf__)); extern double __sin (double __x) __attribute__ ((__nothrow__ , __leaf__));
 extern double tan (double __x) __attribute__ ((__nothrow__ , __leaf__)); extern double __tan (double __x) __attribute__ ((__nothrow__ , __leaf__));
 extern double cosh (double __x) __attribute__ ((__nothrow__ , __leaf__)); extern double __cosh (double __x) __attribute__ ((__nothrow__ , __leaf__));
 extern double sinh (double __x) __attribute__ ((__nothrow__ , __leaf__)); extern double __sinh (double __x) __attribute__ ((__nothrow__ , __leaf__));
 extern double tanh (double __x) __attribute__ ((__nothrow__ , __leaf__)); extern double __tanh (double __x) __attribute__ ((__nothrow__ , __leaf__));
 extern double acosh (double __x) __attribute__ ((__nothrow__ , __leaf__)); extern double __acosh (double __x) __attribute__ ((__nothrow__ , __leaf__));
 extern double asinh (double __x) __attribute__ ((__nothrow__ , __leaf__)); extern double __asinh (double __x) __attribute__ ((__nothrow__ , __leaf__));
 extern double atanh (double __x) __attribute__ ((__nothrow__ , __leaf__)); extern double __atanh (double __x) __attribute__ ((__nothrow__ , __leaf__));
 extern double exp (double __x) __attribute__ ((__nothrow__ , __leaf__)); extern double __exp (double __x) __attribute__ ((__nothrow__ , __leaf__));
extern double frexp (double __x, int *__exponent) __attribute__ ((__nothrow__ , __leaf__)); extern double __frexp (double __x, int *__exponent) __attribute__ ((__nothrow__ , __leaf__));
extern double ldexp (double __x, int __exponent) __attribute__ ((__nothrow__ , __leaf__)); extern double __ldexp (double __x, int __exponent) __attribute__ ((__nothrow__ , __leaf__));
 extern double log (double __x) __attribute__ ((__nothrow__ , __leaf__)); extern double __log (double __x) __attribute__ ((__nothrow__ , __leaf__));
 extern double log10 (double __x) __attribute__ ((__nothrow__ , __leaf__)); extern double __log10 (double __x) __attribute__ ((__nothrow__ , __leaf__));
extern double modf (double __x, double *__iptr) __attribute__ ((__nothrow__ , __leaf__)); extern double __modf (double __x, double *__iptr) __attribute__ ((__nothrow__ , __leaf__)) __attribute__ ((__nonnull__ (2)));
 extern double expm1 (double __x) __attribute__ ((__nothrow__ , __leaf__)); extern double __expm1 (double __x) __attribute__ ((__nothrow__ , __leaf__));
 extern double log1p (double __x) __attribute__ ((__nothrow__ , __leaf__)); extern double __log1p (double __x) __attribute__ ((__nothrow__ , __leaf__));
extern double logb (double __x) __attribute__ ((__nothrow__ , __leaf__)); extern double __logb (double __x) __attribute__ ((__nothrow__ , __leaf__));
 extern double exp2 (double __x) __attribute__ ((__nothrow__ , __leaf__)); extern double __exp2 (double __x) __attribute__ ((__nothrow__ , __leaf__));
 extern double log2 (double __x) __attribute__ ((__nothrow__ , __leaf__)); extern double __log2 (double __x) __attribute__ ((__nothrow__ , __leaf__));
 extern double pow (double __x, double __y) __attribute__ ((__nothrow__ , __leaf__)); extern double __pow (double __x, double __y) __attribute__ ((__nothrow__ , __leaf__));
extern double sqrt (double __x) __attribute__ ((__nothrow__ , __leaf__)); extern double __sqrt (double __x) __attribute__ ((__nothrow__ , __leaf__));
 extern double hypot (double __x, double __y) __attribute__ ((__nothrow__ , __leaf__)); extern double __hypot (double __x, double __y) __attribute__ ((__nothrow__ , __leaf__));
 extern double cbrt (double __x) __attribute__ ((__nothrow__ , __leaf__)); extern double __cbrt (double __x) __attribute__ ((__nothrow__ , __leaf__));
extern double ceil (double __x) __attribute__ ((__nothrow__ , __leaf__)) __attribute__ ((__const__)); extern double __ceil (double __x) __attribute__ ((__nothrow__ , __leaf__)) __attribute__ ((__const__));
extern double fabs (double __x) __attribute__ ((__nothrow__ , __leaf__)) __attribute__ ((__const__)); extern double __fabs (double __x) __attribute__ ((__nothrow__ , __leaf__)) __attribute__ ((__const__));
extern double floor (double __x) __attribute__ ((__nothrow__ , __leaf__)) __attribute__ ((__const__)); extern double __floor (double __x) __attribute__ ((__nothrow__ , __leaf__)) __attribute__ ((__const__));
extern double fmod (double __x, double __y) __attribute__ ((__nothrow__ , __leaf__)); extern double __fmod (double __x, double __y) __attribute__ ((__nothrow__ , __leaf__));
extern int isinf (double __value) __attribute__ ((__nothrow__ , __leaf__))
  __attribute__ ((__const__));
extern int finite (double __value) __attribute__ ((__nothrow__ , __leaf__))
  __attribute__ ((__const__));
extern double drem (double __x, double __y) __attribute__ ((__nothrow__ , __leaf__)); extern double __drem (double __x, double __y) __attribute__ ((__nothrow__ , __leaf__));
extern double significand (double __x) __attribute__ ((__nothrow__ , __leaf__)); extern double __significand (double __x) __attribute__ ((__nothrow__ , __leaf__));
extern double copysign (double __x, double __y) __attribute__ ((__nothrow__ , __leaf__)) __attribute__ ((__const__)); extern double __copysign (double __x, double __y) __attribute__ ((__nothrow__ , __leaf__)) __attribute__ ((__const__));
extern double nan (const char *__tagb) __attribute__ ((__nothrow__ , __leaf__)); extern double __nan (const char *__tagb) __attribute__ ((__nothrow__ , __leaf__));
extern int isnan (double __value) __attribute__ ((__nothrow__ , __leaf__))
  __attribute__ ((__const__));
extern double j0 (double) __attribute__ ((__nothrow__ , __leaf__)); extern double __j0 (double) __attribute__ ((__nothrow__ , __leaf__));
extern double j1 (double) __attribute__ ((__nothrow__ , __leaf__)); extern double __j1 (double) __attribute__ ((__nothrow__ , __leaf__));
extern double jn (int, double) __attribute__ ((__nothrow__ , __leaf__)); extern double __jn (int, double) __attribute__ ((__nothrow__ , __leaf__));
extern double y0 (double) __attribute__ ((__nothrow__ , __leaf__)); extern double __y0 (double) __attribute__ ((__nothrow__ , __leaf__));
extern double y1 (double) __attribute__ ((__nothrow__ , __leaf__)); extern double __y1 (double) __attribute__ ((__nothrow__ , __leaf__));
extern double yn (int, double) __attribute__ ((__nothrow__ , __leaf__)); extern double __yn (int, double) __attribute__ ((__nothrow__ , __leaf__));
 extern double erf (double) __attribute__ ((__nothrow__ , __leaf__)); extern double __erf (double) __attribute__ ((__nothrow__ , __leaf__));
 extern double erfc (double) __attribute__ ((__nothrow__ , __leaf__)); extern double __erfc (double) __attribute__ ((__nothrow__ , __leaf__));
extern double lgamma (double) __attribute__ ((__nothrow__ , __leaf__)); extern double __lgamma (double) __attribute__ ((__nothrow__ , __leaf__));
extern double tgamma (double) __attribute__ ((__nothrow__ , __leaf__)); extern double __tgamma (double) __attribute__ ((__nothrow__ , __leaf__));
extern double gamma (double) __attribute__ ((__nothrow__ , __leaf__)); extern double __gamma (double) __attribute__ ((__nothrow__ , __leaf__));
extern double lgamma_r (double, int *__signgamp) __attribute__ ((__nothrow__ , __leaf__)); extern double __lgamma_r (double, int *__signgamp) __attribute__ ((__nothrow__ , __leaf__));
extern double rint (double __x) __attribute__ ((__nothrow__ , __leaf__)); extern double __rint (double __x) __attribute__ ((__nothrow__ , __leaf__));
extern double nextafter (double __x, double __y) __attribute__ ((__nothrow__ , __leaf__)); extern double __nextafter (double __x, double __y) __attribute__ ((__nothrow__ , __leaf__));
extern double nexttoward (double __x, long double __y) __attribute__ ((__nothrow__ , __leaf__)); extern double __nexttoward (double __x, long double __y) __attribute__ ((__nothrow__ , __leaf__));
extern double remainder (double __x, double __y) __attribute__ ((__nothrow__ , __leaf__)); extern double __remainder (double __x, double __y) __attribute__ ((__nothrow__ , __leaf__));
extern double scalbn (double __x, int __n) __attribute__ ((__nothrow__ , __leaf__)); extern double __scalbn (double __x, int __n) __attribute__ ((__nothrow__ , __leaf__));
extern int ilogb (double __x) __attribute__ ((__nothrow__ , __leaf__)); extern int __ilogb (double __x) __attribute__ ((__nothrow__ , __leaf__));
extern double scalbln (double __x, long int __n) __attribute__ ((__nothrow__ , __leaf__)); extern double __scalbln (double __x, long int __n) __attribute__ ((__nothrow__ , __leaf__));
extern double nearbyint (double __x) __attribute__ ((__nothrow__ , __leaf__)); extern double __nearbyint (double __x) __attribute__ ((__nothrow__ , __leaf__));
extern double round (double __x) __attribute__ ((__nothrow__ , __leaf__)) __attribute__ ((__const__)); extern double __round (double __x) __attribute__ ((__nothrow__ , __leaf__)) __attribute__ ((__const__));
extern double trunc (double __x) __attribute__ ((__nothrow__ , __leaf__)) __attribute__ ((__const__)); extern double __trunc (double __x) __attribute__ ((__nothrow__ , __leaf__)) __attribute__ ((__const__));
extern double remquo (double __x, double __y, int *__quo) __attribute__ ((__nothrow__ , __leaf__)); extern double __remquo (double __x, double __y, int *__quo) __attribute__ ((__nothrow__ , __leaf__));
extern long int lrint (double __x) __attribute__ ((__nothrow__ , __leaf__)); extern long int __lrint (double __x) __attribute__ ((__nothrow__ , __leaf__));
__extension__
extern long long int llrint (double __x) __attribute__ ((__nothrow__ , __leaf__)); extern long long int __llrint (double __x) __attribute__ ((__nothrow__ , __leaf__));
extern long int lround (double __x) __attribute__ ((__nothrow__ , __leaf__)); extern long int __lround (double __x) __attribute__ ((__nothrow__ , __leaf__));
__extension__
extern long long int llround (double __x) __attribute__ ((__nothrow__ , __leaf__)); extern long long int __llround (double __x) __attribute__ ((__nothrow__ , __leaf__));
extern double fdim (double __x, double __y) __attribute__ ((__nothrow__ , __leaf__)); extern double __fdim (double __x, double __y) __attribute__ ((__nothrow__ , __leaf__));
extern double fmax (double __x, double __y) __attribute__ ((__nothrow__ , __leaf__)) __attribute__ ((__const__)); extern double __fmax (double __x, double __y) __attribute__ ((__nothrow__ , __leaf__)) __attribute__ ((__const__));
extern double fmin (double __x, double __y) __attribute__ ((__nothrow__ , __leaf__)) __attribute__ ((__const__)); extern double __fmin (double __x, double __y) __attribute__ ((__nothrow__ , __leaf__)) __attribute__ ((__const__));
extern double fma (double __x, double __y, double __z) __attribute__ ((__nothrow__ , __leaf__)); extern double __fma (double __x, double __y, double __z) __attribute__ ((__nothrow__ , __leaf__));
extern double scalb (double __x, double __n) __attribute__ ((__nothrow__ , __leaf__)); extern double __scalb (double __x, double __n) __attribute__ ((__nothrow__ , __leaf__));
extern int __fpclassifyf (float __value) __attribute__ ((__nothrow__ , __leaf__))
     __attribute__ ((__const__));
extern int __signbitf (float __value) __attribute__ ((__nothrow__ , __leaf__))
     __attribute__ ((__const__));
extern int __isinff (float __value) __attribute__ ((__nothrow__ , __leaf__))
  __attribute__ ((__const__));
extern int __finitef (float __value) __attribute__ ((__nothrow__ , __leaf__))
  __attribute__ ((__const__));
extern int __isnanf (float __value) __attribute__ ((__nothrow__ , __leaf__))
  __attribute__ ((__const__));
extern int __iseqsigf (float __x, float __y) __attribute__ ((__nothrow__ , __leaf__));
extern int __issignalingf (float __value) __attribute__ ((__nothrow__ , __leaf__))
     __attribute__ ((__const__));
 extern float acosf (float __x) __attribute__ ((__nothrow__ , __leaf__)); extern float __acosf (float __x) __attribute__ ((__nothrow__ , __leaf__));
 extern float asinf (float __x) __attribute__ ((__nothrow__ , __leaf__)); extern float __asinf (float __x) __attribute__ ((__nothrow__ , __leaf__));
 extern float atanf (float __x) __attribute__ ((__nothrow__ , __leaf__)); extern float __atanf (float __x) __attribute__ ((__nothrow__ , __leaf__));
 extern float atan2f (float __y, float __x) __attribute__ ((__nothrow__ , __leaf__)); extern float __atan2f (float __y, float __x) __attribute__ ((__nothrow__ , __leaf__));
 extern float cosf (float __x) __attribute__ ((__nothrow__ , __leaf__)); extern float __cosf (float __x) __attribute__ ((__nothrow__ , __leaf__));
 extern float sinf (float __x) __attribute__ ((__nothrow__ , __leaf__)); extern float __sinf (float __x) __attribute__ ((__nothrow__ , __leaf__));
 extern float tanf (float __x) __attribute__ ((__nothrow__ , __leaf__)); extern float __tanf (float __x) __attribute__ ((__nothrow__ , __leaf__));
 extern float coshf (float __x) __attribute__ ((__nothrow__ , __leaf__)); extern float __coshf (float __x) __attribute__ ((__nothrow__ , __leaf__));
 extern float sinhf (float __x) __attribute__ ((__nothrow__ , __leaf__)); extern float __sinhf (float __x) __attribute__ ((__nothrow__ , __leaf__));
 extern float tanhf (float __x) __attribute__ ((__nothrow__ , __leaf__)); extern float __tanhf (float __x) __attribute__ ((__nothrow__ , __leaf__));
 extern float acoshf (float __x) __attribute__ ((__nothrow__ , __leaf__)); extern float __acoshf (float __x) __attribute__ ((__nothrow__ , __leaf__));
 extern float asinhf (float __x) __attribute__ ((__nothrow__ , __leaf__)); extern float __asinhf (float __x) __attribute__ ((__nothrow__ , __leaf__));
 extern float atanhf (float __x) __attribute__ ((__nothrow__ , __leaf__)); extern float __atanhf (float __x) __attribute__ ((__nothrow__ , __leaf__));
 extern float expf (float __x) __attribute__ ((__nothrow__ , __leaf__)); extern float __expf (float __x) __attribute__ ((__nothrow__ , __leaf__));
extern float frexpf (float __x, int *__exponent) __attribute__ ((__nothrow__ , __leaf__)); extern float __frexpf (float __x, int *__exponent) __attribute__ ((__nothrow__ , __leaf__));
extern float ldexpf (float __x, int __exponent) __attribute__ ((__nothrow__ , __leaf__)); extern float __ldexpf (float __x, int __exponent) __attribute__ ((__nothrow__ , __leaf__));
 extern float logf (float __x) __attribute__ ((__nothrow__ , __leaf__)); extern float __logf (float __x) __attribute__ ((__nothrow__ , __leaf__));
 extern float log10f (float __x) __attribute__ ((__nothrow__ , __leaf__)); extern float __log10f (float __x) __attribute__ ((__nothrow__ , __leaf__));
extern float modff (float __x, float *__iptr) __attribute__ ((__nothrow__ , __leaf__)); extern float __modff (float __x, float *__iptr) __attribute__ ((__nothrow__ , __leaf__)) __attribute__ ((__nonnull__ (2)));
 extern float expm1f (float __x) __attribute__ ((__nothrow__ , __leaf__)); extern float __expm1f (float __x) __attribute__ ((__nothrow__ , __leaf__));
 extern float log1pf (float __x) __attribute__ ((__nothrow__ , __leaf__)); extern float __log1pf (float __x) __attribute__ ((__nothrow__ , __leaf__));
extern float logbf (float __x) __attribute__ ((__nothrow__ , __leaf__)); extern float __logbf (float __x) __attribute__ ((__nothrow__ , __leaf__));
 extern float exp2f (float __x) __attribute__ ((__nothrow__ , __leaf__)); extern float __exp2f (float __x) __attribute__ ((__nothrow__ , __leaf__));
 extern float log2f (float __x) __attribute__ ((__nothrow__ , __leaf__)); extern float __log2f (float __x) __attribute__ ((__nothrow__ , __leaf__));
 extern float powf (float __x, float __y) __attribute__ ((__nothrow__ , __leaf__)); extern float __powf (float __x, float __y) __attribute__ ((__nothrow__ , __leaf__));
extern float sqrtf (float __x) __attribute__ ((__nothrow__ , __leaf__)); extern float __sqrtf (float __x) __attribute__ ((__nothrow__ , __leaf__));
 extern float hypotf (float __x, float __y) __attribute__ ((__nothrow__ , __leaf__)); extern float __hypotf (float __x, float __y) __attribute__ ((__nothrow__ , __leaf__));
 extern float cbrtf (float __x) __attribute__ ((__nothrow__ , __leaf__)); extern float __cbrtf (float __x) __attribute__ ((__nothrow__ , __leaf__));
extern float ceilf (float __x) __attribute__ ((__nothrow__ , __leaf__)) __attribute__ ((__const__)); extern float __ceilf (float __x) __attribute__ ((__nothrow__ , __leaf__)) __attribute__ ((__const__));
extern float fabsf (float __x) __attribute__ ((__nothrow__ , __leaf__)) __attribute__ ((__const__)); extern float __fabsf (float __x) __attribute__ ((__nothrow__ , __leaf__)) __attribute__ ((__const__));
extern float floorf (float __x) __attribute__ ((__nothrow__ , __leaf__)) __attribute__ ((__const__)); extern float __floorf (float __x) __attribute__ ((__nothrow__ , __leaf__)) __attribute__ ((__const__));
extern float fmodf (float __x, float __y) __attribute__ ((__nothrow__ , __leaf__)); extern float __fmodf (float __x, float __y) __attribute__ ((__nothrow__ , __leaf__));
extern int isinff (float __value) __attribute__ ((__nothrow__ , __leaf__))
  __attribute__ ((__const__));
extern int finitef (float __value) __attribute__ ((__nothrow__ , __leaf__))
  __attribute__ ((__const__));
extern float dremf (float __x, float __y) __attribute__ ((__nothrow__ , __leaf__)); extern float __dremf (float __x, float __y) __attribute__ ((__nothrow__ , __leaf__));
extern float significandf (float __x) __attribute__ ((__nothrow__ , __leaf__)); extern float __significandf (float __x) __attribute__ ((__nothrow__ , __leaf__));
extern float copysignf (float __x, float __y) __attribute__ ((__nothrow__ , __leaf__)) __attribute__ ((__const__)); extern float __copysignf (float __x, float __y) __attribute__ ((__nothrow__ , __leaf__)) __attribute__ ((__const__));
extern float nanf (const char *__tagb) __attribute__ ((__nothrow__ , __leaf__)); extern float __nanf (const char *__tagb) __attribute__ ((__nothrow__ , __leaf__));
extern int isnanf (float __value) __attribute__ ((__nothrow__ , __leaf__))
  __attribute__ ((__const__));
extern float j0f (float) __attribute__ ((__nothrow__ , __leaf__)); extern float __j0f (float) __attribute__ ((__nothrow__ , __leaf__));
extern float j1f (float) __attribute__ ((__nothrow__ , __leaf__)); extern float __j1f (float) __attribute__ ((__nothrow__ , __leaf__));
extern float jnf (int, float) __attribute__ ((__nothrow__ , __leaf__)); extern float __jnf (int, float) __attribute__ ((__nothrow__ , __leaf__));
extern float y0f (float) __attribute__ ((__nothrow__ , __leaf__)); extern float __y0f (float) __attribute__ ((__nothrow__ , __leaf__));
extern float y1f (float) __attribute__ ((__nothrow__ , __leaf__)); extern float __y1f (float) __attribute__ ((__nothrow__ , __leaf__));
extern float ynf (int, float) __attribute__ ((__nothrow__ , __leaf__)); extern float __ynf (int, float) __attribute__ ((__nothrow__ , __leaf__));
 extern float erff (float) __attribute__ ((__nothrow__ , __leaf__)); extern float __erff (float) __attribute__ ((__nothrow__ , __leaf__));
 extern float erfcf (float) __attribute__ ((__nothrow__ , __leaf__)); extern float __erfcf (float) __attribute__ ((__nothrow__ , __leaf__));
extern float lgammaf (float) __attribute__ ((__nothrow__ , __leaf__)); extern float __lgammaf (float) __attribute__ ((__nothrow__ , __leaf__));
extern float tgammaf (float) __attribute__ ((__nothrow__ , __leaf__)); extern float __tgammaf (float) __attribute__ ((__nothrow__ , __leaf__));
extern float gammaf (float) __attribute__ ((__nothrow__ , __leaf__)); extern float __gammaf (float) __attribute__ ((__nothrow__ , __leaf__));
extern float lgammaf_r (float, int *__signgamp) __attribute__ ((__nothrow__ , __leaf__)); extern float __lgammaf_r (float, int *__signgamp) __attribute__ ((__nothrow__ , __leaf__));
extern float rintf (float __x) __attribute__ ((__nothrow__ , __leaf__)); extern float __rintf (float __x) __attribute__ ((__nothrow__ , __leaf__));
extern float nextafterf (float __x, float __y) __attribute__ ((__nothrow__ , __leaf__)); extern float __nextafterf (float __x, float __y) __attribute__ ((__nothrow__ , __leaf__));
extern float nexttowardf (float __x, long double __y) __attribute__ ((__nothrow__ , __leaf__)); extern float __nexttowardf (float __x, long double __y) __attribute__ ((__nothrow__ , __leaf__));
extern float remainderf (float __x, float __y) __attribute__ ((__nothrow__ , __leaf__)); extern float __remainderf (float __x, float __y) __attribute__ ((__nothrow__ , __leaf__));
extern float scalbnf (float __x, int __n) __attribute__ ((__nothrow__ , __leaf__)); extern float __scalbnf (float __x, int __n) __attribute__ ((__nothrow__ , __leaf__));
extern int ilogbf (float __x) __attribute__ ((__nothrow__ , __leaf__)); extern int __ilogbf (float __x) __attribute__ ((__nothrow__ , __leaf__));
extern float scalblnf (float __x, long int __n) __attribute__ ((__nothrow__ , __leaf__)); extern float __scalblnf (float __x, long int __n) __attribute__ ((__nothrow__ , __leaf__));
extern float nearbyintf (float __x) __attribute__ ((__nothrow__ , __leaf__)); extern float __nearbyintf (float __x) __attribute__ ((__nothrow__ , __leaf__));
extern float roundf (float __x) __attribute__ ((__nothrow__ , __leaf__)) __attribute__ ((__const__)); extern float __roundf (float __x) __attribute__ ((__nothrow__ , __leaf__)) __attribute__ ((__const__));
extern float truncf (float __x) __attribute__ ((__nothrow__ , __leaf__)) __attribute__ ((__const__)); extern float __truncf (float __x) __attribute__ ((__nothrow__ , __leaf__)) __attribute__ ((__const__));
extern float remquof (float __x, float __y, int *__quo) __attribute__ ((__nothrow__ , __leaf__)); extern float __remquof (float __x, float __y, int *__quo) __attribute__ ((__nothrow__ , __leaf__));
extern long int lrintf (float __x) __attribute__ ((__nothrow__ , __leaf__)); extern long int __lrintf (float __x) __attribute__ ((__nothrow__ , __leaf__));
__extension__
extern long long int llrintf (float __x) __attribute__ ((__nothrow__ , __leaf__)); extern long long int __llrintf (float __x) __attribute__ ((__nothrow__ , __leaf__));
extern long int lroundf (float __x) __attribute__ ((__nothrow__ , __leaf__)); extern long int __lroundf (float __x) __attribute__ ((__nothrow__ , __leaf__));
__extension__
extern long long int llroundf (float __x) __attribute__ ((__nothrow__ , __leaf__)); extern long long int __llroundf (float __x) __attribute__ ((__nothrow__ , __leaf__));
extern float fdimf (float __x, float __y) __attribute__ ((__nothrow__ , __leaf__)); extern float __fdimf (float __x, float __y) __attribute__ ((__nothrow__ , __leaf__));
extern float fmaxf (float __x, float __y) __attribute__ ((__nothrow__ , __leaf__)) __attribute__ ((__const__)); extern float __fmaxf (float __x, float __y) __attribute__ ((__nothrow__ , __leaf__)) __attribute__ ((__const__));
extern float fminf (float __x, float __y) __attribute__ ((__nothrow__ , __leaf__)) __attribute__ ((__const__)); extern float __fminf (float __x, float __y) __attribute__ ((__nothrow__ , __leaf__)) __attribute__ ((__const__));
extern float fmaf (float __x, float __y, float __z) __attribute__ ((__nothrow__ , __leaf__)); extern float __fmaf (float __x, float __y, float __z) __attribute__ ((__nothrow__ , __leaf__));
extern float scalbf (float __x, float __n) __attribute__ ((__nothrow__ , __leaf__)); extern float __scalbf (float __x, float __n) __attribute__ ((__nothrow__ , __leaf__));
extern int __fpclassifyl (long double __value) __attribute__ ((__nothrow__ , __leaf__))
     __attribute__ ((__const__));
extern int __signbitl (long double __value) __attribute__ ((__nothrow__ , __leaf__))
     __attribute__ ((__const__));
extern int __isinfl (long double __value) __attribute__ ((__nothrow__ , __leaf__))
  __attribute__ ((__const__));
extern int __finitel (long double __value) __attribute__ ((__nothrow__ , __leaf__))
  __attribute__ ((__const__));
extern int __isnanl (long double __value) __attribute__ ((__nothrow__ , __leaf__))
  __attribute__ ((__const__));
extern int __iseqsigl (long double __x, long double __y) __attribute__ ((__nothrow__ , __leaf__));
extern int __issignalingl (long double __value) __attribute__ ((__nothrow__ , __leaf__))
     __attribute__ ((__const__));
 extern long double acosl (long double __x) __attribute__ ((__nothrow__ , __leaf__)); extern long double __acosl (long double __x) __attribute__ ((__nothrow__ , __leaf__));
 extern long double asinl (long double __x) __attribute__ ((__nothrow__ , __leaf__)); extern long double __asinl (long double __x) __attribute__ ((__nothrow__ , __leaf__));
 extern long double atanl (long double __x) __attribute__ ((__nothrow__ , __leaf__)); extern long double __atanl (long double __x) __attribute__ ((__nothrow__ , __leaf__));
 extern long double atan2l (long double __y, long double __x) __attribute__ ((__nothrow__ , __leaf__)); extern long double __atan2l (long double __y, long double __x) __attribute__ ((__nothrow__ , __leaf__));
 extern long double cosl (long double __x) __attribute__ ((__nothrow__ , __leaf__)); extern long double __cosl (long double __x) __attribute__ ((__nothrow__ , __leaf__));
 extern long double sinl (long double __x) __attribute__ ((__nothrow__ , __leaf__)); extern long double __sinl (long double __x) __attribute__ ((__nothrow__ , __leaf__));
 extern long double tanl (long double __x) __attribute__ ((__nothrow__ , __leaf__)); extern long double __tanl (long double __x) __attribute__ ((__nothrow__ , __leaf__));
 extern long double coshl (long double __x) __attribute__ ((__nothrow__ , __leaf__)); extern long double __coshl (long double __x) __attribute__ ((__nothrow__ , __leaf__));
 extern long double sinhl (long double __x) __attribute__ ((__nothrow__ , __leaf__)); extern long double __sinhl (long double __x) __attribute__ ((__nothrow__ , __leaf__));
 extern long double tanhl (long double __x) __attribute__ ((__nothrow__ , __leaf__)); extern long double __tanhl (long double __x) __attribute__ ((__nothrow__ , __leaf__));
 extern long double acoshl (long double __x) __attribute__ ((__nothrow__ , __leaf__)); extern long double __acoshl (long double __x) __attribute__ ((__nothrow__ , __leaf__));
 extern long double asinhl (long double __x) __attribute__ ((__nothrow__ , __leaf__)); extern long double __asinhl (long double __x) __attribute__ ((__nothrow__ , __leaf__));
 extern long double atanhl (long double __x) __attribute__ ((__nothrow__ , __leaf__)); extern long double __atanhl (long double __x) __attribute__ ((__nothrow__ , __leaf__));
 extern long double expl (long double __x) __attribute__ ((__nothrow__ , __leaf__)); extern long double __expl (long double __x) __attribute__ ((__nothrow__ , __leaf__));
extern long double frexpl (long double __x, int *__exponent) __attribute__ ((__nothrow__ , __leaf__)); extern long double __frexpl (long double __x, int *__exponent) __attribute__ ((__nothrow__ , __leaf__));
extern long double ldexpl (long double __x, int __exponent) __attribute__ ((__nothrow__ , __leaf__)); extern long double __ldexpl (long double __x, int __exponent) __attribute__ ((__nothrow__ , __leaf__));
 extern long double logl (long double __x) __attribute__ ((__nothrow__ , __leaf__)); extern long double __logl (long double __x) __attribute__ ((__nothrow__ , __leaf__));
 extern long double log10l (long double __x) __attribute__ ((__nothrow__ , __leaf__)); extern long double __log10l (long double __x) __attribute__ ((__nothrow__ , __leaf__));
extern long double modfl (long double __x, long double *__iptr) __attribute__ ((__nothrow__ , __leaf__)); extern long double __modfl (long double __x, long double *__iptr) __attribute__ ((__nothrow__ , __leaf__)) __attribute__ ((__nonnull__ (2)));
 extern long double expm1l (long double __x) __attribute__ ((__nothrow__ , __leaf__)); extern long double __expm1l (long double __x) __attribute__ ((__nothrow__ , __leaf__));
 extern long double log1pl (long double __x) __attribute__ ((__nothrow__ , __leaf__)); extern long double __log1pl (long double __x) __attribute__ ((__nothrow__ , __leaf__));
extern long double logbl (long double __x) __attribute__ ((__nothrow__ , __leaf__)); extern long double __logbl (long double __x) __attribute__ ((__nothrow__ , __leaf__));
 extern long double exp2l (long double __x) __attribute__ ((__nothrow__ , __leaf__)); extern long double __exp2l (long double __x) __attribute__ ((__nothrow__ , __leaf__));
 extern long double log2l (long double __x) __attribute__ ((__nothrow__ , __leaf__)); extern long double __log2l (long double __x) __attribute__ ((__nothrow__ , __leaf__));
 extern long double powl (long double __x, long double __y) __attribute__ ((__nothrow__ , __leaf__)); extern long double __powl (long double __x, long double __y) __attribute__ ((__nothrow__ , __leaf__));
extern long double sqrtl (long double __x) __attribute__ ((__nothrow__ , __leaf__)); extern long double __sqrtl (long double __x) __attribute__ ((__nothrow__ , __leaf__));
 extern long double hypotl (long double __x, long double __y) __attribute__ ((__nothrow__ , __leaf__)); extern long double __hypotl (long double __x, long double __y) __attribute__ ((__nothrow__ , __leaf__));
 extern long double cbrtl (long double __x) __attribute__ ((__nothrow__ , __leaf__)); extern long double __cbrtl (long double __x) __attribute__ ((__nothrow__ , __leaf__));
extern long double ceill (long double __x) __attribute__ ((__nothrow__ , __leaf__)) __attribute__ ((__const__)); extern long double __ceill (long double __x) __attribute__ ((__nothrow__ , __leaf__)) __attribute__ ((__const__));
extern long double fabsl (long double __x) __attribute__ ((__nothrow__ , __leaf__)) __attribute__ ((__const__)); extern long double __fabsl (long double __x) __attribute__ ((__nothrow__ , __leaf__)) __attribute__ ((__const__));
extern long double floorl (long double __x) __attribute__ ((__nothrow__ , __leaf__)) __attribute__ ((__const__)); extern long double __floorl (long double __x) __attribute__ ((__nothrow__ , __leaf__)) __attribute__ ((__const__));
extern long double fmodl (long double __x, long double __y) __attribute__ ((__nothrow__ , __leaf__)); extern long double __fmodl (long double __x, long double __y) __attribute__ ((__nothrow__ , __leaf__));
extern int isinfl (long double __value) __attribute__ ((__nothrow__ , __leaf__))
  __attribute__ ((__const__));
extern int finitel (long double __value) __attribute__ ((__nothrow__ , __leaf__))
  __attribute__ ((__const__));
extern long double dreml (long double __x, long double __y) __attribute__ ((__nothrow__ , __leaf__)); extern long double __dreml (long double __x, long double __y) __attribute__ ((__nothrow__ , __leaf__));
extern long double significandl (long double __x) __attribute__ ((__nothrow__ , __leaf__)); extern long double __significandl (long double __x) __attribute__ ((__nothrow__ , __leaf__));
extern long double copysignl (long double __x, long double __y) __attribute__ ((__nothrow__ , __leaf__)) __attribute__ ((__const__)); extern long double __copysignl (long double __x, long double __y) __attribute__ ((__nothrow__ , __leaf__)) __attribute__ ((__const__));
extern long double nanl (const char *__tagb) __attribute__ ((__nothrow__ , __leaf__)); extern long double __nanl (const char *__tagb) __attribute__ ((__nothrow__ , __leaf__));
extern int isnanl (long double __value) __attribute__ ((__nothrow__ , __leaf__))
  __attribute__ ((__const__));
extern long double j0l (long double) __attribute__ ((__nothrow__ , __leaf__)); extern long double __j0l (long double) __attribute__ ((__nothrow__ , __leaf__));
extern long double j1l (long double) __attribute__ ((__nothrow__ , __leaf__)); extern long double __j1l (long double) __attribute__ ((__nothrow__ , __leaf__));
extern long double jnl (int, long double) __attribute__ ((__nothrow__ , __leaf__)); extern long double __jnl (int, long double) __attribute__ ((__nothrow__ , __leaf__));
extern long double y0l (long double) __attribute__ ((__nothrow__ , __leaf__)); extern long double __y0l (long double) __attribute__ ((__nothrow__ , __leaf__));
extern long double y1l (long double) __attribute__ ((__nothrow__ , __leaf__)); extern long double __y1l (long double) __attribute__ ((__nothrow__ , __leaf__));
extern long double ynl (int, long double) __attribute__ ((__nothrow__ , __leaf__)); extern long double __ynl (int, long double) __attribute__ ((__nothrow__ , __leaf__));
 extern long double erfl (long double) __attribute__ ((__nothrow__ , __leaf__)); extern long double __erfl (long double) __attribute__ ((__nothrow__ , __leaf__));
 extern long double erfcl (long double) __attribute__ ((__nothrow__ , __leaf__)); extern long double __erfcl (long double) __attribute__ ((__nothrow__ , __leaf__));
extern long double lgammal (long double) __attribute__ ((__nothrow__ , __leaf__)); extern long double __lgammal (long double) __attribute__ ((__nothrow__ , __leaf__));
extern long double tgammal (long double) __attribute__ ((__nothrow__ , __leaf__)); extern long double __tgammal (long double) __attribute__ ((__nothrow__ , __leaf__));
extern long double gammal (long double) __attribute__ ((__nothrow__ , __leaf__)); extern long double __gammal (long double) __attribute__ ((__nothrow__ , __leaf__));
extern long double lgammal_r (long double, int *__signgamp) __attribute__ ((__nothrow__ , __leaf__)); extern long double __lgammal_r (long double, int *__signgamp) __attribute__ ((__nothrow__ , __leaf__));
extern long double rintl (long double __x) __attribute__ ((__nothrow__ , __leaf__)); extern long double __rintl (long double __x) __attribute__ ((__nothrow__ , __leaf__));
extern long double nextafterl (long double __x, long double __y) __attribute__ ((__nothrow__ , __leaf__)); extern long double __nextafterl (long double __x, long double __y) __attribute__ ((__nothrow__ , __leaf__));
extern long double nexttowardl (long double __x, long double __y) __attribute__ ((__nothrow__ , __leaf__)); extern long double __nexttowardl (long double __x, long double __y) __attribute__ ((__nothrow__ , __leaf__));
extern long double remainderl (long double __x, long double __y) __attribute__ ((__nothrow__ , __leaf__)); extern long double __remainderl (long double __x, long double __y) __attribute__ ((__nothrow__ , __leaf__));
extern long double scalbnl (long double __x, int __n) __attribute__ ((__nothrow__ , __leaf__)); extern long double __scalbnl (long double __x, int __n) __attribute__ ((__nothrow__ , __leaf__));
extern int ilogbl (long double __x) __attribute__ ((__nothrow__ , __leaf__)); extern int __ilogbl (long double __x) __attribute__ ((__nothrow__ , __leaf__));
extern long double scalblnl (long double __x, long int __n) __attribute__ ((__nothrow__ , __leaf__)); extern long double __scalblnl (long double __x, long int __n) __attribute__ ((__nothrow__ , __leaf__));
extern long double nearbyintl (long double __x) __attribute__ ((__nothrow__ , __leaf__)); extern long double __nearbyintl (long double __x) __attribute__ ((__nothrow__ , __leaf__));
extern long double roundl (long double __x) __attribute__ ((__nothrow__ , __leaf__)) __attribute__ ((__const__)); extern long double __roundl (long double __x) __attribute__ ((__nothrow__ , __leaf__)) __attribute__ ((__const__));
extern long double truncl (long double __x) __attribute__ ((__nothrow__ , __leaf__)) __attribute__ ((__const__)); extern long double __truncl (long double __x) __attribute__ ((__nothrow__ , __leaf__)) __attribute__ ((__const__));
extern long double remquol (long double __x, long double __y, int *__quo) __attribute__ ((__nothrow__ , __leaf__)); extern long double __remquol (long double __x, long double __y, int *__quo) __attribute__ ((__nothrow__ , __leaf__));
extern long int lrintl (long double __x) __attribute__ ((__nothrow__ , __leaf__)); extern long int __lrintl (long double __x) __attribute__ ((__nothrow__ , __leaf__));
__extension__
extern long long int llrintl (long double __x) __attribute__ ((__nothrow__ , __leaf__)); extern long long int __llrintl (long double __x) __attribute__ ((__nothrow__ , __leaf__));
extern long int lroundl (long double __x) __attribute__ ((__nothrow__ , __leaf__)); extern long int __lroundl (long double __x) __attribute__ ((__nothrow__ , __leaf__));
__extension__
extern long long int llroundl (long double __x) __attribute__ ((__nothrow__ , __leaf__)); extern long long int __llroundl (long double __x) __attribute__ ((__nothrow__ , __leaf__));
extern long double fdiml (long double __x, long double __y) __attribute__ ((__nothrow__ , __leaf__)); extern long double __fdiml (long double __x, long double __y) __attribute__ ((__nothrow__ , __leaf__));
extern long double fmaxl (long double __x, long double __y) __attribute__ ((__nothrow__ , __leaf__)) __attribute__ ((__const__)); extern long double __fmaxl (long double __x, long double __y) __attribute__ ((__nothrow__ , __leaf__)) __attribute__ ((__const__));
extern long double fminl (long double __x, long double __y) __attribute__ ((__nothrow__ , __leaf__)) __attribute__ ((__const__)); extern long double __fminl (long double __x, long double __y) __attribute__ ((__nothrow__ , __leaf__)) __attribute__ ((__const__));
extern long double fmal (long double __x, long double __y, long double __z) __attribute__ ((__nothrow__ , __leaf__)); extern long double __fmal (long double __x, long double __y, long double __z) __attribute__ ((__nothrow__ , __leaf__));
extern long double scalbl (long double __x, long double __n) __attribute__ ((__nothrow__ , __leaf__)); extern long double __scalbl (long double __x, long double __n) __attribute__ ((__nothrow__ , __leaf__));
 
 
 
 
 
 
 
extern int signgam;
enum
  {
    FP_NAN =
      0,
    FP_INFINITE =
      1,
    FP_ZERO =
      2,
    FP_SUBNORMAL =
      3,
    FP_NORMAL =
      4
  };

int main()
{
 float x = __VERIFIER_nondet_float();
 if(!(__builtin_isgreaterequal(x, 0.0f) && __builtin_islessequal(x, 3.4e38f))) abort();
 float y = expf(logf(x));
 float r = fabsf(x - y) / (x + 1e-37f);
 if(!(__builtin_islessequal(r, 1e-8f))) reach_error();
    return 0;
}
