EESchema Schematic File Version 4
EELAYER 30 0
EELAYER END
$Descr A4 11693 8268
encoding utf-8
Sheet 1 1
Title ""
Date ""
Rev ""
Comp ""
Comment1 ""
Comment2 ""
Comment3 ""
Comment4 ""
$EndDescr
$Comp
L LED:SK6812 D1
U 1 1 6127F609
P 2150 2250
F 0 "D1" H 2494 2296 50  0000 L CNN
F 1 "SK6812" H 2494 2205 50  0000 L CNN
F 2 "LED_SMD:LED_SK6812_EC15_1.5x1.5mm" H 2200 1950 50  0001 L TNN
F 3 "https://cdn-shop.adafruit.com/product-files/1138/SK6812+LED+datasheet+.pdf" H 2250 1875 50  0001 L TNN
	1    2150 2250
	1    0    0    -1  
$EndComp
$Comp
L LED:SK6812 D2
U 1 1 6127F60F
P 3100 2250
F 0 "D2" H 3444 2296 50  0000 L CNN
F 1 "SK6812" H 3444 2205 50  0000 L CNN
F 2 "LED_SMD:LED_SK6812_EC15_1.5x1.5mm" H 3150 1950 50  0001 L TNN
F 3 "https://cdn-shop.adafruit.com/product-files/1138/SK6812+LED+datasheet+.pdf" H 3200 1875 50  0001 L TNN
	1    3100 2250
	1    0    0    -1  
$EndComp
Wire Wire Line
	2450 2250 2800 2250
Wire Wire Line
	3400 2250 3750 2250
$Comp
L LED:SK6812 D3
U 1 1 6128053C
P 4050 2250
F 0 "D3" H 4394 2296 50  0000 L CNN
F 1 "SK6812" H 4394 2205 50  0000 L CNN
F 2 "LED_SMD:LED_SK6812_EC15_1.5x1.5mm" H 4100 1950 50  0001 L TNN
F 3 "https://cdn-shop.adafruit.com/product-files/1138/SK6812+LED+datasheet+.pdf" H 4150 1875 50  0001 L TNN
	1    4050 2250
	1    0    0    -1  
$EndComp
$Comp
L LED:SK6812 D4
U 1 1 61280542
P 5000 2250
F 0 "D4" H 5344 2296 50  0000 L CNN
F 1 "SK6812" H 5344 2205 50  0000 L CNN
F 2 "LED_SMD:LED_SK6812_EC15_1.5x1.5mm" H 5050 1950 50  0001 L TNN
F 3 "https://cdn-shop.adafruit.com/product-files/1138/SK6812+LED+datasheet+.pdf" H 5100 1875 50  0001 L TNN
	1    5000 2250
	1    0    0    -1  
$EndComp
Wire Wire Line
	4350 2250 4700 2250
Wire Wire Line
	5300 2250 5650 2250
Wire Wire Line
	1850 2250 1500 2250
Text Label 1500 2250 0    50   ~ 0
DIN
$Comp
L power:GND #PWR0101
U 1 1 612AA965
P 2150 2550
F 0 "#PWR0101" H 2150 2300 50  0001 C CNN
F 1 "GND" H 2155 2377 50  0000 C CNN
F 2 "" H 2150 2550 50  0001 C CNN
F 3 "" H 2150 2550 50  0001 C CNN
	1    2150 2550
	1    0    0    -1  
$EndComp
$Comp
L power:GND #PWR0102
U 1 1 612B3F7A
P 3100 2550
F 0 "#PWR0102" H 3100 2300 50  0001 C CNN
F 1 "GND" H 3105 2377 50  0000 C CNN
F 2 "" H 3100 2550 50  0001 C CNN
F 3 "" H 3100 2550 50  0001 C CNN
	1    3100 2550
	1    0    0    -1  
$EndComp
$Comp
L power:GND #PWR0103
U 1 1 612B5D0E
P 4050 2550
F 0 "#PWR0103" H 4050 2300 50  0001 C CNN
F 1 "GND" H 4055 2377 50  0000 C CNN
F 2 "" H 4050 2550 50  0001 C CNN
F 3 "" H 4050 2550 50  0001 C CNN
	1    4050 2550
	1    0    0    -1  
$EndComp
$Comp
L power:GND #PWR0104
U 1 1 612B5D14
P 5000 2550
F 0 "#PWR0104" H 5000 2300 50  0001 C CNN
F 1 "GND" H 5005 2377 50  0000 C CNN
F 2 "" H 5000 2550 50  0001 C CNN
F 3 "" H 5000 2550 50  0001 C CNN
	1    5000 2550
	1    0    0    -1  
$EndComp
$Comp
L power:VCC #PWR0105
U 1 1 612B633C
P 2150 1950
F 0 "#PWR0105" H 2150 1800 50  0001 C CNN
F 1 "VCC" H 2167 2123 50  0000 C CNN
F 2 "" H 2150 1950 50  0001 C CNN
F 3 "" H 2150 1950 50  0001 C CNN
	1    2150 1950
	1    0    0    -1  
$EndComp
$Comp
L power:VCC #PWR0106
U 1 1 612B6EBC
P 3100 1950
F 0 "#PWR0106" H 3100 1800 50  0001 C CNN
F 1 "VCC" H 3117 2123 50  0000 C CNN
F 2 "" H 3100 1950 50  0001 C CNN
F 3 "" H 3100 1950 50  0001 C CNN
	1    3100 1950
	1    0    0    -1  
$EndComp
$Comp
L power:VCC #PWR0107
U 1 1 612B8C05
P 4050 1950
F 0 "#PWR0107" H 4050 1800 50  0001 C CNN
F 1 "VCC" H 4067 2123 50  0000 C CNN
F 2 "" H 4050 1950 50  0001 C CNN
F 3 "" H 4050 1950 50  0001 C CNN
	1    4050 1950
	1    0    0    -1  
$EndComp
$Comp
L power:VCC #PWR0108
U 1 1 612B8C0B
P 5000 1950
F 0 "#PWR0108" H 5000 1800 50  0001 C CNN
F 1 "VCC" H 5017 2123 50  0000 C CNN
F 2 "" H 5000 1950 50  0001 C CNN
F 3 "" H 5000 1950 50  0001 C CNN
	1    5000 1950
	1    0    0    -1  
$EndComp
$Comp
L LED:SK6812 D5
U 1 1 612CB850
P 5650 2900
F 0 "D5" H 5994 2946 50  0000 L CNN
F 1 "SK6812" H 5994 2855 50  0000 L CNN
F 2 "LED_SMD:LED_SK6812_EC15_1.5x1.5mm" H 5700 2600 50  0001 L TNN
F 3 "https://cdn-shop.adafruit.com/product-files/1138/SK6812+LED+datasheet+.pdf" H 5750 2525 50  0001 L TNN
	1    5650 2900
	0    1    1    0   
$EndComp
$Comp
L LED:SK6812 D6
U 1 1 612CB856
P 5650 3850
F 0 "D6" H 5994 3896 50  0000 L CNN
F 1 "SK6812" H 5994 3805 50  0000 L CNN
F 2 "LED_SMD:LED_SK6812_EC15_1.5x1.5mm" H 5700 3550 50  0001 L TNN
F 3 "https://cdn-shop.adafruit.com/product-files/1138/SK6812+LED+datasheet+.pdf" H 5750 3475 50  0001 L TNN
	1    5650 3850
	0    1    1    0   
$EndComp
Wire Wire Line
	5650 3200 5650 3550
Wire Wire Line
	5650 4150 5650 4500
$Comp
L LED:SK6812 D7
U 1 1 612CB85E
P 5650 4800
F 0 "D7" H 5994 4846 50  0000 L CNN
F 1 "SK6812" H 5994 4755 50  0000 L CNN
F 2 "LED_SMD:LED_SK6812_EC15_1.5x1.5mm" H 5700 4500 50  0001 L TNN
F 3 "https://cdn-shop.adafruit.com/product-files/1138/SK6812+LED+datasheet+.pdf" H 5750 4425 50  0001 L TNN
	1    5650 4800
	0    1    1    0   
$EndComp
$Comp
L LED:SK6812 D8
U 1 1 612CB864
P 5650 5750
F 0 "D8" H 5994 5796 50  0000 L CNN
F 1 "SK6812" H 5994 5705 50  0000 L CNN
F 2 "LED_SMD:LED_SK6812_EC15_1.5x1.5mm" H 5700 5450 50  0001 L TNN
F 3 "https://cdn-shop.adafruit.com/product-files/1138/SK6812+LED+datasheet+.pdf" H 5750 5375 50  0001 L TNN
	1    5650 5750
	0    1    1    0   
$EndComp
Wire Wire Line
	5650 5100 5650 5450
Wire Wire Line
	5650 6050 5650 6400
Wire Wire Line
	5650 2600 5650 2250
$Comp
L power:GND #PWR0109
U 1 1 612CB86D
P 5350 2900
F 0 "#PWR0109" H 5350 2650 50  0001 C CNN
F 1 "GND" H 5355 2727 50  0000 C CNN
F 2 "" H 5350 2900 50  0001 C CNN
F 3 "" H 5350 2900 50  0001 C CNN
	1    5350 2900
	0    1    1    0   
$EndComp
$Comp
L power:GND #PWR0110
U 1 1 612CB873
P 5350 3850
F 0 "#PWR0110" H 5350 3600 50  0001 C CNN
F 1 "GND" H 5355 3677 50  0000 C CNN
F 2 "" H 5350 3850 50  0001 C CNN
F 3 "" H 5350 3850 50  0001 C CNN
	1    5350 3850
	0    1    1    0   
$EndComp
$Comp
L power:GND #PWR0111
U 1 1 612CB879
P 5350 4800
F 0 "#PWR0111" H 5350 4550 50  0001 C CNN
F 1 "GND" H 5355 4627 50  0000 C CNN
F 2 "" H 5350 4800 50  0001 C CNN
F 3 "" H 5350 4800 50  0001 C CNN
	1    5350 4800
	0    1    1    0   
$EndComp
$Comp
L power:GND #PWR0112
U 1 1 612CB87F
P 5350 5750
F 0 "#PWR0112" H 5350 5500 50  0001 C CNN
F 1 "GND" H 5355 5577 50  0000 C CNN
F 2 "" H 5350 5750 50  0001 C CNN
F 3 "" H 5350 5750 50  0001 C CNN
	1    5350 5750
	0    1    1    0   
$EndComp
$Comp
L power:VCC #PWR0113
U 1 1 612CB885
P 5950 2900
F 0 "#PWR0113" H 5950 2750 50  0001 C CNN
F 1 "VCC" H 5967 3073 50  0000 C CNN
F 2 "" H 5950 2900 50  0001 C CNN
F 3 "" H 5950 2900 50  0001 C CNN
	1    5950 2900
	0    1    1    0   
$EndComp
$Comp
L power:VCC #PWR0114
U 1 1 612CB88B
P 5950 3850
F 0 "#PWR0114" H 5950 3700 50  0001 C CNN
F 1 "VCC" H 5967 4023 50  0000 C CNN
F 2 "" H 5950 3850 50  0001 C CNN
F 3 "" H 5950 3850 50  0001 C CNN
	1    5950 3850
	0    1    1    0   
$EndComp
$Comp
L power:VCC #PWR0115
U 1 1 612CB891
P 5950 4800
F 0 "#PWR0115" H 5950 4650 50  0001 C CNN
F 1 "VCC" H 5967 4973 50  0000 C CNN
F 2 "" H 5950 4800 50  0001 C CNN
F 3 "" H 5950 4800 50  0001 C CNN
	1    5950 4800
	0    1    1    0   
$EndComp
$Comp
L power:VCC #PWR0116
U 1 1 612CB897
P 5950 5750
F 0 "#PWR0116" H 5950 5600 50  0001 C CNN
F 1 "VCC" H 5967 5923 50  0000 C CNN
F 2 "" H 5950 5750 50  0001 C CNN
F 3 "" H 5950 5750 50  0001 C CNN
	1    5950 5750
	0    1    1    0   
$EndComp
$Comp
L LED:SK6812 D9
U 1 1 612D319D
P 5000 6400
F 0 "D9" H 5344 6446 50  0000 L CNN
F 1 "SK6812" H 5344 6355 50  0000 L CNN
F 2 "LED_SMD:LED_SK6812_EC15_1.5x1.5mm" H 5050 6100 50  0001 L TNN
F 3 "https://cdn-shop.adafruit.com/product-files/1138/SK6812+LED+datasheet+.pdf" H 5100 6025 50  0001 L TNN
	1    5000 6400
	-1   0    0    1   
$EndComp
$Comp
L LED:SK6812 D10
U 1 1 612D31A3
P 4050 6400
F 0 "D10" H 4394 6446 50  0000 L CNN
F 1 "SK6812" H 4394 6355 50  0000 L CNN
F 2 "LED_SMD:LED_SK6812_EC15_1.5x1.5mm" H 4100 6100 50  0001 L TNN
F 3 "https://cdn-shop.adafruit.com/product-files/1138/SK6812+LED+datasheet+.pdf" H 4150 6025 50  0001 L TNN
	1    4050 6400
	-1   0    0    1   
$EndComp
Wire Wire Line
	4700 6400 4350 6400
Wire Wire Line
	3750 6400 3400 6400
$Comp
L LED:SK6812 D11
U 1 1 612D31AB
P 3100 6400
F 0 "D11" H 3444 6446 50  0000 L CNN
F 1 "SK6812" H 3444 6355 50  0000 L CNN
F 2 "LED_SMD:LED_SK6812_EC15_1.5x1.5mm" H 3150 6100 50  0001 L TNN
F 3 "https://cdn-shop.adafruit.com/product-files/1138/SK6812+LED+datasheet+.pdf" H 3200 6025 50  0001 L TNN
	1    3100 6400
	-1   0    0    1   
$EndComp
$Comp
L LED:SK6812 D12
U 1 1 612D31B1
P 2150 6400
F 0 "D12" H 2494 6446 50  0000 L CNN
F 1 "SK6812" H 2494 6355 50  0000 L CNN
F 2 "LED_SMD:LED_SK6812_EC15_1.5x1.5mm" H 2200 6100 50  0001 L TNN
F 3 "https://cdn-shop.adafruit.com/product-files/1138/SK6812+LED+datasheet+.pdf" H 2250 6025 50  0001 L TNN
	1    2150 6400
	-1   0    0    1   
$EndComp
Wire Wire Line
	2800 6400 2450 6400
Wire Wire Line
	1850 6400 1500 6400
Wire Wire Line
	5300 6400 5650 6400
$Comp
L power:GND #PWR0117
U 1 1 612D31BA
P 5000 6100
F 0 "#PWR0117" H 5000 5850 50  0001 C CNN
F 1 "GND" H 5005 5927 50  0000 C CNN
F 2 "" H 5000 6100 50  0001 C CNN
F 3 "" H 5000 6100 50  0001 C CNN
	1    5000 6100
	-1   0    0    1   
$EndComp
$Comp
L power:GND #PWR0118
U 1 1 612D31C0
P 4050 6100
F 0 "#PWR0118" H 4050 5850 50  0001 C CNN
F 1 "GND" H 4055 5927 50  0000 C CNN
F 2 "" H 4050 6100 50  0001 C CNN
F 3 "" H 4050 6100 50  0001 C CNN
	1    4050 6100
	-1   0    0    1   
$EndComp
$Comp
L power:GND #PWR0119
U 1 1 612D31C6
P 3100 6100
F 0 "#PWR0119" H 3100 5850 50  0001 C CNN
F 1 "GND" H 3105 5927 50  0000 C CNN
F 2 "" H 3100 6100 50  0001 C CNN
F 3 "" H 3100 6100 50  0001 C CNN
	1    3100 6100
	-1   0    0    1   
$EndComp
$Comp
L power:GND #PWR0120
U 1 1 612D31CC
P 2150 6100
F 0 "#PWR0120" H 2150 5850 50  0001 C CNN
F 1 "GND" H 2155 5927 50  0000 C CNN
F 2 "" H 2150 6100 50  0001 C CNN
F 3 "" H 2150 6100 50  0001 C CNN
	1    2150 6100
	-1   0    0    1   
$EndComp
$Comp
L power:VCC #PWR0121
U 1 1 612D31D2
P 5000 6700
F 0 "#PWR0121" H 5000 6550 50  0001 C CNN
F 1 "VCC" H 5017 6873 50  0000 C CNN
F 2 "" H 5000 6700 50  0001 C CNN
F 3 "" H 5000 6700 50  0001 C CNN
	1    5000 6700
	-1   0    0    1   
$EndComp
$Comp
L power:VCC #PWR0122
U 1 1 612D31D8
P 4050 6700
F 0 "#PWR0122" H 4050 6550 50  0001 C CNN
F 1 "VCC" H 4067 6873 50  0000 C CNN
F 2 "" H 4050 6700 50  0001 C CNN
F 3 "" H 4050 6700 50  0001 C CNN
	1    4050 6700
	-1   0    0    1   
$EndComp
$Comp
L power:VCC #PWR0123
U 1 1 612D31DE
P 3100 6700
F 0 "#PWR0123" H 3100 6550 50  0001 C CNN
F 1 "VCC" H 3117 6873 50  0000 C CNN
F 2 "" H 3100 6700 50  0001 C CNN
F 3 "" H 3100 6700 50  0001 C CNN
	1    3100 6700
	-1   0    0    1   
$EndComp
$Comp
L power:VCC #PWR0124
U 1 1 612D31E4
P 2150 6700
F 0 "#PWR0124" H 2150 6550 50  0001 C CNN
F 1 "VCC" H 2167 6873 50  0000 C CNN
F 2 "" H 2150 6700 50  0001 C CNN
F 3 "" H 2150 6700 50  0001 C CNN
	1    2150 6700
	-1   0    0    1   
$EndComp
$Comp
L LED:SK6812 D13
U 1 1 612D9BF9
P 1500 5750
F 0 "D13" H 1844 5796 50  0000 L CNN
F 1 "SK6812" H 1844 5705 50  0000 L CNN
F 2 "LED_SMD:LED_SK6812_EC15_1.5x1.5mm" H 1550 5450 50  0001 L TNN
F 3 "https://cdn-shop.adafruit.com/product-files/1138/SK6812+LED+datasheet+.pdf" H 1600 5375 50  0001 L TNN
	1    1500 5750
	0    -1   -1   0   
$EndComp
$Comp
L LED:SK6812 D14
U 1 1 612D9BFF
P 1500 4800
F 0 "D14" H 1844 4846 50  0000 L CNN
F 1 "SK6812" H 1844 4755 50  0000 L CNN
F 2 "LED_SMD:LED_SK6812_EC15_1.5x1.5mm" H 1550 4500 50  0001 L TNN
F 3 "https://cdn-shop.adafruit.com/product-files/1138/SK6812+LED+datasheet+.pdf" H 1600 4425 50  0001 L TNN
	1    1500 4800
	0    -1   -1   0   
$EndComp
Wire Wire Line
	1500 5450 1500 5100
Wire Wire Line
	1500 4500 1500 4150
$Comp
L LED:SK6812 D15
U 1 1 612D9C07
P 1500 3850
F 0 "D15" H 1844 3896 50  0000 L CNN
F 1 "SK6812" H 1844 3805 50  0000 L CNN
F 2 "LED_SMD:LED_SK6812_EC15_1.5x1.5mm" H 1550 3550 50  0001 L TNN
F 3 "https://cdn-shop.adafruit.com/product-files/1138/SK6812+LED+datasheet+.pdf" H 1600 3475 50  0001 L TNN
	1    1500 3850
	0    -1   -1   0   
$EndComp
$Comp
L LED:SK6812 D16
U 1 1 612D9C0D
P 1500 2900
F 0 "D16" H 1844 2946 50  0000 L CNN
F 1 "SK6812" H 1844 2855 50  0000 L CNN
F 2 "LED_SMD:LED_SK6812_EC15_1.5x1.5mm" H 1550 2600 50  0001 L TNN
F 3 "https://cdn-shop.adafruit.com/product-files/1138/SK6812+LED+datasheet+.pdf" H 1600 2525 50  0001 L TNN
	1    1500 2900
	0    -1   -1   0   
$EndComp
Wire Wire Line
	1500 3550 1500 3200
Wire Wire Line
	1500 6050 1500 6400
$Comp
L power:GND #PWR0125
U 1 1 612D9C16
P 1800 5750
F 0 "#PWR0125" H 1800 5500 50  0001 C CNN
F 1 "GND" H 1805 5577 50  0000 C CNN
F 2 "" H 1800 5750 50  0001 C CNN
F 3 "" H 1800 5750 50  0001 C CNN
	1    1800 5750
	0    -1   -1   0   
$EndComp
$Comp
L power:GND #PWR0126
U 1 1 612D9C1C
P 1800 4800
F 0 "#PWR0126" H 1800 4550 50  0001 C CNN
F 1 "GND" H 1805 4627 50  0000 C CNN
F 2 "" H 1800 4800 50  0001 C CNN
F 3 "" H 1800 4800 50  0001 C CNN
	1    1800 4800
	0    -1   -1   0   
$EndComp
$Comp
L power:GND #PWR0127
U 1 1 612D9C22
P 1800 3850
F 0 "#PWR0127" H 1800 3600 50  0001 C CNN
F 1 "GND" H 1805 3677 50  0000 C CNN
F 2 "" H 1800 3850 50  0001 C CNN
F 3 "" H 1800 3850 50  0001 C CNN
	1    1800 3850
	0    -1   -1   0   
$EndComp
$Comp
L power:GND #PWR0128
U 1 1 612D9C28
P 1800 2900
F 0 "#PWR0128" H 1800 2650 50  0001 C CNN
F 1 "GND" H 1805 2727 50  0000 C CNN
F 2 "" H 1800 2900 50  0001 C CNN
F 3 "" H 1800 2900 50  0001 C CNN
	1    1800 2900
	0    -1   -1   0   
$EndComp
$Comp
L power:VCC #PWR0129
U 1 1 612D9C2E
P 1200 5750
F 0 "#PWR0129" H 1200 5600 50  0001 C CNN
F 1 "VCC" H 1217 5923 50  0000 C CNN
F 2 "" H 1200 5750 50  0001 C CNN
F 3 "" H 1200 5750 50  0001 C CNN
	1    1200 5750
	0    -1   -1   0   
$EndComp
$Comp
L power:VCC #PWR0130
U 1 1 612D9C34
P 1200 4800
F 0 "#PWR0130" H 1200 4650 50  0001 C CNN
F 1 "VCC" H 1217 4973 50  0000 C CNN
F 2 "" H 1200 4800 50  0001 C CNN
F 3 "" H 1200 4800 50  0001 C CNN
	1    1200 4800
	0    -1   -1   0   
$EndComp
$Comp
L power:VCC #PWR0131
U 1 1 612D9C3A
P 1200 3850
F 0 "#PWR0131" H 1200 3700 50  0001 C CNN
F 1 "VCC" H 1217 4023 50  0000 C CNN
F 2 "" H 1200 3850 50  0001 C CNN
F 3 "" H 1200 3850 50  0001 C CNN
	1    1200 3850
	0    -1   -1   0   
$EndComp
$Comp
L power:VCC #PWR0132
U 1 1 612D9C40
P 1200 2900
F 0 "#PWR0132" H 1200 2750 50  0001 C CNN
F 1 "VCC" H 1217 3073 50  0000 C CNN
F 2 "" H 1200 2900 50  0001 C CNN
F 3 "" H 1200 2900 50  0001 C CNN
	1    1200 2900
	0    -1   -1   0   
$EndComp
$Comp
L Connector_Generic:Conn_01x01 J1
U 1 1 612FFF4E
P 7600 2550
F 0 "J1" H 7680 2592 50  0000 L CNN
F 1 "Conn_01x01" H 7680 2501 50  0000 L CNN
F 2 "ringLed:MagnetPad_2.1m" H 7600 2550 50  0001 C CNN
F 3 "~" H 7600 2550 50  0001 C CNN
	1    7600 2550
	1    0    0    -1  
$EndComp
$Comp
L Connector_Generic:Conn_01x01 J2
U 1 1 613007A3
P 7600 2700
F 0 "J2" H 7680 2742 50  0000 L CNN
F 1 "Conn_01x01" H 7680 2651 50  0000 L CNN
F 2 "ringLed:MagnetPad_2.1m" H 7600 2700 50  0001 C CNN
F 3 "~" H 7600 2700 50  0001 C CNN
	1    7600 2700
	1    0    0    -1  
$EndComp
$Comp
L Connector_Generic:Conn_01x01 J3
U 1 1 61300A28
P 7600 2850
F 0 "J3" H 7680 2892 50  0000 L CNN
F 1 "Conn_01x01" H 7680 2801 50  0000 L CNN
F 2 "ringLed:MagnetPad_2.1m" H 7600 2850 50  0001 C CNN
F 3 "~" H 7600 2850 50  0001 C CNN
	1    7600 2850
	1    0    0    -1  
$EndComp
$Comp
L power:VCC #PWR0133
U 1 1 6130207C
P 7350 2500
F 0 "#PWR0133" H 7350 2350 50  0001 C CNN
F 1 "VCC" H 7367 2673 50  0000 C CNN
F 2 "" H 7350 2500 50  0001 C CNN
F 3 "" H 7350 2500 50  0001 C CNN
	1    7350 2500
	1    0    0    -1  
$EndComp
$Comp
L power:GND #PWR0134
U 1 1 6130262C
P 7350 2900
F 0 "#PWR0134" H 7350 2650 50  0001 C CNN
F 1 "GND" H 7355 2727 50  0000 C CNN
F 2 "" H 7350 2900 50  0001 C CNN
F 3 "" H 7350 2900 50  0001 C CNN
	1    7350 2900
	1    0    0    -1  
$EndComp
Text Label 7200 2700 0    50   ~ 0
DIN
Wire Wire Line
	7350 2500 7350 2550
Wire Wire Line
	7350 2550 7400 2550
Wire Wire Line
	7350 2900 7350 2850
Wire Wire Line
	7350 2850 7400 2850
Wire Wire Line
	7200 2700 7400 2700
$Comp
L Connector_Generic:Conn_01x01 J4
U 1 1 613259AB
P 8750 2550
F 0 "J4" H 8830 2592 50  0000 L CNN
F 1 "Conn_01x01" H 8830 2501 50  0000 L CNN
F 2 "ringLed:MagnetPad_2.1m" H 8750 2550 50  0001 C CNN
F 3 "~" H 8750 2550 50  0001 C CNN
	1    8750 2550
	1    0    0    -1  
$EndComp
$Comp
L Connector_Generic:Conn_01x01 J6
U 1 1 613259B7
P 8750 2850
F 0 "J6" H 8830 2892 50  0000 L CNN
F 1 "Conn_01x01" H 8830 2801 50  0000 L CNN
F 2 "ringLed:MagnetPad_2.1m" H 8750 2850 50  0001 C CNN
F 3 "~" H 8750 2850 50  0001 C CNN
	1    8750 2850
	1    0    0    -1  
$EndComp
$Comp
L power:VCC #PWR0135
U 1 1 613259BD
P 8500 2500
F 0 "#PWR0135" H 8500 2350 50  0001 C CNN
F 1 "VCC" H 8517 2673 50  0000 C CNN
F 2 "" H 8500 2500 50  0001 C CNN
F 3 "" H 8500 2500 50  0001 C CNN
	1    8500 2500
	1    0    0    -1  
$EndComp
$Comp
L power:GND #PWR0136
U 1 1 613259C3
P 8500 2900
F 0 "#PWR0136" H 8500 2650 50  0001 C CNN
F 1 "GND" H 8505 2727 50  0000 C CNN
F 2 "" H 8500 2900 50  0001 C CNN
F 3 "" H 8500 2900 50  0001 C CNN
	1    8500 2900
	1    0    0    -1  
$EndComp
Wire Wire Line
	8500 2500 8500 2550
Wire Wire Line
	8500 2550 8550 2550
Wire Wire Line
	8500 2900 8500 2850
Wire Wire Line
	8500 2850 8550 2850
$EndSCHEMATC
