EESchema Schematic File Version 4
EELAYER 30 0
EELAYER END
$Descr A4 11693 8268
encoding utf-8
Sheet 1 1
Title ""
Date ""
Rev ""
Comp ""
Comment1 ""
Comment2 ""
Comment3 ""
Comment4 ""
$EndDescr
Wire Wire Line
	6200 2450 6200 2350
Wire Wire Line
	6100 2450 6100 2350
Text Label 6100 2450 1    50   ~ 0
BD-
Text Label 6200 2450 1    50   ~ 0
BD+
Text Notes 1600 5450 0    50   ~ 0
p0k3r vortex is 220mA\ng602 is 23mA\nneed fet setup capable of handling either
Wire Wire Line
	4800 2450 4800 2350
Wire Wire Line
	4700 2450 4700 2350
Text Label 4700 2450 1    50   ~ 0
AD-
$Comp
L power:GND #PWR0106
U 1 1 60041190
P 5000 2450
F 0 "#PWR0106" H 5000 2200 50  0001 C CNN
F 1 "GND" H 5005 2277 50  0000 C CNN
F 2 "" H 5000 2450 50  0001 C CNN
F 3 "" H 5000 2450 50  0001 C CNN
	1    5000 2450
	1    0    0    -1  
$EndComp
$Comp
L Switch:SW_DPDT_x2 SW1
U 1 1 600ACB41
P 5750 3200
F 0 "SW1" V 5796 3012 50  0000 R CNN
F 1 "SW_DPDT_x2" V 5705 3012 50  0000 R CNN
F 2 "footprints:JS202011CQN" H 5750 3200 50  0001 C CNN
F 3 "~" H 5750 3200 50  0001 C CNN
	1    5750 3200
	0    -1   -1   0   
$EndComp
$Comp
L Switch:SW_DPDT_x2 SW1
U 2 1 600ADCAA
P 5250 3200
F 0 "SW1" V 5296 3012 50  0000 R CNN
F 1 "SW_DPDT_x2" V 5205 3012 50  0000 R CNN
F 2 "footprints:JS202011CQN" H 5250 3200 50  0001 C CNN
F 3 "~" H 5250 3200 50  0001 C CNN
	2    5250 3200
	0    -1   -1   0   
$EndComp
$Comp
L power:VBUS #PWR0102
U 1 1 600B3CA7
P 4600 2450
F 0 "#PWR0102" H 4600 2300 50  0001 C CNN
F 1 "VBUS" H 4615 2623 50  0000 C CNN
F 2 "" H 4600 2450 50  0001 C CNN
F 3 "" H 4600 2450 50  0001 C CNN
	1    4600 2450
	-1   0    0    1   
$EndComp
Text Label 5250 3500 1    50   ~ 0
D+
Text Label 5750 3500 1    50   ~ 0
D-
Wire Wire Line
	5750 3400 5750 3500
Wire Wire Line
	5250 3400 5250 3500
Text Label 4800 2450 1    50   ~ 0
AD+
NoConn ~ 6300 2350
Text Label 5850 2900 1    50   ~ 0
AD-
Text Label 5150 2900 1    50   ~ 0
AD+
Text Label 5650 2900 1    50   ~ 0
BD-
Text Label 5350 2900 1    50   ~ 0
BD+
Wire Wire Line
	5150 2900 5150 3000
Wire Wire Line
	5350 2900 5350 3000
Wire Wire Line
	5650 2900 5650 3000
Wire Wire Line
	5850 2900 5850 3000
$Comp
L USB-A1HSW6:USB-A1HSW6 P1
U 1 1 600D1129
P 5700 4250
F 0 "P1" V 5789 3920 50  0000 R CNN
F 1 "USB-A1HSW6" V 5698 3920 50  0000 R CNN
F 2 "lib:OST_USB-A1HSW6" H 5700 4250 50  0001 L BNN
F 3 "" H 5700 4250 50  0001 L BNN
F 4 "On-Shore Technology, Inc." H 5700 4250 50  0001 L BNN "MANUFACTURER"
	1    5700 4250
	0    1    1    0   
$EndComp
$Comp
L 10118192-0002LF:10118192-0002LF J1
U 1 1 600D2117
P 4900 1950
F 0 "J1" V 4747 2380 50  0000 L CNN
F 1 "10118192-0002LF" V 4838 2380 50  0000 L CNN
F 2 "lib:AMPHENOL_10118192-0002LF" H 4900 1950 50  0001 L BNN
F 3 "" H 4900 1950 50  0001 L BNN
F 4 "Manufacturer Recommendations" H 4900 1950 50  0001 L BNN "STANDARD"
F 5 "B" H 4900 1950 50  0001 L BNN "PARTREV"
F 6 "2.8mm" H 4900 1950 50  0001 L BNN "MAXIMUM_PACKAGE_HEIGHT"
F 7 "Amphenol" H 4900 1950 50  0001 L BNN "MANUFACTURER"
	1    4900 1950
	0    -1   -1   0   
$EndComp
$Comp
L 10118192-0002LF:10118192-0002LF J2
U 1 1 600D2D92
P 6300 1950
F 0 "J2" V 6147 2380 50  0000 L CNN
F 1 "10118192-0002LF" V 6238 2380 50  0000 L CNN
F 2 "lib:AMPHENOL_10118192-0002LF" H 6300 1950 50  0001 L BNN
F 3 "" H 6300 1950 50  0001 L BNN
F 4 "Manufacturer Recommendations" H 6300 1950 50  0001 L BNN "STANDARD"
F 5 "B" H 6300 1950 50  0001 L BNN "PARTREV"
F 6 "2.8mm" H 6300 1950 50  0001 L BNN "MAXIMUM_PACKAGE_HEIGHT"
F 7 "Amphenol" H 6300 1950 50  0001 L BNN "MANUFACTURER"
	1    6300 1950
	0    -1   -1   0   
$EndComp
$Comp
L power:GND #PWR01
U 1 1 600D49EB
P 5600 4050
F 0 "#PWR01" H 5600 3800 50  0001 C CNN
F 1 "GND" H 5605 3877 50  0000 C CNN
F 2 "" H 5600 4050 50  0001 C CNN
F 3 "" H 5600 4050 50  0001 C CNN
	1    5600 4050
	-1   0    0    1   
$EndComp
$Comp
L power:VBUS #PWR02
U 1 1 600D4B9D
P 5900 4050
F 0 "#PWR02" H 5900 3900 50  0001 C CNN
F 1 "VBUS" H 5915 4223 50  0000 C CNN
F 2 "" H 5900 4050 50  0001 C CNN
F 3 "" H 5900 4050 50  0001 C CNN
	1    5900 4050
	1    0    0    -1  
$EndComp
Text Label 5700 3950 1    50   ~ 0
D+
Text Label 5800 3950 1    50   ~ 0
D-
Wire Wire Line
	5800 3950 5800 4050
Wire Wire Line
	5700 3950 5700 4050
$Comp
L power:GND #PWR04
U 1 1 600DA38F
P 6400 2450
F 0 "#PWR04" H 6400 2200 50  0001 C CNN
F 1 "GND" H 6405 2277 50  0000 C CNN
F 2 "" H 6400 2450 50  0001 C CNN
F 3 "" H 6400 2450 50  0001 C CNN
	1    6400 2450
	1    0    0    -1  
$EndComp
Wire Wire Line
	6400 2350 6400 2400
Wire Wire Line
	6600 2350 6600 2400
Wire Wire Line
	6600 2400 6400 2400
Connection ~ 6400 2400
Wire Wire Line
	6400 2400 6400 2450
Wire Wire Line
	6000 2350 6000 2450
Wire Wire Line
	4600 2350 4600 2450
Wire Wire Line
	5000 2350 5000 2400
Wire Wire Line
	5000 2400 5200 2400
Wire Wire Line
	5200 2400 5200 2350
Connection ~ 5000 2400
Wire Wire Line
	5000 2400 5000 2450
NoConn ~ 4900 2350
Text Notes 1850 2750 0    50   ~ 0
differential lines need length tuning\nneed to check emi concerns as well
Text Notes 2100 3050 0    50   ~ 0
more via stitching probably
NoConn ~ 6000 2450
$EndSCHEMATC
