
(module DFN3X3 (layer F.Cu) (tedit 5FFBF656)
  (descr "")
  (fp_text reference REF** (at -2.2082225 -0.2243425 900) (layer F.SilkS)
    (effects (font (size 0.480744094488 0.480744094488) (thickness 0.015)))
  )
  (fp_text value DFN3X3 (at 0 0) (layer F.Fab)
    (effects (font (size 0.787401574803 0.787401574803) (thickness 0.015)))
  )
  (fp_circle (center 1.8 -2.0) (end 1.95 -2.0) (layer F.SilkS) (width 0.3048))
  (fp_line (start -1.5 -1.5) (end -1.5 1.5) (layer F.SilkS) (width 0.127))
  (fp_line (start -1.5 1.5) (end 1.5 1.5) (layer F.SilkS) (width 0.127))
  (fp_line (start 1.5 1.5) (end 1.5 -1.5) (layer F.SilkS) (width 0.127))
  (fp_line (start 1.5 -1.5) (end -1.5 -1.5) (layer F.SilkS) (width 0.127))
  (pad D1 smd rect (at 0.7275 -0.5475) (size 1.205 2.225) (layers F.Cu F.Mask F.Paste))
  (pad D2 smd rect (at -0.7275 0.5475) (size 1.205 2.225) (layers F.Cu F.Mask F.Paste))
  (pad S2 smd rect (at -0.45 -1.36) (size 0.4 0.58) (layers F.Cu F.Mask F.Paste))
  (pad G2 smd rect (at -1.1 -1.36) (size 0.4 0.58) (layers F.Cu F.Mask F.Paste))
  (pad S1 smd rect (at 0.45 1.36) (size 0.4 0.58) (layers F.Cu F.Mask F.Paste))
  (pad G1 smd rect (at 1.1 1.3601) (size 0.4 0.58) (layers F.Cu F.Mask F.Paste))
  (pad D1A smd rect (at 1.465 0.0) (size 0.37 0.43) (layers F.Cu F.Mask F.Paste))
  (pad D2A smd rect (at -1.465 0.0) (size 0.37 0.43) (layers F.Cu F.Mask F.Paste))
)