(module QFN-16_EP_3x3_Pitch0.5mm (layer F.Cu) (tedit 5E13BE0F)
  (attr smd)
  (fp_text reference REF** (at 0 -2.875) (layer F.SilkS)
    (effects (font (size 1 1) (thickness 0.15)))
  )
  (fp_text value QFN-16_EP_3x3_Pitch0.5mm (at 0 2.875) (layer F.Fab)
    (effects (font (size 1 1) (thickness 0.15)))
  )
  (fp_line (start -0.5 -1.5) (end -1.5 -0.5) (layer F.Fab) (width 0.15))
  (fp_line (start -1.5 -0.5) (end -1.5 1.5) (layer F.Fab) (width 0.15))
  (fp_line (start -1.5 1.5) (end 1.5 1.5) (layer F.Fab) (width 0.15))
  (fp_line (start 1.5 1.5) (end 1.5 -1.5) (layer F.Fab) (width 0.15))
  (fp_line (start 1.5 -1.5) (end -0.5 -1.5) (layer F.Fab) (width 0.15))
  (fp_line (start 1.25 -1.65) (end 1.65 -1.65) (layer F.SilkS) (width 0.15))
  (fp_line (start 1.65 -1.65) (end 1.65 -1.25) (layer F.SilkS) (width 0.15))
  (fp_line (start 1.25 1.65) (end 1.65 1.65) (layer F.SilkS) (width 0.15))
  (fp_line (start 1.65 1.65) (end 1.65 1.25) (layer F.SilkS) (width 0.15))
  (fp_line (start -1.25 1.65) (end -1.65 1.65) (layer F.SilkS) (width 0.15))
  (fp_line (start -1.65 1.65) (end -1.65 1.25) (layer F.SilkS) (width 0.15))
  (fp_line (start -1.25 -1.65) (end -1.875 -1.65) (layer F.SilkS) (width 0.15))
  (fp_line (start -2.15 -2.15) (end 2.15 -2.15) (layer F.CrtYd) (width 0.05))
  (fp_line (start 2.15 -2.15) (end 2.15 2.15) (layer F.CrtYd) (width 0.05))
  (fp_line (start 2.15 2.15) (end -2.15 2.15) (layer F.CrtYd) (width 0.05))
  (fp_line (start -2.15 2.15) (end -2.15 -2.15) (layer F.CrtYd) (width 0.05))
  (pad 1 smd rect (at -1.5 -0.75 90) (size 0.25 0.75) (layers F.Cu F.Paste F.Mask))
  (pad 2 smd rect (at -1.5 -0.25 90) (size 0.25 0.75) (layers F.Cu F.Paste F.Mask))
  (pad 3 smd rect (at -1.5 0.25 90) (size 0.25 0.75) (layers F.Cu F.Paste F.Mask))
  (pad 4 smd rect (at -1.5 0.75 90) (size 0.25 0.75) (layers F.Cu F.Paste F.Mask))
  (pad 5 smd rect (at -0.75 1.5) (size 0.25 0.75) (layers F.Cu F.Paste F.Mask))
  (pad 6 smd rect (at -0.25 1.5) (size 0.25 0.75) (layers F.Cu F.Paste F.Mask))
  (pad 7 smd rect (at 0.25 1.5) (size 0.25 0.75) (layers F.Cu F.Paste F.Mask))
  (pad 8 smd rect (at 0.75 1.5) (size 0.25 0.75) (layers F.Cu F.Paste F.Mask))
  (pad 9 smd rect (at 1.5 0.75 90) (size 0.25 0.75) (layers F.Cu F.Paste F.Mask))
  (pad 10 smd rect (at 1.5 0.25 90) (size 0.25 0.75) (layers F.Cu F.Paste F.Mask))
  (pad 11 smd rect (at 1.5 -0.25 90) (size 0.25 0.75) (layers F.Cu F.Paste F.Mask))
  (pad 12 smd rect (at 1.5 -0.75 90) (size 0.25 0.75) (layers F.Cu F.Paste F.Mask))
  (pad 13 smd rect (at 0.75 -1.5) (size 0.25 0.75) (layers F.Cu F.Paste F.Mask))
  (pad 14 smd rect (at 0.25 -1.5) (size 0.25 0.75) (layers F.Cu F.Paste F.Mask))
  (pad 15 smd rect (at -0.25 -1.5) (size 0.25 0.75) (layers F.Cu F.Paste F.Mask))
  (pad 16 smd rect (at -0.75 -1.5) (size 0.25 0.75) (layers F.Cu F.Paste F.Mask))
  (pad 17 smd rect (at -0.625 0) (size 0.75 1.6) (layers F.Cu F.Paste F.Mask)
    (solder_paste_margin -0.1))
  (pad 17 smd rect (at 0.625 0) (size 0.75 1.6) (layers F.Cu F.Paste F.Mask)
    (solder_paste_margin -0.1))
  (pad 17 thru_hole circle (at -0.625 0.4) (size 0.5 0.5) (drill 0.25) (layers *.Cu *.Mask))
  (pad 17 thru_hole circle (at 0.625 0.4) (size 0.5 0.5) (drill 0.25) (layers *.Cu *.Mask))
  (pad 17 thru_hole circle (at -0.625 -0.4) (size 0.5 0.5) (drill 0.25) (layers *.Cu *.Mask))
  (pad 17 thru_hole circle (at 0.625 -0.4) (size 0.5 0.5) (drill 0.25) (layers *.Cu *.Mask))
)
