(module P120PK (layer F.Cu) (tedit 5E15E5D1)
  (descr "Potentiometer, vertical")
  (fp_text reference REF** (at 0 0.5) (layer F.SilkS)
    (effects (font (size 1 1) (thickness 0.15)))
  )
  (fp_text value P120PK (at 0 -0.5) (layer F.Fab)
    (effects (font (size 1 1) (thickness 0.15)))
  )
  (fp_line (start -6.2 -18) (end 6.2 -18) (layer F.CrtYd) (width 0.12))
  (fp_line (start 6.2 -18) (end 6.2 3) (layer F.CrtYd) (width 0.12))
  (fp_line (start 6.2 3) (end -6.2 3) (layer F.CrtYd) (width 0.12))
  (fp_line (start -6.2 3) (end -6.2 -18) (layer F.CrtYd) (width 0.12))
  (pad 1 thru_hole circle (at -3.25 0) (size 1.762 1.762) (drill 1) (layers *.Cu *.Mask))
  (pad 2 thru_hole circle (at 0 0) (size 1.762 1.762) (drill 1) (layers *.Cu *.Mask))
  (pad 3 thru_hole circle (at 3.25 0) (size 1.762 1.762) (drill 1) (layers *.Cu *.Mask))
  (pad "" np_thru_hole rect (at 5.2 -10) (size 2.526 3.526) (drill oval 1.8 2.8) (layers *.Cu *.Mask))
  (pad "" np_thru_hole rect (at -5.2 -10) (size 2.526 3.526) (drill oval 1.8 2.8) (layers *.Cu *.Mask))
)
