
(module SOT95P280X145-5N (layer F.Cu) (tedit 5FEACBD1)
  (descr "")
  (fp_text reference REF** (at -0.06 -2.508 0) (layer F.SilkS)
    (effects (font (size 0.8 0.8) (thickness 0.015)))
  )
  (fp_text value SOT95P280X145-5N (at 5.528 2.508 0) (layer F.Fab)
    (effects (font (size 0.8 0.8) (thickness 0.015)))
  )
  (fp_circle (center -2.41 -1.05) (end -2.31 -1.05) (layer F.SilkS) (width 0.2))
  (fp_circle (center -2.41 -1.05) (end -2.31 -1.05) (layer F.Fab) (width 0.2))
  (fp_line (start -0.33 -1.45) (end 0.33 -1.45) (layer F.SilkS) (width 0.127))
  (fp_line (start 0.8 -0.335) (end 0.8 0.335) (layer F.SilkS) (width 0.127))
  (fp_line (start 0.33 1.45) (end -0.33 1.45) (layer F.SilkS) (width 0.127))
  (fp_line (start -0.8 1.45) (end -0.8 -1.45) (layer F.Fab) (width 0.127))
  (fp_line (start 0.8 -1.45) (end 0.8 1.45) (layer F.Fab) (width 0.127))
  (fp_line (start -0.8 -1.45) (end 0.8 -1.45) (layer F.Fab) (width 0.127))
  (fp_line (start 0.8 1.45) (end -0.8 1.45) (layer F.Fab) (width 0.127))
  (fp_line (start -2.11 -1.7) (end 2.11 -1.7) (layer F.CrtYd) (width 0.05))
  (fp_line (start 2.11 -1.7) (end 2.11 1.7) (layer F.CrtYd) (width 0.05))
  (fp_line (start 2.11 1.7) (end -2.11 1.7) (layer F.CrtYd) (width 0.05))
  (fp_line (start -2.11 1.7) (end -2.11 -1.7) (layer F.CrtYd) (width 0.05))
  (pad 1 smd rect (at -1.255 -0.95) (size 1.21 0.59) (layers F.Cu F.Mask F.Paste))
  (pad 2 smd rect (at -1.255 0.0) (size 1.21 0.59) (layers F.Cu F.Mask F.Paste))
  (pad 3 smd rect (at -1.255 0.95) (size 1.21 0.59) (layers F.Cu F.Mask F.Paste))
  (pad 4 smd rect (at 1.255 0.95) (size 1.21 0.59) (layers F.Cu F.Mask F.Paste))
  (pad 5 smd rect (at 1.255 -0.95) (size 1.21 0.59) (layers F.Cu F.Mask F.Paste))
)