G04 #@! TF.GenerationSoftware,KiCad,Pcbnew,5.1.5-52549c5~86~ubuntu19.04.1*
G04 #@! TF.CreationDate,2021-01-11T22:22:12-06:00*
G04 #@! TF.ProjectId,actionCam,61637469-6f6e-4436-916d-2e6b69636164,rev?*
G04 #@! TF.SameCoordinates,Original*
G04 #@! TF.FileFunction,Soldermask,Bot*
G04 #@! TF.FilePolarity,Negative*
%FSLAX46Y46*%
G04 Gerber Fmt 4.6, Leading zero omitted, Abs format (unit mm)*
G04 Created by KiCad (PCBNEW 5.1.5-52549c5~86~ubuntu19.04.1) date 2021-01-11 22:22:12*
%MOMM*%
%LPD*%
G04 APERTURE LIST*
%ADD10C,0.100000*%
G04 APERTURE END LIST*
D10*
G36*
X161746564Y-46796889D02*
G01*
X161937833Y-46876115D01*
X161937835Y-46876116D01*
X162109973Y-46991135D01*
X162256365Y-47137527D01*
X162371385Y-47309667D01*
X162450611Y-47500936D01*
X162491000Y-47703984D01*
X162491000Y-47911016D01*
X162450611Y-48114064D01*
X162371385Y-48305333D01*
X162371384Y-48305335D01*
X162256365Y-48477473D01*
X162109973Y-48623865D01*
X161937835Y-48738884D01*
X161937834Y-48738885D01*
X161937833Y-48738885D01*
X161746564Y-48818111D01*
X161543516Y-48858500D01*
X161336484Y-48858500D01*
X161133436Y-48818111D01*
X160942167Y-48738885D01*
X160942166Y-48738885D01*
X160942165Y-48738884D01*
X160770027Y-48623865D01*
X160623635Y-48477473D01*
X160508616Y-48305335D01*
X160508615Y-48305333D01*
X160429389Y-48114064D01*
X160389000Y-47911016D01*
X160389000Y-47703984D01*
X160429389Y-47500936D01*
X160508615Y-47309667D01*
X160623635Y-47137527D01*
X160770027Y-46991135D01*
X160942165Y-46876116D01*
X160942167Y-46876115D01*
X161133436Y-46796889D01*
X161336484Y-46756500D01*
X161543516Y-46756500D01*
X161746564Y-46796889D01*
G37*
G36*
X155246564Y-46796889D02*
G01*
X155437833Y-46876115D01*
X155437835Y-46876116D01*
X155609973Y-46991135D01*
X155756365Y-47137527D01*
X155871385Y-47309667D01*
X155950611Y-47500936D01*
X155991000Y-47703984D01*
X155991000Y-47911016D01*
X155950611Y-48114064D01*
X155871385Y-48305333D01*
X155871384Y-48305335D01*
X155756365Y-48477473D01*
X155609973Y-48623865D01*
X155437835Y-48738884D01*
X155437834Y-48738885D01*
X155437833Y-48738885D01*
X155246564Y-48818111D01*
X155043516Y-48858500D01*
X154836484Y-48858500D01*
X154633436Y-48818111D01*
X154442167Y-48738885D01*
X154442166Y-48738885D01*
X154442165Y-48738884D01*
X154270027Y-48623865D01*
X154123635Y-48477473D01*
X154008616Y-48305335D01*
X154008615Y-48305333D01*
X153929389Y-48114064D01*
X153889000Y-47911016D01*
X153889000Y-47703984D01*
X153929389Y-47500936D01*
X154008615Y-47309667D01*
X154123635Y-47137527D01*
X154270027Y-46991135D01*
X154442165Y-46876116D01*
X154442167Y-46876115D01*
X154633436Y-46796889D01*
X154836484Y-46756500D01*
X155043516Y-46756500D01*
X155246564Y-46796889D01*
G37*
G36*
X149681564Y-42415640D02*
G01*
X149872833Y-42494866D01*
X149872835Y-42494867D01*
X150044973Y-42609886D01*
X150191365Y-42756278D01*
X150306385Y-42928418D01*
X150385611Y-43119687D01*
X150426000Y-43322735D01*
X150426000Y-43529767D01*
X150385611Y-43732815D01*
X150355573Y-43805333D01*
X150306384Y-43924086D01*
X150191365Y-44096224D01*
X150044973Y-44242616D01*
X149872835Y-44357635D01*
X149872834Y-44357636D01*
X149872833Y-44357636D01*
X149681564Y-44436862D01*
X149478516Y-44477251D01*
X149271484Y-44477251D01*
X149068436Y-44436862D01*
X148877167Y-44357636D01*
X148877166Y-44357636D01*
X148877165Y-44357635D01*
X148705027Y-44242616D01*
X148558635Y-44096224D01*
X148443616Y-43924086D01*
X148394427Y-43805333D01*
X148364389Y-43732815D01*
X148324000Y-43529767D01*
X148324000Y-43322735D01*
X148364389Y-43119687D01*
X148443615Y-42928418D01*
X148558635Y-42756278D01*
X148705027Y-42609886D01*
X148877165Y-42494867D01*
X148877167Y-42494866D01*
X149068436Y-42415640D01*
X149271484Y-42375251D01*
X149478516Y-42375251D01*
X149681564Y-42415640D01*
G37*
G36*
X143181564Y-42415640D02*
G01*
X143372833Y-42494866D01*
X143372835Y-42494867D01*
X143544973Y-42609886D01*
X143691365Y-42756278D01*
X143806385Y-42928418D01*
X143885611Y-43119687D01*
X143926000Y-43322735D01*
X143926000Y-43529767D01*
X143885611Y-43732815D01*
X143855573Y-43805333D01*
X143806384Y-43924086D01*
X143691365Y-44096224D01*
X143544973Y-44242616D01*
X143372835Y-44357635D01*
X143372834Y-44357636D01*
X143372833Y-44357636D01*
X143181564Y-44436862D01*
X142978516Y-44477251D01*
X142771484Y-44477251D01*
X142568436Y-44436862D01*
X142377167Y-44357636D01*
X142377166Y-44357636D01*
X142377165Y-44357635D01*
X142205027Y-44242616D01*
X142058635Y-44096224D01*
X141943616Y-43924086D01*
X141894427Y-43805333D01*
X141864389Y-43732815D01*
X141824000Y-43529767D01*
X141824000Y-43322735D01*
X141864389Y-43119687D01*
X141943615Y-42928418D01*
X142058635Y-42756278D01*
X142205027Y-42609886D01*
X142377165Y-42494867D01*
X142377167Y-42494866D01*
X142568436Y-42415640D01*
X142771484Y-42375251D01*
X142978516Y-42375251D01*
X143181564Y-42415640D01*
G37*
G36*
X155246564Y-42296889D02*
G01*
X155435747Y-42375251D01*
X155437835Y-42376116D01*
X155496988Y-42415641D01*
X155609973Y-42491135D01*
X155756365Y-42637527D01*
X155871385Y-42809667D01*
X155950611Y-43000936D01*
X155991000Y-43203984D01*
X155991000Y-43411016D01*
X155950611Y-43614064D01*
X155901423Y-43732815D01*
X155871384Y-43805335D01*
X155756365Y-43977473D01*
X155609973Y-44123865D01*
X155437835Y-44238884D01*
X155437834Y-44238885D01*
X155437833Y-44238885D01*
X155246564Y-44318111D01*
X155043516Y-44358500D01*
X154836484Y-44358500D01*
X154633436Y-44318111D01*
X154442167Y-44238885D01*
X154442166Y-44238885D01*
X154442165Y-44238884D01*
X154270027Y-44123865D01*
X154123635Y-43977473D01*
X154008616Y-43805335D01*
X153978577Y-43732815D01*
X153929389Y-43614064D01*
X153889000Y-43411016D01*
X153889000Y-43203984D01*
X153929389Y-43000936D01*
X154008615Y-42809667D01*
X154123635Y-42637527D01*
X154270027Y-42491135D01*
X154383012Y-42415641D01*
X154442165Y-42376116D01*
X154444253Y-42375251D01*
X154633436Y-42296889D01*
X154836484Y-42256500D01*
X155043516Y-42256500D01*
X155246564Y-42296889D01*
G37*
G36*
X161746564Y-42296889D02*
G01*
X161935747Y-42375251D01*
X161937835Y-42376116D01*
X161996988Y-42415641D01*
X162109973Y-42491135D01*
X162256365Y-42637527D01*
X162371385Y-42809667D01*
X162450611Y-43000936D01*
X162491000Y-43203984D01*
X162491000Y-43411016D01*
X162450611Y-43614064D01*
X162401423Y-43732815D01*
X162371384Y-43805335D01*
X162256365Y-43977473D01*
X162109973Y-44123865D01*
X161937835Y-44238884D01*
X161937834Y-44238885D01*
X161937833Y-44238885D01*
X161746564Y-44318111D01*
X161543516Y-44358500D01*
X161336484Y-44358500D01*
X161133436Y-44318111D01*
X160942167Y-44238885D01*
X160942166Y-44238885D01*
X160942165Y-44238884D01*
X160770027Y-44123865D01*
X160623635Y-43977473D01*
X160508616Y-43805335D01*
X160478577Y-43732815D01*
X160429389Y-43614064D01*
X160389000Y-43411016D01*
X160389000Y-43203984D01*
X160429389Y-43000936D01*
X160508615Y-42809667D01*
X160623635Y-42637527D01*
X160770027Y-42491135D01*
X160883012Y-42415641D01*
X160942165Y-42376116D01*
X160944253Y-42375251D01*
X161133436Y-42296889D01*
X161336484Y-42256500D01*
X161543516Y-42256500D01*
X161746564Y-42296889D01*
G37*
G36*
X161746564Y-38034390D02*
G01*
X161937833Y-38113616D01*
X161937835Y-38113617D01*
X162109973Y-38228636D01*
X162256365Y-38375028D01*
X162371385Y-38547168D01*
X162450611Y-38738437D01*
X162491000Y-38941485D01*
X162491000Y-39148517D01*
X162450611Y-39351565D01*
X162371385Y-39542834D01*
X162371384Y-39542836D01*
X162256365Y-39714974D01*
X162109973Y-39861366D01*
X161937835Y-39976385D01*
X161937834Y-39976386D01*
X161937833Y-39976386D01*
X161746564Y-40055612D01*
X161543516Y-40096001D01*
X161336484Y-40096001D01*
X161133436Y-40055612D01*
X160942167Y-39976386D01*
X160942166Y-39976386D01*
X160942165Y-39976385D01*
X160770027Y-39861366D01*
X160623635Y-39714974D01*
X160508616Y-39542836D01*
X160508615Y-39542834D01*
X160429389Y-39351565D01*
X160389000Y-39148517D01*
X160389000Y-38941485D01*
X160429389Y-38738437D01*
X160508615Y-38547168D01*
X160623635Y-38375028D01*
X160770027Y-38228636D01*
X160942165Y-38113617D01*
X160942167Y-38113616D01*
X161133436Y-38034390D01*
X161336484Y-37994001D01*
X161543516Y-37994001D01*
X161746564Y-38034390D01*
G37*
G36*
X155246564Y-38034390D02*
G01*
X155437833Y-38113616D01*
X155437835Y-38113617D01*
X155609973Y-38228636D01*
X155756365Y-38375028D01*
X155871385Y-38547168D01*
X155950611Y-38738437D01*
X155991000Y-38941485D01*
X155991000Y-39148517D01*
X155950611Y-39351565D01*
X155871385Y-39542834D01*
X155871384Y-39542836D01*
X155756365Y-39714974D01*
X155609973Y-39861366D01*
X155437835Y-39976385D01*
X155437834Y-39976386D01*
X155437833Y-39976386D01*
X155246564Y-40055612D01*
X155043516Y-40096001D01*
X154836484Y-40096001D01*
X154633436Y-40055612D01*
X154442167Y-39976386D01*
X154442166Y-39976386D01*
X154442165Y-39976385D01*
X154270027Y-39861366D01*
X154123635Y-39714974D01*
X154008616Y-39542836D01*
X154008615Y-39542834D01*
X153929389Y-39351565D01*
X153889000Y-39148517D01*
X153889000Y-38941485D01*
X153929389Y-38738437D01*
X154008615Y-38547168D01*
X154123635Y-38375028D01*
X154270027Y-38228636D01*
X154442165Y-38113617D01*
X154442167Y-38113616D01*
X154633436Y-38034390D01*
X154836484Y-37994001D01*
X155043516Y-37994001D01*
X155246564Y-38034390D01*
G37*
G36*
X149681564Y-37915640D02*
G01*
X149872833Y-37994866D01*
X149872835Y-37994867D01*
X150044973Y-38109886D01*
X150191365Y-38256278D01*
X150306385Y-38428418D01*
X150385611Y-38619687D01*
X150426000Y-38822735D01*
X150426000Y-39029767D01*
X150385611Y-39232815D01*
X150336423Y-39351565D01*
X150306384Y-39424086D01*
X150191365Y-39596224D01*
X150044973Y-39742616D01*
X149872835Y-39857635D01*
X149872834Y-39857636D01*
X149872833Y-39857636D01*
X149681564Y-39936862D01*
X149478516Y-39977251D01*
X149271484Y-39977251D01*
X149068436Y-39936862D01*
X148877167Y-39857636D01*
X148877166Y-39857636D01*
X148877165Y-39857635D01*
X148705027Y-39742616D01*
X148558635Y-39596224D01*
X148443616Y-39424086D01*
X148413577Y-39351565D01*
X148364389Y-39232815D01*
X148324000Y-39029767D01*
X148324000Y-38822735D01*
X148364389Y-38619687D01*
X148443615Y-38428418D01*
X148558635Y-38256278D01*
X148705027Y-38109886D01*
X148877165Y-37994867D01*
X148877167Y-37994866D01*
X149068436Y-37915640D01*
X149271484Y-37875251D01*
X149478516Y-37875251D01*
X149681564Y-37915640D01*
G37*
G36*
X143181564Y-37915640D02*
G01*
X143372833Y-37994866D01*
X143372835Y-37994867D01*
X143544973Y-38109886D01*
X143691365Y-38256278D01*
X143806385Y-38428418D01*
X143885611Y-38619687D01*
X143926000Y-38822735D01*
X143926000Y-39029767D01*
X143885611Y-39232815D01*
X143836423Y-39351565D01*
X143806384Y-39424086D01*
X143691365Y-39596224D01*
X143544973Y-39742616D01*
X143372835Y-39857635D01*
X143372834Y-39857636D01*
X143372833Y-39857636D01*
X143181564Y-39936862D01*
X142978516Y-39977251D01*
X142771484Y-39977251D01*
X142568436Y-39936862D01*
X142377167Y-39857636D01*
X142377166Y-39857636D01*
X142377165Y-39857635D01*
X142205027Y-39742616D01*
X142058635Y-39596224D01*
X141943616Y-39424086D01*
X141913577Y-39351565D01*
X141864389Y-39232815D01*
X141824000Y-39029767D01*
X141824000Y-38822735D01*
X141864389Y-38619687D01*
X141943615Y-38428418D01*
X142058635Y-38256278D01*
X142205027Y-38109886D01*
X142377165Y-37994867D01*
X142377167Y-37994866D01*
X142568436Y-37915640D01*
X142771484Y-37875251D01*
X142978516Y-37875251D01*
X143181564Y-37915640D01*
G37*
G36*
X155246564Y-33534390D02*
G01*
X155437833Y-33613616D01*
X155437835Y-33613617D01*
X155609973Y-33728636D01*
X155756365Y-33875028D01*
X155871385Y-34047168D01*
X155950611Y-34238437D01*
X155991000Y-34441485D01*
X155991000Y-34648517D01*
X155950611Y-34851565D01*
X155871385Y-35042834D01*
X155871384Y-35042836D01*
X155756365Y-35214974D01*
X155609973Y-35361366D01*
X155437835Y-35476385D01*
X155437834Y-35476386D01*
X155437833Y-35476386D01*
X155246564Y-35555612D01*
X155043516Y-35596001D01*
X154836484Y-35596001D01*
X154633436Y-35555612D01*
X154442167Y-35476386D01*
X154442166Y-35476386D01*
X154442165Y-35476385D01*
X154270027Y-35361366D01*
X154123635Y-35214974D01*
X154008616Y-35042836D01*
X154008615Y-35042834D01*
X153929389Y-34851565D01*
X153889000Y-34648517D01*
X153889000Y-34441485D01*
X153929389Y-34238437D01*
X154008615Y-34047168D01*
X154123635Y-33875028D01*
X154270027Y-33728636D01*
X154442165Y-33613617D01*
X154442167Y-33613616D01*
X154633436Y-33534390D01*
X154836484Y-33494001D01*
X155043516Y-33494001D01*
X155246564Y-33534390D01*
G37*
G36*
X161746564Y-33534390D02*
G01*
X161937833Y-33613616D01*
X161937835Y-33613617D01*
X162109973Y-33728636D01*
X162256365Y-33875028D01*
X162371385Y-34047168D01*
X162450611Y-34238437D01*
X162491000Y-34441485D01*
X162491000Y-34648517D01*
X162450611Y-34851565D01*
X162371385Y-35042834D01*
X162371384Y-35042836D01*
X162256365Y-35214974D01*
X162109973Y-35361366D01*
X161937835Y-35476385D01*
X161937834Y-35476386D01*
X161937833Y-35476386D01*
X161746564Y-35555612D01*
X161543516Y-35596001D01*
X161336484Y-35596001D01*
X161133436Y-35555612D01*
X160942167Y-35476386D01*
X160942166Y-35476386D01*
X160942165Y-35476385D01*
X160770027Y-35361366D01*
X160623635Y-35214974D01*
X160508616Y-35042836D01*
X160508615Y-35042834D01*
X160429389Y-34851565D01*
X160389000Y-34648517D01*
X160389000Y-34441485D01*
X160429389Y-34238437D01*
X160508615Y-34047168D01*
X160623635Y-33875028D01*
X160770027Y-33728636D01*
X160942165Y-33613617D01*
X160942167Y-33613616D01*
X161133436Y-33534390D01*
X161336484Y-33494001D01*
X161543516Y-33494001D01*
X161746564Y-33534390D01*
G37*
G36*
X146316000Y-30746000D02*
G01*
X144514000Y-30746000D01*
X144514000Y-28944000D01*
X146316000Y-28944000D01*
X146316000Y-30746000D01*
G37*
G36*
X155688512Y-28948927D02*
G01*
X155837812Y-28978624D01*
X156001784Y-29046544D01*
X156149354Y-29145147D01*
X156274853Y-29270646D01*
X156373456Y-29418216D01*
X156441376Y-29582188D01*
X156476000Y-29756259D01*
X156476000Y-29933741D01*
X156441376Y-30107812D01*
X156373456Y-30271784D01*
X156274853Y-30419354D01*
X156149354Y-30544853D01*
X156001784Y-30643456D01*
X155837812Y-30711376D01*
X155688512Y-30741073D01*
X155663742Y-30746000D01*
X155486258Y-30746000D01*
X155461488Y-30741073D01*
X155312188Y-30711376D01*
X155148216Y-30643456D01*
X155000646Y-30544853D01*
X154875147Y-30419354D01*
X154776544Y-30271784D01*
X154708624Y-30107812D01*
X154674000Y-29933741D01*
X154674000Y-29756259D01*
X154708624Y-29582188D01*
X154776544Y-29418216D01*
X154875147Y-29270646D01*
X155000646Y-29145147D01*
X155148216Y-29046544D01*
X155312188Y-28978624D01*
X155461488Y-28948927D01*
X155486258Y-28944000D01*
X155663742Y-28944000D01*
X155688512Y-28948927D01*
G37*
G36*
X153148512Y-28948927D02*
G01*
X153297812Y-28978624D01*
X153461784Y-29046544D01*
X153609354Y-29145147D01*
X153734853Y-29270646D01*
X153833456Y-29418216D01*
X153901376Y-29582188D01*
X153936000Y-29756259D01*
X153936000Y-29933741D01*
X153901376Y-30107812D01*
X153833456Y-30271784D01*
X153734853Y-30419354D01*
X153609354Y-30544853D01*
X153461784Y-30643456D01*
X153297812Y-30711376D01*
X153148512Y-30741073D01*
X153123742Y-30746000D01*
X152946258Y-30746000D01*
X152921488Y-30741073D01*
X152772188Y-30711376D01*
X152608216Y-30643456D01*
X152460646Y-30544853D01*
X152335147Y-30419354D01*
X152236544Y-30271784D01*
X152168624Y-30107812D01*
X152134000Y-29933741D01*
X152134000Y-29756259D01*
X152168624Y-29582188D01*
X152236544Y-29418216D01*
X152335147Y-29270646D01*
X152460646Y-29145147D01*
X152608216Y-29046544D01*
X152772188Y-28978624D01*
X152921488Y-28948927D01*
X152946258Y-28944000D01*
X153123742Y-28944000D01*
X153148512Y-28948927D01*
G37*
G36*
X150608512Y-28948927D02*
G01*
X150757812Y-28978624D01*
X150921784Y-29046544D01*
X151069354Y-29145147D01*
X151194853Y-29270646D01*
X151293456Y-29418216D01*
X151361376Y-29582188D01*
X151396000Y-29756259D01*
X151396000Y-29933741D01*
X151361376Y-30107812D01*
X151293456Y-30271784D01*
X151194853Y-30419354D01*
X151069354Y-30544853D01*
X150921784Y-30643456D01*
X150757812Y-30711376D01*
X150608512Y-30741073D01*
X150583742Y-30746000D01*
X150406258Y-30746000D01*
X150381488Y-30741073D01*
X150232188Y-30711376D01*
X150068216Y-30643456D01*
X149920646Y-30544853D01*
X149795147Y-30419354D01*
X149696544Y-30271784D01*
X149628624Y-30107812D01*
X149594000Y-29933741D01*
X149594000Y-29756259D01*
X149628624Y-29582188D01*
X149696544Y-29418216D01*
X149795147Y-29270646D01*
X149920646Y-29145147D01*
X150068216Y-29046544D01*
X150232188Y-28978624D01*
X150381488Y-28948927D01*
X150406258Y-28944000D01*
X150583742Y-28944000D01*
X150608512Y-28948927D01*
G37*
G36*
X148068512Y-28948927D02*
G01*
X148217812Y-28978624D01*
X148381784Y-29046544D01*
X148529354Y-29145147D01*
X148654853Y-29270646D01*
X148753456Y-29418216D01*
X148821376Y-29582188D01*
X148856000Y-29756259D01*
X148856000Y-29933741D01*
X148821376Y-30107812D01*
X148753456Y-30271784D01*
X148654853Y-30419354D01*
X148529354Y-30544853D01*
X148381784Y-30643456D01*
X148217812Y-30711376D01*
X148068512Y-30741073D01*
X148043742Y-30746000D01*
X147866258Y-30746000D01*
X147841488Y-30741073D01*
X147692188Y-30711376D01*
X147528216Y-30643456D01*
X147380646Y-30544853D01*
X147255147Y-30419354D01*
X147156544Y-30271784D01*
X147088624Y-30107812D01*
X147054000Y-29933741D01*
X147054000Y-29756259D01*
X147088624Y-29582188D01*
X147156544Y-29418216D01*
X147255147Y-29270646D01*
X147380646Y-29145147D01*
X147528216Y-29046544D01*
X147692188Y-28978624D01*
X147841488Y-28948927D01*
X147866258Y-28944000D01*
X148043742Y-28944000D01*
X148068512Y-28948927D01*
G37*
G36*
X145528512Y-26408927D02*
G01*
X145677812Y-26438624D01*
X145841784Y-26506544D01*
X145989354Y-26605147D01*
X146114853Y-26730646D01*
X146213456Y-26878216D01*
X146281376Y-27042188D01*
X146316000Y-27216259D01*
X146316000Y-27393741D01*
X146281376Y-27567812D01*
X146213456Y-27731784D01*
X146114853Y-27879354D01*
X145989354Y-28004853D01*
X145841784Y-28103456D01*
X145677812Y-28171376D01*
X145528512Y-28201073D01*
X145503742Y-28206000D01*
X145326258Y-28206000D01*
X145301488Y-28201073D01*
X145152188Y-28171376D01*
X144988216Y-28103456D01*
X144840646Y-28004853D01*
X144715147Y-27879354D01*
X144616544Y-27731784D01*
X144548624Y-27567812D01*
X144514000Y-27393741D01*
X144514000Y-27216259D01*
X144548624Y-27042188D01*
X144616544Y-26878216D01*
X144715147Y-26730646D01*
X144840646Y-26605147D01*
X144988216Y-26506544D01*
X145152188Y-26438624D01*
X145301488Y-26408927D01*
X145326258Y-26404000D01*
X145503742Y-26404000D01*
X145528512Y-26408927D01*
G37*
G36*
X153148512Y-26408927D02*
G01*
X153297812Y-26438624D01*
X153461784Y-26506544D01*
X153609354Y-26605147D01*
X153734853Y-26730646D01*
X153833456Y-26878216D01*
X153901376Y-27042188D01*
X153936000Y-27216259D01*
X153936000Y-27393741D01*
X153901376Y-27567812D01*
X153833456Y-27731784D01*
X153734853Y-27879354D01*
X153609354Y-28004853D01*
X153461784Y-28103456D01*
X153297812Y-28171376D01*
X153148512Y-28201073D01*
X153123742Y-28206000D01*
X152946258Y-28206000D01*
X152921488Y-28201073D01*
X152772188Y-28171376D01*
X152608216Y-28103456D01*
X152460646Y-28004853D01*
X152335147Y-27879354D01*
X152236544Y-27731784D01*
X152168624Y-27567812D01*
X152134000Y-27393741D01*
X152134000Y-27216259D01*
X152168624Y-27042188D01*
X152236544Y-26878216D01*
X152335147Y-26730646D01*
X152460646Y-26605147D01*
X152608216Y-26506544D01*
X152772188Y-26438624D01*
X152921488Y-26408927D01*
X152946258Y-26404000D01*
X153123742Y-26404000D01*
X153148512Y-26408927D01*
G37*
G36*
X155688512Y-26408927D02*
G01*
X155837812Y-26438624D01*
X156001784Y-26506544D01*
X156149354Y-26605147D01*
X156274853Y-26730646D01*
X156373456Y-26878216D01*
X156441376Y-27042188D01*
X156476000Y-27216259D01*
X156476000Y-27393741D01*
X156441376Y-27567812D01*
X156373456Y-27731784D01*
X156274853Y-27879354D01*
X156149354Y-28004853D01*
X156001784Y-28103456D01*
X155837812Y-28171376D01*
X155688512Y-28201073D01*
X155663742Y-28206000D01*
X155486258Y-28206000D01*
X155461488Y-28201073D01*
X155312188Y-28171376D01*
X155148216Y-28103456D01*
X155000646Y-28004853D01*
X154875147Y-27879354D01*
X154776544Y-27731784D01*
X154708624Y-27567812D01*
X154674000Y-27393741D01*
X154674000Y-27216259D01*
X154708624Y-27042188D01*
X154776544Y-26878216D01*
X154875147Y-26730646D01*
X155000646Y-26605147D01*
X155148216Y-26506544D01*
X155312188Y-26438624D01*
X155461488Y-26408927D01*
X155486258Y-26404000D01*
X155663742Y-26404000D01*
X155688512Y-26408927D01*
G37*
G36*
X148068512Y-26408927D02*
G01*
X148217812Y-26438624D01*
X148381784Y-26506544D01*
X148529354Y-26605147D01*
X148654853Y-26730646D01*
X148753456Y-26878216D01*
X148821376Y-27042188D01*
X148856000Y-27216259D01*
X148856000Y-27393741D01*
X148821376Y-27567812D01*
X148753456Y-27731784D01*
X148654853Y-27879354D01*
X148529354Y-28004853D01*
X148381784Y-28103456D01*
X148217812Y-28171376D01*
X148068512Y-28201073D01*
X148043742Y-28206000D01*
X147866258Y-28206000D01*
X147841488Y-28201073D01*
X147692188Y-28171376D01*
X147528216Y-28103456D01*
X147380646Y-28004853D01*
X147255147Y-27879354D01*
X147156544Y-27731784D01*
X147088624Y-27567812D01*
X147054000Y-27393741D01*
X147054000Y-27216259D01*
X147088624Y-27042188D01*
X147156544Y-26878216D01*
X147255147Y-26730646D01*
X147380646Y-26605147D01*
X147528216Y-26506544D01*
X147692188Y-26438624D01*
X147841488Y-26408927D01*
X147866258Y-26404000D01*
X148043742Y-26404000D01*
X148068512Y-26408927D01*
G37*
G36*
X150608512Y-26408927D02*
G01*
X150757812Y-26438624D01*
X150921784Y-26506544D01*
X151069354Y-26605147D01*
X151194853Y-26730646D01*
X151293456Y-26878216D01*
X151361376Y-27042188D01*
X151396000Y-27216259D01*
X151396000Y-27393741D01*
X151361376Y-27567812D01*
X151293456Y-27731784D01*
X151194853Y-27879354D01*
X151069354Y-28004853D01*
X150921784Y-28103456D01*
X150757812Y-28171376D01*
X150608512Y-28201073D01*
X150583742Y-28206000D01*
X150406258Y-28206000D01*
X150381488Y-28201073D01*
X150232188Y-28171376D01*
X150068216Y-28103456D01*
X149920646Y-28004853D01*
X149795147Y-27879354D01*
X149696544Y-27731784D01*
X149628624Y-27567812D01*
X149594000Y-27393741D01*
X149594000Y-27216259D01*
X149628624Y-27042188D01*
X149696544Y-26878216D01*
X149795147Y-26730646D01*
X149920646Y-26605147D01*
X150068216Y-26506544D01*
X150232188Y-26438624D01*
X150381488Y-26408927D01*
X150406258Y-26404000D01*
X150583742Y-26404000D01*
X150608512Y-26408927D01*
G37*
M02*
