EESchema Schematic File Version 4
LIBS:pylon-cache
EELAYER 29 0
EELAYER END
$Descr A4 11693 8268
encoding utf-8
Sheet 1 1
Title ""
Date ""
Rev ""
Comp ""
Comment1 ""
Comment2 ""
Comment3 ""
Comment4 ""
$EndDescr
$Comp
L power:GND #PWR05
U 1 1 5DDCF9AB
P 3350 3350
F 0 "#PWR05" H 3350 3100 50  0001 C CNN
F 1 "GND" H 3355 3177 50  0000 C CNN
F 2 "" H 3350 3350 50  0001 C CNN
F 3 "" H 3350 3350 50  0001 C CNN
	1    3350 3350
	1    0    0    -1  
$EndComp
$Comp
L power:+5V #PWR04
U 1 1 5DDD0266
P 3350 1550
F 0 "#PWR04" H 3350 1400 50  0001 C CNN
F 1 "+5V" H 3365 1723 50  0000 C CNN
F 2 "" H 3350 1550 50  0001 C CNN
F 3 "" H 3350 1550 50  0001 C CNN
	1    3350 1550
	1    0    0    -1  
$EndComp
$Comp
L Device:C C1
U 1 1 5E06ACA2
P 5200 2150
F 0 "C1" H 5315 2196 50  0000 L CNN
F 1 "1u" H 5315 2105 50  0000 L CNN
F 2 "Capacitor_SMD:C_0402_1005Metric" H 5238 2000 50  0001 C CNN
F 3 "~" H 5200 2150 50  0001 C CNN
	1    5200 2150
	1    0    0    -1  
$EndComp
$Comp
L Device:C C3
U 1 1 5E06ADE4
P 5500 2150
F 0 "C3" H 5615 2196 50  0000 L CNN
F 1 "0.1u" H 5615 2105 50  0000 L CNN
F 2 "Capacitor_SMD:C_0402_1005Metric" H 5538 2000 50  0001 C CNN
F 3 "~" H 5500 2150 50  0001 C CNN
	1    5500 2150
	1    0    0    -1  
$EndComp
$Comp
L power:+5V #PWR030
U 1 1 5E06C06F
P 5350 1900
F 0 "#PWR030" H 5350 1750 50  0001 C CNN
F 1 "+5V" H 5365 2073 50  0000 C CNN
F 2 "" H 5350 1900 50  0001 C CNN
F 3 "" H 5350 1900 50  0001 C CNN
	1    5350 1900
	1    0    0    -1  
$EndComp
Wire Wire Line
	5200 2000 5350 2000
Connection ~ 5350 2000
Wire Wire Line
	5350 2000 5500 2000
Wire Wire Line
	5200 2300 5350 2300
$Comp
L power:GND #PWR031
U 1 1 5E06DC4F
P 5350 2400
F 0 "#PWR031" H 5350 2150 50  0001 C CNN
F 1 "GND" H 5355 2227 50  0000 C CNN
F 2 "" H 5350 2400 50  0001 C CNN
F 3 "" H 5350 2400 50  0001 C CNN
	1    5350 2400
	1    0    0    -1  
$EndComp
Connection ~ 5350 2300
Wire Wire Line
	5350 2300 5500 2300
Wire Wire Line
	5350 2000 5350 1900
Wire Wire Line
	5350 2300 5350 2400
$Comp
L pylon-rescue:AP3012-modLEDs_common U2
U 1 1 5E58DB03
P 2550 4550
F 0 "U2" H 2550 4915 50  0000 C CNN
F 1 "AP3012" H 2550 4824 50  0000 C CNN
F 2 "Package_TO_SOT_SMD:SOT-23-5" H 2200 4400 50  0001 C CNN
F 3 "" H 2200 4400 50  0001 C CNN
	1    2550 4550
	1    0    0    -1  
$EndComp
$Comp
L pylon-rescue:BCR420UW6-modLEDs_common U3
U 1 1 5E58E179
P 6200 4250
F 0 "U3" H 6200 4565 50  0000 C CNN
F 1 "BCR420UW6" H 6200 4474 50  0000 C CNN
F 2 "BCR420UW6:SOT95P280X140-6N" H 6200 4250 50  0001 C CNN
F 3 "" H 6200 4250 50  0001 C CNN
	1    6200 4250
	1    0    0    -1  
$EndComp
$Comp
L Device:C C4
U 1 1 5E59C1DF
P 1750 4850
F 0 "C4" H 1865 4896 50  0000 L CNN
F 1 "1u" H 1865 4805 50  0000 L CNN
F 2 "Capacitor_SMD:C_0402_1005Metric" H 1788 4700 50  0001 C CNN
F 3 "~" H 1750 4850 50  0001 C CNN
	1    1750 4850
	1    0    0    -1  
$EndComp
$Comp
L Device:C C5
U 1 1 5E59D154
P 3550 4850
F 0 "C5" H 3665 4896 50  0000 L CNN
F 1 "1u" H 3665 4805 50  0000 L CNN
F 2 "Capacitor_SMD:C_0402_1005Metric" H 3588 4700 50  0001 C CNN
F 3 "~" H 3550 4850 50  0001 C CNN
	1    3550 4850
	1    0    0    -1  
$EndComp
$Comp
L Device:R R1
U 1 1 5E59E542
P 3200 4550
F 0 "R1" H 3270 4596 50  0000 L CNN
F 1 "72k" H 3270 4505 50  0000 L CNN
F 2 "Resistor_SMD:R_0402_1005Metric" V 3130 4550 50  0001 C CNN
F 3 "~" H 3200 4550 50  0001 C CNN
	1    3200 4550
	1    0    0    -1  
$EndComp
$Comp
L Device:R R2
U 1 1 5E59ED2D
P 3200 4850
F 0 "R2" H 3270 4896 50  0000 L CNN
F 1 "5k" H 3270 4805 50  0000 L CNN
F 2 "Resistor_SMD:R_0402_1005Metric" V 3130 4850 50  0001 C CNN
F 3 "~" H 3200 4850 50  0001 C CNN
	1    3200 4850
	1    0    0    -1  
$EndComp
$Comp
L Device:L L1
U 1 1 5E59F497
P 2550 4050
F 0 "L1" V 2740 4050 50  0000 C CNN
F 1 "10uH" V 2649 4050 50  0000 C CNN
F 2 "Inductor_SMD:L_Taiyo-Yuden_MD-3030" H 2550 4050 50  0001 C CNN
F 3 "~" H 2550 4050 50  0001 C CNN
	1    2550 4050
	0    -1   -1   0   
$EndComp
$Comp
L Diode:1N5819 D1
U 1 1 5E59FD27
P 3050 4050
F 0 "D1" H 3050 3834 50  0000 C CNN
F 1 "1N5819" H 3050 3925 50  0000 C CNN
F 2 "Diode_SMD:D_SOD-123" H 3050 3875 50  0001 C CNN
F 3 "http://www.vishay.com/docs/88525/1n5817.pdf" H 3050 4050 50  0001 C CNN
	1    3050 4050
	-1   0    0    1   
$EndComp
$Comp
L power:GND #PWR0101
U 1 1 5E5ACF08
P 2550 5150
F 0 "#PWR0101" H 2550 4900 50  0001 C CNN
F 1 "GND" V 2550 4900 50  0000 C CNN
F 2 "" H 2550 5150 50  0001 C CNN
F 3 "" H 2550 5150 50  0001 C CNN
	1    2550 5150
	1    0    0    -1  
$EndComp
Wire Wire Line
	2100 4700 1750 4700
Wire Wire Line
	2550 4900 2550 5100
Wire Wire Line
	1750 5000 1750 5100
Wire Wire Line
	1750 5100 2550 5100
Connection ~ 2550 5100
Wire Wire Line
	2550 5100 2550 5150
Wire Wire Line
	3200 5100 2550 5100
Wire Wire Line
	3200 5000 3200 5100
Wire Wire Line
	3000 4700 3200 4700
Connection ~ 3200 4700
Wire Wire Line
	2400 4050 2350 4050
Wire Wire Line
	2350 4050 2350 4300
Wire Wire Line
	2700 4050 2750 4050
Wire Wire Line
	2750 4050 2750 4300
Wire Wire Line
	3200 4050 3200 4400
Wire Wire Line
	2750 4050 2900 4050
Connection ~ 2750 4050
Wire Wire Line
	3200 4050 3550 4050
Wire Wire Line
	3550 4050 3550 4700
Connection ~ 3200 4050
Wire Wire Line
	3550 5000 3550 5100
Wire Wire Line
	3550 5100 3200 5100
Connection ~ 3200 5100
Wire Wire Line
	3550 4050 3750 4050
Connection ~ 3550 4050
Wire Wire Line
	2350 4050 1750 4050
Wire Wire Line
	1750 4050 1750 4700
Connection ~ 2350 4050
Connection ~ 1750 4700
Wire Wire Line
	1750 4050 1550 4050
Connection ~ 1750 4050
Text Label 3750 4050 2    50   ~ 0
18V
$Comp
L power:GND #PWR0102
U 1 1 5E5D60CA
P 6200 4650
F 0 "#PWR0102" H 6200 4400 50  0001 C CNN
F 1 "GND" V 6200 4400 50  0000 C CNN
F 2 "" H 6200 4650 50  0001 C CNN
F 3 "" H 6200 4650 50  0001 C CNN
	1    6200 4650
	1    0    0    -1  
$EndComp
Text Notes 4050 4400 0    50   ~ 0
VOUT should be (6V * 3 = 18V)\nVOUT = 1.25* (1+R1/R2)\n18 = 1.25 * (1 + R1/R2)\nR1/R2 = 14.4\n72k/5k = 14.4
Text Label 5850 4200 2    50   ~ 0
18V
$Comp
L Device:R R3
U 1 1 5E5FE7D2
P 6550 4450
F 0 "R3" H 6620 4496 50  0000 L CNN
F 1 "100" H 6620 4405 50  0000 L CNN
F 2 "Resistor_SMD:R_0402_1005Metric" V 6480 4450 50  0001 C CNN
F 3 "~" H 6550 4450 50  0001 C CNN
	1    6550 4450
	1    0    0    -1  
$EndComp
Text Label 6550 4200 0    50   ~ 0
VOUT
Wire Wire Line
	6550 4600 6200 4600
Wire Wire Line
	6200 4600 6200 4650
Wire Wire Line
	5850 4300 5850 4600
Wire Wire Line
	5850 4600 6200 4600
Connection ~ 6200 4600
$Comp
L power:+5V #PWR0103
U 1 1 5E626982
P 1550 4050
F 0 "#PWR0103" H 1550 3900 50  0001 C CNN
F 1 "+5V" H 1565 4223 50  0000 C CNN
F 2 "" H 1550 4050 50  0001 C CNN
F 3 "" H 1550 4050 50  0001 C CNN
	1    1550 4050
	0    -1   -1   0   
$EndComp
$Comp
L pylon-rescue:ATtiny406-M-MCU_Microchip_ATtiny U1
U 1 1 5E6AD4A6
P 3350 2450
F 0 "U1" H 3350 3531 50  0000 C CNN
F 1 "ATtiny406-M" H 3350 3440 50  0000 C CNN
F 2 "Package_DFN_QFN:VQFN-20-1EP_3x3mm_P0.4mm_EP1.7x1.7mm" H 3350 2450 50  0001 C CIN
F 3 "http://ww1.microchip.com/downloads/en/DeviceDoc/Microchip%208bit%20mcu%20AVR%20ATtiny406%20data%20sheet%2040001976A.pdf" H 3350 2450 50  0001 C CNN
	1    3350 2450
	1    0    0    -1  
$EndComp
Text Label 3950 2250 0    50   ~ 0
TX_LED4
Text Notes 4550 3200 1    50   ~ 0
need to check physical locations of pins still
Text Notes 6000 2850 1    50   ~ 0
check bypass cap req
$Comp
L power:+5V #PWR0104
U 1 1 5E6E1D91
P 8850 1250
F 0 "#PWR0104" H 8850 1100 50  0001 C CNN
F 1 "+5V" H 8865 1423 50  0000 C CNN
F 2 "" H 8850 1250 50  0001 C CNN
F 3 "" H 8850 1250 50  0001 C CNN
	1    8850 1250
	0    1    -1   0   
$EndComp
$Comp
L power:GND #PWR0105
U 1 1 5E6E4CEB
P 8850 1450
F 0 "#PWR0105" H 8850 1200 50  0001 C CNN
F 1 "GND" H 8855 1277 50  0000 C CNN
F 2 "" H 8850 1450 50  0001 C CNN
F 3 "" H 8850 1450 50  0001 C CNN
	1    8850 1450
	0    -1   1    0   
$EndComp
Text Label 8850 1350 0    50   ~ 0
RX1
Text Label 8600 3750 2    50   ~ 0
TX_LED1
Text Label 8350 1350 2    50   ~ 0
TX_LED1
Text Notes 7700 3550 1    50   ~ 0
determine whether fet should be on light or pylon cell
Text Notes 5050 5250 0    50   ~ 0
change BCR out for the lower rating one (cheaper?)
Text Notes 8150 950  0    50   ~ 0
not sure if male or female yet
Text Label 8350 1250 2    50   ~ 0
VOUT
Text Label 8900 3550 1    50   ~ 0
18V
Text Label 8900 3950 3    50   ~ 0
VLED1
Text Label 8350 1450 2    50   ~ 0
VLED1
Text Notes 3900 4650 0    50   ~ 0
small drop due to fet, and bcr sets vout @ 1.4v\ndo math to accomodate
$Comp
L Device:Q_NMOS_SGD Q1
U 1 1 5E680636
P 8800 3750
F 0 "Q1" H 9004 3796 50  0000 L CNN
F 1 "Q_NMOS_SGD" H 9004 3705 50  0000 L CNN
F 2 "Package_TO_SOT_SMD:SOT-23" H 9000 3850 50  0001 C CNN
F 3 "~" H 8800 3750 50  0001 C CNN
	1    8800 3750
	1    0    0    -1  
$EndComp
Text Notes 2750 3700 0    50   ~ 0
check diode replace lcsc
$Comp
L Connector_Generic:Conn_02x03_Odd_Even J1
U 1 1 5E6B0B6A
P 8650 1350
F 0 "J1" H 8700 1667 50  0000 C CNN
F 1 "Conn_02x03_Odd_Even" H 8700 1576 50  0000 C CNN
F 2 "Connector_PinSocket_2.54mm:PinSocket_2x03_P2.54mm_Vertical" H 8650 1350 50  0001 C CNN
F 3 "~" H 8650 1350 50  0001 C CNN
	1    8650 1350
	-1   0    0    -1  
$EndComp
Text Label 8600 4650 2    50   ~ 0
TX_LED2
Text Label 8900 4450 1    50   ~ 0
18V
Text Label 8900 4850 3    50   ~ 0
VLED2
$Comp
L Device:Q_NMOS_SGD Q2
U 1 1 5E6E2DE6
P 8800 4650
F 0 "Q2" H 9004 4696 50  0000 L CNN
F 1 "Q_NMOS_SGD" H 9004 4605 50  0000 L CNN
F 2 "Package_TO_SOT_SMD:SOT-23" H 9000 4750 50  0001 C CNN
F 3 "~" H 8800 4650 50  0001 C CNN
	1    8800 4650
	1    0    0    -1  
$EndComp
Text Label 8600 5550 2    50   ~ 0
TX_LED3
Text Label 8900 5350 1    50   ~ 0
18V
Text Label 8900 5750 3    50   ~ 0
VLED3
$Comp
L Device:Q_NMOS_SGD Q3
U 1 1 5E6E4033
P 8800 5550
F 0 "Q3" H 9004 5596 50  0000 L CNN
F 1 "Q_NMOS_SGD" H 9004 5505 50  0000 L CNN
F 2 "Package_TO_SOT_SMD:SOT-23" H 9000 5650 50  0001 C CNN
F 3 "~" H 8800 5550 50  0001 C CNN
	1    8800 5550
	1    0    0    -1  
$EndComp
Text Label 10000 3750 2    50   ~ 0
TX_LED4
Text Label 10300 3550 1    50   ~ 0
18V
Text Label 10300 3950 3    50   ~ 0
VLED4
$Comp
L Device:Q_NMOS_SGD Q4
U 1 1 5E6E700A
P 10200 3750
F 0 "Q4" H 10404 3796 50  0000 L CNN
F 1 "Q_NMOS_SGD" H 10404 3705 50  0000 L CNN
F 2 "Package_TO_SOT_SMD:SOT-23" H 10400 3850 50  0001 C CNN
F 3 "~" H 10200 3750 50  0001 C CNN
	1    10200 3750
	1    0    0    -1  
$EndComp
Text Label 10000 4650 2    50   ~ 0
TX_LED5
Text Label 10300 4450 1    50   ~ 0
18V
Text Label 10300 4850 3    50   ~ 0
VLED5
$Comp
L Device:Q_NMOS_SGD Q5
U 1 1 5E6E7013
P 10200 4650
F 0 "Q5" H 10404 4696 50  0000 L CNN
F 1 "Q_NMOS_SGD" H 10404 4605 50  0000 L CNN
F 2 "Package_TO_SOT_SMD:SOT-23" H 10400 4750 50  0001 C CNN
F 3 "~" H 10200 4650 50  0001 C CNN
	1    10200 4650
	1    0    0    -1  
$EndComp
Text Label 10000 5550 2    50   ~ 0
TX_LED6
Text Label 10300 5350 1    50   ~ 0
18V
Text Label 10300 5750 3    50   ~ 0
VLED6
$Comp
L Device:Q_NMOS_SGD Q6
U 1 1 5E6E701C
P 10200 5550
F 0 "Q6" H 10404 5596 50  0000 L CNN
F 1 "Q_NMOS_SGD" H 10404 5505 50  0000 L CNN
F 2 "Package_TO_SOT_SMD:SOT-23" H 10400 5650 50  0001 C CNN
F 3 "~" H 10200 5550 50  0001 C CNN
	1    10200 5550
	1    0    0    -1  
$EndComp
$Comp
L power:+5V #PWR0106
U 1 1 5E6EB991
P 8850 1800
F 0 "#PWR0106" H 8850 1650 50  0001 C CNN
F 1 "+5V" H 8865 1973 50  0000 C CNN
F 2 "" H 8850 1800 50  0001 C CNN
F 3 "" H 8850 1800 50  0001 C CNN
	1    8850 1800
	0    1    -1   0   
$EndComp
$Comp
L power:GND #PWR0107
U 1 1 5E6EB997
P 8850 2000
F 0 "#PWR0107" H 8850 1750 50  0001 C CNN
F 1 "GND" H 8855 1827 50  0000 C CNN
F 2 "" H 8850 2000 50  0001 C CNN
F 3 "" H 8850 2000 50  0001 C CNN
	1    8850 2000
	0    -1   1    0   
$EndComp
Text Label 8850 1900 0    50   ~ 0
RX2
Text Label 8350 1900 2    50   ~ 0
TX_LED2
Text Label 8350 1800 2    50   ~ 0
VOUT
Text Label 8350 2000 2    50   ~ 0
VLED2
$Comp
L Connector_Generic:Conn_02x03_Odd_Even J2
U 1 1 5E6EB9A1
P 8650 1900
F 0 "J2" H 8700 2217 50  0000 C CNN
F 1 "Conn_02x03_Odd_Even" H 8700 2126 50  0000 C CNN
F 2 "Connector_PinSocket_2.54mm:PinSocket_2x03_P2.54mm_Vertical" H 8650 1900 50  0001 C CNN
F 3 "~" H 8650 1900 50  0001 C CNN
	1    8650 1900
	-1   0    0    -1  
$EndComp
$Comp
L power:+5V #PWR0108
U 1 1 5E6F71AC
P 8850 2350
F 0 "#PWR0108" H 8850 2200 50  0001 C CNN
F 1 "+5V" H 8865 2523 50  0000 C CNN
F 2 "" H 8850 2350 50  0001 C CNN
F 3 "" H 8850 2350 50  0001 C CNN
	1    8850 2350
	0    1    -1   0   
$EndComp
$Comp
L power:GND #PWR0109
U 1 1 5E6F71B2
P 8850 2550
F 0 "#PWR0109" H 8850 2300 50  0001 C CNN
F 1 "GND" H 8855 2377 50  0000 C CNN
F 2 "" H 8850 2550 50  0001 C CNN
F 3 "" H 8850 2550 50  0001 C CNN
	1    8850 2550
	0    -1   1    0   
$EndComp
Text Label 8850 2450 0    50   ~ 0
RX3
Text Label 8350 2450 2    50   ~ 0
TX_LED3
Text Label 8350 2350 2    50   ~ 0
VOUT
Text Label 8350 2550 2    50   ~ 0
VLED3
$Comp
L Connector_Generic:Conn_02x03_Odd_Even J3
U 1 1 5E6F71BC
P 8650 2450
F 0 "J3" H 8700 2767 50  0000 C CNN
F 1 "Conn_02x03_Odd_Even" H 8700 2676 50  0000 C CNN
F 2 "Connector_PinSocket_2.54mm:PinSocket_2x03_P2.54mm_Vertical" H 8650 2450 50  0001 C CNN
F 3 "~" H 8650 2450 50  0001 C CNN
	1    8650 2450
	-1   0    0    -1  
$EndComp
$Comp
L power:+5V #PWR0110
U 1 1 5E6FAA8D
P 10000 1250
F 0 "#PWR0110" H 10000 1100 50  0001 C CNN
F 1 "+5V" H 10015 1423 50  0000 C CNN
F 2 "" H 10000 1250 50  0001 C CNN
F 3 "" H 10000 1250 50  0001 C CNN
	1    10000 1250
	0    1    -1   0   
$EndComp
$Comp
L power:GND #PWR0111
U 1 1 5E6FAA93
P 10000 1450
F 0 "#PWR0111" H 10000 1200 50  0001 C CNN
F 1 "GND" H 10005 1277 50  0000 C CNN
F 2 "" H 10000 1450 50  0001 C CNN
F 3 "" H 10000 1450 50  0001 C CNN
	1    10000 1450
	0    -1   1    0   
$EndComp
Text Label 10000 1350 0    50   ~ 0
RX4
Text Label 9500 1350 2    50   ~ 0
TX_LED4
Text Label 9500 1250 2    50   ~ 0
VOUT
Text Label 9500 1450 2    50   ~ 0
VLED4
$Comp
L Connector_Generic:Conn_02x03_Odd_Even J4
U 1 1 5E6FAA9D
P 9800 1350
F 0 "J4" H 9850 1667 50  0000 C CNN
F 1 "Conn_02x03_Odd_Even" H 9850 1576 50  0000 C CNN
F 2 "Connector_PinSocket_2.54mm:PinSocket_2x03_P2.54mm_Vertical" H 9800 1350 50  0001 C CNN
F 3 "~" H 9800 1350 50  0001 C CNN
	1    9800 1350
	-1   0    0    -1  
$EndComp
$Comp
L power:+5V #PWR0112
U 1 1 5E6FAAA3
P 10000 1800
F 0 "#PWR0112" H 10000 1650 50  0001 C CNN
F 1 "+5V" H 10015 1973 50  0000 C CNN
F 2 "" H 10000 1800 50  0001 C CNN
F 3 "" H 10000 1800 50  0001 C CNN
	1    10000 1800
	0    1    -1   0   
$EndComp
$Comp
L power:GND #PWR0113
U 1 1 5E6FAAA9
P 10000 2000
F 0 "#PWR0113" H 10000 1750 50  0001 C CNN
F 1 "GND" H 10005 1827 50  0000 C CNN
F 2 "" H 10000 2000 50  0001 C CNN
F 3 "" H 10000 2000 50  0001 C CNN
	1    10000 2000
	0    -1   1    0   
$EndComp
Text Label 10000 1900 0    50   ~ 0
RX5
Text Label 9500 1900 2    50   ~ 0
TX_LED5
Text Label 9500 1800 2    50   ~ 0
VOUT
Text Label 9500 2000 2    50   ~ 0
VLED5
$Comp
L Connector_Generic:Conn_02x03_Odd_Even J5
U 1 1 5E6FAAB3
P 9800 1900
F 0 "J5" H 9850 2217 50  0000 C CNN
F 1 "Conn_02x03_Odd_Even" H 9850 2126 50  0000 C CNN
F 2 "Connector_PinSocket_2.54mm:PinSocket_2x03_P2.54mm_Vertical" H 9800 1900 50  0001 C CNN
F 3 "~" H 9800 1900 50  0001 C CNN
	1    9800 1900
	-1   0    0    -1  
$EndComp
$Comp
L power:+5V #PWR0114
U 1 1 5E6FAAB9
P 10000 2350
F 0 "#PWR0114" H 10000 2200 50  0001 C CNN
F 1 "+5V" H 10015 2523 50  0000 C CNN
F 2 "" H 10000 2350 50  0001 C CNN
F 3 "" H 10000 2350 50  0001 C CNN
	1    10000 2350
	0    1    -1   0   
$EndComp
$Comp
L power:GND #PWR0115
U 1 1 5E6FAABF
P 10000 2550
F 0 "#PWR0115" H 10000 2300 50  0001 C CNN
F 1 "GND" H 10005 2377 50  0000 C CNN
F 2 "" H 10000 2550 50  0001 C CNN
F 3 "" H 10000 2550 50  0001 C CNN
	1    10000 2550
	0    -1   1    0   
$EndComp
Text Label 10000 2450 0    50   ~ 0
RX6
Text Label 9500 2450 2    50   ~ 0
TX_LED6
Text Label 9500 2350 2    50   ~ 0
VOUT
Text Label 9500 2550 2    50   ~ 0
VLED6
$Comp
L Connector_Generic:Conn_02x03_Odd_Even J6
U 1 1 5E6FAAC9
P 9800 2450
F 0 "J6" H 9850 2767 50  0000 C CNN
F 1 "Conn_02x03_Odd_Even" H 9850 2676 50  0000 C CNN
F 2 "Connector_PinSocket_2.54mm:PinSocket_2x03_P2.54mm_Vertical" H 9800 2450 50  0001 C CNN
F 3 "~" H 9800 2450 50  0001 C CNN
	1    9800 2450
	-1   0    0    -1  
$EndComp
Text Label 3950 2150 0    50   ~ 0
TX_LED3
Text Label 3950 2050 0    50   ~ 0
TX_LED2
Text Label 3950 2650 0    50   ~ 0
TX_LED1
Text Label 3950 2450 0    50   ~ 0
RX4
Text Label 3950 2350 0    50   ~ 0
RX3
Text Label 3950 1950 0    50   ~ 0
RX2
Text Label 3950 1750 0    50   ~ 0
RX1
Text Label 3950 2950 0    50   ~ 0
RX6
Text Label 3950 2850 0    50   ~ 0
TX_LED6
Text Label 3950 2750 0    50   ~ 0
TX_LED5
Text Label 3950 3050 0    50   ~ 0
RX5
Text Notes 4700 2900 0    50   ~ 0
hw rx, tx on 11, 12
$Comp
L pylon-rescue:BCR420UW6-modLEDs_common U4
U 1 1 5E7E9442
P 7400 4250
F 0 "U4" H 7400 4565 50  0000 C CNN
F 1 "BCR420UW6" H 7400 4474 50  0000 C CNN
F 2 "BCR420UW6:SOT95P280X140-6N" H 7400 4250 50  0001 C CNN
F 3 "" H 7400 4250 50  0001 C CNN
	1    7400 4250
	1    0    0    -1  
$EndComp
$Comp
L Device:R R4
U 1 1 5E7EB723
P 7750 4450
F 0 "R4" H 7820 4496 50  0000 L CNN
F 1 "100" H 7820 4405 50  0000 L CNN
F 2 "Resistor_SMD:R_0402_1005Metric" V 7680 4450 50  0001 C CNN
F 3 "~" H 7750 4450 50  0001 C CNN
	1    7750 4450
	1    0    0    -1  
$EndComp
Wire Wire Line
	7050 4200 7050 3750
Wire Wire Line
	7050 3750 5850 3750
Wire Wire Line
	5850 3750 5850 4200
Wire Wire Line
	7050 4300 7050 4600
Wire Wire Line
	7050 4600 6550 4600
Connection ~ 6550 4600
Wire Wire Line
	7750 4600 7050 4600
Connection ~ 7050 4600
Wire Wire Line
	6550 4200 6550 3850
Wire Wire Line
	6550 3850 7750 3850
Wire Wire Line
	7750 3850 7750 4200
Text Notes 4700 3050 0    50   ~ 0
pwm pins are: 2,5,6,12,13,14
$EndSCHEMATC
