EESchema Schematic File Version 4
EELAYER 30 0
EELAYER END
$Descr A4 11693 8268
encoding utf-8
Sheet 1 1
Title ""
Date ""
Rev ""
Comp ""
Comment1 ""
Comment2 ""
Comment3 ""
Comment4 ""
$EndDescr
$Comp
L power:+5V #PWR0104
U 1 1 5E6E1D91
P 8850 1250
F 0 "#PWR0104" H 8850 1100 50  0001 C CNN
F 1 "+5V" H 8865 1423 50  0000 C CNN
F 2 "" H 8850 1250 50  0001 C CNN
F 3 "" H 8850 1250 50  0001 C CNN
	1    8850 1250
	0    1    -1   0   
$EndComp
$Comp
L power:GND #PWR0105
U 1 1 5E6E4CEB
P 8850 1450
F 0 "#PWR0105" H 8850 1200 50  0001 C CNN
F 1 "GND" H 8855 1277 50  0000 C CNN
F 2 "" H 8850 1450 50  0001 C CNN
F 3 "" H 8850 1450 50  0001 C CNN
	1    8850 1450
	0    -1   1    0   
$EndComp
Text Label 8850 1350 0    50   ~ 0
RX1
Text Label 8350 1350 2    50   ~ 0
TX_LED1
Text Label 8350 1250 2    50   ~ 0
VOUT
Text Label 8350 1450 2    50   ~ 0
VLED1
$Comp
L Connector_Generic:Conn_02x03_Odd_Even J1
U 1 1 5E6B0B6A
P 8650 1350
F 0 "J1" H 8700 1667 50  0000 C CNN
F 1 "Conn_02x03_Odd_Even" H 8700 1576 50  0000 C CNN
F 2 "Connector_PinHeader_2.54mm:PinHeader_2x03_P2.54mm_Vertical" H 8650 1350 50  0001 C CNN
F 3 "~" H 8650 1350 50  0001 C CNN
	1    8650 1350
	-1   0    0    -1  
$EndComp
$Comp
L power:+5V #PWR0106
U 1 1 5E6EB991
P 8850 1800
F 0 "#PWR0106" H 8850 1650 50  0001 C CNN
F 1 "+5V" H 8865 1973 50  0000 C CNN
F 2 "" H 8850 1800 50  0001 C CNN
F 3 "" H 8850 1800 50  0001 C CNN
	1    8850 1800
	0    1    -1   0   
$EndComp
$Comp
L power:GND #PWR0107
U 1 1 5E6EB997
P 8850 2000
F 0 "#PWR0107" H 8850 1750 50  0001 C CNN
F 1 "GND" H 8855 1827 50  0000 C CNN
F 2 "" H 8850 2000 50  0001 C CNN
F 3 "" H 8850 2000 50  0001 C CNN
	1    8850 2000
	0    -1   1    0   
$EndComp
Text Label 8850 1900 0    50   ~ 0
RX2
Text Label 8350 1900 2    50   ~ 0
TX_LED2
Text Label 8350 1800 2    50   ~ 0
VOUT
Text Label 8350 2000 2    50   ~ 0
VLED2
$Comp
L Connector_Generic:Conn_02x03_Odd_Even J2
U 1 1 5E6EB9A1
P 8650 1900
F 0 "J2" H 8700 2217 50  0000 C CNN
F 1 "Conn_02x03_Odd_Even" H 8700 2126 50  0000 C CNN
F 2 "Connector_PinHeader_2.54mm:PinHeader_2x03_P2.54mm_Vertical" H 8650 1900 50  0001 C CNN
F 3 "~" H 8650 1900 50  0001 C CNN
	1    8650 1900
	-1   0    0    -1  
$EndComp
$Comp
L power:+5V #PWR0108
U 1 1 5E6F71AC
P 8850 2350
F 0 "#PWR0108" H 8850 2200 50  0001 C CNN
F 1 "+5V" H 8865 2523 50  0000 C CNN
F 2 "" H 8850 2350 50  0001 C CNN
F 3 "" H 8850 2350 50  0001 C CNN
	1    8850 2350
	0    1    -1   0   
$EndComp
$Comp
L power:GND #PWR0109
U 1 1 5E6F71B2
P 8850 2550
F 0 "#PWR0109" H 8850 2300 50  0001 C CNN
F 1 "GND" H 8855 2377 50  0000 C CNN
F 2 "" H 8850 2550 50  0001 C CNN
F 3 "" H 8850 2550 50  0001 C CNN
	1    8850 2550
	0    -1   1    0   
$EndComp
Text Label 8850 2450 0    50   ~ 0
RX3
Text Label 8350 2450 2    50   ~ 0
TX_LED3
Text Label 8350 2350 2    50   ~ 0
VOUT
Text Label 8350 2550 2    50   ~ 0
VLED3
$Comp
L Connector_Generic:Conn_02x03_Odd_Even J3
U 1 1 5E6F71BC
P 8650 2450
F 0 "J3" H 8700 2767 50  0000 C CNN
F 1 "Conn_02x03_Odd_Even" H 8700 2676 50  0000 C CNN
F 2 "Connector_PinHeader_2.54mm:PinHeader_2x03_P2.54mm_Vertical" H 8650 2450 50  0001 C CNN
F 3 "~" H 8650 2450 50  0001 C CNN
	1    8650 2450
	-1   0    0    -1  
$EndComp
$Comp
L Device:LED D3
U 1 1 5E6AFCA4
P 5400 3550
F 0 "D3" H 5393 3766 50  0000 C CNN
F 1 "LED" H 5393 3675 50  0000 C CNN
F 2 "AP3012KTR-G1:GW_PSLR31_EM" H 5400 3550 50  0001 C CNN
F 3 "~" H 5400 3550 50  0001 C CNN
	1    5400 3550
	0    -1   -1   0   
$EndComp
$Comp
L Device:LED D2
U 1 1 5E6B02EC
P 5400 3250
F 0 "D2" H 5393 3466 50  0000 C CNN
F 1 "LED" H 5393 3375 50  0000 C CNN
F 2 "AP3012KTR-G1:GW_PSLR31_EM" H 5400 3250 50  0001 C CNN
F 3 "~" H 5400 3250 50  0001 C CNN
	1    5400 3250
	0    -1   -1   0   
$EndComp
$Comp
L Device:LED D1
U 1 1 5E6B05FA
P 5400 2950
F 0 "D1" H 5393 3166 50  0000 C CNN
F 1 "LED" H 5393 3075 50  0000 C CNN
F 2 "AP3012KTR-G1:GW_PSLR31_EM" H 5400 2950 50  0001 C CNN
F 3 "~" H 5400 2950 50  0001 C CNN
	1    5400 2950
	0    -1   -1   0   
$EndComp
Text Label 5400 3700 2    50   ~ 0
VOUT
Text Label 5400 2800 2    50   ~ 0
VLED1
Wire Wire Line
	5400 2800 6000 2800
Text Label 5700 2800 2    50   ~ 0
VLED2
Text Label 6000 2800 2    50   ~ 0
VLED3
Text Notes 7650 900  0    50   ~ 0
need to change pinouts here to complement tx/rx sigs
$Comp
L Jumper:SolderJumper_3_Open JP1
U 1 1 5E6BE768
P 8000 3300
F 0 "JP1" H 8000 3505 50  0000 C CNN
F 1 "SolderJumper_3_Open" H 8000 3414 50  0000 C CNN
F 2 "Jumper:SolderJumper-3_P1.3mm_Open_Pad1.0x1.5mm" H 8000 3300 50  0001 C CNN
F 3 "~" H 8000 3300 50  0001 C CNN
	1    8000 3300
	1    0    0    -1  
$EndComp
Text Label 8000 3450 3    50   ~ 0
RX1
Text Label 7800 3300 2    50   ~ 0
TX_LED2
Text Label 8200 3300 0    50   ~ 0
TX_LED3
$Comp
L Jumper:SolderJumper_3_Open JP2
U 1 1 5E6BFE2E
P 8000 3900
F 0 "JP2" H 8000 4105 50  0000 C CNN
F 1 "SolderJumper_3_Open" H 8000 4014 50  0000 C CNN
F 2 "Jumper:SolderJumper-3_P1.3mm_Open_Pad1.0x1.5mm" H 8000 3900 50  0001 C CNN
F 3 "~" H 8000 3900 50  0001 C CNN
	1    8000 3900
	1    0    0    -1  
$EndComp
Text Label 8000 4050 3    50   ~ 0
RX2
Text Label 7800 3900 2    50   ~ 0
TX_LED3
Text Label 8200 3900 0    50   ~ 0
TX_LED1
$Comp
L Jumper:SolderJumper_3_Open JP3
U 1 1 5E6C0188
P 8000 4500
F 0 "JP3" H 8000 4705 50  0000 C CNN
F 1 "SolderJumper_3_Open" H 8000 4614 50  0000 C CNN
F 2 "Jumper:SolderJumper-3_P1.3mm_Open_Pad1.0x1.5mm" H 8000 4500 50  0001 C CNN
F 3 "~" H 8000 4500 50  0001 C CNN
	1    8000 4500
	1    0    0    -1  
$EndComp
Text Label 8000 4650 3    50   ~ 0
RX3
Text Label 7800 4500 2    50   ~ 0
TX_LED1
Text Label 8200 4500 0    50   ~ 0
TX_LED2
$Comp
L light-rescue:10118193-0001LF_10118193-0001LF-power-cache J4
U 1 1 5E7ECC56
P 5500 4650
F 0 "J4" H 5728 4696 50  0000 L CNN
F 1 "10118193-0001LF_10118193-0001LF" H 5728 4605 50  0000 L CNN
F 2 "" H 5500 4650 50  0001 L BNN
F 3 "" H 5500 4650 50  0001 L BNN
F 4 "Amphenol FCI" H 5500 4650 50  0001 L BNN "Field4"
F 5 "Unavailable" H 5500 4650 50  0001 L BNN "Field5"
F 6 "10118193-0001LF" H 5500 4650 50  0001 L BNN "Field6"
F 7 "None" H 5500 4650 50  0001 L BNN "Field7"
F 8 "Single Port 5 Contact Shielded SMT MICRO USB B-Type Receptacle" H 5500 4650 50  0001 L BNN "Field8"
	1    5500 4650
	-1   0    0    -1  
$EndComp
$Comp
L power:+5V #PWR0101
U 1 1 5E7F1C2E
P 5900 4350
F 0 "#PWR0101" H 5900 4200 50  0001 C CNN
F 1 "+5V" H 5915 4523 50  0000 C CNN
F 2 "" H 5900 4350 50  0001 C CNN
F 3 "" H 5900 4350 50  0001 C CNN
	1    5900 4350
	0    1    -1   0   
$EndComp
$Comp
L power:GND #PWR0102
U 1 1 5E7F24CE
P 5950 4950
F 0 "#PWR0102" H 5950 4700 50  0001 C CNN
F 1 "GND" H 5955 4777 50  0000 C CNN
F 2 "" H 5950 4950 50  0001 C CNN
F 3 "" H 5950 4950 50  0001 C CNN
	1    5950 4950
	-1   0    0    -1  
$EndComp
Wire Wire Line
	5900 4750 5950 4750
Wire Wire Line
	5950 4750 5950 4950
Wire Wire Line
	5900 4950 5950 4950
Connection ~ 5950 4950
NoConn ~ 5900 4650
NoConn ~ 5900 4550
NoConn ~ 5900 4450
$EndSCHEMATC
