EESchema Schematic File Version 4
EELAYER 30 0
EELAYER END
$Descr A4 11693 8268
encoding utf-8
Sheet 1 1
Title ""
Date ""
Rev ""
Comp ""
Comment1 ""
Comment2 ""
Comment3 ""
Comment4 ""
$EndDescr
$Comp
L Device:Speaker LS1
U 1 1 5E2227B1
P 6200 6750
F 0 "LS1" H 6370 6746 50  0000 L CNN
F 1 "Speaker" H 6370 6655 50  0000 L CNN
F 2 "Connector_PinHeader_2.54mm:PinHeader_1x02_P2.54mm_Vertical" H 6200 6550 50  0001 C CNN
F 3 "~" H 6190 6700 50  0001 C CNN
	1    6200 6750
	1    0    0    -1  
$EndComp
$Comp
L Connector:Conn_01x04_Male J2
U 1 1 5E253A7B
P 10450 5000
F 0 "J2" H 10556 5278 50  0000 C CNN
F 1 "Conn_01x04_Male" H 10556 5187 50  0000 C CNN
F 2 "Connector_PinHeader_2.54mm:PinHeader_1x04_P2.54mm_Horizontal" H 10450 5000 50  0001 C CNN
F 3 "~" H 10450 5000 50  0001 C CNN
	1    10450 5000
	1    0    0    -1  
$EndComp
$Comp
L power:+5V #PWR017
U 1 1 5E253D6F
P 10650 4900
F 0 "#PWR017" H 10650 4750 50  0001 C CNN
F 1 "+5V" H 10665 5073 50  0000 C CNN
F 2 "" H 10650 4900 50  0001 C CNN
F 3 "" H 10650 4900 50  0001 C CNN
	1    10650 4900
	0    1    1    0   
$EndComp
$Comp
L power:GND #PWR018
U 1 1 5E253DB5
P 10650 5200
F 0 "#PWR018" H 10650 4950 50  0001 C CNN
F 1 "GND" H 10655 5027 50  0000 C CNN
F 2 "" H 10650 5200 50  0001 C CNN
F 3 "" H 10650 5200 50  0001 C CNN
	1    10650 5200
	0    -1   -1   0   
$EndComp
Text Label 3750 3350 0    50   ~ 0
led1
Text Label 3750 3450 0    50   ~ 0
led2
Text Label 3750 3750 0    50   ~ 0
led3
Text Label 3750 3850 0    50   ~ 0
led4
Text Label 10650 5100 0    50   ~ 0
led1
Text Label 10650 5000 0    50   ~ 0
led2
Text Label 10650 5900 0    50   ~ 0
led3
Text Label 10650 5800 0    50   ~ 0
led4
$Comp
L Connector:Conn_01x04_Male J3
U 1 1 5E253FC9
P 10450 5800
F 0 "J3" H 10556 6078 50  0000 C CNN
F 1 "Conn_01x04_Male" H 10556 5987 50  0000 C CNN
F 2 "Connector_PinHeader_2.54mm:PinHeader_1x04_P2.54mm_Horizontal" H 10450 5800 50  0001 C CNN
F 3 "~" H 10450 5800 50  0001 C CNN
	1    10450 5800
	1    0    0    -1  
$EndComp
$Comp
L power:+5V #PWR019
U 1 1 5E253FD0
P 10650 5700
F 0 "#PWR019" H 10650 5550 50  0001 C CNN
F 1 "+5V" H 10665 5873 50  0000 C CNN
F 2 "" H 10650 5700 50  0001 C CNN
F 3 "" H 10650 5700 50  0001 C CNN
	1    10650 5700
	0    1    1    0   
$EndComp
$Comp
L power:GND #PWR020
U 1 1 5E2544C8
P 3150 4250
F 0 "#PWR020" H 3150 4000 50  0001 C CNN
F 1 "GND" H 3155 4077 50  0000 C CNN
F 2 "" H 3150 4250 50  0001 C CNN
F 3 "" H 3150 4250 50  0001 C CNN
	1    3150 4250
	1    0    0    -1  
$EndComp
$Comp
L power:+5V #PWR01
U 1 1 5E2544F1
P 3150 1250
F 0 "#PWR01" H 3150 1100 50  0001 C CNN
F 1 "+5V" H 3165 1423 50  0000 C CNN
F 2 "" H 3150 1250 50  0001 C CNN
F 3 "" H 3150 1250 50  0001 C CNN
	1    3150 1250
	1    0    0    -1  
$EndComp
$Comp
L Device:C C3
U 1 1 5E25466C
P 1300 2300
F 0 "C3" H 1415 2346 50  0000 L CNN
F 1 "1uF" H 1415 2255 50  0000 L CNN
F 2 "Capacitor_SMD:C_0402_1005Metric" H 1338 2150 50  0001 C CNN
F 3 "~" H 1300 2300 50  0001 C CNN
	1    1300 2300
	1    0    0    -1  
$EndComp
$Comp
L Device:C C4
U 1 1 5E2546D2
P 1650 2300
F 0 "C4" H 1765 2346 50  0000 L CNN
F 1 "0.1uF" H 1765 2255 50  0000 L CNN
F 2 "Capacitor_SMD:C_0402_1005Metric" H 1688 2150 50  0001 C CNN
F 3 "~" H 1650 2300 50  0001 C CNN
	1    1650 2300
	1    0    0    -1  
$EndComp
Wire Wire Line
	1300 2150 1650 2150
Wire Wire Line
	1650 2450 1300 2450
$Comp
L power:GND #PWR011
U 1 1 5E2547F9
P 1300 2450
F 0 "#PWR011" H 1300 2200 50  0001 C CNN
F 1 "GND" H 1305 2277 50  0000 C CNN
F 2 "" H 1300 2450 50  0001 C CNN
F 3 "" H 1300 2450 50  0001 C CNN
	1    1300 2450
	1    0    0    -1  
$EndComp
Connection ~ 1300 2450
$Comp
L power:+5V #PWR010
U 1 1 5E254837
P 1300 2150
F 0 "#PWR010" H 1300 2000 50  0001 C CNN
F 1 "+5V" H 1315 2323 50  0000 C CNN
F 2 "" H 1300 2150 50  0001 C CNN
F 3 "" H 1300 2150 50  0001 C CNN
	1    1300 2150
	1    0    0    -1  
$EndComp
Connection ~ 1300 2150
$Comp
L MCU_Microchip_ATmega:ATmega328PB-MU U3
U 1 1 5E2616D3
P 3150 2750
F 0 "U3" H 3150 1164 50  0000 C CNN
F 1 "ATmega328PB-MU" H 3150 1073 50  0000 C CNN
F 2 "Package_DFN_QFN:QFN-32-1EP_5x5mm_P0.5mm_EP3.1x3.1mm" H 3150 2750 50  0001 C CIN
F 3 "http://ww1.microchip.com/downloads/en/DeviceDoc/40001906C.pdf" H 3150 2750 50  0001 C CNN
	1    3150 2750
	1    0    0    -1  
$EndComp
Text Label 3750 2450 0    50   ~ 0
miso
Text Label 2550 3550 2    50   ~ 0
mosi
Text Label 3750 2550 0    50   ~ 0
sck
Text Label 2550 3450 2    50   ~ 0
!ss
Text Notes 2250 3750 1    50   ~ 0
spi-mode for sd
Text Label 9150 3550 2    50   ~ 0
miso_sd
Text Label 9150 3150 2    50   ~ 0
mosi_sd
Text Label 9150 3350 2    50   ~ 0
sck_sd
Text Label 9150 3050 2    50   ~ 0
!ss_sd
$Comp
L power:GND #PWR013
U 1 1 5E262BC7
P 5300 3800
F 0 "#PWR013" H 5300 3550 50  0001 C CNN
F 1 "GND" H 5305 3627 50  0000 C CNN
F 2 "" H 5300 3800 50  0001 C CNN
F 3 "" H 5300 3800 50  0001 C CNN
	1    5300 3800
	1    0    0    -1  
$EndComp
$Comp
L power:+5V #PWR05
U 1 1 5E262C4C
P 5350 1850
F 0 "#PWR05" H 5350 1700 50  0001 C CNN
F 1 "+5V" H 5365 2023 50  0000 C CNN
F 2 "" H 5350 1850 50  0001 C CNN
F 3 "" H 5350 1850 50  0001 C CNN
	1    5350 1850
	0    -1   -1   0   
$EndComp
$Comp
L power:GND #PWR016
U 1 1 5E262F65
P 9150 3450
F 0 "#PWR016" H 9150 3200 50  0001 C CNN
F 1 "GND" V 9155 3322 50  0000 R CNN
F 2 "" H 9150 3450 50  0001 C CNN
F 3 "" H 9150 3450 50  0001 C CNN
	1    9150 3450
	0    1    1    0   
$EndComp
$Comp
L power:+3.3V #PWR014
U 1 1 5E263012
P 9150 3250
F 0 "#PWR014" H 9150 3100 50  0001 C CNN
F 1 "+3.3V" V 9165 3378 50  0000 L CNN
F 2 "" H 9150 3250 50  0001 C CNN
F 3 "" H 9150 3250 50  0001 C CNN
	1    9150 3250
	0    -1   -1   0   
$EndComp
$Comp
L 74xx:74LVC125 U1
U 1 1 5E28679C
P 6350 3400
F 0 "U1" H 6350 3717 50  0000 C CNN
F 1 "74LVC125" H 6350 3626 50  0000 C CNN
F 2 "Package_SO:SOIC-14_3.9x8.7mm_P1.27mm" H 6350 3400 50  0001 C CNN
F 3 "http://www.ti.com/lit/gpn/sn74LVC125" H 6350 3400 50  0001 C CNN
	1    6350 3400
	1    0    0    -1  
$EndComp
$Comp
L 74xx:74LVC125 U1
U 2 1 5E2868B4
P 6350 2550
F 0 "U1" H 6350 2867 50  0000 C CNN
F 1 "74LVC125" H 6350 2776 50  0000 C CNN
F 2 "Package_SO:SOIC-14_3.9x8.7mm_P1.27mm" H 6350 2550 50  0001 C CNN
F 3 "http://www.ti.com/lit/gpn/sn74LVC125" H 6350 2550 50  0001 C CNN
	2    6350 2550
	-1   0    0    1   
$EndComp
$Comp
L 74xx:74LVC125 U1
U 3 1 5E286934
P 5300 3550
F 0 "U1" H 5300 3774 50  0000 C CNN
F 1 "74LVC125" H 5300 3865 50  0000 C CNN
F 2 "Package_SO:SOIC-14_3.9x8.7mm_P1.27mm" H 5300 3550 50  0001 C CNN
F 3 "http://www.ti.com/lit/gpn/sn74LVC125" H 5300 3550 50  0001 C CNN
	3    5300 3550
	1    0    0    -1  
$EndComp
$Comp
L 74xx:74LVC125 U1
U 4 1 5E2869D3
P 5300 2700
F 0 "U1" H 5300 3017 50  0000 C CNN
F 1 "74LVC125" H 5300 2926 50  0000 C CNN
F 2 "Package_SO:SOIC-14_3.9x8.7mm_P1.27mm" H 5300 2700 50  0001 C CNN
F 3 "http://www.ti.com/lit/gpn/sn74LVC125" H 5300 2700 50  0001 C CNN
	4    5300 2700
	1    0    0    -1  
$EndComp
$Comp
L 74xx:74LVC125 U1
U 5 1 5E28712E
P 5850 1850
F 0 "U1" H 6080 1896 50  0000 L CNN
F 1 "74LVC125" H 6080 1805 50  0000 L CNN
F 2 "Package_SO:SOIC-14_3.9x8.7mm_P1.27mm" H 5850 1850 50  0001 C CNN
F 3 "http://www.ti.com/lit/gpn/sn74LVC125" H 5850 1850 50  0001 C CNN
	5    5850 1850
	0    -1   -1   0   
$EndComp
$Comp
L power:GND #PWR012
U 1 1 5E287205
P 6350 1850
F 0 "#PWR012" H 6350 1600 50  0001 C CNN
F 1 "GND" H 6355 1677 50  0000 C CNN
F 2 "" H 6350 1850 50  0001 C CNN
F 3 "" H 6350 1850 50  0001 C CNN
	1    6350 1850
	0    -1   -1   0   
$EndComp
$Comp
L power:GND #PWR015
U 1 1 5E287391
P 6350 2300
F 0 "#PWR015" H 6350 2050 50  0001 C CNN
F 1 "GND" H 6355 2127 50  0000 C CNN
F 2 "" H 6350 2300 50  0001 C CNN
F 3 "" H 6350 2300 50  0001 C CNN
	1    6350 2300
	-1   0    0    1   
$EndComp
$Comp
L power:GND #PWR021
U 1 1 5E2873B6
P 6350 3650
F 0 "#PWR021" H 6350 3400 50  0001 C CNN
F 1 "GND" H 6355 3477 50  0000 C CNN
F 2 "" H 6350 3650 50  0001 C CNN
F 3 "" H 6350 3650 50  0001 C CNN
	1    6350 3650
	1    0    0    -1  
$EndComp
Text Label 5000 3550 2    50   ~ 0
mosi
Text Label 6050 3400 2    50   ~ 0
sck
Text Label 6050 2550 2    50   ~ 0
miso
Text Label 5600 3550 0    50   ~ 0
mosi_sd
Text Label 6650 3400 0    50   ~ 0
sck_sd
Text Label 6650 2550 0    50   ~ 0
miso_sd
$Comp
L main-rescue:MIC5365-3.3YC5-TR-MIC5365-3.3YC5-TR U2
U 1 1 5E28893B
P 9650 1600
F 0 "U2" H 9650 2170 50  0000 C CNN
F 1 "MIC5365-3.3YC5-TR" H 9650 2079 50  0000 C CNN
F 2 "ldo:SOT65P210X110-5N" H 9650 1600 50  0001 L BNN
F 3 "SOT65P210X110-5N" H 9650 1600 50  0001 L BNN
F 4 "Microchip" H 9650 1600 50  0001 L BNN "Field4"
	1    9650 1600
	1    0    0    -1  
$EndComp
$Comp
L power:GND #PWR03
U 1 1 5E288C27
P 10350 1300
F 0 "#PWR03" H 10350 1050 50  0001 C CNN
F 1 "GND" H 10355 1127 50  0000 C CNN
F 2 "" H 10350 1300 50  0001 C CNN
F 3 "" H 10350 1300 50  0001 C CNN
	1    10350 1300
	0    -1   -1   0   
$EndComp
$Comp
L power:+5V #PWR06
U 1 1 5E288E46
P 8500 1600
F 0 "#PWR06" H 8500 1450 50  0001 C CNN
F 1 "+5V" H 8515 1773 50  0000 C CNN
F 2 "" H 8500 1600 50  0001 C CNN
F 3 "" H 8500 1600 50  0001 C CNN
	1    8500 1600
	0    -1   -1   0   
$EndComp
$Comp
L power:+3.3V #PWR04
U 1 1 5E288F85
P 10550 1500
F 0 "#PWR04" H 10550 1350 50  0001 C CNN
F 1 "+3.3V" V 10565 1628 50  0000 L CNN
F 2 "" H 10550 1500 50  0001 C CNN
F 3 "" H 10550 1500 50  0001 C CNN
	1    10550 1500
	0    1    1    0   
$EndComp
$Comp
L power:+5V #PWR02
U 1 1 5E28907E
P 8900 1200
F 0 "#PWR02" H 8900 1050 50  0001 C CNN
F 1 "+5V" H 8915 1373 50  0000 C CNN
F 2 "" H 8900 1200 50  0001 C CNN
F 3 "" H 8900 1200 50  0001 C CNN
	1    8900 1200
	1    0    0    -1  
$EndComp
$Comp
L Device:R R1
U 1 1 5E2890F0
P 8900 1350
F 0 "R1" H 8970 1396 50  0000 L CNN
F 1 "10k" H 8970 1305 50  0000 L CNN
F 2 "Resistor_SMD:R_0402_1005Metric" V 8830 1350 50  0001 C CNN
F 3 "~" H 8900 1350 50  0001 C CNN
	1    8900 1350
	1    0    0    -1  
$EndComp
Wire Wire Line
	8950 1500 8900 1500
NoConn ~ 8950 1800
$Comp
L Device:C C2
U 1 1 5E289FAD
P 8600 1750
F 0 "C2" H 8715 1796 50  0000 L CNN
F 1 "1uF" H 8715 1705 50  0000 L CNN
F 2 "Capacitor_SMD:C_0402_1005Metric" H 8638 1600 50  0001 C CNN
F 3 "~" H 8600 1750 50  0001 C CNN
	1    8600 1750
	1    0    0    -1  
$EndComp
Wire Wire Line
	8600 1600 8500 1600
Connection ~ 8600 1600
$Comp
L Device:C C1
U 1 1 5E28A233
P 10450 1650
F 0 "C1" H 10565 1696 50  0000 L CNN
F 1 "1uF" H 10565 1605 50  0000 L CNN
F 2 "Capacitor_SMD:C_0402_1005Metric" H 10488 1500 50  0001 C CNN
F 3 "~" H 10450 1650 50  0001 C CNN
	1    10450 1650
	1    0    0    -1  
$EndComp
Wire Wire Line
	10350 1500 10450 1500
Connection ~ 10450 1500
Wire Wire Line
	10450 1500 10550 1500
$Comp
L power:GND #PWR08
U 1 1 5E28A3C6
P 10450 1800
F 0 "#PWR08" H 10450 1550 50  0001 C CNN
F 1 "GND" H 10455 1627 50  0000 C CNN
F 2 "" H 10450 1800 50  0001 C CNN
F 3 "" H 10450 1800 50  0001 C CNN
	1    10450 1800
	1    0    0    -1  
$EndComp
$Comp
L power:GND #PWR09
U 1 1 5E28A401
P 8600 1900
F 0 "#PWR09" H 8600 1650 50  0001 C CNN
F 1 "GND" H 8605 1727 50  0000 C CNN
F 2 "" H 8600 1900 50  0001 C CNN
F 3 "" H 8600 1900 50  0001 C CNN
	1    8600 1900
	1    0    0    -1  
$EndComp
Wire Wire Line
	8600 1600 8950 1600
$Comp
L Amplifier_Audio:LM386 U4
U 1 1 5E2A29AC
P 4550 6150
F 0 "U4" H 4891 6196 50  0000 L CNN
F 1 "LM386" H 4891 6105 50  0000 L CNN
F 2 "Package_SO:SOIC-8_3.9x4.9mm_P1.27mm" H 4650 6250 50  0001 C CNN
F 3 "http://www.ti.com/lit/ds/symlink/lm386.pdf" H 4750 6350 50  0001 C CNN
	1    4550 6150
	1    0    0    -1  
$EndComp
$Comp
L power:GND #PWR030
U 1 1 5E2A2EA1
P 6000 6950
F 0 "#PWR030" H 6000 6700 50  0001 C CNN
F 1 "GND" H 6005 6777 50  0000 C CNN
F 2 "" H 6000 6950 50  0001 C CNN
F 3 "" H 6000 6950 50  0001 C CNN
	1    6000 6950
	1    0    0    -1  
$EndComp
$Comp
L Device:C C7
U 1 1 5E2A33E0
P 5250 6400
F 0 "C7" H 5365 6446 50  0000 L CNN
F 1 "0.047uF" H 5365 6355 50  0000 L CNN
F 2 "Capacitor_SMD:C_0402_1005Metric" H 5288 6250 50  0001 C CNN
F 3 "~" H 5250 6400 50  0001 C CNN
	1    5250 6400
	1    0    0    -1  
$EndComp
$Comp
L power:GND #PWR029
U 1 1 5E2A3735
P 5250 6950
F 0 "#PWR029" H 5250 6700 50  0001 C CNN
F 1 "GND" H 5255 6777 50  0000 C CNN
F 2 "" H 5250 6950 50  0001 C CNN
F 3 "" H 5250 6950 50  0001 C CNN
	1    5250 6950
	1    0    0    -1  
$EndComp
$Comp
L Device:R R4
U 1 1 5E2A3979
P 5250 6700
F 0 "R4" H 5320 6746 50  0000 L CNN
F 1 "10k" H 5320 6655 50  0000 L CNN
F 2 "Resistor_SMD:R_0402_1005Metric" V 5180 6700 50  0001 C CNN
F 3 "~" H 5250 6700 50  0001 C CNN
	1    5250 6700
	1    0    0    -1  
$EndComp
Wire Wire Line
	5250 6950 5250 6850
Wire Wire Line
	6000 6750 6000 6150
Wire Wire Line
	6000 6150 5900 6150
Wire Wire Line
	5600 6150 5250 6150
Wire Wire Line
	5250 6150 5250 6250
Wire Wire Line
	6000 6850 6000 6950
$Comp
L Device:CP C6
U 1 1 5E2A460F
P 5750 6150
F 0 "C6" V 5500 6150 50  0000 C CNN
F 1 "220uF" V 5600 6150 50  0000 C CNN
F 2 "Capacitor_Tantalum_SMD:CP_EIA-3528-12_Kemet-T_Pad1.50x2.35mm_HandSolder" H 5788 6000 50  0001 C CNN
F 3 "~" H 5750 6150 50  0001 C CNN
	1    5750 6150
	0    -1   -1   0   
$EndComp
Wire Wire Line
	4850 6150 5250 6150
Connection ~ 5250 6150
$Comp
L power:GND #PWR028
U 1 1 5E2A493E
P 4450 6450
F 0 "#PWR028" H 4450 6200 50  0001 C CNN
F 1 "GND" H 4455 6277 50  0000 C CNN
F 2 "" H 4450 6450 50  0001 C CNN
F 3 "" H 4450 6450 50  0001 C CNN
	1    4450 6450
	1    0    0    -1  
$EndComp
$Comp
L power:GND #PWR027
U 1 1 5E2A49B2
P 4250 6250
F 0 "#PWR027" H 4250 6000 50  0001 C CNN
F 1 "GND" H 4255 6077 50  0000 C CNN
F 2 "" H 4250 6250 50  0001 C CNN
F 3 "" H 4250 6250 50  0001 C CNN
	1    4250 6250
	1    0    0    -1  
$EndComp
$Comp
L power:GND #PWR026
U 1 1 5E2A49FC
P 3950 6200
F 0 "#PWR026" H 3950 5950 50  0001 C CNN
F 1 "GND" H 3955 6027 50  0000 C CNN
F 2 "" H 3950 6200 50  0001 C CNN
F 3 "" H 3950 6200 50  0001 C CNN
	1    3950 6200
	1    0    0    -1  
$EndComp
Wire Wire Line
	4250 6050 4100 6050
$Comp
L Device:CP C8
U 1 1 5E2A6DA5
P 4550 6850
F 0 "C8" H 4668 6896 50  0000 L CNN
F 1 "10uF" H 4668 6805 50  0000 L CNN
F 2 "Capacitor_Tantalum_SMD:CP_EIA-3216-10_Kemet-I_Pad1.58x1.35mm_HandSolder" H 4588 6700 50  0001 C CNN
F 3 "~" H 4550 6850 50  0001 C CNN
	1    4550 6850
	1    0    0    -1  
$EndComp
$Comp
L Device:C C5
U 1 1 5E2A6F37
P 4550 5550
F 0 "C5" H 4665 5596 50  0000 L CNN
F 1 "0.1uF" H 4665 5505 50  0000 L CNN
F 2 "Capacitor_SMD:C_0402_1005Metric" H 4588 5400 50  0001 C CNN
F 3 "~" H 4550 5550 50  0001 C CNN
	1    4550 5550
	1    0    0    -1  
$EndComp
Wire Wire Line
	4550 5700 4550 5850
$Comp
L power:GND #PWR024
U 1 1 5E2A7170
P 4550 5400
F 0 "#PWR024" H 4550 5150 50  0001 C CNN
F 1 "GND" H 4555 5227 50  0000 C CNN
F 2 "" H 4550 5400 50  0001 C CNN
F 3 "" H 4550 5400 50  0001 C CNN
	1    4550 5400
	-1   0    0    1   
$EndComp
Wire Wire Line
	4550 6450 4550 6700
Wire Wire Line
	4550 7000 4550 7100
Wire Wire Line
	4550 7100 4650 7100
Wire Wire Line
	4650 7100 4650 6450
Wire Wire Line
	3950 5900 3950 5700
Wire Wire Line
	3950 5700 3600 5700
Text Label 3600 5700 2    50   ~ 0
sig_out
Text Label 3750 1650 0    50   ~ 0
pwm_audio_hb
$Comp
L Device:R_PHOTO R2
U 1 1 5E2A8D95
P 9600 5300
F 0 "R2" H 9670 5346 50  0000 L CNN
F 1 "200k" H 9670 5255 50  0000 L CNN
F 2 "Connector_PinHeader_2.54mm:PinHeader_1x02_P2.54mm_Vertical" V 9650 5050 50  0001 L CNN
F 3 "~" H 9600 5250 50  0001 C CNN
	1    9600 5300
	1    0    0    -1  
$EndComp
Text Label 3750 2650 0    50   ~ 0
adc_photo
Text Label 9500 5500 2    50   ~ 0
adc_photo
Wire Wire Line
	9600 5550 9600 5500
$Comp
L Device:R R3
U 1 1 5E2A9A15
P 9600 5700
F 0 "R3" H 9670 5746 50  0000 L CNN
F 1 "10k" H 9670 5655 50  0000 L CNN
F 2 "Resistor_SMD:R_0402_1005Metric" V 9530 5700 50  0001 C CNN
F 3 "~" H 9600 5700 50  0001 C CNN
	1    9600 5700
	1    0    0    -1  
$EndComp
Wire Wire Line
	9600 5500 9500 5500
Connection ~ 9600 5500
Wire Wire Line
	9600 5500 9600 5450
$Comp
L power:GND #PWR025
U 1 1 5E2A9ED3
P 9600 5850
F 0 "#PWR025" H 9600 5600 50  0001 C CNN
F 1 "GND" H 9605 5677 50  0000 C CNN
F 2 "" H 9600 5850 50  0001 C CNN
F 3 "" H 9600 5850 50  0001 C CNN
	1    9600 5850
	1    0    0    -1  
$EndComp
$Comp
L power:+5V #PWR023
U 1 1 5E2AA124
P 9600 5150
F 0 "#PWR023" H 9600 5000 50  0001 C CNN
F 1 "+5V" H 9615 5323 50  0000 C CNN
F 2 "" H 9600 5150 50  0001 C CNN
F 3 "" H 9600 5150 50  0001 C CNN
	1    9600 5150
	1    0    0    -1  
$EndComp
Wire Notes Line
	11050 4400 11050 750 
Text Notes 5450 700  0    50   ~ 0
sd card stuff
Wire Notes Line
	7250 2450 7250 4100
Wire Notes Line
	10900 4100 10900 2450
Wire Notes Line
	8200 950  8200 2200
Wire Notes Line
	8200 2200 10900 2200
Wire Notes Line
	10900 2200 10900 950 
Wire Notes Line
	10900 950  8200 950 
Text Notes 8200 900  0    50   ~ 0
LDO 5v <-> 3v3
Text Notes 7250 2400 0    50   ~ 0
sd shield
Wire Notes Line
	4550 4400 4550 750 
Wire Notes Line
	4750 1200 7050 1200
Wire Notes Line
	7050 1200 7050 4100
Wire Notes Line
	7050 4100 4750 4100
Wire Notes Line
	4750 4100 4750 1200
Text Notes 4750 1150 0    50   ~ 0
lvl translator
Wire Notes Line
	3250 5050 3250 7300
Wire Notes Line
	6750 7300 6750 5050
Text Notes 3250 5000 0    50   ~ 0
audio
Wire Notes Line
	9050 4850 10000 4850
Wire Notes Line
	10000 4850 10000 6150
Wire Notes Line
	10000 6150 9050 6150
Wire Notes Line
	9050 6150 9050 4850
Text Notes 9050 4800 0    50   ~ 0
sensor
Wire Notes Line
	10100 4600 10100 6300
Wire Notes Line
	10100 6300 11050 6300
Wire Notes Line
	11050 4600 10100 4600
Wire Notes Line
	11050 4600 11050 6300
Text Notes 10100 4550 0    50   ~ 0
leds
$Comp
L power:GND #PWR033
U 1 1 5E2BD739
P 10550 3650
F 0 "#PWR033" H 10550 3400 50  0001 C CNN
F 1 "GND" V 10555 3522 50  0000 R CNN
F 2 "" H 10550 3650 50  0001 C CNN
F 3 "" H 10550 3650 50  0001 C CNN
	1    10550 3650
	0    -1   -1   0   
$EndComp
Wire Wire Line
	3250 1250 3150 1250
Text Notes 4300 3850 1    50   ~ 0
gpio pins only
$Comp
L Device:C C9
U 1 1 5E2AF786
P 7600 3600
F 0 "C9" H 7715 3646 50  0000 L CNN
F 1 "47uF" H 7715 3555 50  0000 L CNN
F 2 "Capacitor_SMD:C_0805_2012Metric_Pad1.15x1.40mm_HandSolder" H 7638 3450 50  0001 C CNN
F 3 "~" H 7600 3600 50  0001 C CNN
	1    7600 3600
	1    0    0    -1  
$EndComp
$Comp
L power:+3.3V #PWR031
U 1 1 5E2B0594
P 7600 3450
F 0 "#PWR031" H 7600 3300 50  0001 C CNN
F 1 "+3.3V" V 7615 3578 50  0000 L CNN
F 2 "" H 7600 3450 50  0001 C CNN
F 3 "" H 7600 3450 50  0001 C CNN
	1    7600 3450
	1    0    0    -1  
$EndComp
$Comp
L power:GND #PWR032
U 1 1 5E2B0BFC
P 7600 3750
F 0 "#PWR032" H 7600 3500 50  0001 C CNN
F 1 "GND" V 7605 3622 50  0000 R CNN
F 2 "" H 7600 3750 50  0001 C CNN
F 3 "" H 7600 3750 50  0001 C CNN
	1    7600 3750
	1    0    0    -1  
$EndComp
$Comp
L 0475710001:0475710001 J1
U 1 1 5E2B04DD
P 9750 3300
F 0 "J1" H 9800 3867 50  0000 C CNN
F 1 "0475710001" H 9800 3776 50  0000 C CNN
F 2 "sdconn:MOLEX_0475710001" H 9750 3300 50  0001 L BNN
F 3 "MOLEX" H 9750 3300 50  0001 L BNN
	1    9750 3300
	1    0    0    -1  
$EndComp
Wire Wire Line
	10450 3450 10500 3450
Wire Wire Line
	10500 3450 10500 3550
Wire Wire Line
	10500 3650 10450 3650
Wire Wire Line
	10550 3650 10500 3650
Connection ~ 10500 3650
Wire Wire Line
	10500 3550 10450 3550
Connection ~ 10500 3550
Wire Wire Line
	10500 3550 10500 3650
Text Label 10450 2950 0    50   ~ 0
sd_detect
Text Label 3750 1950 0    50   ~ 0
sd_detect
$Comp
L Device:R_POT_TRIM RV1
U 1 1 5E2B47BE
P 3950 6050
F 0 "RV1" H 3880 6096 50  0000 R CNN
F 1 "10k" H 3880 6005 50  0000 R CNN
F 2 "r_trimmer:35WR" H 3950 6050 50  0001 C CNN
F 3 "~" H 3950 6050 50  0001 C CNN
	1    3950 6050
	1    0    0    -1  
$EndComp
Connection ~ 3150 1250
$Comp
L power:+5V #PWR034
U 1 1 5E2B7C7A
P 4450 5850
F 0 "#PWR034" H 4450 5700 50  0001 C CNN
F 1 "+5V" H 4465 6023 50  0000 C CNN
F 2 "" H 4450 5850 50  0001 C CNN
F 3 "" H 4450 5850 50  0001 C CNN
	1    4450 5850
	1    0    0    -1  
$EndComp
Text Notes 2150 650  0    50   ~ 0
http://wiki.openmusiclabs.com/wiki/PWMDAC
Text Label 3750 1750 0    50   ~ 0
pwm_audio_lb
Text Notes 3750 1450 0    50   ~ 0
timer1 (16-bit)
$Comp
L Device:R R6
U 1 1 5E2C0A09
P 8100 5400
F 0 "R6" V 8200 5300 50  0000 L CNN
F 1 "3.9k" V 8300 5300 50  0000 L CNN
F 2 "Resistor_SMD:R_0402_1005Metric" V 8030 5400 50  0001 C CNN
F 3 "~" H 8100 5400 50  0001 C CNN
	1    8100 5400
	0    1    1    0   
$EndComp
$Comp
L Device:C C10
U 1 1 5E2C0CE9
P 8350 5650
F 0 "C10" H 8465 5696 50  0000 L CNN
F 1 "4.7nF" H 8465 5605 50  0000 L CNN
F 2 "Capacitor_SMD:C_0402_1005Metric" H 8388 5500 50  0001 C CNN
F 3 "~" H 8350 5650 50  0001 C CNN
	1    8350 5650
	1    0    0    -1  
$EndComp
$Comp
L Device:R R5
U 1 1 5E2C0E35
P 8100 5250
F 0 "R5" V 7900 5150 50  0000 L CNN
F 1 "1M" V 8000 5150 50  0000 L CNN
F 2 "Resistor_SMD:R_0402_1005Metric" V 8030 5250 50  0001 C CNN
F 3 "~" H 8100 5250 50  0001 C CNN
	1    8100 5250
	0    1    1    0   
$EndComp
Wire Wire Line
	8250 5400 8350 5400
Wire Wire Line
	8350 5400 8350 5500
Wire Wire Line
	8250 5250 8350 5250
Wire Wire Line
	8350 5250 8350 5400
Connection ~ 8350 5400
$Comp
L power:GND #PWR022
U 1 1 5E2C3722
P 8350 5800
F 0 "#PWR022" H 8350 5550 50  0001 C CNN
F 1 "GND" H 8355 5627 50  0000 C CNN
F 2 "" H 8350 5800 50  0001 C CNN
F 3 "" H 8350 5800 50  0001 C CNN
	1    8350 5800
	1    0    0    -1  
$EndComp
Text Label 8450 5250 0    50   ~ 0
sig_out
Wire Wire Line
	8350 5250 8450 5250
Connection ~ 8350 5250
$Comp
L power:GND #PWR035
U 1 1 5E2CFF2D
P 10650 6000
F 0 "#PWR035" H 10650 5750 50  0001 C CNN
F 1 "GND" H 10655 5827 50  0000 C CNN
F 2 "" H 10650 6000 50  0001 C CNN
F 3 "" H 10650 6000 50  0001 C CNN
	1    10650 6000
	0    -1   -1   0   
$EndComp
Text Label 7950 5400 2    50   ~ 0
pwm_audio_hb
Text Label 7950 5250 2    50   ~ 0
pwm_audio_lb
Text Notes 7300 4850 0    50   ~ 0
pwm-based DAC
Wire Notes Line
	7300 4900 8850 4900
Wire Notes Line
	8850 4900 8850 6050
Wire Notes Line
	8850 6050 7300 6050
Wire Notes Line
	7300 6050 7300 4900
Text Notes 6250 6500 0    50   ~ 0
8ohm
Text Notes 7300 6150 0    50   ~ 0
low-pass filter
Text Notes 1250 1850 0    50   ~ 0
decoupling (mcu)
Text Notes 7400 3900 1    50   ~ 0
decoupling (sd)
Text Notes 7250 5800 1    50   ~ 0
pin order\nintentionally flipped
$Comp
L Device:R R11
U 1 1 5E2D31F3
P 8600 3650
F 0 "R11" H 8670 3696 50  0000 L CNN
F 1 "49.9k" H 8670 3605 50  0000 L CNN
F 2 "Resistor_SMD:R_0402_1005Metric" V 8530 3650 50  0001 C CNN
F 3 "~" H 8600 3650 50  0001 C CNN
	1    8600 3650
	0    -1   -1   0   
$EndComp
$Comp
L Device:R R10
U 1 1 5E2D348F
P 8600 3550
F 0 "R10" H 8670 3596 50  0000 L CNN
F 1 "49.9k" H 8670 3505 50  0000 L CNN
F 2 "Resistor_SMD:R_0402_1005Metric" V 8530 3550 50  0001 C CNN
F 3 "~" H 8600 3550 50  0001 C CNN
	1    8600 3550
	0    -1   -1   0   
$EndComp
$Comp
L Device:R R9
U 1 1 5E2D34E5
P 8600 3150
F 0 "R9" H 8670 3196 50  0000 L CNN
F 1 "49.9k" H 8670 3105 50  0000 L CNN
F 2 "Resistor_SMD:R_0402_1005Metric" V 8530 3150 50  0001 C CNN
F 3 "~" H 8600 3150 50  0001 C CNN
	1    8600 3150
	0    -1   -1   0   
$EndComp
$Comp
L Device:R R8
U 1 1 5E2D3535
P 8600 3050
F 0 "R8" H 8670 3096 50  0000 L CNN
F 1 "49.9k" H 8670 3005 50  0000 L CNN
F 2 "Resistor_SMD:R_0402_1005Metric" V 8530 3050 50  0001 C CNN
F 3 "~" H 8600 3050 50  0001 C CNN
	1    8600 3050
	0    -1   -1   0   
$EndComp
$Comp
L Device:R R7
U 1 1 5E2D358B
P 8600 2950
F 0 "R7" H 8670 2996 50  0000 L CNN
F 1 "49.9k" H 8670 2905 50  0000 L CNN
F 2 "Resistor_SMD:R_0402_1005Metric" V 8530 2950 50  0001 C CNN
F 3 "~" H 8600 2950 50  0001 C CNN
	1    8600 2950
	0    -1   -1   0   
$EndComp
$Comp
L power:+3.3V #PWR0101
U 1 1 5E2D4F69
P 8350 2950
F 0 "#PWR0101" H 8350 2800 50  0001 C CNN
F 1 "+3.3V" V 8365 3078 50  0000 L CNN
F 2 "" H 8350 2950 50  0001 C CNN
F 3 "" H 8350 2950 50  0001 C CNN
	1    8350 2950
	0    -1   -1   0   
$EndComp
Wire Notes Line
	4550 4400 11050 4400
Wire Notes Line
	4550 750  11050 750 
Wire Wire Line
	9150 2950 8750 2950
Wire Wire Line
	9150 3650 8750 3650
Wire Wire Line
	9150 3050 8750 3050
Wire Wire Line
	9150 3150 8750 3150
Wire Wire Line
	9150 3550 8750 3550
Wire Wire Line
	8450 2950 8350 2950
Wire Wire Line
	8350 3150 8450 3150
Wire Wire Line
	8400 3550 8400 3600
Wire Wire Line
	8400 3650 8450 3650
Wire Wire Line
	8400 3550 8450 3550
$Comp
L power:+3.3V #PWR0102
U 1 1 5E2EB6B1
P 8350 3600
F 0 "#PWR0102" H 8350 3450 50  0001 C CNN
F 1 "+3.3V" V 8365 3728 50  0000 L CNN
F 2 "" H 8350 3600 50  0001 C CNN
F 3 "" H 8350 3600 50  0001 C CNN
	1    8350 3600
	0    -1   -1   0   
$EndComp
Wire Wire Line
	8400 3600 8350 3600
Connection ~ 8400 3600
Wire Wire Line
	8400 3600 8400 3650
Text Notes 8300 3900 0    50   ~ 0
pull-up for uSD (sck exception)
Wire Notes Line
	7250 4100 10900 4100
Wire Notes Line
	7250 2450 10900 2450
Wire Wire Line
	8350 3050 8450 3050
$Comp
L power:+3.3V #PWR041
U 1 1 5E2F55A1
P 8350 3150
F 0 "#PWR041" H 8350 3000 50  0001 C CNN
F 1 "+3.3V" V 8365 3278 50  0000 L CNN
F 2 "" H 8350 3150 50  0001 C CNN
F 3 "" H 8350 3150 50  0001 C CNN
	1    8350 3150
	0    -1   -1   0   
$EndComp
$Comp
L power:GND #PWR040
U 1 1 5E2F5678
P 8350 3050
F 0 "#PWR040" H 8350 2800 50  0001 C CNN
F 1 "GND" V 8355 2922 50  0000 R CNN
F 2 "" H 8350 3050 50  0001 C CNN
F 3 "" H 8350 3050 50  0001 C CNN
	1    8350 3050
	0    1    1    0   
$EndComp
NoConn ~ 5300 2950
NoConn ~ 5600 2700
NoConn ~ 5000 2700
$Comp
L naisuRingBoxu:MIC2288 U5
U 1 1 5E2F6B1B
P 1800 6000
F 0 "U5" H 1800 6465 50  0000 C CNN
F 1 "MIC2288" H 1800 6374 50  0000 C CNN
F 2 "Package_TO_SOT_SMD:TSOT-23-5" H 1800 6150 50  0001 C CNN
F 3 "" H 1800 6150 50  0001 C CNN
	1    1800 6000
	1    0    0    -1  
$EndComp
$Comp
L power:GND #PWR036
U 1 1 5E2FB2E7
P 900 4900
F 0 "#PWR036" H 900 4650 50  0001 C CNN
F 1 "GND" H 905 4727 50  0000 C CNN
F 2 "" H 900 4900 50  0001 C CNN
F 3 "" H 900 4900 50  0001 C CNN
	1    900  4900
	1    0    0    -1  
$EndComp
$Comp
L main-rescue:+3V0-power #PWR07
U 1 1 5E2FC902
P 900 4500
F 0 "#PWR07" H 900 4350 50  0001 C CNN
F 1 "+3V0" H 915 4673 50  0000 C CNN
F 2 "" H 900 4500 50  0001 C CNN
F 3 "" H 900 4500 50  0001 C CNN
	1    900  4500
	1    0    0    -1  
$EndComp
$Comp
L main-rescue:+3V0-power #PWR037
U 1 1 5E2FE3E6
P 950 5450
F 0 "#PWR037" H 950 5300 50  0001 C CNN
F 1 "+3V0" V 965 5578 50  0000 L CNN
F 2 "" H 950 5450 50  0001 C CNN
F 3 "" H 950 5450 50  0001 C CNN
	1    950  5450
	0    -1   -1   0   
$EndComp
Wire Wire Line
	1500 5800 1500 5450
$Comp
L Device:L L1
U 1 1 5E301880
P 1800 5450
F 0 "L1" V 1990 5450 50  0000 C CNN
F 1 "10uH" V 1899 5450 50  0000 C CNN
F 2 "Inductor_SMD:L_0805_2012Metric" H 1800 5450 50  0001 C CNN
F 3 "~" H 1800 5450 50  0001 C CNN
	1    1800 5450
	0    -1   -1   0   
$EndComp
Wire Wire Line
	1500 5450 1650 5450
Wire Wire Line
	1950 5450 2100 5450
Wire Wire Line
	2100 5450 2100 5800
$Comp
L Device:D_Schottky D1
U 1 1 5E305D16
P 2250 5450
F 0 "D1" H 2250 5234 50  0000 C CNN
F 1 "D_Schottky" H 2250 5325 50  0000 C CNN
F 2 "Diode_SMD:D_SOD-323" H 2250 5450 50  0001 C CNN
F 3 "~" H 2250 5450 50  0001 C CNN
	1    2250 5450
	-1   0    0    1   
$EndComp
Connection ~ 2100 5450
$Comp
L Device:R R12
U 1 1 5E30759D
P 2400 5750
F 0 "R12" H 2470 5796 50  0000 L CNN
F 1 "5.62k" H 2470 5705 50  0000 L CNN
F 2 "Resistor_SMD:R_0402_1005Metric" V 2330 5750 50  0001 C CNN
F 3 "~" H 2400 5750 50  0001 C CNN
	1    2400 5750
	1    0    0    -1  
$EndComp
$Comp
L Device:R R13
U 1 1 5E307B0A
P 2400 6250
F 0 "R13" H 2470 6296 50  0000 L CNN
F 1 "1.87k" H 2470 6205 50  0000 L CNN
F 2 "Resistor_SMD:R_0402_1005Metric" V 2330 6250 50  0001 C CNN
F 3 "~" H 2400 6250 50  0001 C CNN
	1    2400 6250
	1    0    0    -1  
$EndComp
Wire Wire Line
	2100 6000 2400 6000
Wire Wire Line
	2400 5450 2400 5600
Wire Wire Line
	2400 5900 2400 6000
Wire Wire Line
	2400 6000 2400 6100
Connection ~ 2400 6000
$Comp
L power:GND #PWR038
U 1 1 5E30E754
P 1800 6400
F 0 "#PWR038" H 1800 6150 50  0001 C CNN
F 1 "GND" H 1805 6227 50  0000 C CNN
F 2 "" H 1800 6400 50  0001 C CNN
F 3 "" H 1800 6400 50  0001 C CNN
	1    1800 6400
	1    0    0    -1  
$EndComp
Wire Wire Line
	1800 6400 2400 6400
Wire Wire Line
	1800 6350 1800 6400
Connection ~ 1800 6400
Wire Wire Line
	1500 5450 1400 5450
Wire Wire Line
	1400 5450 1400 6000
Wire Wire Line
	1400 6000 1500 6000
Connection ~ 1500 5450
Wire Wire Line
	1400 5450 1050 5450
Wire Wire Line
	1050 5450 1050 5600
Connection ~ 1400 5450
Wire Wire Line
	950  5450 1050 5450
Connection ~ 1050 5450
Wire Wire Line
	1050 5900 1050 6400
Wire Wire Line
	1050 6400 1800 6400
$Comp
L Device:C C12
U 1 1 5E31CC11
P 2800 5750
F 0 "C12" H 2915 5796 50  0000 L CNN
F 1 "22uF" H 2915 5705 50  0000 L CNN
F 2 "Capacitor_SMD:C_0603_1608Metric" H 2838 5600 50  0001 C CNN
F 3 "~" H 2800 5750 50  0001 C CNN
	1    2800 5750
	1    0    0    -1  
$EndComp
Wire Notes Line
	3250 7300 6750 7300
Wire Notes Line
	6750 5050 3250 5050
Wire Wire Line
	2400 5450 2800 5450
Wire Wire Line
	2800 5450 2800 5600
Connection ~ 2400 5450
Wire Wire Line
	2800 5900 2800 6400
Wire Wire Line
	2800 6400 2400 6400
Connection ~ 2400 6400
Wire Wire Line
	2800 5450 2900 5450
Connection ~ 2800 5450
$Comp
L power:+5V #PWR039
U 1 1 5E3360D1
P 2900 5450
F 0 "#PWR039" H 2900 5300 50  0001 C CNN
F 1 "+5V" H 2915 5623 50  0000 C CNN
F 2 "" H 2900 5450 50  0001 C CNN
F 3 "" H 2900 5450 50  0001 C CNN
	1    2900 5450
	0    1    1    0   
$EndComp
$Comp
L Device:C C11
U 1 1 5E31322D
P 1050 5750
F 0 "C11" H 1165 5796 50  0000 L CNN
F 1 "1uF" H 1165 5705 50  0000 L CNN
F 2 "Capacitor_SMD:C_0402_1005Metric" H 1088 5600 50  0001 C CNN
F 3 "~" H 1050 5750 50  0001 C CNN
	1    1050 5750
	1    0    0    -1  
$EndComp
$Comp
L CR-2032_F2N:CR-2032_F2N BAT1
U 1 1 5E355341
P 900 4700
F 0 "BAT1" V 946 4567 50  0000 R CNN
F 1 "CR-2032_F2N" V 855 4567 50  0000 R CNN
F 2 "CR-2032_F2N:F2N" H 900 4700 50  0001 L BNN
F 3 "" H 900 4700 50  0001 L BNN
F 4 "Panasonic" H 900 4700 50  0001 L BNN "Field4"
F 5 "Manufacturer Recommendations" H 900 4700 50  0001 L BNN "Field5"
	1    900  4700
	0    -1   -1   0   
$EndComp
$Comp
L Connector:TestPoint TP8
U 1 1 5E3C6276
P 3750 3050
F 0 "TP8" V 3704 3238 50  0000 L CNN
F 1 "TestPoint" V 3795 3238 50  0000 L CNN
F 2 "TestPoint:TestPoint_THTPad_1.0x1.0mm_Drill0.5mm" H 3950 3050 50  0001 C CNN
F 3 "~" H 3950 3050 50  0001 C CNN
	1    3750 3050
	0    1    1    0   
$EndComp
$Comp
L Connector:TestPoint TP6
U 1 1 5E3C8A38
P 3750 2450
F 0 "TP6" V 3704 2638 50  0000 L CNN
F 1 "TestPoint" V 3795 2638 50  0000 L CNN
F 2 "TestPoint:TestPoint_THTPad_1.0x1.0mm_Drill0.5mm" H 3950 2450 50  0001 C CNN
F 3 "~" H 3950 2450 50  0001 C CNN
	1    3750 2450
	0    1    1    0   
$EndComp
$Comp
L Connector:TestPoint TP7
U 1 1 5E3C8EC6
P 3750 2550
F 0 "TP7" V 3704 2738 50  0000 L CNN
F 1 "TestPoint" V 3795 2738 50  0000 L CNN
F 2 "TestPoint:TestPoint_THTPad_1.0x1.0mm_Drill0.5mm" H 3950 2550 50  0001 C CNN
F 3 "~" H 3950 2550 50  0001 C CNN
	1    3750 2550
	0    1    1    0   
$EndComp
$Comp
L Connector:TestPoint TP3
U 1 1 5E3C903C
P 2550 3550
F 0 "TP3" V 2745 3622 50  0000 C CNN
F 1 "TestPoint" V 2654 3622 50  0000 C CNN
F 2 "TestPoint:TestPoint_THTPad_1.0x1.0mm_Drill0.5mm" H 2750 3550 50  0001 C CNN
F 3 "~" H 2750 3550 50  0001 C CNN
	1    2550 3550
	0    -1   -1   0   
$EndComp
$Comp
L Connector:TestPoint TP2
U 1 1 5E3CD33B
P 1600 3500
F 0 "TP2" V 1795 3572 50  0000 C CNN
F 1 "TestPoint" V 1704 3572 50  0000 C CNN
F 2 "TestPoint:TestPoint_THTPad_1.0x1.0mm_Drill0.5mm" H 1800 3500 50  0001 C CNN
F 3 "~" H 1800 3500 50  0001 C CNN
	1    1600 3500
	1    0    0    -1  
$EndComp
$Comp
L power:GND #PWR043
U 1 1 5E3D2492
P 1600 3500
F 0 "#PWR043" H 1600 3250 50  0001 C CNN
F 1 "GND" H 1605 3327 50  0000 C CNN
F 2 "" H 1600 3500 50  0001 C CNN
F 3 "" H 1600 3500 50  0001 C CNN
	1    1600 3500
	1    0    0    -1  
$EndComp
$Comp
L power:+5V #PWR042
U 1 1 5E3D4F61
P 1450 3450
F 0 "#PWR042" H 1450 3300 50  0001 C CNN
F 1 "+5V" H 1465 3623 50  0000 C CNN
F 2 "" H 1450 3450 50  0001 C CNN
F 3 "" H 1450 3450 50  0001 C CNN
	1    1450 3450
	1    0    0    -1  
$EndComp
$Comp
L Connector:TestPoint TP1
U 1 1 5E3D5B25
P 1450 3450
F 0 "TP1" V 1645 3522 50  0000 C CNN
F 1 "TestPoint" V 1554 3522 50  0000 C CNN
F 2 "TestPoint:TestPoint_THTPad_1.0x1.0mm_Drill0.5mm" H 1650 3450 50  0001 C CNN
F 3 "~" H 1650 3450 50  0001 C CNN
	1    1450 3450
	-1   0    0    1   
$EndComp
$Comp
L Connector:TestPoint TP4
U 1 1 5E3E0D04
P 3750 2150
F 0 "TP4" V 3704 2338 50  0000 L CNN
F 1 "TestPoint" V 3795 2338 50  0000 L CNN
F 2 "TestPoint:TestPoint_THTPad_1.0x1.0mm_Drill0.5mm" H 3950 2150 50  0001 C CNN
F 3 "~" H 3950 2150 50  0001 C CNN
	1    3750 2150
	0    1    1    0   
$EndComp
$Comp
L Connector:TestPoint TP5
U 1 1 5E3E1A54
P 3750 2250
F 0 "TP5" V 3704 2438 50  0000 L CNN
F 1 "TestPoint" V 3795 2438 50  0000 L CNN
F 2 "TestPoint:TestPoint_THTPad_1.0x1.0mm_Drill0.5mm" H 3950 2250 50  0001 C CNN
F 3 "~" H 3950 2250 50  0001 C CNN
	1    3750 2250
	0    1    1    0   
$EndComp
$EndSCHEMATC
