
(module SOIC127P600X175-8N (layer F.Cu) (tedit 5E286DEA)
  (descr "")
  (fp_text reference REF** (at -0.795 -3.337 0) (layer F.SilkS)
    (effects (font (size 1.0 1.0) (thickness 0.015)))
  )
  (fp_text value SOIC127P600X175-8N (at 7.46 3.337 0) (layer F.Fab)
    (effects (font (size 1.0 1.0) (thickness 0.015)))
  )
  (fp_circle (center -4.445 -2.505) (end -4.345 -2.505) (layer F.SilkS) (width 0.2))
  (fp_circle (center -4.445 -2.505) (end -4.345 -2.505) (layer F.Fab) (width 0.2))
  (fp_line (start -1.95 -2.45) (end 1.95 -2.45) (layer F.Fab) (width 0.127))
  (fp_line (start -1.95 2.45) (end 1.95 2.45) (layer F.Fab) (width 0.127))
  (fp_line (start -1.95 -2.525) (end 1.95 -2.525) (layer F.SilkS) (width 0.127))
  (fp_line (start -1.95 2.525) (end 1.95 2.525) (layer F.SilkS) (width 0.127))
  (fp_line (start -1.95 -2.45) (end -1.95 2.45) (layer F.Fab) (width 0.127))
  (fp_line (start 1.95 -2.45) (end 1.95 2.45) (layer F.Fab) (width 0.127))
  (fp_line (start -3.71 -2.75) (end 3.71 -2.75) (layer F.CrtYd) (width 0.05))
  (fp_line (start -3.71 2.75) (end 3.71 2.75) (layer F.CrtYd) (width 0.05))
  (fp_line (start -3.71 -2.75) (end -3.71 2.75) (layer F.CrtYd) (width 0.05))
  (fp_line (start 3.71 -2.75) (end 3.71 2.75) (layer F.CrtYd) (width 0.05))
  (pad 1 smd rect (at -2.475 -1.905) (size 1.97 0.6) (layers F.Cu F.Mask F.Paste))
  (pad 2 smd rect (at -2.475 -0.635) (size 1.97 0.6) (layers F.Cu F.Mask F.Paste))
  (pad 3 smd rect (at -2.475 0.635) (size 1.97 0.6) (layers F.Cu F.Mask F.Paste))
  (pad 4 smd rect (at -2.475 1.905) (size 1.97 0.6) (layers F.Cu F.Mask F.Paste))
  (pad 5 smd rect (at 2.475 1.905) (size 1.97 0.6) (layers F.Cu F.Mask F.Paste))
  (pad 6 smd rect (at 2.475 0.635) (size 1.97 0.6) (layers F.Cu F.Mask F.Paste))
  (pad 7 smd rect (at 2.475 -0.635) (size 1.97 0.6) (layers F.Cu F.Mask F.Paste))
  (pad 8 smd rect (at 2.475 -1.905) (size 1.97 0.6) (layers F.Cu F.Mask F.Paste))
)