EESchema Schematic File Version 4
EELAYER 26 0
EELAYER END
$Descr A4 11693 8268
encoding utf-8
Sheet 1 1
Title ""
Date ""
Rev ""
Comp ""
Comment1 ""
Comment2 ""
Comment3 ""
Comment4 ""
$EndDescr
$Comp
L power:+5V #PWR01
U 1 1 5E22325B
P 5200 3400
F 0 "#PWR01" H 5200 3250 50  0001 C CNN
F 1 "+5V" H 5215 3573 50  0000 C CNN
F 2 "" H 5200 3400 50  0001 C CNN
F 3 "" H 5200 3400 50  0001 C CNN
	1    5200 3400
	1    0    0    -1  
$EndComp
$Comp
L power:GND #PWR02
U 1 1 5E2231EC
P 5200 4000
F 0 "#PWR02" H 5200 3750 50  0001 C CNN
F 1 "GND" H 5205 3827 50  0000 C CNN
F 2 "" H 5200 4000 50  0001 C CNN
F 3 "" H 5200 4000 50  0001 C CNN
	1    5200 4000
	1    0    0    -1  
$EndComp
$Comp
L LED:SK6812 D2
U 1 1 5E25324B
P 6200 3700
F 0 "D2" H 6541 3746 50  0000 L CNN
F 1 "SK6812" H 6541 3655 50  0000 L CNN
F 2 "LED_SMD:LED_SK6812_PLCC4_5.0x5.0mm_P3.2mm" H 6250 3400 50  0001 L TNN
F 3 "https://cdn-shop.adafruit.com/product-files/1138/SK6812+LED+datasheet+.pdf" H 6300 3325 50  0001 L TNN
	1    6200 3700
	1    0    0    -1  
$EndComp
Text Notes 5350 3150 0    50   ~ 0
top
$Comp
L Connector:Conn_01x04_Male J1
U 1 1 5E253C4C
P 7650 3600
F 0 "J1" V 7450 3550 50  0000 C CNN
F 1 "Conn_01x04_Male" V 7550 3550 50  0000 C CNN
F 2 "Connector_PinHeader_2.54mm:PinHeader_1x04_P2.54mm_Horizontal" H 7650 3600 50  0001 C CNN
F 3 "~" H 7650 3600 50  0001 C CNN
	1    7650 3600
	1    0    0    -1  
$EndComp
$Comp
L LED:SK6812 D1
U 1 1 5E2531E7
P 5200 3700
F 0 "D1" H 4700 3650 50  0000 L CNN
F 1 "SK6812" H 4700 3550 50  0000 L CNN
F 2 "LED_SMD:LED_SK6812_PLCC4_5.0x5.0mm_P3.2mm" H 5250 3400 50  0001 L TNN
F 3 "https://cdn-shop.adafruit.com/product-files/1138/SK6812+LED+datasheet+.pdf" H 5300 3325 50  0001 L TNN
	1    5200 3700
	1    0    0    -1  
$EndComp
$Comp
L power:+5V #PWR?
U 1 1 5E253E3B
P 6200 3400
F 0 "#PWR?" H 6200 3250 50  0001 C CNN
F 1 "+5V" H 6215 3573 50  0000 C CNN
F 2 "" H 6200 3400 50  0001 C CNN
F 3 "" H 6200 3400 50  0001 C CNN
	1    6200 3400
	1    0    0    -1  
$EndComp
$Comp
L power:GND #PWR?
U 1 1 5E253E4C
P 6200 4000
F 0 "#PWR?" H 6200 3750 50  0001 C CNN
F 1 "GND" H 6205 3827 50  0000 C CNN
F 2 "" H 6200 4000 50  0001 C CNN
F 3 "" H 6200 4000 50  0001 C CNN
	1    6200 4000
	1    0    0    -1  
$EndComp
Text Label 4900 3700 2    50   ~ 0
in1
Text Label 5900 3700 2    50   ~ 0
in2
Text Label 7850 3600 0    50   ~ 0
in1
Text Label 7850 3700 0    50   ~ 0
in2
$Comp
L power:GND #PWR?
U 1 1 5E253FD7
P 7850 3800
F 0 "#PWR?" H 7850 3550 50  0001 C CNN
F 1 "GND" H 7855 3627 50  0000 C CNN
F 2 "" H 7850 3800 50  0001 C CNN
F 3 "" H 7850 3800 50  0001 C CNN
	1    7850 3800
	1    0    0    -1  
$EndComp
$Comp
L power:+5V #PWR?
U 1 1 5E253FE8
P 7850 3500
F 0 "#PWR?" H 7850 3350 50  0001 C CNN
F 1 "+5V" H 7865 3673 50  0000 C CNN
F 2 "" H 7850 3500 50  0001 C CNN
F 3 "" H 7850 3500 50  0001 C CNN
	1    7850 3500
	1    0    0    -1  
$EndComp
$EndSCHEMATC
