
(module MOLEX_0475710001 (layer F.Cu) (tedit 5E2AFA8B)
  (descr "")
  (fp_text reference REF** (at -2.127575 -3.739505 0) (layer F.SilkS)
    (effects (font (size 1.00120472441 1.00120472441) (thickness 0.015)))
  )
  (fp_text value MOLEX_0475710001 (at 4.56555 3.66943 0) (layer F.Fab)
    (effects (font (size 1.00121259843 1.00121259843) (thickness 0.015)))
  )
  (fp_line (start -5.7 -1.275) (end -5.7 -2.725) (layer F.SilkS) (width 0.2))
  (fp_line (start -5.7 -2.725) (end 5.7 -2.725) (layer F.SilkS) (width 0.2))
  (fp_line (start 5.7 -2.725) (end 5.7 -0.875) (layer F.SilkS) (width 0.2))
  (fp_line (start -4.4 2.725) (end 4.25 2.725) (layer F.SilkS) (width 0.2))
  (fp_line (start -5.95 -2.95) (end 6.15 -2.95) (layer F.CrtYd) (width 0.05))
  (fp_line (start 6.15 -2.95) (end 6.15 3.05) (layer F.CrtYd) (width 0.05))
  (fp_line (start 6.15 3.05) (end -5.95 3.05) (layer F.CrtYd) (width 0.05))
  (fp_line (start -5.95 3.05) (end -5.95 -2.95) (layer F.CrtYd) (width 0.05))
  (pad 1 smd rect (at 3.55 -1.415) (size 0.7 1.0) (layers F.Cu F.Mask F.Paste))
  (pad 2 smd rect (at 2.45 -1.415) (size 0.7 1.0) (layers F.Cu F.Mask F.Paste))
  (pad 3 smd rect (at 1.35 -1.415) (size 0.7 1.0) (layers F.Cu F.Mask F.Paste))
  (pad 4 smd rect (at 0.25 -1.415) (size 0.7 1.0) (layers F.Cu F.Mask F.Paste))
  (pad 5 smd rect (at -0.85 -1.415) (size 0.7 1.0) (layers F.Cu F.Mask F.Paste))
  (pad 6 smd rect (at -1.95 -1.415) (size 0.7 1.0) (layers F.Cu F.Mask F.Paste))
  (pad 7 smd rect (at -3.05 -1.415) (size 0.7 1.0) (layers F.Cu F.Mask F.Paste))
  (pad 8 smd rect (at -4.15 -1.415) (size 0.7 1.0) (layers F.Cu F.Mask F.Paste))
  (pad 13 smd rect (at 5.175 0.075) (size 1.45 1.2) (layers F.Cu F.Mask F.Paste))
  (pad 12 smd rect (at 5.4 1.225) (size 1.0 0.7) (layers F.Cu F.Mask F.Paste))
  (pad 11 smd rect (at 5.2 2.375) (size 1.4 0.9) (layers F.Cu F.Mask F.Paste))
  (pad 9 smd rect (at -5.225 -0.365) (size 1.15 1.2) (layers F.Cu F.Mask F.Paste))
  (pad 10 smd rect (at -5.225 2.225) (size 1.15 1.2) (layers F.Cu F.Mask F.Paste))
)