1;4;p
0;9;p
1;14;p
2;18;p
2;23;p
3;27;p
3;35;p
5;41;p
6;46;p
6;52;p
7;55;p
8;61;p
9;67;p
9;74;p
9;82;p
11;87;p
11;91;p
12;96;p
12;98;p
12;99;p
12;100;p
13;102;p
14;102;p
15;102;p
19;102;p
25;102;p
32;102;p
39;101;p
47;98;p
56;96;p
62;94;p
67;93;p
72;92;p
76;91;p
79;91;p
80;91;p
82;91;p
84;90;p
85;90;p
86;90;p
87;90;p
89;89;p
92;89;p
95;89;p
100;89;p
104;89;p
110;89;p
116;89;p
121;89;p
124;89;p
127;89;p
129;89;p
131;88;p
133;88;p
135;88;p
137;87;p
140;87;p
142;87;p
144;87;p
146;87;p
148;87;p
151;86;p
152;86;p
154;86;p
155;86;p
157;86;p
159;85;p
160;85;p
163;85;p
166;85;p
168;85;p
169;85;p
170;85;p
171;84;p
171;82;p
171;80;p
171;76;p
171;73;p
171;69;p
171;66;p
170;63;p
169;60;p
169;57;p
168;54;p
167;51;p
166;46;p
165;44;p
164;40;p
163;38;p
163;36;p
162;34;p
162;31;p
161;29;p
161;27;p
161;26;p
160;24;p
160;23;p
160;21;p
160;20;p
160;19;p
159;18;p
159;17;p
159;16;p
159;15;p
159;13;p
158;11;p
158;10;p
158;9;p
157;7;p
157;6;p
156;6;p
155;5;p
154;5;p
152;4;p
147;4;p
142;2;p
136;2;p
130;1;p
122;0;p
115;0;p
107;0;p
101;0;p
94;0;p
90;0;p
86;0;p
82;0;p
79;0;p
75;0;p
72;0;p
68;0;p
63;0;p
60;0;p
55;0;p
50;0;p
44;0;p
38;0;p
31;0;p
25;0;p
20;0;p
17;0;p
15;0;p
13;0;p
12;0;p
11;0;p
10;0;p
9;0;p
8;1;p
