47;1;p
51;0;p
53;0;p
56;0;p
59;1;p
62;1;p
66;2;p
73;3;p
80;5;p
86;5;p
93;6;p
99;7;p
107;10;p
114;11;p
120;12;p
125;14;p
128;14;p
130;14;p
131;14;p
132;14;p
132;15;p
132;18;p
132;21;p
132;27;p
132;30;p
132;33;p
132;37;p
132;42;p
132;45;p
132;49;p
132;52;p
132;54;p
132;58;p
132;62;p
132;66;p
133;70;p
133;75;p
134;79;p
134;82;p
134;85;p
134;88;p
135;90;p
135;91;p
135;94;p
136;96;p
136;97;p
136;100;p
136;102;p
137;103;p
137;105;p
137;108;p
137;110;p
138;113;p
138;115;p
138;116;p
139;118;p
139;119;p
139;120;p
139;121;p
140;122;p
140;123;p
140;124;p
140;125;p
139;124;p
136;121;p
135;120;p
130;119;p
123;119;p
116;117;p
108;116;p
96;115;p
80;111;p
66;109;p
50;108;p
36;106;p
27;104;p
19;103;p
14;103;p
11;103;p
9;103;p
7;103;p
6;103;p
5;103;p
4;103;p
3;103;p
2;103;p
1;103;p
0;103;p
