0;180;p
5;175;p
7;173;p
10;171;p
13;168;p
18;166;p
21;162;p
27;159;p
33;153;p
41;147;p
53;141;p
62;136;p
68;132;p
76;128;p
83;124;p
88;121;p
93;118;p
96;114;p
100;111;p
103;107;p
108;102;p
112;98;p
115;95;p
118;93;p
121;90;p
123;88;p
125;86;p
126;85;p
128;83;p
129;83;p
131;82;p
132;82;p
134;82;p
136;81;p
138;81;p
139;80;p
142;79;p
143;78;p
145;76;p
147;74;p
149;72;p
151;70;p
154;66;p
157;63;p
161;60;p
163;57;p
166;55;p
169;53;p
171;52;p
173;51;p
175;50;p
177;49;p
178;48;p
179;48;p
180;47;p
181;47;p
182;46;p
180;46;p
178;46;p
175;47;p
170;47;p
167;48;p
165;48;p
164;48;p
163;48;p
162;49;p
161;49;p
160;49;p
159;49;p
157;49;p
154;50;p
152;50;p
148;50;p
142;52;p
139;52;p
135;52;p
129;52;p
124;52;p
117;52;p
108;52;p
102;52;p
94;52;p
86;52;p
79;52;p
73;52;p
66;52;p
59;52;p
54;52;p
52;52;p
50;53;p
47;53;p
46;53;p
44;53;p
43;53;p
42;53;p
41;53;p
40;53;p
39;53;p
40;53;p
43;53;p
47;52;p
53;50;p
61;49;p
68;48;p
76;45;p
83;42;p
91;41;p
98;37;p
108;32;p
115;29;p
122;27;p
130;23;p
137;20;p
142;19;p
149;16;p
156;15;p
163;12;p
171;11;p
177;8;p
184;7;p
192;4;p
197;3;p
202;2;p
205;1;p
207;0;p
208;0;p
209;0;p
209;0;p
210;0;p
212;0;p
214;1;p
217;3;p
220;5;p
221;6;p
223;8;p
225;10;p
227;13;p
228;15;p
230;19;p
234;25;p
238;32;p
239;36;p
242;40;p
243;43;p
244;47;p
245;52;p
246;55;p
247;58;p
247;64;p
248;69;p
248;74;p
249;79;p
251;85;p
252;92;p
252;99;p
253;104;p
253;109;p
254;112;p
254;115;p
255;117;p
255;119;p
255;120;p
255;121;p
255;122;p
255;123;p
256;124;p
256;125;p
