0;111;p
4;111;p
7;111;p
11;111;p
16;108;p
23;104;p
30;102;p
36;98;p
41;93;p
46;89;p
51;84;p
55;78;p
57;72;p
60;65;p
61;59;p
63;53;p
64;46;p
64;42;p
64;36;p
64;32;p
64;28;p
64;25;p
62;22;p
61;20;p
60;19;p
58;16;p
57;15;p
55;13;p
54;12;p
52;11;p
49;9;p
46;8;p
43;6;p
40;5;p
35;3;p
31;2;p
26;0;p
23;0;p
21;0;p
19;0;p
17;0;p
15;2;p
14;3;p
14;8;p
13;11;p
13;15;p
13;19;p
13;24;p
13;30;p
13;36;p
13;41;p
13;45;p
14;51;p
15;56;p
18;63;p
22;70;p
23;75;p
26;81;p
30;87;p
32;90;p
33;92;p
35;94;p
36;96;p
37;97;p
37;98;p
39;100;p
40;101;p
41;102;p
41;103;p
42;104;p
43;106;p
44;107;p
45;108;p
46;110;p
47;111;p
48;113;p
49;114;p
49;115;p
49;116;p
50;117;p
50;119;p
51;120;p
51;121;p
52;122;p
53;124;p
