7;2;p
11;1;p
14;1;p
18;0;p
24;0;p
30;0;p
36;0;p
43;0;p
49;0;p
53;0;p
59;0;p
63;0;p
66;1;p
70;2;p
72;3;p
75;4;p
76;4;p
77;4;p
78;4;p
79;5;p
79;6;p
79;8;p
80;11;p
81;13;p
81;17;p
82;22;p
83;26;p
84;29;p
85;34;p
86;38;p
86;44;p
87;49;p
87;53;p
89;58;p
89;62;p
89;67;p
89;70;p
89;73;p
89;76;p
89;80;p
89;83;p
89;87;p
89;91;p
89;94;p
89;97;p
89;100;p
89;103;p
89;106;p
89;109;p
89;111;p
89;114;p
89;116;p
89;118;p
89;119;p
89;120;p
87;121;p
85;121;p
82;122;p
72;123;p
69;123;p
54;123;p
41;123;p
30;123;p
20;123;p
13;123;p
8;123;p
5;123;p
3;123;p
2;123;p
0;124;p
