0;71;p
1;65;p
6;60;p
10;54;p
16;47;p
20;41;p
25;35;p
32;27;p
35;23;p
38;19;p
41;16;p
43;13;p
44;11;p
45;10;p
46;9;p
47;8;p
48;7;p
50;5;p
51;4;p
52;3;p
53;2;p
55;1;p
56;0;p
56;1;p
59;4;p
71;24;p
73;29;p
75;32;p
79;39;p
80;40;p
80;41;p
81;43;p
82;44;p
83;46;p
84;47;p
85;48;p
86;49;p
87;50;p
88;51;p
89;52;p
91;53;p
92;54;p
93;55;p
94;56;p
95;58;p
97;60;p
99;63;p
101;65;p
101;66;p
102;67;p
103;68;p
104;69;p
105;70;p
105;72;p
106;74;p
107;75;p
106;75;p
103;75;p
98;75;p
90;75;p
80;75;p
71;75;p
63;75;p
56;75;p
50;75;p
44;75;p
40;75;p
36;75;p
33;75;p
29;75;p
27;74;p
24;74;p
23;74;p
21;74;p
20;74;p
19;74;p
18;74;p
17;74;p
16;74;p
15;73;p
