32;3;p
32;8;p
32;12;p
32;20;p
32;28;p
32;37;p
34;45;p
35;52;p
36;56;p
37;59;p
38;62;p
39;65;p
39;67;p
40;69;p
40;71;p
41;74;p
41;77;p
41;82;p
42;86;p
42;91;p
42;93;p
42;96;p
42;98;p
42;100;p
42;101;p
43;101;p
44;101;p
45;101;p
56;100;p
61;100;p
67;99;p
70;99;p
76;98;p
82;98;p
88;98;p
98;98;p
110;98;p
122;98;p
134;98;p
145;98;p
156;98;p
165;98;p
170;98;p
172;98;p
174;97;p
175;97;p
176;97;p
178;96;p
179;96;p
179;95;p
179;95;p
179;92;p
179;81;p
179;71;p
177;66;p
176;58;p
173;52;p
170;45;p
169;40;p
167;34;p
165;29;p
164;26;p
164;23;p
163;21;p
162;19;p
162;17;p
161;15;p
161;14;p
161;13;p
160;12;p
160;11;p
160;9;p
160;7;p
160;6;p
159;4;p
158;3;p
157;3;p
148;3;p
134;3;p
124;2;p
105;0;p
94;0;p
85;0;p
75;0;p
68;0;p
62;0;p
57;0;p
53;0;p
45;0;p
40;0;p
34;1;p
28;3;p
20;4;p
14;5;p
10;5;p
6;6;p
4;7;p
2;7;p
0;7;p
