0;3;p
5;6;p
7;8;p
14;13;p
19;18;p
30;24;p
40;33;p
52;43;p
69;57;p
83;66;p
92;73;p
104;81;p
118;88;p
130;95;p
140;102;p
149;106;p
160;111;p
169;115;p
178;120;p
182;122;p
186;126;p
191;130;p
195;132;p
196;134;p
198;136;p
197;134;p
196;133;p
193;132;p
191;132;p
190;131;p
188;131;p
185;131;p
183;131;p
180;131;p
176;131;p
168;131;p
158;131;p
150;131;p
137;131;p
124;130;p
115;130;p
107;130;p
100;128;p
95;128;p
92;127;p
89;127;p
87;127;p
85;126;p
82;126;p
80;126;p
78;126;p
75;126;p
73;126;p
71;126;p
69;126;p
67;126;p
65;126;p
64;125;p
63;125;p
62;124;p
61;123;p
60;122;p
58;120;p
56;120;p
55;119;p
54;119;p
53;118;p
52;118;p
50;117;p
50;116;p
50;113;p
50;111;p
50;108;p
52;105;p
55;100;p
59;95;p
64;90;p
70;83;p
74;76;p
78;69;p
82;62;p
86;54;p
90;47;p
96;38;p
103;29;p
108;23;p
112;18;p
117;13;p
123;9;p
126;6;p
129;3;p
130;2;p
131;1;p
132;0;p
