125;0;p
120;1;p
115;6;p
112;10;p
107;12;p
105;14;p
102;17;p
95;21;p
90;27;p
86;30;p
82;35;p
79;40;p
74;45;p
68;50;p
61;58;p
56;62;p
49;66;p
37;71;p
33;74;p
30;76;p
28;77;p
26;79;p
23;82;p
21;84;p
19;86;p
17;88;p
15;91;p
12;94;p
6;101;p
3;104;p
2;105;p
0;106;p
