0 39
1 63
2 53
3 46
4 42
5 38
6 34
7 31
8 28
9 27
10 27
11 25
12 24
13 22
14 21
15 22
16 22
17 21
18 20
19 20
20 19
21 18
22 18
23 18
24 18
25 17
26 17
27 17
28 16
29 20
30 16
31 15
32 28
33 115
34 129
35 109
36 113
37 114
38 77
39 34
40 67
41 130
42 170
43 179
44 182
45 181
46 160
47 149
48 146
49 138
50 131
51 128
52 122
53 120
54 118
55 112
56 105
57 96
58 84
59 73
60 65
61 58
62 54
63 48
64 44
65 41
66 39
67 37
68 36
69 34
70 33
71 30
72 29
73 28
74 27
75 27
76 27
77 25
78 24
79 24
80 23
81 21
82 20
83 20
84 20
85 20
86 13
87 16
88 15
89 8
90 22
91 91
92 119
93 75
94 11
95 48
96 119
97 122
98 117
99 140
100 139
101 138
102 111
103 112
104 162
105 147
106 140
107 137
108 138
109 130
110 128
111 123
112 120
113 119
114 115
115 103
116 90
117 80
118 72
119 64
120 60
121 57
122 52
123 48
124 48
125 44
126 43
127 41
