\relax 
\providecommand\hyper@newdestlabel[2]{}
\providecommand\zref@newlabel[2]{}
\providecommand\HyperFirstAtBeginDocument{\AtBeginDocument}
\HyperFirstAtBeginDocument{\ifx\hyper@anchor\@undefined
\global\let\oldcontentsline\contentsline
\gdef\contentsline#1#2#3#4{\oldcontentsline{#1}{#2}{#3}}
\global\let\oldnewlabel\newlabel
\gdef\newlabel#1#2{\newlabelxx{#1}#2}
\gdef\newlabelxx#1#2#3#4#5#6{\oldnewlabel{#1}{{#2}{#3}}}
\AtEndDocument{\ifx\hyper@anchor\@undefined
\let\contentsline\oldcontentsline
\let\newlabel\oldnewlabel
\fi}
\fi}
\global\let\hyper@last\relax 
\gdef\HyperFirstAtBeginDocument#1{#1}
\providecommand*\HyPL@Entry[1]{}
\HyPL@Entry{0<</S/D>>}
\HyPL@Entry{1<</S/D>>}
\@writefile{toc}{\contentsline {section}{فهرست مطالب}{1}{section*.1}}
\citation{terzi2018smart}
\citation{chen2015data}
\citation{jumale2016survey}
\citation{angelos2011detection}
\citation{zheng2017wide}
\citation{faisal2014data}
\@writefile{toc}{\contentsline {section}{فهرست تصاویر}{2}{section*.2}}
\zref@newlabel{footdir@1}{\abspage{4}}
\pp@pagectr{footnote}{1}{4}{3}
\zref@newlabel{footdir@3}{\abspage{4}}
\pp@pagectr{footnote}{2}{4}{3}
\zref@newlabel{footdir@5}{\abspage{4}}
\zref@newlabel{footdir@2}{\abspage{4}}
\zref@newlabel{footdir@4}{\abspage{4}}
\citation{terzi2018smart}
\@writefile{toc}{\contentsline {section}{\numberline {1}مقدمه}{4}{section.1}}
\@writefile{lof}{\contentsline {figure}{\numberline {1}{\ignorespaces کلان‌داده و شبکه هوشمند برق \cite  {terzi2018smart}}}{4}{figure.1}}
\newlabel{fig:terzi2018smart}{{1}{4}{کلان‌داده و شبکه هوشمند برق \cite {terzi2018smart}}{figure.1}{}}
\citation{chen2015data}
\citation{jumale2016survey}
\citation{jumale2016survey}
\@writefile{toc}{\contentsline {section}{\numberline {2}کارهای پیشین}{6}{section.2}}
\newlabel{relatedwork}{{2}{6}{کارهای پیشین}{section.2}{}}
\zref@newlabel{footdir@6}{\abspage{7}}
\pp@pagectr{footnote}{3}{7}{6}
\@writefile{toc}{\contentsline {subsection}{\numberline {2.1}تحلیل مصرف}{6}{subsection.2.1}}
\zref@newlabel{footdir@8}{\abspage{7}}
\pp@pagectr{footnote}{4}{7}{6}
\zref@newlabel{footdir@10}{\abspage{7}}
\pp@pagectr{footnote}{5}{7}{6}
\@writefile{lof}{\contentsline {figure}{\numberline {2}{\ignorespaces فرآیند داده‌کاوی \cite  {chen2015data}}}{6}{figure.2}}
\newlabel{fig:datamining}{{2}{6}{فرآیند داده‌کاوی \cite {chen2015data}}{figure.2}{}}
\zref@newlabel{footdir@12}{\abspage{7}}
\zref@newlabel{footdir@7}{\abspage{7}}
\zref@newlabel{footdir@9}{\abspage{7}}
\zref@newlabel{footdir@11}{\abspage{7}}
\citation{angelos2011detection}
\citation{angelos2011detection}
\citation{sahoo2015electricity}
\@writefile{lof}{\contentsline {figure}{\numberline {3}{\ignorespaces بخش‌های اصلی سیستم‌های تشخیص برق‌دزدی \cite  {jumale2016survey}}}{7}{figure.3}}
\newlabel{fig:electricitytheftdetectionsystems}{{3}{7}{بخش‌های اصلی سیستم‌های تشخیص برق‌دزدی \cite {jumale2016survey}}{figure.3}{}}
\zref@newlabel{footdir@13}{\abspage{8}}
\pp@pagectr{footnote}{6}{8}{7}
\zref@newlabel{footdir@15}{\abspage{8}}
\pp@pagectr{footnote}{7}{8}{7}
\@writefile{lof}{\contentsline {figure}{\numberline {4}{\ignorespaces فرآیند طبقه بندی فازی بر اساس خوشه‌بندی \cite  {angelos2011detection}}}{7}{figure.4}}
\newlabel{fig:angelos2011detection}{{4}{7}{فرآیند طبقه بندی فازی بر اساس خوشه‌بندی \cite {angelos2011detection}}{figure.4}{}}
\zref@newlabel{footdir@17}{\abspage{8}}
\zref@newlabel{footdir@14}{\abspage{8}}
\zref@newlabel{footdir@16}{\abspage{8}}
\citation{zhou2015dynamic}
\citation{jokar2015electricity}
\newlabel{eq:temperature}{{1}{8}{تحلیل مصرف}{equation.2.1}{}}
\zref@newlabel{footdir@18}{\abspage{9}}
\pp@pagectr{footnote}{8}{9}{8}
\zref@newlabel{footdir@20}{\abspage{9}}
\pp@pagectr{footnote}{9}{9}{8}
\zref@newlabel{footdir@24}{\abspage{9}}
\pp@pagectr{footnote}{11}{9}{8}
\zref@newlabel{footdir@22}{\abspage{9}}
\pp@pagectr{footnote}{10}{9}{8}
\zref@newlabel{footdir@26}{\abspage{9}}
\pp@pagectr{footnote}{12}{9}{8}
\zref@newlabel{footdir@28}{\abspage{9}}
\pp@pagectr{footnote}{13}{9}{8}
\zref@newlabel{footdir@30}{\abspage{9}}
\pp@pagectr{footnote}{14}{9}{8}
\zref@newlabel{footdir@34}{\abspage{9}}
\zref@newlabel{footdir@19}{\abspage{9}}
\zref@newlabel{footdir@21}{\abspage{9}}
\zref@newlabel{footdir@23}{\abspage{9}}
\zref@newlabel{footdir@25}{\abspage{9}}
\zref@newlabel{footdir@27}{\abspage{9}}
\zref@newlabel{footdir@29}{\abspage{9}}
\zref@newlabel{footdir@31}{\abspage{9}}
\zref@newlabel{footdir@32}{\abspage{10}}
\pp@pagectr{footnote}{15}{10}{9}
\zref@newlabel{footdir@35}{\abspage{10}}
\pp@pagectr{footnote}{16}{10}{9}
\zref@newlabel{footdir@37}{\abspage{10}}
\pp@pagectr{footnote}{17}{10}{9}
\zref@newlabel{footdir@39}{\abspage{10}}
\pp@pagectr{footnote}{18}{10}{9}
\newlabel{eq:jokar2015electricity}{{2}{9}{تحلیل مصرف}{equation.2.2}{}}
\zref@newlabel{footdir@41}{\abspage{10}}
\zref@newlabel{footdir@33}{\abspage{10}}
\zref@newlabel{footdir@36}{\abspage{10}}
\zref@newlabel{footdir@38}{\abspage{10}}
\zref@newlabel{footdir@40}{\abspage{10}}
\citation{zheng2017wide}
\citation{zheng2017wide}
\citation{moghaddass2017hierarchical}
\@writefile{lof}{\contentsline {figure}{\numberline {5}{\ignorespaces نمونه‌ای از الگوی مصرف برق کاربر \cite  {zheng2017wide}}}{10}{figure.5}}
\newlabel{fig:zheng2017wide}{{5}{10}{نمونه‌ای از الگوی مصرف برق کاربر \cite {zheng2017wide}}{figure.5}{}}
\zref@newlabel{footdir@44}{\abspage{11}}
\pp@pagectr{footnote}{20}{11}{10}
\zref@newlabel{footdir@42}{\abspage{11}}
\pp@pagectr{footnote}{19}{11}{10}
\zref@newlabel{footdir@46}{\abspage{11}}
\pp@pagectr{footnote}{21}{11}{10}
\zref@newlabel{footdir@48}{\abspage{11}}
\pp@pagectr{footnote}{22}{11}{10}
\zref@newlabel{footdir@52}{\abspage{11}}
\zref@newlabel{footdir@43}{\abspage{11}}
\zref@newlabel{footdir@45}{\abspage{11}}
\zref@newlabel{footdir@47}{\abspage{11}}
\zref@newlabel{footdir@49}{\abspage{11}}
\citation{moghaddass2017hierarchical}
\citation{faisal2014data}
\citation{faisal2014data}
\zref@newlabel{footdir@50}{\abspage{12}}
\pp@pagectr{footnote}{23}{12}{11}
\@writefile{toc}{\contentsline {subsection}{\numberline {2.2}حملات بدخواهانه}{11}{subsection.2.2}}
\zref@newlabel{footdir@57}{\abspage{12}}
\pp@pagectr{footnote}{26}{12}{11}
\zref@newlabel{footdir@55}{\abspage{12}}
\pp@pagectr{footnote}{25}{12}{11}
\zref@newlabel{footdir@53}{\abspage{12}}
\pp@pagectr{footnote}{24}{12}{11}
\zref@newlabel{footdir@61}{\abspage{12}}
\pp@pagectr{footnote}{28}{12}{11}
\zref@newlabel{footdir@59}{\abspage{12}}
\pp@pagectr{footnote}{27}{12}{11}
\zref@newlabel{footdir@63}{\abspage{12}}
\pp@pagectr{footnote}{29}{12}{11}
\zref@newlabel{footdir@67}{\abspage{12}}
\zref@newlabel{footdir@51}{\abspage{12}}
\zref@newlabel{footdir@54}{\abspage{12}}
\zref@newlabel{footdir@56}{\abspage{12}}
\zref@newlabel{footdir@58}{\abspage{12}}
\zref@newlabel{footdir@60}{\abspage{12}}
\zref@newlabel{footdir@62}{\abspage{12}}
\zref@newlabel{footdir@64}{\abspage{12}}
\citation{liu2015collaborative}
\@writefile{lof}{\contentsline {figure}{\numberline {6}{\ignorespaces الف) اندازه‌گیر با ماژول تشخیص نفوذ ب) پیکربندی ماژول تشخیص نفوذ \cite  {faisal2014data}}}{12}{figure.6}}
\newlabel{fig:faisal2014data}{{6}{12}{الف) اندازه‌گیر با ماژول تشخیص نفوذ ب) پیکربندی ماژول تشخیص نفوذ \cite {faisal2014data}}{figure.6}{}}
\zref@newlabel{footdir@65}{\abspage{13}}
\pp@pagectr{footnote}{30}{13}{12}
\zref@newlabel{footdir@68}{\abspage{13}}
\pp@pagectr{footnote}{31}{13}{12}
\zref@newlabel{footdir@72}{\abspage{13}}
\pp@pagectr{footnote}{33}{13}{12}
\zref@newlabel{footdir@70}{\abspage{13}}
\pp@pagectr{footnote}{32}{13}{12}
\zref@newlabel{footdir@74}{\abspage{13}}
\zref@newlabel{footdir@66}{\abspage{13}}
\zref@newlabel{footdir@69}{\abspage{13}}
\zref@newlabel{footdir@71}{\abspage{13}}
\zref@newlabel{footdir@73}{\abspage{13}}
\citation{angelos2011detection}
\citation{sahoo2015electricity}
\citation{zhou2015dynamic}
\citation{jokar2015electricity}
\citation{zheng2017wide}
\citation{moghaddass2017hierarchical}
\citation{faisal2014data}
\citation{liu2015collaborative}
\@writefile{toc}{\contentsline {section}{\numberline {3}چالش‌های موجود}{13}{section.3}}
\newlabel{challenges}{{3}{13}{چالش‌های موجود}{section.3}{}}
\@writefile{lot}{\contentsline {table}{\numberline {1}{\ignorespaces مقایسه کارهای پیشین}}{14}{table.1}}
\newlabel{tab:my-review}{{1}{14}{مقایسه کارهای پیشین}{table.1}{}}
\@writefile{toc}{\contentsline {section}{\numberline {4}اهداف تحقیق}{15}{section.4}}
\newlabel{target}{{4}{15}{اهداف تحقیق}{section.4}{}}
\zref@newlabel{footdir@75}{\abspage{16}}
\pp@pagectr{footnote}{34}{16}{15}
\zref@newlabel{footdir@77}{\abspage{16}}
\pp@pagectr{footnote}{35}{16}{15}
\zref@newlabel{footdir@79}{\abspage{16}}
\zref@newlabel{footdir@76}{\abspage{16}}
\zref@newlabel{footdir@78}{\abspage{16}}
\@writefile{toc}{\contentsline {section}{\numberline {5}مفروضات و محدودیت‌ها}{17}{section.5}}
\zref@newlabel{footdir@80}{\abspage{18}}
\pp@pagectr{footnote}{36}{18}{17}
\zref@newlabel{footdir@82}{\abspage{18}}
\pp@pagectr{footnote}{37}{18}{17}
\zref@newlabel{footdir@84}{\abspage{18}}
\zref@newlabel{footdir@81}{\abspage{18}}
\zref@newlabel{footdir@83}{\abspage{18}}
\citation{shoro2015big}
\@writefile{toc}{\contentsline {section}{\numberline {6}راهکارهای پیشنهادی}{18}{section.6}}
\newlabel{ProposedApproach}{{6}{18}{راهکارهای پیشنهادی}{section.6}{}}
\zref@newlabel{footdir@85}{\abspage{19}}
\pp@pagectr{footnote}{38}{19}{18}
\zref@newlabel{footdir@87}{\abspage{19}}
\pp@pagectr{footnote}{39}{19}{18}
\zref@newlabel{footdir@89}{\abspage{19}}
\zref@newlabel{footdir@86}{\abspage{19}}
\zref@newlabel{footdir@88}{\abspage{19}}
\@writefile{lof}{\contentsline {figure}{\numberline {7}{\ignorespaces ساختار چارچوب اسپارک}}{19}{figure.7}}
\newlabel{fig:spark}{{7}{19}{ساختار چارچوب اسپارک}{figure.7}{}}
\@writefile{lof}{\contentsline {figure}{\numberline {8}{\ignorespaces ساختار کلی سیستم پیشنهادی}}{20}{figure.8}}
\newlabel{fig:system}{{8}{20}{ساختار کلی سیستم پیشنهادی}{figure.8}{}}
\@writefile{toc}{\contentsline {section}{\numberline {7}روش انجام تحقیق}{21}{section.7}}
\citation{he2017real}
\citation{faisal2014data}
\citation{jokar2015electricity}
\citation{jokar2015electricity}
\@writefile{toc}{\contentsline {section}{\numberline {8}ارزیابی راهکار پیشنهادی}{22}{section.8}}
\newlabel{evaluation}{{8}{22}{ارزیابی راهکار پیشنهادی}{section.8}{}}
\zref@newlabel{footdir@90}{\abspage{23}}
\pp@pagectr{footnote}{40}{23}{22}
\zref@newlabel{footdir@92}{\abspage{23}}
\pp@pagectr{footnote}{41}{23}{22}
\zref@newlabel{footdir@94}{\abspage{23}}
\pp@pagectr{footnote}{42}{23}{22}
\zref@newlabel{footdir@96}{\abspage{23}}
\pp@pagectr{footnote}{43}{23}{22}
\zref@newlabel{footdir@98}{\abspage{23}}
\zref@newlabel{footdir@91}{\abspage{23}}
\zref@newlabel{footdir@93}{\abspage{23}}
\zref@newlabel{footdir@95}{\abspage{23}}
\zref@newlabel{footdir@97}{\abspage{23}}
\@writefile{toc}{\contentsline {section}{\numberline {9}جنبه‌ی جديد بودن و نوآوری}{23}{section.9}}
\@writefile{toc}{\contentsline {section}{\numberline {10}زمان‌بندی انجام تحقیق}{24}{section.10}}
\newlabel{conclusion}{{10}{24}{زمان‌بندی انجام تحقیق}{section.10}{}}
\@writefile{lot}{\contentsline {table}{\numberline {2}{\ignorespaces زمان‌بندی انجام پروژه}}{24}{table.2}}
\newlabel{tab:table}{{2}{24}{زمان‌بندی انجام پروژه}{table.2}{}}
\bibstyle{ieeetr-fa}
\bibdata{ref_en,ref_fa}
\bibcite{terzi2018smart}{{1}{}{{}}{{}}}
\bibcite{chen2015data}{{2}{}{{}}{{}}}
\bibcite{jumale2016survey}{{3}{}{{}}{{}}}
\bibcite{angelos2011detection}{{4}{}{{}}{{}}}
\bibcite{zheng2017wide}{{5}{}{{}}{{}}}
\bibcite{faisal2014data}{{6}{}{{}}{{}}}
\bibcite{sahoo2015electricity}{{7}{}{{}}{{}}}
\bibcite{zhou2015dynamic}{{8}{}{{}}{{}}}
\bibcite{jokar2015electricity}{{9}{}{{}}{{}}}
\@writefile{toc}{\contentsline {section}{مراجع}{25}{section*.4}}
\bibcite{moghaddass2017hierarchical}{{10}{}{{}}{{}}}
\bibcite{liu2015collaborative}{{11}{}{{}}{{}}}
\bibcite{shoro2015big}{{12}{}{{}}{{}}}
\bibcite{he2017real}{{13}{}{{}}{{}}}
\providecommand\NAT@force@numbers{}\NAT@force@numbers
\HyPL@Entry{27<</S/D>>}
