% Generated by ieeetr-fa.bst,  version: 0.9 (2015/05/09), for XePersian Package
% Authors: M.Amintoosi and M.Vahedi
\providecommand{\noopsort}[1]{}
\begin{thebibliography}{10}

\begin{LTRbibitems}
\resetlatinfont
\bibitem{terzi2018smart}
D.~S. Terzi, B.~Arslan, and S.~Sagiroglu, ``Smart grid security evaluation with
  a big data use case,''  in {\em 2018 IEEE 12th International Conference on
  Compatibility, Power Electronics and Power Engineering (CPE-POWERENG 2018)},
  pp.1--6, IEEE, 2018.

\end{LTRbibitems}

\begin{LTRbibitems}
\resetlatinfont
\bibitem{chen2015data}
F.~Chen, P.~Deng, J.~Wan, D.~Zhang, A.~V. Vasilakos, and X.~Rong, ``Data mining
  for the internet of things: literature review and challenges,'' {\em
  International Journal of Distributed Sensor Networks},  vol.11,  no.8,
  p.431047, 2015.

\end{LTRbibitems}

\begin{LTRbibitems}
\resetlatinfont
\bibitem{jumale2016survey}
P.~Jumale, A.~Khaire, H.~Jadhawar, S.~Awathare, and M.~Mali, ``Survey:
  Electricity theft detection technique,'' {\em International Journal of
  Computer Engineering and Information Technology},  vol.8,  no.2,  p.30, 2016.

\end{LTRbibitems}

\begin{LTRbibitems}
\resetlatinfont
\bibitem{angelos2011detection}
E.~W.~S. Angelos, O.~R. Saavedra, O.~A.~C. Cort{\'e}s, and A.~N. de~Souza,
  ``Detection and identification of abnormalities in customer consumptions in
  power distribution systems,'' {\em IEEE Transactions on Power Delivery},
  vol.26,  no.4,  pp.2436--2442, 2011.

\end{LTRbibitems}

\begin{LTRbibitems}
\resetlatinfont
\bibitem{zheng2017wide}
Z.~Zheng, Y.~Yang, X.~Niu, H.-N. Dai, and Y.~Zhou, ``Wide and deep
  convolutional neural networks for electricity-theft detection to secure smart
  grids,'' {\em IEEE Transactions on Industrial Informatics},  vol.14,  no.4,
  pp.1606--1615, 2017.

\end{LTRbibitems}

\begin{LTRbibitems}
\resetlatinfont
\bibitem{faisal2014data}
M.~A. Faisal, Z.~Aung, J.~R. Williams, and A.~Sanchez, ``Data-stream-based
  intrusion detection system for advanced metering infrastructure in smart
  grid: A feasibility study,'' {\em IEEE Systems journal},  vol.9,  no.1,
  pp.31--44, 2014.

\end{LTRbibitems}

\begin{LTRbibitems}
\resetlatinfont
\bibitem{sahoo2015electricity}
S.~Sahoo, D.~Nikovski, T.~Muso, and K.~Tsuru, ``Electricity theft detection
  using smart meter data,''  in {\em 2015 IEEE Power \& Energy Society
  Innovative Smart Grid Technologies Conference (ISGT)},  pp.1--5, IEEE, 2015.

\end{LTRbibitems}

\begin{LTRbibitems}
\resetlatinfont
\bibitem{zhou2015dynamic}
Y.~Zhou, X.~Chen, A.~Y. Zomaya, L.~Wang, and S.~Hu, ``A dynamic programming
  algorithm for leveraging probabilistic detection of energy theft in smart
  home,'' {\em IEEE Transactions on Emerging Topics in Computing},  vol.3,
  no.4,  pp.502--513, 2015.

\end{LTRbibitems}

\begin{LTRbibitems}
\resetlatinfont
\bibitem{jokar2015electricity}
P.~Jokar, N.~Arianpoo, and V.~C. Leung, ``Electricity theft detection in ami
  using customers’ consumption patterns,'' {\em IEEE Transactions on Smart
  Grid},  vol.7,  no.1,  pp.216--226, 2015.

\end{LTRbibitems}

\begin{LTRbibitems}
\resetlatinfont
\bibitem{moghaddass2017hierarchical}
R.~Moghaddass and J.~Wang, ``A hierarchical framework for smart grid anomaly
  detection using large-scale smart meter data,'' {\em IEEE Transactions on
  Smart Grid},  vol.9,  no.6,  pp.5820--5830, 2017.

\end{LTRbibitems}

\begin{LTRbibitems}
\resetlatinfont
\bibitem{liu2015collaborative}
X.~Liu, P.~Zhu, Y.~Zhang, and K.~Chen, ``A collaborative intrusion detection
  mechanism against false data injection attack in advanced metering
  infrastructure,'' {\em IEEE Transactions on Smart Grid},  vol.6,  no.5,
  pp.2435--2443, 2015.

\end{LTRbibitems}

\begin{LTRbibitems}
\resetlatinfont
\bibitem{shoro2015big}
A.~G. Shoro and T.~R. Soomro, ``Big data analysis: Apache spark perspective,''
  {\em Global Journal of Computer Science and Technology}, 2015.

\end{LTRbibitems}

\begin{LTRbibitems}
\resetlatinfont
\bibitem{he2017real}
Y.~He, G.~J. Mendis, and J.~Wei, ``Real-time detection of false data injection
  attacks in smart grid: A deep learning-based intelligent mechanism,'' {\em
  IEEE Transactions on Smart Grid},  vol.8,  no.5,  pp.2505--2516, 2017.

\end{LTRbibitems}

\end{thebibliography}
