username,category,num_followings,num_followers,label,id
BeautyDiaryNews,2,302,313273,mf,2232426158
SaiJaii,2,193,434357,mf,289449311
Basniixz,2,408,563656,mf,164591868
DJPoom,2,206,131379,mm,74795730
lee_thanat,1,111,1357202,mf,727220354330955776
MookWorranit,1,429,1419662,mm,139379061
cheewitgu,2,73,1405472,mf,315615561
iconnnz,2,344,645750,mf,105719173
Bonusiie,2,243,264168,mf,160207884
bbigkachu,2,209,302324,mf,930902404182065152
mimilkss,2,249,1646198,mf,224945515
nobluk,2,377,313110,mf,92527729
bnk48official,1,37,251729,mm,710019065792765952
tontawan_t,1,254,399141,mm,307782840
PuimekSter,1,408,735122,mm,182279606
psmark1821,2,44,791970,mf,867523838
chocoopal,1,590,3261703,mf,123529004
crishorwang,1,180,996034,mf,90208575
ted6104,2,992,275547,mm,15430127
beartai,2,519,129772,mm,13302042
suthichai,3,2560,3102562,mm,12425692
joeybangkokboy,1,360,2459963,mm,33844605
TramodPhan,2,1,934983,mm,1527660253999173632
chadanuy69,2,1,2456328,mm,1531286768070590466
THkkrumkrum,2,61,1524313,mm,703149580930551808
pighappylady,2,87,381024,mf,861751596803280896
castby9arm,2,171,160062,mm,2864086918
spin9,2,293,257223,mm,67251857
UnderbedDara,3,8,4165586,mf,4781800940
impeachii,2,1466,672407,mf,67585827
KomsakAddams,2,176,2264077,mf,57300500
Psolemn,2,1087,338449,mm,198714960
Eng_afternoonz,2,274,1137770,mf,2833794228
sfkkfs_,2,346,1833988,mf,1678061454
stitch_pololo,2,7,1228462,mf,1659665096
4amvanila,2,148,311652,mf,782686901983588352
madaisyy__,2,187,1445431,mf,299144776
siwarintira,2,129,993742,mf,3023214775
Dekchaikumkom,2,80,2482203,mm,396414373
khajochi,2,932,611541,mm,14522520
ONEChampionship,4,233,1092035,mm,289256940
siamsport_news,3,69,815735,mm,99222522
jackie14AP,3,178,647882,mm,348897168
TL_online,3,167,575303,mm,96299933
nichaphatc,2,373,344385,mf,232871884
salarymangroup,2,13,438408,mm,1083436291
bodyslamband,1,30,1937375,mm,84079337
HowtoPerfect,2,46,918203,mf,1424990239
chocofah,2,389,1319188,mf,2185553887
PlobJai,2,572,1709537,mf,324322422
LantoAikawa,2,98,541473,mf,766915046
_coHd,2,1471,308591,mm,164619457
gimmicj,2,149,736316,mf,459900029
nattaboat,2,1667,786871,mm,76890925
FILM_BANGPI,2,267,753477,mf,1920208040
Viviennewonder,2,410,419488,mf,453624029
waiibearbie,2,1063,916940,mf,352869254
i_gubgibth,2,67,513373,mf,125408067
cnew888,2,196,377404,mf,2887191906
JebanSundae,2,254,296621,mf,625675501
bbrightvc,1,224,4587403,mf,2333223628
winmetawin,1,78,3823481,mf,298457633
Firstkpp,1,166,1050326,mf,841932369590390786
myktnw,1,140,1082673,mf,945873966765301760
AtthaphanP,1,97,2676062,mf,3016827096
Tawan_V,1,732,3350202,mf,57027096
kristtps,1,117,1381073,mf,3316960524
MSuppasit,1,77,1242127,mf,828410488509734912
off_tumcial,1,96,1528136,mf,702411609742970881
jarinporn,1,98,800638,mm,71963221
paloyhorwang,1,311,380319,mf,30669777
terchantwist,1,200,3273560,mm,153691784
WassanaNanuam,3,234,227844,mm,267243786
KhunPleum,3,499,118978,mm,60972200
pongkool,1,163,744561,mm,230033113
loveyoutomee,2,1,211867,mm,897002172323254273
mininow_,2,88,735864,mm,1461960719369334791
Pitchytd,2,41,874013,mm,1470439081746206721
kainaotawan,2,43,493334,mm,1534607666852507648
MookmuayPt,2,30,227366,mm,1423284754862940179
buchsayaa_,2,76,465410,mm,1373169199653154817
daradaily,3,183,1452388,mf,14252356
MhorRitz,1,33,724988,mf,204902477
Miint_chalida,1,104,262139,mm,161701052
peckpalit,1,12,1154123,mf,2302666267
Jasmindays,2,250,550526,mf,441795620
zentradies,2,2193,319958,mf,72490179
iPattt,3,1956,654232,mm,14458023
bongtao,3,312,470574,mm,16401569
tpagon,3,797,807270,mm,6085812
moomanoww,2,467,179974,mm,206284741
iannnnn,3,1048,910271,mm,14211527
mor_maew,3,973,693643,mm,37233942
fuxsuxlux,2,1322,293236,mm,23585910
SpokeDarkTV,3,10,447467,mm,383284782
aviknowledge,3,40,212689,mm,3226842193
MrMessenger,3,408,317276,mm,64674441
Dr_coachbear,3,430,532250,mm,123173156
guplia,3,455,345082,mm,406071769
aj__chayapol,1,60,461441,mf,1007232039597236224
leclandestine,2,19,481661,mf,1038081339361124352
Aew72230847,2,19,1086524,mm,1042346183002214402
mmikesiri,1,88,1504487,mf,1043180889285394432
itmydefinition,2,31,688978,mf,1044982306383880192
bb0un,2,121,1275495,mf,1049238073249214464
NoonimNaja,2,33,1015389,mm,1057564525669437440
Karoona12,2,190,370318,mm,1060813291184779264
jeffsatur,1,59,842046,mf,1062239067226562560
ChenRcj,2,159,730665,mf,1063930322105090050
yingnoey4,2,24,954037,mm,1064969173829279744
Chimonac,1,88,1281672,mf,1079781247
natasittttt,1,104,460930,mf,1089442250633822208
Gulfkanawutofc,1,4,456873,mf,1090512109035606016
tongthk,1,88,695603,mf,1092828469698846720
jimmyyjp_,1,68,643556,mf,1093480388356231170
Tiktook13,2,93,453005,mm,1093715557457682433
Mira04568197,2,29,1198128,mm,1095276053616947200
biblesumett,1,40,875542,mf,1108262626520256512
mynameishalipea,2,0,507557,mm,1110189085073694720
Hirunkit_,1,35,422811,mf,1120716335749578753
CwrNew,1,69,687553,mf,1127984079306018818
fforcejs,1,70,403751,mf,1138422605768118272
pattarayaa,2,6,627359,mm,1140232184369803266
primiilly1,1,517,624355,mm,1142985865829871616
Louis_Thanawin,1,110,542161,mf,1166548052909461505
wixxiws,1,133,1387709,mf,1166705879586000896
new_thitipoom,1,1,671698,mf,1176873106985537536
uucl_oe,2,268,383009,mm,1178698600500494337
PlPurim,1,109,553488,mf,1183128283
ladyonly2020,2,25,1129019,mm,1229284868913160192
JenniePanhan,1,238,1318393,mf,123873260
itfeelquotes,2,11,2020825,mf,1241114737
cutegirls251034,2,203,602270,mm,1252582384882475008
ppnaravit,1,114,764207,mf,1280214316851924992
nchdaq,2,165,441289,mf,1282960879
456subthai,2,749,474311,mm,1293796671529181185
StarPink06,2,90,648254,mm,1312968772639174658
kaykai_ninwan,2,2,753814,mm,1330638126306316288
Nnattawin1,1,82,891609,mf,1334895788741197825
RNzabver,2,381,1044360,mm,1336334001884131330
DJ_NUI,1,158,555411,mf,133979440
zabverRN,2,71,747727,mm,1359360063782096897
papoy83340349,2,2,2287626,mm,1368080137745395713
TutorKrp,1,31,336810,mf,1375156495399018500
Numay24Numay24,2,1544,484590,mm,1377968197899460608
NarumonThamma,2,1,3361744,mm,1416409822459617282
wannarod_oil,2,62,1081918,mm,1428978815980642308
sesouk23556,2,11,845006,mm,1435113928883724288
gagiiiiiixn,2,2,1953581,mm,1440378888765403136
donut2107,2,17,935763,mm,1446792369580376064
BarcodeTin,1,28,637280,mf,1451826688673734662
Aiw_1402,2,7,1353017,mm,1455072552720556032
mlml108A,2,68,758434,mm,1455908778486894593
xxmkha15,2,0,852991,mm,1468681316795179008
nuishow,3,823,339806,mm,14697365
pang3pongsow,2,1,1113571,mm,1471539261224615938
somint_20,2,0,1150372,mm,1471872056966873090
fm91trafficpro,3,51,2778798,mm,148271173
Xpiaja,2,3,1016999,mm,1486040797850238977
Imneko16,2,2,723995,mm,1486379907651629056
jarrtch,2,10,482879,mm,1505496713431498760
kas55953458,2,1,1406401,mm,1505716317089038337
noy_6969,2,13,1066621,mm,1505746307591581701
jennywatchari45,2,29,691254,mm,1506908550798327812
miniheart_18,2,0,730040,mm,1507610199431213061
nxngkhr22387472,2,1,575133,mm,1520395963390603264
Toptap_jirakit,1,307,1184736,mf,1659753438
ProngSAD,2,275,702367,mm,265815074
UunJai,2,97,316373,mf,338438421
kidmakk,2,59,2563963,mm,182168448
grand_thestar,1,449,363363,mf,196077882
manutfankow,2,34,923700,mf,206539781
ClubFridays,2,88,779058,mf,2184579650
ssingss,1,202,1103484,mf,2324101986
usnttr,1,221,519616,mf,259804815
BOHHOT,2,133,1387257,mf,274068407
loverrukk,2,101,874685,mf,2790803071
dinsorekod,2,0,1631842,mf,482753590
Kwaiii_,2,208,445701,mf,1111288874
janeeeyeh,1,139,312178,mm,2991089054
dunknatachai,1,170,662580,mf,3436552632
stjinx_maya,2,101,1392875,mm,3656882112
OabnithiW,1,182,494378,mf,377759693
alonepord,2,34,1839647,mf,377986411
phuwintang,1,312,1151578,mf,40408670
yoxrgravity,2,107,1149889,mf,4553422220
merlinx26,2,69,348092,mf,4694565348
Prem_space,1,82,1040890,mf,4714743812
itfeelstory,2,145,2772711,mf,535211630
pwittaya,3,580,102275,mm,53801369
yumikomiyakii,2,28,1233825,mf,744885723849842688
peartunwarat,2,393,1093432,mf,796236445
Sawarinni,2,607,1989241,mf,873067446
ThaiLFC,4,18379,733934,mm,904718268
WriteORST,2,27,231917,mm,998033664180015104
