{
  "groups": [
    {
      "id": "e3569070-85eb-11e8-a5f4-3fc1fbcc654e",
      "name": "eee"
    }
  ],
  "children": [
    {
      "id": "b6db6540-8f99-11e8-be5a-f99f15b3d3d4",
      "groupId": "e3569070-85eb-11e8-a5f4-3fc1fbcc654e",
      "fullname": "ass",
      "circle": "green"
    },
    {
      "id": "631acea0-9b6a-11e8-981e-65e0e4ef7df4",
      "groupId": "e3569070-85eb-11e8-a5f4-3fc1fbcc654e",
      "fullname": "red",
      "circle": "red"
    }
  ]
}