{
  "dogs": [
    {
      "fullname": "asda",
      "rasa": "sdasdasd",
      "id": 2
    },
    {
      "fullname": "qweq",
      "rasa": "eqweqeqe",
      "adopted": "Adopted",
      "checked": true,
      "id": 3
    },
    {
      "fullname": "qweqw",
      "rasa": "eqweqe",
      "id": 7
    },
    {
      "fullname": "qaweqw",
      "rasa": "eqweqwe",
      "id": 8
    }
  ]
}