{
    "content": [
        {
            "content": "Lorem ipsum dolor sit amet, consectetur adipiscing elit, sed do eiusmod tempor incididunt ut labore et dolore magna aliqua. Ut enim ad minim veniam, quis nostrud exercitation ullamco laboris nisi ut aliquip ex ea commodo consequat. Duis aute irure dolor in reprehenderit in voluptate velit esse cillum dolore eu fugiat nulla pariatur. Excepteur sint occaecat cupidatatnon proident, sunt in culpa qui officia deserunt mollit anim id est laborum. ",
            "context": {},
            "metadata": {
                "anchors": [],
                "sha256": "02ab3d2d8b63f484823488118931988d8672c3ec022b4b719792fe8b07070934",
                "tags": [
                    "adobe"
                ],
                "types": []
            },
            "origin": null,
            "pdf_context": null,
            "title": "Sorcero's test PDF",
            "type": "passage",
            "version": "1.0"
        },
        {
            "content": "Lorem ipsum dolor sit amet, consectetur adipiscing elit, sed do eiusmod tempor incididunt ut labore et dolore magna aliqua. Ut enim ad minim veniam, quis nostrud exercitation ullamco laboris nisi ut aliquip ex ea commodo consequat. Duis aute irure dolor in reprehenderit in voluptate velit esse cillum dolore eu fugiat nulla pariatur. Excepteur sint occaecat cupidatatnon proident, sunt in culpa qui officia deserunt mollit anim id est laborum. ",
            "context": {},
            "metadata": {
                "anchors": [],
                "sha256": "02ab3d2d8b63f484823488118931988d8672c3ec022b4b719792fe8b07070934",
                "tags": [
                    "adobe"
                ],
                "types": []
            },
            "origin": null,
            "pdf_context": null,
            "title": "Sorcero's test PDF",
            "type": "passage",
            "version": "1.0"
        },
        {
            "content": "<image> ",
            "context": {},
            "metadata": {
                "anchors": [],
                "sha256": "96bf98839c86b8e6d199605d814e440c9a8186253d44b6cae735fc7380153b73",
                "tags": [
                    "adobe"
                ],
                "types": []
            },
            "origin": null,
            "pdf_context": null,
            "title": "Sorcero's test PDF",
            "type": "passage",
            "version": "1.0"
        },
        {
            "content": "[file:///image.0.1.54.242.317.314]",
            "context": {},
            "metadata": {
                "anchors": [],
                "sha256": "6b40809cb4b3fe6a3b8a506919d433aaf186f0bf32a054318aafa0b82b03d428",
                "tags": [
                    "adobe"
                ],
                "types": []
            },
            "origin": null,
            "pdf_context": null,
            "title": "Sorcero's test PDF",
            "type": "passage",
            "version": "1.0"
        },
        {
            "content": "</image> ",
            "context": {},
            "metadata": {
                "anchors": [],
                "sha256": "308e930ec91c9071a397c8de3c4f91cb7ce6bbf6094aba6230177506faf08b90",
                "tags": [
                    "adobe"
                ],
                "types": []
            },
            "origin": null,
            "pdf_context": null,
            "title": "Sorcero's test PDF",
            "type": "passage",
            "version": "1.0"
        },
        {
            "content": "Lorem ipsum dolor sit amet, consectetur adipiscing elit, sed do eiusmod tempor incididunt ut labore et dolore magna aliqua. Ut enim ad minim veniam, quis nostrud exercitation ullamco laboris nisi ut aliquip ex ea commodo consequat. Duis aute irure dolor in reprehenderit in voluptate velit esse cillum dolore eu fugiat nulla pariatur. Excepteur sint occaecat cupidatatnon proident, sunt in culpa qui officia deserunt mollit anim id est laborum. ",
            "context": {},
            "metadata": {
                "anchors": [],
                "sha256": "02ab3d2d8b63f484823488118931988d8672c3ec022b4b719792fe8b07070934",
                "tags": [
                    "adobe"
                ],
                "types": []
            },
            "origin": null,
            "pdf_context": null,
            "title": "Sorcero's test PDF",
            "type": "passage",
            "version": "1.0"
        },
        {
            "content": "Lorem ipsum dolor sit amet, consectetur adipiscing elit, sed do eiusmod tempor incididunt ut labore et dolore magna aliqua. Ut enim ad minim veniam, quis nostrud exercitation ullamco laboris nisi ut aliquip ex ea commodo consequat. Duis aute irure dolor in reprehenderit in voluptate velit esse cillum dolore eu fugiat nulla pariatur. Excepteur sint occaecat cupidatatnon proident, sunt in culpa qui officia deserunt mollit anim id est laborum. ",
            "context": {},
            "metadata": {
                "anchors": [],
                "sha256": "02ab3d2d8b63f484823488118931988d8672c3ec022b4b719792fe8b07070934",
                "tags": [
                    "adobe"
                ],
                "types": []
            },
            "origin": null,
            "pdf_context": null,
            "title": "Sorcero's test PDF",
            "type": "passage",
            "version": "1.0"
        },
        {
            "content": "<shape> ",
            "context": {},
            "metadata": {
                "anchors": [],
                "sha256": "62c2fb7a35d0a8f4825700342754952a0a8c87962dcf327b83ff1f473e6ecb97",
                "tags": [
                    "adobe"
                ],
                "types": []
            },
            "origin": null,
            "pdf_context": null,
            "title": "Sorcero's test PDF",
            "type": "passage",
            "version": "1.0"
        },
        {
            "content": "[file:///image.1.1.79.561.204.655]",
            "context": {},
            "metadata": {
                "anchors": [],
                "sha256": "58df69a98e175f342207e46dc170d83258ba913e72ef8f7895765cbb49dcde5b",
                "tags": [
                    "adobe"
                ],
                "types": []
            },
            "origin": null,
            "pdf_context": null,
            "title": "Sorcero's test PDF",
            "type": "passage",
            "version": "1.0"
        },
        {
            "content": "</shape> ",
            "context": {},
            "metadata": {
                "anchors": [],
                "sha256": "a73696f35dbd4e4bf54c44b0863044ec6433fe2778375d416abc3e54590881d1",
                "tags": [
                    "adobe"
                ],
                "types": []
            },
            "origin": null,
            "pdf_context": null,
            "title": "Sorcero's test PDF",
            "type": "passage",
            "version": "1.0"
        },
        {
            "content": "Lorem ipsum dolor sit amet, consectetur adipiscing elit, sed do eiusmod tempor incididunt ut labore et dolore magna aliqua. Ut enim ad minim veniam, quis nostrud exercitation ullamco laboris nisi ut aliquip ex ea commodo consequat. Duis aute irure dolor in reprehenderit in voluptate velit esse cillum dolore eu fugiat nulla pariatur. Excepteur sint occaecat cupidatatnon proident, sunt in culpa qui officia deserunt mollit anim id est laborum. ",
            "context": {},
            "metadata": {
                "anchors": [],
                "sha256": "02ab3d2d8b63f484823488118931988d8672c3ec022b4b719792fe8b07070934",
                "tags": [
                    "adobe"
                ],
                "types": []
            },
            "origin": null,
            "pdf_context": null,
            "title": "Sorcero's test PDF",
            "type": "passage",
            "version": "1.0"
        },
        {
            "content": "Lorem ipsum dolor sit amet, consectetur adipiscing elit, sed do eiusmod tempor incididunt ut labore et dolore magna aliqua. Ut enim ad minim veniam, quis nostrud exercitation ullamco laboris nisi ut aliquip ex ea commodo consequat. Duis aute irure dolor in reprehenderit in voluptate velit esse cillum dolore eu fugiat nulla pariatur. Excepteur sint occaecat cupidatatnon proident, sunt in culpa qui officia deserunt mollit anim id est laborum. ",
            "context": {},
            "metadata": {
                "anchors": [],
                "sha256": "02ab3d2d8b63f484823488118931988d8672c3ec022b4b719792fe8b07070934",
                "tags": [
                    "adobe"
                ],
                "types": []
            },
            "origin": null,
            "pdf_context": null,
            "title": "Sorcero's test PDF",
            "type": "passage",
            "version": "1.0"
        },
        {
            "content": "<table> ",
            "context": {},
            "metadata": {
                "anchors": [],
                "sha256": "02c078dc9ed37b48b78e27934a5a9e395e43a14799dca0bc5ecc21dc8d9a0c7c",
                "tags": [
                    "adobe"
                ],
                "types": []
            },
            "origin": null,
            "pdf_context": null,
            "title": "Sorcero's test PDF",
            "type": "passage",
            "version": "1.0"
        },
        {
            "content": "| column1   | column2   | column3   | column4   |\n| --- | --- | --- | --- |\n| row1   | row1   | row1   | row1   |\n| row2   | row2   | row2   | row2   |\n|\n",
            "context": {},
            "metadata": {
                "anchors": [],
                "sha256": "2b8b05e8e4283775e584313e62337a4e77f7e37be5c8f34d0862db2653a7a6ef",
                "tags": [
                    "adobe"
                ],
                "types": []
            },
            "origin": null,
            "pdf_context": null,
            "title": "Sorcero's test PDF",
            "type": "passage",
            "version": "1.0"
        },
        {
            "content": "</table> ",
            "context": {},
            "metadata": {
                "anchors": [],
                "sha256": "5df53e83906699dcda91d8efa12c82a14921056c35a9b0a4cd97665c20e6780b",
                "tags": [
                    "adobe"
                ],
                "types": []
            },
            "origin": null,
            "pdf_context": null,
            "title": "Sorcero's test PDF",
            "type": "passage",
            "version": "1.0"
        },
        {
            "content": "Lorem ipsum dolor sit amet, consectetur adipiscing elit, sed do eiusmod tempor incididunt ut labore et dolore magna aliqua. Ut enim ad minim veniam, quis nostrud exercitation ullamco laboris nisi ut aliquip ex ea commodo consequat. Duis aute irure dolor in reprehenderit in voluptate velit esse cillum dolore eu fugiat nulla pariatur. Excepteur sint occaecat cupidatatnon proident, sunt in culpa qui officia deserunt mollit anim id est laborum. ",
            "context": {},
            "metadata": {
                "anchors": [],
                "sha256": "02ab3d2d8b63f484823488118931988d8672c3ec022b4b719792fe8b07070934",
                "tags": [
                    "adobe"
                ],
                "types": []
            },
            "origin": null,
            "pdf_context": null,
            "title": "Sorcero's test PDF",
            "type": "passage",
            "version": "1.0"
        },
        {
            "content": "Lorem ipsum dolor sit amet, consectetur adipiscing elit, sed do eiusmod tempor incididunt ut labore et dolore magna aliqua. Ut enim ad minim veniam, quis nostrud exercitation ullamco laboris nisi ut aliquip ex ea commodo consequat. Duis aute irure dolor in reprehenderit in voluptate velit esse cillum dolore eu fugiat nulla pariatur. Excepteur sint occaecat cupidatatnon proident, sunt in culpa qui officia deserunt mollit anim id est laborum. ",
            "context": {},
            "metadata": {
                "anchors": [],
                "sha256": "02ab3d2d8b63f484823488118931988d8672c3ec022b4b719792fe8b07070934",
                "tags": [
                    "adobe"
                ],
                "types": []
            },
            "origin": null,
            "pdf_context": null,
            "title": "Sorcero's test PDF",
            "type": "passage",
            "version": "1.0"
        },
        {
            "content": "Lorem ipsum dolor sit amet, consectetur adipiscing elit, sed do eiusmod tempor incididunt ut labore et dolore magna aliqua. Ut enim ad minim veniam, quis nostrud exercitation ullamco laboris nisi ut aliquip ex ea commodo consequat. Duis aute irure dolor in reprehenderit in voluptate velit esse cillum dolore eu fugiat nulla pariatur. Excepteur sint occaecat cupidatatnon proident, sunt in culpa qui officia deserunt mollit anim id est laborum. ",
            "context": {},
            "metadata": {
                "anchors": [],
                "sha256": "02ab3d2d8b63f484823488118931988d8672c3ec022b4b719792fe8b07070934",
                "tags": [
                    "adobe"
                ],
                "types": []
            },
            "origin": null,
            "pdf_context": null,
            "title": "Sorcero's test PDF",
            "type": "passage",
            "version": "1.0"
        },
        {
            "content": "Lorem ipsum dolor sit amet, consectetur adipiscing elit, sed do eiusmod tempor incididunt ut labore et dolore magna aliqua. Ut enim ad minim veniam, quis nostrud exercitation ullamco laboris nisi ut aliquip ex ea commodo consequat. Duis aute irure dolor in reprehenderit in voluptate velit esse cillum dolore eu fugiat nulla pariatur. Excepteur sint occaecat cupidatatnon proident, sunt in culpa qui officia deserunt mollit anim id est laborum. ",
            "context": {},
            "metadata": {
                "anchors": [],
                "sha256": "02ab3d2d8b63f484823488118931988d8672c3ec022b4b719792fe8b07070934",
                "tags": [
                    "adobe"
                ],
                "types": []
            },
            "origin": null,
            "pdf_context": null,
            "title": "Sorcero's test PDF",
            "type": "passage",
            "version": "1.0"
        },
        {
            "content": "Lorem ipsum dolor sit amet, consectetur adipiscing elit, sed do eiusmod tempor incididunt ut labore et dolore magna aliqua. Ut enim ad minim veniam, quis nostrud exercitation ullamco laboris nisi ut aliquip ex ea commodo consequat. Duis aute irure dolor in reprehenderit in voluptate velit esse cillum dolore eu fugiat nulla pariatur. Excepteur sint occaecat cupidatatnon proident, sunt in culpa qui officia deserunt mollit anim id est laborum. ",
            "context": {},
            "metadata": {
                "anchors": [],
                "sha256": "02ab3d2d8b63f484823488118931988d8672c3ec022b4b719792fe8b07070934",
                "tags": [
                    "adobe"
                ],
                "types": []
            },
            "origin": null,
            "pdf_context": null,
            "title": "Sorcero's test PDF",
            "type": "passage",
            "version": "1.0"
        },
        {
            "content": "Lorem ipsum dolor sit amet, consectetur adipiscing elit, sed do eiusmod tempor incididunt ut labore et dolore magna aliqua. Ut enim ad minim veniam, quis nostrud exercitation ullamco laboris nisi ut aliquip ex ea commodo consequat. Duis aute irure dolor in reprehenderit <column1>aaa aaaaaa a aaaaa aa aa a aaaaaa aaaa aa aa a aaaaa aaaaaaaaaaaa aaaaaaaaaa aaaaaaa aa aaa aaa aaaa aa aaaaa aa aa aa aaa aaaaaa aaa aa a aa aa a aa a a a aa a aa a a a a a a a aa a a a a a aaa aa aaa aa aaaaaaaa aa a a a aa a a aa a a a a ",
            "context": {},
            "metadata": {
                "anchors": [],
                "sha256": "d33c68a504bf8854e00954d4b934ad62f3f68968c7b6df7163180f37509d1002",
                "tags": [
                    "adobe"
                ],
                "types": []
            },
            "origin": null,
            "pdf_context": null,
            "title": "Sorcero's test PDF",
            "type": "passage",
            "version": "1.0"
        },
        {
            "content": "aaaaaaa a aaaaaaa aa a aaaaaaa aa aa aa a aaa a aa aaaaaaa aaaaaa aaaaaaa aaaaa aaaaa aa aa a aa a aa a a a a aa aaaaaaa aaaaaa aaa aaaaaaa aaa aaaaaaaaaaa aa aaaaa ",
            "context": {},
            "metadata": {
                "anchors": [],
                "sha256": "0fb8c08597cf726739ee55135ff874fa1c2ef2b64e05a376088ea29a5e715357",
                "tags": [
                    "adobe"
                ],
                "types": []
            },
            "origin": null,
            "pdf_context": null,
            "title": "Sorcero's test PDF",
            "type": "passage",
            "version": "1.0"
        },
        {
            "content": "aa aaaaaa aaaaa aaaa aaaaaaaa a aa aaaaaaa aaaaaaaaa aaaaaaa aaaaaaaaaaa aaaaaa aa aaaaa aaa aaa aaaaaaaa <column2>bbbb bbb bbb b b bb bb b b bb bb bbbb b b b b b b b b b b b b b b b bb bbbbbbbb bbbbbb bbbbb bbbbb bbbbbb bbbbb bbbbb bbbbbb bbbbbbb bbbbbbb ",
            "context": {},
            "metadata": {
                "anchors": [],
                "sha256": "e5d5e9c2d59eaca0d23b052bf31cd0b822e5e215779752f1bd3d1eac366015e9",
                "tags": [
                    "adobe"
                ],
                "types": []
            },
            "origin": null,
            "pdf_context": null,
            "title": "Sorcero's test PDF",
            "type": "passage",
            "version": "1.0"
        },
        {
            "content": "bbbbbb bbbbbbb bbbbbb bbbbbbbb bbbbbbbb bbbbbbbbbb bb bbbbbbbbbbb bbbbbbb bbb bbbbbb bbbbbb bb bbbbb bbbb bbbbb bbbbb bbbbb bbbb bbbbbb bbbbb bbbbbb bbbb bbbbb bbbbb bb bb bbbbb b bb ",
            "context": {},
            "metadata": {
                "anchors": [],
                "sha256": "8021e1408b718a739499d3dae78bb7493f85b1d90fa0eac4a065b5d5b51fb9e4",
                "tags": [
                    "adobe"
                ],
                "types": []
            },
            "origin": null,
            "pdf_context": null,
            "title": "Sorcero's test PDF",
            "type": "passage",
            "version": "1.0"
        },
        {
            "content": "bb bb bbb bbbb bbbb bbbbb bb bb bbbbb bbb bb bbbb bbb bbbb bbb bbbbb bbb bbbb bbbb bbb bbbb bbbbbb bbbbb bbbbbb <column3>ccccc cccccc ccccc ccc c c c c ccccc ccccc ccc c c c c ccccc ccccccccc cc c ccc ccc c cc ccc ccccc cccc cccc cccccc cccc ccc ccc ccc cccccc ccccc cccc ccccccc c ccc ccc cc cccc ccc cccc ccccc ccc cccccc cc cc cccc ccc ccccc ccc cccccc cccc ccccc ccccccc cc ccccc ccc ccc cc c ccc ccc cccc cc ccccc ccc c c c c ccccc ccccccccc cc c ccc ccc c cc ccc ccccc cccc cccc cccccccccc ",
            "context": {},
            "metadata": {
                "anchors": [],
                "sha256": "a9ec993033ff7a09b87a74c83ec098739a08563794f30ca76306e48c44ab8316",
                "tags": [
                    "adobe"
                ],
                "types": []
            },
            "origin": null,
            "pdf_context": null,
            "title": "Sorcero's test PDF",
            "type": "passage",
            "version": "1.0"
        },
        {
            "content": "ccc ccc ccc cccccc ccccc cccc ccccccc c ccc ccc cc cccc ccc cccc ccccc ccc cccccc cc cc cccc ccc ccccc ccc cccccc cccc ccccc ccccccc cc ccccc ccc ccc cc c ccc ccc cccc cc ccccccccc cc c ccc ccc c cc ccc ccccc cccc cccc cccccc cccc ccc ",
            "context": {},
            "metadata": {
                "anchors": [],
                "sha256": "282eccadf1bde1e087c3793543369b8f7c6211eee176f4dbfab60c6a374310c5",
                "tags": [
                    "adobe"
                ],
                "types": []
            },
            "origin": null,
            "pdf_context": null,
            "title": "Sorcero's test PDF",
            "type": "passage",
            "version": "1.0"
        }
    ],
    "context": {},
    "origin": null,
    "title": "Sorcero's test PDF",
    "type": "collection",
    "version": "1.0"
}
