{
    "name": "pipeline_pdf_adobe",
    "pipes": [
        {
            "name": "text",
            "sources": [
                {
                    "source": "pdf",
                    "type": "manifest"
                }
            ],
            "steps": [
                {
                    "arguments": {
                        "directory": "output",
                        "first_page": -1,
                        "last_page": -1,
                        "layout_markers": {
                            "figure": "PASSAGE_MARKER",
                            "footnote": "PASSAGE_MARKER",
                            "header": "PASSAGE_MARKER",
                            "list_item": "PASSAGE_MARKER",
                            "paragraph": "PASSAGE_MARKER",
                            "table": "PASSAGE_MARKER",
                            "title": "PASSAGE_MARKER",
                            "toc_item": "PASSAGE_MARKER"
                        }
                    },
                    "inputs": null,
                    "outputs": null,
                    "type": "pdf_source_create_text_document_adobe"
                },
                {
                    "arguments": {
                        "regexp": "PASSAGE_MARKER\\s*PASSAGE_MARKER",
                        "replacement": "PASSAGE_MARKER"
                    },
                    "inputs": null,
                    "outputs": null,
                    "type": "text_document_string_replace"
                },
                {
                    "arguments": {
                        "regexp": "\\APASSAGE_MARKER",
                        "replacement": ""
                    },
                    "inputs": null,
                    "outputs": null,
                    "type": "text_document_string_replace"
                },
                {
                    "arguments": {
                        "regexp": "PASSAGE_MARKER\\Z",
                        "replacement": ""
                    },
                    "inputs": null,
                    "outputs": null,
                    "type": "text_document_string_replace"
                },
                {
                    "arguments": {
                        "separator": "PASSAGE_MARKER"
                    },
                    "inputs": null,
                    "outputs": null,
                    "type": "text_split_into_collection_document"
                },
                {
                    "arguments": {
                        "transformer": {
                            "arguments": {},
                            "inputs": null,
                            "outputs": null,
                            "type": "text_create_passage_document"
                        }
                    },
                    "inputs": null,
                    "outputs": null,
                    "type": "collection_document_transform"
                },
                {
                    "arguments": {
                        "transformer": {
                            "arguments": {
                                "key": "tags",
                                "value": "adobe"
                            },
                            "inputs": null,
                            "outputs": null,
                            "type": "passage_document_add_metadata"
                        }
                    },
                    "inputs": null,
                    "outputs": null,
                    "type": "collection_document_transform"
                }
            ],
            "type": "base"
        }
    ],
    "type": "base"
}
