{
    "content": [
        {
            "abstract": "",
            "authors": [
                {
                    "affiliation": [],
                    "name": "D'Amore, F",
                    "orcid": ""
                },
                {
                    "affiliation": [],
                    "name": "Santoro, A M",
                    "orcid": ""
                },
                {
                    "affiliation": [],
                    "name": "Genuini, A",
                    "orcid": ""
                },
                {
                    "affiliation": [],
                    "name": "Castaldi, C",
                    "orcid": ""
                }
            ],
            "coi_statement": "",
            "content": "",
            "context": {},
            "copyright": "",
            "country": "Italy",
            "doi": "",
            "entrez_date": "",
            "full_text_url": "",
            "journal": "La Clinica terapeutica",
            "journal_ISSN": "0009-9074",
            "journal_abbreviation": "",
            "journal_issue": "6",
            "journal_volume": "131",
            "keywords": [
                "Adenoma, complications",
                "Adenoma, physiopathology",
                "Atrial Fibrillation, etiology",
                "Atrial Fibrillation, physiopathology",
                "Female",
                "Goiter, Nodular, complications",
                "Goiter, Nodular, physiopathology",
                "Heart Failure, etiology",
                "Heart Failure, physiopathology",
                "Humans",
                "Middle Aged",
                "Thyroid Neoplasms, complications",
                "Thyroid Neoplasms, physiopathology"
            ],
            "language": "ita",
            "origin": null,
            "pagination": "381-5",
            "provider": "proquest",
            "provider_id": "596763388",
            "provider_url": "https://www.proquest.com/docview/596763388",
            "publication_date": "1989-12-31",
            "publication_type": [
                "Case Reports",
                "English Abstract",
                "Journal Article"
            ],
            "references": [],
            "revision_date": "",
            "source": null,
            "title": "Cardiothyrosis. Presentation of a clinical case",
            "type": "publication",
            "version": "1.0"
        }
    ],
    "context": {},
    "origin": null,
    "source": null,
    "title": "",
    "type": "collection",
    "version": "1.0"
}