{
    "content": [
        {
            "abstract": "",
            "authors": [
                {
                    "affiliation": [
                        "1 University of Illinois at Chicago, IL, USA."
                    ],
                    "name": "Dunn, Heather",
                    "orcid": ""
                },
                {
                    "affiliation": [
                        "1 University of Illinois at Chicago, IL, USA."
                    ],
                    "name": "Quinn, Laurie",
                    "orcid": ""
                },
                {
                    "affiliation": [
                        "1 University of Illinois at Chicago, IL, USA."
                    ],
                    "name": "Corbridge, Susan J",
                    "orcid": ""
                },
                {
                    "affiliation": [
                        "1 University of Illinois at Chicago, IL, USA."
                    ],
                    "name": "Eldeirawi, Kamal",
                    "orcid": ""
                },
                {
                    "affiliation": [
                        "1 University of Illinois at Chicago, IL, USA."
                    ],
                    "name": "Kapella, Mary",
                    "orcid": ""
                },
                {
                    "affiliation": [
                        "1 University of Illinois at Chicago, IL, USA."
                    ],
                    "name": "Collins, Eileen G",
                    "orcid": ""
                }
            ],
            "coi_statement": "Declaration of Conflicting Interests: The author(s) declared no potential conflicts of interest with respect to the research, authorship, and/or publication of this article.",
            "content": "",
            "context": {},
            "copyright": "",
            "country": "United States",
            "doi": "10.1177/0193945917707705",
            "entrez_date": "2017-05-17",
            "full_text_url": "https://www.ncbi.nlm.nih.gov/pmc/articles/PMC5665711",
            "journal": "Western journal of nursing research",
            "journal_ISSN": "1552-8456",
            "journal_abbreviation": "West J Nurs Res",
            "journal_issue": "11",
            "journal_volume": "40",
            "keywords": [
                "cluster analysis",
                "historical article",
                "nursing research"
            ],
            "language": "eng",
            "origin": "https://eutils.ncbi.nlm.nih.gov/entrez/eutils/efetch.fcgi?id=28508702&db=pubmed&rettype=abstract&retmode=xml",
            "pagination": "1658-1676",
            "provider": "pubmed",
            "provider_id": "28508702",
            "provider_url": "http://www.ncbi.nlm.nih.gov/pubmed/28508702",
            "publication_date": "2018-11-01",
            "publication_type": [
                "Historical Article",
                "Journal Article"
            ],
            "references": [
                "Abbas OA. Comparisons between data clustering algorithms. International Arab Journal of Information Technology. 2008;5:320–325.",
                "Aldenderfer MS, Blashfield RK, editors. SAGE University paper series on quantitative applications in the social sciences, series no 07-044. 6th. Newbury Park, CA: SAGE; 1984. Cluster analysis.",
                "Allred CA, Michel Y, Arford PH, Carter V, Veitch JS, Dring R, et al. Finch NJ. Environmental uncertainty: Implications for practice model redesign. Nursing Economic$ 1994;12:318–326.",
                "Beckstead J. Using hierarchical cluster analysis in nursing research. Western Journal of Nursing Research. 2002;24:307–319. doi: 10.1177/01939450222045923.",
                "Bender CM, Ergun FS, Rosenzweig MQ, Cohen SM, Sereika SM. Symptom clusters in breast cancer across 3 phases of the disease. Cancer Nursing. 2005;28:219–225.",
                "Boudier A, Curjuric I, Basagaña X, Hazgui H, Anto JM, Bousquet J, et al. Sunyer J. Ten-year follow-up of cluster-based asthma phenotypes in adults. A pooled analysis of three cohorts. American Journal of Respiratory & Critical Care Medicine. 2013;188:550–560. doi: 10.1164/rccm.201301-0156OC.",
                "Buijck BI, Zuidema SU, Eijk MS, Bor H, Gerritsen DL, Koopmans RT. Is patient-grouping on basis of condition on admission indicative for discharge destination in geriatric stroke patients after rehabilitation in skilled nursing facilities? The results of a cluster analysis. BMC Health Services Research. 2012;12:443. doi: 10.1186/1472-6963-12-443.",
                "Collins LM, Lansa ST. Latent class and latent transition analysis: With applications in the social, behavioral, and health sciences. Hoboken, NJ: John Wiley; 2010.",
                "Ghosh D, Sterns AA, Drew BL, Hamera E. Geospatial study of psychiatric mental health-advanced practice registered nurses (PMH-APRNs) in the United States. Psychiatric Services. 2011;62:1506–1509.",
                "Gilbertson-White S, Miaskowski C, Lee K, Dodd M, West C, Cooper B. The stability of patient subgroups identified using cluster analysis. Oncology Nursing Forum. 2007;34(1):202–203.",
                "Hagan DE. Cluster analysis: An empirical methodology for developing homogeneous patient subjects for research purposes. Communicating Nursing Research. 1977;9:395–407.",
                "Haldar P, Pavord ID, Shaw DE, Berry MA, Thomas M, Brightling CE, et al. Green RH. Cluster analysis and clinical asthma phenotypes. American Journal of Respiratory & Critical Care Medicine. 2008;178:218–224.",
                "Halkidi M, Batistakis Y, Vazirgiannis M. On clustering validation techniques. Journal of Intelligent Information Systems. 2001;17:107–145. doi: 10.1023/A:1012801612483.",
                "Halkidi M, Batistakis Y, Vazirgiannis M. Cluster validity methods: Part I. SIGMOD Record. 2002;31(2):40–45. doi: 10.1145/565117.565124.",
                "Hall-Lord ML, Larsson G, Steen B. Chronic pain and distress in older people: A cluster analysis. International Journal of Nursing Practice. 1999;5:78–85.",
                "Hertzog MA, Pozehl B, Duncan K. Cluster analysis of symptom occur-rence to identify subgroups of heart failure patients: A pilot study. The Journal of Cardiovascular Nursing. 2010;25:273–283. doi: 10.1097/JCN.0b013e3181cfbb6c.",
                "Hillhouse JJ, Adler CM. Investigating stress effect patterns in hospital staff nurses: Results of a cluster analysis. Social Science & Medicine. 1997;45:1781–1788. doi: 10.1016/S0277-9536(97)00109-3.",
                "Huba GJ, Brief DE, Cherin DA, Panter AT, Melchior LA. A typology of service patterns in end-stage AIDS care: Relationships to the transprofessional model. Home Health Care Services Quarterly. 1998;17:73–92.",
                "Jain AK. Data clustering: 50 years beyond K-means. Pattern Recognition Letters. 2010;31:651–666. doi: 10.1016/j.patrec.2009.09.011.",
                "Jain AK, Murty M, Flynn P. Data clustering: A review. ACM Computing Surveys (CSUR) 1999;31:264–323. doi: 10.1145/331499.331504.",
                "Johnson M. Using cluster analysis to develop a healing typology in vascular ulcers. Journal of Vascular Nursing. 1997;15(2):45–49. doi: 10.1016/S1062-0303(97)90000-5.",
                "Kaufman L, Rousseau PJ. Finding groups in data: An introduction to cluster analysis. Hoboken, NJ: John Wiley; 2005.",
                "Krause EF. Taxicab geometry: An adventure in non-Euclidean geometry. New York, NY: Dover; 1986.",
                "Kulczycki A, Qu H, Bosarge PM, Shewchuk RM. Examining the diverse perspectives of nurse practitioners regarding obstacles to diaphragm prescription: A latent class analysis. Journal of Women's Health. 2010;19:1355–1361. doi: 10.1089/jwh.2009.1730.",
                "Lee KS, Song EK, Lennie TA, Frazier SK, Chung ML, Heo S, et al. Moser DK. Symptom clusters in men and women with heart failure and their impact on cardiac event-free survival. The Journal of Cardiovascular Nursing. 2010;25:263–272. doi: 10.1097/JCN.0b013e3181cfbb88.",
                "Lin C, Cheng C, Kuo S, Chou F. Development of a Chinese short form of the prenatal self-evaluation questionnaire. Journal of Clinical Nursing. 2009;18:659–666. doi: 10.1111/j.1365-2702.2007.02201.x.",
                "Lindberg M, Wikström B, Lindberg P. Subgroups of haemodialysis patients in relation to fluid intake restrictions: A cluster analytical approach. Journal of Clinical Nursing. 2010;19:2997–3005. doi: 10.1111/j.1365-2702.2010.03372.x.",
                "Magidson J, Vermunt JK. Latent class models for clustering: A comparison with K-means. Canadian Journal of Marketing Research. 2002a;20:36–43.",
                "Magidson J, Vermunt JK. A nontechnical introduction to latent class models. Belmont, MA: Statistical Innovations Inc; 2002b.",
                "Magidson J, Vermunt JK. Latent class models: The SAGE handbook of quantitative methodology for the social sciences. Thousand Oaks, CA: SAGE; 2004.",
                "Manning CD, Raghavan P, Schütze H. Hierarchical clustering. In: Manning CD, Raghavan P, Schütze H, editors. An introduction to information retrieval. Cambridge, UK: Cambridge University Press; 2009. pp. 377–401.",
                "McSweeney JC, Cleves MA, Zhao W, Lefler LL, Yang S. Cluster analysis of women's prodromal and acute myocardial infarction symptoms by race and other characteristics. The Journal of Cardiovascular Nursing. 2010;25:311–322. doi: 10.1097/JCN.0b013e3181cfba15.",
                "Moore WC, Meyers DA, Wenzel SE, Teague WG, Li H, Li X, et al. Bleecker ER. Identification of asthma phenotypes using cluster analysis in the severe asthma research program. American Journal of Respiratory and Critical Care Medicine. 2010;181:315–323. doi: 10.1164/rccm.200906-0896OC.",
                "Norušis MJ. Cluster analysis. In: Norušis MJ, editor. SPSS statistics 17.0: Advanced statistical procedures companion. Upper Saddle River, NJ: Prentice Hall; 2008. pp. 361–391.",
                "Popper KR. Conjectures and refutations: The growth of scientific knowledge. 5th. New York, NY: Routledge Classics; 1968.",
                "Riegel B, Hanlon AL, McKinley S, Moser DK, Meischke H, Doering LV, et al. Dracup K. Differences in mortality in acute coronary syndrome symptom clusters. American Heart Journal. 2010;159:392–398. doi: 10.1016/j.ahj.2010.01.003.",
                "Rokach L, Maimon O. Clustering methods. In: Maimon O, Rokach L, editors. Data mining and knowledge discovery handbook. 1st. New York, NY: Springer; 2005. pp. 321–352.",
                "Rosenfeld AG, Knight EP, Steffen A, Burke L, Daya M, DeVon HA. Symptom clusters in patients presenting to the emergency department with possible acute coronary syndrome differ by sex, age, and discharge diagnosis. Heart & Lung. 2015;44:368–375. doi: 10.1016/j.hrtlng.2015.05.008.",
                "Ryan CJ, Devon HA, Horne R, King KB, Milner K, Moser DK, et al. Zerwic JJ. Symptom clusters in acute myocardial infarction. American Journal of Critical Care. 2006;15:337.",
                "Shahrbanian S, Duquette P, Kuspinar A, Mayo NE. Contribution of symptom clusters to multiple sclerosis consequences. Quality of Life Research. 2015;24:617–629. doi: 10.1007/s11136-014-0804-7.",
                "Shimanouchi S, Kamei T, Hayashi M. Home care for the frail elderly based on urinary incontinence level. Public Health Nursing. 2000;17:468–473.",
                "Siroux V, Basaga X, Boudier A, Pin I, Garcia-Aymerich J, Vesin A, et al. Sunyer J. Identifying adult asthma phenotypes using a clustering approach. European Respiratory Journal. 2011;38:310–317.",
                "Sokal RR, Sneath PH. Principles of numerical taxonomy. San Francisco, CA: W.H. Freeman; 1963.",
                "Sørlie T, Tibshirani R, Parker J, Hastie T, Marron JS, Nobel A, et al. Botstein D. Repeated observation of breast tumor subtypes in independent gene expression data sets. Proceedings of the National Academy of Sciences of the United States of America. 2003;100:8418–8423. doi: 10.1073/pnas.0932692100.",
                "SPSS Inc. A scalable component to segment your customers more effectively (White paper, technical report) Chicago, IL: Author; 2001. The SPSS TwoStep cluster component.",
                "Stuifbergen AK. Patterns of functioning in families with a chronically ill parent: An exploratory study. Research in Nursing & Health. 1990;13:35–44.",
                "Tan P, Steinbach M, Kumar V. Cluster analysis. In: Tan P, Steinbach M, Kumar V, editors. Introduction to data mining. 1st. Boston, MA: Addison-Wesley; Longman: 2005. pp. 7–65.",
                "Thorpe K, Loo R. Critical-thinking types among nursing and management undergraduates. Nurse Education Today. 2003;23:566–574. doi: 10.1016/S0260-6917(03)00102-3.",
                "van ‘t Veer LJ, Dai H, van dV, He YD, Hart AAM, Mao M, et al. Friend SH. Gene expression profiling predicts clinical outcome of breast cancer. Nature. 2002;415:530–536.",
                "Vasiliadou A, Karvountzis GG, Soumilas A, Roumeliotis D, Theodosopoulou E. Occupational low-back pain in nursing staff in a Greek Hospital. Journal of Advanced Nursing. 1995;21:125–130."
            ],
            "revision_date": "2019-10-08",
            "source": null,
            "title": "Cluster Analysis in Nursing Research: An Introduction, Historical Perspective, and Future Directions",
            "type": "publication",
            "version": "1.0"
        }
    ],
    "context": {},
    "origin": null,
    "source": null,
    "title": "",
    "type": "collection",
    "version": "1.0"
}