[
  {
    "icon":"pet-friendly-condos",
    "link": {
      "rent": {
        "href": "/rentals/condo/pet-friendly",
        "name": "searchesPetFriendlyCondos"
      },
      "sale": {
        "href": "/sales/condo/pet-friendly",
        "name": "searchesPetFriendlyCondosSale"
      }
    }
  },
  {
    "icon":"modern-gym",
    "link": {
      "rent": {
        "href": "/rentals/gym",
        "name": "searchesModernGym"
      },
      "sale": {
        "href": "/sales/gym",
        "name": "searchesModernGymSale"
      }
    }
  },
  {
    "icon":"with-balcony",
    "link": {
      "rent": {
        "href": "/rentals/condo/balcony",
        "name": "searchesWithBalcony"
      },
      "sale": {
        "href": "/sales/condo/balcony",
        "name": "searchesWithBalconySale"
      }
    }
  },
  {
    "icon":"great-value-condos",
    "link": {
      "rent": {
        "href": "/rentals/condo/cheapest",
        "name": "searchesGreatValueCondos"
      },
      "sale": {
        "href": "/sales/condo/cheapest",
        "name": "searchesGreatValueCondosSale"
      }
    }
  }
]