[
  {
    "id": 1,
    "icon": "largest-selection",
    "title": "propertyLargestSelectionTitle",
    "subTitle": "propertyLargestSelectionSubTitle",
    "contents": [
      "propertyLargestSelectionContentFirst",
      "propertyLargestSelectionContentSecond"
    ]
  },
  {
    "id": 2,
    "icon": "professional",
    "title": "propertyProfessionalTitle",
    "subTitle": "propertyProfessionalSubTitle",
    "contents": [
      "propertyProfessionalContentFirst",
      "propertyProfessionalContentSecond",
      "propertyProfessionalContentThird"
    ]
  },
  {
    "id": 3,
    "icon": "free-for-you",
    "title": "propertyFreeForYouTitle",
    "subTitle": "propertyFreeForYouSubTitle",
    "contents": [
      "propertyFreeForYouContentFirst"
    ]
  },
  {
    "id": 4,
    "icon": "best-deals",
    "title": "propertyBestDealsTitle",
    "subTitle": "propertyBestDealsSubTitle",
    "contents": [
      "propertyBestDealsContentFirst",
      "propertyBestDealsContentSecond"
    ]
  }
]