[
  {
    "question": "howItWorksFAQQuestionFirst",
    "answers": [
      "howItWorksFAQAnswersFirst"
    ]
  },
  {
    "question": "howItWorksFAQQuestionSecond",
    "answers": [
      "howItWorksFAQAnswersSecond"
    ]
  },
  {
    "question": "howItWorksFAQQuestionThird",
    "answers": [
      "howItWorksFAQAnswersThird"
    ]
  },
  {
    "question": "howItWorksFAQQuestionFourth",
    "answers": [
      "howItWorksFAQAnswersFourth"
    ]
  }
]