{
  "en": {
    "B": [
      { "id": 103, "name": "Bang Kapi" },
      { "id": 126, "name": "Bang Khun Non" },
      { "id": 159, "name": "Bang Khae" },
      { "id": 88, "name": "Bang Chan" },
      { "id": 175, "name": "Bang Son" },
      { "id": 133, "name": "Bang Sue" },
      { "id": 155, "name": "Bang Phai" },
      { "id": 129, "name": "Bang Phlat" },
      { "id": 131, "name": "Bang Pho" },
      { "id": 127, "name": "Bang Yi Khan" },
      { "id": 156, "name": "Bang Wa" },
      { "id": 130, "name": "Bang O" }
    ],
    "C": [
      { "id": 124, "name": "Charan 13" },
      { "id": 72, "name": "Chaengwattana 14" },
      { "id": 98, "name": "Chokchai4" },
      { "id": 135, "name": "Chatuchak Park" }
    ],
    "F": [{ "id": 125, "name": "Fai Chai" }],
    "G": [{ "id": 73, "name": "Government Complex" }],
    "H": [
      { "id": 140, "name": "Huai Khwang" },
      { "id": 150, "name": "Hua Lamphong" }
    ],
    "I": [{ "id": 154, "name": "Itsaraphap" }],
    "K": [
      { "id": 107, "name": "Kalan Tan" },
      { "id": 134, "name": "Kamphaeng Phet" },
      { "id": 146, "name": "Khlong Toei" },
      { "id": 84, "name": "Khu Bon" }
    ],
    "L": [
      { "id": 79, "name": "Lat Plakhao" },
      { "id": 137, "name": "Lat Phrao" },
      { "id": 102, "name": "Lat Phrao 101" },
      { "id": 99, "name": "Lat Phrao 71" },
      { "id": 100, "name": "Lat Phrao 83" },
      { "id": 147, "name": "Lumphini" },
      { "id": 160, "name": "Lak Song" },
      { "id": 75, "name": "Lak Si" }
    ],
    "M": [
      { "id": 90, "name": "Minburi Market" },
      { "id": 101, "name": "Ministry of Interior" },
      { "id": 81, "name": "Maiyarap" },
      { "id": 91, "name": "Minburi" }
    ],
    "N": [{ "id": 87, "name": "Nopparat" }],
    "P": [
      { "id": 142, "name": "Phra Ram 9" },
      { "id": 136, "name": "Phahon Yothin" },
      { "id": 94, "name": "Phahonyothin 24" },
      { "id": 106, "name": "Pattanakarn" },
      { "id": 157, "name": "Phetkasem 48" },
      { "id": 143, "name": "Phetchaburi" },
      { "id": 97, "name": "Phaowana " },
      { "id": 158, "name": "Phasi Charoen" }
    ],
    "Q": [{ "id": 145, "name": "Queen Sirikit National Convention Centre" }],
    "R": [
      { "id": 96, "name": "Ratchada" },
      { "id": 138, "name": "Ratchadaphisek" },
      { "id": 76, "name": "Rajabhat Phranakhon" },
      { "id": 78, "name": "Rarm Intra 3" },
      { "id": 80, "name": "Rarm Inthra Km 4" },
      { "id": 83, "name": "Rarm Intra Km 6" },
      { "id": 85, "name": "Rarm Intra Km 9" }
    ],
    "S": [
      { "id": 105, "name": "Srikreeta" },
      { "id": 109, "name": "Srinakarin 38" },
      { "id": 108, "name": "Sri Nuch" },
      { "id": 113, "name": "Sri La Salle" },
      { "id": 111, "name": "Sri Udom" },
      { "id": 112, "name": "Sri Iam" },
      { "id": 89, "name": "Setthabutbamphen" },
      { "id": 153, "name": "Sanam Chai" },
      { "id": 110, "name": "Suan Luang Rama 9" },
      { "id": 152, "name": "Sam Yot" },
      { "id": 149, "name": "Sam Yan" },
      { "id": 128, "name": "Sirindhorn" },
      { "id": 148, "name": "Si Lom" },
      { "id": 144, "name": "Sukhumvit" },
      { "id": 139, "name": "Sutthisan" }
    ],
    "T": [
      { "id": 132, "name": "Tao Poon" },
      { "id": 123, "name": "Tha Phra" },
      { "id": 74, "name": "TOT" },
      { "id": 141, "name": "Thailand Cultural Centre" }
    ],
    "V": [{ "id": 82, "name": "Vacharaphol" }],
    "W": [
      { "id": 174, "name": "Wong Sawang" },
      { "id": 86, "name": "Wongwaen-Ramintra" },
      { "id": 77, "name": "Wat Phra Sri Mahathat" },
      { "id": 151, "name": "Wat Mangkon" }
    ],
    "Y": [{ "id": 104, "name": "Yaek Lam Sali" }]
  },
  "th": {
    "ก": [
      { "id": 107, "name": "กลันตัน" },
      { "id": 134, "name": "กำแพงเพชร" }
    ],
    "ค": [
      { "id": 146, "name": "คลองเตย" },
      { "id": 84, "name": "คู้บอน" }
    ],
    "จ": [
      { "id": 124, "name": "จรัญฯ 13" },
      { "id": 72, "name": "แจ้งวัฒนะ 14" }
    ],
    "ช": [{ "id": 98, "name": "โชคชัย 4" }],
    "ต": [
      { "id": 90, "name": "ตลาดมีนบุรี" },
      { "id": 132, "name": "เตาปูน" }
    ],
    "ท": [
      { "id": 123, "name": "ท่าพระ" },
      { "id": 74, "name": "ทีโอที" }
    ],
    "น": [{ "id": 87, "name": "นพรัตน์" }],
    "บ": [
      { "id": 103, "name": "บางกะปิ" },
      { "id": 126, "name": "บางขุนนนท์" },
      { "id": 159, "name": "บางแค" },
      { "id": 88, "name": "บางชัน" },
      { "id": 175, "name": "บางซ่อน" },
      { "id": 133, "name": "บางซื่อ" },
      { "id": 155, "name": "บางไผ่" },
      { "id": 129, "name": "บางพลัด" },
      { "id": 131, "name": "บางโพ" },
      { "id": 127, "name": "บางยี่ขัน" },
      { "id": 156, "name": "บางหว้า" },
      { "id": 130, "name": "บางอ้อ" }
    ],
    "พ": [
      { "id": 142, "name": "พระราม 9" },
      { "id": 136, "name": "พหลโยธิน" },
      { "id": 94, "name": "พหลโยธิน 24" },
      { "id": 106, "name": "พัฒนาการ" },
      { "id": 157, "name": "เพชรเกษม 48" },
      { "id": 143, "name": "เพชรบุรี" }
    ],
    "ฟ": [{ "id": 125, "name": "ไฟฉาย" }],
    "ภ": [
      { "id": 97, "name": "ภาวนา" },
      { "id": 158, "name": "ภาษีเจริญ" }
    ],
    "ม": [
      { "id": 101, "name": "มหาดไทย" },
      { "id": 81, "name": "มัยลาภ" },
      { "id": 91, "name": "มีนบุรี" }
    ],
    "ย": [{ "id": 104, "name": "แยกลำสาลี" }],
    "ร": [
      { "id": 96, "name": "รัชดา" },
      { "id": 138, "name": "รัชดาภิเษก" },
      { "id": 76, "name": "ราชภัฏพระนคร" },
      { "id": 78, "name": "รามอินทรา 3" },
      { "id": 80, "name": "รามอินทรา กม 4" },
      { "id": 83, "name": "รามอินทรา กม 6" },
      { "id": 85, "name": "รามอินทรา กม 9" }
    ],
    "ล": [
      { "id": 79, "name": "ลาดปลาเค้า" },
      { "id": 137, "name": "ลาดพร้าว" },
      { "id": 102, "name": "ลาดพร้าว 101" },
      { "id": 99, "name": "ลาดพร้าว 71" },
      { "id": 100, "name": "ลาดพร้าว 83" },
      { "id": 147, "name": "ลุมพินี" }
    ],
    "ว": [
      { "id": 174, "name": "วงศ์สว่าง" },
      { "id": 86, "name": "วงแหวนรามอินทรา" },
      { "id": 82, "name": "วัชรพล" },
      { "id": 77, "name": "วัดพระศรีมหาธาตุ" },
      { "id": 151, "name": "วัดมังกร" }
    ],
    "ศ": [
      { "id": 105, "name": "ศรีกรีฑา" },
      { "id": 109, "name": "ศรีนครินทร์ 38" },
      { "id": 108, "name": "ศรีนุช" },
      { "id": 113, "name": "ศรีลาซาล" },
      { "id": 111, "name": "ศรีอุดม" },
      { "id": 112, "name": "ศรีเอี่ยม" },
      { "id": 145, "name": "ศูนย์การประชุมแห่งชาติสิริกิติ์" },
      { "id": 73, "name": "ศูนย์ราชการเฉลิมพระเกียรติ" },
      { "id": 141, "name": "ศูนย์วัฒนธรรมแห่งประเทศไทย" },
      { "id": 89, "name": "เศรษฐบุตรบำเพ็ญ" }
    ],
    "ส": [
      { "id": 153, "name": "สนามไชย" },
      { "id": 135, "name": "สวนจตุจักร" },
      { "id": 110, "name": "สวนหลวง ร 9" },
      { "id": 152, "name": "สามยอด" },
      { "id": 149, "name": "สามย่าน" },
      { "id": 128, "name": "สิรินธร" },
      { "id": 148, "name": "สีลม" },
      { "id": 144, "name": "สุขุมวิท" },
      { "id": 139, "name": "สุทธิสาร" }
    ],
    "ห": [
      { "id": 160, "name": "หลักสอง" },
      { "id": 75, "name": "หลักสี่" },
      { "id": 140, "name": "ห้วยขวาง" },
      { "id": 150, "name": "หัวลำโพง" }
    ],
    "อ": [{ "id": 154, "name": "อิสรภาพ" }]
  }
}
