[
  {
    "href": "/rentals",
    "i18nKey": "rent",
    "children": [
      { "href": "/bangkok/rentals/condo", "i18nKey": "condo" },
      { "href": "/bangkok/rentals/apartment", "i18nKey": "apartment" },
      { "href": "/bangkok/rentals/serviced-apartment", "i18nKey": "servicedApartment" },
      { "href": "/bangkok/rentals/house", "i18nKey": "house" },
      { "href": "/bangkok/rentals/townhouse", "i18nKey": "townhouse" }
    ]
  },
  {
    "href": "/sales",
    "i18nKey": "buyFilter"
  },
  {
    "href": "/list-your-property",
    "i18nKey": "saleHeader"
  },
  {
    "href": "/how-does-it-work",
    "i18nKey": "howDoesItWork"
  }
]
