{
  "apps": [
      {
          "name": "fs-main-website:3900",
          "script": "npm",
          "args": "run start:development",
          "instances": 1,
          "exec_mode": "fork",
          "listen_timeout": 5000,
          "wait_ready": true,
          "update-env": true,
					"time": true,
          "env": {
            "PORT": 3900,
            "NEXT_PUBLIC_OPTIMIZED_IMAGE_DOMAINS": "flexstay.rentals,blog.flexstay.rentals,cdn.staticflexstay.com,www.thaihometown.com"
          }
      },
			{
				"name": "fs-main-website:3901",
				"script": "npm",
				"args": "run start:development",
				"instances": 1,
				"exec_mode": "fork",
				"listen_timeout": 5000,
				"wait_ready": true,
				"update-env": true,
				"time": true,
				"env": {
					"PORT": 3901,
					"NEXT_PUBLIC_OPTIMIZED_IMAGE_DOMAINS": "flexstay.rentals,blog.flexstay.rentals,cdn.staticflexstay.com,www.thaihometown.com"
				}
		}
  ]
}