{
  "apps": [
    {
      "name": "staging-fs-main-website:3900",
      "script": "npm",
      "args": "run start:staging",
      "instances": 1,
      "exec_mode": "fork",
      "listen_timeout": 5000,
      "wait_ready": true,
      "update-env": true,
      "time": true,
      "env": {
        "PORT": 3900,
        "NEXT_PUBLIC_OPTIMIZED_IMAGE_DOMAINS": "staging-cms.propertyscout.co.th,staging.propertyscout.co.th,flexstay.rentals,blog.flexstay.rentals,cdn.staticflexstay.com,www.thaihometown.com",
        "LD_PRELOAD": "/usr/lib/x86_64-linux-gnu/libjemalloc.so.1",
        "NODE_ENV": "production"
      }
    },
    {
      "name": "staging-fs-main-website:3901",
      "script": "npm",
      "args": "run start:staging",
      "instances": 1,
      "exec_mode": "fork",
      "listen_timeout": 5000,
      "wait_ready": true,
      "update-env": true,
      "time": true,
      "env": {
        "PORT": 3901,
        "NEXT_PUBLIC_OPTIMIZED_IMAGE_DOMAINS": "staging-cms.propertyscout.co.th,staging.propertyscout.co.th,flexstay.rentals,blog.flexstay.rentals,cdn.staticflexstay.com,www.thaihometown.com",
        "LD_PRELOAD": "/usr/lib/x86_64-linux-gnu/libjemalloc.so.1",
        "NODE_ENV": "production"
      }
    }
  ]
}
