[
  {
    "name": "Sukhumvit",
    "description": "Lorem ipsum dolor sit amet, conse ctetur adipiscin elit. Cras tincidunt posuere dictum. Morbi tempus ligula"
  },
  {
    "name": "Asok",
    "description": "Lorem ipsum dolor sit amet, conse ctetur adipiscin elit. Cras tincidunt posuere dictum. Morbi tempus ligula"
  },
  {
    "name": "Sathorn",
    "description": "Lorem ipsum dolor sit amet, conse ctetur adipiscin elit. Cras tincidunt posuere dictum. Morbi tempus ligula"
  },
  {
    "name": "Ari",
    "description": "Lorem ipsum dolor sit amet, conse ctetur adipiscin elit. Cras tincidunt posuere dictum. Morbi tempus ligula"
  },
  {
    "name": "Sukhumvit 1",
    "description": "Lorem ipsum dolor sit amet, conse ctetur adipiscin elit. Cras tincidunt posuere dictum. Morbi tempus ligula"
  },
  {
    "name": "Asok 1",
    "description": "Lorem ipsum dolor sit amet, conse ctetur adipiscin elit. Cras tincidunt posuere dictum. Morbi tempus ligula"
  },
  {
    "name": "Sukhumvit 2",
    "description": "Lorem ipsum dolor sit amet, conse ctetur adipiscin elit. Cras tincidunt posuere dictum. Morbi tempus ligula"
  },
  {
    "name": "Asok 2",
    "description": "Lorem ipsum dolor sit amet, conse ctetur adipiscin elit. Cras tincidunt posuere dictum. Morbi tempus ligula"
  }
]