{
  "project_info": {
    "project_number": "65230351600",
    "firebase_url": "https://shopdemo-3b115.firebaseio.com",
    "project_id": "shopdemo-3b115",
    "storage_bucket": "shopdemo-3b115.appspot.com"
  },
  "client": [
    {
      "client_info": {
        "mobilesdk_app_id": "1:65230351600:android:dd9bde9701d6930b10a635",
        "android_client_info": {
          "package_name": "com.giangteam.shopdemo"
        }
      },
      "oauth_client": [
        {
          "client_id": "65230351600-on7ekj0sv9vcn78mqg9vv32ffitrrnld.apps.googleusercontent.com",
          "client_type": 3
        }
      ],
      "api_key": [
        {
          "current_key": "AIzaSyADMQdMSFxq8z-LQYuQvd514EnpRHYQWyQ"
        }
      ],
      "services": {
        "appinvite_service": {
          "other_platform_oauth_client": [
            {
              "client_id": "65230351600-on7ekj0sv9vcn78mqg9vv32ffitrrnld.apps.googleusercontent.com",
              "client_type": 3
            }
          ]
        }
      }
    }
  ],
  "configuration_version": "1"
}