{
  "specversion": "1.0",
  "type": "org.cyverse.events.WorkflowResubmitRequested",
  "source": "/cli",
  "id": "<MSG-ID>",
  "time": "2018-04-05T17:31:00Z",
  "datacontenttype": "application/json",
  "data": {
    "provider": "provider-c1emqao8oik5v6qdebag",
    "workflow_name": "<WORKFLOW-NAME>"
  }
}

