{
  "specversion": "1.0",
  "type": "org.cyverse.events.WorkflowCreateRequested",
  "source": "/cli",
  "id": "<MSG-ID>",
  "time": "2018-04-05T17:31:00Z",
  "comexampleextension1": "value",
  "comexampleothervalue": 5,
  "datacontenttype": "application/json",
  "data": {
    "provider": "provider-c1emqao8oik5v6qdebag",
    "username": "<USERNAME>",
    "workflow_type": "terraform",
    "workflow_data": {
      "template_id": "<TEMPLATE-ID>",
      "username": "<USERNAME>",
      "deployment_id": "<DEPLOYMENT-ID>",
      "tf_state_key": "<TF-STATE-KEY>",
      "git_url": "https://gitlab.com/cyverse/cacao-tf-os-ops.git",
      "git_upstream": {
        "branch": "master",
        "tag": "",
        "commit": ""
      },
      "sub_path": "single-image",
      "ansible_vars": {
        "TF_MODULE": "openstack-single-image",
        "TF_INPUT_VALUES": {
          "instance_name": "tf-ansible-test",
          "instance_count": "1",
          "flavor": "tiny1",
          "keypair": "<SSH-KEY-PAIR-NAME>",
          "image": "<IMAGE-UUID>",
          "username": "<USERNAME>",
          "ip_pool": "ext-net",
          "external_subnet_uuid": "<SUBNET-UUID>"
        },
        "TF_INPUT_VARS": {
          "instance_name": {
            "type": "string"
          },
          "instance_count": {
            "type": "string"
          },
          "flavor": {
            "type": "string"
          },
          "keypair": {
            "type": "string"
          },
          "image": {
            "type": "string"
          },
          "username": {
            "type": "string"
          },
          "ip_pool": {
            "type": "string"
          },
          "external_subnet_uuid": {
            "type": "string"
          }
        }
      
      },
      "cloud_cred_id": "<CLOUD-CREDENTIAL-ID>",
      "cloud_cred": "<BASE64-ENCODED-CREDENTIAL-JSON-STRING>",
      "git_cred_id": "<CLOUD-CREDENTIAL-ID>",
      "git_cred": "<BASE64-ENCODED-CREDENTIAL-JSON-STRING>"
    }
  }
}
