<svg width="95" height="95" viewBox="0 0 95 95" fill="none" xmlns="http://www.w3.org/2000/svg">
<circle cx="47.5" cy="47.5" r="47.5" fill="#F4F5F7"/>
<path fill-rule="evenodd" clip-rule="evenodd" d="M63.0671 42.5312H65.9071C66.3183 43.7774 67.4929 44.6797 68.875 44.6797C70.5981 44.6797 72 43.2778 72 41.5547C72 39.8315 70.5981 38.4297 68.875 38.4297C67.4929 38.4297 66.3183 39.3319 65.9071 40.5781H63.0671V37.1908C63.0671 36.7044 62.7092 36.2922 62.2275 36.2239C61.2045 36.0789 60.1909 35.8823 59.1906 35.6368L60.6674 32.9122H68.875C69.4144 32.9122 69.8516 32.4749 69.8516 31.9356V29.0929C71.0978 28.6817 72 27.5071 72 26.125C72 24.4019 70.5981 23 68.875 23C67.1519 23 65.75 24.402 65.75 26.125C65.75 27.5071 66.6522 28.6818 67.8984 29.0929V30.959H60.0859C59.7276 30.959 59.398 31.1552 59.2273 31.4701L57.2615 35.0971C53.7824 34.0021 50.5023 32.3 47.5955 30.0632C47.2444 29.7929 46.7554 29.7929 46.4044 30.0632C43.4977 32.3 40.2176 34.0021 36.7384 35.0971L34.7726 31.4701C34.6019 31.1551 34.2723 30.959 33.914 30.959H26.1016V29.0929C27.3478 28.6818 28.25 27.5071 28.25 26.125C28.25 24.402 26.8481 23 25.125 23C23.4019 23 22 24.402 22 26.125C22 27.5071 22.9022 28.6818 24.1484 29.0929V31.9355C24.1484 32.4748 24.5856 32.9121 25.125 32.9121H33.3326L34.8094 35.6367C33.809 35.8822 32.7955 36.0788 31.7725 36.2238C31.2908 36.2921 30.9329 36.7044 30.9329 37.1907V40.5781H28.0929C27.6817 39.3319 26.5071 38.4297 25.125 38.4297C23.4019 38.4297 22 39.8315 22 41.5547C22 43.2778 23.4019 44.6797 25.125 44.6797C26.5071 44.6797 27.6817 43.7774 28.0929 42.5312H30.9329V47.8815C30.9329 49.7811 31.2039 51.6628 31.7239 53.4688H28.0929C27.6817 52.2226 26.5071 51.3203 25.125 51.3203C23.4019 51.3203 22 52.7222 22 54.4453C22 56.1685 23.4019 57.5703 25.125 57.5703C26.5071 57.5703 27.6817 56.6681 28.0929 55.4219H32.395C33.1344 57.2614 34.1435 58.9926 35.3984 60.5467C35.5622 60.7495 35.7304 60.9484 35.9017 61.1442H25.125C24.5856 61.1442 24.1484 61.5814 24.1484 62.1208V66.9071C22.9022 67.3182 22 68.4929 22 69.875C22 71.5981 23.4019 73 25.125 73C26.8481 73 28.25 71.5981 28.25 69.875C28.25 68.4929 27.3478 67.3182 26.1016 66.9071V63.0974H37.8655C40.4053 65.2966 43.4813 66.8496 46.7928 67.5687C46.861 67.5834 46.9306 67.5909 47 67.5909C47.0694 67.5909 47.139 67.5835 47.2072 67.5687C50.5188 66.8496 53.5947 65.2966 56.1345 63.0974H67.8984V66.9071C66.6522 67.3183 65.75 68.4929 65.75 69.875C65.75 71.5981 67.1519 73 68.875 73C70.5981 73 72 71.5981 72 69.875C72 68.4929 71.0978 67.3182 69.8516 66.9071V62.1208C69.8516 61.5814 69.4144 61.1442 68.875 61.1442H58.0983C58.2696 60.9484 58.4377 60.7495 58.6016 60.5467C59.8565 58.9926 60.8656 57.2614 61.605 55.4219H65.9071C66.3183 56.6681 67.4929 57.5703 68.875 57.5703C70.5981 57.5703 72 56.1685 72 54.4453C72 52.7222 70.5981 51.3203 68.875 51.3203C67.4929 51.3203 66.3183 52.2226 65.9071 53.4688H62.2761C62.7961 51.6628 63.0671 49.7811 63.0671 47.8815V42.5312ZM68.875 40.3828C69.5212 40.3828 70.0469 40.9085 70.0469 41.5547C70.0469 42.2009 69.5212 42.7266 68.875 42.7266C68.2288 42.7266 67.7031 42.2009 67.7031 41.5547C67.7031 40.9085 68.2288 40.3828 68.875 40.3828ZM68.875 24.9531C69.5212 24.9531 70.0469 25.4788 70.0469 26.125C70.0469 26.7712 69.5212 27.2969 68.875 27.2969C68.2288 27.2969 67.7031 26.7712 67.7031 26.125C67.7031 25.4788 68.2288 24.9531 68.875 24.9531ZM25.125 24.9531C25.7712 24.9531 26.2969 25.4788 26.2969 26.125C26.2969 26.7712 25.7712 27.2969 25.125 27.2969C24.4788 27.2969 23.9531 26.7712 23.9531 26.125C23.9531 25.4788 24.4788 24.9531 25.125 24.9531ZM25.125 42.7266C24.4788 42.7266 23.9531 42.2009 23.9531 41.5547C23.9531 40.9085 24.4788 40.3828 25.125 40.3828C25.7712 40.3828 26.2969 40.9085 26.2969 41.5547C26.2969 42.2009 25.7712 42.7266 25.125 42.7266ZM25.125 55.6172C24.4788 55.6172 23.9531 55.0915 23.9531 54.4453C23.9531 53.7991 24.4788 53.2734 25.125 53.2734C25.7712 53.2734 26.2969 53.7991 26.2969 54.4453C26.2969 55.0915 25.7712 55.6172 25.125 55.6172ZM25.125 71.0469C24.4788 71.0469 23.9531 70.5212 23.9531 69.875C23.9531 69.2288 24.4788 68.7031 25.125 68.7031C25.7712 68.7031 26.2969 69.2288 26.2969 69.875C26.2969 70.5212 25.7712 71.0469 25.125 71.0469ZM68.875 71.0469C68.2288 71.0469 67.7031 70.5212 67.7031 69.875C67.7031 69.2288 68.2288 68.7031 68.875 68.7031C69.5212 68.7031 70.0469 69.2288 70.0469 69.875C70.0469 70.5212 69.5212 71.0469 68.875 71.0469ZM68.875 53.2734C69.5212 53.2734 70.0469 53.7991 70.0469 54.4453C70.0469 55.0915 69.5212 55.6172 68.875 55.6172C68.2288 55.6172 67.7031 55.0915 67.7031 54.4453C67.7031 53.7991 68.2288 53.2734 68.875 53.2734ZM47 65.6138C38.6792 63.7086 32.886 56.4472 32.886 47.8815V38.0276C37.981 37.1705 42.8302 35.12 47 32.0588C51.1698 35.12 56.0189 37.1705 61.114 38.0276V47.8815C61.114 56.4472 55.3208 63.7086 47 65.6138ZM46.9999 36.7738C40.8098 36.7738 35.7738 41.8099 35.7738 48C35.7738 52.3695 38.3393 56.3741 42.3097 58.2021C42.4419 58.2631 42.5808 58.2919 42.7175 58.2919C43.0871 58.2919 43.4406 58.0812 43.6052 57.7236C43.8308 57.2336 43.6164 56.6537 43.1266 56.4281C39.8464 54.9178 37.727 51.6096 37.727 48C37.727 42.8868 41.8869 38.727 47 38.727C52.1132 38.727 56.2731 42.8868 56.2731 48C56.2731 51.6001 54.1616 54.9046 50.8936 56.4188C50.4042 56.6454 50.1914 57.226 50.4181 57.7153C50.6448 58.2048 51.2253 58.4177 51.7147 58.1908C55.6703 56.3581 58.2262 52.358 58.2262 48C58.2261 41.8099 53.1901 36.7738 46.9999 36.7738ZM43.1914 44.4886C43.1914 42.3885 44.8999 40.68 47 40.68C49.1001 40.68 50.8085 42.3885 50.8085 44.4886V45.0224C51.8864 45.0282 52.7617 45.9064 52.7617 46.9856V49.5582C52.7617 52.7352 50.177 55.3199 47 55.3199C43.8229 55.3199 41.2382 52.7352 41.2382 49.5582V46.9856C41.2382 45.9064 42.1135 45.0282 43.1914 45.0224V44.4886ZM48.8554 44.4886C48.8554 43.4655 48.0231 42.6332 47 42.6332C45.9768 42.6332 45.1445 43.4655 45.1445 44.4886V45.0219H48.8554V44.4886ZM47 53.3668C49.1001 53.3668 50.8085 51.6583 50.8085 49.5582V46.9856C50.8085 46.9798 50.8039 46.9751 50.798 46.9751H43.2019C43.196 46.9751 43.1914 46.9797 43.1914 46.9856V49.5582C43.1914 51.6583 44.8999 53.3668 47 53.3668ZM46.9999 48.543C46.4606 48.543 46.0234 48.9803 46.0234 49.5195V50.4264C46.0234 50.9656 46.4606 51.4029 46.9999 51.4029C47.5393 51.4029 47.9765 50.9656 47.9765 50.4264V49.5195C47.9765 48.9803 47.5393 48.543 46.9999 48.543ZM46.0234 58.2459C46.0234 57.7067 46.4606 57.2694 46.9999 57.2694C47.5393 57.2694 47.9765 57.7067 47.9765 58.2459C47.9765 58.7852 47.5393 59.2243 46.9999 59.2243C46.4606 59.2243 46.0234 58.7889 46.0234 58.2497V58.2459Z" fill="url(#paint0_linear)"/>
<defs>
<linearGradient id="paint0_linear" x1="18.1426" y1="78.6559" x2="76.7001" y2="23.3098" gradientUnits="userSpaceOnUse">
<stop stop-color="#00C6FF"/>
<stop offset="1" stop-color="#0072FF"/>
</linearGradient>
</defs>
</svg>
