<svg width="95" height="95" viewBox="0 0 95 95" fill="none" xmlns="http://www.w3.org/2000/svg">
<circle cx="47.5" cy="47.5" r="47.5" fill="#F4F5F7"/>
<path fill-rule="evenodd" clip-rule="evenodd" d="M68.5364 26H25.4634C23.5538 26 22 27.5538 22 29.4634V58.6859C22 60.5955 23.5538 62.1493 25.4634 62.1493H50.5799L49.8216 66.7744C49.6789 67.645 49.9668 68.4336 50.592 68.8837C51.217 69.3337 52.0557 69.3578 52.8365 68.9464L58.2554 66.0942C58.4066 66.0166 58.8232 66.0166 58.9744 66.0942L64.3932 68.9464C64.7639 69.1415 65.1479 69.2387 65.5158 69.2387C65.9227 69.2387 66.3098 69.1198 66.6379 68.8835C67.2629 68.4334 67.5509 67.6446 67.4084 66.774L66.6502 62.1491H68.5366C70.4462 62.1491 72 60.5953 72 58.6857V29.4634C71.9998 27.5536 70.446 26 68.5364 26ZM58.615 56.2129C55.2868 56.2129 52.5788 53.5049 52.5788 50.1767C52.5788 46.8485 55.2868 44.1405 58.615 44.1405C61.9432 44.1405 64.6511 46.8485 64.6511 50.1767C64.6511 53.5049 61.9432 56.2129 58.615 56.2129ZM60.3571 63.4673C59.3476 62.9358 57.8821 62.9358 56.8728 63.4673L53.0417 65.4838L54.2596 58.0546C55.5514 58.7716 57.0361 59.1813 58.6152 59.1813C60.1943 59.1813 61.6788 58.7714 62.9707 58.0546L63.4453 60.951C63.4459 60.9536 63.4464 60.9565 63.4468 60.9593L63.4478 60.9656L64.1886 65.484L60.3571 63.4673ZM69.0312 58.6859C69.0312 58.9541 68.8046 59.1807 68.5364 59.1807H66.1633L65.6213 55.8739C65.62 55.8664 65.6183 55.8591 65.6166 55.8518L65.6166 55.8517C65.6153 55.8463 65.614 55.8408 65.6129 55.8353C66.8667 54.288 67.6199 52.3188 67.6199 50.1767C67.6199 45.2114 63.5804 41.1719 58.6152 41.1719C53.6499 41.1719 49.6104 45.2114 49.6104 50.1767C49.6104 52.3188 50.3636 54.2876 51.6174 55.8353C51.6167 55.8385 51.616 55.8417 51.6153 55.8448C51.6148 55.847 51.6143 55.8492 51.6138 55.8514L51.6138 55.8514C51.612 55.8588 51.6103 55.8662 51.6091 55.8737L51.0666 59.1833C51.0597 59.183 51.0529 59.1825 51.0462 59.182C51.0366 59.1814 51.0271 59.1807 51.0173 59.1807H25.4634C25.1952 59.1807 24.9686 58.9541 24.9686 58.6859V29.4634C24.9686 29.1952 25.1952 28.9686 25.4634 28.9686H68.5364C68.8046 28.9686 69.0312 29.1952 69.0312 29.4634V58.6859ZM63.2871 34.5421H29.6429C28.823 34.5421 28.1586 35.2065 28.1586 36.0264C28.1586 36.8463 28.823 37.5107 29.6429 37.5107H63.2871C64.107 37.5107 64.7714 36.8463 64.7714 36.0264C64.7714 35.2065 64.107 34.5421 63.2871 34.5421ZM29.6429 42.5906H43.8922C44.7121 42.5906 45.3765 43.2549 45.3765 44.0749C45.3765 44.8948 44.7121 45.5592 43.8922 45.5592H29.6429C28.823 45.5592 28.1586 44.8948 28.1586 44.0749C28.1586 43.2549 28.823 42.5906 29.6429 42.5906Z" fill="url(#paint0_linear)"/>
<defs>
<linearGradient id="paint0_linear" x1="18.1426" y1="74.13" x2="68.6627" y2="18.9141" gradientUnits="userSpaceOnUse">
<stop stop-color="#00C6FF"/>
<stop offset="1" stop-color="#0072FF"/>
</linearGradient>
</defs>
</svg>
