<svg width="604" height="453" viewBox="0 0 604 453" fill="none" xmlns="http://www.w3.org/2000/svg">
<circle cx="330.5" cy="291.5" r="134.5" fill="#56CCF2"/>
<circle cx="75.5" cy="93.5" r="75.5" fill="#F2C94C"/>
<circle cx="554.5" cy="432.5" r="20.5" fill="#2036FF"/>
<rect x="509" width="95" height="95" rx="20" fill="#F200CB"/>
</svg>
