{
	"description": "项目配置文件",
	"packOptions": {
		"ignore": []
	},
	"setting": {
		"urlCheck": false,
		"es6": true,
		"enhance": false,
		"postcss": true,
		"preloadBackgroundData": false,
		"minified": true,
		"newFeature": false,
		"coverView": true,
		"nodeModules": false,
		"autoAudits": false,
		"showShadowRootInWxmlPanel": true,
		"scopeDataCheck": false,
		"uglifyFileName": false,
		"checkInvalidKey": true,
		"checkSiteMap": true,
		"uploadWithSourceMap": true,
		"compileHotReLoad": false,
		"babelSetting": {
			"ignore": [],
			"disablePlugins": [],
			"outputPath": ""
		},
		"useIsolateContext": true,
		"useCompilerModule": false,
		"userConfirmedUseCompilerModuleSwitch": false
	},
	"compileType": "miniprogram",
	"libVersion": "2.12.0",
	"appid": "wxf85606512ae21592",
	"projectname": "LineCourse",
	"debugOptions": {
		"hidedInDevtools": []
	},
	"scripts": {},
	"isGameTourist": false,
	"simulatorType": "wechat",
	"simulatorPluginLibVersion": {},
	"condition": {
		"search": {
			"current": -1,
			"list": []
		},
		"conversation": {
			"current": -1,
			"list": []
		},
		"plugin": {
			"current": -1,
			"list": []
		},
		"game": {
			"current": -1,
			"list": []
		},
		"gamePlugin": {
			"current": -1,
			"list": []
		},
		"miniprogram": {
			"current": -1,
			"list": [
				{
					"id": -1,
					"name": "测试",
					"pathName": "pages/test/index",
					"query": "",
					"scene": null
				},
				{
					"id": 1,
					"name": "授权",
					"pathName": "my/confirm/index",
					"query": "",
					"scene": null
				},
				{
					"id": 2,
					"name": "我的vip",
					"pathName": "my/vip/index",
					"query": "",
					"scene": null
				},
				{
					"id": -1,
					"name": "我的",
					"pathName": "pages/mine/index",
					"query": "",
					"scene": null
				},
				{
					"id": 4,
					"name": "搜索课程",
					"pathName": "course/searchCourse/index",
					"query": "",
					"scene": null
				},
				{
					"id": -1,
					"name": "课程",
					"pathName": "pages/course/index",
					"query": "",
					"scene": null
				},
				{
					"id": 6,
					"name": "课程详情",
					"pathName": "course/courseInfo/index",
					"query": "",
					"scene": null
				},
				{
					"id": 7,
					"name": "开通vip",
					"pathName": "my/openVip/index",
					"query": "",
					"scene": null
				},
				{
					"id": -1,
					"name": "确认订单",
					"pathName": "pages/orderConfirm/index",
					"query": "",
					"scene": null
				},
				{
					"id": 9,
					"name": "订单详情",
					"pathName": "order/orderInfo/index",
					"query": "",
					"scene": null
				},
				{
					"id": 10,
					"name": "支付结果",
					"pathName": "order/payResult/index",
					"query": "",
					"scene": null
				},
				{
					"id": -1,
					"name": "我的订单",
					"pathName": "pages/myOrder/index",
					"query": "",
					"scene": null
				},
				{
					"id": -1,
					"name": "我的vip",
					"pathName": "pages/vip/index",
					"query": "",
					"scene": null
				},
				{
					"id": 13,
					"name": "我的收藏",
					"pathName": "my/collect/index",
					"query": "",
					"scene": null
				},
				{
					"id": -1,
					"name": "报错",
					"pathName": "pages/contact/index",
					"query": "",
					"scene": null
				},
				{
					"id": -1,
					"name": "我的订单-分包",
					"pathName": "order/myOrder/index",
					"query": "",
					"scene": null
				},
				{
					"id": -1,
					"name": "我的套餐",
					"pathName": "pages/myPackage/index",
					"query": "",
					"scene": null
				},
				{
					"id": 17,
					"name": "日志",
					"pathName": "pages/logs/logs",
					"query": "",
					"scene": null
				},
				{
					"id": 18,
					"name": "我的收藏-拖拽",
					"pathName": "pages/drag/index",
					"query": "",
					"scene": null
				}
			]
		}
	}
}