%YAML 1.1
%TAG !u! tag:unity3d.com,2011:
--- !u!114 &11400000
MonoBehaviour:
  m_ObjectHideFlags: 0
  m_CorrespondingSourceObject: {fileID: 0}
  m_PrefabInstance: {fileID: 0}
  m_PrefabAsset: {fileID: 0}
  m_GameObject: {fileID: 0}
  m_Enabled: 1
  m_EditorHideFlags: 0
  m_Script: {fileID: 11500000, guid: 5a1e551922b81ce40b6579726b70c93f, type: 3}
  m_Name: dp_player
  m_EditorClassIdentifier: 
  Version: 65536
  Name: player
  DataCellMap: {fileID: 11400000, guid: dd670eae308ec6e4eb260c651a60df2b, type: 2}
  DataAnimation:
  - {fileID: 11400000, guid: 292a6f4d6ddf5de42a2b68f60740bbd8, type: 2}
  DataEffect: []
  DataSequence: []
  PrefabAnimation:
  - {fileID: 3852271573184105843, guid: cb72534a351b7d842987d1cc8180eeca, type: 3}
  PrefabEffect: []
  TableTexture:
  - {fileID: 2800000, guid: 5a943c345d482b64695a7ed3b72e80f9, type: 3}
