id,name,model_id:id,group_id:id,perm_read,perm_write,perm_create,perm_unlink
access_payroll_import_wizard,payroll.import.wizard,model_payroll_import_wizard,account.group_account_user,1,1,1,1
access_payroll_import_setup,payroll.import.setup,model_payroll_import_setup,account.group_account_user,1,1,1,1
access_payroll_custom_concept,payroll.custom.concept,model_payroll_custom_concept,account.group_account_user,1,1,1,1
access_payroll_import_mapping,payroll.import.mapping,model_payroll_import_mapping,account.group_account_user,1,1,1,1
