<?xml version="1.0" encoding="UTF-8" standalone="no"?>
<svg
   version="1.1"
   viewBox="0 0 128 128"
   id="svg21245"
   sodipodi:docname="Attendant.svg"
   inkscape:version="1.2.2 (732a01da63, 2022-12-09, custom)"
   width="128"
   height="128"
   xml:space="preserve"
   xmlns:inkscape="http://www.inkscape.org/namespaces/inkscape"
   xmlns:sodipodi="http://sodipodi.sourceforge.net/DTD/sodipodi-0.dtd"
   xmlns="http://www.w3.org/2000/svg"
   xmlns:svg="http://www.w3.org/2000/svg"><defs
     id="defs21249"><filter
       id="mask-powermask-path-effect24812_inverse"
       inkscape:label="filtermask-powermask-path-effect24812"
       style="color-interpolation-filters:sRGB"
       height="100"
       width="100"
       x="-50"
       y="-50"><feColorMatrix
         id="mask-powermask-path-effect24812_primitive1"
         values="1"
         type="saturate"
         result="fbSourceGraphic" /><feColorMatrix
         id="mask-powermask-path-effect24812_primitive2"
         values="-1 0 0 0 1 0 -1 0 0 1 0 0 -1 0 1 0 0 0 1 0 "
         in="fbSourceGraphic" /></filter><mask
       maskUnits="userSpaceOnUse"
       id="mask24818"><path
         d="m 108.57011,84.504906 c 0,15.624344 -12.666211,28.290554 -28.290554,28.290554 -15.624344,0 -28.290555,-12.66621 -28.290555,-28.290554 0,-15.624343 12.666211,-28.290555 28.290555,-28.290555 15.624343,0 28.290554,12.666212 28.290554,28.290555"
         fill="#529add"
         stroke-width="0.088408"
         id="path24820" /></mask><inkscape:path-effect
       effect="simplify"
       id="path-effect6058-3-2"
       is_visible="true"
       lpeversion="1"
       steps="1"
       threshold="0.00457143"
       smooth_angles="360"
       helper_size="0"
       simplify_individual_paths="false"
       simplify_just_coalesce="false" /><inkscape:path-effect
       effect="spiro"
       id="path-effect6060-5-6"
       is_visible="true"
       lpeversion="1" /><inkscape:path-effect
       effect="simplify"
       id="path-effect6066-62-1"
       is_visible="true"
       lpeversion="1"
       steps="1"
       threshold="0.00457143"
       smooth_angles="360"
       helper_size="0"
       simplify_individual_paths="false"
       simplify_just_coalesce="false" /><inkscape:path-effect
       effect="spiro"
       id="path-effect6068-9-8"
       is_visible="true"
       lpeversion="1" /><inkscape:path-effect
       effect="simplify"
       id="path-effect6066-6-1-7"
       is_visible="true"
       lpeversion="1"
       steps="1"
       threshold="0.00457143"
       smooth_angles="360"
       helper_size="0"
       simplify_individual_paths="false"
       simplify_just_coalesce="false" /><inkscape:path-effect
       effect="spiro"
       id="path-effect6068-7-2-9"
       is_visible="true"
       lpeversion="1" /><inkscape:path-effect
       effect="simplify"
       id="path-effect6058-2"
       is_visible="true"
       lpeversion="1"
       steps="1"
       threshold="0.00457143"
       smooth_angles="360"
       helper_size="0"
       simplify_individual_paths="false"
       simplify_just_coalesce="false" /><inkscape:path-effect
       effect="spiro"
       id="path-effect6060-0"
       is_visible="true"
       lpeversion="1" /><inkscape:path-effect
       effect="simplify"
       id="path-effect6066-2"
       is_visible="true"
       lpeversion="1"
       steps="1"
       threshold="0.00457143"
       smooth_angles="360"
       helper_size="0"
       simplify_individual_paths="false"
       simplify_just_coalesce="false" /><inkscape:path-effect
       effect="spiro"
       id="path-effect6068-3"
       is_visible="true"
       lpeversion="1" /><inkscape:path-effect
       effect="simplify"
       id="path-effect6066-6-7"
       is_visible="true"
       lpeversion="1"
       steps="1"
       threshold="0.00457143"
       smooth_angles="360"
       helper_size="0"
       simplify_individual_paths="false"
       simplify_just_coalesce="false" /><inkscape:path-effect
       effect="spiro"
       id="path-effect6068-7-5"
       is_visible="true"
       lpeversion="1" /><inkscape:path-effect
       effect="simplify"
       id="path-effect6058-3"
       is_visible="true"
       lpeversion="1"
       steps="1"
       threshold="0.00457143"
       smooth_angles="360"
       helper_size="0"
       simplify_individual_paths="false"
       simplify_just_coalesce="false" /><inkscape:path-effect
       effect="spiro"
       id="path-effect6060-5"
       is_visible="true"
       lpeversion="1" /><inkscape:path-effect
       effect="simplify"
       id="path-effect6066-62"
       is_visible="true"
       lpeversion="1"
       steps="1"
       threshold="0.00457143"
       smooth_angles="360"
       helper_size="0"
       simplify_individual_paths="false"
       simplify_just_coalesce="false" /><inkscape:path-effect
       effect="spiro"
       id="path-effect6068-9"
       is_visible="true"
       lpeversion="1" /><inkscape:path-effect
       effect="simplify"
       id="path-effect6066-6-1"
       is_visible="true"
       lpeversion="1"
       steps="1"
       threshold="0.00457143"
       smooth_angles="360"
       helper_size="0"
       simplify_individual_paths="false"
       simplify_just_coalesce="false" /><inkscape:path-effect
       effect="spiro"
       id="path-effect6068-7-2"
       is_visible="true"
       lpeversion="1" /><inkscape:path-effect
       effect="simplify"
       id="path-effect6058"
       is_visible="true"
       lpeversion="1"
       steps="1"
       threshold="0.00457143"
       smooth_angles="360"
       helper_size="0"
       simplify_individual_paths="false"
       simplify_just_coalesce="false" /><inkscape:path-effect
       effect="spiro"
       id="path-effect6060"
       is_visible="true"
       lpeversion="1" /><inkscape:path-effect
       effect="simplify"
       id="path-effect6066"
       is_visible="true"
       lpeversion="1"
       steps="1"
       threshold="0.00457143"
       smooth_angles="360"
       helper_size="0"
       simplify_individual_paths="false"
       simplify_just_coalesce="false" /><inkscape:path-effect
       effect="spiro"
       id="path-effect6068"
       is_visible="true"
       lpeversion="1" /><inkscape:path-effect
       effect="simplify"
       id="path-effect6066-6"
       is_visible="true"
       lpeversion="1"
       steps="1"
       threshold="0.00457143"
       smooth_angles="360"
       helper_size="0"
       simplify_individual_paths="false"
       simplify_just_coalesce="false" /><inkscape:path-effect
       effect="spiro"
       id="path-effect6068-7"
       is_visible="true"
       lpeversion="1" /><inkscape:path-effect
       effect="simplify"
       id="path-effect6066-6-7-7"
       is_visible="true"
       lpeversion="1"
       steps="1"
       threshold="0.00457143"
       smooth_angles="360"
       helper_size="0"
       simplify_individual_paths="false"
       simplify_just_coalesce="false" /><inkscape:path-effect
       effect="spiro"
       id="path-effect6068-7-5-6"
       is_visible="true"
       lpeversion="1" /><inkscape:path-effect
       effect="simplify"
       id="path-effect6066-2-7"
       is_visible="true"
       lpeversion="1"
       steps="1"
       threshold="0.00457143"
       smooth_angles="360"
       helper_size="0"
       simplify_individual_paths="false"
       simplify_just_coalesce="false" /><inkscape:path-effect
       effect="spiro"
       id="path-effect6068-3-3"
       is_visible="true"
       lpeversion="1" /><inkscape:path-effect
       effect="simplify"
       id="path-effect6058-39"
       is_visible="true"
       lpeversion="1"
       steps="1"
       threshold="0.00457143"
       smooth_angles="360"
       helper_size="0"
       simplify_individual_paths="false"
       simplify_just_coalesce="false" /><inkscape:path-effect
       effect="spiro"
       id="path-effect6060-4"
       is_visible="true"
       lpeversion="1" /><symbol
       id="u"
       overflow="visible"><path
         d="m18.766-1.125c-0.96875 0.5-1.9805 0.875-3.0312 1.125-1.043 0.25781-2.1367 0.39062-3.2812 0.39062-3.3984 0-6.0898-0.94531-8.0781-2.8438-1.9922-1.9062-2.9844-4.4844-2.9844-7.7344 0-3.2578 0.99219-5.8359 2.9844-7.7344 1.9883-1.9062 4.6797-2.8594 8.0781-2.8594 1.1445 0 2.2383 0.13281 3.2812 0.39062 1.0508 0.25 2.0625 0.625 3.0312 1.125v4.2188c-0.98047-0.65625-1.9453-1.1406-2.8906-1.4531-0.94922-0.3125-1.9492-0.46875-3-0.46875-1.875 0-3.3516 0.60547-4.4219 1.8125-1.0742 1.1992-1.6094 2.8555-1.6094 4.9688 0 2.1055 0.53516 3.7617 1.6094 4.9688 1.0703 1.1992 2.5469 1.7969 4.4219 1.7969 1.0508 0 2.0508-0.14844 3-0.45312 0.94531-0.3125 1.9102-0.80078 2.8906-1.4688z"
         id="path33903" /></symbol><symbol
       id="b"
       overflow="visible"><path
         d="m13.734-11.141c-0.4375-0.19531-0.87109-0.34375-1.2969-0.4375-0.41797-0.10156-0.83984-0.15625-1.2656-0.15625-1.2617 0-2.2305 0.40625-2.9062 1.2188-0.67969 0.80469-1.0156 1.9531-1.0156 3.4531v7.0625h-4.8906v-15.312h4.8906v2.5156c0.625-1 1.3438-1.7266 2.1562-2.1875 0.82031-0.46875 1.8008-0.70312 2.9375-0.70312 0.16406 0 0.34375 0.011719 0.53125 0.03125 0.19531 0.011719 0.47656 0.039062 0.84375 0.078125z"
         id="path33906" /></symbol><symbol
       id="a"
       overflow="visible"><path
         d="m17.641-7.7031v1.4062h-11.453c0.125 1.1484 0.53906 2.0078 1.25 2.5781 0.70703 0.57422 1.7031 0.85938 2.9844 0.85938 1.0312 0 2.082-0.14844 3.1562-0.45312 1.082-0.3125 2.1914-0.77344 3.3281-1.3906v3.7656c-1.1562 0.4375-2.3125 0.76562-3.4688 0.98438-1.1562 0.22656-2.3125 0.34375-3.4688 0.34375-2.7734 0-4.9297-0.70312-6.4688-2.1094-1.5312-1.4062-2.2969-3.3789-2.2969-5.9219 0-2.5 0.75391-4.4609 2.2656-5.8906 1.5078-1.4375 3.582-2.1562 6.2188-2.1562 2.4062 0 4.332 0.73047 5.7812 2.1875 1.4453 1.4492 2.1719 3.3828 2.1719 5.7969zm-5.0312-1.625c0-0.92578-0.27344-1.6719-0.8125-2.2344-0.54297-0.57031-1.25-0.85938-2.125-0.85938-0.94922 0-1.7188 0.26562-2.3125 0.79688s-0.96484 1.2969-1.1094 2.2969z"
         id="path33909" /></symbol><symbol
       id="d"
       overflow="visible"><path
         d="m9.2188-6.8906c-1.0234 0-1.793 0.17188-2.3125 0.51562-0.51172 0.34375-0.76562 0.85547-0.76562 1.5312 0 0.625 0.20703 1.1172 0.625 1.4688 0.41406 0.34375 0.98828 0.51562 1.7188 0.51562 0.92578 0 1.7031-0.32812 2.3281-0.98438 0.63281-0.66406 0.95312-1.4922 0.95312-2.4844v-0.5625zm7.4688-1.8438v8.7344h-4.9219v-2.2656c-0.65625 0.92969-1.3984 1.6055-2.2188 2.0312-0.82422 0.41406-1.8242 0.625-3 0.625-1.5859 0-2.8711-0.45703-3.8594-1.375-0.99219-0.92578-1.4844-2.1289-1.4844-3.6094 0-1.7891 0.61328-3.1016 1.8438-3.9375 1.2383-0.84375 3.1797-1.2656 5.8281-1.2656h2.8906v-0.39062c0-0.76953-0.30859-1.332-0.92188-1.6875-0.61719-0.36328-1.5703-0.54688-2.8594-0.54688-1.0547 0-2.0312 0.10547-2.9375 0.3125-0.89844 0.21094-1.7305 0.52344-2.5 0.9375v-3.7344c1.0391-0.25 2.0859-0.44141 3.1406-0.57812 1.0625-0.13281 2.125-0.20312 3.1875-0.20312 2.7578 0 4.75 0.54688 5.9688 1.6406 1.2266 1.0859 1.8438 2.8555 1.8438 5.3125z"
         id="path33912" /></symbol><symbol
       id="c"
       overflow="visible"><path
         d="m7.7031-19.656v4.3438h5.0469v3.5h-5.0469v6.5c0 0.71094 0.14062 1.1875 0.42188 1.4375s0.83594 0.375 1.6719 0.375h2.5156v3.5h-4.1875c-1.9375 0-3.3125-0.39844-4.125-1.2031-0.80469-0.8125-1.2031-2.1797-1.2031-4.1094v-6.5h-2.4219v-3.5h2.4219v-4.3438z"
         id="path33915" /></symbol><symbol
       id="k"
       overflow="visible"><path
         d="m12.766-13.078v-8.2031h4.9219v21.281h-4.9219v-2.2188c-0.66797 0.90625-1.4062 1.5703-2.2188 1.9844s-1.7578 0.625-2.8281 0.625c-1.8867 0-3.4336-0.75-4.6406-2.25-1.2109-1.5-1.8125-3.4258-1.8125-5.7812 0-2.3633 0.60156-4.2969 1.8125-5.7969 1.207-1.5 2.7539-2.25 4.6406-2.25 1.0625 0 2 0.21484 2.8125 0.64062 0.82031 0.42969 1.5664 1.0859 2.2344 1.9688zm-3.2188 9.9219c1.0391 0 1.8359-0.37891 2.3906-1.1406 0.55078-0.76953 0.82812-1.8828 0.82812-3.3438 0-1.457-0.27734-2.5664-0.82812-3.3281-0.55469-0.76953-1.3516-1.1562-2.3906-1.1562-1.043 0-1.8398 0.38672-2.3906 1.1562-0.55469 0.76172-0.82812 1.8711-0.82812 3.3281 0 1.4609 0.27344 2.5742 0.82812 3.3438 0.55078 0.76172 1.3477 1.1406 2.3906 1.1406z"
         id="path33918" /></symbol><symbol
       id="g"
       overflow="visible"><path
         d="m10.5-3.1562c1.0508 0 1.8516-0.37891 2.4062-1.1406 0.55078-0.76953 0.82812-1.8828 0.82812-3.3438 0-1.457-0.27734-2.5664-0.82812-3.3281-0.55469-0.76953-1.3555-1.1562-2.4062-1.1562-1.0547 0-1.8594 0.38672-2.4219 1.1562-0.55469 0.77344-0.82812 1.8828-0.82812 3.3281 0 1.4492 0.27344 2.5586 0.82812 3.3281 0.5625 0.77344 1.3672 1.1562 2.4219 1.1562zm-3.25-9.9219c0.67578-0.88281 1.4219-1.5391 2.2344-1.9688 0.82031-0.42578 1.7656-0.64062 2.8281-0.64062 1.8945 0 3.4453 0.75 4.6562 2.25 1.207 1.5 1.8125 3.4336 1.8125 5.7969 0 2.3555-0.60547 4.2812-1.8125 5.7812-1.2109 1.5-2.7617 2.25-4.6562 2.25-1.0625 0-2.0078-0.21094-2.8281-0.625-0.8125-0.42578-1.5586-1.0859-2.2344-1.9844v2.2188h-4.8906v-21.281h4.8906z"
         id="path33921" /></symbol><symbol
       id="f"
       overflow="visible"><path
         d="m0.34375-15.312h4.8906l4.125 10.391 3.5-10.391h4.8906l-6.4375 16.766c-0.64844 1.6953-1.4023 2.8828-2.2656 3.5625-0.86719 0.6875-2 1.0312-3.4062 1.0312h-2.8438v-3.2188h1.5312c0.83203 0 1.4375-0.13672 1.8125-0.40625 0.38281-0.26172 0.67969-0.73047 0.89062-1.4062l0.14062-0.42188z"
         id="path33924" /></symbol><symbol
       id="j"
       overflow="visible"><path
         d="m14.953-3.7188h-8.2188l-1.3125 3.7188h-5.2812l7.5625-20.406h6.2656l7.5625 20.406h-5.2812zm-6.9062-3.7812h5.5781l-2.7812-8.125z"
         id="path33927" /></symbol><symbol
       id="i"
       overflow="visible"><path
         d="m2.1875-5.9688v-9.3438h4.9219v1.5312c0 0.83594-0.007813 1.875-0.015625 3.125-0.011719 1.25-0.015625 2.0859-0.015625 2.5 0 1.2422 0.03125 2.1328 0.09375 2.6719 0.070313 0.54297 0.17969 0.93359 0.32812 1.1719 0.20703 0.32422 0.47266 0.57422 0.79688 0.75 0.32031 0.16797 0.69141 0.25 1.1094 0.25 1.0195 0 1.8203-0.39062 2.4062-1.1719 0.58203-0.78125 0.875-1.8672 0.875-3.2656v-7.5625h4.8906v15.312h-4.8906v-2.2188c-0.74219 0.89844-1.5234 1.5586-2.3438 1.9844-0.82422 0.41406-1.7344 0.625-2.7344 0.625-1.7617 0-3.1055-0.53906-4.0312-1.625-0.92969-1.082-1.3906-2.6602-1.3906-4.7344z"
         id="path33930" /></symbol><symbol
       id="t"
       overflow="visible"><path
         d="m2.5781-20.406h5.25v20.406h-5.25z"
         id="path33933" /></symbol><symbol
       id="s"
       overflow="visible"><path
         d="m0.98438-15.312h4.7656l2.5625 10.547 2.5781-10.547h4.0938l2.5781 10.438 2.5781-10.438h4.75l-4.0312 15.312h-5.3438l-2.5781-10.531-2.5781 10.531h-5.3438z"
         id="path33936" /></symbol><symbol
       id="h"
       overflow="visible"><path
         d="m17.75-9.3281v9.3281h-4.9219v-7.1406c0-1.3203-0.03125-2.2344-0.09375-2.7344s-0.16797-0.86719-0.3125-1.1094c-0.1875-0.3125-0.44922-0.55469-0.78125-0.73438-0.32422-0.17578-0.69531-0.26562-1.1094-0.26562-1.0234 0-1.8242 0.39844-2.4062 1.1875-0.58594 0.78125-0.875 1.8711-0.875 3.2656v7.5312h-4.8906v-15.312h4.8906v2.2344c0.73828-0.88281 1.5195-1.5391 2.3438-1.9688 0.83203-0.42578 1.75-0.64062 2.75-0.64062 1.7695 0 3.1133 0.54688 4.0312 1.6406 0.91406 1.0859 1.375 2.6562 1.375 4.7188z"
         id="path33939" /></symbol><symbol
       id="r"
       overflow="visible"><path
         d="m12.422-21.281v3.2188h-2.7031c-0.6875 0-1.1719 0.125-1.4531 0.375-0.27344 0.25-0.40625 0.6875-0.40625 1.3125v1.0625h4.1875v3.5h-4.1875v11.812h-4.8906v-11.812h-2.4375v-3.5h2.4375v-1.0625c0-1.6641 0.46094-2.8984 1.3906-3.7031 0.92578-0.80078 2.3672-1.2031 4.3281-1.2031z"
         id="path33942" /></symbol><symbol
       id="e"
       overflow="visible"><path
         d="m9.6406-12.188c-1.0859 0-1.9141 0.39062-2.4844 1.1719-0.57422 0.78125-0.85938 1.9062-0.85938 3.375s0.28516 2.5938 0.85938 3.375c0.57031 0.77344 1.3984 1.1562 2.4844 1.1562 1.0625 0 1.875-0.38281 2.4375-1.1562 0.57031-0.78125 0.85938-1.9062 0.85938-3.375s-0.28906-2.5938-0.85938-3.375c-0.5625-0.78125-1.375-1.1719-2.4375-1.1719zm0-3.5c2.6328 0 4.6914 0.71484 6.1719 2.1406 1.4766 1.418 2.2188 3.3867 2.2188 5.9062 0 2.5117-0.74219 4.4805-2.2188 5.9062-1.4805 1.418-3.5391 2.125-6.1719 2.125-2.6484 0-4.7148-0.70703-6.2031-2.125-1.4922-1.4258-2.2344-3.3945-2.2344-5.9062 0-2.5195 0.74219-4.4883 2.2344-5.9062 1.4883-1.4258 3.5547-2.1406 6.2031-2.1406z"
         id="path33945" /></symbol><symbol
       id="q"
       overflow="visible"><path
         d="m16.547-12.766c0.61328-0.94531 1.3477-1.6719 2.2031-2.1719 0.85156-0.5 1.7891-0.75 2.8125-0.75 1.7578 0 3.0977 0.54688 4.0156 1.6406 0.92578 1.0859 1.3906 2.6562 1.3906 4.7188v9.3281h-4.9219v-7.9844-0.35938c0.007813-0.13281 0.015625-0.32031 0.015625-0.5625 0-1.082-0.16406-1.8633-0.48438-2.3438-0.3125-0.48828-0.82422-0.73438-1.5312-0.73438-0.92969 0-1.6484 0.38672-2.1562 1.1562-0.51172 0.76172-0.77344 1.8672-0.78125 3.3125v7.5156h-4.9219v-7.9844c0-1.6953-0.14844-2.7852-0.4375-3.2656-0.29297-0.48828-0.8125-0.73438-1.5625-0.73438-0.9375 0-1.6641 0.38672-2.1719 1.1562-0.51172 0.76172-0.76562 1.8594-0.76562 3.2969v7.5312h-4.9219v-15.312h4.9219v2.2344c0.60156-0.86328 1.2891-1.5156 2.0625-1.9531 0.78125-0.4375 1.6406-0.65625 2.5781-0.65625 1.0625 0 2 0.25781 2.8125 0.76562 0.8125 0.51172 1.4258 1.2305 1.8438 2.1562z"
         id="path33948" /></symbol><symbol
       id="p"
       overflow="visible"><path
         d="m17.75-9.3281v9.3281h-4.9219v-7.1094c0-1.3438-0.03125-2.2656-0.09375-2.7656s-0.16797-0.86719-0.3125-1.1094c-0.1875-0.3125-0.44922-0.55469-0.78125-0.73438-0.32422-0.17578-0.69531-0.26562-1.1094-0.26562-1.0234 0-1.8242 0.39844-2.4062 1.1875-0.58594 0.78125-0.875 1.8711-0.875 3.2656v7.5312h-4.8906v-21.281h4.8906v8.2031c0.73828-0.88281 1.5195-1.5391 2.3438-1.9688 0.83203-0.42578 1.75-0.64062 2.75-0.64062 1.7695 0 3.1133 0.54688 4.0312 1.6406 0.91406 1.0859 1.375 2.6562 1.375 4.7188z"
         id="path33951" /></symbol><symbol
       id="o"
       overflow="visible"><path
         d="m2.5781-20.406h5.875l7.4219 14v-14h4.9844v20.406h-5.875l-7.4219-14v14h-4.9844z"
         id="path33954" /></symbol><symbol
       id="n"
       overflow="visible"><path
         d="m2.5781-20.406h8.7344c2.5938 0 4.582 0.57812 5.9688 1.7344 1.3945 1.1484 2.0938 2.7891 2.0938 4.9219 0 2.1367-0.69922 3.7812-2.0938 4.9375-1.3867 1.1562-3.375 1.7344-5.9688 1.7344h-3.4844v7.0781h-5.25zm5.25 3.8125v5.7031h2.9219c1.0195 0 1.8047-0.25 2.3594-0.75 0.5625-0.5 0.84375-1.2031 0.84375-2.1094 0-0.91406-0.28125-1.6172-0.84375-2.1094-0.55469-0.48828-1.3398-0.73438-2.3594-0.73438z"
         id="path33957" /></symbol><symbol
       id="m"
       overflow="visible"><path
         d="m2.3594-15.312h4.8906v15.031c0 2.0508-0.49609 3.6172-1.4844 4.7031-0.98047 1.082-2.4062 1.625-4.2812 1.625h-2.4219v-3.2188h0.85938c0.92578 0 1.5625-0.21094 1.9062-0.625 0.35156-0.41797 0.53125-1.2461 0.53125-2.4844zm0-5.9688h4.8906v4h-4.8906z"
         id="path33960" /></symbol><symbol
       id="l"
       overflow="visible"><path
         d="m14.719-14.828v3.9844c-0.65625-0.45703-1.3242-0.79688-2-1.0156-0.66797-0.21875-1.3594-0.32812-2.0781-0.32812-1.3672 0-2.4336 0.40234-3.2031 1.2031-0.76172 0.79297-1.1406 1.9062-1.1406 3.3438 0 1.4297 0.37891 2.543 1.1406 3.3438 0.76953 0.79297 1.8359 1.1875 3.2031 1.1875 0.75781 0 1.4844-0.10938 2.1719-0.32812 0.6875-0.22656 1.3203-0.56641 1.9062-1.0156v4c-0.76172 0.28125-1.5391 0.48828-2.3281 0.625-0.78125 0.14453-1.5742 0.21875-2.375 0.21875-2.7617 0-4.9219-0.70703-6.4844-2.125-1.5547-1.4141-2.3281-3.3828-2.3281-5.9062 0-2.5312 0.77344-4.5039 2.3281-5.9219 1.5625-1.4141 3.7227-2.125 6.4844-2.125 0.80078 0 1.5938 0.074219 2.375 0.21875 0.78125 0.13672 1.5547 0.35156 2.3281 0.64062z"
         id="path33963" /></symbol></defs><sodipodi:namedview
     id="namedview21247"
     pagecolor="#ffffff"
     bordercolor="#000000"
     borderopacity="0.25"
     inkscape:showpageshadow="2"
     inkscape:pageopacity="0.0"
     inkscape:pagecheckerboard="true"
     inkscape:deskcolor="#d1d1d1"
     showgrid="false"
     inkscape:zoom="5.0666044"
     inkscape:cx="46.875576"
     inkscape:cy="54.178297"
     inkscape:window-width="1846"
     inkscape:window-height="1016"
     inkscape:window-x="74"
     inkscape:window-y="27"
     inkscape:window-maximized="1"
     inkscape:current-layer="g34048"
     showguides="true" /><path
     d="M 128,64 C 128,99.346 99.346,128 64,128 28.654,128 0,99.346 0,64 0,28.654 28.654,0 64,0 c 35.346,0 64,28.654 64,64"
     fill="#529add"
     stroke-width="0.2"
     id="path21231" /><path
     d="M 128,64 C 128,99.346 99.346,128 64,128 28.654,128 0,99.346 0,64 0,28.654 28.654,0 64,0 c 35.346,0 64,28.654 64,64"
     fill="#529add"
     stroke-width="0.2"
     id="path21231-5" /><path
     d="M 128,64 C 128,99.346 99.346,128 64,128 28.654,128 0,99.346 0,64 0,28.654 28.654,0 64,0 c 35.346,0 64,28.654 64,64"
     fill="#529add"
     stroke-width="0.2"
     id="path21231-5-9" /><g
     aria-label="MAX"
     id="text46545"
     style="font-size:27.1454px;font-family:'DIN Alternate Medium';-inkscape-font-specification:'DIN Alternate Medium, ';fill:#ffffff;stroke:#ae153b;stroke-width:21.3191;stroke-linecap:round;stroke-linejoin:round" /><g
     id="g34048"
     transform="matrix(1.3333333,0,0,1.3333333,-887.05349,-870.25644)"><g
       id="g36090-5"
       transform="matrix(0.02437976,0,0,0.02437976,688.0132,687.62288)"
       style="fill:#427bb1;fill-opacity:1"><path
         d="M 840,300 C 840,432.55 732.55,540 600,540 467.45,540 360,432.55 360,300 360,167.45 467.45,60 600,60 732.55,60 840,167.45 840,300"
         id="path36078-5"
         style="fill:#427bb1;fill-opacity:1" /><path
         d="m 612,756 c 0,6.6289 -5.3711,12 -12,12 -6.6289,0 -12,-5.3711 -12,-12 0,-6.6289 5.3711,-12 12,-12 6.6289,0 12,5.3711 12,12"
         id="path36080-4"
         style="fill:#427bb1;fill-opacity:1" /><path
         d="m 612,876 c 0,6.6289 -5.3711,12 -12,12 -6.6289,0 -12,-5.3711 -12,-12 0,-6.6289 5.3711,-12 12,-12 6.6289,0 12,5.3711 12,12"
         id="path36082-7"
         style="fill:#427bb1;fill-opacity:1" /><path
         d="m 612,996 c 0,6.6289 -5.3711,12 -12,12 -6.6289,0 -12,-5.3711 -12,-12 0,-6.6289 5.3711,-12 12,-12 6.6289,0 12,5.3711 12,12"
         id="path36084-6"
         style="fill:#427bb1;fill-opacity:1" /><path
         d="m 728.09,576 -107.83,43.379 c -6.3477,-5.6875 -14.652,-9.2539 -23.844,-9.2539 -9.1914,0 -17.496,3.5625 -23.844,9.2539 L 464.732,576 v 139.95 l 110.04,-41.555 c 6.0234,4.5977 13.465,7.4414 21.637,7.4414 8.172,0 15.613,-2.832 21.637,-7.4414 l 110.04,41.555 z"
         id="path36086-5"
         style="fill:#427bb1;fill-opacity:1" /><path
         d="M 1036.8,1140 H 155.98 V 817.34 c 0,-132.07 107.06,-239.14 239.14,-239.14 21.938,189.68 91.691,357.27 204.6,503.7 113,-154.6 180.25,-322.27 199.34,-503.7 131.3,0 237.74,106.44 237.74,237.74 z"
         id="path36088-6"
         style="fill:#427bb1;fill-opacity:1" /></g><g
       id="g36090"
       transform="matrix(0.02437976,0,0,0.02437976,688.0132,685.04947)"
       style="fill:#ffffff;fill-opacity:1"><path
         d="M 840,300 C 840,432.55 732.55,540 600,540 467.45,540 360,432.55 360,300 360,167.45 467.45,60 600,60 732.55,60 840,167.45 840,300"
         id="path36078"
         style="fill:#ffffff;fill-opacity:1" /><path
         d="m 612,756 c 0,6.6289 -5.3711,12 -12,12 -6.6289,0 -12,-5.3711 -12,-12 0,-6.6289 5.3711,-12 12,-12 6.6289,0 12,5.3711 12,12"
         id="path36080"
         style="fill:#ffffff;fill-opacity:1" /><path
         d="m 612,876 c 0,6.6289 -5.3711,12 -12,12 -6.6289,0 -12,-5.3711 -12,-12 0,-6.6289 5.3711,-12 12,-12 6.6289,0 12,5.3711 12,12"
         id="path36082"
         style="fill:#ffffff;fill-opacity:1" /><path
         d="m 612,996 c 0,6.6289 -5.3711,12 -12,12 -6.6289,0 -12,-5.3711 -12,-12 0,-6.6289 5.3711,-12 12,-12 6.6289,0 12,5.3711 12,12"
         id="path36084"
         style="fill:#ffffff;fill-opacity:1" /><path
         d="m 728.09,576 -107.83,43.379 c -6.3477,-5.6875 -14.652,-9.2539 -23.844,-9.2539 -9.1914,0 -17.496,3.5625 -23.844,9.2539 L 464.732,576 v 139.95 l 110.04,-41.555 c 6.0234,4.5977 13.465,7.4414 21.637,7.4414 8.172,0 15.613,-2.832 21.637,-7.4414 l 110.04,41.555 z"
         id="path36086"
         style="fill:#ffffff;fill-opacity:1" /><path
         d="M 1036.8,1140 H 155.98 V 817.34 c 0,-132.07 107.06,-239.14 239.14,-239.14 21.938,189.68 91.691,357.27 204.6,503.7 113,-154.6 180.25,-322.27 199.34,-503.7 131.3,0 237.74,106.44 237.74,237.74 z"
         id="path36088"
         style="fill:#ffffff;fill-opacity:1" /></g><g
       id="g38756"
       transform="matrix(1.1034577,0,0,1.1034577,-71.355854,-70.803903)"><path
         d="M 731.05615,674.6632 H 690.0985 c -3.14614,0 -5.74049,2.59436 -5.74049,5.7405 v 40.95765 c 0,3.14654 2.59435,5.7405 5.74049,5.7405 h 40.95765 c 3.14654,0 5.7405,-2.59435 5.7405,-5.7405 l 3.9e-4,-40.95765 c 0,-3.14614 -2.59435,-5.7405 -5.74049,-5.7405 z m 2.20776,46.69835 c 0,1.21438 -0.99338,2.20776 -2.20776,2.20776 H 690.0985 c -1.21437,0 -2.20776,-0.99338 -2.20776,-2.20776 V 680.4039 c 0,-1.21438 0.99339,-2.20776 2.20776,-2.20776 h 40.95765 c 1.21438,0 2.20776,0.99338 2.20776,2.20776 z"
         id="path36088-8-8"
         style="fill:#000000;fill-opacity:0.2;stroke-width:0.0985696" /><path
         d="M 731.05615,672.11984 H 690.0985 c -3.14614,0 -5.74049,2.59436 -5.74049,5.7405 v 40.95765 c 0,3.14654 2.59435,5.7405 5.74049,5.7405 h 40.95765 c 3.14654,0 5.7405,-2.59435 5.7405,-5.7405 l 3.9e-4,-40.95765 c 0,-3.14614 -2.59435,-5.7405 -5.74049,-5.7405 z m 2.20776,46.69835 c 0,1.21438 -0.99338,2.20776 -2.20776,2.20776 H 690.0985 c -1.21437,0 -2.20776,-0.99338 -2.20776,-2.20776 v -40.95765 c 0,-1.21438 0.99339,-2.20776 2.20776,-2.20776 h 40.95765 c 1.21438,0 2.20776,0.99338 2.20776,2.20776 z"
         id="path36088-8"
         style="fill:#ffffff;fill-opacity:1;stroke-width:0.0985696" /></g><g
       id="g38744"
       transform="matrix(0.08846205,0,0,0.08846205,686.2143,675.7068)"
       style="fill:#ffffff;fill-opacity:1"><path
         d="m 720.67874,687.35897 c -0.4967,-0.77276 -1.65607,-0.77276 -2.09766,0 l -6.01659,9.88062 c -0.4967,0.82783 0.11051,1.87667 1.04888,1.87667 h 12.03338 c 0.93833,0 1.54557,-1.04888 1.04888,-1.87667 z"
         id="path36094-9-1"
         style="fill:#000000;fill-opacity:0.2;stroke-width:0.0985696"
         transform="matrix(10.145114,0,0,10.145114,-6858.8878,-6804.7322)" /><path
         d="m 725.64665,702.64909 h -12.03338 c -0.93833,0 -1.54557,1.04888 -1.04888,1.87667 l 6.01659,9.88062 c 0.49671,0.77276 1.65607,0.77276 2.09766,0 l 6.01659,-9.88062 c 0.49671,-0.82821 -0.1105,-1.87667 -1.04888,-1.87667 z"
         id="path36096-6-1"
         style="fill:#000000;fill-opacity:0.2;stroke-width:0.0985696"
         transform="matrix(10.145114,0,0,10.145114,-6858.8878,-6804.7322)" /><path
         d="m 452.48,142.8 c -5.0391,-7.8398 -16.801,-7.8398 -21.281,0 L 370.16,243.04 c -5.0391,8.3984 1.1211,19.039 10.641,19.039 h 122.08 c 9.5195,0 15.68,-10.641 10.641,-19.039 z"
         id="path36094-9"
         style="fill:#ffffff;fill-opacity:1" /><path
         d="M 502.88,297.92 H 380.8 c -9.5195,0 -15.68,10.641 -10.641,19.039 l 61.039,100.24 c 5.0391,7.8398 16.801,7.8398 21.281,0 l 61.039,-100.24 c 5.0391,-8.4023 -1.1211,-19.039 -10.641,-19.039 z"
         id="path36096-6"
         style="fill:#ffffff;fill-opacity:1" /></g></g></svg>
