<?xml version="1.0" encoding="UTF-8" standalone="no"?>
<svg
   version="1.1"
   viewBox="0 0 128 128"
   id="svg21245"
   sodipodi:docname="InternalWidth.svg"
   inkscape:version="1.2.2 (732a01da63, 2022-12-09, custom)"
   width="128"
   height="128"
   xmlns:inkscape="http://www.inkscape.org/namespaces/inkscape"
   xmlns:sodipodi="http://sodipodi.sourceforge.net/DTD/sodipodi-0.dtd"
   xmlns="http://www.w3.org/2000/svg"
   xmlns:svg="http://www.w3.org/2000/svg">
  <defs
     id="defs21249">
    <filter
       id="mask-powermask-path-effect24812_inverse"
       inkscape:label="filtermask-powermask-path-effect24812"
       style="color-interpolation-filters:sRGB"
       height="100"
       width="100"
       x="-50"
       y="-50">
      <feColorMatrix
         id="mask-powermask-path-effect24812_primitive1"
         values="1"
         type="saturate"
         result="fbSourceGraphic" />
      <feColorMatrix
         id="mask-powermask-path-effect24812_primitive2"
         values="-1 0 0 0 1 0 -1 0 0 1 0 0 -1 0 1 0 0 0 1 0 "
         in="fbSourceGraphic" />
    </filter>
    <mask
       maskUnits="userSpaceOnUse"
       id="mask24818">
      <path
         d="m 108.57011,84.504906 c 0,15.624344 -12.666211,28.290554 -28.290554,28.290554 -15.624344,0 -28.290555,-12.66621 -28.290555,-28.290554 0,-15.624343 12.666211,-28.290555 28.290555,-28.290555 15.624343,0 28.290554,12.666212 28.290554,28.290555"
         fill="#529add"
         stroke-width="0.088408"
         id="path24820" />
    </mask>
    <inkscape:path-effect
       effect="simplify"
       id="path-effect6058-3-2"
       is_visible="true"
       lpeversion="1"
       steps="1"
       threshold="0.00457143"
       smooth_angles="360"
       helper_size="0"
       simplify_individual_paths="false"
       simplify_just_coalesce="false" />
    <inkscape:path-effect
       effect="spiro"
       id="path-effect6060-5-6"
       is_visible="true"
       lpeversion="1" />
    <inkscape:path-effect
       effect="simplify"
       id="path-effect6066-62-1"
       is_visible="true"
       lpeversion="1"
       steps="1"
       threshold="0.00457143"
       smooth_angles="360"
       helper_size="0"
       simplify_individual_paths="false"
       simplify_just_coalesce="false" />
    <inkscape:path-effect
       effect="spiro"
       id="path-effect6068-9-8"
       is_visible="true"
       lpeversion="1" />
    <inkscape:path-effect
       effect="simplify"
       id="path-effect6066-6-1-7"
       is_visible="true"
       lpeversion="1"
       steps="1"
       threshold="0.00457143"
       smooth_angles="360"
       helper_size="0"
       simplify_individual_paths="false"
       simplify_just_coalesce="false" />
    <inkscape:path-effect
       effect="spiro"
       id="path-effect6068-7-2-9"
       is_visible="true"
       lpeversion="1" />
    <inkscape:path-effect
       effect="simplify"
       id="path-effect6058-2"
       is_visible="true"
       lpeversion="1"
       steps="1"
       threshold="0.00457143"
       smooth_angles="360"
       helper_size="0"
       simplify_individual_paths="false"
       simplify_just_coalesce="false" />
    <inkscape:path-effect
       effect="spiro"
       id="path-effect6060-0"
       is_visible="true"
       lpeversion="1" />
    <inkscape:path-effect
       effect="simplify"
       id="path-effect6066-2"
       is_visible="true"
       lpeversion="1"
       steps="1"
       threshold="0.00457143"
       smooth_angles="360"
       helper_size="0"
       simplify_individual_paths="false"
       simplify_just_coalesce="false" />
    <inkscape:path-effect
       effect="spiro"
       id="path-effect6068-3"
       is_visible="true"
       lpeversion="1" />
    <inkscape:path-effect
       effect="simplify"
       id="path-effect6066-6-7"
       is_visible="true"
       lpeversion="1"
       steps="1"
       threshold="0.00457143"
       smooth_angles="360"
       helper_size="0"
       simplify_individual_paths="false"
       simplify_just_coalesce="false" />
    <inkscape:path-effect
       effect="spiro"
       id="path-effect6068-7-5"
       is_visible="true"
       lpeversion="1" />
    <inkscape:path-effect
       effect="simplify"
       id="path-effect6058-3"
       is_visible="true"
       lpeversion="1"
       steps="1"
       threshold="0.00457143"
       smooth_angles="360"
       helper_size="0"
       simplify_individual_paths="false"
       simplify_just_coalesce="false" />
    <inkscape:path-effect
       effect="spiro"
       id="path-effect6060-5"
       is_visible="true"
       lpeversion="1" />
    <inkscape:path-effect
       effect="simplify"
       id="path-effect6066-62"
       is_visible="true"
       lpeversion="1"
       steps="1"
       threshold="0.00457143"
       smooth_angles="360"
       helper_size="0"
       simplify_individual_paths="false"
       simplify_just_coalesce="false" />
    <inkscape:path-effect
       effect="spiro"
       id="path-effect6068-9"
       is_visible="true"
       lpeversion="1" />
    <inkscape:path-effect
       effect="simplify"
       id="path-effect6066-6-1"
       is_visible="true"
       lpeversion="1"
       steps="1"
       threshold="0.00457143"
       smooth_angles="360"
       helper_size="0"
       simplify_individual_paths="false"
       simplify_just_coalesce="false" />
    <inkscape:path-effect
       effect="spiro"
       id="path-effect6068-7-2"
       is_visible="true"
       lpeversion="1" />
    <inkscape:path-effect
       effect="simplify"
       id="path-effect6058"
       is_visible="true"
       lpeversion="1"
       steps="1"
       threshold="0.00457143"
       smooth_angles="360"
       helper_size="0"
       simplify_individual_paths="false"
       simplify_just_coalesce="false" />
    <inkscape:path-effect
       effect="spiro"
       id="path-effect6060"
       is_visible="true"
       lpeversion="1" />
    <inkscape:path-effect
       effect="simplify"
       id="path-effect6066"
       is_visible="true"
       lpeversion="1"
       steps="1"
       threshold="0.00457143"
       smooth_angles="360"
       helper_size="0"
       simplify_individual_paths="false"
       simplify_just_coalesce="false" />
    <inkscape:path-effect
       effect="spiro"
       id="path-effect6068"
       is_visible="true"
       lpeversion="1" />
    <inkscape:path-effect
       effect="simplify"
       id="path-effect6066-6"
       is_visible="true"
       lpeversion="1"
       steps="1"
       threshold="0.00457143"
       smooth_angles="360"
       helper_size="0"
       simplify_individual_paths="false"
       simplify_just_coalesce="false" />
    <inkscape:path-effect
       effect="spiro"
       id="path-effect6068-7"
       is_visible="true"
       lpeversion="1" />
    <inkscape:path-effect
       effect="simplify"
       id="path-effect6066-6-7-7"
       is_visible="true"
       lpeversion="1"
       steps="1"
       threshold="0.00457143"
       smooth_angles="360"
       helper_size="0"
       simplify_individual_paths="false"
       simplify_just_coalesce="false" />
    <inkscape:path-effect
       effect="spiro"
       id="path-effect6068-7-5-6"
       is_visible="true"
       lpeversion="1" />
    <inkscape:path-effect
       effect="simplify"
       id="path-effect6066-2-7"
       is_visible="true"
       lpeversion="1"
       steps="1"
       threshold="0.00457143"
       smooth_angles="360"
       helper_size="0"
       simplify_individual_paths="false"
       simplify_just_coalesce="false" />
    <inkscape:path-effect
       effect="spiro"
       id="path-effect6068-3-3"
       is_visible="true"
       lpeversion="1" />
    <inkscape:path-effect
       effect="simplify"
       id="path-effect6058-39"
       is_visible="true"
       lpeversion="1"
       steps="1"
       threshold="0.00457143"
       smooth_angles="360"
       helper_size="0"
       simplify_individual_paths="false"
       simplify_just_coalesce="false" />
    <inkscape:path-effect
       effect="spiro"
       id="path-effect6060-4"
       is_visible="true"
       lpeversion="1" />
  </defs>
  <sodipodi:namedview
     id="namedview21247"
     pagecolor="#ffffff"
     bordercolor="#000000"
     borderopacity="0.25"
     inkscape:showpageshadow="2"
     inkscape:pageopacity="0.0"
     inkscape:pagecheckerboard="0"
     inkscape:deskcolor="#d1d1d1"
     showgrid="false"
     inkscape:zoom="2.6892115"
     inkscape:cx="65.446693"
     inkscape:cy="-67.491902"
     inkscape:window-width="2486"
     inkscape:window-height="1376"
     inkscape:window-x="74"
     inkscape:window-y="27"
     inkscape:window-maximized="1"
     inkscape:current-layer="svg21245"
     showguides="true" />
  <path
     d="M 128,64 C 128,99.346 99.346,128 64,128 28.654,128 0,99.346 0,64 0,28.654 28.654,0 64,0 c 35.346,0 64,28.654 64,64"
     fill="#529add"
     stroke-width="0.2"
     id="path21231" />
  <g
     id="g24766"
     transform="matrix(2.0068344,-0.14556213,0.14556213,2.0068344,-77.056041,-6.7119908)">
    <g
       fill="none"
       stroke-width="7.7795"
       id="g21237"
       transform="matrix(1.1243138,0,0,1.1243138,-19.248832,-22.791638)">
      <g
         id="g31437"
         transform="rotate(-85.66964,74.245754,67.112468)">
        <g
           id="g32185"
           transform="matrix(2.1027376,0,0,2.1027376,-72.108229,-71.606109)">
          <g
             id="g32241"
             transform="translate(1.3143837,0.34131099)">
            <path
               style="fill:none;fill-opacity:0.207843;stroke:#000000;stroke-width:2.80447;stroke-linecap:round;stroke-dasharray:none;stroke-opacity:0.2"
               d="m 73.288319,58.082433 -4.14074,3.562905"
               id="path6064-9"
               inkscape:path-effect="#path-effect6066-62;#path-effect6068-9"
               inkscape:original-d="m 73.288319,58.082433 -4.14074,3.562905"
               sodipodi:nodetypes="cc" />
            <path
               style="fill:none;fill-opacity:0.207843;stroke:#000000;stroke-width:2.80447;stroke-linecap:round;stroke-linejoin:round;stroke-dasharray:none;stroke-opacity:0.2"
               d="m 73.950238,58.743658 3.282681,3.002491"
               id="path6064-5-3"
               inkscape:path-effect="#path-effect6066-6-1;#path-effect6068-7-2"
               inkscape:original-d="m 73.950238,58.743658 3.282681,3.002491"
               sodipodi:nodetypes="cc" />
            <g
               id="g29044-6"
               transform="translate(0,1.1103762)"
               style="fill:#427bb1;fill-opacity:1;stroke:#427bb1;stroke-opacity:1">
              <path
                 style="fill:#427bb1;fill-opacity:1;stroke:#427bb1;stroke-width:2.80447;stroke-linecap:round;stroke-linejoin:round;stroke-dasharray:none;stroke-opacity:1"
                 d="m 73.204185,73.925125 -4.004184,-3.43875"
                 id="path6064-5-2-5"
                 inkscape:path-effect="#path-effect6066-6-7-7;#path-effect6068-7-5-6"
                 inkscape:original-d="m 73.204185,73.925125 -4.004184,-3.43875"
                 sodipodi:nodetypes="cc" />
              <path
                 style="fill:#427bb1;fill-opacity:1;stroke:#427bb1;stroke-width:2.80447;stroke-linecap:round;stroke-dasharray:none;stroke-opacity:1"
                 d="m 74.074801,73.477506 3.114846,-2.978132"
                 id="path6064-1-6"
                 inkscape:path-effect="#path-effect6066-2-7;#path-effect6068-3-3"
                 inkscape:original-d="m 74.074801,73.477506 3.114846,-2.978132"
                 sodipodi:nodetypes="cc" />
            </g>
            <g
               id="g6701"
               transform="matrix(0.01763109,-0.07062279,0.07062279,0.01763109,47.823511,96.056459)">
              <g
                 id="g6508"
                 transform="rotate(-15,-417.36918,-2355.4362)">
                <path
                   style="fill:#000000;fill-opacity:0.207843;stroke:#427bb1;stroke-width:38.528;stroke-linecap:round;stroke-dasharray:none;stroke-opacity:1"
                   d="m -298.14528,385.10479 166.68674,2.38629"
                   id="path6056-8"
                   inkscape:path-effect="#path-effect6058-39;#path-effect6060-4"
                   inkscape:original-d="m -298.14528,385.10479 166.68674,2.38629"
                   sodipodi:nodetypes="cc" />
                <path
                   style="fill:#000000;fill-opacity:0.207843;stroke:#ffffff;stroke-width:38.528;stroke-linecap:round;stroke-dasharray:none;stroke-opacity:1"
                   d="m -275.14493,396.91287 166.68674,2.38629"
                   id="path6056"
                   inkscape:path-effect="#path-effect6058;#path-effect6060"
                   inkscape:original-d="m -275.14493,396.91287 166.68674,2.38629"
                   sodipodi:nodetypes="cc" />
                <path
                   style="fill:none;fill-opacity:0.207843;stroke:#fdfdfd;stroke-width:38.528;stroke-linecap:round;stroke-dasharray:none;stroke-opacity:1"
                   d="M -108.45819,399.29916 -156.3572,340.01727"
                   id="path6064"
                   inkscape:path-effect="#path-effect6066;#path-effect6068"
                   inkscape:original-d="M -108.45819,399.29916 -156.3572,340.01727"
                   sodipodi:nodetypes="cc" />
                <path
                   style="fill:none;fill-opacity:0.207843;stroke:#fdfdfd;stroke-width:38.528;stroke-linecap:round;stroke-linejoin:round;stroke-dasharray:none;stroke-opacity:1"
                   d="m -108.45819,399.29916 -51.20135,53.47929"
                   id="path6064-5"
                   inkscape:path-effect="#path-effect6066-6;#path-effect6068-7"
                   inkscape:original-d="m -108.45819,399.29916 -51.20135,53.47929"
                   sodipodi:nodetypes="cc" />
              </g>
            </g>
            <g
               id="g29044">
              <path
                 style="fill:none;fill-opacity:0.207843;stroke:#fdfdfd;stroke-width:2.80447;stroke-linecap:round;stroke-linejoin:round;stroke-dasharray:none;stroke-opacity:1"
                 d="m 74.271083,75.032116 -4.25228,-3.440599"
                 id="path6064-5-2"
                 inkscape:path-effect="#path-effect6066-6-7;#path-effect6068-7-5"
                 inkscape:original-d="m 74.271083,75.032116 -4.25228,-3.440599"
                 sodipodi:nodetypes="cc" />
              <path
                 style="fill:none;fill-opacity:0.207843;stroke:#fdfdfd;stroke-width:2.80447;stroke-linecap:round;stroke-dasharray:none;stroke-opacity:1"
                 d="m 74.271083,75.032116 3.934895,-3.42559"
                 id="path6064-1"
                 inkscape:path-effect="#path-effect6066-2;#path-effect6068-3"
                 inkscape:original-d="m 74.271083,75.032116 3.934895,-3.42559"
                 sodipodi:nodetypes="cc" />
            </g>
            <path
               style="fill:#000000;fill-opacity:0.207843;stroke:#ffffff;stroke-width:2.80447;stroke-linecap:round;stroke-dasharray:none;stroke-opacity:1"
               d="m 74.236698,62.897737 0.03439,12.134379"
               id="path6056-6"
               inkscape:path-effect="#path-effect6058-2;#path-effect6060-0"
               inkscape:original-d="m 74.236698,62.897737 0.03439,12.134379"
               sodipodi:nodetypes="cc" />
          </g>
        </g>
      </g>
    </g>
  </g>
</svg>
