<?xml version="1.0" encoding="UTF-8" standalone="no"?>
<svg
   version="1.1"
   viewBox="0 0 128 128"
   id="svg21245"
   sodipodi:docname="StairFlightCount.svg"
   inkscape:version="1.2.2 (732a01da63, 2022-12-09, custom)"
   xmlns:inkscape="http://www.inkscape.org/namespaces/inkscape"
   xmlns:sodipodi="http://sodipodi.sourceforge.net/DTD/sodipodi-0.dtd"
   xmlns="http://www.w3.org/2000/svg"
   xmlns:svg="http://www.w3.org/2000/svg">
  <defs
     id="defs21249" />
  <sodipodi:namedview
     id="namedview21247"
     pagecolor="#ffffff"
     bordercolor="#000000"
     borderopacity="0.25"
     inkscape:showpageshadow="2"
     inkscape:pageopacity="0.0"
     inkscape:pagecheckerboard="0"
     inkscape:deskcolor="#d1d1d1"
     showgrid="false"
     inkscape:zoom="2.0034261"
     inkscape:cx="-29.948697"
     inkscape:cy="43.176038"
     inkscape:window-width="2486"
     inkscape:window-height="1376"
     inkscape:window-x="74"
     inkscape:window-y="27"
     inkscape:window-maximized="1"
     inkscape:current-layer="svg21245" />
  <path
     d="m128 64c0 35.346-28.654 64-64 64s-64-28.654-64-64 28.654-64 64-64 64 28.654 64 64"
     fill="#529add"
     stroke-width=".2"
     id="path21231" />
  <g
     fill="none"
     stroke-width="7.7795"
     id="g21237"
     transform="matrix(1.1243138,0,0,1.1243138,-19.248832,-34.061797)">
    <path
       d="m 39.989,117.02 v -15.13 h 24 V 86.76 h 24 V 71.63 h 24"
       stroke="#000000"
       stroke-opacity="0.2"
       id="path21233" />
    <path
       d="M 39.989,113.24 V 98.11 h 24 V 82.98 h 24 V 67.85 h 24"
       stroke="#ffffff"
       id="path21235" />
  </g>
</svg>
