<?xml version="1.0" encoding="UTF-8" standalone="no"?>
<svg
   version="1.1"
   viewBox="0 0 128 128"
   id="svg13683"
   sodipodi:docname="assistance_guichet.svg"
   inkscape:version="1.2.2 (732a01da63, 2022-12-09, custom)"
   xml:space="preserve"
   xmlns:inkscape="http://www.inkscape.org/namespaces/inkscape"
   xmlns:sodipodi="http://sodipodi.sourceforge.net/DTD/sodipodi-0.dtd"
   xmlns="http://www.w3.org/2000/svg"
   xmlns:svg="http://www.w3.org/2000/svg"><defs
     id="defs13687" /><sodipodi:namedview
     id="namedview13685"
     pagecolor="#ffffff"
     bordercolor="#000000"
     borderopacity="0.25"
     inkscape:showpageshadow="2"
     inkscape:pageopacity="0.0"
     inkscape:pagecheckerboard="true"
     inkscape:deskcolor="#d1d1d1"
     showgrid="false"
     inkscape:zoom="2.5098531"
     inkscape:cx="142.63783"
     inkscape:cy="81.478872"
     inkscape:window-width="1846"
     inkscape:window-height="1016"
     inkscape:window-x="74"
     inkscape:window-y="27"
     inkscape:window-maximized="1"
     inkscape:current-layer="g39472" /><g
     id="g39472"
     transform="translate(151.40752,99.92358)"><path
       d="m -115.01352,-74.209434 h 54.962 c 4.6854,0 8.4574,3.7836 8.4574,8.4833 v 63.1410002 c 0,4.6998 -3.772,8.4833 -8.4574,8.4833 h -54.962 c -4.6854,0 -8.4574,-3.7836 -8.4574,-8.4833 V -65.726134 c 0,-4.6997 3.772,-8.4833 8.4574,-8.4833 z"
       fill="none"
       stroke="#000000"
       stroke-opacity="0.2"
       stroke-width="7.9985"
       id="path80664" /><path
       d="m -114.88852,-78.104434 h 54.962 c 4.6854,0 8.4574,3.7836 8.4574,8.4833 v 63.1410002 c 0,4.6998 -3.772,8.4833 -8.4574,8.4833 h -54.962 c -4.6854,0 -8.4574,-3.7836 -8.4574,-8.4833 V -69.621134 c 0,-4.6998 3.772,-8.4833 8.4574,-8.4833 z"
       fill="#495aad"
       stroke="#ffffff"
       stroke-opacity="0.98995"
       stroke-width="7.9985"
       id="path80666"
       style="stroke:#495aad;stroke-opacity:1" /><path
       d="m -72.91652,-10.103434 h -26.554 v -5.0634 c 2.8533,-0.06904 4.7994,-0.83839 5.1377,-3.6843 v -9.2885 c -0.29822,-3.4533 -3.1186,-4.253 -5.9828,-4.7659 v -7.6593 l 21.754,-0.87883 0.50702,0.50702 v 21.646 c 0.08448,2.3549 1.5679,3.137 3.4477,3.7857 0.54081,0.15774 1.1042,0.27041 1.69,0.33801 z"
       fill="#ffffff"
       id="path80668" /><path
       d="m -76.73952,-56.885434 a 9.9245,9.9245 0 0 1 -9.9245,9.9246 9.9245,9.9245 0 0 1 -9.9246,-9.9246 9.9245,9.9245 0 0 1 9.9246,-9.9245 9.9245,9.9245 0 0 1 9.9245,9.9245"
       fill="#ffffff"
       id="path80670" /></g></svg>
