<?xml version="1.0" encoding="UTF-8" standalone="no"?>
<svg
   version="1.1"
   viewBox="0 0 128 128"
   id="svg13683"
   sodipodi:docname="ticket.svg"
   inkscape:version="1.2.2 (732a01da63, 2022-12-09, custom)"
   xmlns:inkscape="http://www.inkscape.org/namespaces/inkscape"
   xmlns:sodipodi="http://sodipodi.sourceforge.net/DTD/sodipodi-0.dtd"
   xmlns="http://www.w3.org/2000/svg"
   xmlns:svg="http://www.w3.org/2000/svg"
   xmlns:i="http://ns.adobe.com/AdobeIllustrator/10.0/">
  <defs
     id="defs13687" />
  <sodipodi:namedview
     id="namedview13685"
     pagecolor="#ffffff"
     bordercolor="#000000"
     borderopacity="0.25"
     inkscape:showpageshadow="2"
     inkscape:pageopacity="0.0"
     inkscape:pagecheckerboard="0"
     inkscape:deskcolor="#d1d1d1"
     showgrid="false"
     inkscape:zoom="5.0495618"
     inkscape:cx="74.659944"
     inkscape:cy="66.243372"
     inkscape:window-width="1846"
     inkscape:window-height="1016"
     inkscape:window-x="74"
     inkscape:window-y="27"
     inkscape:window-maximized="1"
     inkscape:current-layer="svg13683" />
  <path
     d="m128 64c0 35.346-28.654 64-64 64s-64-28.654-64-64 28.654-64 64-64 64 28.654 64 64"
     fill="#529add"
     id="path13663"
     style="fill:#e9a76f;fill-opacity:1" />
  <switch
     id="switch25761-3"
     transform="translate(962.55,-934.1743)"
     style="fill:#000000;fill-opacity:0.2">
    <foreignObject
       requiredExtensions="http://ns.adobe.com/AdobeIllustrator/10.0/"
       x="0"
       y="0"
       width="1"
       height="1" />
    <g
       i:extraneous="self"
       id="g25759-6"
       style="fill:#000000;fill-opacity:0.2">
      <path
         d="m -853.3,982.8 -5.9,-5.9 c -0.8,-0.8 -2.2,-1 -3.2,-0.4 -3.5,2.2 -7.9,1.7 -10.8,-1.2 -2.9,-2.9 -3.4,-7.4 -1.2,-10.8 0.6,-1 0.5,-2.3 -0.4,-3.2 l -5.9,-5.9 c -2.4,-2.4 -6.4,-2.4 -8.8,0 l -15,15 6.2,6.2 -3.6,3.6 -6.2,-6.2 -36.5,36.5 c -2.4,2.4 -2.4,6.4 0,8.8 l 5.9,5.9 c 0.8,0.8 2.1,1 3.1,0.4 3.4,-2.1 7.8,-1.5 10.7,1.3 2.8,2.8 3.4,7.2 1.3,10.7 -0.6,1 -0.5,2.3 0.4,3.1 l 6,6 c 1.2,1.2 2.8,1.8 4.4,1.8 1.6,0 3.2,-0.6 4.4,-1.8 l 36.5,-36.5 -6.2,-6.2 3.6,-3.6 6.2,6.2 15,-15 c 2.4,-2.4 2.4,-6.4 0,-8.8 z m -45.2,0.9 3.6,-3.6 6.7,6.7 -3.6,3.6 z m 16.8,16.8 -6.7,-6.7 3.6,-3.6 6.7,6.7 z"
         id="path25757-7"
         style="fill:#000000;fill-opacity:0.2" />
    </g>
  </switch>
  <switch
     id="switch25761"
     transform="translate(962.95,-938.41491)"
     style="fill:#ffffff;fill-opacity:1">
    <foreignObject
       requiredExtensions="http://ns.adobe.com/AdobeIllustrator/10.0/"
       x="0"
       y="0"
       width="1"
       height="1" />
    <g
       i:extraneous="self"
       id="g25759"
       style="fill:#ffffff;fill-opacity:1">
      <path
         d="m -853.3,982.8 -5.9,-5.9 c -0.8,-0.8 -2.2,-1 -3.2,-0.4 -3.5,2.2 -7.9,1.7 -10.8,-1.2 -2.9,-2.9 -3.4,-7.4 -1.2,-10.8 0.6,-1 0.5,-2.3 -0.4,-3.2 l -5.9,-5.9 c -2.4,-2.4 -6.4,-2.4 -8.8,0 l -15,15 6.2,6.2 -3.6,3.6 -6.2,-6.2 -36.5,36.5 c -2.4,2.4 -2.4,6.4 0,8.8 l 5.9,5.9 c 0.8,0.8 2.1,1 3.1,0.4 3.4,-2.1 7.8,-1.5 10.7,1.3 2.8,2.8 3.4,7.2 1.3,10.7 -0.6,1 -0.5,2.3 0.4,3.1 l 6,6 c 1.2,1.2 2.8,1.8 4.4,1.8 1.6,0 3.2,-0.6 4.4,-1.8 l 36.5,-36.5 -6.2,-6.2 3.6,-3.6 6.2,6.2 15,-15 c 2.4,-2.4 2.4,-6.4 0,-8.8 z m -45.2,0.9 3.6,-3.6 6.7,6.7 -3.6,3.6 z m 16.8,16.8 -6.7,-6.7 3.6,-3.6 6.7,6.7 z"
         id="path25757"
         style="fill:#ffffff;fill-opacity:1" />
    </g>
  </switch>
</svg>
