<?xml version="1.0" encoding="UTF-8" standalone="no"?>
<!-- Created with Inkscape (http://www.inkscape.org/) -->

<svg
   xmlns:dc="http://purl.org/dc/elements/1.1/"
   xmlns:cc="http://creativecommons.org/ns#"
   xmlns:rdf="http://www.w3.org/1999/02/22-rdf-syntax-ns#"
   xmlns:svg="http://www.w3.org/2000/svg"
   xmlns="http://www.w3.org/2000/svg"
   xmlns:sodipodi="http://sodipodi.sourceforge.net/DTD/sodipodi-0.dtd"
   xmlns:inkscape="http://www.inkscape.org/namespaces/inkscape"
   width="125"
   height="125"
   viewBox="0 0 33.072915 33.072915"
   version="1.1"
   id="svg8"
   sodipodi:docname="launcher.svg"
   inkscape:version="0.92.5 (2060ec1f9f, 2020-04-08)">
  <defs
     id="defs2" />
  <sodipodi:namedview
     id="base"
     pagecolor="#ffffff"
     bordercolor="#666666"
     borderopacity="1.0"
     inkscape:pageopacity="0.0"
     inkscape:pageshadow="2"
     inkscape:zoom="1.979899"
     inkscape:cx="-88.393192"
     inkscape:cy="92.609902"
     inkscape:document-units="px"
     inkscape:current-layer="g916"
     showgrid="true"
     inkscape:window-width="1920"
     inkscape:window-height="1029"
     inkscape:window-x="1920"
     inkscape:window-y="27"
     inkscape:window-maximized="1"
     units="px"
     fit-margin-top="0"
     fit-margin-left="0"
     fit-margin-right="0"
     fit-margin-bottom="0">
    <inkscape:grid
       type="xygrid"
       id="grid979" />
  </sodipodi:namedview>
  <metadata
     id="metadata5">
    <rdf:RDF>
      <cc:Work
         rdf:about="">
        <dc:format>image/svg+xml</dc:format>
        <dc:type
           rdf:resource="http://purl.org/dc/dcmitype/StillImage" />
        <dc:title></dc:title>
      </cc:Work>
    </rdf:RDF>
  </metadata>
  <g
     inkscape:label="Layer 1"
     inkscape:groupmode="layer"
     id="layer1"
     transform="translate(-162.56278,-69.744154)">
    <g
       id="g916"
       transform="matrix(0.26458333,0,0,0.26458333,44.857695,71.861068)">
      <polyline
         transform="translate(3.3696273,-46.000939)"
         id="polyline16"
         points="470.5,151 470.5,51.2 523.5,51.2 "
         class="st1"
         style="fill:#ffffff;stroke:#1a578b;stroke-width:6;stroke-miterlimit:10;fill-opacity:0"
         inkscape:export-xdpi="350"
         inkscape:export-ydpi="350" />
      <polygon
         transform="translate(3.3696273,-46.000939)"
         id="polygon18"
         points="540.8,51.9 540.8,148.9 498.7,160.4 498.7,41.8 "
         class="st2"
         style="fill:#1a578b"
         inkscape:export-xdpi="350"
         inkscape:export-ydpi="350" />
      <circle
         id="circle20"
         r="3.3"
         cy="59.59906"
         cx="509.16962"
         class="st3"
         style="fill:#ffffff"
         inkscape:export-xdpi="350"
         inkscape:export-ydpi="350" />
    </g>
  </g>
  <style
     id="style10"
     type="text/css">
	.st0{fill:#FFFFFF;stroke:#1A578B;stroke-width:4;stroke-miterlimit:10;}
	.st1{fill:#FFFFFF;stroke:#1A578B;stroke-width:6;stroke-miterlimit:10;}
	.st2{fill:#1A578B;}
	.st3{fill:#FFFFFF;}
	.st4{fill:#010202;}
	.st5{fill:#293173;}
	.st6{fill:#E10814;}
	.st7{fill:#9D9D9C;}
</style>
</svg>
