<?xml version="1.0" encoding="UTF-8" standalone="no"?>
<svg
   version="1.1"
   viewBox="0 0 128 128"
   id="svg21245"
   sodipodi:docname="RaisedButtons.svg"
   inkscape:version="1.2.2 (732a01da63, 2022-12-09, custom)"
   width="128"
   height="128"
   xml:space="preserve"
   xmlns:inkscape="http://www.inkscape.org/namespaces/inkscape"
   xmlns:sodipodi="http://sodipodi.sourceforge.net/DTD/sodipodi-0.dtd"
   xmlns="http://www.w3.org/2000/svg"
   xmlns:svg="http://www.w3.org/2000/svg"><defs
     id="defs21249"><filter
       id="mask-powermask-path-effect24812_inverse"
       inkscape:label="filtermask-powermask-path-effect24812"
       style="color-interpolation-filters:sRGB"
       height="100"
       width="100"
       x="-50"
       y="-50"><feColorMatrix
         id="mask-powermask-path-effect24812_primitive1"
         values="1"
         type="saturate"
         result="fbSourceGraphic" /><feColorMatrix
         id="mask-powermask-path-effect24812_primitive2"
         values="-1 0 0 0 1 0 -1 0 0 1 0 0 -1 0 1 0 0 0 1 0 "
         in="fbSourceGraphic" /></filter><mask
       maskUnits="userSpaceOnUse"
       id="mask24818"><path
         d="m 108.57011,84.504906 c 0,15.624344 -12.666211,28.290554 -28.290554,28.290554 -15.624344,0 -28.290555,-12.66621 -28.290555,-28.290554 0,-15.624343 12.666211,-28.290555 28.290555,-28.290555 15.624343,0 28.290554,12.666212 28.290554,28.290555"
         fill="#529add"
         stroke-width="0.088408"
         id="path24820" /></mask><inkscape:path-effect
       effect="simplify"
       id="path-effect6058-3-2"
       is_visible="true"
       lpeversion="1"
       steps="1"
       threshold="0.00457143"
       smooth_angles="360"
       helper_size="0"
       simplify_individual_paths="false"
       simplify_just_coalesce="false" /><inkscape:path-effect
       effect="spiro"
       id="path-effect6060-5-6"
       is_visible="true"
       lpeversion="1" /><inkscape:path-effect
       effect="simplify"
       id="path-effect6066-62-1"
       is_visible="true"
       lpeversion="1"
       steps="1"
       threshold="0.00457143"
       smooth_angles="360"
       helper_size="0"
       simplify_individual_paths="false"
       simplify_just_coalesce="false" /><inkscape:path-effect
       effect="spiro"
       id="path-effect6068-9-8"
       is_visible="true"
       lpeversion="1" /><inkscape:path-effect
       effect="simplify"
       id="path-effect6066-6-1-7"
       is_visible="true"
       lpeversion="1"
       steps="1"
       threshold="0.00457143"
       smooth_angles="360"
       helper_size="0"
       simplify_individual_paths="false"
       simplify_just_coalesce="false" /><inkscape:path-effect
       effect="spiro"
       id="path-effect6068-7-2-9"
       is_visible="true"
       lpeversion="1" /><inkscape:path-effect
       effect="simplify"
       id="path-effect6058-2"
       is_visible="true"
       lpeversion="1"
       steps="1"
       threshold="0.00457143"
       smooth_angles="360"
       helper_size="0"
       simplify_individual_paths="false"
       simplify_just_coalesce="false" /><inkscape:path-effect
       effect="spiro"
       id="path-effect6060-0"
       is_visible="true"
       lpeversion="1" /><inkscape:path-effect
       effect="simplify"
       id="path-effect6066-2"
       is_visible="true"
       lpeversion="1"
       steps="1"
       threshold="0.00457143"
       smooth_angles="360"
       helper_size="0"
       simplify_individual_paths="false"
       simplify_just_coalesce="false" /><inkscape:path-effect
       effect="spiro"
       id="path-effect6068-3"
       is_visible="true"
       lpeversion="1" /><inkscape:path-effect
       effect="simplify"
       id="path-effect6066-6-7"
       is_visible="true"
       lpeversion="1"
       steps="1"
       threshold="0.00457143"
       smooth_angles="360"
       helper_size="0"
       simplify_individual_paths="false"
       simplify_just_coalesce="false" /><inkscape:path-effect
       effect="spiro"
       id="path-effect6068-7-5"
       is_visible="true"
       lpeversion="1" /><inkscape:path-effect
       effect="simplify"
       id="path-effect6058-3"
       is_visible="true"
       lpeversion="1"
       steps="1"
       threshold="0.00457143"
       smooth_angles="360"
       helper_size="0"
       simplify_individual_paths="false"
       simplify_just_coalesce="false" /><inkscape:path-effect
       effect="spiro"
       id="path-effect6060-5"
       is_visible="true"
       lpeversion="1" /><inkscape:path-effect
       effect="simplify"
       id="path-effect6066-62"
       is_visible="true"
       lpeversion="1"
       steps="1"
       threshold="0.00457143"
       smooth_angles="360"
       helper_size="0"
       simplify_individual_paths="false"
       simplify_just_coalesce="false" /><inkscape:path-effect
       effect="spiro"
       id="path-effect6068-9"
       is_visible="true"
       lpeversion="1" /><inkscape:path-effect
       effect="simplify"
       id="path-effect6066-6-1"
       is_visible="true"
       lpeversion="1"
       steps="1"
       threshold="0.00457143"
       smooth_angles="360"
       helper_size="0"
       simplify_individual_paths="false"
       simplify_just_coalesce="false" /><inkscape:path-effect
       effect="spiro"
       id="path-effect6068-7-2"
       is_visible="true"
       lpeversion="1" /><inkscape:path-effect
       effect="simplify"
       id="path-effect6058"
       is_visible="true"
       lpeversion="1"
       steps="1"
       threshold="0.00457143"
       smooth_angles="360"
       helper_size="0"
       simplify_individual_paths="false"
       simplify_just_coalesce="false" /><inkscape:path-effect
       effect="spiro"
       id="path-effect6060"
       is_visible="true"
       lpeversion="1" /><inkscape:path-effect
       effect="simplify"
       id="path-effect6066"
       is_visible="true"
       lpeversion="1"
       steps="1"
       threshold="0.00457143"
       smooth_angles="360"
       helper_size="0"
       simplify_individual_paths="false"
       simplify_just_coalesce="false" /><inkscape:path-effect
       effect="spiro"
       id="path-effect6068"
       is_visible="true"
       lpeversion="1" /><inkscape:path-effect
       effect="simplify"
       id="path-effect6066-6"
       is_visible="true"
       lpeversion="1"
       steps="1"
       threshold="0.00457143"
       smooth_angles="360"
       helper_size="0"
       simplify_individual_paths="false"
       simplify_just_coalesce="false" /><inkscape:path-effect
       effect="spiro"
       id="path-effect6068-7"
       is_visible="true"
       lpeversion="1" /><inkscape:path-effect
       effect="simplify"
       id="path-effect6066-6-7-7"
       is_visible="true"
       lpeversion="1"
       steps="1"
       threshold="0.00457143"
       smooth_angles="360"
       helper_size="0"
       simplify_individual_paths="false"
       simplify_just_coalesce="false" /><inkscape:path-effect
       effect="spiro"
       id="path-effect6068-7-5-6"
       is_visible="true"
       lpeversion="1" /><inkscape:path-effect
       effect="simplify"
       id="path-effect6066-2-7"
       is_visible="true"
       lpeversion="1"
       steps="1"
       threshold="0.00457143"
       smooth_angles="360"
       helper_size="0"
       simplify_individual_paths="false"
       simplify_just_coalesce="false" /><inkscape:path-effect
       effect="spiro"
       id="path-effect6068-3-3"
       is_visible="true"
       lpeversion="1" /><inkscape:path-effect
       effect="simplify"
       id="path-effect6058-39"
       is_visible="true"
       lpeversion="1"
       steps="1"
       threshold="0.00457143"
       smooth_angles="360"
       helper_size="0"
       simplify_individual_paths="false"
       simplify_just_coalesce="false" /><inkscape:path-effect
       effect="spiro"
       id="path-effect6060-4"
       is_visible="true"
       lpeversion="1" /></defs><sodipodi:namedview
     id="namedview21247"
     pagecolor="#ffffff"
     bordercolor="#000000"
     borderopacity="0.25"
     inkscape:showpageshadow="2"
     inkscape:pageopacity="0.0"
     inkscape:pagecheckerboard="true"
     inkscape:deskcolor="#d1d1d1"
     showgrid="false"
     inkscape:zoom="2.62854"
     inkscape:cx="21.685042"
     inkscape:cy="80.843357"
     inkscape:window-width="2486"
     inkscape:window-height="1376"
     inkscape:window-x="74"
     inkscape:window-y="27"
     inkscape:window-maximized="1"
     inkscape:current-layer="svg21245"
     showguides="true" /><path
     d="M 128,64 C 128,99.346 99.346,128 64,128 28.654,128 0,99.346 0,64 0,28.654 28.654,0 64,0 c 35.346,0 64,28.654 64,64"
     fill="#529add"
     stroke-width="0.2"
     id="path21231" /><path
     d="M 128,64 C 128,99.346 99.346,128 64,128 28.654,128 0,99.346 0,64 0,28.654 28.654,0 64,0 c 35.346,0 64,28.654 64,64"
     fill="#529add"
     stroke-width="0.2"
     id="path21231-5" /><path
     d="M 128,64 C 128,99.346 99.346,128 64,128 28.654,128 0,99.346 0,64 0,28.654 28.654,0 64,0 c 35.346,0 64,28.654 64,64"
     fill="#529add"
     stroke-width="0.2"
     id="path21231-5-9" /><g
     aria-label="MAX"
     id="text46545"
     style="font-size:27.1454px;font-family:'DIN Alternate Medium';-inkscape-font-specification:'DIN Alternate Medium, ';fill:#ffffff;stroke:#ae153b;stroke-width:21.3191;stroke-linecap:round;stroke-linejoin:round" /><path
     d="m 52.383346,128 h 22.110077 c 0.624157,0 1.222542,-0.24795 1.663644,-0.68909 0.441147,-0.44115 0.689095,-1.03954 0.689095,-1.6631 v -6.36979 c 0.02362,-2.14451 0.755638,-4.22101 2.082823,-5.905 2.427942,-3.09497 3.756222,-6.91027 3.77546,-10.84359 l 0.0036,-12.528267 v -5.44e-4 c 0.06549,-1.203232 -0.374071,-2.379038 -1.212887,-3.244723 -0.838296,-0.865664 -2.000253,-1.341692 -3.205024,-1.313787 h -0.110555 c -2.382881,0 -4.295618,1.658841 -4.304135,3.708964 v -3.598917 c 0,-2.048477 -1.911083,-3.708965 -4.267584,-3.708421 h -0.125585 c -2.459547,0 -4.436168,1.717372 -4.436168,3.836188 l -0.0021,-3.452457 c -0.04559,-1.019153 -0.464756,-1.985688 -1.177467,-2.715089 -0.71324,-0.729344 -1.670106,-1.169952 -2.687606,-1.238645 -2.68226,-0.280691 -4.962093,1.530101 -4.962093,3.805548 l -5.84e-4,-18.080451 c -0.0029,-1.871377 -1.002521,-3.600013 -2.623315,-4.53495 -1.621331,-0.93543 -3.618291,-0.93543 -5.239623,0 -1.621331,0.934894 -2.621111,2.663573 -2.623315,4.53495 v 26.854149 c 0,0 -2.784334,0.01718 -3.832473,1.195717 -2.304018,2.592125 -6.234049,8.864775 -5.07489,12.097275 2.160721,6.02425 8.184833,11.72096 11.327619,14.84904 0.959585,0.95529 1.880587,1.94173 1.880587,3.29515 v 3.35752 l 5.15e-4,0.001 c 0,0.62363 0.247948,1.22201 0.689093,1.6631 0.441138,0.44115 1.039538,0.68909 1.663094,0.68909 z"
     id="path9647"
     style="fill:#ffffff;fill-opacity:1;stroke-width:0.137389" /><g
     id="g12006"
     transform="matrix(0.1246765,0,0,0.1246765,20.56358,10.238878)"
     style="fill:#ffffff;fill-opacity:1"><path
       d="m 149.36,150.53 c 0,22.359 -18.125,40.484 -40.484,40.484 -22.359,0 -40.48,-18.125 -40.48,-40.484 0,-22.355 18.121,-40.48 40.48,-40.48 22.359,0 40.484,18.125 40.484,40.48"
       id="path11411"
       style="fill:#ffffff;fill-opacity:1" /><path
       d="m 286.22,150.53 c 0,22.359 -18.125,40.484 -40.484,40.484 -22.355,0 -40.48,-18.125 -40.48,-40.484 0,-22.355 18.125,-40.48 40.48,-40.48 22.359,0 40.484,18.125 40.484,40.48"
       id="path11413"
       style="fill:#ffffff;fill-opacity:1" /><path
       d="m 286.22,287.39 c 0,22.359 -18.125,40.484 -40.484,40.484 -22.355,0 -40.48,-18.125 -40.48,-40.484 0,-22.355 18.125,-40.48 40.48,-40.48 22.359,0 40.484,18.125 40.484,40.48"
       id="path11415"
       style="fill:#ffffff;fill-opacity:1" /><path
       d="m 149.36,424.26 c 0,22.359 -18.125,40.48 -40.484,40.48 -22.359,0 -40.48,-18.121 -40.48,-40.48 0,-22.359 18.121,-40.484 40.48,-40.484 22.359,0 40.484,18.125 40.484,40.484"
       id="path11417"
       style="fill:#ffffff;fill-opacity:1" /><path
       d="m 491.52,150.53 c 0,22.359 -18.125,40.484 -40.484,40.484 -22.355,0 -40.48,-18.125 -40.48,-40.484 0,-22.355 18.125,-40.48 40.48,-40.48 22.359,0 40.484,18.125 40.484,40.48"
       id="path11419"
       style="fill:#ffffff;fill-opacity:1" /><path
       d="m 628.39,150.53 c 0,22.359 -18.125,40.484 -40.484,40.484 -22.359,0 -40.48,-18.125 -40.48,-40.484 0,-22.355 18.121,-40.48 40.48,-40.48 22.359,0 40.484,18.125 40.484,40.48"
       id="path11421"
       style="fill:#ffffff;fill-opacity:1" /><path
       d="m 491.52,287.39 c 0,22.359 -18.125,40.484 -40.484,40.484 -22.355,0 -40.48,-18.125 -40.48,-40.484 0,-22.355 18.125,-40.48 40.48,-40.48 22.359,0 40.484,18.125 40.484,40.48"
       id="path11423"
       style="fill:#ffffff;fill-opacity:1" /><path
       d="m 628.39,287.39 c 0,22.359 -18.125,40.484 -40.484,40.484 -22.359,0 -40.48,-18.125 -40.48,-40.484 0,-22.355 18.121,-40.48 40.48,-40.48 22.359,0 40.484,18.125 40.484,40.48"
       id="path11425"
       style="fill:#ffffff;fill-opacity:1" /><path
       d="m 491.52,424.26 c 0,22.359 -18.125,40.48 -40.484,40.48 -22.355,0 -40.48,-18.121 -40.48,-40.48 0,-22.359 18.125,-40.484 40.48,-40.484 22.359,0 40.484,18.125 40.484,40.484"
       id="path11427"
       style="fill:#ffffff;fill-opacity:1" /></g></svg>
