<!--?xml version="1.0" standalone="no"?-->
              <svg id="sw-js-blob-svg" viewBox="0 0 100 100" xmlns="http://www.w3.org/2000/svg" version="1.1">
                    <defs> 
                        <linearGradient id="sw-gradient" x1="0" x2="1" y1="1" y2="0">
                            <stop id="stop1" stop-color="rgba(55, 166.278, 248, 1)" offset="0%"></stop>
                            <stop id="stop2" stop-color="rgba(31, 251, 202.56, 1)" offset="100%"></stop>
                        </linearGradient>
                    </defs>
                <path fill="url(#sw-gradient)" d="M22,-35.2C27.6,-34.9,30.5,-27.1,29.9,-20C29.4,-12.9,25.4,-6.4,24.8,-0.4C24.1,5.7,26.9,11.4,26.6,17.1C26.4,22.9,23.1,28.6,18.2,31.3C13.2,33.9,6.6,33.3,0.8,32C-5.1,30.6,-10.1,28.4,-16.4,26.6C-22.7,24.8,-30.2,23.3,-31.7,18.9C-33.2,14.5,-28.5,7.3,-25.6,1.7C-22.7,-3.9,-21.5,-7.8,-20.5,-12.9C-19.4,-17.9,-18.4,-24.1,-15.1,-25.7C-11.7,-27.3,-5.8,-24.3,1.2,-26.3C8.2,-28.4,16.4,-35.6,22,-35.2Z" width="100%" height="100%" transform="translate(50 50)" stroke-width="0" style="transition: all 0.3s ease 0s;" stroke="url(#sw-gradient)"></path>
              </svg>