[
    {
        "software name": "ANA-ROD",
        "git name": "ANA-ROD documentation",
        "url": "https://gitlab.com/soleil-data-treatment/soleil-software-documentation/ana-rod-documentation"
    },
    {
        "software name": "BINoculars",
        "git name": "BINoculars documentation",
        "url": "https://gitlab.com/soleil-data-treatment/soleil-software-documentation/binoculars-documentation"
    },
    {
        "software name": "Crysalis",
        "git name": "Crysalis documentation",
        "url": "https://gitlab.com/soleil-data-treatment/soleil-software-documentation/crysalis-documentation"
    },
    {
        "software name": "Fullprof",
        "git name": "Fullprof documentation",
        "url": "https://gitlab.com/soleil-data-treatment/soleil-software-documentation/fullprof-documentation"
    },
    {
        "software name": "PyMca",
        "git name": "PyMca documentation",
        "url": "https://gitlab.com/soleil-data-treatment/soleil-software-documentation/pymca-documentation"
    },
    {
        "software name": "Pynx",
        "git name": "Pynx documentation",
        "url": "https://gitlab.com/soleil-data-treatment/soleil-software-documentation/pynx-documentation"
    },
    {
        "software name": "XRSTools",
        "git name": "XRSTools documentation",
        "url": "https://gitlab.com/soleil-data-treatment/soleil-software-documentation/xrstools-documentation"
    },
    {
        "software name": "Quanty",
        "git name": "Quanty documentation",
        "url": "https://gitlab.com/soleil-data-treatment/soleil-software-documentation/quanty-documentation"
    },
    {
        "software name": "Matlab",
        "git name": "Matlab documentation",
        "url": "https://gitlab.com/soleil-data-treatment/soleil-software-documentation/matlab-documentation"
    },
    {
        "software name": "ImageJ",
        "git name": "Fiji - ImageJ documentation",
        "url": "https://gitlab.com/soleil-data-treatment/soleil-software-documentation/fiji-imagej-documentation"
    },
    {
        "software name": "BeStSel",
        "git name": "BeStSel documentation",
        "url": "https://gitlab.com/soleil-data-treatment/soleil-software-documentation/bestsel-documentation"
    },
    {
        "software name": "Quasar",
        "git name": "Quasar documentation",
        "url": "https://gitlab.com/soleil-data-treatment/soleil-software-documentation/quasar-documentation"
    },
    {
        "software name": "Moulinex",
        "git name": "Moulinex documentation",
        "url": "https://gitlab.com/soleil-data-treatment/soleil-software-documentation/moulinex-documentation"
    },
    {
        "software name": "Imagine",
        "git name": "Imagine documentation",
        "url": "https://gitlab.com/soleil-data-treatment/soleil-software-documentation/imagine-documentation"
    },
    {
        "software name": "Crispy",
        "git name": "Crispy documentation",
        "url": "https://gitlab.com/soleil-data-treatment/soleil-software-documentation/crispy-documentation"
    },
    {
        "software name": "Larch",
        "git name": "Larch documentation",
        "url": "https://gitlab.com/soleil-data-treatment/soleil-software-documentation/larch-documentation"
    },
    {
        "software name": "Demeter",
        "git name": "Demeter documentation",
        "url": "https://gitlab.com/soleil-data-treatment/soleil-software-documentation/demeter-documentation"
    },
    {
        "software name": "i2PEPICO",
        "git name": "i2PEPICO documentation",
        "url": "https://gitlab.com/soleil-data-treatment/soleil-software-documentation/i2PEPICO-documentation"
    },
    {
        "software name": "VBasic-FTS",
        "git name": "VBasic-FTS documentation",
        "url": "https://gitlab.com/soleil-data-treatment/soleil-software-documentation/VBasic-FTS-documentation"
    },
    {
        "software name": "SasView",
        "git name": "SasView documentation",
        "url": "https://gitlab.com/soleil-data-treatment/soleil-software-documentation/SasView-documentation"
    },
    {
        "software name": "PyFAI",
        "git name": "PyFAI documentation",
        "url": "https://gitlab.com/soleil-data-treatment/soleil-software-documentation/PyFAI-documentation"
    },
    {
        "software name": "silx",
        "git name": "silx documentation",
        "url": "https://gitlab.com/soleil-data-treatment/soleil-software-documentation/silx-documentation"
    },
    {
        "software name": "Igor Pro",
        "git name": "Igor Pro documentation",
        "url": "https://gitlab.com/soleil-data-treatment/soleil-software-documentation/Igor-Pro-documentation"
    },
    {
        "software name": "UFO",
        "git name": "UFO documentation",
        "url": "https://gitlab.com/soleil-data-treatment/soleil-software-documentation/UFO-documentation"
    },
    {
        "software name": "DYNA",
        "git name": "DYNA documentation",
        "url": "https://gitlab.com/soleil-data-treatment/soleil-software-documentation/dyna-documentation"
    },
    {
        "software name": "Athena",
        "git name": "Athena documentation",
        "url": "https://gitlab.com/soleil-data-treatment/soleil-software-documentation/athena-documentation"
    },
    {
        "software name": "tomodata",
        "git name": "tomodata documentation",
        "url": "https://gitlab.com/soleil-data-treatment/soleil-software-documentation/tomodata-documentation"
    },
    {
        "software name": "pyHST2",
        "git name": "pyHST2 documentation",
        "url": "https://gitlab.com/soleil-data-treatment/soleil-software-documentation/pyhst2-documentation"
    },
    {
        "software name": "Fastosh",
        "git name": "Fastosh documentation",
        "url": "https://gitlab.com/soleil-data-treatment/soleil-software-documentation/fastosh-documentation"
    },
    {
        "software name": "Origin",
        "git name": "Origin documentation",
        "url": "https://gitlab.com/soleil-data-treatment/soleil-software-documentation/origin-documentation"
    },
    {
        "software name": "RIXS",
        "git name": "RIXS documentation",
        "url": "https://gitlab.com/soleil-data-treatment/soleil-software-documentation/rixs-documentation"
    },
    {
        "software name": "XDS",
        "git name": "XDS documentation",
        "url": "https://gitlab.com/soleil-data-treatment/soleil-software-documentation/xds-documentation"
    },
    {
        "software name": "DIALS",
        "git name": "DIALS documentation",
        "url": "https://gitlab.com/soleil-data-treatment/soleil-software-documentation/dials-documentation"
    },
    {
        "software name": "CCP4",
        "git name": "CCP4 documentation",
        "url": "https://gitlab.com/soleil-data-treatment/soleil-software-documentation/ccp4-documentation"
    },
    {
        "software name": "NavARP",
        "git name": "NavARP documentation",
        "url": "https://gitlab.com/soleil-data-treatment/soleil-software-documentation/navarp-documentation"
    },
    {
        "software name": "ARPYS",
        "git name": "ARPYS documentation",
        "url": "https://gitlab.com/soleil-data-treatment/soleil-software-documentation/arpys-documentation"
    },
    {
        "software name": "OPUS Bruker",
        "git name": "OPUS Bruker documentation",
        "url": "https://gitlab.com/soleil-data-treatment/soleil-software-documentation/opus-bruker-documentation"
    },
    {
        "software name": "RefFIT",
        "git name": "RefFIT documentation",
        "url": "https://gitlab.com/soleil-data-treatment/soleil-software-documentation/reffit-documentation"
    },
    {
        "software name": "Dioptas",
        "git name": "Dioptas documentation",
        "url": "https://gitlab.com/soleil-data-treatment/soleil-software-documentation/dioptas-documentation"
    },
    {
        "software name": "JupyLabBook",
        "git name": "JupyLabBook documentation",
        "url": "https://gitlab.com/soleil-data-treatment/soleil-software-documentation/jupylabbook-documentation"
    },
    {
        "software name": "Genx",
        "git name": "Genx documentation",
        "url": "https://gitlab.com/soleil-data-treatment/soleil-software-documentation/genx-documentation"
    },
    {
        "software name": "AXIS",
        "git name": "AXIS documentation",
        "url": "https://gitlab.com/soleil-data-treatment/soleil-software-documentation/axis-documentation"
    },
    {
        "software name": "BORNAGAIN",
        "git name": "BORNAGAIN documentation",
        "url": "https://gitlab.com/soleil-data-treatment/soleil-software-documentation/bornagain-documentation"
    },
    {
        "software name": "ptycho-shelves",
        "git name": "ptycho-shelves documentation",
        "url": "https://gitlab.com/soleil-data-treatment/soleil-software-documentation/ptycho-shelves-documentation"
    }
]