animation{
  name = "closed",
  src_image = "doors/sideview_door_wooden.png",
  directions = {
    { x = 0, y = 0, frame_width = 16, frame_height = 24, origin_x = 0, origin_y = 8 },
    { x = 0, y = 0, frame_width = 16, frame_height = 24, origin_x = 0, origin_y = 8 },
    { x = 0, y = 0, frame_width = 16, frame_height = 24, origin_x = 0, origin_y = 8 },
    { x = 0, y = 0, frame_width = 16, frame_height = 24, origin_x = 0, origin_y = 8 },
  },
}
animation{
  name = "closing",
  src_image = "doors/sideview_door_wooden.png",
  frame_delay = 100,
  directions = {
    { x = 32, y = 0, frame_width = 16, frame_height = 24, origin_x = 0, origin_y = 8 },
    { x = 32, y = 0, frame_width = 16, frame_height = 24, origin_x = 0, origin_y = 8 },
    { x = 32, y = 0, frame_width = 16, frame_height = 24, origin_x = 0, origin_y = 8 },
    { x = 32, y = 0, frame_width = 16, frame_height = 24, origin_x = 0, origin_y = 8 },
  },
}
animation{
  name = "opening",
  src_image = "doors/sideview_door_wooden.png",
  directions = {
    { x = 16, y = 0, frame_width = 16, frame_height = 24, origin_x = 0, origin_y = 8 },
    { x = 16, y = 0, frame_width = 16, frame_height = 24, origin_x = 0, origin_y = 8 },
    { x = 16, y = 0, frame_width = 16, frame_height = 24, origin_x = 0, origin_y = 8 },
    { x = 16, y = 0, frame_width = 16, frame_height = 24, origin_x = 0, origin_y = 8 },
  },
}
